
##TITLE=AC1252_TOGORS11070_6534220_CZ6qINh3ny
##JCAMPDX= 6.0         $$ Bruker NMR JCAMP-DX V2.0
##DATA TYPE= NMR SPECTRUM
##DATA CLASS= NTUPLES
##ORIGIN= BRUKER
##OWNER= Administrator
$$ 1.72 TOPSPIN		Version 2.1
$$ 2012-07-16 22:51:29.562 -0500  Administrator@TOPSPIN
$$ Compression mode = diff/dup
##.OBSERVE FREQUENCY= 400.02188249412
##.OBSERVE NUCLEUS= ^1H
##.ACQUISITION MODE= SIMULTANEOUS (DQD)
##.ACQUISITION SCHEME= undefined
##.AVERAGES= 64
##.DIGITISER RES= 22
##SPECTROMETER/DATA SYSTEM= spect
##.PULSE SEQUENCE= noesygpps1d.comp
##.SOLVENT NAME= COFFEE_meoh
##.SHIFT REFERENCE= INTERNAL, COFFEE_meoh, 1, 14.96084
##AUDIT TRAIL= $$ (NUMBER, WHEN, WHO, WHERE, PROCESS, VERSION, WHAT)
$$ ##TITLE= Audit trail, TOPSPIN		Version 2.1
$$ ##JCAMPDX= 5.01
$$ ##ORIGIN= Bruker BioSpin GmbH
$$ ##OWNER= Administrator
$$ $$ C:\Bruker\TOPSPIN/data/COFFEE/nmr/AC1252_TOGORS11070_6534220_CZ6qINh3ny/12/pdata/1/auditp.txt
$$ ##AUDIT TRAIL=  $$ (NUMBER, WHEN, WHO, WHERE, PROCESS, VERSION, WHAT)
(   1,<2012-07-16 22:51:24.531 -0500>,<Administrator>,<TOPSPIN>,<go>,<TOPSPIN 2.1>,
      <created by zg
	started at 2012-07-16 22:39:54.171 -0500,
	POWCHK enabled, PULCHK disabled,
       configuration hash MD5:
       6B 1B 68 BB D9 2E 58 E2 7F 35 AD 54 07 DF 0E 41
       data hash MD5: 64K
       2F 52 46 A8 AF 9C 1E 22 CB 1F 02 32 5B 65 DB D5>)
(   2,<2012-07-16 22:51:27.359 -0500>,<Administrator>,<TOPSPIN>,<proc1d>,<TOPSPIN 2.1>,
      <Start of raw data processing
       efp LB = 0.3 FT_mod = 6 PKNL = 1 PHC0 = 0 PHC1 = 0 SI = 128K 
       data hash MD5: 128K
       C8 20 E4 F7 5D 36 40 22 BF 2B 7B EA 39 2B 2D DF>)
(   3,<2012-07-16 22:51:28.453 -0500>,<Administrator>,<TOPSPIN>,<proc1d>,<TOPSPIN 2.1>,
      <pk PHC0 = 0.802002 PHC1 = 0 
       data hash MD5: 128K
       99 85 09 80 F4 BD AA 53 66 9D 76 71 14 1B 46 F7>)
(   4,<2012-07-16 22:51:29.218 -0500>,<Administrator>,<TOPSPIN>,<proc1d>,<TOPSPIN 2.1>,
      <abs ABSG = 1 
       data hash MD5: 128K
       EA B4 6A 3F D8 C2 43 7E 98 A5 2D 1D DA A4 F1 E3>)
(   5,<2012-07-16 22:51:29.296 -0500>,<Administrator>,<TOPSPIN>,<proc1d>,<TOPSPIN 2.1>,
      <abs ABSG = 2 
       data hash MD5: 128K
       F1 D0 40 0A 69 9E 5A 0A B1 27 42 DB A4 4C 58 C0>)
(   6,<2012-07-16 22:51:29.343 -0500>,<Administrator>,<TOPSPIN>,<proc1d>,<TOPSPIN 2.1>,
      <abs ABSG = 3 
       data hash MD5: 128K
       20 7F F3 00 3E 51 90 9F 4A 7B 37 42 E7 E3 F2 7A>)
(   7,<2012-07-16 22:51:29.406 -0500>,<Administrator>,<TOPSPIN>,<proc1d>,<TOPSPIN 2.1>,
      <abs ABSG = 4 
       data hash MD5: 128K
       C8 C9 ED 61 B1 15 E3 96 88 4C 9D 25 72 06 09 0C>)
(   8,<2012-07-16 22:51:29.468 -0500>,<Administrator>,<TOPSPIN>,<proc1d>,<TOPSPIN 2.1>,
      <abs ABSG = 5 
       data hash MD5: 128K
       9A 8B FA 02 D4 0F 68 65 85 2A 61 CF 8D 40 9D F0>)
$$ ##END=
$$ 
$$ $$ hash MD5
$$ $$ F9 EB 20 F3 03 E0 4B CC 45 93 18 22 6C DB 9D D1
##$RELAX= 
##$RELAX= 
##$RELAX= 
##$RELAX= 
##$RELAX= 
##$RELAX= 
##$RELAX= 
##$RELAX= 
$$ Bruker specific parameters
$$ [...]
##$TP07= 0
##$TPNAME0= <>
##$TPNAME1= <>
##$TPNAME2= <>
##$TPNAME3= <>
##$TPNAME4= <>
##$TPNAME5= <>
##$TPNAME6= <>
##$TPNAME7= <>
##$TPOAL= (0..7)
0.5 0.5 0.5 0.5 0.5 0.5 0.5 0.5
##$TPOFFS= (0..7)
0 0 0 0 0 0 0 0
##$TUNHIN= 0
##$TUNHOUT= 0
##$TUNXOUT= 0
##$USERA1= <user>
##$USERA2= <user>
##$USERA3= <user>
##$USERA4= <user>
##$USERA5= <user>
##$V9= 5
##$VALIST= <valist>
##$VCLIST= <CCCCCCCCCCCCCCC>
##$VD= 0
##$VDLIST= <DDDDDDDDDDDDDDD>
##$VPLIST= <PPPPPPPPPPPPPPP>
##$VTLIST= <TTTTTTTTTTTTTTT>
##$WBST= 2048
##$WBSW= 25
##$XGAIN= (0..3)
0 0 0 0
##$XL= 0
##$YL= 0
##$YMAX_a= 10740201
##$YMIN_a= -7772493
##$ZGOPTNS= <>
##$ZL1= 120
##$ZL2= 120
##$ZL3= 120
##$ZL4= 120
##$ABSF1= 14.96084
##$ABSF2= -5.597342
##$ABSG= 5
##$ABSL= 3
##$ALPHA= 0
##$AQORDER= 0
##$ASSFAC= 0
##$ASSFACI= 0
##$ASSFACX= 0
##$ASSWID= 0
##$AUNMP= <proc_prof1d_extract.lims>
##$AXLEFT= 0
##$AXNAME= <>
##$AXNUC= <1H>
##$AXRIGHT= 0
##$AXTYPE= 0
##$AXUNIT= <>
##$AZFE= 0.1
##$AZFW= 0.1
##$BCFW= 0
##$BC_mod= 0
##$BYTORDP= 0
##$COROFFS= 0
##$CY= 15
##$DATMOD= 1
##$DC= 0
##$DFILT= <>
##$DTYPP= 0
##$F1P= 0
##$F2P= 0
##$FCOR= 0.5
##$FTSIZE= 131072
##$FT_mod= 6
##$GAMMA= 0
##$GB= 0
##$INTBC= 1
##$INTSCL= 1
##$ISEN= 128
##$LB= 0.3
##$LEV0= 0
##$LPBIN= 0
##$MAXI= 10000
##$MC2= 0
##$MEAN= 0
##$ME_mod= 0
##$MI= 0
##$NCOEF= 0
##$NC_proc= -2
##$NLEV= 6
##$NOISF1= 0
##$NOISF2= 0
##$NSP= 0
##$NTH_PI= 0
##$NZP= 0
##$OFFSET= 14.96084
##$PC= 1
##$PHC0= 0.802002
##$PHC1= 0
##$PH_mod= 1
##$PKNL= yes
##$PPARMOD= 0
##$PPDIAG= 0
##$PPIPTYP= 0
##$PPMPNUM= 2147483647
##$PPRESOL= 1
##$PSCAL= 4
##$PSIGN= 0
##$PYNMP= <proc.py>
##$REVERSE= no
##$SF= 400.020009701436
##$SI= 131072
##$SIGF1= 0
##$SIGF2= 0
##$SINO= 400
##$SIOLD= 131072
##$SPECTYP= <>
##$SREGLST= <1H.CDCl3>
##$SSB= 0
##$STSI= 131072
##$STSR= 0
##$SW_p= 8223.68421052631
##$SYMM= 0
##$S_DEV= 0
##$TDeff= 65536
##$TDoff= 0
##$TI= <>
##$TILT= no
##$TM1= 0
##$TM2= 0
##$TOPLEV= 0
##$USERP1= <user>
##$USERP2= <user>
##$USERP3= <user>
##$USERP4= <user>
##$USERP5= <user>
##$WDW= 1
##$XDIM= 131072
##$YMAX_p= 391155920
##$YMIN_p= -11231
##$CURPLOT= <Network HP LaserJet P1505>
##$CURPRIN= <$Network HP LaserJet P1505>
##$DFORMAT= <normdp>
##$LAYOUT= <+/1D_H.xwp>
##$LFORMAT= <normlp>
##$PFORMAT= <normpl>
##$SURQMSG= 1
$$ End of Bruker specific parameters
$$ ---------------------------------
##NTUPLES= NMR SPECTRUM
##VAR_NAME=  FREQUENCY,     SPECTRUM/REAL,   SPECTRUM/IMAG
##SYMBOL=    X,             R,               I
##VAR_TYPE=  INDEPENDENT,   DEPENDENT,       DEPENDENT
##VAR_FORM=  AFFN,          ASDF,            ASDF
##VAR_DIM=   131072,        131072,          131072
##UNITS=     HZ,            ARBITRARY UNITS, ARBITRARY UNITS
##FACTOR=    0.0627417313425164, 1,          1
##FIRST=     8223.62146879497, 1258,         -44186
##LAST=      0,             2347,            -43870
##MIN=       0,             -11231,          0
##MAX=       8223.62146879497, 391155920,    0
$$ Real data points
##PAGE= N=1
##DATA TABLE= (X++(R..R)), XYDATA
$$ [...]
61603D94670p080o708o368o499p248q197q535p873o622n384m242l042j999j593
$$ 494670 487590 480882 474514 468015 460767 452570 444035 436162 429540 424156 419914 416872 414873 413280
61589D13280j976k802l590l991l812l111k245j674j668k174k855l245l145k851
$$ 413280 411304 408502 404912 400921 397109 393998 391753 390079 388411 386237 383382 380137 376992 374141
61575C74141k766k820k661k388k504l070l440l151k562k248k248k293k407k715
$$ 374141 371375 368555 365894 363506 361002 357932 354492 351341 348779 346531 344283 341990 339583 336868
61561C36868k940k628j757p53k4L06L01J58K8j71n71q70n30L09P39K60m75o37
$$ 336868 333928 331300 329543 328790 328766 329072 329373 329531 329559 329388 328817 327947 327417 327726 328465 328725 328250 327613
61543C27613l91m28p60q10m69j69j8L76J092J658J778J711J779J996K288K594
$$ 327613 327222 326794 326034 325224 324755 324586 324568 324944 326036 327694 329472 331183 332962 334958 337246 339840
61527C39840K604J993J025M15L31J14p14j640j858j400j127j631k549k998k503
$$ 339840 342444 344437 345462 345877 346208 346322 345608 343968 342110 340710 339583 337952 335403 332405 329902
61512C29902j541j093j621k412k328j211k77p30k222l174k619j297o08q40j024
$$ 329902 328361 327268 325647 323235 320907 319696 319419 318689 316467 313293 310674 309377 308769 307929 306905
61497C06905m87J10j88j035j053K80J803K136J361O03L83J72n27j365j670j337
$$ 306905 306418 306528 306340 305305 304252 304532 306335 308471 309832 310435 310818 310990 310463 309098 307428 306091
61481C06091q02m38k94l31o08j051j215o17N97J578J678J234J054J237J156N82
$$ 306091 305289 304851 304557 304226 303618 302567 301352 300735 301332 302910 304588 305822 306876 308113 309269 309851
61465C09851Q5Pj73q82j528j355o88n07r32j107n67Q6P6n83j237j258m42Q83J965
$$ 309851 309936 309943 309770 308888 307360 306005 305317 304810 303878 302771 302204 302290 302366 301783 300546 299288 298846 299729 301694
61446C01694K176J500L79p46j426j123J52J406J601R66O32J052J653K067K649
$$ 301694 303870 305370 305749 305003 303577 302454 302606 304012 305613 306579 307211 308263 309916 311983 314632
61431C14632L505M027L890L659L744L582K588J283O06N79M91Q4k88m34m25r6P30
$$ 314632 318137 322164 326054 329713 333457 337039 339627 340910 341516 342095 342586 342670 342382 341948 341523 341427 342157
61414C42157J639J991J921K080K416K116J027J64K96Q02O56r0o04o59q32j412
$$ 342157 343796 345787 347708 349788 352204 354320 355347 355511 355807 356609 357265 357175 356571 355912 355080 353668
61398C53668j958k097k034k031j961j719j606j867k205k167j777j356q82r3Q63
$$ 353668 351710 349613 347579 345548 343587 341868 340262 338395 336190 334023 332246 330890 330008 329915 330778
61383C30778J385J174O17K52J49Q3M8K89Q53J335J194L75m04k45Q92J982K082
$$ 330778 332163 333337 333954 334206 334355 334438 334486 334775 335628 336963 338157 338532 338128 337883 338775 340757 342839
61366C42839J477J166J358J209K29p91q29l4N48M13J42N10J552K588K918K437
$$ 342839 344316 345482 346840 348049 348278 347487 346658 346624 347172 347585 347727 348237 349789 352377 355295 357732
61350C57732J786J786K622L705M496N229O456Q205R889J0963J1348J1264J0979
$$ 357732 359518 361304 363926 367631 372127 377356 383812 392017 401906 412869 424217 435481 446460
61337D46460J0670J0315R754Q924P872O452M483K335R14O39Q66P29J60n40j562
$$ 446460 457130 467445 477199 486123 493995 500447 504930 507265 508179 508818 509684 510413 510573 510033 508471
61322E08471l240n038n898n592m946m536m037l039j906j379j699k443k920k584
$$ 508471 505231 500193 494295 488703 483757 479221 475184 472145 470239 468860 467161 464718 461798 459214
61308D59214j413NR38J239J381J820K602L515M280M688M916N535O790Q115Q791
$$ 459214 457801 457806 458744 459983 461364 463184 465786 469301 473581 478269 483185 488720 495510 503625 512416
61293E12416Q833Q542P542N180J806j326l534n190o609p450p502p133o520n399
$$ 512416 521249 529791 537333 542513 544319 542993 539459 534269 527660 520210 512708 505575 499055 493656
61279D93656l990l178l156k918j848q60r56j481j052L40J499K074L082N146P407
$$ 493656 489666 486488 483332 480414 478566 477706 476750 475269 474217 474557 476056 478130 481212 486358 493765
61264D93765Q650Q729Q332P939P515O960O384N984N823N851O113O961Q775J1341
$$ 493765 502415 511144 519476 527415 534930 541890 548274 554258 560081 565932 572045 579006 587781 599122
61250E99122J3747J5181J5595J5344J4439J2642J0071P220M387J547j253l796
$$ 599122 612869 628050 643645 658989 673428 686070 696141 703361 707748 709295 708042 704246
61238G04246n981p782q925r081q519q111q419q984q810p390n169l104j900j570
$$ 704246 698265 690483 681558 672477 663958 655847 647428 638444 629634 622244 617075 613971 612071 610501
61224F10501j564j290n71L45J102J569J903K287K595K406J585O08Ll97j141k058
$$ 610501 608937 607647 607076 607421 608523 610092 611995 614282 616877 619283 620868 621476 621479 621082 619941 617883
61208F17883k277j532p64q12j180p97L35J204J220O97n2j136k327k803k154j019
$$ 617883 615606 614074 613310 612498 611318 610521 610856 612060 613280 613977 613925 612789 610462 607659 605505 604486
61192F04486j38P61K458M995P591R758J1794J4092J6488J8521J9921K0567K0258
$$ 604486 604348 605109 607567 612562 620153 629911 641705 655797 672285 690806 710727 731294 751552
61179G51552J8893J6757J4285J1703R142P079O199O662P773Q556Q505P655O273
$$ 751552 770445 787202 801487 813190 822332 829411 835610 842272 850045 858601 867106 874761 881034
61166H81034M646L000J302o36k685m292n207o045p604r767j1571j2400j2570j2628
$$ 881034 885680 888680 889982 889346 886661 882369 877162 871117 863513 853746 842175 829775 817205 804577
61152H04577j2678j2616j2561j2648j2673j2289j1402j0139q573o721m719k807
$$ 804577 791899 779283 766722 754074 741401 729112 717710 707571 698998 692277 687558 684751
61140F84751j184L6Q51J334J498J113j32k244m776p056q513q937q631q135p554
$$ 684751 683567 683603 684454 685788 687286 688399 688267 686023 681247 674191 665678 656741 648110 639975 632421
61125F32421o387m415k443j535j591j354R6K454M878O968Q819J0696J2856J5285
$$ 632421 626034 621619 619176 617641 616050 614696 614792 617246 622124 629092 637911 648607 661463 676748
61111F76748J7403J8523J8788J9129K0099K1308K2216K2921K3737K4584K5109
$$ 676748 694151 712674 731462 750591 770690 791998 814214 837135 860872 885456 910565
61100I10565K5144K4715K3944K3073K2236K1090J9180J6652J3975J0969O925J889
$$ 910565 935709 960424 984368 1007441 1029677 1050767 1069947 1086599 1100574 1111543 1118468 1120357
61088A120357l050p112j0496j3381j5330j6369j7563j9555k1341k1569k0551j9841
$$ 1120357 1117307 1110195 1099699 1086318 1070988 1054619 1037056 1017501 996160 974591 954040 934199
61076I34199k0166k0750k0546j9305j7518j5917j4952j4318j3197j1348r501q318
$$ 934199 914033 893283 872737 853432 835914 819997 805045 790727 777530 766182 756681 748363
61064G48363p496o476n337m375l401k223j198n19M57K254M236N449O056O876P962
$$ 748363 740867 734391 729054 724679 721278 719055 717857 717338 717795 720049 724285 729734 735790 742666 750628
61049G50628Q719R144R826J0846J1652J2030J2381J3106J4349J6119J8139J9854
$$ 750628 759347 768491 778317 789163 800815 812845 825226 838332 852681 868800 886939 906793
61037I06793K1198K2811K4964K7028K8680L0696L3524L6108L7449L8497M0864
$$ 906793 927991 950802 975766 1002794 1031474 1062170 1095694 1131802 1169251 1207748 1248612
61026A248612M4424M7688N0099N2265N4531N6941O0138O4479O8738P1452P3088
$$ 1248612 1293036 1340724 1390823 1443088 1497619 1554560 1614698 1679177 1747915 1819367 1892455
61015A892455P4973P6801P7640P8929Q3633R2379J03204J15185J29278J45076
$$ 1892455 1967428 2044229 2121869 2200798 2284431 2376810 2480014 2595199 2724477 2869553
61005B869553J60137J73889J89399K10104K37642K74385L24966L93330M81411
$$ 2869553 3029690 3203579 3392978 3603082 3840724 4115109 4440075 4833405 5314816
60996E314816N93713P40620R33431J176535J466328J797050K166721K576214L012991
$$ 5314816 5908529 6649149 7582580 8759115 10225443 12022493 14189214 16765428 19778419
60987A9778419L416611L652389L545143K988697K057796J010311J53790l16894
$$ 19778419 23195030 26847419 30392562 33381259 35439055 36449366 36603156 36286262
60979C6286262l80148j33200K77266O66687Q11920N22161k35152j275639k289235
$$ 36286262 35906114 35772914 36050180 36716867 37528787 38050948 37815796 36540157 34250922
60970C4250922l016381l363388l385876l197528k898906k558414k217898j898299
$$ 34250922 31234541 27871153 24485277 21287749 18388843 15830429 13612531 11714232
60962A1714232j606486j345394j118720r27432p67564o34384n25879m40420l73959
$$ 11714232 10107746 8762352 7643632 6716200 5948636 5314252 4788373 4347953 3973994
60953C973994l21571k79810k46020k17431j92581j71828j54908j39453j23412
$$ 3973994 3652423 3372613 3126593 2909162 2716581 2544753 2389845 2250392 2126980
60944B126980j07404r3214q1265p1182o3578n9468n8424n8779n9270n9415n8850
$$ 2126980 2019576 1926362 1845097 1773915 1710337 1650869 1592445 1533666 1474396 1414981 1356131
60933A356131n7364n5268n2847m9816m6056m2366l9694l7986l6459l4614l2400
$$ 1356131 1298767 1243499 1190652 1140836 1094780 1052414 1012720 974734 938275 903661 871261
60922H71261k9901k7414k5443k4040k2642k0932j9299j8003j6588j4681j2787
$$ 871261 841360 813946 788503 764463 741821 720889 701590 683587 666999 652318 639531
60911F39531j1563j0883j0205r411q625p722o587n465m451l158j411K21J124J441
$$ 639531 627968 617085 606880 597469 588844 581122 574535 569070 564619 561461 560050 560271 561395 562836
60897E62836J593J601J456J578K135K379J565K36k47N92J792K133J270k92j898
$$ 562836 564429 566030 567486 569064 571199 573578 575143 575379 575132 575724 577516 579649 580919 580627 578729
60882E78729l260m474n583o309o460o492p056p960q323p914p592q030q838r391
$$ 578729 575469 570995 565412 559103 552643 546151 539095 531135 522812 514898 507306 499276 490438 481047
60868D81047r694r826r364q085o627n641m884l891k909k322j764p57K51N05K41
$$ 481047 471353 461527 452163 444078 437451 431810 426926 423035 420126 417804 416040 415283 415534 416039 416280
60853D16280L44R71J524J803K158K607K751K627K774L399M244N252O537P676P835
$$ 416280 416624 417595 419119 420922 423080 425687 428438 431065 433839 437238 441482 446734 453271 460947 468782
60838D68782O813N236L710K404J487J143R75K27j158k312k546k074j439q60m52
$$ 468782 475595 480831 484541 486945 488432 489575 490550 490777 489619 487307 484761 482687 481248 480388 479936
60823D79936m34p24p78k60M22O21K48k30m73o53j234k465m039n306n870n915n874
$$ 479936 479502 478778 478000 477740 478162 478783 479031 478801 478328 477675 476441 473976 469937 464631 458761 452846 446972
60806D46972o001o345o833p155o929o272n805n734n394m284l052k667l009l043
$$ 446972 440971 434626 427793 420638 413709 407437 401632 395898 390504 386220 383168 380501 377492 374449
60792C74449k308j355q40q84j269j605j404p02l40r10j613j171K79J338J373J179
$$ 374449 372141 370786 369946 369062 367793 366188 364784 364082 363742 362832 361219 360048 360327 361665 363038 364217
60776C64217J455J825J790J562J485J571K056L406N237O274O002N473N768O541
$$ 364217 365672 367497 369287 370849 372334 373905 375961 379367 384604 390878 396880 402353 408121 414662
60762D14662O865O692O542O452O146N745N420M902M061L457L466L416K615J627
$$ 414662 421527 428219 434761 441213 447359 453104 458524 463426 467487 470944 474410 477826 480441 482068
60748D82068J447J797J477K71o91n70K33R37J276J284Q69k0j308k981m909o561
$$ 482068 483515 485312 486789 487060 486369 485799 486032 486969 488245 489529 490398 490378 489070 486089 481180 474619
60732D74619p393p528p492p406p022o419n888n222l983k532j855k188k640k463
$$ 474619 467226 459698 452206 444800 437778 431359 425471 420249 416266 413734 411879 409691 407051 404588
60718D04588j889j364p46J71J043J552K099L235M620N286M830L951L713M566O038
$$ 404588 402699 401335 400589 400760 401803 403355 405454 408689 413309 418595 423425 427376 431089 435655 441693
60703D41693P252P764P968Q561R622J0558J1035J1509J2569J4024J5026J5000
$$ 441693 448945 456709 464677 473238 482860 493418 504453 515962 528531 542555 557581 572581
60691E72581J4229J3510J3385J3677J3829J3712J3886J4813J5996J6426J5821
$$ 572581 586810 600320 613705 627382 641211 654923 668809 683622 699618 716044 731865
60680G31865J4961J4622J4669J4436J3480J1725R203O099K810l60l461o625r730
$$ 731865 746826 761448 776117 790553 804033 815758 824961 831060 833870 833510 830049 823424 813694
60667H13694j2458j4610j6191j7333j8214j8902j9233j9126j8913j9005j9199
$$ 813694 801236 786626 770435 753102 734888 715986 696753 677627 658714 639709 620510
60656F20510j8770j7452j5825j4521j3495j2374j1115r864q513o868n058l419
$$ 620510 601740 584288 568463 553942 540447 528073 516958 507094 498581 491713 486655 483236
60644D83236k117j179p09p36j028j394j936k763l588l993l906l528k986k371j883
$$ 483236 481119 479940 479231 478495 477467 476073 474137 471374 467786 463793 459887 456359 453373 451002 449119
60629D49119j541r17L25J795K684K761K556K532K538K215J637J248J333J682J779
$$ 449119 447578 446661 446986 448781 451465 454226 456782 459314 461852 464067 465704 466952 468285 469967 471746
60614D71746J254K15q57j574j918k013j920j757j819k277k823k969k612k160k030
$$ 471746 473000 473215 472358 470784 468866 466853 464933 463176 461357 459080 456257 453288 450676 448516 446486
60599D46486k248k566k740k719k611k546k583k700k843k889k655k155j675j357
$$ 446486 444238 441672 438932 436213 433602 431056 428473 425773 422930 420041 417386 415231 413556 412199
60585D12199r05m5P62O74l94j531j834j173R9J545K527K511J998K371M215O413
$$ 412199 411294 411249 412011 412685 412291 410760 408926 407753 407852 409397 411924 414435 416433 418804 423019 429432
60569D29432P612Q051R013J0943J3151J5142J7262J9877K2697K5084K6464K6416
$$ 429432 437044 445095 454108 465051 478202 493344 510606 530483 553180 578264 604728 631144
60557F31144K4842K2109J8516J3835P886J315m848j0163j4493j7094j7013j4514
$$ 631144 655986 678095 696611 710446 718332 719647 714799 704636 690143 673049 656036 641522
60545F41522j1104p891m755j245K599O641J1014J5625K0001K3997K7998L1936
$$ 641522 630418 622527 617772 616527 619126 625767 636781 652406 672407 696404 724402 756338
60533G56338L4761L5336L3301K8841K2250J4206N849j935q834j4394j7677j8225
$$ 756338 791099 826435 859736 888577 910827 925033 930882 928947 920113 905719 888042 869817
60521H69817j6830j4748j2585j0461q703p658p120o628o109n698n182m159k623
$$ 869817 852987 838239 825654 815193 806490 798832 791712 785084 778975 773277 768095 763936 761313
60508G61313r02Q48K636M290N600O733Q178J0342J3379J7281K1954K7423L4067
$$ 761313 760411 761259 763895 768185 773785 780518 788696 799038 812417 829698 851652 879075 913142
60495I13142M2290N1831O1837P1809Q1953R2206J01460J08193J11451J10824J05876
$$ 913142 955432 1007263 1069100 1140909 1222862 1315068 1416528 1524721 1636172 1746996 1852872
60484A852872R6108Q1149O0738L5123O010k3524n0757p4613r4780j10185j19307
$$ 1852872 1948980 2030129 2090867 2125990 2132000 2108476 2057719 1983106 1888326 1778141 1658834
60473A658834j21713j18506j11463j02303r2478q2840p3541o4704n6818m9991
$$ 1658834 1537121 1418615 1307152 1204849 1112371 1029531 955990 891286 834468 784477
60463G84477m3444l6718l0874k7315k5576k3613k0360j6840j4411j3021j1726
$$ 784477 741033 704315 673441 646126 620550 596937 576577 559737 545326 532305 520579
60452E20579j0113q486p160o212n591n170m815m571m559m632m484m087l642l147
$$ 520579 510466 501980 494820 488608 483017 477847 473032 468461 463902 459270 454786 450699 447057 443910
60438D43910k492j878j639j650j482j098q40p24m30m9q5o56j334j931k706l608
$$ 443910 441418 439540 437901 436251 434769 433671 432831 432107 431677 431628 431543 430887 429553 427622 424916 421308
60422D21308m055l784l234k837k520k229k191k309k016j172m03r9K30J041J862
$$ 421308 417253 413469 410235 407398 404878 402649 400458 398149 396133 394961 394558 394459 394689 395730 397592
60407C97592K040J757J579J424Q97K50O1J43l16j424k266k075j096n2O79J038
$$ 397592 399632 401389 402968 404392 405289 405539 405600 405743 405427 404003 401737 399662 398566 398514 399193 400231
60391D00231R81O40M67Q17J446J827J820J765J834J734J269R31J394K487L158
$$ 400231 401212 401852 402319 403136 404582 406409 408229 409994 411828 413562 414831 415762 417156 419643 422801
60376D22801K747J859J516J839K096J953J923K502L428M065M138L890L754L998
$$ 422801 425548 427407 428923 430762 432858 434811 436734 439236 442664 446729 450867 454757 458511 462509
60362D62509M412M367L486K246J466J243R71M13qj37n39j553k587k908k632k323
$$ 462509 466921 471288 474774 477020 478486 479729 480700 481113 481105 480968 480429 478876 476289 473381 470749 468426
60346D68426k037j465o55L1N78J279K185L056L839M641N271N368M990M613M417
$$ 468426 466389 464924 464269 464300 464878 466157 468342 471398 475237 479878 485149 490517 495507 500120 504537
60331E04537M023L118J994J200Q69O91M32K18K47L79J85n79j710k767l405l418
$$ 504537 508560 511678 513672 514872 515741 516432 516864 517082 517329 517708 517893 517314 515604 512837 509432 506014
60315E06014k813j987j504j287m67J496L855N478O439P789R821J1738J3333J5803
$$ 506014 503201 501214 499710 498423 497956 499452 503307 508785 515224 523013 532834 544572 557905 573708
60301E73708K0274K6339L2707L8337M2158M2654L9019L2303K4225J5113M146q520
$$ 573708 593982 620321 653028 691365 733523 776177 815196 847499 871724 886837 890983 882463
60289H82463k1033l1286l8057m0696l9096l4505k9349k5310k2086j8589j4823
$$ 882463 861430 830144 792087 751391 712295 677790 648441 623131 601045 582456 567633
60278E67633j1832j0149r146p971o576n578n421n888o324o173n301l932k437j221
$$ 567633 555801 545652 536506 528535 521959 516381 510960 505072 498748 492575 487274 483342 480905 479684
60264D79684n99n89r07j273j625j922j930j451o39J06M75L02m67j608k592l024
$$ 479684 479085 478496 477589 476316 474691 472769 470839 469388 468749 468855 469330 469632 469165 467557 464965 461941
60248D61941k965k605j868p49J93K81m21j132j269q75k26M57Q22N44j60n73l29
$$ 461941 458976 456371 454503 453754 453947 454228 453807 452675 451406 450531 450305 450762 451584 452128 451968 451395 451066
60231D51066K31P40J383K426L539M039L696K927K294K069K220K505K520J991J081
$$ 451066 451297 452037 453420 455846 459385 463424 467120 470047 472341 474410 476630 479135 481655 483646 484727
60216D84727L36J37L12L92J88J9K54R00J710K537L237L429K866K010J756K323
$$ 484727 485063 485200 485512 485904 486092 486111 486365 487265 488975 491512 494749 498178 501044 503054 504810 507133
60200E07133K990L185L266L713M073L542K249J216J027J329J673K045K390K323
$$ 507133 510123 513308 516574 520287 524360 527902 530151 531367 532394 533723 535396 537441 539831 542154
60186E42154J705R48M18l6o01j059j244j498k184l000l372l318l404l846m163
$$ 542154 543859 544807 545225 545189 544588 543529 542285 540787 538603 535603 532231 528913 525509 521663 517500
60171E17500l791k748j555p14l79l87m58m12k32Q2N83J195J630J609J232R80J366
$$ 517500 513709 510961 509406 508692 508313 507926 507468 507056 506824 506906 507489 508684 510314 511923 513155 514135 515501
60154E15501K538M141N436N672M612K751R83m3k81j09J00K16K98M04N05O00Q79
$$ 515501 518039 522180 527616 533288 537900 540651 541634 541591 541310 541201 541301 541517 541815 542219 542724 543324 544203
60137E44203J626K836M062M823N212N796O746P342O743N174L830L414L203J980
$$ 544203 545829 548665 552727 557550 562762 568558 575304 582646 589389 594563 598393 601807 605010 606990
60123F06990m38l041m785n358m964l962k811j835q57N26K148L223L288K779K444
$$ 606990 606552 603511 598726 593368 588404 584442 581631 579796 578939 579465 581613 584836 588124 590903 593347
60108E93347K637L353M490N696O403O394N948N184L782J753j15j155j758k691
$$ 593347 595984 599337 603827 609523 615926 622320 628268 633452 637234 638987 638872 637717 635959 633268
60094F33268l931m858n259n400n330m890m272l774l110j753R9J649K590L207L509
$$ 633268 629337 624479 619220 613820 608490 603600 599328 595554 592444 590691 590790 592439 595029 598236 601745
60079F01745L159K464K309K769K742J562Q2n77o59j265k691m200n229n952o550
$$ 601745 604904 607368 609677 612446 615188 616750 616832 616255 615596 614331 611640 607440 602211 596259 589709
60064E89709o726o219n349m723m649m963n291n283m775l955l295l162l412l510
$$ 589709 582983 576764 571415 566692 562043 557080 551789 546506 541731 537776 534481 531319 527907 524397
60050E24397l187k844l069l809m331m111l354k587k086j915k039k031j252K25
$$ 524397 521210 518366 515297 511488 507157 503046 499692 497105 495019 493104 491065 489034 487782 488007
60036D88007J378J566J539K263L288L384K550K073K480K783K206J364J105J129
$$ 488007 489385 490951 492490 494753 498041 501425 503975 506048 508528 511311 513517 514881 515986 517115
60022E17115O37m06j511k543l645m617n147n323n390n287m988m849n052n094m467
$$ 517115 517752 517346 515835 513292 509647 505030 499883 494560 489170 483883 478895 474046 468994 463900 459433
60007D59433l527k968k735k198j223l75p5j32j58N2N09J033J341J429J695K320
$$ 459433 455906 452938 450203 448005 446782 446407 446332 446200 446042 446094 446603 447636 448977 450406 452101 454421
59991D54421K856K875K698K900L341L425L084K823K729K297J345N02M74J256K234
$$ 454421 457277 460152 462850 465750 469091 472516 475600 478423 481152 483449 484794 485296 485770 487026 489260
59976D89260K764K498J576N50j58p15j512k432k961k901k522k023j430r77r53
$$ 489260 492024 494522 496098 496648 496490 495775 494263 491831 488870 485969 483447 481424 479994 479017 478064
59961D78064j056o01M08J149J158J075J658K651L214L066K541J859R89K10J3L57
$$ 478064 477008 476407 476815 477964 479122 480197 481855 484506 487720 490786 493327 495186 496175 496385 496398 496755
59945D96755N80K82j44j61O7q6p84j437j427q63m25o42j472k530l456m034m162
$$ 496755 497335 497617 497473 497312 497379 497293 496509 495072 493645 492782 492357 491715 490243 487713 484257 480223 476061
59928D76061l840l210k461j744j155o73j81L39O11L47k11l78J95J042J461J393
$$ 476061 472221 469011 466550 464806 463651 462978 462797 463136 463747 464094 463883 463505 463700 464742 466203 467596
59912D67596J360J735K325K657K373J438L26j59M12J536K331K543K603K747K659
$$ 467596 468956 470691 473016 475673 478046 479484 479810 479651 480063 481599 483930 486473 489076 491823 494482
59897D94482K116J464J083R22Q55J091J758K469K880L375M505N899O494N996N366
$$ 494482 496598 498062 499145 500067 500922 502013 503771 506240 509120 512495 517000 522899 529393 535389 540755
59882E40755N443N677M902L037J349R44J607K310K490K463K737L288L574L117
$$ 540755 546198 551875 556777 559814 561163 562107 563714 566024 568514 570977 573714 577002 580576 583693
59868E83693J932M13j078k444l593m230m101l455k965l075l555l813l471k620
$$ 583693 585625 586038 584960 582516 578923 574693 570592 567137 564172 561097 557542 553729 550258 547638
59854E47638j686j171j284j625j422l43J114K211K834L406M185N055O031P399
$$ 547638 545952 544781 543497 541872 540450 540107 541221 543432 546266 549672 553857 558912 564943 572342
59840E72342R257J1246J2948J4210J4837J4239J1844P836L300m25k425k387n25
$$ 572342 581599 592845 605793 620003 634840 649079 660923 668759 672059 671634 669209 666822 666297
59827F66297K378M919N512L362q88n656r697j2807j5267j7021j7719j7305j6201
$$ 666297 668675 673594 679106 682468 681580 675924 666227 653420 638153 621132 603413 586108 569907
59814E69907j4890j3629j2457j1253r847q283o897n878m989l990l128k791k862
$$ 569907 555017 541388 528931 517678 507831 499548 492651 486773 481784 477794 474666 471875 469013
59801D69013k884k701k426k003j335p75q12j307j702j951k508l341l746l344k558
$$ 469013 466129 463428 461002 458999 457664 456889 456077 454770 453068 451117 448609 445268 441522 438178 435620
59786D35620j893j435j232j374j453q26K43O11j11r23j009r16j370j884j683j183
$$ 435620 433727 432292 431060 429686 428233 427407 427650 428261 428150 427227 426218 425302 423932 422048 420365 419182
59770D19182j313j828j639o05K98M58J76k69r66j601j444m34N83R55R20R24J063
$$ 419182 417869 416041 414402 413797 414095 414553 414729 414460 413494 411893 410449 410015 410598 411553 412473 413397 414460
59753D14460J392K046K734K864K479K387K929L445L349L062L185L399L002K200
$$ 414460 415852 417898 420632 423496 425975 428362 431291 434736 438085 441147 444332 447731 450733 452933
59739D52933J922K497L169L069K158J017J32m14p35q65o93k12K31J57m56r98r18
$$ 452933 454855 457352 460521 463590 465748 466765 466897 466483 465748 464883 464190 463978 464209 464366 463910 462912 461994
59722D61994m55l35p71j195j119r09j199j730j487j82J012Q10m94j418j210n29
$$ 461994 461539 461204 460433 459238 458119 457210 456011 454281 452794 452612 453624 454434 453940 452522 451312 450783
59706D50783j26J51O75J200J426J719K485L260L254K584K167K512L351M352N431
$$ 450783 450657 450808 451483 452683 454109 455828 458313 461573 464827 467411 469578 472090 475441 479793 485224
59691D85224O300O523O155N689N202M110K090k59j905k352j913j277r10p26m20
$$ 485224 491524 498047 504202 509891 515093 519203 521293 521034 519129 516777 514864 513587 512677 511951 511531
59676E11531q3j97p23p92J43J277J355L36p33j288j769k533l239l547l593l486
$$ 511531 511448 511251 510528 509736 509879 511156 512511 512847 512114 510826 509057 506524 503285 499738 496145 492659
59660D92659l094k546k284k307k068j341n89k16m3K26P16J653L166M599M933M208
$$ 492659 489565 487019 484735 482428 480360 479019 478430 478214 478171 478397 479113 480766 483932 488531 493464 497672
59644D97672L602L649L364J780n37k305l106l340l248k933k814l181l582l417
$$ 497672 501274 504923 508287 510067 509530 507225 504119 500779 497531 494598 491784 488603 485021 481604
59630D81604k805k208j544n06O03J140J022O35J41m17n79N4J030J524J469J423
$$ 481604 478799 476591 475047 474541 475144 476284 477306 477941 478082 477665 477086 477140 478170 479694 481163 482586
59614D82586J468J057k8j433k888m321n254n004l698k351j672j431j119n68K33
$$ 482586 484054 485111 485083 483650 480762 476441 471187 466183 462485 460134 458462 457031 455912 455344 455577
59599D55577J231J975J868J063M25L39K40k76o63l04M19O83M60M09P58R75O07
$$ 455577 456808 458783 460651 461714 462139 462478 462718 462442 461779 461475 461894 462577 463037 463446 464204 465179 465786
59582D65786r8o27q68j116j619k255k705k843k870k967l053l048l179l576l743
$$ 465786 465688 465061 464193 463077 461458 459203 456498 453655 450785 447818 444765 441717 438538 434962 431219
59567D31219l058j831j183j642k394k392j621p58m0Q11J744K193J829J014M21
$$ 431219 428161 426330 425147 423505 421111 418719 417098 416340 416300 417111 418855 421048 422877 423891 424312
59552D24312M93J177J885J859J006K43N43J725K654K675K223K013K243K843L833
$$ 424312 424805 425982 427867 429726 430732 430975 431518 433243 435897 438572 440795 442808 445051 447894 451727
59537D51727N090O312P649R924J3645J8053K1507K2561K0342J4589O169k574q943
$$ 451727 456817 463129 470778 480702 494347 512400 533907 556468 576810 591399 597568 594994 586051
59524E86051j1651j1237q960n983l377j846j076l6J667L331M311M888N477N690
$$ 586051 574400 563163 554203 548220 544843 542997 541921 541885 543552 546883 551194 556082 561559 567249
59510E67249M944L469J983O49q61k492l804m753n729o805p601p933q039q064p892
$$ 567249 572193 575662 577645 578294 577433 574941 571137 566384 560655 553850 546249 538316 530277 522213 514321
59495E14321p557p209o661n544m040k841k241j863j429j116r26m16N09J234J336
$$ 514321 506764 499555 492894 487350 483310 480469 478228 476365 474936 473820 472894 472478 472987 474221 475557
59480D75557J314J801K610L199L686M677O247P780Q783R251R362R201Q797P963
$$ 475557 476871 478672 481282 484481 488167 492844 499091 506871 515654 524905 534267 543468 552265 560228
59466E60228O239L501M97j722k906l580l977l740k780j748j120l62J449M384P487
$$ 560228 566467 569968 570465 568743 565837 562257 558280 554540 551760 550012 548892 548530 549979 554363 561850
59451E61850R812J1196J2122J3168J4743J6988J9619K1967K3379K3611K2631K0124
$$ 561850 571662 582858 594980 608148 622891 639879 659498 681465 704844 728455 751086 771210
59439G71210J5575R024J574n251j0615j4630j7584j9348j9719j8974j7763j6653
$$ 771210 786785 795809 797383 792132 781517 766887 749303 729955 710236 691262 673499 656846
59427F56846j5881j5362j4683j3366j1459r585q074o327l619l67K132L376M402
$$ 656846 640965 625603 610920 597554 586095 576510 568436 562109 558490 558123 560255 563631 568033
59414E68033O509R697J2955J5745J8589K2243K6727L1185L4121L3631K8132J7610
$$ 568033 574542 584239 597194 612939 631528 653771 680498 711683 745804 779435 807567 825177
59402H25177M365p896j6002j8831j7404j3764r534n142l76M133O299L883l432
$$ 825177 829542 821646 805644 786813 769409 755645 746111 740969 740593 744726 751025 754908 751476
59389G51476j3463k3019k9710l2614l2035k9090k5170k1258j7652j4367j1512
$$ 751476 738013 714994 685284 652670 620635 591545 566375 545117 527465 513098 501586
59378E01586r158p184n587m549l976l282k049o20L28N64L05k24p62q83l95K88
$$ 501586 492428 485244 479657 475108 471132 467850 465801 465181 465509 466073 466378 466154 465392 464509 464114 464402
59362D64402P29J064J555J796J303N87P49J901K886K853K353K517L671N190O278
$$ 464402 465131 466195 467750 469546 470849 471436 472185 474086 476972 479825 482178 484695 488366 493556 499834
59347D99834O652O717P230Q508J0047J1279J2475J4206J6112J7195J7333J7476
$$ 499834 506486 513203 520433 528941 538988 550267 562742 576948 593060 610255 627588 645064
59335F45064J8070J8316J7464J5896J4229J2269R596O559L755J066j945m999p297
$$ 645064 663134 681450 698914 714810 729039 741308 750904 757463 761218 762284 760339 755340 748043
59322G48043q582r349j0097j0970j1881j2496j2290j1169r862r162q952q441p278
$$ 748043 739461 730112 720015 709045 697164 684668 672378 661209 651347 642185 633233 624792 617514
59309F17514n901m902m447m241l788k741j284kQ35J559K448L185L315L005K955
$$ 617514 611613 606711 602264 598023 594235 591494 590210 590208 591043 592602 595050 598235 601550 604555 607510
59294F07510L740N503P982J0640J3092J5614J8844K2776K6507K8936K9001K5217
$$ 607510 611250 616753 624735 635375 648467 664081 682925 705701 732208 761144 790145 815362
59282H15362J6386L614r372j8938k4171k6164k5736k3089j9039j4913j1230p581
$$ 815362 831748 835362 825990 807052 782881 756717 730981 707892 688853 673940 662710 655129
59270F55129l821m24K353M738O848Q609J0197J1771J2937J3225J2936J2604J1860
$$ 655129 651308 650884 653237 657975 664823 673432 683629 695400 708337 721562 734498 747102 758962
59257G58962R841O646L286K47k871o137q845j0548j1599j2347j2659j2498j2192
$$ 758962 768803 775449 778735 778982 776111 769974 761129 750581 738982 726635 713976 701478 689286
59244F89286j1872j1328j0571r812q846p321n663m773m609m143k970j818j175
$$ 689286 677414 666086 655515 645703 636857 629536 623873 619100 614491 610348 607378 605560 604385
59231F04385m94O74J849K540L051L669L979L662L115K547J346p96k961m173m785
$$ 604385 603891 604565 606414 608954 612005 615674 619653 623315 626430 628977 630323 629527 626566 622393 617608
59216F17608n712o931p826q463r270r781r097p565o743p368q319q100o557m709
$$ 617608 611896 604965 597139 588676 579406 569625 560528 552963 546220 538852 530533 522433 515876 511167
59202E11167l432k920l014l422l649l128j757j98N94K81n13r47q16m35J27J070
$$ 511167 507735 504815 501801 498379 494730 491602 489845 489647 490241 490522 490009 489062 488246 487811 487938 489008
59186D89008K217L015L357L809M712N660O185O342O220N548M356L466L591M347
$$ 489008 491225 494240 497597 501406 506118 511778 517963 524305 530525 536073 540429 543895 547486 551833
59172E51833M786M632M236L774L260L134L890N129N871N939O254P468R017R928
$$ 551833 556619 561251 565487 569261 572521 575655 579545 584674 590545 596484 602738 610206 619223 629151
59158F29151J0047J0036J0434J1141J1589J1195R767P662N525L697J978Qk248
$$ 629151 639198 649234 659668 670809 682398 693593 703360 711022 716547 720244 722222 722230 719982
59145G19982m454o236p445q151q443q322p903p540p514p568p165o318n720n744
$$ 719982 715528 709292 701847 693696 685253 676931 669028 661488 653974 646406 639241 632923 627203 621459
59131F21459n793n168m150l570l505l202k285j213l21P39K216L592M333M851O049
$$ 621459 615666 610498 606348 602778 599273 596071 593786 592573 592252 592991 595207 598799 603132 607983 614032
59116F14032Q100J0287J1911J2730J2730J2125J1653J2074J3138J3730J3312J2581
$$ 614032 622132 632419 644330 657060 669790 681915 693568 705642 718780 732510 745822 758403
59104G58403J2214J1640R953P564N940N702N921N489M400L297K494J885J283L97
$$ 758403 770617 782257 792210 799774 805714 811416 817337 822826 827226 830523 833017 834902 836185 836582
59090H36582j098k989m408m764m413m053l866l766m007m783n649o127o673q227
$$ 836582 835484 832495 828087 823323 818910 814857 810991 807225 803218 798435 792786 786659 779986 771759
59076G71759j0799j3256j4614j4920j4758j4513j4231j3760j2820j1389r996r243
$$ 771759 760960 747704 733090 718170 703412 688899 674668 660908 648088 636699 626703 617460
59064F17460r032q744q124p384o536n321l882k823k389k247k168k323k638k598
$$ 617460 608428 599684 591560 584176 577640 572319 568437 565614 563225 560978 558810 556487 553849 551251
59050E51251j960j165o87n87q77j693k720l105k449j410q53q71j000r58o55K2
$$ 551251 549291 548126 547439 546852 545975 544282 541562 538457 536008 534598 533745 532874 531874 530916 530261 530283
59034E30283R65J718K049K378L118M005M483M516M514M687M919N119N342N720
$$ 530283 531248 532966 535015 537393 540511 544516 548999 553515 558029 562716 567635 572754 578096 583816
59020E83816O476P758R259J0378J0971J1464J1992J1961J0957R473Q161O845M966
$$ 583816 590292 598050 607309 617687 628658 640122 652114 664075 675032 684505 692666 699511 704477
59007G04477K684P60m58j228j701j714j278o74O0J114K379L392L963M424N085
$$ 704477 707161 707921 707463 706235 704534 702820 701542 700868 700928 702042 704421 707813 711776 716200 721285
58992G21285N793O168O026N422M477L324K094R25j08j129k531m527o622p901q135
$$ 721285 727078 733246 739272 744694 749171 752495 754589 755514 755406 754277 751746 747219 740597 732696 724561
58977G24561q200q966j0101j0442r380p365n175l232j636l37Q64K214L787N560
$$ 724561 716361 707395 697294 686852 677472 670107 664932 661700 660064 659727 660591 662805 666592 672152
58963F72152P569R669J1236J1669J1226J0873J1072J1096R893P368M448K015J26
$$ 672152 679721 689390 700626 712295 723521 734394 745466 756562 766455 773823 778271 780286 780412
58950G80412j776m148o969r780j1975j3213j3711j4018j4352j4274j3275j1506
$$ 780412 778636 774488 767519 757739 745764 732551 718840 704822 690470 676196 662921 651415
58938F51415r565p675n616l585k413k521l171l351l058l011l426l790l800l730
$$ 651415 641850 634175 628559 624974 622561 620040 616869 613518 610460 607449 604023 600233 596433 592703
58924E92703l765l686l407l286l557l875l692k889j873j221j184j378j118l38
$$ 592703 588938 585252 581845 578559 575002 571127 567435 564546 562673 561452 560268 558890 557772 557434
58910E57434K30J35M8Q63K361L641M529N541O675P469Q244R995J2754J5258J6627
$$ 557434 557664 557799 557847 558710 561071 564712 569241 574782 581457 588926 597170 607165 619919 635177 651804
58895F51804J7218J7371J6618J4834J2972J1805J0918R922R707J1333J4306J7091
$$ 651804 669022 686393 703011 717845 730817 742622 753540 763462 773169 784502 798808 815899
58883H15899J8945K0301K1636K2910K3831K4009K2953K0477J6888J2487P404K244
$$ 815899 834844 855145 876781 899691 923522 947531 970484 990961 1007849 1020336 1027740 1029984
58871A029984j940m913p760j1322j4944j7495j8938j9830k0004j8984j7233j5811
$$ 1029984 1028044 1023131 1015371 1004049 989105 971610 952672 932842 912838 893854 876621 860810
58859H60810j4990j4244j3424j2917j2829j2933j3313j4165j5062j5327j5042
$$ 860810 845820 831576 818152 805235 792406 779473 766160 751995 736933 721606 706564
58848G06564j4877j4983j4871j4256j3278j2014j0497r066q020p175o425o249
$$ 706564 691687 676704 661833 647577 634299 622285 611788 602722 594702 587527 581102 574853
58836E74853o858p272o437m868l964l916l631k749k262k823l725m073l952l861
$$ 574853 567995 560723 554286 549418 545454 541538 537907 535158 532896 530073 526348 522275 518323 514462
58822E14462l835l661l299k658j576l56L30L63M21R85J775K403K941L428L451
$$ 514462 510627 506966 503667 501009 499433 499077 499407 499770 500191 501176 502951 505354 508295 511723 515174
58807E15174K772J885J563K055L033L944M229L552K149P21j97o26q64j145j589
$$ 515174 517946 519831 521394 523449 526482 530426 534655 538207 540356 541077 540880 540254 539390 538245 536656
58792E36656k173k649k702k237j382l35N90J040J009R83J401K203L230M588O235
$$ 536656 534483 531834 529132 526895 525513 525178 525768 526808 527817 528800 530201 532404 535634 540222 546457
58777E46457P671Q611R482J0596J1359J0999R662P848N300J548k685n890p546
$$ 546457 554128 562739 572221 582817 594176 605175 614837 622685 627985 629533 626848 620958 613412
58764F13412q387q863q497p028n163l753l041l004l612m391m519l753k666j739
$$ 613412 605025 596162 587665 580637 575474 571721 568680 565676 562064 557673 553154 549401 546735 544996
58750E44996q36J90J065J575J931K382K943L573M150M260L718L282M048N972P797
$$ 544996 544160 544350 545415 546990 548921 551303 554246 557819 561969 566229 569947 573229 577277 583249 591046
58735E91046Q660Q952R337R739R742R348Q836Q417Q296Q592Q941Q705P850P055
$$ 591046 599706 608658 617995 627734 637476 646824 655660 664077 672373 680965 689906 698611 706461 713516
58721G13516O718O508O109N832O003O428O805P297Q166R171R830J0061J0194J0424
$$ 713516 720234 726742 732851 738683 744686 751114 757919 765216 773382 782553 792383 802444 812638 823062
58707H23062J0466R817Q323O462M828L232P78k869o764r792j2030j4326j6890
$$ 823062 833528 843345 851668 858130 862958 866190 866968 864099 857335 847543 835513 821187 804297
58694H04297j9166k0871k2179k2974k2887k2051k0991j9710j7814j5554j3780
$$ 804297 785131 764260 742081 719107 696220 674169 653178 633468 615654 600100 586320
58683E86320j2687j1534r855q053o520n086l732k978l068l416l393l058k669j975
$$ 586320 573633 562099 552244 544191 537671 532585 528853 525875 522807 519391 515998 512940 510271 508296
58669E08296n99J180K537L056L341M534P029R750J1147J1035J0732J1036J0990
$$ 508296 507697 508877 511414 514470 517811 522345 529374 539124 550271 561306 572038 583074 594064
58656E94064R354O411L296L60k518m707n536n680o261o814n929l860k576k938
$$ 594064 603418 609829 613125 613485 610967 606260 600724 595044 588783 581969 576040 572180 569604 566666
58642E66666l613l351k644k445k670k856l058l306l163k558k086j950j560p05
$$ 566666 563053 559702 557058 554613 551943 549087 546029 542723 539560 537002 534916 532966 531406 530701
58628E30701n5jo2J2l29j262j959j860j561j685j874j631j266j231j217o88L80
$$ 530701 530646 530645 530583 530595 530266 529004 527045 525185 523624 521939 520065 518434 517168 515937 514720 514032 514412
58611E14412J876L937O424Q698J0351J1394J1513J0158P720N521M066K513L91
$$ 514412 516288 520225 526649 535347 545698 557092 568605 578763 586483 592004 596070 598583 598974
58598E98974j337j764j482j577k130k556k674k622k398k154k233k349j543M27
$$ 598974 597637 595873 594391 592814 590684 588128 585454 582832 580434 578280 576047 573698 572155 572582
58584E72582K479L620M124M802N957P492R174J0276J0017Q843Q208Q615Q979Q476
$$ 572582 575061 578681 582805 587607 593564 601056 610230 620506 630523 639366 647574 656189 665168 673644
58570F73644P662P153O609N894N857O995Q573J0006J1825J4340J6725J8446K0162
$$ 673644 681306 688459 695068 700962 706819 713814 722387 732393 744218 758558 775283 793729 813891
58557H13891K2030K2665K1276J9352J8495J7850J5585J1849Q256N214J820k036
$$ 813891 835921 858586 879862 899214 917709 935559 951144 962993 971249 976463 978283 976247
58545I76247n423q071j0514j2654j3738j3757j3484j3158j2469j1763j1897j2887
$$ 976247 970824 962753 952239 939585 925847 912090 898606 885448 872979 861216 849319 836432
58533H36432j3849j4415j5054j5928j6428j6052j4927j3352j1552r882q624p533
$$ 836432 822583 808168 793114 777186 760758 744706 729779 716427 704875 694993 686369 678836
58521F78836o107m240k196k36J342K159K229K094K054J723Q48j9k19J37N09O34
$$ 678836 672729 668489 666293 666057 667399 669558 671787 673881 675935 677658 678506 678487 678268 678405 678914 679548
58505F79548N59M16N82J392K446K881K536K055J671J012K39R2M37K44o37j148
$$ 679548 680107 680523 681105 682497 684943 687824 690360 692415 694086 695098 695337 695429 695866 696110 695473 694325
58489F94325j042j436k584k985j851o11o04j007n40L60Q32J477L114M972O007
$$ 694325 693283 691847 689263 686278 684427 683816 683212 682205 681665 682025 682857 684334 687448 692420 698427
58474F98427O885Q670J0575J1048J0287R647R283Q232O365M349K185n12l243n151
$$ 698427 705312 713982 724557 735605 745892 755539 764822 773054 779419 783768 785953 785441 782198 777047
58460G77047o323p164p224o078m660m005l490j947K45J916L132M623N858N741
$$ 777047 770724 763560 756336 750258 745598 741593 738103 736156 736401 738317 741449 746072 751930 757671
58446G57671M807M670N495N778M505K085o10k780l735l696l949m930n107l254
$$ 757671 762478 767148 772643 778421 782926 785011 784401 781621 777886 774190 770241 765311 760204 756950
58432G56950o74O56J055K135L763M440M121M192M975N502N596O069O989P792Q810
$$ 756950 756276 756932 757987 760122 763885 768325 772446 776638 781613 787115 792711 798780 805769 813561 822371
58417H22371J0606J2105J1604R526P973P497O517M122J366n95j775k421k456k282
$$ 822371 832977 845082 856686 866212 874185 881682 888199 892321 893687 893092 891317 888896 886440 884158
58403H84158k691l709m707n567o500o987o288m751l295j979m12J003J758K491
$$ 884158 881467 877758 873051 867484 860984 853997 847709 842958 839663 837684 837272 838275 840033 842524
58389H42524M011N642O200N849N385M559K970J744K175L494M047L906M101M207
$$ 842524 846535 852177 858377 864226 869611 874170 877140 878884 881059 884553 888600 892506 896607 900814
58375I00814L151J704J523K289K315J616J689K642L143L052L580M908O116P252
$$ 900814 903965 905669 907192 909481 911796 913412 915101 917743 920886 923938 927518 932426 938542 945794
58361I45794R085J1013J1616J1071J0765J0912J0828J0959J2081J3110J2453J0923
$$ 945794 954879 965892 977508 988579 999344 1010256 1021084 1032043 1044124 1057234 1069687 1080610
58349A080610J0460J0607R319O786N176M906M464L778M382O194P495Q178R765
$$ 1080610 1091070 1101677 1110996 1117782 1122958 1127864 1132328 1136106 1140488 1146682 1154177 1162355 1172120
58336A172120J2069J3197J3052J3556J5092J6016J5951J6258J6946J6533J5240
$$ 1172120 1184189 1197386 1210438 1223994 1239086 1255102 1271053 1287311 1304257 1320790 1336030
58325A336030J4991J5776J5525J4011J3310J3881J3749J2262J1197J1323J1288
$$ 1336030 1351021 1366797 1382322 1396333 1409643 1423524 1437273 1449535 1460732 1472055 1483343
58314A483343J0685J0883J2041J2593J2312J2691J3757J3903J3383J4316J6668
$$ 1483343 1494028 1504911 1516952 1529545 1541857 1554548 1568305 1582208 1595591 1609907 1626575
58303A626575J8004J7811J8284K0094K1325K1439K2324K4362K5403K4725K4232
$$ 1626575 1644579 1662390 1680674 1700768 1722093 1743532 1765856 1790218 1815621 1840346 1864578
58292A864578K4609K4136K2432K1539K2205K2850K3137K4612K6972K7878K7433
$$ 1864578 1889187 1913323 1935755 1957294 1979499 2002349 2025486 2050098 2077070 2104948 2132381
58281B132381K8468L1442L3455L3529L4238L6774L9072M0253M2284M5591M7758
$$ 2132381 2160849 2192291 2225746 2259275 2293513 2330287 2369359 2409612 2451896 2497487 2545245
58270B545245M8199M9500N2484N4624N5091N6523O0024O3178O4907O7385P1463
$$ 2545245 2593444 2642944 2695428 2750052 2805143 2861666 2921690 2984868 3049775 3117160 3188623
58259C188623P4977P7362Q0894Q5695Q8772Q9717R1840R5904R8484R8466R9241
$$ 3188623 3263600 3340962 3421856 3507551 3596323 3686040 3777880 3873784 3972268 4070734 4169975
58248D169975J02414J05371J07278J11188J17879J23968J28526J34983J44131
$$ 4169975 4272389 4377760 4485038 4596226 4714105 4838073 4966599 5101582 5245713
58239E245713J52178J58236J66455J77924J88203J95923K05927K20372K34875
$$ 5245713 5397891 5556127 5722582 5900506 6088709 6284632 6490559 6710931 6945806
58230F945806K47307K62089K81539L01406L19430L39908L65056L90552M14575
$$ 6945806 7193113 7455202 7736741 8038147 8357577 8697485 9062541 9453093 9867668
58221I867668M42401M76956N13941N51483N95103O47627P04079P62382Q28862
$$ 9867668 10310069 10787025 11300966 11852449 12447552 13095179 13799258 14561640 15390502
58212A5390502R07269R93375J086763J196356J327574J476435J643610J841253
$$ 15390502 16297771 17291146 18377909 19574265 20901839 22378274 24021884 25863137
58204B5863137K078428K354574K676390L066159L544596M123510M827560N706439
$$ 25863137 27941565 30296139 32972529 36038688 39583284 43706794 48534354 54240793
58196E4240793O815858Q209971R966249J2184264J4921300J8135389K1711130
$$ 54240793 61056651 69266622 79232871 91417135 106338435 124473824 146184954
58189A46184954K5520174K9407146L3068616L5883227L6807900L4532885K8051352
$$ 146184954 171705128 201112274 234180890 270064117 306872017 341404902 369456254
58182C69456254J7443301M256365q997878j9963506k7343856l1038507l1698610
$$ 369456254 386899555 391155920 382158042 362194536 334850680 303812173 272113563
58175B72113563l0217361k7425593k3958411k0221598j6443501j2782672r445496
$$ 272113563 241896202 214470609 190512198 170290600 153847099 141064427 131618931
58168A31618931o770574n189566m986445n992598p548658q865536r476565r370295
$$ 131618931 124848357 119658791 114672346 108679748 101131090 92265554 82788989 73418694
58160G3418694q778279p932048o992765o072683n232333m478833l806413l226572
$$ 73418694 64640415 56708367 49715602 43642919 38410586 33931753 30125340 26898768
58152B6898768k746734k348644k009674j725297j493968j300190j130060r86892
$$ 26898768 24152034 21803390 19793716 18068419 16574451 15274261 14144201 13157309
58144A3157309q75664p86530p07748o41105n91167n51342n13133m78068m49002
$$ 13157309 12281645 11495115 10787367 10146262 9555095 9003753 8490620 8012552 7563550
58135G563550m19977l85550l50720l21516k94680k65762k38571k17640j99809
$$ 7563550 7143573 6758023 6407303 6085787 5791107 5525345 5286774 5069134 4869325
58126D869325j81963j68976j65233j65711j63584j59700j56941j52503j43575
$$ 4869325 4687362 4518386 4353153 4187442 4023858 3864158 3707217 3554714 3411139
58117C411139j34047j27867j21889j12423j02838r7411r3506q6982p9893p5879
$$ 3411139 3277092 3149225 3027336 2914913 2812075 2714664 2621158 2534176 2454283 2378404
58107B378404p2943o7682o2007n9165n7445n3988n0565m9735m9476m7260m5216
$$ 2378404 2305461 2237779 2175772 2116607 2059162 2005174 1954609 1904874 1855398 1808138 1762922
58096A762922m5715m6084m3257l9572l8380l7912l5099l1623l0494l0177k7706
$$ 1762922 1717207 1671123 1627866 1588294 1549914 1512002 1476903 1445280 1414786 1384609 1356903
58085A356903k4440k3312k3361k2140k0729k1333k2555k1856k0234j9985k0425
$$ 1356903 1332463 1309151 1285790 1263650 1242921 1221588 1199033 1177177 1156943 1136958 1116533
58074A116533k0006j9924k1432k2431k0923j8984j9094j9604j8104j6252j6603
$$ 1116533 1096527 1076603 1055171 1032740 1011817 992833 973739 954135 936031 919779 903176
58063I03176j7566j6250j3770j2918j2928j1383r223r104j0474j0810j0161j0249
$$ 903176 885610 869360 855590 842672 829744 818361 809138 800034 789560 778750 768589 758340
58051G58340j0613r769q700r189j0208r764q748r128r948r080p415p249p942p176
$$ 758340 747727 737958 729258 720069 709861 700097 691349 682221 672273 663193 655778 648529 640587 633411
58037F33411n384m935n827o029n364n425o282o595o482p199q518r236r566j0378
$$ 633411 628027 623092 617265 611236 605872 600447 594165 587570 581088 573889 565371 556135 546569 536191
58023E36191j1028j0499r621r611r665q531p095o708o511n211l926m269n073m259
$$ 536191 525163 514664 505043 495432 485767 477236 470141 463433 456922 451711 447785 443516 438443 434184
58009D34184k637k529l716m023l034k141j715j167j008j962k891k325j144j045
$$ 434184 431547 429018 425302 421279 418245 416104 414389 413222 412214 410252 407361 405036 403892 402847
57995D02847j446q36Po49j984j709mR07O04P91J999K995L290L550L643K802J546
$$ 402847 401401 400565 400572 399923 397939 396230 396226 397133 397737 398528 400527 403522 406812 410362 414005 416807 418353
57978D18353J147J403J153M78K87L58n4m35l8K46o19j520r33J65j83j424j484
$$ 418353 419500 420903 422056 422534 422821 423179 423125 422690 422652 422898 422279 420759 419826 419991 419808 418384 416900
57961D16900m17j6m70m30k0o45k095k805k841l733n434o278o004n969o296n645
$$ 416900 416483 416467 415997 415567 415547 414902 412807 410002 407161 403428 397994 391716 385712 379743 373447 367802
57945C67802m008l076l380l554k829j942j275k73R69J684K172L473N205N861N397
$$ 367802 363794 360718 357338 353784 350955 349013 347738 347465 348434 350118 352290 355763 360968 366829 372226
57930C72226N330O065O350N649N009N117N430N564N791N950N449M571M148L983
$$ 372226 377556 383621 389971 395620 400629 405746 411176 416740 422531 428481 433930 438501 442649 446632
57916D46632L169J798O52n01k535n084o898p797q486q880q483q034q565r321q847
$$ 446632 449801 451599 452251 451750 449215 444131 437233 429436 420950 412070 403587 395553 386988 377667 368820
57901C68820p789q080r587j0100q826p303o655o364o102o383o905o502n255m529
$$ 368820 361031 352951 343364 333264 324438 317135 310480 304116 298014 291631 284726 278224 272969 268440
57887B68440m499l778k048q27r26j212o85J35O94J449K618L393L289K909K830
$$ 268440 263941 260163 258115 257288 256362 255150 254465 254600 255294 256743 259361 262754 266043 268952 271782
57872B71782K879K907K990K645J273n37j521j624j849k305k113j344j165j892
$$ 271782 274661 277568 280558 283203 284476 283939 282418 280794 278945 276640 274527 273183 272018 270126
57858B70126k524k476k079j277M22K447L461L406L570M443N193N473N873O404
$$ 270126 267602 265126 263047 261770 262192 264639 268100 271506 275076 279519 284712 290185 296058 302462
57844C02462O344N861N932O407O054M780L860L656L119J950J182J013J49j971
$$ 302462 308806 314667 320599 327006 333060 337840 341700 345356 348475 350425 351607 352620 352769 350798
57830C50798m113n203n690o226o652o841p078p062o064m441l439l155k474j209
$$ 350798 346685 341482 335792 329566 322914 316073 308995 301933 295869 291428 287989 284834 282360 281151
57816B81151m37l65M9J004J469J401K085L619M325L583L009L718M510L967K442
$$ 281151 280714 280349 280398 281402 282871 284272 286357 289976 294301 297884 300893 304611 309121 313088 315530
57801C15530P62j230l545n229n889o465p378p573o538n489n344n225m296l387
$$ 315530 316292 315062 311517 306288 300399 293934 286556 278983 272445 266956 261612 256387 252091 248704
57787B48704l353l409k692j993k265k790k439j661j525j777j467p27l74l59N6
$$ 248704 245351 241942 239250 237257 234992 232202 229763 228102 226577 224800 223333 222606 222232 221873 221929
57772B21929J050K201L225L946M150M140M645N610O010N452M861M908M987M475
$$ 221929 222979 225180 228405 232351 236501 240641 245286 250896 256906 262358 267219 272127 277114 281589
57758B81589L720L007J906M77k42J3n1j249k536k852k863l503m135l802l159l424
$$ 281589 285309 288316 290222 290699 290457 290470 290419 289170 286634 283782 280919 277416 273281 269479 266320 262896
57742B62896m320m636m165l596l075k370j912k294l105l485l412l359l156k300
$$ 262896 258576 253940 249775 246179 243104 240734 238822 236528 233423 229938 226526 223167 220011 217711
57728B17711j027n6M01N57M15J3j65K14Q45J399J969K393K007Q19k5K61R86J242
$$ 217711 216684 216628 217029 217586 218001 218014 217849 218063 218908 220307 222276 224669 226676 227495 227470 227731 228717 229959
57710B29959J272J659J991J457J45j167j903j734n84P72J117N64P84K605M585
$$ 229959 231231 232890 234881 236338 236483 235316 233413 231679 231095 231867 232984 233548 234332 236937 241522
57695B41522N084M507M280M673N070N379N631N031K915J46j877l005l856m279
$$ 241522 246606 251113 255393 260066 265136 270515 276146 281177 284092 284238 282361 279356 275500 271221
57681B71221l750k746k262k180j485J81K410N110Q547J2582J6960K2142K8801
$$ 271221 267471 264725 262463 260283 258798 258979 261389 266499 275046 287628 304588 326730 355531
57668C55531L6725M5112N3592O2003O9350P3521P1642O0596L8873R463k0171m2849
$$ 355531 392256 437368 490960 552963 622313 695834 767476 828072 866945 876408 856237 813388
57656H13388n6390o2875o4522o2083n6523m9755m3193l6966l0923k5330k0474
$$ 813388 756998 694123 629601 567518 510995 461240 418047 381081 350158 324828 304354
57645C04354j6490j3635j1924j0610q900o925n218l637j823l04J29j68m2Q00J639
$$ 304354 287864 274229 262305 251695 242795 235870 230652 227015 225192 224888 225017 224849 224807 225607 227246
57630B27246K008K004J549N25l77j60J015J898J720Q37j62r87j367j138p64q61
$$ 227246 229254 231258 232807 233332 232955 232795 233810 235708 237428 238265 238103 237116 235749 234611 233847 232986
57614B32986j273j338r73o18l01K84Q65P53Mm89k69J40J22k61n13k23O73J752
$$ 232986 231713 230375 229402 228784 228483 228767 229632 230385 230389 229900 229631 229771 229893 229632 229119 228896 229569 231321
57596B31321K281J986J360Q90L52n52j445j815j867k042k172j946j718j988k422
$$ 231321 233602 235588 236948 237838 238190 237638 236193 234378 232511 230469 228297 226351 224633 222645 220223
57581B20223k316j699j145q43o70p66j103j006j05O81K68r13j546j382j326j729
$$ 220223 217907 216208 215063 214220 213550 212784 211681 210675 210570 211251 211519 210606 209060 207678 206352 204623
57565B04623j905j401n62K08Q04R84N95J78M44J149J368Q90M09L89P13J325K308
$$ 204623 202718 201317 200755 200963 201767 202751 203346 203524 203968 205117 206485 207375 207784 208173 208886 210211 212519
57548B12519L231L310K364R56l21j097j059l06M60Q25J329K402L278L063K321
$$ 212519 215750 219060 221424 222380 222059 220962 219903 219597 220057 220882 222211 224613 227891 230954 233275
57533B33275K267K807K840K201J746J630J102O9o63q75j244j866j939j194l66
$$ 233275 235542 238349 241189 243390 245136 246766 247868 247937 247274 246399 245155 243289 241350 240156 239790
57518B39790Q6M72P80M88j30P9J355K379K048Q08m11j405k167k288j774j531k267
$$ 239790 239876 240348 241128 241616 241486 241565 242920 245299 247347 248155 247744 246339 244172 241884 240110 238579 236312
57501B36312l468m144l946l035j630k44L73J39o6M34J279J820K036K175K115J688
$$ 236312 232844 228700 224754 221719 220089 219845 220218 220357 220291 220725 222004 223824 225860 228035 230150 231838
57485B31838J167R22J041J552K473L311L249K216J202J009J308J388J253J399
$$ 231838 233005 233927 234968 236520 238993 242304 245553 247769 248971 249980 251288 252676 253929 255328
57471B55328J979K731L386L633L061J670J93n08k46N02J193J629J974K506L210
$$ 255328 257307 260038 263424 267057 270118 271788 271981 271473 271227 271729 272922 274551 276525 279031 282241
57456B82241L656L540L164K975K868K490K069K181K711K846K296J747J825K318
$$ 282241 285897 289437 292601 295576 298444 300934 303003 305184 307895 310741 313037 314784 316609 318927
57442C18927K660K682K571K458K392K320K110J823J868K445L022L000K650K718
$$ 318927 321587 324269 326840 329298 331690 334010 336120 337943 339811 342256 345278 348278 350928 353646
57428C53646L228L575L686M056M579M410L299K171J911K330K679K619K288K022
$$ 353646 356874 360449 364135 368191 372770 377180 380479 382650 384561 386891 389570 392189 394477 396499
57414C96499K250L118M004M032L193K395K209K322K340K441K841L306L535L608
$$ 396499 398749 401867 405871 409903 413096 415491 417700 420022 422362 424803 427644 430950 434485 438093
57400D38093L730L935M156M282M144L893M116M996N657N200M099L619M020M443
$$ 438093 441823 445758 449914 454196 458340 462233 466349 471345 477002 482202 486301 489920 493940 498383
57386D98383M546M999O167P450Q224Q435Q078P108O150O111O829P109O412N495
$$ 498383 502929 507928 514095 521545 529769 538204 546282 553390 559540 565651 572480 579589 586001 591496
57372E91496N069M994N071N359N411M558L424L661N459O873O453N158M587M753
$$ 591496 596565 601559 606630 611989 617400 621958 625382 629043 634502 641375 647828 652986 657573 662326
57358F62326M879N163O192P470Q012P850P647P425O969O877P839R194R595Q901
$$ 662326 667205 672368 678560 686030 694042 701892 709539 716964 723933 730810 738649 747843 757438 766339
57344G66339Q184Q095Q349Q710R261R678R338Q393P828Q247R269J0210J0711J0664
$$ 766339 774523 782618 790967 799677 808938 818616 827954 836347 844175 852422 861691 871901 882612 893276
57330H93276J0156R633R542R804R982R948R901R912R932J0082J0452J0763J0745
$$ 893276 903432 913065 922607 932411 942393 952341 962242 972154 982086 992168 1002620 1013383 1024128
57317A024128J0682J1042J1701J2114J2175J2302J2695J3027J3002J2828J2946
$$ 1024128 1034810 1045852 1057553 1069667 1081842 1094144 1106839 1119866 1132868 1145696 1158642
57306A158642J3541J4272J4472J3763J2672J2317J3241J4757J5744J5797J5340
$$ 1158642 1172183 1186455 1200927 1214690 1227362 1239679 1252920 1267677 1283421 1299218 1314558
57295A314558J4898J4697J4790J5179J5824J6720J7887J9214K0510K1695K2750
$$ 1314558 1329456 1344153 1358943 1374122 1389946 1406666 1424553 1443767 1464277 1485972 1508722
57284A508722K3474K3736K3916K4514K5305K5549K5184K5097K5886K7191K8551
$$ 1508722 1532196 1555932 1579848 1604362 1629667 1655216 1680400 1705497 1731383 1758574 1787125
57273A787125L0070L1685L2593L2255L1334L0881L1017L1183L1209L1301L1288
$$ 1787125 1817195 1848880 1881473 1913728 1945062 1975943 2006960 2038143 2069352 2100653 2131941
57262B131941L0785K9989K9553K9639K9743K9498K9128K8983K9045K9024K8715
$$ 2131941 2162726 2192715 2222268 2251907 2281650 2311148 2340276 2369259 2398304 2427328 2456043
57251B456043K8231K7871K7707K7395K6714K6121K6258K6904K7136K6685K6328
$$ 2456043 2484274 2512145 2539852 2567247 2593961 2620082 2646340 2673244 2700380 2727065 2753393
57240B753393K6604K6962K6679K5977K5546K5568K5821K6228K6691K6804K6351
$$ 2753393 2779997 2806959 2833638 2859615 2885161 2910729 2936550 2962778 2989469 3016273 3042624
57229C042624K5728K5428K5455K5712K6406K7556K8642K9232K9555K9892L0016
$$ 3042624 3068352 3093780 3119235 3144947 3171353 3198909 3227551 3256783 3286338 3316230 3346246
57218C346246K9790K9697L0050L0288K9787K8968K8660K8858K8920K8629K8242
$$ 3346246 3376036 3405733 3435783 3466071 3495858 3524826 3553486 3582344 3611264 3639893 3668135
57207C668135K7783K7142K6664K6772K7186K7338K7397K8056K9338L0421L0722
$$ 3668135 3695918 3723060 3749724 3776496 3803682 3831020 3858417 3886473 3915811 3946232 3976954
57196C976954L0447L0010K9491K8865K8304K8007K7992K8039K7747K6855K5657
$$ 3976954 4007401 4037411 4066902 4095767 4124071 4152078 4180070 4208109 4235856 4262711 4288368
57185D288368K4813K4468K3972K2782K1264K0195J9791J9664J9403J8859J8121
$$ 4288368 4313181 4337649 4361621 4384403 4405667 4425862 4445653 4465317 4484720 4503579 4521700
57174D521700J7516J7344J7398J7202J6797J6698J6802J6211J4524J2482J0878
$$ 4521700 4539216 4556560 4573958 4591160 4607957 4624655 4641457 4657668 4672192 4684674 4695552
57163D695552R609Q421P619P263O535M791K501K81k262n671r314j2047j3775j5272
$$ 4695552 4705161 4713582 4721201 4728464 4734999 4739790 4742291 4742572 4740310 4734639 4725325 4713278 4699503 4684231
57149D684231j6922j8536k0021k1197k1354k0035j7876j5816j3937j1974j0313
$$ 4684231 4667309 4648773 4628752 4607555 4586201 4566166 4548290 4532474 4518537 4506563 4496250
57138D496250r409q736p513o090n400n455n640o149p731j0192j2468j4094j5417
$$ 4496250 4486841 4478105 4470592 4464502 4459102 4453647 4448007 4441858 4434127 4423935 4411467 4397373 4381956
57125D381956j6406j6461j5356j3381j0578o872k821P73L751O222P819Q436R272
$$ 4381956 4365550 4349089 4333733 4320352 4309774 4302902 4300081 4300854 4304605 4310827 4318646 4327082 4336354
57112D336354J1804J6188K2088L0536M3163N9753P8389R8151J20137J45938J76881
$$ 4336354 4348158 4364346 4386434 4416970 4460133 4519886 4598275 4696426 4816563 4962501 5139382
57101E139382K14914K62592L21892L94598M83859N93715P27004Q85361J070969
$$ 5139382 5354296 5616888 5938780 6333378 6817237 7410952 8137956 9023317 10094286
57092A0094286J285892J529071J795432K077364K364391K641767K893316L107442
$$ 10094286 11380178 12909249 14704681 16782045 19146436 21788203 24681519 27788961
57084B7788961L278451L402653L477229L501669L469870L352485L092803K634951
$$ 27788961 31067412 34470065 37947294 41448963 44918833 48271318 51364121 53999072
57076E3999072J966888J139028K42721o29211j409817k064402k584187k975283
$$ 53999072 55965960 57104988 57347709 56718498 55308681 53244279 50660092 47684809
57068D7684809l247618l408909l466087l429667l314905l139600k921914k679047
$$ 47684809 44437191 41028282 37562195 34132528 30817623 27678023 24756109 22077062
57060B2077062k425674k172755j928313j698840j489079j300953j134016r87278
$$ 22077062 19651388 17478633 15550320 13851480 12362401 11061448 9927432 8940154
57052H940154q60017p51014o58038n78559n10431m51732m00571l55604l16280
$$ 8940154 8080137 7329123 6671085 6092526 5582095 5130363 4729792 4374188 4057908
57043D057908k82153k52202k25265k00966j79662j61449j45660j31444j18462
$$ 4057908 3775755 3523553 3298288 3097322 2917660 2756211 2610551 2479107 2360645
57034B360645j06801r6483q7336p9167p1867o5316n9240n3108m6340l8957l1755
$$ 2360645 2253844 2157361 2070025 1990858 1918991 1853675 1794435 1741327 1694987 1656030 1624275
57023A624275k5191j8137q517M746K1246M0499O2512Q6683J12058J39269J68927
$$ 1624275 1599084 1580947 1572430 1577176 1598422 1638921 1701433 1788116 1900174 2039443 2208370
57012B208370J94430J98318J62165Q3925j5898j07369j70308k01534k08346j99676
$$ 2208370 2402800 2601118 2763283 2847208 2831310 2723941 2553633 2352099 2143753 1944077
57002A944077j82674j62611j42551j23440j05510q9328p5277o3016n2079m2538
$$ 1944077 1761403 1598792 1456241 1332801 1227291 1137963 1062686 999670 947591 905053
56992I05053l4668k8345k3217j9049j5604j2527r640p146n229l734k438j577j818
$$ 905053 870385 842040 818823 799774 784170 771643 762003 754857 749628 745894 743456 741879 740061
56979G40061l789p597j2548j7270k0390k1465k1210k0686k0219j9289j7385j4725
$$ 740061 736272 728675 716127 698857 678467 657002 635792 615106 594887 575598 558213 543488
56967E43488j2052r842p944n887l374m57K516N118P243R317J1883J4725J6639
$$ 543488 531436 521594 513650 507763 504389 503932 506448 511566 518809 528126 540009 554734 571373
56954E71373J6222J2787O645j049q576j4346j7821j9559k0118j9373j7319j4872
$$ 571373 587595 600382 607027 605978 597402 583056 565235 545676 525558 506185 488866 473994
56942D73994j3098j1893j0233p601m435j260J883N088Q367J1836J5593J9275K2207
$$ 473994 460896 449003 438770 431169 426734 425474 427357 432445 440812 452648 468241 487516 509723
56929E09723K3865K3666K0583J3890M416n701j4600k1439k5710k6979k5694k3372
$$ 509723 533588 557254 577837 591727 596143 590442 575842 554403 528693 501714 476020 452648
56917D52648k1391k0019j8873j7608j5864j3202r748o521m683m605n688o796o910
$$ 452648 431257 411238 392365 374757 358893 345691 335943 329422 324739 320134 314446 307650 300740
56904C00740n918m750m260m078l234j735n22R6P97J916K938L777N257P707J0201
$$ 300740 294822 290072 285812 281734 278500 276765 276243 276339 277136 279052 281990 285767 291024 298731 308932
56889C08932J2033J3836J6345J8886K0231K0132J8911J6201J1511N623J44m290
$$ 308932 320965 334801 351146 370032 390263 410395 429306 445507 457018 462641 462785 458495
56877D58495q150j1400j3022j2499j0705q769o790m250j176J893M815Q131J2319
$$ 458495 450345 438945 425923 413424 402719 393950 387160 382910 381734 383627 388442 396573 408892
56864D08892J7226K2445K7859L3514L9014M3520M6249M6369M2392L2698J7576
$$ 408892 426118 448563 476422 509936 548950 592470 638719 685088 727480 760178 777754
56853G77754L09j4814k5464l1765l4524l4246l1770k8238k3909j8100j0872l604
$$ 777754 778063 763249 737785 706020 671496 637250 605480 577242 553333 535233 524361 520757
56841E20757K780R140J6829K5814L5026M3957N2940O2023P0330P6173P7187P0755
$$ 520757 523537 532677 549506 575320 610346 654303 707243 769266 839596 915769 992956 1063711
56829A063711N5359L2032M453k2440m4327n8960o6483o8385o6118o0866n4026
$$ 1063711 1119070 1151102 1155555 1133115 1088788 1029828 963345 894960 828842 767976 713950
56818G13950m6834l9427l1242k2351j3467m592N035J5283K4793L2799L9970M6696
$$ 713950 667116 627689 596447 574096 560629 556037 561072 576355 601148 633947 673917 720613
56806G20613N1715N3175M9876M0780K4995L801j8401l6724m8960n5318n6487n3500
$$ 720613 772328 825503 875379 916159 941154 944955 926554 889830 840870 785552 729065 675565
56794F75565m8490m3415l8345l2465k6247k0941j6306j0786m021K528P725J2036
$$ 675565 627075 583660 545315 512850 486603 465662 449356 438570 434549 437077 444802 456838
56782D56838J6292K0476K4069K6363K5989K1323J2121J93j1818k1863k8841l2596
$$ 456838 473130 493606 517675 544038 570027 591350 603471 603664 591846 569983 541142 508546
56770E08546l3895l3788l2675l0428k7218k3685k0330j7410j5197j3642j2093
$$ 508546 474651 440863 408188 377760 350542 326857 306527 289117 273920 260278 248185
56759B48185j0167q558q003p845o818n053l997m236m717m367l306k184j358j100
$$ 248185 238018 229460 221457 213612 206794 201741 197744 193508 188791 184424 181118 178934 177576 176476
56745A76476j630k484k734k128j287o21M2N77L84n41j286j292j081j258j617j712
$$ 176476 174846 172362 169628 167500 166213 165592 165634 166211 166595 166054 164768 163476 162395 161137 159520 157808
56729A57808j587j380q64M2Q29R82N67m8o39r73p03Q4P04N16m17j514k153j933
$$ 157808 156221 154841 153977 154019 154848 155830 156397 156349 155710 154737 154034 154118 154822 155338 154921 153407 151254 149321
56711A49321r43J71P67Q40P05K95n50j291j103j18O18N72K19n0n49j440k143k160
$$ 149321 148378 148549 149316 150156 150861 151156 150606 149315 148212 148094 148712 149284 149503 149453 148904 147464 145321 143161
56693A43161j837j737j771j495q54k50q0m48j062j312q51q7K86J84Q8K07L75O03
$$ 143161 141324 139587 137816 136321 135467 135217 135137 134689 133627 132315 131464 131377 131663 131847 131935 132142 132517 133120
56675A33120J003J234Q32J17j49N2L4l39n46n79j004j638j479m87n2r91k220k294
$$ 133120 134123 135357 136189 136306 136157 136209 136243 135904 135358 134779 133775 132137 130658 130171 130119 129128 126908 124614
56657A24614j342m40Q1N94J115J292J203J252J525J890K503L516M613N321N586
$$ 124614 123272 122832 122913 123507 124622 125914 127117 128369 129894 131784 134287 137803 142416 147737 153323
56642A53323N582N320M858M501M405M337M183M138M112L608K642K063K336K727
$$ 153323 158905 164225 169083 173584 177989 182326 186509 190647 194759 198367 201009 203072 205408 208135
56628B08135K386J594J083P56Q2o75p27j35J69k26p32p92o37p11r37r74p74o16
$$ 208135 210521 212115 213198 213954 214036 213361 212634 212499 212668 212442 211710 210918 210281 209570 208633 207659 206885 206269
56610B06269o89q51p37j41O67J121R22K90l63q33j067j100j153j519k161k654
$$ 206269 205580 204729 203992 203851 204518 205639 206561 206851 206488 205655 204588 203488 202335 200816 198655 196001
56594A96001k660k175j311k07P20R59N32O1l4P7J22J86L49M45L90L46L53K25L9
$$ 196001 193341 191166 189855 189648 190368 191327 191859 191920 191886 191963 192085 192271 192620 193065 193455 193801 194154 194379 194418
56575A94418J40M48L72k27o16j55Q64J758K288K497K326J910J811K385L308M214
$$ 194418 194558 195006 195378 195151 194535 194380 195244 197002 199290 201787 204113 206023 207834 210219 213527 217741
56559B17741N262O612P867Q628R136R672R683Q286N511K449K24p82q69o48o16
$$ 217741 223003 229615 237482 246110 255246 264918 274601 282887 288398 290847 291071 290289 289420 288772 288156
56544B88156p91q91r02j107j435j410j021r71j633k397k575k351k271k368k435
$$ 288156 287365 286474 285572 284465 283030 281620 280599 279628 277995 275598 273023 270672 268401 266033 263598
56529B63598k607k982l125k668k004j712j715j666j730k137k471k230j748j710
$$ 263598 260991 258009 254884 252216 250212 248500 246785 245119 243389 241252 238781 236551 234803 233093
56515B33093j978j905j486j293j368j231r52j199j968k324j705p58l90n95p44
$$ 233093 231115 229210 227724 226431 225063 223832 222880 221681 219713 217389 215684 214926 214536 213941 213197
56500B13197n80m02m56n51l47J98P38R58R50R73Q87K86o64j065l48Q63J434R95
$$ 213197 212617 212215 211759 211208 210861 211059 211797 212755 213705 214678 215565 215851 215187 214122 213774 214637 216071 217066
56482B17066J18m68m48N5N40M34k27o47k55M69O39J76k17j04K86O71J060J410
$$ 217066 217184 216716 216268 216323 216863 217297 217070 216423 216168 216637 217276 217452 217235 217131 217417 218088 219148 220558
56464B20558J422R35K57r0J23N81P91P29J036K117L219L073J590K15J44R44J402
$$ 220558 221980 222915 223172 223082 223205 223786 224577 225306 226342 228459 231678 234751 236341 236556 236700 237644 239046
56447B39046J141O83M49M57P13J149J355R55J70m61p25o94m06j6N0l95q69p84
$$ 239046 240187 240870 241319 241776 242489 243638 244993 245948 246118 245657 244932 244238 243832 243816 243866 243471 242602 241818
56429B41818j62N45J051J224R56M35J34J47O1j99l0P95J518J452R09M34m6n18
$$ 241818 241656 242201 243252 244476 245432 245867 246001 246148 246209 246010 245980 246775 248293 249745 250654 251088 251042 250524
56411B50524k34J042K005J378r0o20M7O08M43K35L48K27k41k43N39J135O37n71
$$ 250524 250290 251332 253337 254715 254625 254005 254052 254660 255103 255338 255686 255913 255672 255429 255968 257103 257740 257169
56393B57169j480j695j514j359j503j916k195k020j666j550j419p70J41N62M83
$$ 257169 255689 253994 252480 251121 249618 247702 245507 243487 241821 240271 238852 238082 238223 238785 239268
56378B39268O38J244J765K077K744L804M326L811L110L221L870M016L321K399
$$ 239268 239906 241150 242915 244992 247736 251540 255866 259677 262787 266008 269878 273894 277215 279614
56364B79614J865J722J669J553J426J280R35K95k88l18O9J42k97l96N01J675J916
$$ 279614 281479 283201 284870 286423 287849 289129 290064 290359 290071 289753 289822 289964 289667 289271 289772 291447 293363
56347B93363J242O67O21O03L31J56K79M89P93J396J872J399O1r44p44L10J434
$$ 293363 294605 295272 295893 296496 296827 296983 297262 297751 298544 299940 301812 303211 303272 302328 301584 301894 303328
56330C03328K385L211L710L628L065K414K090K295K730K734K093J486J470J550
$$ 303328 305713 308924 312634 316262 319327 321741 323831 326126 328856 331590 333683 335169 336639 338189
56316C38189R95J83O9N64O71J44k52k03k96p06o84K03J307J877J927J751J411
$$ 338189 339184 339367 339436 340000 340671 340815 340563 340360 340064 339358 338674 338877 340184 342061 343988 345739 347150
56299C47150J112J295K003K862L770M776N238M274K246O69K42R1n63j215j189
$$ 347150 348262 349557 351560 354422 358192 362968 368206 372480 374726 375395 375637 375728 375165 373950 372761
56284C72761p64m26M3Q80J606J784J801K121K430K358K337K979M052M832N069
$$ 372761 371997 371571 371614 372494 374100 375884 377685 379806 382236 384594 386931 389910 393962 398794 403863
56269D03863M956M622M219M141M544N015N125M906M533M121M144N254P174Q541
$$ 403863 408819 413441 417660 421801 426345 431360 436485 441391 445924 450045 454189 459443 466617 475158
56255D75158Q564Q191Q873J0742J2809J4510J6122J7847J9409K0701K2190K4390
$$ 475158 483722 491913 500786 511528 524337 538847 554969 572816 592225 612926 635116 659506
56243F59506K7196L0009L2459L4813L7423L9877M1204M1133M0468L9733L8155
$$ 659506 686702 716711 749170 783983 821406 861283 902487 943620 984088 1023821 1061976
56232A061976L4835L0229K5353K0034J3458O148k48n235r916j4902j9386k2768
$$ 1061976 1096811 1127040 1152393 1172427 1185885 1192033 1191785 1186550 1176634 1161732 1142346 1119578
56220A119578k5608k8237k9860k9932k9222k8563k7669k6106k4410k3281k2471
$$ 1119578 1093970 1065733 1035873 1005941 976719 948156 920487 894381 869971 846690 824219
56209H24219k1408k0133j8944j7708j6381j5368j4800j4125j3017j1942j1263
$$ 824219 802811 782678 763734 746026 729645 714277 699477 685352 672335 660393 649130
56198F49130j0645r844r138q494p325n639m311l651k856j582p45q92j137o85j73
$$ 649130 638485 628641 619503 611009 603684 598045 593734 590083 587227 585645 584900 584008 582871 582186 582013
56183E82013l06m16K93J198J308R44R42J053O18J23N40J643K389K574K786L055
$$ 582013 581707 581291 581584 582782 584090 585034 585976 587029 587647 587770 588310 589953 592342 594916 597702 600757
56167F00757K873K364K237K696L346L971M591N008N103N303O036P072P975Q716
$$ 600757 603630 605994 608231 610927 614273 618244 622835 627843 632946 638249 644285 651357 659332 668048
56153F68048R261R330R143R644J1144J2642J3309J3799J5073J6872J8415J9826
$$ 668048 677309 686639 695782 705426 716570 729212 742521 756320 771393 788265 806680 826506
56141H26506K1726K4005K6139K8110L0077L1804L3487L6463M2109N0527O1113
$$ 826506 848232 872237 898376 926486 956563 988367 1021854 1058317 1100426 1150953 1212066
56130A212066P3567Q7318J00805J12336J20983J25760J25047J18067J06248R2127
$$ 1212066 1285633 1372951 1473756 1586092 1707075 1832835 1957882 2075949 2182197 2274324
56120B274324P7772O5063N6022N1160M8273M4220L7357K7507J5098J798r305j6136
$$ 2274324 2352096 2417159 2473181 2524341 2572614 2616834 2654191 2681698 2696796 2698594 2689289 2673153
56108B673153j9683k2453k6115l1941m1911n6930p4635r0957j03324j10935j13108
$$ 2673153 2653470 2631017 2604902 2572961 2531050 2474120 2399485 2308528 2205204 2094269 1981161
56097A981161j09630j02107r2874q2837p1965o1110n1543m3259l5493k8318k2137
$$ 1981161 1871531 1769424 1676550 1593713 1521748 1460638 1409095 1365836 1330343 1302025 1279888
56086A279888j6496j1067o820m411k534J71K800L975M623O409Q537R047Q439Q999
$$ 1279888 1263392 1252325 1245505 1241094 1238560 1238731 1241531 1245506 1250129 1256538 1265075 1274122 1282561 1291560
56072A291560J1048J2760J3443J4080J4771J4546J3726J3777J4681J4950J4344
$$ 1291560 1302608 1315368 1328811 1342891 1357662 1372208 1385934 1399711 1414392 1429342 1443686
56061A443686J4179J4964J6044J7442J9659K1917K3070K3849K5652K7648K7917
$$ 1443686 1457865 1472829 1488873 1506315 1525974 1547891 1570961 1594810 1620462 1648110 1676027
56050A676027K6978K6970K7726K7107K5178K4431K5509K6317K5913K5868K6924
$$ 1676027 1703005 1729975 1757701 1784808 1809986 1834417 1859926 1886243 1912156 1938024 1964948
56039A964948K7683K7624K8304L0492L2901L4723L6731L9095M0876M2367M5124
$$ 1964948 1992631 2020255 2048559 2079051 2111952 2146675 2183406 2222501 2263377 2305744 2350868
56028B350868M8900N1480N2284N3242N5409N7641N9386O1754O4960O7617O9341
$$ 2350868 2399768 2451248 2503532 2556774 2612183 2669824 2729210 2790964 2855924 2923541 2992882
56017B992882P1268P3483P4942P6284P9367Q3723Q6959Q9150R2974R8873J04238
$$ 2992882 3064150 3137633 3212575 3288859 3368226 3451949 3538908 3628058 3721032 3819905 3924143
56006C924143J08222J13143J19891J26166J30813J35761J42234J48929J55478
$$ 3924143 4032365 4145508 4265399 4391565 4522378 4658139 4800373 4949302 5104780
55997E104780J63646J73577J82941J91341K01518K14592K28295K41408K55738
$$ 5104780 5268426 5442003 5624944 5816285 6017803 6232395 6460690 6702098 6957836
55988F957836K72283K89684L07817L28367L50778L72636L95054M22319M55185
$$ 6957836 7230119 7519803 7827620 8155987 8506765 8879401 9274455 9696774 10151959
55979A0151959M90447N28110N72158O22885O76052P31721P96016Q71692R55284
$$ 10151959 10642406 11170516 11742674 12365559 13041611 13773332 14569348 15441040 16396324
55970A6396324J046713J152907J278451J421817J584992J777285K005402K270527
$$ 16396324 17443037 18595944 19874395 21296212 22881204 24658489 26663891 28934418
55962B8934418K580720K955497L413136L966946M642223N484847O547310P884445
$$ 28934418 31515138 34470635 37883771 41850717 46492940 51977787 58525097 66409542
55954F6409542R573114J1709948J4356889J7488339K1004783K4783997K8677870
$$ 66409542 75982656 87692604 102049493 119537832 140542615 165326612 194004482
55947A94004482L2406729L5385998L6601371L4735724K8709314J8459773N383244
$$ 194004482 226411211 261797209 298398580 333134304 361843618 380303391 385686635
55940C85686635q069003j9469740k7392710l1655284l2897979l2023018k9855046
$$ 385686635 377617632 358147892 330755182 299099898 266201919 234178901 204323855
55933B04323855k7023876k3950223k0887447j7992290j5368092j3064176j1078207
$$ 204323855 177299979 153349756 132462309 114470019 99101927 86037751 74959544
55926G4959544r385318p960014o770667n775618m938546m237806l654750l165031
$$ 74959544 65574226 57614212 50843545 45067927 40129381 35891575 32236825 29071794
55918B9071794k748461k396318k101663j851483j634438j447442j288347j149759
$$ 29071794 26323333 23927015 21825352 19973869 18339431 16891989 15603642 14453883
55910A4453883j025745r17277q25399p45426o72874o08942n55108n07985m64346
$$ 14453883 13428138 12510861 11685462 10940036 10267162 9658220 9103112 8595127 8130781
55901H130781m25819l94001l65850l38374l13345k93004k75290k57451k40428
$$ 8130781 7704962 7310961 6945111 6606737 6293392 6000388 5725098 5467647 5227219
55892E227219k25733k11613j96152j80807j67331j54334j40130j25814j12378
$$ 5227219 5001486 4789873 4593721 4412914 4245583 4091249 3951119 3825305 3712927
55883C712927r7887q0712o2668m5852k9102j0475R277K8299M5857O0258O7268
$$ 3712927 3615040 3534328 3471660 3425808 3396706 3386231 3395508 3423807 3469664 3529922 3597190
55872C597190O3647N0234K9171O79l4748p3318j09850j40923j64146j76991j79115
$$ 3597190 3660837 3711071 3740242 3740921 3706173 3632855 3523005 3382082 3217936 3040945 2861830
55861B861830j73905j65105j53549j39152j23801j09829r7522q6403p7143p0027
$$ 2861830 2687925 2522820 2369271 2230119 2106318 1996489 1898967 1812564 1735421 1665394
55851A665394o3485n6465n0468m6999m4812m2002l8957l6936l5490l3627l1941
$$ 1665394 1601909 1545444 1494976 1447977 1403165 1361163 1322206 1285270 1249780 1216153 1184212
55840A184212l1132l0024k7452k4680k3501k3234k2059k0045j8493j7419j6060
$$ 1184212 1153080 1123056 1095604 1070924 1047423 1024189 1002130 982085 963592 946173 930113
55829I30113j4943j5062j5770j5626j4595j3613j2838j2175j2449j4028j5347
$$ 930113 915170 900108 884338 868712 854117 840504 827666 815491 803042 789014 773667
55818G73667j4811j3276j2607j2767j2466j1697j1300j0766q929o367m838m523
$$ 773667 758856 745580 732973 720206 707740 696043 684743 673977 665048 658681 653843 649320
55806F49320l969k582j202l03N33J288J458J261J457J945J947J463J177J100P36
$$ 649320 645351 642769 641567 641264 641797 643085 644543 645804 647261 649206 651153 652616 653793 654893 655629
55791F55629L92R97K662M524N918O633O391N133L565K330J122n15k287m168p441
$$ 655629 656021 657018 659680 664204 670122 676755 683146 688279 691844 694174 695296 694781 692494 688326 680885
55776F80885j3053j9477k3821k4870k3688k1601j9066j6268j3348r983n914j872
$$ 680885 667832 648355 624534 599664 575976 554375 535309 519041 505693 495710 489796 487924
55764D87924R48K045J409j087m992q563j0171j0075r638r388r130r216j0104j1065
$$ 487924 488872 490917 492326 491239 486247 477684 467513 457438 447800 438412 429282 420066 409962 398897
55750C98897j0963j0032r383r115q448p480p043p033o526n466m684m213l315k113
$$ 398897 387934 377902 368519 359404 350956 343476 336433 329400 322874 317408 312724 308511 305196 303083
55736C03083j556j562r43N25J570J430Q61N48j3j346k901l927m492m988n351n397
$$ 303083 301527 299965 299022 299547 301117 302547 303408 303956 303943 302597 299696 295769 291277 286289 280938 275541
55720B75541n278n145m904m518m081l548k866k305k027j637p98J10P81J815L689
$$ 275541 270263 265118 260214 255696 251615 248067 245201 242896 240869 239232 238434 238544 239325 241140 244829
55705B44829N425N724M973M525M219K522q19m109o082p210q055q095p025n771
$$ 244829 250254 255978 260951 265476 269695 272217 271398 267289 261207 253997 245942 237847 230822 225051
55691B25051n202m969m473l950l702l310k471j724j473j166k61P24J033Q39Q02
$$ 225051 219849 214880 210407 206457 202755 199445 196974 195250 193777 192611 192350 193074 194107 194946 195748
55676A95748J023J227J385J406P10j072l303m869n234m613l531k653k495k790
$$ 195748 196771 197998 199383 200789 201499 200427 197124 192255 187021 182408 178877 176224 173729 170939
55662A70939k628j636n51j59k54j63K80Q77J681K731L545L556K914K313K135K194
$$ 170939 168311 166675 166124 165965 165711 165548 165828 166705 168386 171117 174662 178218 181132 183445 185580 187774
55646A87774K228K249K452K965L609L936L710L262L001K637J506l06j898k759
$$ 187774 190002 192251 194703 197668 201277 205213 208923 212185 215186 217823 219329 219023 217125 214366
55632B14366l387m326n323n866n935n791n447m834m081l288k429j702j558j926
$$ 214366 210979 206653 201330 195464 189529 183738 178291 173457 169376 166088 163659 161957 160399 158473
55618A58473k028j360m18M3N3J80N34N88j28j433k599k892k257j535j676k605
$$ 158473 156445 155085 154667 154710 154763 154943 155477 156065 155937 154504 151905 149013 146756 145221 143545 140940
55602A40940l330l155k338j400n01J98L04k48q44r52p95q66j151j287j109o00
$$ 140940 137610 134455 132117 130717 130216 130414 130718 130470 129626 128674 127879 127013 125862 124575 123466 122866
55586A22866K81J323J927J755J219R80J191J581J961K286K562K995L911N207O253
$$ 122866 123147 124470 126397 128152 129371 130351 131542 133123 135084 137370 139932 142927 146838 152045 158298
55571A58298O717P107Q094R688J1421J2920J3772J3324J1260Q239N359L031Q50
$$ 158298 165015 172122 180216 189904 201325 214245 228017 241341 252601 260840 266199 269230 270080
55558B70080j644m449p210r404j0570j0733j0492j0363j0226r778r183q792q434
$$ 270080 268436 263987 256777 247373 236803 226070 215578 205215 194989 185211 176028 167236 158802
55545A58802p647o507n636n312n079m384l212j937q94k78j60l77n44m07j58k28
$$ 158802 151155 144648 139012 133700 128621 124237 121025 119088 118194 117916 117756 117379 116835 116428 116270 116042
55529A16042p70j413j605j184n22r6K8K08P90J715K518K721K391K256K879L710
$$ 116042 115272 113859 112254 111070 110548 110452 110480 110688 111478 113193 115711 118432 120823 123079 125958 129668
55513A29668L501J929J90n55p27j450k666l254k873k437k552k670k212j536j221
$$ 129668 133169 135098 135288 134733 134006 132556 129890 126636 123763 121326 118774 116104 113892 112356 111135
55498A11135j208j285j681k484l068k843k128j617j398j106o91m07l05k52k23
$$ 111135 109927 108642 106961 104477 101409 98566 96438 94821 93423 92317 91626 91219 90914 90662 90439
55483I0439j54J30N48O87N02N06Q33P52j96j160r79J75J055J013N35K03nk91o44
$$ 90439 90285 90415 90963 91650 92152 92658 93491 94243 94047 92887 91908 92083 93138 94151 94686 94889 94884 94593 93949
55464I3949j020j381j518j279r30p97o32N5J098J687J415P44K92J74J74K01L18
$$ 93949 92929 91548 90030 88751 87821 87024 86392 86447 87545 89232 90647 91391 91683 91857 92031 92232 92550
55447I2550N34P53P99N68K81L41P08P08r6j132j406p65N2M49M77K75k43r55j316
$$ 92550 93084 93837 94636 95204 95485 95826 96534 97242 97146 96014 94608 93843 93895 94344 94821 95096 94853 93898 92582
55428I2582r66k29K50J70k63o25o23k94J4L2p8O5N62J135J512J693J843K072K262
$$ 92582 91616 91387 91637 91807 91544 90919 90296 90002 90016 90048 89970 90035 90597 91732 93244 94937 96780 98852 101114
55409A01114K102J434O56L90O06M85l62j145r77l06l28j145j553r24j65k76q36
$$ 101114 103216 104650 105306 105696 106302 106787 106425 105280 104303 103997 103669 102524 100971 100047 99882 99606 98770
55392I8770q16l40n16j629k515k086p01M91J043J318J427R62o1q02o32j3K63K27
$$ 98770 97954 97614 97098 95469 92954 90868 90167 90658 91701 93019 94446 95408 95347 94545 93913 93900 94163 94390
55374I4390L82N16o7j181j666j026k02j56n01l18L39O58L97Q3J6n5k84l94j21
$$ 94390 94772 95288 95221 94040 92374 91348 91146 90990 90489 90171 90510 91168 91565 91648 91664 91609 91325 90931 90810
55355I0810M34R71J155P52l2n19k74L13O42P49R83J139O67k86q98q54p27j014
$$ 90810 91244 92215 93370 94122 94090 93571 93297 93610 94252 95001 95984 97123 97790 97504 96606 95752 95025 94011
55337I4011j379j216m79L90J005J251J196J012P65K95m78j151j125l93L64N25
$$ 94011 92632 91416 90937 91327 92332 93583 94779 95791 96556 96851 96373 95222 94097 93704 94068 94593
55321I4593Q4n39r70j013p02k79O9M01P35P35J63m92m21M31J203J227P68M71N04
$$ 94593 94677 94138 93168 92155 91453 91174 91243 91644 92379 93114 93277 92785 92364 92795 93998 95225 95993 96464 96968
55302I6968N19J98m25r96j113o92j24J41P5p8k67n69p65n19L9L86L63L30M76N05
$$ 96968 97487 97685 97260 96264 95151 94459 94335 94476 94551 94473 94206 93637 92872 92353 92392 92778 93141 93471 93947 94452
55282I4452J78k45l76k24p1j23l98p25p62l24L11O99R13J404K181K597K158J161
$$ 94452 94630 94385 94009 93785 93714 93591 93193 92468 91706 91382 91693 92392 93305 94709 96890 99487 101645 102806
55264A02806K38k54k85M4M38M21j91j048j625j701j404r99p71p61o41j02N59P21
$$ 102806 103044 102790 102505 102549 102987 103408 103217 102169 100544 98843 97439 96440 95669 94908 94267 94165 94724 95445
55246I5445L80K93R44J792J939J221K68k68k15J71M88M65J93l2j19k20m00n22
$$ 95445 95825 96118 97062 98854 100793 102014 102282 102014 101799 101970 102458 102923 103116 103084 102965 102745 102345 101823
55228A01823n88p82j041r93n36j09j09l92o01o83p27o10j95K77M75N30Q91J623
$$ 101823 101235 100453 99412 98419 97883 97774 97665 97273 96672 95989 95262 94652 94457 94734 95209 95739 96630 98253
55210I8253K153J889R01j17n66m63k61j76K8N88J253J546J317P49k4q51j326j053
$$ 98253 100406 102295 103196 103079 102513 102050 101789 101613 101641 102229 103482 105028 106345 107094 107070 106219 104893 103840
55192A03840l02J42p0m49l87J0J35l19r36r98k62O76R94O52M51Q41J140M96p92
$$ 103840 103538 103680 103610 103161 102774 102784 102919 102600 101664 100666 100404 101080 102074 102726 103177 104018 105158 105654 104862
55173A04862j659j671j240o12L39J291J557J181R61J066O84m61j273p42N79J413
$$ 104862 103203 101532 100292 99680 100019 101310 102867 104048 105009 106075 106759 106298 105025 104283 104862 106275
55157A06275J413J129Q29L15l80r08j142j151q62k72K32L16J79J28P2q2O0O95
$$ 106275 107688 108817 109646 109961 109581 108673 107531 106380 105518 105246 105478 105794 105973 106101 106173 106091 106151 106846
55139A06846J071K97j286k443k608k305j992j469n97J82M64M65O31J019J326J210
$$ 106846 107917 108214 106928 104485 101877 99572 97580 96111 95514 95696 96160 96625 97256 98275 99601 100811
55123A00811N23n07j206r63O8J069J425J189O48k7n73n33J90R42R08L9q68j036
$$ 100811 101334 100827 99621 98658 98726 99795 101220 102409 103057 103030 102457 101924 102114 103056 103964 104003 103135 102099
55105A02099m68K33O29Q14J011J117Q82M47K82N44Q62Q70O35M32L96N49Q49J038
$$ 102099 101631 101864 102493 103307 104318 105435 106317 106764 107046 107590 108452 109322 109957 110389 110785 111334 112183 113221
55087A13221Q10L12J13M14P93R21J033J228R23l10j788k349j796r95o18m94k15
$$ 113221 114031 114343 114456 114870 115663 116584 117617 118845 119768 119458 117670 115321 113525 112530 111912 111418 111203
55070A11203K25N67O36L81j22o50j029j318j488j215l56N31P08K31j35LK42J43
$$ 111203 111428 111995 112631 113012 112890 112240 111211 109893 108405 107190 106834 107365 108073 108304 108169 108172 108414 108557
55052A08557p6J13P93J468J571R76P9o32j017j132q22R9J159J383N39l95n07j83
$$ 108557 108481 108594 109387 110855 112426 113402 113481 112849 111832 110700 109878 109977 111136 112519 113058 112663 112156 111973
55034A11973l36r96j445j410j134n14P09J956K094R92j67l86J15O60J027J198
$$ 111973 111637 110641 109196 107786 106652 106138 106847 108803 110897 111889 111722 111336 111451 112111 113138 114336
55018A14336R69L28k86n56o23n82k88J3l57j404k060j558o29m73j013j082j75
$$ 114336 115305 115633 115347 114791 114168 113586 113298 113311 112954 111550 109490 107932 107303 106830 105817 104735 104560
55001A04560Q94J165O21m7k57J06P43J186J215J076J084J148J022Q92J150J531
$$ 104560 105454 106619 107240 107193 106936 107042 107785 108971 110186 111262 112346 113494 114516 115408 116558 118089
54985A18089J155j72j264q04Q67J955J330k20j228j411j581k029k004r97L62J199
$$ 118089 119244 119072 117808 117004 117871 119826 121156 120936 119708 118297 116716 114687 112683 111686 112048 113247
54969A13247J515J776J903J497Q06N85R53J197Q38K41o8m4J34M78R10J069P23
$$ 113247 114762 116538 118441 119938 120744 121329 122282 123479 124317 124558 124490 124446 124580 125058 125968 127037 127760
54952A27760J71j38r0J32L00J60m54j277j678j330n85J06P18J337J624J206L54
$$ 127760 127931 127793 127703 127835 128135 128295 127841 126564 124886 123556 122971 123077 123795 125132 126756 127962 128316
54935A28316j82j10J13Ql13m53l88m37o06l71O47J998K766K622K159K062K310
$$ 128316 128134 128024 128137 128145 127832 127379 126991 126554 125948 125577 126224 128222 130988 133610 135769 137831 140141
54918A40141K495K522K565K585K503K747L997O173Q185Q930Q286O959N614M297
$$ 140141 142636 145158 147723 150308 152811 155558 159555 165728 173913 182843 191129 198088 203702 207999
54904B07999K583J46k694n067o336o672o643o463n989n285m660m239l846l332
$$ 207999 210582 210728 208034 202967 196631 189959 183316 176853 170864 165579 160919 156680 152834 149502
54890A49502k652j810j114j176k095k847k376j081k96k86J05J492K775K628J355
$$ 149502 146850 145040 143926 142750 140655 137808 135432 134351 134055 133769 133874 135366 138141 140769 142124
54875A42124M57Q90K408M199N520O003N971O244P177Q106Q097O990N336L636K033
$$ 142124 142581 143471 145879 150078 155598 161601 167572 173816 180993 189099 197196 204186 209522 213158 215191
54860B15191M15j476l742n840o888o753o310o210o012n153m138l975m750n597
$$ 215191 215606 214130 210388 204548 197660 190907 184597 178387 172375 167222 163084 159109 154359 148762
54846A48762n807n264m066k529j462j547k360k702k061j136q45j243j676j532
$$ 148762 142955 137691 133625 131096 129634 128087 125727 123025 120964 119828 118983 117740 116064 114532
54832A14532p06M01J198J390J140O86J50j30L69J500K060J099o73j571j021r8
$$ 114532 113826 114227 115425 116815 117955 118641 118791 118661 119030 120530 122590 123689 123016 121445 120424 120326
54816A20326Q6l09m46o3L96N15L14Q8J16M10O84O43K88j38m26m30j6P02J254J297
$$ 120326 120412 120103 119657 119594 119990 120505 120819 120907 121023 121433 122117 122760 123048 122910 122484 122054 122038 122740 123994 125291
54796A25291J081J074J225J060L88m81j179j520j389q08j35K29L05L60M30L83
$$ 125291 126372 127446 128671 129731 130119 129638 128459 126939 125550 124742 124607 124836 125141 125501 125931 126314
54780A26314L62N89R03R70Q70R04R78P92N62Q23J470J773J472J115J122J306J591
$$ 126314 126676 127265 128168 129138 130008 130912 131890 132682 133244 134067 135537 137310 138782 139897 141019 142325 143916
54763A43916K435M065N871P116P765Q246Q721R040R067Q638P516N699L543J319
$$ 143916 146351 150416 156287 163403 171168 179414 188135 197175 206242 214880 222396 228095 231638 232957
54749B32957j065l654o147q144r347r427q226o382n068m732m585l785k564j656
$$ 232957 231892 228238 222091 213947 204600 195173 186947 180565 175497 170765 166180 162395 159831 158175
54735A58175j168p51m60o53j210j590j624j590j594j388q52j48O13J414K037K219
$$ 158175 157007 156256 155796 155143 153933 152343 150719 149129 147535 146147 145295 145147 145760 147174 149211 151430
54719A51430K160K414L168M003M518M823N280N950O473O355N385L835K265R86
$$ 151430 153590 156004 159172 163175 167693 172516 177796 183746 190219 196574 201959 205794 208059 209045
54705B09045j73j527l174n027o912q357q683p701o096m741l845l147k572k180
$$ 209045 208872 207345 204171 199144 192232 183875 175192 167491 161395 156654 152809 149662 147090 144910
54691A44910j753j133p90j255k053k022q31N57J178J058O11j10j005j466j067
$$ 144910 143157 142024 141234 139979 137926 135904 135073 135630 136808 137866 138477 138367 137362 135896 134829
54676A34829l68k57p35j007o76j51J07J66K46K91J68k6q7O3M22R33J364J398R82
$$ 134829 134461 134204 133469 132462 131786 131635 131742 131908 132154 132445 132613 132587 132500 132563 132985 133918 135282 136680 137662
54657A37662M37L0l70j036j849k315k104j389o31j49O4J96M12O97P92M56j37l70
$$ 137662 138099 138129 137759 136723 134874 132559 130455 129066 128435 128286 128350 128546 128958 129655 130447 130903 130766 130396
54639A30396J89J146J630J339Q25N91L21m60j323j314l46N53O28L27L87O57N23
$$ 130396 130585 131731 133361 134700 135525 136116 136437 135977 134654 133340 132994 133547 134175 134502 134889 135546 136069
54622A36069O0j15L8p2n71p93m65l58j183k328k451j159N33J413J235N68J2k09
$$ 136069 136129 136014 136052 135980 135409 134616 134151 133793 132610 130282 127831 126672 127205 128618 129853 130421 130433 130224
54604A30224j59kJ51L17N48P59Q15O89M70J69k11n05m57j15J67K34M11J015J732
$$ 130224 130065 130063 130214 130531 131079 131838 132653 133342 133812 133981 133770 133265 132808 132693 132860 133094 133505 134520 136252
54585A36252J806R40k33p26k49M76M90l26j092r25N5R37J156R94R03P90L12l87
$$ 136252 138058 138998 138765 138039 137790 138266 138756 138430 137338 136413 136468 137405 138561 139555 140458 141248 141560 141173
54567A41173p55n79j59K82Q45J444J553Q70p4m42l2O45J083J088N66l32q30j13
$$ 141173 140418 139839 139680 139962 140807 142251 143804 144674 144600 144158 144126 144771 145854 146942 147508 147176 146346 146233
54549A46233J408K135J150m63r20KQ63O25j31l05K60Q93J084Q08K66j63P0J123
$$ 146233 147641 149776 150926 150463 149543 149545 150408 151033 150902 150597 150857 151750 152834 153642 153908 153745 153815 154938
54531A54938K358K882K491J702J078Q55J037J367J304N37m59q70n94k99m36o88
$$ 154938 157296 160178 162669 164371 165449 166304 167341 168708 170012 170549 170090 169220 168626 168327 167891 167203
54515A67203o19l43j80r9J26M07L94o1p10j147j137q02o19r72j644j923j379l52
$$ 167203 166584 166241 166061 165962 166088 166495 166889 166828 166118 164971 163834 163032 162413 161441 159797 157874 156495 156143
54497A56143M99R00R75Q29M48m7l98m80m37m11l35l1M77R10J047J059J289J718
$$ 156143 156642 157542 158517 159346 159794 159747 159349 158869 158432 158021 157686 157655 158132 159042 160089 161148 162437 164155
54479A64155J891J524R43N93M66L41L28O15R52J039J221J993K878K765J618Q10
$$ 164155 166046 167570 168513 169106 169572 169913 170241 170856 171808 172847 174068 176061 178939 181704 183322 184132
54463A84132J260K182K336J729J160Q04K87j87M0Q69J387J126N67K17o6m92p10
$$ 184132 185392 187574 189910 191639 192799 193603 193890 193703 193743 194612 195999 197125 197692 197909 197843 197351 196641
54446A96641k28P71J388Q01q41k310k345j091j33o82k060k586j671l66J02m80
$$ 196641 196413 197184 198572 199373 198532 196222 193877 192786 192653 191971 189911 187325 185654 185288 185390 184910
54430A84910j508k196j896n27J018J577J004K90J33J28l79j233j745j572q96r6
$$ 184910 183402 181206 179310 178783 179801 181378 182382 182672 182805 182933 182554 181321 179576 178004 177108 177012
54414A77012L96K79j98l34J46O39M97r1m52l68j89j59j59j04r3j52q8K75Q61J403
$$ 177012 177408 177687 177489 177155 177301 177940 178437 178346 177894 177526 177337 177178 177019 176915 176822 176670 176582 176857 177718 179121
54394A79121J672J665J580J577J561J317Q42L80J90L64Q42J346J398P65j31o31
$$ 179121 180793 182458 184038 185615 187176 188493 189335 189715 189905 190269 191111 192457 193855 194620 194489 193858
54378A93858o58p21j096j508j696j762j696j150m6J027J422J171P04K05l29p00
$$ 193858 193200 192479 191383 189875 188179 186417 184721 183571 183525 184552 185974 187145 187849 188054 187725 187025
54362A87025o38k81j04l76q63j096p70m6M99L75k64q57j168j449j768j779j361
$$ 187025 186387 186106 186002 185626 184763 183667 182897 182851 183350 183725 183461 182604 181436 179987 178219 176440 175079
54345A75079r48q79q65n20K0M05N69M48k93j628k638k391j157j10P4k88o41p89
$$ 175079 174131 173252 172387 171867 171887 172292 172861 173309 173016 171388 168750 166359 165202 165092 165166 164878 164237 163448
54327A63448p42n53m05l96k44L10R10R14L28j78k32j68l46n99n45q1O26J220J209
$$ 163448 162706 162153 161748 161352 161108 161418 162328 163242 163570 163392 163160 162992 162646 162047 161502 161421 162047 163267 164476
54308A64476M17n26o24K99J317J540J053N35L66N05Q16J076R30K82m51q54j084
$$ 164476 164893 164367 163743 164042 165359 166899 167952 168487 168853 169358 170174 171250 172180 172462 172011 171157 170073
54291A70073j536k095k194j656j027q78j055r06j50O95P92m5j060j220k86R49
$$ 170073 168537 166442 164248 162592 161565 160687 159632 158726 158576 159271 160063 160018 158958 157738 157452 158401
54275A58401J493J120M16L4P5K56L82M14K54k22p80q16o0Q88J101L93m90q02n21
$$ 158401 159894 161014 161430 161464 161539 161795 162177 162591 162845 162623 161843 161027 160967 161855 162956 163349 162859 162057 161536
54256A61536r3Q3k16r37j494j064L11J418J223J86l85j07K11m9m95n11j02L27
$$ 161536 161443 161526 161310 160373 158879 157815 158126 159544 160767 160953 160568 160461 160672 160623 160128 159617 159515 159842
54238A59842N02K86l10q52p28nM92L09l2M7K17j45q81j309j247j007o13Q7O13
$$ 159842 160344 160630 160320 159468 158740 158735 159227 159536 159504 159551 159768 159623 158742 157433 156186 155179 154566 154653 155266
54219A55266J61j088j880j478n88j90j60K39J005J397J061L68k82p97j022p55
$$ 155266 155427 154339 152459 150981 150393 150203 150043 150282 151287 152684 153745 154113 153831 153034 152012 151257
54203A51257l06l63j016j491j193m53J50O41J276J773J644J001M03J6m07p64o51
$$ 151257 150951 150588 149572 148081 146888 146435 146585 147226 148502 150275 151919 152920 153323 153339 152932 152168 151517
54186A51517r2L94N96P67Q63M59l28o59j65M37M38J15n6l73j212j898j490l30
$$ 151517 151425 151819 152415 153182 154045 154504 154176 153517 153352 153789 154227 154342 154286 153913 152701 150803 149313 148983
54168A48983L12R0j06K02L66p5m60o2P14J025Q09N87M80K70J44M73J010J100O99
$$ 148983 149295 149385 149279 149481 149847 149772 149312 149250 149964 150989 151798 152385 152865 153135 153279 153752 154762 155862 156561
54149A56561M39N74N92J53k99l14k30n78j097j064m99k36o63j097p85l9K21k55
$$ 156561 157000 157574 158166 158319 158020 157706 157476 156898 155801 154737 154238 154002 153339 152242 151457 151418 151639 151384
54131A51384q04q37n20l26l73l92j45K94N47K80l32n96j52L66P5p84r38J68J512
$$ 151384 150580 149743 149223 148897 148524 148132 147987 148281 148828 149108 148776 148180 148028 148394 148469 147685 146747 146915 148427
54112A48427J856J282P66O73O36N47P78J307J479Q53j79q18o10L15J293J466M80
$$ 148427 150283 151565 152331 153004 153640 154187 154965 156272 157751 158604 158425 157607 156997 157312 158605 160071 160551
54095A60551j039k007j930j170k81M18P44O26K65q1m17p73q39l83J87L47M33J190
$$ 160551 159512 157505 155575 154405 154124 154542 155286 155912 156177 156096 155679 154906 154067 153684 153871 154218 154651 155841
54077A55841K392K842K036Q33J99J11K22O13J250J482R41L17M28R75J097O89L66
$$ 155841 158233 161075 163111 163944 164143 164254 164476 165089 166339 167821 168762 169079 169507 170482 171579 172268 172634
54060A72634L97N05N10L69j79j175j810j223J59R72P26K51K46L21j0k95J09R18
$$ 172634 173031 173536 174046 174415 174236 173061 171251 170028 170187 171159 171885 172136 172382 172703 172693 172398 172507 173425
54042A73425J341J306J494K130K551K233J698J930L021M007M082L592L402L646
$$ 173425 174766 176072 177566 179696 182247 184480 186178 188108 191129 195136 199218 202810 206212 209858
54028B09858L776L694M002M852N395M926L964L433L296K871K122J694J718J648
$$ 209858 213634 217328 221330 226182 231577 236503 240467 243900 247196 250067 252189 253883 255601 257249
54014B57249J359J339J594J373L84n83q46q44j285j980k298k292k467k799k873
$$ 257249 258608 259947 261541 262914 263298 262715 261869 261025 259740 257760 255462 253170 250703 247904 245031
53999B45031k797l090l672l784l128k351k086k099j783j099n50m66p06r76j170
$$ 245031 242234 239144 235472 231688 228560 226209 224123 222024 220241 219142 218592 218126 217420 216444 215274
53984B15274j302j345j233j014r15j128j508j597j160n63m34r61j593j548n35
$$ 215274 213972 212627 211394 210380 209465 208337 206829 205232 204072 203509 203075 202114 200521 198973 198438
53969A98438Q84J693J289J44o04k69Q05J928K959M150N417O364O981P772R056
$$ 198438 199322 201015 202304 202448 201844 201575 202380 204308 207267 211417 216834 223198 230179 237951 247007
53954B47007J0604J2076J3322J3995J3378J0970P071K553j743n229p586q897r467
$$ 247007 257611 269687 283009 297004 310382 321352 328423 330976 329233 324004 316418 307521 298054
53941B98054r301q094o083m372l793l682k634m38J504J890R85K1k85j75j34k55
$$ 298054 288753 280659 274576 270204 266411 262729 260095 259657 261161 263051 264036 264057 263772 263597 263463 263208
53925B63208k44K40J250K310K726K274J501J136J398J985K536K914L135L338L649
$$ 263208 262964 263204 264454 266764 269490 271764 273265 274401 275799 277784 280320 283234 286369 289707 293356
53910B93356M004M203M333M835N877O937P342P055O524N880M764L007J036n07
$$ 293356 297360 301563 305896 310731 316608 323545 330887 337942 344466 350346 355110 358117 359153 358646
53896C58646j238j111l65M47P21K06r40k440l945m919m968m446m251m818n653
$$ 358646 357408 356297 355932 356379 357100 357306 356366 353926 349981 345062 340094 335648 331397 326579 320926
53881C20926o060n905n421m731m020l739m046m317l805k691j866j689j623j272
$$ 320926 314866 308961 303540 298809 294789 291050 287004 282687 278882 276191 274325 272636 271013 269741
53867B69741j017j296j792j924j862k330l463m430m380l387k239j580j484j665
$$ 269741 268724 267428 265636 263712 261850 259520 256057 251627 247247 243860 241621 240041 238557 236892
53853B36892j764j551j105q36j112j748k080j643o43K79O52L91k82r46j115o48
$$ 236892 235128 233577 232472 231636 230524 228776 226696 225053 224410 224689 225341 225732 225450 224504 223389 222741
53837B22741o1r6q75j706j965j833j927k342k547k176j488q95m81k22l11p95j146
$$ 222741 222680 222584 221709 220003 218038 216205 214278 211936 209389 207213 205725 204830 204349 204127 203816 203021 201875
53820B01875p74N6M45J25q5N85J751K447K392K041J658J055L35N3M64J098J513
$$ 201875 201101 201157 201602 201727 201642 202227 203978 206425 208817 210858 212516 213571 213906 213959 214423 215521 217034
53803B17034J852K345K692K474J868J525J868K881M284N554O015N487M648M279
$$ 217034 218886 221231 223923 226397 228265 229790 231658 234539 238823 244377 250392 255879 260527 264806
53789B64806M263L881L013K447K909M284N884P029P313O754N950N734O454P730
$$ 264806 269069 272950 275963 278410 281319 285603 291487 298516 305829 312583 318533 324267 330721 338451
53775C38451Q812Q838O972L033j882n987q376r603j0550j1311j1541j1237j0599
$$ 338451 347263 356101 363073 366106 364224 358237 349861 340258 329708 318397 306856 295619 285020
53762B85020r503p866o250n418n331n123m273l212k664k664k564j870q25j72l48
$$ 285020 275517 267651 261401 255983 250652 245529 241256 238044 235380 232716 230152 228282 227457 227285 226937
53747B26937j010j400j206q59r14j380j812j883j580r61j21O29Q57M75n2j52K26
$$ 226937 225927 224527 223321 222462 221548 220168 218356 216473 214893 213932 213811 214440 215297 215772 215720 215568 215794
53730B15794O09O04L37J81K04J35p4n0M25R30Q61K43l20l67P3P86J514J839J521
$$ 215794 216403 217007 217344 217525 217729 217864 217790 217740 218165 219095 219956 220199 219879 219512 219585 220371 221885 223724 225245
53711B25245J033J173K004K758L009L304M139M955M845L900L095K936K869K204
$$ 225245 226278 227451 229455 232213 235222 238526 242665 247620 252465 256365 259460 262396 265265 267469
53697B67469J037O8k46r7j5k71n97o12m08m71r29j247q84l7N14J89r80k383l118
$$ 267469 268506 268574 268328 268231 268216 267945 267348 266736 266328 265857 264928 263681 262797 262760 263274 263463 262483 260100 256982
53678B56982k612j242m6M04N26Q06R77O05ok45k23n29j115j358j153j095j350
$$ 256982 254370 253128 253082 253486 254012 254818 255795 256400 256394 256149 255926 255397 254282 252924 251771 250676 249326
53661B49326j289o34j37n42j399j704j270q04p41p51m73j41j48l77l53O8N22O45
$$ 249326 248037 247403 247266 246724 245325 243621 242351 241547 240806 240055 239582 239441 239293 238916 238563 238631 239153 239798
53643B39798M88K44j07o35j056r58m44j14j90j05P12J915K581K315J583R93O83
$$ 239798 240286 240530 240423 239788 238732 237774 237330 237216 237026 236921 237633 239548 242129 244444 246027 247020 247703
53626B47703N03L77L88O30J097J624J999K251K671L335L830L709L125K619K391
$$ 247703 248206 248583 248971 249601 250698 252322 254321 256572 259243 262578 266408 270117 273242 275861 278252
53611B78252K207J913J665J530J327R44O11O19J030J659K214K420K228J909J746
$$ 278252 280459 282372 284037 285567 286894 287838 288449 289068 290098 291757 293971 296391 298619 300528 302274
53596C02274J697J519J189Q77O19L04o9l78o06q13r86j130j363j666j771j646
$$ 302274 303971 305490 306679 307556 308175 308479 308410 308032 307426 306613 305627 304497 303134 301468 299697 298051
53580B98051j807k553l193k799j595p75q47j027n63J54L30r3n85q52r31q16n19
$$ 298051 296244 293691 290498 287699 286104 285329 284482 283455 282892 283046 283376 283283 282698 281846 280915 280099 279580
53563B79580k52r2K36Q14J158Q89M79O72J414J963K027K001K088J944J494J370
$$ 279580 279328 279236 279472 280286 281444 282333 282812 283484 284898 286861 288888 290889 292977 294921 296415 297785
53547B97785K074L118L637L563L568L930M131L825L567M115N292O128O102N694
$$ 297785 299859 302977 306614 310177 313745 317675 321806 325631 329198 333313 338605 344733 350835 356529
53533C56529N619N998O529P021P399P562P667Q277R732J1514J2688J2928J2657
$$ 356529 362148 368146 374675 381696 389095 396657 404324 412601 422333 433847 446535 459463 472120
53520D72120J2353J2256J2683J3968J5835J7449J8369J9092K0335K2149K3942
$$ 472120 484473 496729 509412 523380 539215 556664 575033 594125 614460 636609 660551
53509F60551K5163K5653K5566K5146K4509K3500K1993K0288J8989J8347J8031
$$ 660551 685714 711367 736933 762079 786588 810088 832081 852369 871358 889705 907736
53498I07736J7607J6983J6350J5978J6129J6814J7537J7768J7648J7730J7948
$$ 907736 925343 942326 958676 974654 990783 1007597 1025134 1042902 1060550 1078280 1096228
53487A096228J7535J6232J4882J4290J4152J3723J3056J2690J2458J1519R579
$$ 1096228 1113763 1129995 1144877 1159167 1173319 1187042 1200098 1212788 1225246 1236765 1246344
53476A246344P341N559M219K831J061j150l631n947p654q834j0074j1783j3697
$$ 1246344 1253685 1259244 1263463 1266294 1267355 1266205 1262574 1256627 1248973 1240139 1230065 1218282 1204585
53463A204585j5306j6503j7539j8500j9134j9262j9141j9308k0063k1196k2218
$$ 1204585 1189279 1172776 1155237 1136737 1117603 1098341 1079200 1059892 1039829 1018633 996415
53452I96415k2794k2901k2601k1880k0800j9658j8817j8305j7784j6887j5594
$$ 996415 973621 950720 928119 906239 885439 865781 846964 828659 810875 793988 778394
53441G78394j4172j2836j1485r869p974o099m513l141j763l51R85K330L924N730
$$ 778394 764222 751386 739901 730032 722058 715959 711446 708305 706542 706191 707176 709506 713430 719160
53427G19160P366Q583R607J0890J2612J4516J6183J7414J8466J9829K1657K3484
$$ 719160 726526 735109 744716 755606 768218 782734 798917 816331 834797 854626 876283 899767
53415H99767K4727K5361K5876K6641K7653K8934L0653L2734L4742L6379L7840
$$ 899767 924494 949855 975731 1002372 1030025 1058959 1089612 1122346 1157088 1193467 1231307
53404A231307L9468M1340M3361M5542M7844M9946N1404N2023N1976N1660N1493
$$ 1231307 1270775 1312115 1355476 1401018 1448862 1498808 1550212 1602235 1654211 1705871 1757364
53393A757364N1708N2169N2464N2228N1354M9949M8221M6359M4375M2169L9779
$$ 1757364 1809072 1861241 1913705 1965933 2017287 2067236 2115457 2161816 2206191 2248360 2288139
53382B288139L7366L4724L1239K6719K1922J7684J3811R598N153J267j970n454
$$ 2288139 2325505 2360229 2391468 2418187 2440109 2457793 2471604 2481202 2486355 2487622 2485652 2480198
53370B480198r745j4508j9522k5245l1769l8148m3478m7975n2204n5940n8538
$$ 2480198 2470453 2455945 2436423 2411178 2379409 2341261 2297783 2249808 2197604 2141664 2083126
53359B083126n9948o0589o0642o0198n9687n9332n8565n6782n4383n2266n0589
$$ 2083126 2023178 1962589 1901947 1841749 1782062 1722730 1664165 1607383 1553000 1500734 1450145
53348A450145m8866m7073m5727m4853m3798m2181m0362l8767l7385l5991l4328
$$ 1450145 1401279 1354206 1308479 1263626 1219828 1177647 1137285 1098518 1061133 1025142 990814
53337I90814l2041k8996k5783k3332k1837k0556j8783j6622j4597j2965j1589
$$ 990814 958773 929777 903994 880662 858825 838269 819486 802864 788267 775302 763713
53326G63713j0288r020p884o929n961m705l233j916p74O65K533M191N123N808
$$ 763713 753425 744405 736521 729592 723631 718926 715693 713777 713003 713668 716201 720392 725515 731323
53312G31323O979Q476R617J0422J1515J2983J4226J4999J5787J7042J8771K0878
$$ 731323 738302 746778 756395 766817 778332 791315 805541 820540 836327 853369 872140 893018
53300H93018K3158K4962K5673K5674K5996K6933K7824K8312K8881K9763L0289
$$ 893018 916176 941138 966811 992485 1018481 1045414 1073238 1101550 1130431 1160194 1190483
53289A190483K9785K8443K6772K4903K2843K0760J8556J5785J2503R538P327N177
$$ 1190483 1220268 1248711 1275483 1300386 1323229 1343989 1362545 1378330 1390833 1400371 1407698 1412875
53277A412875K262j180m341o980r283j1145j2398j3520j5247j7539j9648k1240
$$ 1412875 1415137 1413957 1409616 1402636 1393353 1382208 1369810 1356290 1341043 1323504 1303856 1282616
53265A282616k2747k4595k6598k8258k9265k9667k9882l0478l1619l2771l3282
$$ 1282616 1259869 1235274 1208676 1180418 1151153 1121486 1091604 1061126 1029507 996736 963454
53254I63454l3154l2885l2684l2273l1435l0310k9060k7632k5954k4195k2717
$$ 963454 930300 897415 864731 832458 801023 770713 741653 714021 688067 663872 641155
53243F41155k1889k1825k2166k2267k1847k1212k0632j9725j7995j5757j3983
$$ 641155 619266 597441 575275 553008 531161 509949 489317 469592 451597 435840 421857
53232D21857j3105j2541j1493r844q051o591n741n550n745n837n629n433n550
$$ 421857 408752 396211 384718 374874 366823 360232 354491 348941 343196 337359 331730 326297 320747
53219C20747n744n548m939m315l881l471l042k952l415l995m025l414k702k319
$$ 320747 315003 309455 304516 300201 296320 292849 289807 286855 283440 279445 275420 272006 269304 266985
53205B66985k185k117k209k505k635k159j259o54p55j179j258q74n72q40j424
$$ 266985 264800 262683 260474 257969 255334 253175 251916 251262 250507 249328 248070 247196 246624 245784 244360
53190B44360j554q72M9K86l82j275j677j582j411j323j112o16M5N66O08M0p86
$$ 244360 242806 241934 241983 242269 241887 240612 238935 237353 235942 234619 233507 232891 232936 233502 234110 234150 233364
53173B33364j200r48n26n26q65j031q78p48q45r51p66k33M42Q53O38k5m13j30
$$ 233364 232164 231216 230690 230164 229299 228268 227390 226642 225797 224846 224080 223847 224289 225142 225780 225755 225342 225212
53155B25212K59N3m46l36M28R38P67N65Q50J082N91k33m58J9M63M62L89N96P85
$$ 225212 225471 225524 225078 224742 225170 226108 226875 227440 228290 229372 229963 229730 229272 229291 229754 230216 230605 231201 231986
53136B31986N07j17n46n88n95q30r75o31j07j87j014j822k001j871j879j669p85
$$ 231986 232493 232376 231830 231242 230647 229817 228842 228211 228104 227917 226903 225081 223080 221209 219330 217661 216876
53119B16876J12j74j496k223j264N32J516J094l4q80r10j64P82J188Q36K56M0
$$ 216876 216988 216814 215318 213095 211831 212363 213879 214973 214939 214059 213149 212985 213767 214955 215791 216047 216087
53102B16087K28M29K76l61j241j706j318o49p68j732k314j704p31o69j400j651
$$ 216087 216315 216744 217020 216659 215418 213712 212394 211745 210977 209245 206931 205227 204496 203827 202427 200776
53086B00776q07L86R15O25L3l69m15j71K22N87O81K77n45j240j265p14j91QQ0
$$ 200776 199969 200355 201270 201895 201928 201559 201144 200973 201195 201782 202463 202740 202195 200955 199690 198976 198785 198793 198873
53067A98873J21j35o89r97o53JL58K04l31j047j571j447p01N7M27N83O10J95o16
$$ 198873 198994 198859 198170 197173 196520 196521 196879 197083 196752 195705 194134 192687 191986 192043 192470 193053 193663 193858 193242
53048A93242j020n62R1J62L6N83J646K184J771R97M61J63q5l74q05j308j437r60
$$ 193242 192222 191660 191751 191913 191949 192532 194178 196362 198133 199130 199591 199754 199669 199295 198490 197182 195745 194785
53030A94785m60o46j220j235n46J5k6j71N5L48K69j1o6J62M89Q24J081R95M03
$$ 194785 194325 193679 192459 191224 190678 190693 190667 190496 190551 190899 191168 191157 191091 191253 191742 192566 193647 194642 195045
53011A95045m76j170j207m11P83J385P73m67j158r39m71k86j86k0k03r44j614
$$ 195045 194569 193399 192192 191781 192564 193949 194722 194255 193097 192158 191687 191401 191215 191195 190992 190048 188434
52994A88434j470o66NJ10j70n08o58m20J03L11l32j440j922j182J74J016Q63J71
$$ 188434 186964 186298 186303 186413 186243 185735 185077 184657 184760 185071 184739 183299 181377 180195 180369 181385 182248 182419
52976A82419l25l08N6M82P94R58J038J091J058Q70P07R81J723K226J719M68l69
$$ 182419 182094 181786 181842 182324 183118 184076 185114 186205 187263 188133 188840 189821 191544 193770 195489 195957 195588
52959A95588q0P87J226R50M29J16P4J51J48r3m48n89m61m54q43j398j765j970
$$ 195588 195508 196295 197521 198471 198900 199016 199090 199241 199389 199296 198848 198259 197798 197344 196501 195103 193338 191368
52941A91368k151k163j893j625j662j821j724j350r24m87m4J54k5k81l35l67m98
$$ 191368 189217 187054 185161 183536 181874 180053 178329 176979 176055 175568 175524 175678 175653 175372 175037 174670 174172
52924A74172k97M79J130Q30r5n74l37r6k94n64n21k80J8M07P28O89L68J34l5l62
$$ 174172 173875 174354 175484 176314 176219 175645 175308 175212 174918 174354 173833 173553 173571 173978 174706 175395 175763 175897 175862 175500
52904A75500n37K9J096J568Q79l47j202j359r15p4O24N83o3m93l12L0J77M10R33
$$ 175500 174963 174992 176088 177656 178535 178188 176986 175627 174712 174638 175262 175845 175782 175289 174977 175007 175184 175594 176527
52885A76527J323J197Q10N31K78q6k72k7L56M32K52K36O22J188J376P38m35j090
$$ 176527 177850 179047 179857 180388 180666 180580 180308 180281 180637 181069 181321 181557 182179 183367 184743 185481 185046 183956
52867A83956o20J54or47j295m50P85J696K497L220L081J814N29L16Q11J046R04
$$ 183956 183336 183490 183484 182537 181242 180792 181577 183273 185770 188990 192071 193885 194414 194730 195541 196587 197491
52850A97491Q04O75K24k40l05l11q16j579j858j485q88m04k25n72j243j492j058
$$ 197491 198295 198970 199194 198954 198649 198338 197522 195943 194085 192600 191712 191308 191083 190511 189268 187776 186718
52833A86718p65j277j908j658q47n66q92q97k62L78O34Q30J188J548J904K288
$$ 186718 185953 184676 182768 181110 180263 179697 178805 177908 177646 178024 178658 179488 180676 182224 184128 186416
52817A86416K198J103m56j340j416j620k219k243j072M75J248J176R47R49J114
$$ 186416 188614 189717 189261 187921 186505 184885 182666 180423 179351 179826 181074 182250 183197 184146 185260
52802A85260J391J756K084K283K282J749L17j636l005l071k219j306p34m70n02
$$ 185260 186651 188407 190491 192774 195056 196805 197122 195486 192481 189410 187191 185885 185151 184681 184179
52787A84179q65j427j960k297k285j823j076m25j02lJ05L95Q35J036N01o07j266
$$ 184179 183314 181887 179927 177630 175345 173522 172446 172021 171919 171916 172021 172416 173251 174287 174788 174181 172915
52770A72915p52L28P87M90L20P34J199J216R00L97l70j046r00N6Q24P38L05J84
$$ 172915 172163 172491 173278 173768 174088 174822 176021 177237 178137 178534 178164 177118 176218 176274 177098 177836 178141 178325
52752A78325K24O4q3m8l22j174j756j146J78R44Q94R27J457J789J333N24K4k32
$$ 178325 178549 178613 178530 178482 178160 176986 175230 174084 174262 175206 176100 177027 178484 180273 181606 182130 182154 181922
52734A81922o02q87m77P45K155L009L038K487J765J170P74M90K33L4L5L15P10
$$ 181922 181320 180433 179956 180701 182856 185865 188903 191390 193155 194325 195099 195589 195822 195856 195891 196206 196916
52717A96916Q34L70o40j749k387k152j145q7J29o81j730k157j954j650j379q66
$$ 196916 197750 198120 197480 195731 193344 191192 190047 189960 190089 189408 187678 185521 183567 181917 180538 179672
52701A79672k25j5l67p51q13q02r22r06o56o03r13r44j53Q97J182N89l4r2K18
$$ 179672 179447 179432 179065 178314 177501 176699 175777 174871 174215 173612 172699 171755 171602 172499 173681 174270 174236 174144 174362
52682A74362N09O92Q12Q53Q51Q80R25J023J361J895K075J411K38n96p52o33o43
$$ 174362 174871 175563 176375 177228 178079 178959 179884 180907 182268 184163 186238 187649 187887 187291 186539 185906 185263
52665A85263p14o06k22M24J168J518J076J64l66j30L65M99L11K41M61P45R14J123
$$ 185263 184549 183943 183721 184145 185313 186831 187907 188071 187705 187575 187940 188439 188750 188991 189452 190197 191111 192234
52647A92234J706K755L809M115L388K173J103M4j462l053l655k922j855j480j606
$$ 192234 193940 196695 200504 204619 208007 210180 211283 211327 209865 206812 203157 200235 198380 196900 195294
52632A95294j410q52o33r54j122n35N15J279J489J576K120L221M303M520L406
$$ 195294 193884 193032 192399 191445 190323 189788 190303 191582 193071 194647 196767 199988 204291 208811 212217
52617B12217J303r06k403k866k497j831j392j336j463j583j771k010j881r23O44
$$ 212217 213520 212614 210211 207345 204848 203017 201625 200289 198826 197243 195472 193462 191581 190658 191302
52602A91302J965K372J990J384Q70L51k88q09p61K3J101J714J507Q53L47N3l93
$$ 191302 193267 195639 197629 199013 199883 200234 199946 199137 198376 198399 199500 201214 202721 203574 203921 203974 203581
52585B03581j017j293q94k54p8m15o70m38J30P37J321J750J604P13k85m49L02
$$ 203581 202564 201271 200377 200123 200045 199630 198960 198522 198652 199389 200710 202460 204064 204777 204492 204043 204345
52568B04345J024Q20j52j037j276r72n16k64m48j008j433j218n46j53m09q47q42
$$ 204345 205369 206189 206037 205000 203724 202752 202236 201972 201524 200516 199083 197865 197319 197166 196757 195910 195068
52551A95068m07m0Qn4L4K36K34k33r62j227m32J021J986J902J390J148Q06l56
$$ 195068 194661 194621 194629 194575 194609 194845 195079 194846 193884 192657 192225 193246 195232 197134 198524 199672 200478 200122
52533B00122j932k543j511M11K002K583J989M48j159j678q59L17Q56P98O87O31
$$ 200122 198190 195647 194136 194547 196549 199132 201121 201569 200410 198732 197873 198190 199046 199844 200531 201162
52517B01162M32J70J5k24p28j120q30J95J525K707L352L207K631K463K862K862
$$ 201162 201594 201764 201779 201555 200827 199707 198877 199072 200597 203304 206656 209863 212494 214957 217819 220681
52501B20681J842P97J030K032K047O36p33q72l06m3j80l84p64j397j790j628j397
$$ 220681 222523 223320 224350 226382 228429 229065 228332 227460 227154 227111 226931 226547 225783 224386 222596 220968 219571
52484B19571j528j506o40P17J573J563J060M02k69o08l72O0J35L1M18J391K292
$$ 219571 218043 216537 215897 216614 218187 219750 220810 221212 220943 220335 219963 220023 220158 220189 220607 221998 224290
52467B24290K563K223J580R35N91N47L50k08m52M15J930K624J787K60p81j143
$$ 224290 226853 229076 230656 231591 232182 232729 233079 232871 232419 232834 234764 237388 239175 239435 238654 237511
52451B37511j314j514j604j578j623j751j780j611j368j282j550k133k650k651
$$ 237511 236197 234683 233079 231501 229878 228127 226347 224736 223368 222086 220536 218403 215753 213102
52437B13102k082j357r35r43j231j546j635j378q95l73J59P14J063R54N44L00
$$ 213102 211020 209663 208728 207785 206554 205008 203373 201995 201100 200727 200886 201600 202663 203617 204161 204461
52421B04461L91M69J95k98n37j40R56K369L368L339K379J236N75M25M22L73N15
$$ 204461 204852 205321 205516 205218 204681 204541 205497 207866 211234 214573 216952 218188 218763 219188 219610 219983 220498
52404B20498J237K572L993M847N078N256N771O326O455O063N100L170L07k281
$$ 220498 221735 224307 228300 233147 238225 243481 249252 255578 262033 268096 273196 276366 276673 274392
52390B74392l205k632k148k762l886m509m419l850k781j295l1M49L58K15Q2j62
$$ 274392 271187 268555 266407 263645 259759 255250 250831 246981 244200 242905 242874 243323 243681 243896 243978 243816
52374B43816k46R4M73L16j77k69K27P65R88J138J447J723J783J800J892J793J212
$$ 243816 243570 243664 244137 244453 244276 244007 244234 244999 245987 247125 248572 250295 252078 253878 255770 257563 258775
52357B58775K53p53j624k201k161j384m28j74q45j635j634q90k59l07o54n85J51
$$ 258775 259028 258275 256651 254450 252289 250905 250477 250303 249458 247823 246189 245299 245040 244733 244079 243494 243645
52340B43645J213K115K491K252J749J531J661J585J054P85J547K937L845M029
$$ 243645 244858 246973 249464 251716 253465 254996 256657 258242 259296 260081 261628 264565 268410 272439
52326B72439M257M847N127M732M366M684N261N420N343N528N701N271M443L901
$$ 272439 276696 281543 286670 291402 295768 300452 305713 311133 316476 322004 327705 332976 337419 341320
52312C41320L625L034K129J596J659J832J866K011K192J845R61M24P78J411J580
$$ 341320 344945 347979 350108 351704 353363 355195 357061 359072 361264 363109 364070 364494 365272 366683 368263
52297C68263J607K236L288L837L555L054K826K558J764N51n66j304j714j807j441
$$ 368263 369870 372106 375394 379231 382786 385840 388666 391224 392988 393539 392973 391669 389955 388148 386707
52282C86707o90j0J07l27p90q17m79j66LL58J145K113K765K952K987L144L293
$$ 386707 386017 386007 386114 385787 384997 384180 383701 383535 383538 383896 385041 387154 389919 392871 395858 399002 402295
52265D02295L158K828K718L059L619M084M432M665M407L274J713Q88J445K684
$$ 402295 405453 408281 410999 414058 417677 421761 426193 430858 435265 438539 440252 441140 442585 445269
52251D45269L404L284K992L131L623M116M437M473M050L206K382K025K119K259
$$ 445269 448673 451957 454949 458080 461703 465819 470256 474729 478779 481985 484367 486392 488511 490770
52237D90770K094J592R35L62J1q4J04O38J441K176K573K794L177L672L930L979
$$ 490770 492864 494456 495391 495753 495764 495680 495784 496422 497863 500039 502612 505406 508583 512255 516185 520164
52221E20164M284M881M978L936K307J338J527K267K879L376M052M797N261N380
$$ 520164 524448 529329 534307 538243 540550 541888 543415 545682 548561 551937 555989 560786 566047 571427
52207E71427N307N052M503L853L593L966M642N030M857M302L651K951K110J256
$$ 571427 576734 581786 586289 590142 593735 597701 602343 607373 612230 616532 620183 623134 625244 626500
52193F26500Q20J102J823K359K389K161J995J843J533J258J411J983K486K506
$$ 626500 627320 628422 630245 632604 634993 637154 639149 640992 642525 643783 645194 647177 649663 652169
52179F52169K083J455P21j08r70j842k791l806m643n091n217n285n447n578n321
$$ 652169 654252 655707 656428 656320 655350 653508 650717 646911 642268 637177 631960 626675 621228 615650 610329
52164F10329m354k780j228l38o1J77O19R35R79J277K263L436L851L281K293J309
$$ 610329 605975 603195 601967 601629 601568 601745 602364 603299 604278 605555 607818 611254 615105 618386 620679 621988
52148F21988K03j059j923j703l15J567K962L258K691K081J852J519N32o84j164
$$ 621988 622191 621132 619209 617506 617191 618758 621720 624978 627669 629750 631602 633121 633653 632969 631805
52133F31805q29p13j540k760l352l048k262j279pJ600L349M978O301P270Q082
$$ 631805 630976 630263 628723 625963 622611 619563 617301 616022 616015 617615 620964 625942 632243 639513 647595
52118F47595R092J0419J1725J2558J2775J2607J2341J2003J1256R657P224M601
$$ 647595 656687 667106 678831 691389 704164 716771 729112 741115 752371 762028 769252 773853
52106G73853K399N30j406l328m803n840o722p091o190m195k370j417o09P99K315
$$ 773853 776252 776782 775376 772048 767245 761405 754683 747592 741402 737207 734837 733420 732811 733610 735925
52091G35925L208L932N313O861P219O119M665L608K500P95j226l040m552n690
$$ 735925 739133 743065 748378 755239 762458 768577 773242 776850 779350 780145 778919 775879 771327 765637
52077G65637o042n436m369l389k475j449o38n54j171j955k425k379j746o99K18
$$ 765637 759595 754159 749790 746401 743926 742477 741839 741285 740114 738159 735734 733355 731609 730910 731128
52062G31128N29M20N45J117J551J195J49r20j594k042k482k795k818k723k741
$$ 731128 731657 732077 732622 733739 735290 736485 736634 735714 734120 732078 729596 726801 723983 721260 718519
52047G18519k758k574k409k615k973k873k301k032k538l264l401k898k295j924
$$ 718519 715761 713187 710778 708163 705190 702317 700016 697984 695446 692182 688781 685883 683588 681664
52033F81664j730j518r87J93J850L276M106M765N606O162N990N667O028O775O978
$$ 681664 679934 678416 677429 677622 679472 682748 686854 691619 697225 703387 709377 715044 721072 727847 734825
52018G34825O699O859P428P121N373L485L059M044N149N589N599N514N173M236
$$ 734825 741524 748383 755811 762932 768305 771790 774849 778893 784042 789631 795230 800744 805917 810153
52004H10153K547J21k879o006q590j0103j0542j0533j0924j2061j3513j4706j5669
$$ 810153 812700 812821 809942 803936 795346 785243 774701 764168 753244 741183 727670 712964 697295
51991F97295j6823j8226j9405j9856j9263j7401j4463j1409r279q070o946n612
$$ 697295 680472 662246 642841 622985 603722 586321 571858 560449 551170 543100 536154 530542
51979E30542m702m598m749m615m488m855n541o140o687p257p388o714n779n454
$$ 530542 525840 521242 516493 511878 507390 502535 496994 490854 484167 476910 469522 462808 457029 451575
51965D51575n692n620m724l256j562K71K023L332M281N465P263R401J1354J2689
$$ 451575 445883 440263 435539 432283 430721 430992 433015 436347 440628 446093 453356 462757 474111 486800
51951D86800J2868J1382Q507N517L504K192M10k232m707n797n420m379l082j197
$$ 486800 499668 511050 519557 525074 528578 530770 531180 528948 524241 518444 513024 508645 505563 504366
51937E04366J458M263O425P835R053J0530J2255J3887J5011J5273J4568J2951
$$ 504366 505824 510087 516512 524347 533400 543930 556185 570072 585083 600356 614924 627875
51925F27875J0300O401J627k993o814j0310j4047j7433j9286j9514j9203j9026
$$ 627875 638175 644576 646203 643210 636396 626086 612039 594606 575320 555806 536603 517577
51913E17577j8560j7282j5390j3320j1349r923r469r408q403o113l810k587j909
$$ 517577 499017 481735 466345 453025 441676 431753 422284 412876 404473 398360 394550 391963 390054
51900C90054p65O15J375J764K896N060P381R130J0333J1059J1027J0107Q377N660
$$ 390054 389289 389904 391279 393043 395939 400999 408380 417510 427843 438902 449929 460036 468413 474073
51886D74073J746k754o530q774r714r823r243q086o672n082l072p07J467L102
$$ 474073 475819 473065 466535 457761 448047 438224 428981 420895 414223 409141 406069 405362 406829 409931
51872D09931M437N745O951Q121R636J1482J2760J2585J1201R647Q505P512O213
$$ 409931 414368 420113 427064 435185 444821 456303 469063 481648 492849 502496 511001 518513 524726
51859E24726M496K399Jk363m059m680m372l422j720J063M621P682Q734P133L421
$$ 524726 529222 531621 531622 529259 525200 520520 516148 512726 511006 512069 516690 524372 533106 540239 543660
51844E43660j227n670r058j1016j1790j2013j2073j1902j1439j0970j0685j0218
$$ 543660 542433 536763 527705 516689 504899 492886 480813 468911 457472 446502 435817 425599
51832D25599r096p550o349n764n142l759j731J53J347J936K248K366K225J903
$$ 425599 416503 408953 402604 396840 391698 387939 386208 386361 387708 389644 391892 394258 396483 398386
51818C98386J538R45k32j816k960l065k583k358k374j825l89J321K757M058N387
$$ 398386 399924 400869 400637 398821 395861 392796 390213 387855 385481 383656 383267 384588 387345 391403 396790
51803C96790O399O864P052O919N663K926j94k229l036l486l898l890l513l377
$$ 396790 403189 410053 417105 424024 429687 432613 432419 430190 427154 423668 419770 415880 412367 408990
51789D08990l594l716l789m365n313n691n177m513m106l298j686j63K94R5K94
$$ 408990 405396 401680 397891 393526 388213 382522 377345 372832 368726 365428 363742 363579 363873 363968 364262
51774C64262R40J143N66k01o33q13q74n90K49J400K354K778K892L414M959P215
$$ 364262 365202 366345 366911 366710 366077 365264 364390 363800 364049 365449 367803 370581 373473 376887 381846 389061
51758C89061R067R788R793R844R912R341P822N577K769n66m017o821q589r544
$$ 389061 398128 407916 417709 427553 437465 446806 454628 460205 462974 462408 458391 451570 442981 433437
51744D33437r975r850r069p797o365n087m163l495k621j090J103L638O307R074
$$ 433437 423462 413612 404543 396746 390381 385294 381131 377636 375015 373925 375028 378666 384973 394047
51730C94047J1799J4277J6330J7517J6978J4241J0183O601M675M315N009O505
$$ 394047 405846 420123 436453 453970 470948 485189 495372 501973 506648 510963 515972 522477
51718E22477Q312R225P983M339p91n902r488j0603r419p118m897l337k785l731
$$ 522477 530789 540014 547997 552336 551545 545643 536155 525552 516133 509015 504118 500781 497996 494265
51704D94265o163q936j0586j0691r820q306n795k253J316L536L801K563Q07n55
$$ 494265 488102 479166 468580 457889 448069 439763 433968 431715 433031 436567 440368 442931 443738 443183
51690D43183j113j044p13j17J034K725M353N146M601K633k42k878m262m559m912
$$ 443183 442070 441026 440313 440196 441230 443955 448308 453454 458055 460688 460446 457568 453306 448747 443835
51675D43835n913o760o338m603k374j67K068M389O698R030J1323J3028J3673J3845
$$ 443835 437922 431162 424824 420221 417847 417680 419748 424137 430835 439865 451188 464216 477889 491734
51661D91734J4789J6766J8462J8391J6286J2684P691R65p089j4772k0070k2069
$$ 491734 506523 523289 541751 560142 576428 589112 596803 597768 590679 575907 555837 533768
51649E33768k1357j9224j6550j3515j0089o491l011J92K741L699K258j178n059
$$ 533768 512411 493187 476637 463122 453033 446542 443531 443723 446464 450163 452421 451243 446184
51636D46184q033r823j0748j0919j0310r288q502q331q564q597p887o445m944
$$ 446184 438151 428328 417580 406661 396351 387063 378561 370230 361666 353069 345182 338737 333793
51623C33793m045l579k810j504l01K39L13L17J34m47j006r05k27K48K4n22n91
$$ 333793 329748 326169 323359 321855 321554 321793 322106 322423 322557 322110 321104 320199 319972 320220 320244 319722 319131
51606C19131K84J827L076L046J634k44j555k045k042j772j277o94j03P23K014
$$ 319131 319415 321242 324318 327364 328998 328754 327199 325154 323112 321340 320063 319369 319266 319989 322003
51591C22003L620N247O872Q504R817J0464J0533J0182R126P041M311J768j93j604
$$ 322003 325623 330870 337742 346246 356063 366527 377060 387242 396368 403409 407720 409488 409295 407691
51577D07691k258j722o0K163M543O949R135J0973J3014J5897J9046K0931K0949
$$ 407691 405433 403711 403651 405814 410357 417306 426441 437414 450428 466325 485371 506302 527251
51564E27251K0297K0573K2095K3961K5082K4769K3028K0965K0403K2512K6917
$$ 527251 547548 568121 590216 614177 639259 664028 687056 708021 728424 750936 777853
51553G77853L2391L8008M3214M7276M9173M7871M2577L3203K0899P682m911j6511
$$ 777853 810244 848252 891466 938742 987915 1035786 1078363 1111566 1132465 1140147 1135236 1118725
51541A118725k7089l6141m3109m8084n1351n2739n2025m9659m6402m2531l8080
$$ 1118725 1091636 1055495 1012386 964302 912951 860212 808187 758528 712126 669595 631515
51530F31515l3557k9644k6294k2900j9312j5981j3184j0766q720p329o543n857
$$ 631515 597958 568314 542020 519120 499808 483827 470643 459877 451157 443828 437285 431428
51518D31428m990m195l743l537l440l423l309k788j968j396j270j154p83o32j258
$$ 431428 426438 422243 418500 414963 411523 408100 404791 402003 400035 398639 397369 396215 395432 394800 393542
51503C93542k424l401l926m305m695m797m357l577k885k559k671l142l702l915
$$ 393542 391118 387717 383791 379486 374791 369994 365637 362060 359175 356616 353945 350803 347101 343186
51489C43186l421k197n85Q89J773J979J877J968K375K696K445J589N67j73n14
$$ 343186 339765 337568 336983 337872 339645 341624 343501 345469 347844 350540 352985 354574 355141 354968 354454
51474C54454o07o22o58p67r33j084j221j495k001k557k842k775k511k179j790
$$ 354454 353847 353225 352567 351800 350867 349783 348562 347067 345066 342509 339667 336892 334381 332202 330412
51459C30412j426j270j273j113o07L5N32R16J339J755K048K382L005L690L829
$$ 330412 328986 327716 326443 325330 324723 324758 325290 326206 327545 329300 331348 333730 336735 340425 344254
51444C44254L228K530K650L872N686P408Q876J0589J3156J6430J9079J9288J6199
$$ 344254 347482 350012 352662 356534 362220 369628 378504 389093 402249 418679 437758 457046 473245
51431D73245J0821N417J893O61Q18J197J132M19j194m086q156j2263j4688j4473
$$ 473245 484066 489483 491376 492037 492855 494052 495184 495603 494409 490323 482167 469904 455216 440743
51417D40743j2268r660p717o406n319m437l880l294k065k35J347J921J650J311
$$ 440743 428475 418815 411098 404692 399373 394936 391056 387762 385697 385462 386809 388730 390380 391691
51403C91691J426J947K577L050L146K822K384K313K723L177L176K755K434K574
$$ 391691 393117 395064 397641 400691 403837 406659 409043 411356 414079 417256 420432 423187 425621 428195
51389D28195K905K884K395J961K133K937M135N789Q167J1160J4328J7677K1877
$$ 428195 431100 433984 436379 438340 440473 443410 447545 453334 461501 472661 486989 504666 526543
51376E26543K7432L3958M0592M6782N2351N7173O1134O4096O5358O3515N7519
$$ 526543 553975 587933 628525 675307 727658 784831 845965 910061 975419 1038934 1096453
51365A096453M7843L6013K3159R604m260j7531k9442l9759m8300n4623n8547o0422
$$ 1096453 1144296 1180309 1203468 1213072 1208812 1191281 1161839 1122080 1073780 1019157 960610 900188
51353I00188o0528n8670n4764m9488m3883l8547l3515k8771k4497k0989j8415
$$ 900188 839660 780990 726226 676738 632855 594308 560793 532022 507525 486536 468121
51342D68121j6569j4758j2411r915q410q362q813q516p390o311n740n307m695
$$ 468121 451552 436794 424383 414468 406058 397696 388883 380367 372977 366666 360926 355619 350924
51329C50924m170m000l958l736l507l545l593l049j804m95K38M00M15M83N38O73
$$ 350924 346754 342754 338796 335060 331553 328008 324415 321366 319562 319067 319305 319705 320120 320603 321141 321814
51313C21814J102J667J820J355P83O23P04N47J61l6J21N03J129K084L082L625
$$ 321814 322916 324583 326403 327758 328541 329164 329868 330415 330576 330540 330661 331164 332293 334377 337459 341084
51297C41084L631L320K666J550L53l32o65j438k809m009m490m612m796m795m280
$$ 341084 344715 348035 350701 352251 352604 352272 351607 350169 347360 343351 338861 334249 329453 324658 320378
51282C20378l435k507j358m1Q26R11Q47J388K368L117L390L279K698J706R51R50
$$ 320378 316943 314436 313078 313037 313863 314774 315621 317009 319377 322494 325884 329163 331861 333567 334518 335468
51266C35468J288J260J002J152J733K214K512L009L679M092M194M230L948K778
$$ 335468 336756 338016 339018 340170 341903 344117 346629 349638 353317 357409 361603 365833 369781 372559
51252C72559Q82q30j910k748l655m401m934n619o363o317n054l370k330k010j758
$$ 372559 373441 372611 370701 367953 364298 359897 354963 349344 342981 336664 331610 328240 325910 323900 322142
51237C22142j355j129j172j109p38l77m08o64n25L15J346J624Q10m01j030q47
$$ 322142 320787 319658 318486 317377 316639 316262 315854 315190 314665 314980 316326 317950 318760 318359 317329 316482
51221C16482l43N9L80P53J186J677K215K613K665K427K127J791J339R09O84N18
$$ 316482 316139 316198 316578 317331 318517 320194 322409 325022 327687 330114 332241 334032 335371 336280 336964 337482
51205C37482K28J24O58J604K237K396K640L210L656L746L944M490M681L803K287
$$ 337482 337710 337834 338492 340096 342333 344729 347369 350579 354235 357981 361925 366415 371096 374899 377186
51190C77186J167P15L30l06q03q58q34j197j775j992j609r36l31J64N34N09j19
$$ 377186 378353 379068 379398 379092 378289 377431 376597 375400 373625 371633 370024 369088 368757 368921 369455 369964 369845
51173C69845r48j229q37n56j109k173k843k809k548k398k037j061L60J596K121
$$ 369845 368897 367668 366831 366275 365166 362993 360150 357341 354793 352395 350358 349297 349657 351253 353374
51158C53374J881J284Q95R12R85O83J0p66j516k166k432k170j765j624j538j142
$$ 353374 355255 356539 357434 358346 359331 360014 360024 359258 357742 355576 353144 350974 349209 347585 346047 344905
51142C44905p73j066j791k053j713j595k078k462k170j609j209n42Q13K209K596
$$ 344905 344132 343066 341275 339222 337509 335914 333836 331374 329204 327595 326386 325844 326657 328866 331462
51127C31462J867P36k37p70m31J023K969M390M907M788M155K961J593P26M83M58
$$ 331462 333329 334065 333828 333058 332627 333650 336619 341009 345916 350704 354859 357820 359413 360139 360622 361080
51111C61080N77J184K127K586K166J577J739K608L350L423L047K758K802L046
$$ 361080 361657 362841 364968 367554 369720 371297 373036 375644 378994 382417 385464 388222 391024 394070
51097C94070L216L125K775K239J505N45n54j604k463l078l452l692l971m266m220
$$ 394070 397286 400411 403186 405425 406930 407475 406921 405317 402854 399776 396324 392632 388661 384395 380175
51082C80175l517k364j382r52r17r64r92r53n87L28J468K021J486L18l89L6J260
$$ 380175 376658 374294 372912 371960 371043 370079 369087 368134 367547 367875 369343 371364 372850 373168 372779 372815 374075
51065C74075K453L204L730M309M828N059N098N325O016P111Q302R184R383Q688
$$ 374075 376528 379732 383462 387771 392599 397658 402756 408081 414097 421208 429510 438694 448077 456765
51051D56765P169N167L190J845J698K970N200P312Q257P937P380P703Q837R583
$$ 456765 463934 469101 472291 474136 475834 478804 484004 491316 499573 507510 514890 522593 531430 541013
51037E41013R049P636O402N893O023O637P445P514N714J927k686o846j0125j2638
$$ 541013 550062 557698 564100 569993 576016 582653 590098 597612 603326 605253 602567 595721 585596 572958
51023E72958j4412j5441j5993j6309j6194j5233j3328j0827q167n650l389j361
$$ 572958 558546 543105 527112 510803 494609 479376 466048 455221 447054 441404 438015 436654
51011D36654M25J782K572L058L772M845N732N784M957L920L521M084N033N318
$$ 436654 437079 438861 441433 444491 448263 453108 458840 464624 469581 473501 477022 481106 486139 491457
50997D91457M520L421L014L196K970J952R20O66J043J484J864K368K997L705M674
$$ 491457 495977 499398 502412 505608 508578 510530 511450 512116 513159 514643 516507 518875 521872 525577 530251
50982E30251N971P227Q138Q989J0344J2340J4575J6404J7162J6359J4076J0911
$$ 530251 536222 543449 551587 560576 570920 583260 597835 614239 631401 647760 661836 672747
50970F72747P308L262j056m903p676r656j1483j3159j4056j3836j2829j1547j0170
$$ 672747 680055 683317 682261 677358 669682 660026 648543 635384 621328 607492 594663 583116 572946
50957E72946q545o481m122k019o28L39J688L671N682P202Q524J0111J1746J2993
$$ 572946 564401 557920 553798 551779 551151 551490 553178 556849 562531 569733 578257 588368 600114 613107
50943F13107J4069J5668J8008K0654K3181K5664K8453L1629L4507L5552L3264
$$ 613107 627176 642844 660852 681506 704687 730351 758804 790433 824940 860492 893756
50932H93756K7554J9951J2288N642O20k229l076l277m249o146q132r667j0842
$$ 893756 921310 941261 953549 959191 959811 957582 954506 951229 946980 940834 932702 923035 912193
50919I12193j1930j3261j5212j7560j9242j9490j8876j8424j8136j7303j5936
$$ 912193 900263 887002 871790 854230 834988 815498 796622 778198 760062 742759 726823
50908G26823j4757j3937j2967j1697j0535r554q466p521p318p538p070n723m692
$$ 726823 712066 698129 685162 673465 662930 653376 644910 637389 630071 622533 615463 609740 605048
50895F05048m807n284n000m117l621l837m211m265m048l739l376k909k306j627
$$ 605048 600241 594957 589957 585840 582219 578382 574171 569906 565858 562119 558743 555834 553528 551901
50881E51901j144j150j540j813j633j121n45n7K60L06J21j60m51n97l51J58K30
$$ 551901 550757 549607 548067 546254 544621 543500 542955 542898 543158 543464 543585 543425 542974 542377 542026 542184 542414
50864E42414n27j326r87M88J930K638L100L934M959N686O030O087N857N515N479
$$ 542414 541887 540561 539574 540062 541992 544630 547730 551664 556623 562309 568339 574426 580283 585798 591277
50849E91277N867O355O835P560Q506R190R528J0138J1446J3035J4310J5259J6141
$$ 591277 597144 603499 610334 617894 626400 635590 645118 655256 666702 679737 694047 709306 725447
50836G25447J6916J7402J7562J7429J7105J7031J7608J8446J8754J8696J9478
$$ 725447 742363 759765 777327 794756 811861 828892 846500 864946 883700 902396 921874
50825I21874K1636K4244K6358K8356L0991L3983L6534L8609M0708M2721M4022
$$ 921874 943510 967754 994112 1022468 1053459 1087442 1123976 1162585 1203293 1246014 1290036
50814A290036M4367M3855M2230L9032L4290K8329K1164J2839M167l680j0274j6019
$$ 1290036 1334403 1378258 1420488 1459520 1493810 1522139 1543303 1556142 1560309 1556629 1546355 1530336
50802A530336k1288k6052l0183l3463l5425l5777l4875l3263l1034k8098k4745
$$ 1530336 1509048 1482996 1452813 1419350 1383925 1348148 1313273 1280010 1248976 1220878 1196133
50791A196133k1206j7187j2548q079m610j739J431M590O593P432Q418J0009J0880
$$ 1196133 1174927 1157740 1145192 1137113 1132503 1130764 1132195 1136785 1143378 1150810 1159228 1169237 1180117
50778A180117R811P403N145L651K650J992J629J045m01k640n067p440j0013j2938
$$ 1180117 1189928 1197331 1202476 1206127 1208777 1210769 1212398 1213443 1213042 1210402 1205335 1197895 1187882 1174944
50764A174944j6048j9180k2251k4985k6925k7780k7609k6728k5621k4757k4212
$$ 1174944 1158896 1139716 1117465 1092480 1065555 1037775 1010166 983438 957817 933060 908848
50753I08848k3593k2538k1164j9783j8353j6605j4592j2691j0985r051o596m036
$$ 908848 885255 862717 841553 821770 803417 786812 772220 759529 748544 739493 732897 728861
50741G28861k093q84K42J888L921N726O974P853Q718R791J1176J2787J4260J5193
$$ 728861 726768 725884 726126 728014 731935 737661 744635 752488 761206 770997 782173 794960 809220 824413
50727H24413J5578J5649J5350J4437J3240J2677J3106J3689J3450J2562J1939
$$ 824413 839991 855640 870990 885427 898667 911344 924450 938139 951589 964151 976090
50716I76090J1819J1485J0314Q465O420M488K858J695R82O76J043K501N059Q235
$$ 976090 987909 999394 1009708 1018173 1024593 1029081 1031939 1033634 1034616 1035292 1036335 1038836 1043895 1052130
50702A052130J1607J5022J8292K1087K3252K4841K5838K6226K6294K6339K6007
$$ 1052130 1063737 1078759 1097051 1118138 1141390 1166231 1192069 1218295 1244589 1270928 1296935
50691A296935K4541K1769J8327J4771J1157P751N441M869N620O773P938R217J0423
$$ 1296935 1321476 1343245 1361572 1376343 1387500 1395251 1400692 1405561 1411181 1417954 1425892 1435109 1445532
50678A445532J0962J0451R115P592O581O567P628R607J2503J6498K1468K6739
$$ 1445532 1456494 1466945 1476060 1483652 1490233 1496800 1504428 1514035 1526538 1543036 1564504 1591243
50666A591243L1533L5352L7840L8716L8152L6828L5302L3623L1873L0532K9850
$$ 1591243 1622776 1658128 1695968 1734684 1772836 1809664 1844966 1878589 1910462 1940994 1970844
50655A970844K9301K8375K7511K7496K8152K8360K7378K5425K3054K0754J9195
$$ 1970844 2000145 2028520 2056031 2083527 2111679 2140039 2167417 2192842 2215896 2236650 2255845
50644B255845J9000K0028K1612K3783K7410L2686L8218M2396M5121M7362M9377
$$ 2255845 2274845 2294873 2316485 2340268 2367678 2400364 2438582 2480978 2526099 2573461 2622838
50633B622838N0284M9332M6772M3283L9185L4524K9426K4063J8559J3199Q513
$$ 2622838 2673122 2722454 2769226 2812509 2851694 2886218 2915644 2939707 2958266 2971465 2979978
50622B979978M799J541k762j0176k2281l8689n6132o9646p5467p3111o4774n3166
$$ 2979978 2984777 2986318 2983556 2973380 2951099 2912410 2856278 2786632 2711165 2638054 2573280 2520114
50610B520114m0277k7605j6447p550r99L160M456K500k403r512j8325k8504l9177
$$ 2520114 2479837 2452232 2435785 2428235 2427236 2430396 2434852 2437352 2434949 2425437 2407112 2378608 2339431
50597B339431m8851n6418o1976o6407p0135p2632p3191p1931o9751o7311o4368
$$ 2339431 2290580 2234162 2172186 2105779 2035644 1963012 1889821 1817890 1748139 1680828 1616460
50586A616460o0359n5386n0293m5698m1402l6877l2061k7314k2848j8513j4078
$$ 1616460 1556101 1500715 1450422 1404724 1363322 1326445 1294384 1267070 1244222 1225709 1211631
50575A211631r420m494N93N478R813J3585J6844J9243K0308K0265J9985J9795
$$ 1211631 1202211 1197717 1198310 1203788 1213601 1227186 1244030 1263273 1283581 1303846 1323831 1343626
50563A343626J8840J6153J2062Q027N260M056M267N687P842J0195J2922J6958
$$ 1343626 1362466 1378619 1390681 1398708 1403968 1408024 1412291 1417978 1425820 1436015 1448937 1465895
50551A465895K2745K9352L5374M0402M4989M9333N2796N4788N5485N5322N4403
$$ 1465895 1488640 1517992 1553366 1593768 1638757 1688090 1740886 1795674 1851159 1906481 1960884
50540A960884N2839N1294N0723N1662N4156N8124O3363O9343P5502Q1756Q8387
$$ 1960884 2013723 2065017 2115740 2167402 2221558 2279682 2343045 2412388 2487890 2569646 2658033
50529B658033R5421J02503J09439J16399J23417J30150J36409J42509J48689J54346
$$ 2658033 2753454 2855957 2965396 3081795 3205212 3335362 3471771 3614280 3762969 3917315
50519C917315J58305J59734J58463J54377J46859J35052J18470R7318P2341M4561
$$ 3917315 4075620 4235354 4393817 4548194 4695053 4830105 4948575 5045893 5118234 5162795
50509E162795J5082j4970m4500p2518r8235j20954j39780j53452j60718j61037
$$ 5162795 5177877 5162907 5118407 5045889 4947654 4826700 4686920 4533468 4372750 4211713
50499D211713j54925j43532j27824j08260q5386o0524l5653j2430Q315K5967L9207
$$ 4211713 4056788 3913256 3785432 3677172 3591786 3531262 3495609 3483179 3491494 3517461 3556668
50488C556668M6191M5650L7564K2776K455k1797m7651p2451r4068j11344j23865
$$ 3556668 3602859 3648509 3686073 3708849 3711304 3689507 3641856 3569405 3475337 3363993 3240128
50477C240128j31648j35121j35234j33237j30107j26010j20503j13418j05535
$$ 3240128 3108480 2973359 2838125 2704888 2574781 2448771 2328268 2214850 2109315
50468B109315r8129r1874q6418q1012p5317o9456o3707n8344n3530m9118m4733
$$ 2109315 2011186 1919312 1832894 1751882 1676565 1607109 1543402 1485058 1431528 1382410 1337677
50457A337677m0246l5936l2008k8272k4544k1105j8331j6050j3733j1224q927
$$ 1337677 1297431 1261495 1229487 1201215 1176671 1155566 1137235 1121185 1107452 1096228 1087301
50446A087301p282o287n571m579k913q03Q37J357J329K053M000O313Q027R178
$$ 1087301 1080019 1073732 1068161 1063582 1060669 1059866 1060703 1062060 1063389 1065442 1069442 1075755 1083782 1092960
50432A092960J0341J1597J2620J3516J4899J7061J9580K1833K3606K5083K6606
$$ 1092960 1103301 1114898 1127518 1141034 1155933 1172994 1192574 1214407 1238013 1263096 1289702
50421A289702K8561L1183L4273L7315M0088M2951M6333N0210N4332N8763O3757
$$ 1289702 1318263 1349446 1383719 1421034 1461122 1504073 1550406 1600616 1654948 1713711 1777468
50410A777468O9186P4534P9467Q4000Q7942R0722R1972R1967R1152Q9608Q7321
$$ 1777468 1846654 1921188 2000655 2084655 2172597 2263319 2355291 2447258 2538410 2628018 2715339
50399B715339Q4471Q0921P5674O7516N6139M2012K5362O089j5130l6516n6274
$$ 2715339 2799810 2880731 2956405 3023921 3080060 3122072 3147434 3153523 3138393 3101877 3045603
50388C045603p3444q7355r7100j02193j03264j01280r6345q8020p6626o3578n0326
$$ 3045603 2972159 2884804 2787704 2685511 2582247 2480967 2384622 2296602 2219976 2156398 2106072
50377B106072l7437k4917j2942k220O189J1323J2838J1104O654k96r589k0567
$$ 2106072 2068635 2043718 2030776 2028556 2034745 2046068 2058906 2070010 2076664 2076368 2066779 2046212
50365B046212l2048m2795n1842n8652o3305o6354o8127o8395o7013o4630o2142
$$ 2046212 2014164 1971369 1919527 1860875 1797570 1731216 1663089 1594694 1527681 1463051 1400909
50354A400909n9671n6653n2846m8648m4466m0433l6794l3875l1492k8984k6108
$$ 1400909 1341238 1284585 1231739 1183091 1138625 1098192 1061398 1027523 996031 967047 940939
50343I40939k3308k0918j8682j6406j4453j3060j1670r663p414n999n884o470
$$ 940939 917631 896713 878031 861625 847172 834112 822442 812779 805365 799366 793482 787012
50331G87012o963p136p086o751n985m960m178m003m286m490m157l271k185j327
$$ 787012 780049 772913 765827 759076 753091 748131 743953 739950 735664 731174 727017 723746 721561 720234
50317G20234r52j006j140r40l01M89J195J986L160M644O088P326Q424R278R569
$$ 720234 719282 718276 717136 716196 715895 716384 717579 719565 722725 727369 733457 740783 749207 758485 768054
50302G68054R202Q522P966P720P759P969Q113P963P534P020O482N863N210M660
$$ 768054 777256 785778 793744 801464 809223 817192 825305 833268 840802 847822 854304 860167 865377 870037
50288H70037M176L662L282L237L290L057K891L832O451J0225J4317J8452K2654
$$ 870037 874213 877875 881157 884394 887684 890741 893632 897464 903915 914140 928457 946909 969563
50275I69563K6616K9701L0969K8789K1247Q190p351k0705k8838l1755l0999k7977
$$ 969563 996179 1025880 1056849 1085638 1106885 1115075 1107724 1087019 1058181 1026426 995427 967450
50263I67450k3916k0237j7914j6692j5634j4316j2943j1562r851p822o081n062
$$ 967450 943534 923297 905383 888691 873057 858741 845798 834236 824385 816563 810482 805420
50251H05420m358l246j691m16Nj89l03M8O34J010R95Q30R35J469K174K704K992
$$ 805420 801062 797816 796125 795709 795714 795525 795222 795270 795904 796914 797909 798739 799674 801143 803317 806021 809013
50234H09013L080K728J628R4r63j147j174j968l431m715n492o267p409q582r277
$$ 809013 812093 814821 816449 816543 815580 814433 813259 811291 807860 803145 797653 791386 783977 775395 766118
50219G66118r374q906p836o425n339m978m957m652m048l608l475l223k414j088
$$ 766118 756744 747838 740002 733577 728238 723260 718303 713651 709603 705995 702520 699297 696883 695795
50205F95795L24J406K067K608L442M676O036P342Q906J1279J4601J8397K1948
$$ 695795 696119 697525 699592 702200 705642 710318 716354 723696 732602 743881 758482 776879 798827
50192G98827K4834K7109K9052L0687L1511L0838K8446K4844K0963J7632J5345
$$ 798827 823661 850770 879822 910509 942020 972858 1001304 1026148 1047111 1064743 1080088
50181A080088J4223J4016J4177J4003J2808J0150O104J209m044r601j5510k1368
$$ 1080088 1094311 1108327 1122504 1136507 1149315 1159465 1165569 1166778 1162734 1153133 1137623 1116255
50169A116255k6386k9987l1990l2408l1425k9494k7054k4084k0397j6228j2038
$$ 1116255 1089869 1059882 1027892 995484 964059 934565 907511 883427 863030 846802 834764
50158H34764p850l435Q01L884N319N371M140J405k228n006n679m906m155l842
$$ 834764 826914 823479 824280 828164 833483 838854 842994 844399 842171 837165 831486 826580 822425 818583
50144H18583l476l089l382m472n593o268o942q163r719j0876j1093j0293q795
$$ 818583 815107 812018 808636 804164 798571 792303 785361 777198 767479 756603 745510 735217 726422
50131G26422p125n632m191k520p40O93J595K113K241J722O37l81p09l60J78M59
$$ 726422 719297 713665 709474 706954 706214 706907 708502 710615 712856 714578 715215 714834 714125 713765 713943 714402
50115G14402L19j80p97j127p68L57J811K871L162L032L156L772M580N316N974
$$ 714402 714721 714541 713744 712617 711849 712206 714017 716888 720050 723082 726238 730010 734590 739906 745880
50100G45880O432O411O081O106O681P085O693N955N733O083O388O430O563O992
$$ 745880 752312 758723 764804 770910 777591 784676 791369 797324 803057 809140 815528 821958 828521 835513
50086H35513P632Q590J0165J2385J5074J8281K2053K5995K9773L3798L8632M3824
$$ 835513 843145 851735 861900 874285 889359 907640 929693 955688 985461 1019259 1057891 1101715
50074A101715M8174N1118N2865N3299N1836M8684M5080M1865L8817L5903L4046
$$ 1101715 1149889 1201007 1253872 1307171 1359007 1407691 1452771 1494636 1533453 1569356 1603402
50063A603402L3804L4167L3545L1340K7596K1798J3242K355r370k0772l1492m1088
$$ 1603402 1637206 1671373 1704918 1736258 1763854 1785652 1798894 1801249 1791879 1771107 1739615 1698527
50051A698527m8740n4050n7424n9336n9769n8692n6524n3689n0119m5665m0735
$$ 1698527 1649787 1595737 1538313 1478977 1419208 1360516 1303992 1250303 1200184 1154519 1113784
50040A113784l6020l1626k6968k1737j6621j2781j0619r474q507p582o930o358
$$ 1113784 1077764 1046138 1019170 997433 980812 968031 957412 947938 939431 931849 924919 918561
50028I18561n297l676k168j383j131p77j01M36J98r44k325k974k612k105k579
$$ 918561 913264 909588 907420 906037 904906 904129 904028 904464 904662 903718 901393 898419 895807 893702 891123
50013H91123m106n714o673p200p817q579r407j0474j1845j3110j3897j4422j5015
$$ 891123 887017 881303 874630 867430 859613 851034 841627 831153 819308 806198 792301 777879 762864
50000G62864j5516j5540j5060j4134j2435r673o263k926J67L212N984Q047R635
$$ 762864 747348 731808 716748 702614 690179 680506 674243 671317 671484 674696 680680 688727 698362
49987F98362J1303J2662J2446J0293P614N981N347M508K975J479O30j02j742m447
$$ 698362 709665 722327 734773 745066 752680 758661 764008 768516 771491 772970 773600 773498 771756 767309
49973G67309p118q433q153p291o910o954o534n211l485j871j49K078M584O910
$$ 767309 760191 751758 743605 736314 729404 722450 715916 710705 707220 705349 705200 707278 711862 718772
49959G18772R309J2499J6473K0293K3305K5969K9043L2321L4778L5768L5576L4838
$$ 718772 728081 740580 757053 777346 800651 826620 855663 887984 922762 958530 994106 1028944
49947A028944L3858L2697L1577L0901L0921L1522L2243L2366L1160K8083K2818
$$ 1028944 1062802 1095499 1127076 1157977 1188898 1220420 1252663 1285029 1316189 1344272 1367090
49936A367090J5172N190o463j8354k8777l6523m1401m4226m6269m8354n0216n0951
$$ 1367090 1382262 1387452 1380989 1362635 1333858 1297335 1255934 1211708 1165439 1117085 1066869 1015918
49924A015918n0136m8245m5769m2491l8079l3035k8350k4396k0795j7354j4336
$$ 1015918 965782 917537 871768 829277 791198 758163 729813 705417 684622 667268 652932
49913F52932j1761r183o556m531l447k666j519l81k2k53m5J077K537L614M257
$$ 652932 641171 631988 625432 620901 617454 614788 613269 612888 612866 612613 612568 613645 616182 619796 624053
49898F24053M832N649O886Q594J0546J2407J4087J5597J6562J6266J4419J1497
$$ 624053 628885 634534 641420 650014 660560 672967 687054 702651 719213 735479 749898 761395
49886G61395Q278N334K982J283p6j518l068m455n828p868j0926j4456j7535j9587
$$ 761395 769673 775007 777989 779272 779196 777678 774610 770155 764327 756459 745533 731077 713542 693955
49872F93955k0412k0016j8778j7340j5916j4057j1553r123p614o829n883m531
$$ 693955 673543 653527 634749 617409 601493 587436 575883 566760 559146 552317 546434 541903
49860E41903l360k648j820k84J760L692N175O168O623O614O580P133Q601J0778
$$ 541903 538543 535895 534075 533791 535551 539243 544418 550586 557209 563823 570403 577536 586137 596915
49846E96915J3054J4717J5433J5516J5501J5353J4411J2250R331O496M124K101
$$ 596915 609969 624686 640119 655635 671136 686489 700900 713150 722481 728977 733101 735202
49834G35202L76r20j911l164n208p954j0707j2725j3686j3680j2871j1319r239
$$ 735202 735578 734658 732747 729583 724375 716421 705714 692989 679303 665623 652752 641433 632194
49821F32194p194n679m590l393j889m45O15J477K447L457M342N390P125R532J1862
$$ 632194 625000 619321 614731 611338 609449 609004 609619 611096 613543 617000 621342 626732 633857 643389 655251
49806F55251J3304J3696J3461J2984J2182J0728Q664O609N188M292L254J662k91
$$ 655251 668555 682251 695712 708696 720878 731606 740270 746879 752067 756359 759613 761275 760984
49793G60984k304m343o398q365j0392j2824j5405j7117j7261j6341j5268j4168
$$ 760984 758680 754337 747939 739574 729182 716358 700953 683836 666575 650234 634966 620798
49781F20798j2596j0549q411o222l910k105j738k627l383l064k127j484j241q43
$$ 620798 608202 597653 589242 583020 579110 577005 575267 572640 569257 566193 564066 562582 561341 560498
$$ [...]
##END NTUPLES=NMR SPECTRUM
##END=
