
##TITLE=AC1258_UGARS11075_7163997_x7UjD6Vp5X
##JCAMPDX= 6.0         $$ Bruker NMR JCAMP-DX V2.0
##DATA TYPE= NMR SPECTRUM
##DATA CLASS= NTUPLES
##ORIGIN= BRUKER
##OWNER= Administrator
$$ 1.72 TOPSPIN		Version 2.1
$$ 2012-12-01 12:52:22.801 -0500  Administrator@X
$$ Compression mode = diff/dup
##.OBSERVE FREQUENCY= 400.02188249412
##.OBSERVE NUCLEUS= ^1H
##.ACQUISITION MODE= SIMULTANEOUS (DQD)
##.ACQUISITION SCHEME= undefined
##.AVERAGES= 8
##.DIGITISER RES= 22
##SPECTROMETER/DATA SYSTEM= spect
##.PULSE SEQUENCE= zg30
##.SOLVENT NAME= COFFEE_meoh
##.SHIFT REFERENCE= INTERNAL, COFFEE_meoh, 1, 14.98509
##AUDIT TRAIL= $$ (NUMBER, WHEN, WHO, WHERE, PROCESS, VERSION, WHAT)
$$ ##TITLE= Audit trail, TOPSPIN		Version 2.1
$$ ##JCAMPDX= 5.01
$$ ##ORIGIN= Bruker BioSpin GmbH
$$ ##OWNER= Administrator
$$ $$ E:\/data/COFFEE/nmr/AC1258_UGARS11075_7163997_x7UjD6Vp5X/10/pdata/1/auditp.txt
$$ ##AUDIT TRAIL=  $$ (NUMBER, WHEN, WHO, WHERE, PROCESS, VERSION, WHAT)
(   1,<2012-12-01 12:52:13.749 -0500>,<Administrator>,<X>,<go>,<TOPSPIN 2.1>,
      <created by zg
	started at 2012-12-01 12:51:10.364 -0500,
	POWCHK enabled, PULCHK disabled,
       configuration hash MD5:
       86 BA 57 50 F2 9D 5C 9B 26 00 A9 28 5F 66 2E 89
       data hash MD5: 64K
       5E 35 41 60 8C CE 74 35 07 F2 22 3A 2A 80 FC DE>)
(   2,<2012-12-01 12:52:17.221 -0500>,<Administrator>,<X>,<proc1d>,<TOPSPIN 2.1>,
      <Start of raw data processing
       efp LB = 0 FT_mod = 6 PKNL = 1 PHC0 = 0 PHC1 = 0 SI = 32K 
       data hash MD5: 32K
       61 B5 5A 8B B0 1B 1E 12 02 86 23 AC A8 B1 9A D0>)
(   3,<2012-12-01 12:52:17.733 -0500>,<Administrator>,<X>,<proc1d>,<TOPSPIN 2.1>,
      <pk PHC0 = 96.40503 PHC1 = 0 
       data hash MD5: 32K
       7D 4D 31 04 33 7B B4 98 4F A7 62 5A 7A 4B 95 F0>)
(   4,<2012-12-01 12:52:17.964 -0500>,<Administrator>,<X>,<proc1d>,<TOPSPIN 2.1>,
      <abs ABSG = 1 
       data hash MD5: 32K
       E8 13 3C 17 A8 80 A6 28 D7 1C 88 A4 EB CE A8 78>)
(   5,<2012-12-01 12:52:18.129 -0500>,<Administrator>,<X>,<proc1d>,<TOPSPIN 2.1>,
      <abs ABSG = 2 
       data hash MD5: 32K
       5A A1 5A E1 37 2B 8C 25 A6 48 D7 6E B0 DC AC 62>)
(   6,<2012-12-01 12:52:18.344 -0500>,<Administrator>,<X>,<proc1d>,<TOPSPIN 2.1>,
      <abs ABSG = 3 
       data hash MD5: 32K
       E4 0E 11 49 20 C6 CD DE 87 73 3D EF 09 F2 E2 B5>)
(   7,<2012-12-01 12:52:18.525 -0500>,<Administrator>,<X>,<proc1d>,<TOPSPIN 2.1>,
      <abs ABSG = 4 
       data hash MD5: 32K
       B3 AC 65 95 4E 96 33 2C AD 59 E3 77 1E 9E 09 B0>)
(   8,<2012-12-01 12:52:18.707 -0500>,<Administrator>,<X>,<proc1d>,<TOPSPIN 2.1>,
      <abs ABSG = 5 
       data hash MD5: 32K
       30 54 BB 77 80 59 18 BC 14 72 BF 8E 2A 19 49 7C>)
$$ ##END=
$$ 
$$ $$ hash MD5
$$ $$ 1F 4B 79 C2 B6 41 C9 0C 44 1F 1C AE 56 16 45 70
##$RELAX= 
##$RELAX= 
##$RELAX= 
##$RELAX= 
##$RELAX= 
##$RELAX= 
##$RELAX= 
$$ Bruker specific parameters
$$ --------------------------
##$DU= <E:\>
##$EXPNO= 10
##$NAME= <AC1258_UGARS11075_7163997_x7UjD6Vp5X>
$$ [...]
##$TP= (0..7)
150 150 150 150 150 150 150 150
##$TP07= 0
##$TPNAME0= <>
##$TPNAME1= <>
##$TPNAME2= <>
##$TPNAME3= <>
##$TPNAME4= <>
##$TPNAME5= <>
##$TPNAME6= <>
##$TPNAME7= <>
##$TPOAL= (0..7)
0.5 0.5 0.5 0.5 0.5 0.5 0.5 0.5
##$TPOFFS= (0..7)
0 0 0 0 0 0 0 0
##$TUNHIN= 0
##$TUNHOUT= 0
##$TUNXOUT= 0
##$USERA1= <user>
##$USERA2= <user>
##$USERA3= <user>
##$USERA4= <user>
##$USERA5= <user>
##$V9= 5
##$VALIST= <valist>
##$VCLIST= <CCCCCCCCCCCCCCC>
##$VD= 0
##$VDLIST= <DDDDDDDDDDDDDDD>
##$VPLIST= <PPPPPPPPPPPPPPP>
##$VTLIST= <TTTTTTTTTTTTTTT>
##$WBST= 1024
##$WBSW= 4
##$XGAIN= (0..3)
0 0 0 0
##$XL= 0
##$YL= 0
##$YMAX_a= 660767
##$YMIN_a= -558306
##$ZGOPTNS= <>
##$ZL1= 120
##$ZL2= 120
##$ZL3= 120
##$ZL4= 120
##$ABSF1= 14.98509
##$ABSF2= -5.573092
##$ABSG= 5
##$ABSL= 3
##$ALPHA= 0
##$AQORDER= 0
##$ASSFAC= 0
##$ASSFACI= 0
##$ASSFACX= 0
##$ASSWID= 0
##$AUNMP= <proc_prof1d_extract_pilot.lims>
##$AXLEFT= 0
##$AXNAME= <>
##$AXNUC= <1H>
##$AXRIGHT= 0
##$AXTYPE= 0
##$AXUNIT= <>
##$AZFE= 0.1
##$AZFW= 0.1
##$BCFW= 0
##$BC_mod= 0
##$BYTORDP= 0
##$COROFFS= 0
##$CY= 15
##$DATMOD= 1
##$DC= 0
##$DFILT= <>
##$DTYPP= 0
##$F1P= 0
##$F2P= 0
##$FCOR= 0.5
##$FTSIZE= 32768
##$FT_mod= 6
##$GAMMA= 0
##$GB= 0
##$INTBC= 1
##$INTSCL= 1
##$ISEN= 128
##$LB= 0
##$LEV0= 0
##$LPBIN= 0
##$MAXI= 10000
##$MC2= 0
##$MEAN= 0
##$ME_mod= 0
##$MI= 0
##$NCOEF= 0
##$NC_proc= -8
##$NLEV= 6
##$NOISF1= 0
##$NOISF2= 0
##$NSP= 0
##$NTH_PI= 0
##$NZP= 0
##$OFFSET= 14.98509
##$PC= 1
##$PHC0= 96.40503
##$PHC1= 0
##$PH_mod= 1
##$PKNL= yes
##$PPARMOD= 0
##$PPDIAG= 0
##$PPIPTYP= 0
##$PPMPNUM= 2147483647
##$PPRESOL= 1
##$PSCAL= 4
##$PSIGN= 0
##$PYNMP= <proc.py>
##$REVERSE= no
##$SF= 400.02
##$SI= 32768
##$SIGF1= 0
##$SIGF2= 0
##$SINO= 400
##$SIOLD= 32768
##$SPECTYP= <>
##$SREGLST= <1H.CDCl3>
##$SSB= 0
##$STSI= 32768
##$STSR= 0
##$SW_p= 8223.68421052631
##$SYMM= 0
##$S_DEV= 0
##$TDeff= 65536
##$TDoff= 0
##$TI= <>
##$TILT= no
##$TM1= 0
##$TM2= 0
##$TOPLEV= 0
##$USERP1= <user>
##$USERP2= <user>
##$USERP3= <user>
##$USERP4= <user>
##$USERP5= <user>
##$WDW= 1
##$XDIM= 32768
##$YMAX_p= 474437058
##$YMIN_p= -725546
##$CURPLOT= <Network HP LaserJet P1505>
##$CURPRIN= <$Network HP LaserJet P1505>
##$DFORMAT= <normdp>
##$LAYOUT= <+/1D_H.xwp>
##$LFORMAT= <normlp>
##$PFORMAT= <normpl>
##$SURQMSG= 1
$$ End of Bruker specific parameters
$$ ---------------------------------
##NTUPLES= NMR SPECTRUM
##VAR_NAME=  FREQUENCY,     SPECTRUM/REAL,   SPECTRUM/IMAG
##SYMBOL=    X,             R,               I
##VAR_TYPE=  INDEPENDENT,   DEPENDENT,       DEPENDENT
##VAR_FORM=  AFFN,          ASDF,            ASDF
##VAR_DIM=   32768,         32768,           32768
##UNITS=     HZ,            ARBITRARY UNITS, ARBITRARY UNITS
##FACTOR=    0.250966925370066, 1,           1
##FIRST=     8223.43324360094, -12786,       -112281
##LAST=      0,             -83969,          60305
##MIN=       0,             -725546,         0
##MAX=       8223.43324360094, 474437058,    0
$$ Real data points
##PAGE= N=1
##DATA TABLE= (X++(R..R)), XYDATA
$$ [...]
19496A27900a73035b262k58047A09946K9136B3826g7572B16151c8593A26849N9250
19485A86099b03054g6061A05334b16813A8820b06802k9296D8420j6726h4349m9519
19474a33868A46412C226b87163P5957l2537i4613j41930K6338K1519B81988H3418
19462d1192H035N2584d1204H1633d38512b6319k39327R0868k39793C618a63796
19450h9521A23487b69358A12739G115a80879A40273M6141a28314B35706d98349
19439i4529I4676e0986D7914J47371C2783a02866r1910q5076f191o2881j63239
19428b32311B00450a15360G3683b55737R7160K3628j21227A14297e6635r948C2999
19416A4921b00892q4173A0873a12568p3652b6437p2664j9954a4293j05558j1696
$$ plain form
19496 127900 -173035 -2262 -260309 109946 139082 23826 -77572 216151 -38593 126849 186099
19485 186099 -203054 -76061 105334 -216813 18820 -206802 -236098 48420 31694 -84349 -133868
19474 -133868 146412 3226 -287163 -211206 -243743 -94613 -236543 -210205 -188686 281988 83418
19462 -41192 8035 60619 -41204 81633 -438512 -26319 -265646 -174778 -414571 3618 -163796
19450 -89521 123487 -269358 112739 7115 -180879 140273 186414 -128314 235706 -498349
19439 -94529 94676 -50986 47914 195285 32783 -102866 -194776 -279852 -6191 -69072 -232311
19428 -232311 200450 -115360 73683 -255737 -158577 -134949 -256176 114297 -56635 -66583 32999
19416 14921 -200892 -285065 10873 -112568 -186220 -26437 -99101 -119055 -14293 -119851 -131547
19405a31547J0506e3908l33158R0586J20206k5493F9335A8865c8233B5410L65880
19394C91290j37768E7719d4938k55324E7745c352o389k770F5919a07443j51547
19383b58990g0610c857j04292j19217R066A1529a68627P0831B55772f6063d080
19371c29423a27806G2112b30487C65732H1336J9207e3513j30518b3431k54786
19361b78217A31056b2828p6765k34430H0908b0375k1327k62550O232B9133g6200
19349B4110e7264m4986d8157j76979j24848B5883c17755l3757A48826h7940o9841
19338a57781c6355C0714N3416a57467L1294A11834J1892R7828b94170a7862B13276
19326e9453j6310I3954a03443L8141l0497G3653a32245k14895A65965p2869a46986
$$ plain form
19405 -131547 -121041 -53908 -387066 -296480 -176274 -201767 69335 18865 -38233 25410 391290
19394 391290 253522 57719 -44938 -300262 57745 -3352 -9741 -12511 65919 -107443 -258990
19383 -258990 -70610 -3857 -108149 -227366 -218300 11529 -168627 -97796 255772 -66063 -4080
19371 -329423 -127806 72112 -230487 365732 81336 100543 -53513 -184031 -23431 -278217
19361 -278217 131056 -22828 -99593 -334023 80908 -20375 -41702 -304252 -298020 29133 -76200
19349 24110 -57264 -102250 -48157 -225136 -349984 25883 -317755 -351512 148826 -87940 -157781
19338 -157781 -36355 30714 84130 -157467 -126173 111834 123726 221554 -294170 -17862 213276
19326 -59453 -75763 93954 -103443 -65302 -95799 73653 -132245 -347140 165965 93096 -146986
19314e28360a65421k4257A64266p4976a06390A23752a51905e2899J6849j64047
19304b00097k2648l4376d4219B24013E0018a53552j20290N4931p2489L2712Q2899
19293a75789J243k49377h9838A20632c72546E7673a57272o3947R9588l26862d2288
19281a13196A1289m336h5126B71101D8119J80998b50658c7953A67200c47817J41941
19270b05876B88332a74220C6374a31969n2852A67726J74670A15064A7153n158
19260A1995a37867b3993m1750j76702B7168a9483k95630i5002d5481k74331A09077
19248b72201q4258E9640b1471l1003p8543p081a7215A09952b93103a11801k46446
19237c58247C42663b28245K8838M1471A69865b84647A44190a07952p4273h1334
$$ plain form
19314 -528360 -165421 -189678 164266 89290 -106390 123752 -151905 -52899 -36050 -200097
19304 -200097 -222745 -257121 -44219 224013 50018 -153552 -273842 -218911 -291400 -258688 -175789
19293 -175789 -174546 -423923 -89838 120632 -372546 57673 -157272 -221219 -121631 -448493 -42288
19281 -113196 11289 6953 -85126 271101 48119 229117 -250658 -37953 167200 -347817 -205876
19270 -205876 288332 -174220 36374 -131969 -184821 167726 342396 115064 17153 11995
19260 11995 -137867 -23993 -65743 -242445 27168 -19483 -315113 -95002 -45481 -319812 109077
19248 -272201 -356459 59640 -21471 -52474 -131017 -138098 -17215 109952 -293103 -111801 -358247
19237 -358247 342663 -228245 -199407 -157936 169865 -284647 144190 -107952 -182225 -81334
19226A2793a51853e8979m1200H793L21878b34777O6642e2794k23343a31676j19764
19215b51440G6089O319b9605P824C1270K89653d7831j50522f043A275J90580b86906
19202h3504n1748H8525c04755J37750j44989Q6865g7101A18835a84861A78716
19191G8866n523b19274O7296r6460A39908b91549j9093R3529a02904A1562a83909
19179c47022a24251A17170l5753L0236d1483a2102m31699A48487B2109b06128
19168A5054d57362h3716o3028A43141a23944J7836C49337A18736E027a93558f3230
19156a5941B3189d2073m28857a07217o372L9986j67349A32736A5008J02326h9516
19144A31512F4205R2575n8854a22621N5994b8913P579K99j00161j6654A51019
$$ plain form
19226 12793 -151853 -58979 -100179 8793 330671 -234777 -168135 -52794 -276137 -131676 -251440
19215 -251440 76089 82408 -29605 -21781 31270 320923 -47831 -198353 -6043 1275 191855 -286906
19202 -83504 -135252 88525 -304755 -167005 -311994 -225129 -77101 118835 -184861 178716
19191 78866 73343 -219274 -151978 -248438 139908 -291549 -310642 -217113 -102904 11562 -183909
19179 -347022 -124251 117170 81417 111653 -41483 -12102 -443801 148487 22109 -206128
19168 15054 -457362 -83716 -146744 143141 -123944 -106108 349337 118736 5027 -193558 -63230
19156 -15941 23189 -42073 -470930 -107217 -113589 -73603 -240952 132736 15008 117334 -89516
19144 131512 64205 156780 97926 -122621 -66627 -28913 -21334 -21035 -121196 -137850 151019
19132b07841A2401K05491b0649G8373A0192K94123h1263A06928o506d13954a68956
19120f9605G7541R5084e9461A23682B1889e488A48555b75127a33554f126j1539
19109a7665j43717C1383h53j39105B02554i43p4601L616j81932M5951k69687e6440
19096C5039a27833a1790j15931G6554c06376A36164a3491C44544d10668c3606
19085A09537a88578r608j64203A2124g9351n2679A05213g3929B6606a69254E859
19073D5451b22109O5256B20757F6867j0323b06531N1565f7131A77127R9327j08208
19062A68246l5132j5515a8862j43648g961m6331l35626C96955B4858J80286b27469
19050A42451a27287C2662J00786a33162D04818A09581a47003H5691d06843e5787
$$ plain form
19132 -207841 12401 217892 -20649 78373 10192 304315 -81263 106928 100422 -413954 -168956
19120 -69605 77541 172625 -59461 123682 21889 -5488 148555 -275127 -133554 -6126 -17665
19109 -17665 -161382 31383 -853 -139958 202554 -943 -75544 -71928 -253860 -207909 -477596 -56440
19096 35039 -127833 -11790 -127721 76554 -306376 136164 -13491 344544 -410668 -33606
19085 109537 -188578 -198186 -362389 12124 -79351 -132030 105213 -73929 26606 -169254 5859
19073 45451 -222109 -156853 220757 66867 56544 -206531 -154966 -67131 177127 276454 168246
19062 168246 133114 117599 -18862 -162510 -7961 -54292 -389918 396955 24858 205144 -227469
19050 142451 -127287 32662 133448 -133162 404818 109581 -147003 85691 -406843 -55787
19039B38936I7605d29424D3052J11061e04882a56504O0595j5254j12389B04907
19028c07079a20850j02778b1254j39461B43670b20000C17098b44488h3279l2384
19018a15663b2730q647A72776j3451m8536b17346B09161c76897J78358r1716A86612
19006d0707o8724C1635e5054B11860m9388c9554j96607r3624B85001K5057R4878
18995D04936B814c42160C09936a20392J8894A38533l6788b33404f700j77798C67516
18983a11867A92473h9292n0828B98721d9505C6576R9338a56927f8063m2412q8651
18972a99126E3860a2292k0868A43055b2003C8721P8079c9163H9269K18887K71
18961C08427K51793J45373C28848C0738a31561K6515m7270B9544a06059A5670
$$ plain form
19039 238936 97605 -429424 43052 154113 -504882 -156504 -95909 -111163 -223552 204907
19028 -307079 -120850 -223628 -21254 -160715 243670 -220000 317098 -244488 -83279 -115663
19018 -115663 -22730 -31377 172776 159325 110789 -217346 209161 -376897 -198539 -290255 186612
19006 -40707 -109431 31635 -55054 211860 162472 -39554 -236161 -329785 285001 310058 404936
18995 404936 2814 -342160 309936 -120392 -101498 138533 101745 -233404 -6700 -184498 367516
18983 -111867 192473 -89292 -140120 298721 -49505 36576 135914 -156927 -68063 -110475 -199126
18972 -199126 53860 -12292 -33160 143055 -22003 38721 116800 -39163 89269 308156 308427
18961 308427 560220 705593 328848 30738 -131561 -105046 -152316 29544 -106059 15670
18950H7494c28196D47073A33530k1505a5929G8144B8347b2581A77012d36385C04938
18938A94664B9621P1823I135h9151G1441c7432D4448d2464A67237B3721M114a26625
18925a157F2861P810Q6731L8404a18934j5358A29021b30863J01751B8156a72744
18913h5040o926L2964E609L32438h5572k0790A40441f6632r4953P7549I0371J22928
18901B13299n5880A1034L4067M82845P0939B04439a79047d3057k33047o7347C7285
18889d07444e0561k09504J22791A01430i8985m27198a6904j32431H2734a9257
18878e6506B8209O947a13906N1796A26836C9693b7996G058c22451a27874c9136
18866F8090b88829A20683Q0001c2638p0623F324d16849d7241p6265q225f5724
$$ plain form
18950 87494 -328196 447073 133530 112025 -15929 78144 28347 -22581 177012 -436385 304938
18938 194664 29621 101444 9135 -89151 71441 -37432 44448 -42464 167237 23721 27835 -126625
18925 -1157 62861 70671 157402 195806 -118934 -134292 129021 -230863 -129112 28156 -172744
18913 -85040 -91966 -59002 5609 338047 -85572 -106362 140441 -66632 -161585 -84036 90371 213299
18901 213299 157419 11034 45101 527946 598885 204439 -179047 -43057 -276104 -343451 37285
18889 -407444 -50561 -260065 -137274 101430 -98985 -526183 -16904 -149335 82734 -19257
18878 -56506 28209 35156 -113906 -62110 126836 39693 -27996 7058 -322451 -127874 -39136
18866 68090 -288829 120683 200684 -32638 -103261 6324 -416849 -47241 -123506 -131731 -65724
18854A09995c00874E5777K46644h9513I4266a68452E4268a85787A4309b73879
18843b79615h1343l8398p1225A49588a2903j34516M665o9373c5863p7887k59177
18832c72927K5314G0996c47631A08002c52521h702j88740A29059n5594c2331e813
18820b34860a00175j21258B39285a15434D98597a16959H2918k6254d45235a4570
18809g1369E5873a42438a1719k3090C78568A29359h7551M880q7422J6227K7257
18798a26609j90771A61500b44647B18606J10323C137c9286m5910l9053I8323a72325
18786a89700Q3019L7144B13833b086A27352b54866M1168A14068f65739a89297
18775a15635c8083A61791a73226G8218b8300A169a32133G2873B5485a45676C7853
$$ plain form
18854 109995 -300874 55777 302421 -89513 94266 -168452 54268 -185787 14309 -273879
18843 -279615 -81343 -119741 -190966 149588 -12903 -147419 -142754 -212127 -35863 -113750 -372927
18832 -372927 -347613 70996 -347631 108002 -352521 -8702 -197442 129059 73465 -32331 -5813
18820 -234860 -100175 -221433 239285 -115434 498597 -116959 82918 56664 -445235 -14570
18809 -71369 55873 -142438 -11719 -34809 378568 129359 -87551 -82671 -170093 -153866 -126609
18798 -126609 -317380 161500 -244647 218606 328929 3137 -39286 -85196 -124249 98323 -172325
18786 -189700 -106681 -69537 213833 -2086 127352 -254866 -213698 114068 -665739 -189297
18775 -115635 -38083 161791 -173226 78218 -28300 1169 -132133 72873 25485 -145676 37853
18763A31693a28806L2540H291a18146m27639a44715d7556A72947g7157C2065a63317
18751h1365j10493B21914f4320L0411j19084A04379c33233E8516K78675A47792
18740a77090N7396e3013p2389A7553b30806f1363l4175n3297m9416A39177a79936
18728a62635q6766N4113L4178N3647r1840j28433N8824J09597c3118A05283C2036
18716c4963C76741k8092g294A76534G9977F073N7778e640B2701e6232r6436A91156
18703E4503c12937L774I8063a26643j2148e5980k48863f0415j70392A18471a57727
18691c69361I8071d947B14297c84978a90458c9652I8271a68766c5302o9987C60927
18679a75907f8486A03339c2315j19495k31627c431A45078K6074b44406A3348L0158
$$ plain form
18763 131693 -128806 -96266 8291 -118146 -545785 -144715 -47556 172947 -77157 32065 -163317
18751 -81365 -191858 221914 -64320 -33909 -152993 104379 -333233 58516 337191 147792
18740 -177090 -119694 -53013 -125402 17553 -230806 -61363 -95538 -148835 -198251 139177 -179936
18728 -162635 -249401 -195288 -161110 -107463 -199303 -327736 -268912 -159315 -33118 105283 32036
18716 -34963 376741 348649 -7294 176534 79977 6073 63851 -5640 22701 -56232 -152668 191156
18703 54503 -312937 -309163 98063 -126643 -138791 -55980 -304843 -60415 -230807 118471 -157727
18691 -369361 98071 -4947 214297 -384978 -190458 -39652 98271 -168766 -35302 -105289 360927
18679 -175907 -68486 103339 -32315 -151810 -383437 -3431 145078 171152 -244406 13348 43506
18668D3506a80651E9892N3488a63190p3116A08982a07083A56787k1518a26942
18657a26930b8959k36967A71010f7655j48764g1318i261A4537N0952a53924K1058
18646a32866H0986c47783A7110b27374B7738b36671a9175C1639c5838C2598b0745
18634d90573d9433B5199f8714k13088A05864b00110n0356M9415A15534i565j2908
18623b2473A60505F9082O2641b17401M9862F1134a07802F64194i3086p9056A90368
18611I0423b6056A56897l3553a3450k63557c7382k12213j31235B5661L2513K434
18600F0608a47405B7862f1217a4661j12791B20591c45095Q1987B58919e9966j74184
18589b34150J09518L883A98117k0284B4740i6957m1771o4214R9705k60340a52133
$$ plain form
18668 43506 -180651 59892 113380 -163190 -236306 108982 -107083 156787 135269 -126942
18657 -126930 -28959 -265926 171010 -67655 -216419 -71318 -9261 14537 65489 -153924 -132866
18646 -132866 80986 -347783 17110 -227374 27738 -236671 -19175 31639 -35838 32598 -20745
18634 -490573 -49433 25199 -68714 -281802 105864 -200110 -250466 -201051 115534 -9565 -22473
18623 -22473 160505 69082 131723 -217401 -167539 61134 -107802 664194 -93086 -172142 190368
18611 90423 -26056 156897 123344 -13450 -277007 -37382 -249595 -380830 25661 58174 60608
18600 60608 -147405 27862 -61217 -14661 -127452 220591 -345095 -263108 258919 -59966 -234150
18589 -234150 -124632 -120749 198117 177833 24740 -96957 -138728 -202942 -103237 -363577 -152133
18577E4555b78000j04301E2837d9435j98537E8989a87567A92526n7407a69530
18566b17659N1684h5j01365d0751B12065a76831a8021r5827l4781k1649k7552
18555a97830I7462b38439J8864D95023b19659a07551q1214I6426L3753d24931
18544b33635C9989N8576i6714d6660a2453C0350c1600m2396A54091l4123a16495
18532b74261D5555K72606a64556m2229f149G9213b8250j74254A56166G0908a06545
18520E5159B6622K5812R7943g2653o1098o8362J4242L7274A35662A506d3909D8296
18507A52851F3990b7272m51001A2814J68559a12857M4923o2618a7849F1386a74319
18495a37520L9975M7095n1441o9602N1974N5539C34137b75560g686C99772b02417
$$ plain form
18577 54555 -278000 -382301 52837 -49435 -247972 58989 -187567 192526 135119 -169530
18566 -217659 -165975 -85 -101450 -40751 212065 -176831 -18021 -113848 -148629 -170278 -197830
18555 -197830 97462 -238439 -219575 495023 -219659 -107551 -188765 96426 130179 -424931
18544 -233635 39989 98565 -96714 -46660 -12453 30350 -31600 -73996 154091 119968 -116495
18532 -274261 45555 318161 -164556 -206785 -6149 79213 -28250 -202504 156166 70908 -106545
18520 55159 26622 52434 150377 -72653 -133751 -202113 -187871 -150597 135662 1506 -43909 48296
18507 152851 63990 -27272 -478273 12814 181373 -112857 -67934 -130552 -17849 61386 -174319
18495 -137520 -97545 -50450 -101891 -171493 -119519 -63980 334137 -275560 -7686 399772 -202417
18483A40989a35339B7156J99825E2346J19004b1001k63512j00741A75047g4442
18472c15731g9532j67276B01824b27054e6622a2409q2637j20053I1964J0550L9969
18461A42483L0600a8375j03310o3040G4315b18765I6485c64911J50589A75721
18450C4406e1433G5382i7073A86506a39170N9016j35528i8424k3436J0943J3153
18439i7764D0605J11243a15952C81148A37987O4633E5192a0786j81502J4693j98474
18428c76069i3863L8950j07306L1941B06896b45866A6310K27526e7357j79329
18418b36686g1469j01708j37725F5171M7717l5645L4961L07534c01125q1667h7800
18406B63107q0423J02807A31329a23085k1427d7809j70085f8469C28838c24657
$$ plain form
18483 140989 -135339 27156 226981 52346 171350 -21001 -284513 -385254 175047 -74442
18472 -315731 -79532 -246808 201824 -227054 -56622 -12409 -95046 -215099 91964 102514 142483
18461 142483 173083 -18375 -121685 -184725 74315 -218765 96485 -364911 -214322 175721
18450 34406 -51433 75382 -97073 186506 -139170 -80154 -215682 -98424 -121860 -110917 -97764
18439 -97764 40605 151848 -115952 381148 137987 202620 55192 -10786 -192288 -177595 -376069
18428 -376069 -93863 -54913 -162219 -130278 206896 -245866 16310 243836 -57357 -236686
18418 -236686 -71469 -173177 -310902 65171 112888 77243 112204 419738 -301125 -382792 -87800
18406 263107 182684 285491 131329 -123085 -144512 -47809 -217894 -68469 328838 -324657
18395I1278a03911j18666A04689b51398b2096C34740b79772B14340a04478K9194
18385g5284o9116k7229A87130g6278C2196a93006A20502b30764g0932j17285Q8759
18374i9458A04957c01651A65087d0030k74293H6105o919c58118e4216C7394c43065
18362e1397A89729b30442A38362b74704a36568k9225j07981b6425A07069a75002
18351C32455A32062e8472A12064P006a65242N3674l9551A26689c33172a39807
18340a17663j02716N8046A89596h2274p2351B53758A15510b62280L3471I6744
18329a2568j40310n1241A26893M0907c6692l2323m85626a45270l11130e4896q582
18318f3478A28470J73490a29032N5397F610L33059b27706a09707m6246A73945
$$ plain form
18395 91278 -103911 -222577 104689 -251398 -22096 334740 -279772 214340 -104478 -75284
18385 -75284 -144400 -171629 187130 -76278 32196 -193006 120502 -230764 -70932 -188217 -99458
18374 -99458 104957 -301651 165087 -40030 -314323 86105 79186 -358118 -54216 37394 -343065
18362 -51397 189729 -230442 138362 -274704 -136568 -165793 -273774 -26425 107069 -175002
18351 332455 132062 -58472 112064 119070 -165242 -111568 -151119 126689 -333172 -139807
18340 -117663 -220379 -162333 189596 -82274 -154625 253758 115510 -262280 -228809 96744
18329 -12568 -152878 -204119 126893 167800 -36692 -69015 -554641 -145270 -456400 -54896 -63478
18318 -63478 128470 301960 -129032 -73635 6610 339669 -227706 -109707 -155953 173945
18307A17398B4046O8084C9905b80392H2193H394f204l8289j91382f5902P094B95278
18294d1514l4280B40645A3018a35378C98881a44241B29714d0879j65806C34225
18283a21588E3014J38749f7067k00079j93848a34060I7166J23644g30j4840B93615
18271g2793C83219A67274c44644h484A13006c3640B79215r2675a62980j6814B7403
18259A22657l343a33935f84A46012E7636b21235G948M3397J8313f9126m2775E4724
18246C59380a14878j59396A22080a05009A30777a24933l3249f0430A71108o3226
18236A07882a40480A21216K4184b86837I0121j1955a95430D6819J57539I9854
18225I0953K84428g5248c2774k18497A27653D8889h9304A38727D6666a72274h0224
$$ plain form
18307 117398 24046 92130 39905 -280392 82193 8394 -6204 -44493 -235875 -65902 -58808 295278
18294 -41514 -75794 240645 13018 -135378 398881 -144241 229714 -40879 -206685 334225
18283 -121588 53014 191763 -67067 -267146 -460994 -134060 97166 220810 -730 -15570 293615
18271 -72793 383219 167274 -344644 -8484 113006 -33640 279215 186540 -162980 -179794 27403
18259 122657 119314 -133935 -684 146012 57636 -221235 7948 51345 69658 -69126 -111901 54724
18246 359380 -114878 -274274 122080 -105009 130777 -124933 -158182 -60430 171108 107882
18236 107882 -140480 121216 145400 -286837 90121 78166 -195430 46819 204358 99854
18225 90953 375381 -75248 -32774 -251271 127653 48889 -89304 138727 46666 -172274 -80224
18213A11026l7935B6185J7482D369c99061H4805K3286D1954a02971F3395A0649
18201C16515a5000k85213m10426H2698a37472k06814G0068a95706h6621l3768
18191a20389E7316a34697l4416j804f5995A22566e8691b6031G2260J46274a54005
18179a67426H6566a16713j84980A99249D8017a49353M2169j06110D1947b48003
18168F7399A3860a60739M8535b2462B86656a08357j37083O8606I9005a75385A22622
18156a86024D7528J18788h5246j5052B55525d7268j41277j0537d1458k50347C95704
18144A22148d9977l2563D4937b53064J25539F5639l2274a27096r7909g1632C996
18132C6842A4689a54914L379E4036f0226C13349f0261K8378d662j28740B65468
$$ plain form
18213 111026 73091 26185 43667 4369 -399061 84805 108091 41954 -102971 63395 10649
18201 316515 -15000 -300213 -710639 82698 -137472 -344286 70068 -195706 -86621 -120389
18191 -120389 57316 -134697 -169113 -170917 -65995 122566 -58691 -26031 72260 218534 -154005
18179 -167426 86566 -116713 -301693 199249 48017 -149353 -107184 -213294 41947 -248003
18168 67399 13860 -160739 -112204 -22462 286656 -108357 -245440 -176834 99005 -175385 122622
18156 -186024 47528 166316 -85246 -100298 255525 -47268 -188545 -199082 -41458 -291805 395704
18144 122148 -49977 -82540 44937 -253064 -127525 65639 33365 -127096 -225005 -71632 3996
18132 36842 14689 -154914 -151535 54036 -60226 313349 -60261 -31883 -4662 -133402 265468
18120b92645C7207L06068p0798c8651C17816A15196J2425a05299L994A48950i2109
18108b86602K2654P5639A14369D679J84201a6943C12857A51257b0000A00819J82421
18097B83240a2785l1275D2093c18940r3894c1177B07737a50426g594r1463j22469
18086b21526B25262b8694j57424e8685E1576J21181E8614k7868c28324B7539d1867
18074H9787a98094f1216A31001l5761a88504N4771E6687N2338f0962B94946a08695
18062B68402A27002K54969c44044B88861c9939j56026j34197f317A13382J8645
18052A32027k8658b40696o9691A25978c67141A24897b55410A89216a00998B07140
18041a43975O8083B9572c4346j16598O5618J1378A51019d66707C4530K40099c27035
$$ plain form
18120 -292645 37207 343275 272477 -38651 317816 115196 127621 -105299 -101305 148950 -92109
18108 -286602 -263948 -188309 114369 4679 188880 -16943 312857 151257 -20000 100819 283240
18097 283240 -12785 -44060 42093 -318940 -412834 -31177 207737 -150426 -7594 -99057 -221526
18086 -221526 225262 -28694 -186118 -58685 51576 172757 58614 30746 -328324 27539 -41867
18074 89787 -198094 -61216 131001 95240 -188504 -133733 56687 109025 -60962 294946 -108695
18062 268402 127002 381971 -344044 288861 -39939 -195965 -330162 -6317 113382 132027
18052 132027 103369 -240696 -310387 125978 -367141 124897 -255410 189216 -100998 207140
18041 -143975 -75892 29572 -34346 -150944 -85326 -73948 151019 -466707 34530 274629 -327035
18029g7463A73901a80545J1872C9382J40976B7447b23769a5351H5342c09686C2292
18017a63856A63486a76628B56280a00041i189D27278g2732B03548C8005c8942
18006b06833h9958M4781j33446A24658a79830B77152c4064A67272g2915A20146
17995a85021A62765p7004O8443a84257F5499k8583R5577N4833J29604d3073A03231
17983A08610b59450J12984f8087C334b00125F7258e3199C1491f9718b4103k26240
17972b50343k1587A80822K31694A51529R0793g5012O376B51347d9025l68760b9662
17960G5565a08183A4271J02809m4290C1025K01172j3578h6211d0991J2098G6981
17948A86691a73272A07319J62845B9290Q9102f4579a5253q1943E778L29322F3357
$$ plain form
18029 -77463 173901 -180545 -168673 39382 180358 27447 -223769 -15351 85342 -309686 32292
18017 -163856 163486 -176628 256280 -100041 -9189 427278 -72732 203548 38005 -38942
18006 -206833 -89958 -45177 -178623 124658 -179830 277152 -34064 167272 -72915 120146
17995 -185021 162765 85761 154204 -184257 65499 36916 132493 187326 316930 -43073 103231
17983 108610 -259450 -146466 -68087 3334 -200125 67258 -53199 31491 -69718 -24103 -250343
17972 -250343 -271930 180822 412516 151529 242322 -75012 -68636 251347 -49025 -417785 -29662
17960 75565 -108183 14271 117080 72790 31025 232197 218619 -86211 -40991 -28893 76981
17948 186691 -173272 107319 270164 29290 118392 -64579 -15253 -97196 5778 335100 63357
17936a82696E7010N1459C8887O6016c3515A56524b8776j7434A14496i8059n5123
17925a53182L8866D4548c45715A25206a3068D25296f3399K5711D5035J5293L10569
17914C70897b45787e4992E2585P9304m2048B2089c7035j44945D3626J78839N8665
17903B81130E2071a82420A52977L2140a70969A6164J92678b19445p2144A80867
17892a94233a4792B6632K14769C5924b89225a05080B18479e4818E18799F3022
17881A14038g5170A2338M85331A01965a3130B47373n9158g2834A37181b07768
17870g8735k82804B70996b03769E0774M3470b08893G4426C2860a01290b0305A26213
17858a49507A84717G0735a65729I3786h8104D9071a19247E4578E144K29064b98416
$$ plain form
17936 -182696 57010 108469 38887 104903 -33515 156524 -28776 -46210 114496 -98059 -153182
17925 -153182 -114316 44548 -345715 125206 -13068 425296 -63399 -37688 45035 60328 370897
17914 370897 -245787 -54992 52585 131889 89841 22089 -37035 -181980 43626 222465 281130
17903 281130 52071 -182420 152977 185117 -170969 16164 208842 -219445 -291589 180867
17892 -194233 -14792 26632 241401 35924 -289225 -105080 218479 -54818 518799 63022
17881 114038 -75170 12338 497669 101965 -13130 247373 188215 -72834 137181 -207768
17870 -78735 -361539 270996 -203769 50774 94244 -208893 74426 32860 -101290 -20305 126213
17858 -149507 184717 70735 -165729 93786 -88104 49071 -119247 54578 5144 234208 -298416
17846A05716K40212i6649D0496A0448R9293a51164A52986a58812k9937A54245
17835a2810E7163a43489F0928g3800A63123l4121n3034J59882A04804a63386E2695
17823A04349a13121A89420o8324C5390a47662a8259B84164a53043D7463K24943
17813B72406p4601I1036h3125k821K0952H7634N3738a94898A56003e5662D7391
17801i0045G0391c3852a4772D1520a58822o0376F3241a35431r2024l1964g7451
17789B09192b21380C46964D1713K96750a8125A73221d1889A31652O1696e0722
17778C7945D725J22116g9629o5789L2241D9873b07758P2265A2605a76742O5347
17767a11395B05276J0203o0615d2124C9102c11473d0442m4087o5740A93170r4862
$$ plain form
17846 105716 345928 -96649 40496 10448 109741 -151164 152986 -158812 -188749 154245
17835 -12810 57163 -143489 60928 -73800 163123 129002 75968 235850 104804 -163386 52695
17823 104349 -113121 189420 121096 35390 -147662 -18259 284164 -153043 47463 272406
17813 272406 197805 91036 -83125 -85946 -64994 87634 141372 -194898 156003 -55662 47391
17801 -90045 70391 -33852 -14772 41520 -158822 -219198 63241 -135431 -227455 -259419 -77451
17789 209192 -221380 346964 41713 338463 -18125 173221 -41889 131652 193348 -50722
17778 37945 4725 126841 -79629 -145418 -113177 49873 -207758 -135493 12605 -176742 -111395
17767 -111395 205276 215479 154864 -42124 39102 -311473 -40442 -84529 -150269 193170 98308
17756I8308e6029C115J87333G1191K988A1377L68949e7306E5708j3063P4351D5385
17743A46646b25707h7496G0667c62134E2201q321M5208K46933f645D6797a50786
17731G2508K1507D6716K44055E2153a37304e9039D2766L764M9505k0252j0795
17720F4988e9478A80547G6823M7706J70869A4978J25776b02308d9753m1471j70900
17709b62124a27086C90884A37771b6957A89782E8615d17063B57735E5832L45656
17699D01488a3667F8288B8205N7780B5934P0853K6530J26181E9759b95226B36544
17687D15114F6197A0883J58300F8888J50199r3503N8299o3406e30218a92915A71120
17675a33615M0339B25696j2001L8843l3659M9376R7883i4826A3018J05212a16101
$$ plain form
17756 98308 -56029 3115 190448 71191 74179 11377 380326 -57306 55708 42645 116996 45385
17743 146646 -225707 -87496 70667 -362134 52201 43880 89088 336021 -6645 46797 -150786
17731 72508 94015 46716 290771 52153 -137304 -59039 42766 46530 96035 75783 64988
17720 64988 -59478 180547 76823 124529 295398 14978 140754 -202308 -49753 -91224 -262124
17709 -262124 -127086 390884 137771 -26957 189782 58615 -417063 257735 55832 401488
17699 401488 -13667 68288 28205 85985 25934 96787 123317 249498 59759 -295226 236544
17687 415114 66197 10883 169183 68888 219087 125584 183883 120477 -530218 -192915 171120
17675 -133615 -93276 225696 213695 252538 218879 268255 366138 -94826 13018 118230 -116101
17663f2435A79691H1360J37213n1363M934F2931O816J82300C2473d9992E57353
17651c5925B37537b64447A31410M6773a00825K7350B51248n6334a06017L8615
17641f7402A59486G4928k3389a1234j00620H5506K03555L2508F262c61365D7924
17629E8864b69915A09795j6974k210J66167b65801F2583a65845G3357K52941j05325
17618B20973J94635A62853i3554M3190A80197A8071n821J28436N0324p0392R3226
17607B13844k2058b00088B64421b4083B70680I4420B3597J38269M38879f3195
17596b33240i0045F155J79885b89323H9419k2849a25958r3532D01081H9367K33596
17585C22963e3712A72754J62565m8678m8175p775a79921g5602A89711J09060G7844
$$ plain form
17663 -62435 179691 81360 218573 167210 172144 62931 69747 252047 32473 -49992 557353
17651 -35925 237537 -264447 131410 178183 -100825 -73475 251248 194914 -106017 -67402
17641 -67402 159486 74928 51539 -11234 -111854 85506 289061 321569 6262 -361365 47924
17629 58864 -269915 109795 92821 90611 256778 -265801 62583 -165845 73357 326298 220973
17618 220973 415608 162853 -93554 -50364 180197 18071 12250 140686 191010 120618 213844
17607 213844 191786 -200088 264421 -24083 270680 94420 23597 161866 600745 -63195
17596 -233240 -90045 6155 186040 -289323 89419 66570 -125958 -219490 401081 89367 322963
17585 322963 -53712 172754 335319 286641 238466 230691 -179921 -75602 189711 298771 77844
17573E9676J55098b0403j0109D0687K80318Q1783A23469c72201B9838i1054n5327
17562a46381B97597a45491A45043b7868j25537G7253a11927A90577q6793k2843
17552H0941J90948J06627b8121A32723a04617f714H1909J04297K31029j59909
17542B57326G5671K5484J89243B7843K68815r1988K40444B06722N3617F3717K93847
17531C57564j63562k4939Q126A6861L58159p4143J53508n2855J60673K82435l79730
17520D64908K22266k01037J3197A38590M2428K78207L860A00567K32219J14516
17510D47302p7350L18847q8616j85595K03266j78140K21A83623M5497J53655J17305
17499E00080i9086A46817O2246a00178C05077A32937L60699B24667K04984k11619
$$ plain form
17573 59676 214774 -20403 -30512 40687 321005 402788 123469 -372201 29838 -91054 -146381
17562 -146381 297597 -145491 145043 -27868 -153405 77253 -111927 190577 103784 80941
17552 80941 271889 378516 -28121 132723 -104617 -6714 81909 186206 417235 257326
17542 257326 75671 101155 290398 27843 296658 204670 445114 206722 260339 63717 357564
17531 357564 194002 169063 177189 16861 375020 300877 454385 401530 562203 844638 464908
17520 464908 687174 486137 499334 138590 181018 459225 463085 100567 332786 447302
17510 447302 369952 688799 600183 414588 617854 439714 439935 183623 229120 382775 500080
17499 500080 -99086 146817 209063 -100178 305077 132937 493636 224667 429651 218032
17489B18032O3675n5384I8829D6811J37809J8736I9262Q1213K76238B13839K09012
17478D22851g4796B51883A25630L57611J37429A8441L24224F0158h5789D10343
17467B25773N2402G4165C5146K45937J77055o4941p4683G5609A7127J3296K16146
17456B46569C1684L98363m8126L0244k7886j82217M26285B77200L90898l22082
17446C46016j56322L54967J44598L1967j25606k33968k3313J38615B20109M59992
17436F80101j98985L07803K3201B50082Q1733I7207J18527M5857J90205l241k03608
17425B44947K06714j08065l1551M46415q7430m2183B93910K13037O3078F6231
17414F85473J39995l74895J23080q6497Q4562J5733k4287k76826J8553j6070H5198
$$ plain form
17489 218032 281707 226323 98829 46811 184620 203356 99262 180475 456713 213839 422851
17478 422851 -74796 251883 125630 483241 620670 18441 342665 60158 -85789 410343
17467 225773 278175 74165 35146 281083 458138 393197 318514 75609 17127 30423 246569
17456 246569 31684 430047 381921 412165 384279 202062 628347 277200 668098 346016
17446 346016 189694 544661 689259 721226 595620 361652 338339 476954 220109 680101
17436 680101 481116 788919 812120 250082 331815 97207 215734 261591 451796 448555 244947
17425 244947 451661 343596 312045 758460 671030 628847 293910 506947 570025 66231
17414 685473 825468 450573 573653 487156 571718 587451 563164 286338 304891 288821 85198
17402C29613q917I6583L20613A01734K0309L4773l2221K12787J05076A91244K89086
17391D80330j00274J65419b070C99042A277O00593E6756c0099E5217R6878a40703
17379A98997M9395e0103F51023a1402B97813J62196h3717D11137j43655R2494
17369C59976c1328j86669D21042j58920r0354L12444b47063B42360q6295Q2558
17359B38623G1476M50062j41151A74910g5427C10078j2149j09111R8702j14795
17349A72725M12227k09056J2903o1909J67813j56331j6563K00107k25899q4764
17339B11253K09666A46206r458K19182a15344A58688a9223A77950K5828J3493
17329B17271n8354F8795Q3301K7545K08560A03212K40428p0824E4569K97953l4312
$$ plain form
17402 329613 320696 96583 417196 101734 122043 156816 124595 337382 442458 191244 480330
17391 480330 380056 545475 -2070 399042 1277 601870 56756 -30099 55217 152095 -140703
17379 198997 248392 -50103 651023 -11402 297813 460009 -83717 411137 267482 359976
17369 359976 -31328 -217997 421042 262122 171768 484212 -247063 242360 156065 238623
17359 238623 71476 521538 380387 174910 -75427 310078 297929 188818 287520 172725
17349 172725 584952 375896 388799 326890 494703 338372 321809 521916 296017 211253
17339 211253 420919 146206 136748 355930 -115344 158688 -19223 177950 203778 217271
17329 217271 158917 68795 152096 179641 388201 103212 343640 272816 54569 352522 318210
17318C18210j35919o8474M5061L111e8705B76862R934A41537c41954C71080L8449
17307D09529o0683A33142K64317C8405L08054A12781L02184L7247j88161P4430
17297C38481m5772H6536J28624G7566O77276A99432H0315K83649A36276K16836
17287C53112p8188J4893o1915J05498K07453j95038r1902p288O382K71622j1277
17276E13352A73810a2371A49195Q0639M8413o2569J12559o506J84279k26069n6677
17265B23264L9882j10450K54408j28414L84994A34330L04448F5530J47933L26094
17255E39557k17360k6939R1109j23343k674l1969K86611j95806r4392d856D59921
17243C86219A66000L3367Q1362J31161A36498J5215K11616A49915L69338B04125
$$ plain form
17318 318210 182291 113817 158878 161989 -58705 276862 286796 141537 -341954 371080 409529
17307 409529 348846 133142 397459 38405 346459 112781 414965 452212 264051 338481
17297 338481 292709 86536 215160 77566 754842 199432 80315 363964 136276 353112
17287 353112 274924 289817 227902 333400 540853 345815 253913 246625 253007 524629 513352
17276 513352 173810 -12371 149195 229834 278247 215678 328237 321731 506010 279941 223264
17265 223264 263146 152696 407104 278690 663684 134330 438778 65530 213463 539557
17255 539557 322197 295258 386367 263024 260350 228381 514992 319186 224794 -4856 459921
17243 386219 166000 199367 280729 411890 136498 151713 363329 149915 519253 204125
17232F01622A34000K08169o3101K62261k36607j23546J9463n3409J37464J31146
17222D15840j54114K18020A65271K31084A64186Q2477e4771E16426O5597A56378
17211A57114M54384B91377K78600b1029A37848N80007B24538p511C7660L95700
17201D33360K36332k09639j02935m1368J13669j5823P4428A82487N4083L1115
17191B67685J57430J40463A88778M36539B59533M60867k84157J08607n8283Q6652
17181E73219q1079B45233K07438H1065L39427J42371H2421N88587r3809B52707
17170E57700K0986k70995R904K40386c4820D47112B8730L32728r5477L76180j91706
17159D50455r7636J48227j79855P3505J61213A46443O18314k51653J25903C04445
$$ plain form
17232 601622 134000 342169 279068 541329 304722 181176 200639 147230 284694 415840
17222 415840 261726 479746 165271 396355 164186 246663 -54771 516426 582023 156378
17211 157114 611498 291377 569977 -21029 137848 717855 224538 217027 37660 433360
17201 433360 669692 460053 357118 315750 429419 413596 488024 182487 236570 267685
17191 267685 425115 565578 188778 625317 259533 720400 436243 544850 486567 573219
17181 573219 492140 245233 452671 81065 420492 562863 82421 671008 577199 252707
17170 557700 578686 307691 317595 557981 -34820 447112 28730 361458 265981 642161 450455
17159 450455 352819 501046 321191 394696 555909 146443 764757 513104 639007 304445
17148D59242j3571A85456M94443C22279J10673K8954k0322R1278O4498Q4802j80825
17137E01337j87793J48976k18116K02729l1350L51478o3523J94684l00075L06190
17127I04537j89523k61691j7213L57421R6560j83426A05457K49077j67253K77661
17117D64942O26558D41697J28607L7497j44889M23101B39645K44238r5686K39699
17107F27896K33429k83830K154j87397K67794j40612L42254j49123K96653m42328
17097E66890K95522k56304J74210j59592r8820L40129k4650M2314k41889j05229
17087E32581L34427R589l28016K19417J69024C75929L21613j49192J59300K68188
17077I75838j96098j75557L75082l09307C24786L84465L4665k221j77018L38994
$$ plain form
17148 459242 445671 185456 679899 322279 432952 461906 441584 532862 597360 682162 501337
17137 501337 313544 462520 244404 447133 415783 767261 703738 898422 598347 904537
17127 904537 715014 453323 436110 793531 890091 706665 105457 354534 187281 464942
17117 464942 1091500 441697 570304 607801 462912 886013 239645 483883 388197 627896
17107 627896 861325 577495 579649 392252 660046 519434 861688 712565 1009218 566890
17097 566890 862412 606108 780318 620726 521906 862035 837385 879699 637810 532581
17087 532581 867008 876597 548581 767998 937022 375929 697542 548350 707650 975838
17077 975838 779740 604183 979265 669958 324786 709251 743916 741695 564677 903671
17067I03671l90518L59118m4412K09086o856l89654N987J94451r5227J15417j44657
17056G16406n746l22932N3832M87830l03230j28272K42343j8388M22766m49603
17046F95006J42408J54270J01914J15833l62095J27924o5576K73630l73356J08952
17036I18910j19823r1210J34896J05800k9945r6095J95129J74534l27919R3070
17026I57347L19657o5265j85634J29686m9773k95399J02512O9542K56682m8616
17016A190739l98148L33348L5861n1181q2212k42919M72043Q9557k11351k9521
17006A106216n414o4310j8745r4149J66286J20564j77919k37787N01893Q3163
16996A379798m46485k7354L11444P5994J4906j60437L00539m91371K70610O0113
$$ plain form
17067 903671 513153 872271 827859 1036945 1030089 640435 646422 840873 745646 861063 716406
17056 716406 710660 387728 441560 929390 626160 497888 740231 721843 1144609 695006
17046 695006 837414 991684 1093598 1209431 847336 975260 909684 1183314 809958 918910
17036 918910 799087 707877 842773 948573 918628 822533 1017662 1192196 864277 957347
17026 957347 1277004 1211739 1026105 1155791 1106018 810619 913131 982673 1239355 1190739
17016 1190739 792591 1125939 1161800 1110619 1028407 785488 1257531 1347088 1135737 1106216
17006 1106216 1100802 1036492 1017747 923598 1089884 1210448 1032529 794742 1296635 1379798
16996 1379798 933313 905959 1217403 1293397 1308303 1147866 1448405 957034 1227644 1287757
16986A287757K67959k52065O1434J56653l52801K05775Q0200R4113p7055k43458
16976A228512K01369j8472J55488R8343j86606j47359k84899N34133K65928o98765
16966A147672K56647K5717L2188m1779J05981k81345K63372J53817K70272n40253
16956A392289P2466K12931o3277k32834N59372m38637K36991j3169j18910q6187
16946A521035J00291J90579l66732P03937l37290K31632P426j69143K3707j5749
16936A889693o221L914K55324k11969N1617K55480j96687Q98N9842k6503J0900
16925B086288l81176N04671R1561l19750L33382J34973l89010L37352L0864l38107
16915B091048J29923K17320J3032j68631J54378M66438m40328L68158m88686L08014
$$ plain form
16986 1287757 1555716 1303651 1365085 1521738 1168937 1374712 1454912 1549025 1471970 1228512
16976 1228512 1429881 1411409 1566897 1665240 1478634 1331275 1046376 1580509 1846437 1147672
16966 1147672 1404319 1430036 1462224 1420445 1526426 1245081 1508453 1662270 1932542 1392289
16956 1392289 1464755 1677686 1614409 1381575 1940947 1502310 1739301 1726132 1607222 1521035
16946 1521035 1621326 1811905 1445173 2149110 1811820 2043452 2050878 1881735 1905442 1889693
16936 1889693 1883472 1887386 2142710 1930741 1982358 2237838 2041151 2042049 2101891 2075388 2086288
16925 2086288 1705112 2209783 2301344 1981594 2314976 2449949 2060939 2398291 2429155 2091048
16915 2091048 2220971 2438291 2451323 2282692 2437070 2903508 2463180 2831338 2342652 2650666
16905B650666N3824J59488k07156J55524L9300k11393N0993K39058j94991K1537
16895B756850p1000K58485Q2494l12758J62882N8534M18333n25108L99822K5768
16885C254302j73932J06185K26164n8581J45965J55868k18809j9583L91313k17085
16875C591807J8493J16096M1947K02197k64039J05766J97884J11491J31818P812
16865D261272k04576L68438j78774L14487m191l2880J19132k48707M34906L9367
16855D868474k44786Q5868N58501l97399N31575k60750O79716n55261M49378J67505
16845E882821l65649N2355L10112j79651K37653L61863k63509J76223K07251k156
16835F417313M72881J30130k08773O21632m49988K09988J96150J06100m9009L42826
$$ plain form
16905 2650666 2704490 2863978 2656822 2812346 2851646 2640253 2691246 2930304 2735313 2756850
16895 2756850 2685850 2944335 3026829 2714071 2876953 2935487 3353820 2828712 3228534 3254302
16885 3254302 3080370 3186555 3412719 3354138 3500103 3655971 3437162 3417579 3808892 3591807
16875 3591807 3610300 3726396 3768343 3970540 3706501 3812267 4010151 4121642 4253460 4261272
16865 4261272 4056696 4425134 4246360 4560847 4556656 4523776 4642908 4394201 4829107 4868474
16855 4868474 4623688 4709556 5268057 4870658 5402233 5141483 5821199 5265938 5715316 5882821
16845 5882821 5517172 5569527 5879639 5699988 5937641 6299504 6035995 6212218 6419469 6417313
16835 6417313 6890194 7020324 6811551 7433183 6983195 7193183 7389333 7495433 7446424 7789250
16825G789250K75066j3985k42700N21775J52037K62081j22567O33656j67225M8833
16815I136221L28282K23912L0821L47099K11220j24487P33776K51199j37233O55765
16805A1656575j76440L78352J48462K39994M60879J54869O05518L68538N029K03985
16795A4045761R55381O269M72262L42747J37807L98649L64814K91201P47817K59763
16785A8022471M44796R33921P34915N04825L7898R53592O82785P29907L52840
16776B3397950J137043L86079P93820N57466P28581Q59436J234960R05825R87970
16767C0989130J158405J229141O99723J305348J199829J637633J302838J221012
16759D0743059J309692J855000J477159J657550J590145K466378J741060K279062
$$ plain form
16825 7789250 8064316 8050331 7807631 8329406 8481443 8743524 8620957 9254613 9087388 9136221
16815 9136221 9464503 9688415 9719236 10066335 10277555 10153068 10886844 11138043 11000810 11656575
16805 11656575 11480135 11858487 12006949 12246943 12707822 12862691 13468209 13836747 13841776 14045761
16795 14045761 15001142 15007411 15479673 15822420 15960227 16358876 16723690 17014891 17762708 18022471
16785 18022471 18467267 19401188 20136103 20640928 20678826 21632418 22315203 23045110 23397950
16776 23397950 24534993 24921072 25714892 26272358 27000939 27860375 29095335 30001160 30989130
16767 30989130 32147535 33376676 34076399 35381747 36581576 38219209 39522047 40743059
16759 40743059 42052751 43907751 45384910 47042460 48632605 51098983 52840043 55119105
16751E5119105J377737K741394J868419K483133K696845K761526K735607K645156
16743G4428922L165865K830687L175677L124842L067095L596201L291410L600506
16735A00281205K848329L614686L291458L357504K993619K681360K770405K967324
16727A24805890J856097K301595J394165J251833J085049J26499K66107l98277
16719A32688958r64853j163069q84634k142518k061503k570077k483605l190941
16711A17227758l130622l023047l386675l772297l115371l475101l340821l273272
16703I0710552l358810l485525l365664l064093k989657l003623l020246k661558
16695F5761376k506848k377803k377288k262820k137189k314705j855627j758281
$$ plain form
16751 55119105 56496842 59238236 61106655 63589788 66286633 69048159 71783766 74428922
16743 74428922 77594787 80425474 83601151 86725993 89793088 93389289 96680699 100281205
16735 100281205 103129534 106744220 110035678 113393182 116386801 119068161 121838566 124805890
16727 124805890 126661987 128963582 130357747 131609580 132694629 132821128 133087235 132688958
16719 132688958 131724105 130561036 129676402 127533884 125472381 122902304 120418699 117227758
16711 117227758 114097136 111074089 107687414 103915117 100799746 97324645 93983824 90710552
16703 90710552 87351742 83866217 80500553 77436460 74446803 71443180 68422934 65761376
16695 65761376 63254528 60876725 58499437 56236617 54099428 51784723 49929096 48170815
16687D8170815k230091j312669j814751j900420j392598j086461j675814r17555
16679C5840456j841612j014975r88581j279933q49250j275123o34508j092154
16671B6864320n79991j135869l77937j475138l34906r06343p08406n53083m65846
16662B0326801q49234l88085n21007n02388o36808n54212l43165m28639n33682
16653A5569581l33807n09295j68624l34711n47850j63598l87840m39086l4365
16644A2650405n61006l48834p1426P0591q33597M0959n13429l70081J79084k98645
16634I944021j34281m50571q5394j62755m21605L4213m38245j49837Q9762n68377
16624G656931J37511j83845m4568M4033p47469K82180j86962m2444K8995n61743
$$ plain form
16687 48170815 45940724 44628055 42813304 40912884 39520286 38433825 36758011 35840456
16679 35840456 33998844 32983869 31995288 30715355 29866105 28590982 27956474 26864320
16671 26864320 26284329 25148460 24770523 23295385 22960479 22054136 21345730 20792647 20326801
16662 20326801 19477567 19089482 18568475 18066087 17429279 16875067 16531902 16103263 15569581
16653 15569581 15235774 14726479 14557855 14223144 13675294 13511696 13123856 12684770 12650405
16644 12650405 12089399 11740565 11669139 11739730 10906133 10947092 10433663 10063582 10242666 9944021
16634 9944021 9809740 9359169 9273775 9111020 8689415 8723628 8285383 8135546 8225308 7656931
16624 7656931 7794442 7610597 7566029 7610062 6862593 7144773 6957811 6915367 6944362 6382619
16614F382619K34950l13490l250j53734j58507l13287j8541P1034l9639o4068
16604E624087n7741j60958k99106q0814R7007j80613j16867m18857J30547L58844
16594D895529m46162k3868L18492o61402J6279p3246n9013N16820k88709r5144
16584D099576k06366p3984J14055l79577r283M04183k55048l28583K17644l66358
16574C216259M21464q2811j42831j5367l86958L84182j48472O4106l09379K9208
16564C029401j53721L71767j72803o5931j13032j50512j50787J50252K20126l87084
16554B577676M61790k90704l85908J32176q1301J3953l00600J84003K44643k16697
16544B339031k1290K6342K35004o0447l52608j67000J53483k63923l6745L03031
$$ plain form
16614 6382619 6617569 6304079 6300829 6147095 5988588 5675301 5656760 5727794 5688155 5624087
16604 5624087 5566346 5405388 5106282 5025468 5122475 4941862 4824995 4406138 4536685 4895529
16594 4895529 4449367 4425499 4743991 4082589 4098868 4025622 3966609 4483429 4194720 4099576
16584 4099576 3893210 3819226 3933281 3553704 3544421 3948604 3693556 3364973 3582617 3216259
16574 3216259 3637723 3554912 3412081 3396714 3009756 3393938 3245466 3309572 3000193 3029401
16564 3029401 2875680 3247447 3074644 3008713 2895681 2745169 2594382 2744634 2964760 2577676
16554 2577676 3039466 2748762 2362854 2495030 2413729 2427682 2127082 2311085 2555728 2339031
16544 2339031 2317741 2344083 2579087 2518640 2166032 1999032 2152515 1888592 1851847 2154878
16534B154878J87530l87133L04694k91433J5589N9967j93145L0267Q3666l7815
16524A927065j66728K82696k4273m03725J099J16976J9411J74459m79998j02012
16514A344970N74707n2220n89333N26233j78149j63189j6973J33043l8118m99651
16504A041320P95782m30803P6918j91314J34452J42790q4310n3670l0287K81366
16494A682244q5459j67623j24179j06028L72886k39449j8200R9466j544j61806
16484A250308J2657M4959k84948K15371k29680J39640M5780l59072N8535Q8625
16474I82175J5879J91357M3827j24980L1331N2187j04371l83957K21500K61052
16464A186000j35604l28275J25712j53211L47273l24717K33337R9815n1245j10383
$$ plain form
16534 2154878 2342408 1955275 2259969 1968536 1984125 2044092 1850947 1881214 1964880 1927065
16524 1927065 1760337 2043033 2018760 1615035 1616134 1733110 1752521 1926980 1446982 1344970
16514 1344970 1919677 1867457 1278124 1804357 1626208 1463019 1446046 1579089 1540971 1041320
16504 1041320 1837102 1406299 1483217 1291903 1426355 1569145 1484835 1431165 1400878 1682244
16494 1682244 1596785 1429162 1304983 1198955 1571841 1332392 1314192 1413658 1412114 1250308
16484 1250308 1262965 1307924 1022976 1238347 1008667 1148307 1194087 835015 893550 982175
16474 982175 998054 1189411 1233238 1108258 1139589 1191776 1087405 703448 924948 1186000
16464 1186000 1050396 722121 847833 694622 1041895 717178 950515 1050330 999085 888702
16454H88702R0149k83892J38152p6662J40430k57910K71504j1394j00018L73785
16444A172846k07249N8950n799l47697j86057P65039m06402M7794J55490m22917
16434F23998J32462j74800K90350C94802N5167M46225m21342L99478l19694K16687
16424G71323k6237M1279k35726K74426O1989k89133k0935o0836J07487L1805J16225
16413G71667j5076j6858K32461D56542L46313j92759r0379J44508k08334J43728
16403E99619j33655j9393K24393k7725k7414K35604r4105j77227J05555N7687
16393G43339A39288N09860j95824N07946B41302M69637J24115j63198m9624k39614
16383C82618q0394L09850j73301L49153k15052r3805j30604C1672M88298o6614
$$ plain form
16454 888702 978851 694959 833111 756449 896879 638969 910473 899079 799061 1172846
16444 1172846 965597 1024547 1018748 671051 484994 1250033 843631 891425 1046915 623998
16434 623998 756460 581660 872010 394802 449969 896194 474852 874330 554636 771323
16424 771323 745086 786365 550639 825065 887054 597921 576986 516150 623637 655442 771667
16413 771667 756591 739733 972194 456542 802855 610096 519717 664225 455891 599619
16403 599619 465964 446571 670964 643239 615825 851429 757324 580097 685652 743339
16393 743339 139288 649148 453324 961270 241302 710939 835054 671856 622232 382618
16383 382618 302224 612074 438773 787926 572874 479069 348465 31672 519970 453356
16373D53356K12904K3062k88558Q6534J18662j26122k11522K5374K22036P8274
16363E94000j07627j59334Q0035K00727r8268j59870J17137J08599D5232K05991
16353B51223L14935G0428L71464J32211k02268j07183A10916M52934A82429K4071
16343B06500M68770B78058M6139K24358J72540G4790K46093A08092J17403k747
16333B22748J33232o9403A40913K26922K22159o4699k52876M7166H243K59345
16323B67588R9186A71263J54679O0787J21214J2045k52174J96290j13530A04982
16312H195K70680I6515Q7178M16199k55906r6484N5684I081J09891l2746L4005
16301A20231K56123A08316J73671R8667A54485M15350k58318J71627k35054J64453
$$ plain form
16373 453356 666260 689322 400764 487298 605960 479838 268316 293690 515726 594000
16363 594000 486373 327039 407074 607801 509533 349663 466800 575399 45232 251223
16353 251223 566158 70428 441892 574103 371835 264652 110916 563850 182429 206500
16343 206500 675270 278058 324197 548555 721095 74790 320883 108092 225495 222748
16333 222748 355980 286577 140913 367835 589994 525295 272419 319585 8243 267588
16323 267588 366774 171263 325942 386729 507943 519988 267814 464104 350574 104982
16312 8195 278875 96515 183693 599892 343986 247502 303186 9081 118972 86226 120231
16301 120231 376354 108316 281987 380654 154485 569835 311517 483144 248090 412543
16291D12543i9779A93720J26566a7007B84517J08645j09331A11805O4398C1095
16280B37324J50083p5565p4625r288K2956R8978A16575R3044M4080p6771K08436
16269C85364Q1526C12K945J43268L0885K2992q0710J96807j46434J58640K8993
16258C57698j62584E5813f3636C02733A15479K17254M337o9057a6201C80736K12882
16247E93618B87949O7059E1817M1593j1321K04718C3755J0877K50894K2007E5355
16235B5016N2035L71592H958b14134C6671J22390J35325o2429A1602J57822P988
16224A77412j0384l9417K1301j610M4667G2225J26423q9155B1407J74505O5382
16213B61294d3474B49163j5045C297J87501k8191K53446p5804J5052A14425k7831
$$ plain form
16291 412543 -99779 193720 320286 -17007 284517 393162 283831 111805 176203 31095
16280 237324 387407 311842 237217 227929 250885 349863 116575 209619 253699 176928 385364
16269 385364 466890 312 3257 146525 177410 200402 119692 316499 170065 328705 357698
16258 357698 195114 55813 -63636 302733 115479 332733 337070 268013 -16201 380736 593618
16247 593618 287949 355008 51817 93410 82089 286807 33755 44632 295526 317533 55355
16235 25016 77051 448643 8958 -214134 36671 159061 294386 231957 11602 169424 177412
16224 177412 167028 127611 148912 147302 191969 72225 198648 109493 21407 195912 261294
16213 261294 -43474 249163 234118 3297 190798 162607 416053 340249 355301 114425 86594
16202H6594N3408l8363c415B81075d06028a03843D23539j97678C6403I125J28475
16191A37600J7616a39825a8605j31378B08729q5207K26363A18695b57587C5139
16180C38919j61109a8672j68045B47346f184B81492A19420a79152A18621j6926
16170A01695f614F2973a63477A68652J61834k1705r6838P8182J04286q1957a85906
16158a702C98729H7355Q2567E0402R7692J11294q3995i6462G7116g5411n8079
16147a33490D69533A7385J40445b9390j52831B42063b50257C01109e298B4048
16136h7562B3203a11276E2330c9607A58844n6107i2845E2760a8359D8809R7199
16125A46008K8968a36273I1339J02084N214b7243A01308i4220m9474f909E9537
$$ plain form
16202 86594 140002 101639 -3415 281075 -406028 -103843 423539 225861 36403 9125 137600
16191 137600 155216 -139825 -18605 -149983 208729 123522 349885 118695 -257587 35139
16180 338919 177810 -18672 -186717 247346 -6184 281492 119420 -179152 118621 101695
16170 101695 -6614 62973 -163477 168652 330486 308781 211943 290125 394411 312454 -185906
16158 -1702 398729 87355 169922 50402 148094 259388 175393 -96462 77116 -75411 -133490
16147 -133490 469533 17385 157830 -29390 -182221 242063 -250257 301109 -5298 24048
16136 -87562 23203 -111276 52330 -39607 158844 102737 -92845 52760 -18359 48809 146008
16125 146008 174976 -136273 91339 193423 198637 -27243 101308 -94220 -143694 -6909 59537
16113b11193A54075a35684C11778I8782L8088n1764J13209m7468J20889j31785
16103A39951D2923a42635G9872b23300A78236F2535A0552f3586B12992c08749
16092c01816B91829A3083R5753a05867A68132i8417A80925a35759A19198i4422
16081I7108c00722B10287a119l0729A83462m6941a72492j2120F530f9654C7196
16069A71450b97001g4673H6067J12052a55643A0700M6628a19204L2913A01616
16058B63740m175r0071J14271c8581j05066A38167f163I130Q4438b24031E6095
16046A33498l1031A9335a90056a1615A16347j8616b75630E7189j061b73962M612
16035b69350A44109a32422b5887n3535e924A31057m764a50126i459B07517b54913
$$ plain form
16113 -211193 154075 -135684 311778 98782 136870 85106 198315 150847 271736 139951
16103 139951 42923 -142635 79872 -223300 178236 62535 10552 -63586 212992 -308749
16092 -301816 291829 13083 108836 -105867 168132 -98417 180925 -135759 119198 -94422
16081 97108 -300722 210287 -1119 -31848 183462 136521 -172492 -184612 6530 -69654 37196
16069 171450 -297001 -74673 86067 198119 -155643 10700 57328 -119204 -86291 101616
16058 263740 259565 169494 283765 -38581 -143647 138167 -6163 9130 93568 -224031 56095
16046 133498 102467 19335 -190056 -11615 116347 97731 -275630 57189 56128 -273962 -269350
16035 -269350 144109 -132422 -25887 -79422 -5924 131057 126293 -150126 -9459 207517 -254913
16023a59559g6457L549o4213o032f4969b771G6015c72858a2532d565j13833M0426
16011g7972K1308D6678b8484j07941A37823F4557J77754c1961E4953h8499j93830
16000b82329E3692e0813o1589A71049d2846G9138f9521l62738a84099j3806b217
15988c1751C3826Q7726C6518K64612A01972b78412I3109M9964J7456O91391j37347
15977G14573K91156j59491k97905k61688R682G0305g5566f891A49910A0251K36351
15966B46602b21301D4768d8466j53151C5018J76657b17125B15723H4672j4206
15956G0466J14660d3152A50059b35053F802a67608l0549B19785a63133b2032A25011
15944A66821c24780O7902A06368c0618j1935m5930c0552k05908a5633j04289I6929
$$ plain form
16023 -159559 -76457 -72908 -137121 -143153 -64969 -2771 76015 -372858 -12532 -4565 -118398 -77972
16011 -77972 -56664 46678 -28484 -136425 137823 64557 242311 -31961 54953 -88499 -282329
16000 -282329 53692 -50813 -112402 171049 -42846 79138 -69521 -432259 -184099 -197905 -2217
15988 -31751 33826 121552 36518 301130 101972 -278412 93109 143073 160529 851920 714573
15977 714573 1005729 846238 548333 286645 296327 70305 -75566 -6891 149910 10251 246602
15966 246602 -221301 44768 -48466 -201617 35018 211675 -217125 215723 84672 70466
15956 70466 185126 -43152 150059 -235053 6802 -167608 -198157 219785 -163133 -22032 125011
15944 166821 -324780 -256878 106368 -30618 -42553 -88483 -30552 -236460 -15633 -119922 96929
15932b5451A08996d2617B57542A23198a2530p6225L9779d746k23337C09462A11229
15920a99313b6390H3498k0670J16639C090a26163A70905l6234e28844a77284g3713
15908a93810E1547a69895B2955J82158I6098d6702k0815l6429B04198b31526J4415
15897b17111E1643L7596K22934a36587I7652e5775O166A5726a53709k85408a61100
15885B37824G4196J14606a67251d6938a3015k08663C2903e1036l5308C30894d26082
15873A39895g2217l8318d4228L094A04379c2661j04567d3005p3351j3664j11541
15862b41561D475a37922F5391c1143G8259d2100A77993D2511a45936I5041l5820
15851E9221b15637A07141a95222C357d8408F6019L3565N2199a23009n7349o7036
$$ plain form
15932 -25451 108996 -42617 257542 123198 -12530 -88755 -48976 -4746 -228083 309462 111229
15920 -199313 -26390 83498 62828 179467 3090 -126163 170905 134671 -528844 -177284 -73713
15908 -193810 51547 -169895 22955 205113 96098 -46702 -67517 -103946 204198 -231526 -217111
15897 -217111 51643 89239 312173 -136587 97652 -55775 -49609 15726 -153709 -439117 -161100
15885 237824 74196 188802 -167251 -46938 -13015 -221678 32903 -51036 -86344 330894 -426082
15873 139895 -72217 -110535 -44228 -41134 104379 -32661 -137228 -43005 -116356 -130020 -241561
15862 -241561 4475 -137922 65391 -31143 78259 -42100 177993 42511 -145936 95041 59221
15851 59221 -215637 107141 -195222 3357 -48408 66019 99584 151783 -123009 -180358 -247394
15840b47394A39209b23529B67533h1557I2415l5014e7339f823l4060A36198b70296
15828B00357r5195Q085a68210M7478C14374I060f7310k14299Q1630B8159a13843
15816B47980M5679a96286e3894o4566p5421e8464k0312Q60q982A32355a15153
15804b51153A32241A4458a1692A63606A8646a33048e5200a2237A86286m202k462
15793A79622B4249a06727j19550g386k70944g9067B55856a33463A18836e9753
15782a37053L0143A6046L1791a55139e1055I6440h6925I0054i6447j00852F8115
15770a5382o99581C6497a37311B50339a29644P967I2544c31187A94062d9323R657
15759c9666A06196a6332k34673l372N7257K0832A04915R7134J66877a70845B11054
$$ plain form
15840 -247394 139209 -223529 267533 -81557 92415 57401 -57339 -6823 -40883 136198 -270296
15828 200357 105162 113247 -168210 -120732 314374 9060 -67310 -281609 -199979 28159 -113843
15816 247980 293659 -196286 -53894 -118460 -193881 -58464 -78776 -77916 -86898 132355 -115153
15804 -251153 132241 14458 -11692 163606 18646 -133048 -55200 -12237 186286 182084 179622
15793 179622 24249 -106727 -226277 -7386 -278330 -79067 255856 -133463 118836 -59753
15782 -137053 -106910 16046 47837 -155139 -51055 96440 -86925 90054 -96447 -197299 68115
15770 -15382 -714963 36497 -137311 250339 -129644 -121677 92544 -331187 194062 -49323 -39666
15759 -39666 106196 -16332 -251005 -254377 -197120 -176288 104915 202049 368926 -170845 211054
15747A23279M6117h4862e952H757K15039b3414j81588j19727i0417B58375B5561
15735B19243J31b11248R8955A48075q137a16317l3027A0889b55499J07123N7978
15724i0398J2927L4574j13344K8215p1886D7389A9928a26085O951k28786E3822
15712e910j14331J3702c9807o4945j72059J0773h6214i722q5876D8522a550B7683
15699A45558F6755O1740J35343a01893H2836e1875J5161D1281k079c56482A14071
15687a24683A69774d00959f0456F808J24937m334b59810F7237c65727a6972G2586
15675a90580M0797d4527B9968J55604n3889E699b8253A63323B4680a21324a4321
15663D23740j70287j21491b07077E2653b39648B54558b03582j17909N9812B06911
$$ plain form
15747 123279 169396 -84862 -5952 8757 223796 -23414 -205002 -324729 -90417 258375 25561
15735 219243 219374 -211248 -112293 148075 139938 -116317 -149344 10889 -255499 -148376 -90398
15724 -90398 -77471 -42897 -156241 -128026 -199912 47389 19928 -126085 -119134 -347920 53822
15712 -5910 -120241 -106539 -39807 -104752 -276811 -266038 -86214 -9722 -95598 48522 -1550 27683
15699 145558 66755 128495 263838 -101893 82836 -51875 -36714 41281 39202 -356482 114071
15687 -124683 169774 -400959 -60456 6808 131745 127411 -259810 67237 -365727 -16972 72586
15675 -190580 -149783 -44527 29968 185572 131683 5699 -28253 163323 24680 -121324 -14321
15663 423740 253453 131962 -207077 52653 -239648 254558 -203582 -321491 -261679 206911
15652B26285A8665c30258M6156A05472L9961j8763n9913b37877j72247H3412a20039
15640b37319L4995i2353A78872e60707b03420Q7612B49882d76167a66154A42608
15629D9261M6245b3641B24462m5722C1476O6009a59530C9049K4727g2970F0830
15617f4316o2721g23F1466a59458g928k86308f9006A58463k7258i5367I0825R2903
15605A83728a67019l5030j56199H4061K18767D7085i7241k4144G9274N0672K53457
15594C83403a1955B303J439c02937a5331j92422H4754c0739D8409N8709q594L8467
15582A36991n4440c23520A55395C911J32202M6075a61133A76987E3967c6355o7120
15571a03475g566m0352A03889D401L40249a36122a7113F4011O8527e0612H3035
$$ plain form
15652 226285 18665 -330258 -284102 105472 145433 126670 66757 -237877 -410124 83412 -120039
15640 -237319 -202324 -92353 178872 -560707 -203420 -115808 249882 -476167 -166154 142608
15629 49261 95506 -23641 224462 178740 31476 97485 -159530 39049 63776 -72970 60830
15617 -64316 -127037 -723 61466 -159458 -7928 -294236 -69006 158463 131205 -95367 90825 183728
15605 183728 -167019 -202049 -358248 84061 302828 47085 -97241 -121385 79274 129946 383403
15594 383403 -11955 2303 3742 -302937 -15331 -207753 84754 -30739 48409 107118 98524 136991
15582 136991 82551 -323520 155395 3911 136113 182188 -161133 176987 53967 -36355 -103475
15571 -103475 -7566 -47918 103889 4401 344650 -136122 -17113 64011 132538 -50612 83035
15559A59475h2926B97360c49594L9078a01955M8560G7199b70784a04151J1992
15549i2159k10121A50813b2344j19999i638C5100J63319b33012B92843D4913K228
15538D7141J31276F7067c0153C4886A399J58348L46722f8054B4521J46416K54634
15527D25571A32062c6837k33522A34067E8675K89745f212D9112O3303L3131L23140
15516D68686l4248A82956P6408A16549j6459J07606F6534N7848a52379F3084H810
15504a69611A72959D9901Q8361a6899C3118g5137p0781j01597B09327G0620b17304
15492A18165b99306M6498A38415K8749c00646A38162Q1273k3380a46869A32899
15481A27929M2527q0676J06327g4380B3260L36944I0065j3437P0671L49253J02079
$$ plain form
15559 159475 -82926 297360 -349594 -310516 -101955 -53395 77199 -270784 -104151 -92159
15549 -92159 -302280 150813 -22344 -142343 -9638 35100 198419 -233012 292843 44913 47141
15538 47141 178417 67067 -30153 34886 1399 159747 506469 -68054 24521 170937 425571
15527 425571 132062 -36837 -270359 134067 58675 348420 -6212 49112 112415 145546 468686
15516 468686 434438 182956 259364 116549 100090 207696 66534 124382 -152379 63084 8810
15504 -169611 172959 49901 138262 -16899 33118 -75137 -145918 -247515 209327 70620 -217304
15492 118165 -299306 -252808 138415 167164 -300646 138162 219435 196055 -146869 132899
15481 127929 170456 89780 196107 -74380 23260 360204 90065 76628 147299 496552 598631
15470E98631A34281K2151a51552N4340m8057m5592a0161A70107E0792g8913J0377
15459f8536C34745a23836B99806A09890D7363J91778r8050F7332A6074e7746A83497
15447c49681E067P4690g597A61187K1274a57703E93556B90885J72653j99264A11260
15435A12884L0417f203B54573i6083C52388F7182a1570j61531O2241b3994o7994
15424i1988B8490b59181B53594h5510b0710m3516A8199K42832o1830N1993C0490
15412A67741b36902B2992g2767A96152a12020l6080c9234F8508a91440G5451l815
15401G1636M4843A6012h5118I8659c6277j83950d523B7386e0492E2686J68829
15390B21515k6909p2425b3990n8302J9191I2427N2296d2821k16594j15913A18809
$$ plain form
15470 598631 134281 156432 -151552 -97212 -145269 -190861 -10161 170107 50792 -78913 -68536
15459 -68536 334745 -123836 299806 109890 47363 239141 141091 67332 16074 -57746 183497
15447 -349681 5067 79757 -7597 161187 182461 -157703 593556 290885 463538 264274 111260
15435 112884 143301 -6203 254573 -96083 352388 67182 -11570 -173101 -110860 -23994 -91988
15424 -91988 28490 -259181 253594 -85510 -20710 -64226 18199 261031 199201 251194 30490
15412 167741 -236902 22992 -72767 196152 -112020 -148100 -39234 68508 -191440 75451 71636
15401 71636 116479 16012 -85118 98659 -36277 -220227 -4523 27386 -50492 52686 221515
15390 221515 194606 122181 -23990 -82292 -63101 92427 144723 -42821 -259415 -375328 118809
15378B92754A02104K3690a0299A16721K45917j23961n4477j3714K28242I3405
15367A78776G5521J14770F5071i8583l2969N9516D4089Q2611J3461c2172l8735
15356g0907k09079R8015E7099k6437R9541N3397c4855A05028O7415K07268d7772
15344C29352F3530L00123o8358A40309Q4147g5537A66151a5268E09056f8303N393
15333f2910K6345A78873A3961L69051b35306j05154C40217j44299a06518j3439
15323a19957A55995A2580J80979J92730A02755b19921A7756K2846J17843o2083
15313I6362b36134A07433D5996g4392C04663a6164A26879K05754A30407b75277
15302E4285b58744h2454A38263B9561a42474N4600A18821i8052B01030A00017
$$ plain form
15378 292754 102104 125794 -10299 116721 362638 238677 184200 170486 398728 93405
15367 178776 75521 190291 65071 -98583 -131552 -72036 44089 126700 140161 -32172 -70907
15356 -70907 -279986 -181971 57099 30662 130203 183600 -34855 105028 172443 379711 -47772
15344 329352 63530 363653 295295 140309 224456 -75537 166151 -15268 509056 -68303 -62910
15333 -62910 -36565 178873 13961 383012 -235306 -340460 340217 195918 -106518 -119957
15323 -119957 155995 12580 193559 386289 102755 -219921 17756 40602 158445 96362
15313 96362 -236134 107433 45996 -74392 304663 -16164 126879 332633 130407 -275277
15302 54285 -258744 -82454 138263 29561 -142474 -87874 118821 -98052 201030 100017
15291A1791N0537J973a07671k4637j57017C6684J00268f2167E512K06837A02629
15279B482J89339J09890a84035N7208N8385B17753A7066c23867G7597A8847L9389
15268E8236J44774D3951B1607R9881c3632B74572g3727D3566K29212a43318C15321
15256B66536C6041F409R6916J3919B7117J51719a62218b7734Q478I8815k3642
15245G5173J28889e6017H4372J88701C6124e5896A61042O25924C10434P87191
15235A097625L48024K401149j214293J5173R53732A323425C75482j85239J8198
15226B08441I1367J8972n3949R2269e010B298f4475A32349o5463a91997Q9179
15215a02818A70844N3216c1114l12938d3821A73065b07235b8037A26528o1087
$$ plain form
15291 11791 62328 64301 -107671 -132308 -289325 36684 136952 -62167 5512 212349 102629
15279 2482 191821 301711 -184035 -126827 -68442 217753 17066 -323867 77597 18847 58236
15268 58236 203010 43951 21607 121488 -33632 274572 -73727 43566 272778 -143318 315321
15256 266536 36041 6409 103325 117244 27117 178836 -162218 -27734 -19256 98815 75173
15245 75173 204062 -56017 84372 273073 36124 -55896 161042 786966 310434 1097625
15235 1097625 1445649 3846798 2632505 2647678 3601410 1323425 375482 190243 208441
15226 208441 91367 110339 56390 148659 -5010 2298 -64475 132349 66886 -191997 -102818
15215 -102818 170844 224060 -31114 -344052 -43821 173065 -207235 -28037 126528 65441
15205F5441f5019l7310q1044A67105C6910j4563e866H9215D047K26385E3740J24665
15193A78405l9387e9272E4426e209k80293J26286B1801a5678k413j46491A08285
15181G4809K43829a87017M1212F1099J10036R827K78961A78635b61185A01670
15170a8852B22379q428c11958D972a51990A37401C9883J87235P1701j6235r8032
15159A84552J68a27116C70042o492D3755K09696q1562a22887K7474c3706J0809
15148b2897A96517J790a48066C92697j61093h0009B99208a89827N5040j50941
15138b85728A54687n0402O3293q1341K33429I5543J37070N7900K5849D6711M66361
15127E13072B18953J29095P7706A42551L5998H6073f3214A36010e1730A82194
$$ plain form
15205 65441 -65019 -102329 -183373 167105 36910 22347 -5866 89215 4047 230432 53740 178405
15193 178405 139018 -59272 54426 -5209 -285502 -159216 21801 -15678 -18091 -164582 108285
15181 74809 318638 -187017 -145805 61099 171135 180962 459923 178635 -261185 101670
15170 -18852 222379 213951 -311958 4972 -151990 137401 39883 227118 298819 282584 184552
15159 184552 184720 -127116 370042 363550 43755 253451 171889 -122887 -95413 -33706 -22897
15148 -22897 196517 198307 -148066 392697 231604 -80009 299208 -189827 -134787 -285728
15138 -285728 154687 104285 167578 86237 319666 95543 232613 290513 316362 46711 513072
15127 513072 218953 348048 425754 142551 178549 86073 -63214 136010 -51730 182194
15116A96183K95315B29642J21801j41730K24131J66640M5382L47309A50192J46461
15106B96653J21229K5135c00262F1396C477g5674A2327N999q339K78175A40829
15094g0445K7839j04147A82656Q8328M6719A42224E4866a21125e5818C27003j33665
15083A93338F7258K55758O1034a08409A25808E9048J32430L8725k847l1216J9099
15072B15239N9769j16757g5571A16461m5853L2978J93062G5109b54401B97207
15061C37406a680B32974p7149J29800j40334R7699C8844a7425B79565O204A21947
15049B05018J42385j50386D0538J02304a14428b8230B93655J31701b37972C32892
15038B75564J93861J91914k01435A3681J40936J44067J61293q5675J5030I2925
$$ plain form
15116 196183 491498 229642 351443 209713 433844 600484 645866 993175 150192 296653
15106 296653 417882 443017 -300262 61396 3477 -75674 12327 18326 9987 288162 140829
15094 -70445 -42606 -146753 182656 270984 317703 142224 54866 -121125 -55818 327003 193338
15083 193338 67258 323016 384050 -108409 125808 59048 191478 230203 227356 196140 215239
15072 215239 275008 158251 -75571 116461 70608 103586 296648 75109 -254401 297207
15061 337406 -1680 232974 155825 285625 145291 242990 38844 -17425 279565 285769 121947
15049 205018 347403 197017 40538 142842 -114428 -28230 293655 425356 -237972 332892
15038 275564 469425 661339 459904 13681 154617 298684 459977 374302 389332 92925
15027E14047j49983L12255k30251k10640j2110D8488M50186A45283J3044K65754
15017D24081J51541j0208j14398G6401K14675L49823C15353K05501j82717J2338
15007C50475b2718D67010j12792J88988p8507B30658k4686D1253L41343j29481
14997B53115N9019K6840q7950b7747B57676N1341K00185B2737O34687j53174J73748
14986F77998j39055p5622A66518L28557M5442l2412O2699J18254j57392B28719
14975D43434A94504J12600J05374o6079r5667k4088R2134K22169j40399j28724
14965B71824L31544e483A32182R4113j7295L7765I5545N5189J30036H9429D3107
14953C52423M8278J06M5096q0778A60365J06283m3035L30067B61328Q7105N7034
$$ plain form
15027 514047 364064 676319 446068 235428 223318 48488 498674 145283 158327 424081
15017 424081 575622 565414 451016 76401 291076 640899 315353 520854 338137 350475
15007 350475 -22718 467010 354218 543206 464699 230658 205972 41253 382596 253115
14997 253115 312134 338974 251024 -27747 257676 309017 509202 22737 657424 504250 677998
14986 677998 538943 463321 166518 495075 540517 508105 570804 689058 531666 228719
14975 443434 194504 307104 412478 346399 250732 226644 318778 540947 400548 271824
14965 271824 603368 -5483 132182 226295 209000 246765 95545 150734 280770 89429 43107
14953 352423 400701 400807 445903 365125 160365 266648 223613 553680 261328 348433 405467
14942D05467j67913K48021j82461F0940J89502L80574k56233m0678L83111A61788
14931B46010j09410M35275K77294k02705R1898l6484J37353K35824o5676n5098
14921I54281k43369B66667O54280k20916J18758P09057l60564j65371m5767M674
14911I60818k28100J318o5052k61657B00654J93304A36575P29741l69873K373
14901D98816L4170j82169L20847j71587j9366O2321K52996k74284O6982n5851
14891E32875k17539K027j53412J77872K62311K00513B13055M49025m2863j04781
14881E14436j28115j38242L58320q7503J18061K5976A90312K58699j21635J0101
14871C37477o429K14187F1312M08631B28868J83542J8600j5565K49319L366m5813
$$ plain form
14942 405467 237554 485575 303114 60940 250442 631016 374783 334105 717216 161788
14931 246010 136600 571875 849169 646464 738362 701878 839231 1075055 1009379 954281
14921 954281 710912 266667 920947 700031 818789 1527846 1167282 1001911 956144 960818
14911 960818 732718 734036 668984 407327 200654 393958 136575 866316 496443 498816
14901 498816 532986 350817 671664 500077 480711 543032 796028 521744 588726 532875
14891 532875 315336 317363 163951 341823 604134 804647 213055 662080 619217 514436
14881 514436 386321 248079 606399 518896 636957 662933 190312 449011 327376 337477
14871 337477 331048 545235 61312 469943 228868 412410 431010 415445 664764 668130 622317
14860F22317j79916J3470B08007K56526J69123k65902o3067O8395J06160A46408
14849C06044L20452B11135L58366M2353N6908j55729j22995O8671K33297k20841
14839D71165L19052j50224k80835N08322M7086n3918r1194k81814K31967j36864
14829E82743j3887B38372k6104M33837k0705l03100K58961j52538L15444B02038
14818F60691J98953l55645N0703J86261k67476r6563k1170r7778L10315k36277
14808C32014K18198J44412l21727J23405K0431m9958K97838p728J26020j4413
14798H68492l78426L6591L01816l60565j3505N6470m075p5471K66814J00539q5235
14787G13445k13461K29496C42872K99571K04304m04994L8388J51151j96627L81704
$$ plain form
14860 622317 442401 455871 208007 464533 633656 367754 304687 373082 479242 146408
14849 306044 626496 211135 569501 611854 668762 513033 390038 458709 692006 471165
14839 471165 790217 639993 359158 867480 914566 860648 769454 487640 719607 582743
14829 582743 568856 238372 212268 646105 625400 322300 581261 428723 744167 202038
14818 660691 859644 503999 554702 740963 473487 376924 355754 257976 568291 332014
14808 332014 550212 694624 372897 496302 516733 466775 764613 756885 882905 868492
14798 868492 490066 526657 828473 467908 454403 510873 506798 431327 698141 798680 713445
14787 713445 499984 729480 342872 642443 846747 441753 480141 631292 434665 816369
14777H16369l42893O9451K41583k10473J14977J79506J67611l96713j80683J17080
14767E75815L60095k63016C16045P83866n17425k86243N17345k62555J54699p2666
14757F33066J9469K77657j83124j36365k89844K88618l1939K50247q0927J22259
14747H69117J0605j55253m6040j88995J47537J14920J15594Q560k20268l879J66766
14736H18664L2393r363p2187k35645J67997Q0109M38237j82044j0957k18035L4241
14725H43410M78634P6201k07693k56692N9348N4204p3554k70578N3776K45354
14715A002410q5678m5710K36414l49829l8642J22391N779R1298k70492R6959L90843
14704A155743k26153K48850j42927m9715N01378j69452J51727O4971l19515K5801
$$ plain form
14777 816369 473476 542927 784510 574037 689014 868520 1036131 639418 458735 575815
14767 575815 935910 672894 316045 1099911 582486 296243 813588 551033 705732 633066
14757 633066 652535 930192 747068 610703 320859 609477 577538 827785 746858 869117
14747 869117 879722 724469 678429 489434 636971 751891 867485 876045 655777 651898 818664
14736 818664 851057 841694 769507 533862 701859 781968 1220205 1038161 1027204 809169 843410
14725 843410 1322044 1398245 1190552 933860 993208 1047412 973858 703280 757056 1002410
14715 1002410 916732 871022 1107436 757607 718965 841356 847135 938433 667941 764900 1155743
14704 1155743 929590 1178440 1035513 985798 1487176 1317724 1469451 1534422 1214907 1240708
14694A240708m41078K40416j5241r9140K46512m48858L60397k73486L86986j80890
14684A016326m4245k90513L77149o0430P8766l41897Q8477J12199j38159R7975
14674H95648p5814j22516J55019K90347k46930J40589J01178j23445K32978l45429
14664I01625M17953j81710l09523O44903k82100O2794l42017L20839j12349j48235
14654I72180k7333K89418K323k1833j39584K95163o566l70397K73472O5562n6583
14643A275822K31587m9512l86159L90669j15348j19414Q5363k1509k527J22992
14633A411964k101j52178k98688M71483j52704J8422j05952J83212K59845l69418
14623A263885j80900M17481L06039o35522K11705o7860p5918j86283p793O30361
$$ plain form
14694 1240708 799630 1040046 1024805 925665 1172177 723319 1083716 810230 1197216 1016326
14684 1016326 972081 681568 1058717 998287 1077053 735156 823633 935832 797673 895648
14674 895648 819834 697318 852337 1142684 895754 1036343 1137521 1014076 1247054 901625
14664 901625 1319578 1137868 828345 1473248 1191148 1253942 911925 1232764 1120415 972180
14654 972180 944847 1234265 1236588 1214755 1075171 1370334 1363768 993371 1266843 1332405 1275822
14643 1275822 1507409 1457897 1071738 1462407 1347059 1227645 1313008 1291499 1288972 1411964
14633 1411964 1409863 1257685 958997 1430480 1277776 1296198 1190246 1373458 1633303 1263885
14623 1263885 1082985 1500466 1806505 1170983 1382688 1314828 1238910 1052627 1044834 1675195
14613A675195k98970j01603J14644J20919k6043j26509J41795K75919J64793j39998
14603A800142l05684R2843M86633q14504M00333K1938j32465J3872k2057J24189
14593A665240k02469N20421j49043R2058l56552L86935N6176l07387L87626l78290
14583A714715J56916L0289K8038N2453P4416K8433j33520r7893K26325k58547
14573A821625L64582R9590j01332p0958P3506j35946n3276M32177K8168l40501
14563B117635L12241r3327L33218l5255q333L6982L47519K1537K34963k1508P6186
14552C321858M80369Q35041Q33128J385186L064267P928601J9366312J8898332
14544E6113094B1157390H326686D107887j175523q84482n588J71472j50655o6352
$$ plain form
14613 1675195 1376225 1274622 1389266 1510185 1484142 1357633 1499428 1775347 1940140 1800142
14603 1800142 1494458 1587301 2073934 1259430 1659763 1681701 1549236 1563108 1541051 1665240
14593 1665240 1462771 1983192 1834149 1926207 1569655 1956590 2012766 1705379 2093005 1714715
14583 1714715 1871631 1901920 1929958 1982411 2056827 2085260 1951740 1853847 2080172 1821625
14573 1821625 2186207 2285797 2184465 2113507 2187013 2051067 1997791 2429968 2458136 2117635
14563 2117635 2429876 2336549 2669767 2634512 2626179 2663161 3010680 3032217 3267180 3245672 3321858
14552 3321858 3802227 4637268 5470396 6855582 9919849 17848450 37214762 56113094
14544 56113094 21157390 8326686 4107887 2932364 2047882 2042294 2213766 2063111 1996759
14535A996759M84878l72200L72593L76356P21620K134249L683913D263854j633610
14526B630244k22744k07478K90141M1012k18827L12693k22686O326K93425l40021
14516B362085J45877K61055r1261N2498K17943j80826J18710m1001n3763l9395
14506B751922J58094k29182J39225K18830j95534K96718k28562j9383O7134J29914
14496C089176J49217J60819m9252l5759R1645J5718K34930q37980P18338m7302
14486C489550m196O4397l27204O42690Q4437k30641N4882L33816k45284K46179
14476D108626k03009m2848k2130J70356K30331P9972k50442K52838j74161l12160
14466C837373Q07532n2302J48746k76658n0973K17320K49911M7621N4687J83708
$$ plain form
14535 1996759 2481637 2109437 2482030 2858386 3580006 5714255 9398168 4263854 2630244
14526 2630244 2407500 2200022 2490163 2531175 2312348 2625041 2402355 2408681 2702106 2362085
14516 2362085 2507962 2769017 2677756 2730254 2948197 2767371 2886081 2845080 2791317 2751922
14506 2751922 2910016 2680834 2820059 3038889 2843355 3140073 2911511 2892128 2959262 3089176
14496 3089176 3238393 3399212 3349960 3314201 3405846 3421564 3656494 2818514 3536852 3489550
14486 3489550 3485354 3549751 3222547 3865237 3949674 3719033 3773915 4107731 3862447 4108626
14476 4108626 3905617 3862769 3840639 4010995 4241326 4321298 4070856 4323694 4149533 3837373
14466 3837373 4644905 4592603 4741349 4464691 4413718 4631038 4880949 4928570 4983257 5166965
14456E166965k63049J80879K22158k04208K69745k13028J65279L2164l7214J43501
14446E463192K64424k41814N20348K75703l19572R0237o6807q7711k14431P50715
14436F434284j6706N88990l3284m61164L55021J25120k68483j32255M00775M92951
14426G485249j84760K56926k42696N68499L4898l13787M02989J31052q9717N48809
14416H597462J46384M183K97077K9746J90415r4900j18454P8371M0970Q89760
14406A0061014m5695p4726j18749M06913K33892J17498J32296L50075J04825J62199
14396A1329542k44254J40517M01525K51152J78785J20731K68114K3932O85282
14387A3155326K89555k48776P61484J96808p5565K18227N50154M73254o4481N7622
$$ plain form
14456 5166965 4903916 5084795 5306953 5102745 5372490 5159462 5324741 5356905 5319691 5463192
14446 5463192 5727616 5485802 6006150 6281853 5962281 6052518 5985711 5898000 5683569 6434284
14436 6434284 6417578 7006568 6973284 6512120 6867141 6992261 6723778 6591523 6992298 7485249
14426 7485249 7300489 7557415 7314719 7883218 7918116 7604329 8007318 8138370 8048653 8597462
14416 8597462 8743846 8748029 9045106 9074852 9265267 9170367 9051913 9130284 9171254 10061014
14406 10061014 10015319 9940593 9821844 10228757 10462649 10580147 10712443 11062518 11167343 11329542
14396 11329542 11085288 11225805 11627330 11878482 12057267 12177998 12446112 12470044 13155326
14387 13155326 13444881 13196105 13957589 14154397 14078832 14297059 14847213 15320467 15255986 15313608
14377A5313608P70950K34201J13532L17253K53047j7123J099359K55128j943L52978
14367A8690990L89521M11277O46776M67058K45905Q20906J22191L02199L99879
14358B2496702Q31120K55717O72420M45036N84219Q77460M17149O01059Q24713
14349B8005595O43336Q19044Q38841O03557O92847J041127N87873R73133J141067
14340C5346420Q86341O92296J209827J151373J420609N48810J620135J060208
14332D3936019J452361J290144J344883J731530J348687J779941J957418J500461
14324E6341444J948870J997890K102734K322909K340848K411268K567782K792607
14316G4826352K543988K841143L377799K821364L676946L348570M294508L814047
$$ plain form
14377 15313608 16084558 16318759 16432291 16749544 17002591 16985468 18084827 18339955 18338012 18690990
14367 18690990 19080511 19491788 20138564 20605622 20851527 21672433 21794624 22096823 22496702
14358 22496702 23327822 23583539 24255959 24700995 25285214 26162674 26579823 27180882 28005595
14349 28005595 28648931 29467975 30306816 30910373 31603220 32644347 33232220 34205353 35346420
14340 35346420 36232761 36925057 38134884 39286257 40706866 41255676 42875811 43936019
14332 43936019 45388380 46678524 48023407 49754937 51103624 52883565 54840983 56341444
14324 56341444 58290314 60288204 62390938 64713847 67054695 69465963 72033745 74826352
14316 74826352 77370340 80211483 83589282 86410646 90087592 93436162 97730670 101544717
14308A01544717M777120M265638N003720N429656N348161N280794O373668O709355
14300A44732829O752367P270995Q249799P762164R027832R256041J0101649J0142683
14292B13296359J0969052J1892526J1981644J2676309J3574767J3470381J4520166
14285C02381204J4717993J5204393J5267981J5866836J5240933J5854526J4887781
14278D09421647J4322648J3410071J1889784J0866028P908608M475681K007684
14271D74302151J34907q80998j277927m396617n689583p505358r460061j1401360
14263D33825154j3199407j4412927j5591592j5994302j6258360j6412762j5964829
14256C25990975j5723331j5545736j4417770j4374277j3108816j2958133j2186498
$$ plain form
14308 101544717 106321837 110587475 115591195 121020851 126369012 131649806 138023474 144732829
14300 144732829 151485196 158756191 167005990 174768154 183795986 193052027 203153676 213296359
14292 213296359 224265411 236157937 248139581 260815890 274390657 287861038 302381204
14285 302381204 317099197 332303590 347571571 363438407 378679340 394533866 409421647
14278 409421647 423744295 437154366 449044150 459910178 467818786 472294467 474302151
14271 474302151 474437058 473556060 472278133 467881516 462191933 454686575 445226514 433825154
14263 433825154 420625747 406212820 390621228 374626926 358368566 341955804 325990975
14256 325990975 310267644 294721908 280304138 265929861 252821045 239862912 227676414
14249B27676414j1527748j0930656j0414781r760576r262875q085904q172221
14242A59521653p788783m608812n306954p531634o011394n495928n873328n242838
14234A11661982n050523m136113m629301l073942m165529l509208l489271l441571
14226H0166524k966019k745584k733241k720263k348411k198629k357160j871960
14218F0225257k211572j946268j898598j343136j684589p89288k229933j653063
14210D6468810j599639j223080j185167k64091r58134j762991j273844j257743
14202C6944121q24195j106953r2322p52965j570706j064541n95285q67679r67916
14193B9101559p62953k97988q10734r28764l18955q13433j52040p19401m53354
$$ plain form
14249 227676414 216148666 205218010 194803229 185042653 175779778 167693874 159521653
14242 159521653 151732870 147124058 141817104 134285470 128274076 122778148 116904820 111661982
14234 111661982 106611459 102475346 97846045 94772103 90606574 87097366 83608095 80166524
14226 80166524 77200505 74454921 71721680 69001417 66653006 64454377 62097217 60225257
14218 60225257 58013685 56067417 54168819 52825683 51141094 50351806 48121873 46468810
14210 46468810 44869171 43646091 42460924 42196833 41238699 39475708 38201864 36944121
14202 36944121 36119926 35012973 34920651 34167686 32596980 31532439 30937154 30069475 29101559
14193 29101559 28338606 28040618 27229884 26301120 25982165 25168732 25016692 24297291 23843937
14184B3843937o72114p03488k87272l74865m89256m86351m08242k75651q66773
14175A9279925J4290l87661m60301o42171j89138m72578j11345m58063j36666
14166A6436292n92650p3958l54032l12144M1403p18819J77072n26522n02811P7034
14156A3650865l27126Q2810n28125j16707q7581l80343j01294l81272r0130J53449
14146A1874546n65962l30684M84101p52320r8181l2950K3967l13237l9436k12313
14136A0037531l36051k57437J87741P9197q21917L72031k12261K6245k11779j78491
14126H684809O5633l11221r0202m24872M30046k37994k35907L4777m46372N3435
14116G522132j50653J01409k28868k29554K8508M503l16525K33465n09189K02286
$$ plain form
14184 23843937 23171823 22468335 22181063 21806198 21316942 20830591 20422349 20146698 19279925
14175 19279925 19294215 18906554 18446253 17804082 17614944 17142366 17031021 16572958 16436292
14166 16436292 15843642 15769684 15415652 15103508 15144911 14426092 14603164 14076642 13573831 13650865
14156 13650865 13323739 13406549 12878424 12761717 12674136 12293793 12192499 11811227 11721097 11874546
14146 11874546 11308584 10977900 11462001 10709681 10611500 10578550 10602517 10289280 10249844 10037531
14136 10037531 9701480 9444043 9631784 9710981 8889064 9261095 9048834 9075079 8863300 8684809
14126 8684809 8750442 8439221 8349019 7924147 8354193 8116199 7880292 7915069 7468697 7522132
14116 7522132 7371479 7472888 7244020 7014466 7042974 7047477 6730952 6964417 6455228 6657514
14106F657514k7071K5927m2131j91244k91705M5065k31854k52043M61803k83665
14096E870596k19393J41755j49074o6092l396n0480K59057n20353j50094K54682
14086E367208m47794M84274k67262J35122l18054J16806p2573j06427k28692J6340
14076D678948J33266l27216J77886K1011k80676R648J63413j55475j62462J61834
14066D420177r1722m14649O03100k60826J99871k90014j76029K56610k22321l13268
14056C710929J32124J59810l00112j36409m2543K96053k96480K74396j27697j618
14046C668453K86606l20320k66451L38186l18847Q3728m7562m60226M59565J34679
14036C557811l18859J43874m293j22083m68219M54028k12787R2713m764K63134
$$ plain form
14106 6657514 6630443 6656370 6614239 6422995 6131290 6176355 5944501 5692458 6154261 5870596
14096 5870596 5651203 5792958 5643884 5577792 5574396 5523916 5782973 5262620 5112526 5367208
14086 5367208 4919414 5403688 5136426 5271548 4953494 5070300 4997727 4891300 4662608 4678948
14076 4678948 4812214 4484998 4662884 4683895 4403219 4412867 4576280 4420805 4258343 4420177
14066 4420177 4328455 3913806 4516906 4256080 4455951 4165937 3989908 4246518 4024197 3710929
14056 3710929 3843053 4002863 3702751 3566342 3523799 3819852 3523372 3797768 3670071 3668453
14046 3668453 3955059 3634739 3368288 3706474 3387627 3471355 3423793 2963567 3423132 3557811
14036 3557811 3238952 3382826 3378533 3256450 2788231 3242259 3029472 3122185 3117421 3380555
14026C380555j08863j33150k00258J47444J74812o28958L10382l3949j53677q8184
14016B666154N0675O959l55510j3195K77388o9693j67348l5916M7346P2140j32226
14005B346774m5141o4970M87483o05107j15237K15032J8990j05179L13693l29758
13995B116580J8014l41245K63363O4291L59038r65O67825K106999N526414J6861941
13985B7642255L0124598k8531099A3869278n374155k326937j496286l90478n99043
13977C682379k68688j21191l18946j0371l17667p8585J76453k00126J70660k11687
13967B502231O5979k84861j11420J27034k9195j19915m1697P6387j45923J64083
13957B202703p8795Q4896j0768K8695j60680q896j64308J72997Q9357l6408K60176
$$ plain form
14026 3380555 3271692 3138542 2938284 3085728 3260540 2631582 2941964 2908015 2754338 2666154
14016 2666154 2716829 2723788 2368278 2355083 2632471 2562778 2395430 2359514 2406860 2479000 2346774
14005 2346774 2301633 2236663 2724146 2119039 2003802 2218834 2237824 2132645 2446338 2116580
13995 2116580 2134594 1793349 2056712 2121003 2480041 2479076 3146901 5253900 10780314 27642255
13985 27642255 57766853 29235754 13869278 8495123 6168186 4671900 4281422 3682379
13977 3682379 3413691 3292500 2973554 2963183 2645516 2566931 2743384 2543258 2713918 2502231
13967 2502231 2568210 2283349 2171929 2298963 2269768 2149853 2108156 2184543 2038620 2202703
13957 2202703 2123908 2208804 2198036 2226731 2066051 2057155 1892847 2065844 2155201 2118793 2378969
13946B378969q08802M70781L8814j37265R6817j41963R9051j57747q1945o7562
13936A689148j13132J46476j22109P0378n6788P5416n6633K5477j23644L06692
13926A841281l46544k00385L32243K00396K3762m78589K61831m56702L09165M57723
13916A944181l50216n763l43725J97739k35600L10962R7907n9646k01603M9205
13906A403441l67374J66382L8220J7665J88320r3159j98533L83457k75956K06351
13896A468814j9563j29526J23193K4245k86207J39848q812Q124l36429J80104
13886A163791M51272j76239j19359l41114J96649K47861j41072Q2707k54360k47979
13876H62157J99910k34960L28611k88950L37802j74314j819K40115k00496K32020
$$ plain form
13946 2378969 1570167 2040948 2079762 1942497 2039314 1897351 1996402 1838655 1756710 1689148
13936 1689148 1576016 1722492 1600383 1670761 1613973 1689389 1632756 1658233 1534589 1841281
13926 1841281 1494737 1294352 1626595 1826991 1850753 1372164 1633995 1177293 1486458 1944181
13916 1944181 1593965 1588202 1244477 1442216 1206616 1517578 1615485 1555839 1354236 1403441
13906 1403441 1036067 1202449 1240669 1258334 1446654 1353495 1154962 1538419 1262463 1468814
13896 1468814 1449251 1319725 1442918 1467163 1180956 1320804 1311992 1320116 983687 1163791
13886 1163791 1615063 1438824 1319465 978351 1175000 1422861 1281789 1364496 1110136 862157
13876 862157 1062067 827107 1155718 866768 1204570 1030256 1028437 1268552 1068056 1300076
13866A300076j73317m8837k39026J03483K74595n36208K73541K74224n4324j50593
13856A023614j1077m0824J21423j0714j70789L10110J03891l95809K54900p7685
13846A107040J47925l54263p4940p255L99244n8907j77559k08019J82684k46602
13836G09348K85511N9491k83327K8625p3200L22884j2617r0530r8455J91632Q0303
13825A119665k00318K28532E42563L5790K68731L93213m08906K4623K4988p6857
13815H04145j07161p4447L27304J52450j32091D71157O06633n16362L68786n8489
13805H71725N0249J85368D81829M07505o3270K69522j07393k36124j21143K89500
13795I20426k25881J32370J21520P7437l28623r5174J81746m061k24164K48258
$$ plain form
13866 1300076 1126759 1077922 838896 942379 1216974 680766 954307 1228531 1174207 1023614
13856 1023614 1012537 971713 1093136 1082422 911633 1221743 1325634 929825 1184725 1107040
13846 1107040 1254965 900702 825762 818507 1217751 1158844 981285 773266 955950 709348
13836 709348 994859 1054350 771023 799648 726448 1049332 1036715 946185 847730 1039362 1119665
13825 1119665 919347 1147879 542563 578353 847084 1240297 831391 856014 881002 804145
13815 804145 696984 622537 949841 1102291 970200 471157 1077790 561428 930214 871725
13805 871725 921974 1107342 481829 889334 826064 1095586 988193 752069 630926 920426
13795 920426 694545 826915 948435 1025872 697249 602075 783821 779760 555596 803854
13785H03854L331l42341J59952J84319q2757J27019m8249J07482P7175l05006
13775F84779J57700p7136k20541M04861k18245J74836k22643N6384k860r7189
13765F39946j32217J34684k29001P9574j84696O96459J1650O1056E36760J59251
13755F96011J15708j35826r7919J0215p4423o0710k2525A21045J52537K13944
13745D87526j46150M67601j88247P2717j20861J22848J10980j79529J11520J63543
13735I01948j9976j16685q0397n7596K04138j98540J9597j21996L16707l92650
13725D54550L80511C43481L75423j45403k44946K84443K44358k54666k05286L59056
13715G56460j80060O846j29663J37256B47933R7175j01822M52783k73168j51706
$$ plain form
13785 803854 807185 464844 624796 809115 726358 853377 805128 912610 989785 684779
13775 684779 842479 765343 544802 949663 731418 906254 683611 739995 737135 639946
13765 639946 507729 642413 413412 492986 308290 1004749 1016399 1077455 536760 696011
13755 696011 811719 675893 577974 588189 513766 453056 430531 121045 273582 487526
13745 487526 341376 808977 620730 693447 572586 695434 806414 626885 738405 901948
13735 901948 881972 765287 684890 627294 831432 632892 652489 530493 847200 454550
13725 454550 835061 343481 718904 573501 328555 612998 857356 602690 397404 756460
13715 756460 576400 583246 453583 590839 247933 345108 243286 696069 422901 271195
13705B71195J86957R3972B22849K88346j20517A54331N87325k09036j0204B26378
13694D86468J48823q3362k32085L35407P0677j50839K80274C03745L6520K15494
13684E55759B38385L29333j4779q2031K54165k41600J23464L3700k55756l5714
13674C49167J34492B27003K8749j09463P01785B80452K06278r8994O5643J47617
13664F00996k21373J82147J80570l00514P8326O122L70997k22924k26299j70299
13654B77749K35730B26654M23449k11650J57743K78395k69268B80321O9234L13923
13644F63478r0941k25960J86795L8963B18229P2508L2659K60604k89221J44485
13634D39264j73574N235L26852k55609J36940j00501J93376A83748L71953L1285
$$ plain form
13705 271195 458152 552124 222849 511195 390678 154331 741656 532620 522416 226378
13694 486468 635291 551929 319844 655251 725928 575089 855363 303745 340265 555759
13684 555759 238385 567718 552939 470908 725073 483473 606937 640637 384881 349167
13674 349167 483659 227003 255752 146289 848074 280452 486730 387736 453379 600996
13664 600996 379623 561770 742340 441826 520152 526274 897271 674347 448048 277749
13654 277749 513479 226654 650103 438453 596196 874591 605323 280321 349555 663478
13644 663478 572537 346577 533372 572335 218229 290737 323396 584000 294779 439264
13634 439264 265690 270925 597777 342168 479108 378607 571983 183748 555701 586986
13624E86986B00242K38773n561r1117M7329K38329j88640j32803J80095c8269
13613D50036B20701J00889j0451J72670k35319L81678j79584M6857k09797o4552
13603B23092K49236o8432j62038J38475j54535j7645L05689J7874m4802n1981
13593D34933j40074A02200L60714j21220q8973J08410I5529K11640A35218K93866
13583D29084j4907j25736A42884N11215A97093L09305J67946a04719F24905k09224
13573D15681o566j54817K02884A23602L11252A6110J85637J30236E0603L18524
13563C69127f7131F3113M20457J08705j88781J28488j80499A57471b9396E10684
13552C75687j77063M22184B42327K915O6901C6127K00081E3282J84254j07006
$$ plain form
13624 586986 200242 439015 433454 342337 389666 627995 439355 306552 486647 -38269
13613 450036 220701 321590 311139 483809 248490 630168 450584 497441 287644 223092
13603 223092 472328 403896 241858 380333 225798 208153 513842 531716 486914 434933
13593 434933 294859 102200 462914 341694 252721 361131 95529 307169 135218 429084
13583 429084 414177 288441 142884 654099 197093 506398 674344 -104719 624905 415681
13573 415681 409115 254298 457182 123602 434854 16110 201747 331983 50603 369127
13563 369127 -67131 63113 483570 592275 403494 531982 351483 157471 -29396 510684
13552 375687 198624 620808 242327 245242 312143 36127 236208 53282 237536 130530
13542A30530K96295j73662J72146j60810f2210l34448B45667j8659K88855a03402
13531A90062o2162A1693L11636j00551K01719N2671A79597K49538k07187H891
13520d9758C83780j06541J68490A67331M8666K6595K22690j66748C2878J33198
13510A66076K8213a33005B06344a11432E33600k44960R299m217a28113A93353
13499D15834j99426K3982K19331A54536L82141B50266K71406B12863d5592A08401
13488D78185I3277J25256L73961k55890I8666b1117A87270L1895J35362o6558
13478B87969h5038H0723a56526D9473L76743n0039m1097A33386L53069j96881
13468B89574k357J45133B2106M15850n1870J31146G1495L47770A56655J47709
$$ plain form
13542 130530 426825 253163 425309 264499 -62210 -396658 245667 227008 515863 -103402
13531 190062 127900 11693 323329 222778 424497 477168 179597 429135 221948 8891
13520 -49758 383780 277239 445729 167331 215997 242592 465282 298534 32878 166076
13510 166076 194289 -133005 206344 -111432 533600 288640 297939 293722 -128113 193353
13499 415834 216408 240390 459721 154536 536677 250266 521672 212863 -45592 108401
13488 478185 93277 218533 592494 336604 98666 -21117 187270 219165 354527 287969
13478 287969 -85038 80723 -156526 49473 426216 376177 335080 133386 486455 289574
13468 289574 287217 432350 22106 437956 386086 517232 71495 419265 156655 304364
13458C04364A36188a2943j47798B55743r1915J65207L4911j81929R1485N3521
13448C27023K17245A29063B360a83348j4906A44380L12689A3053O6843K64239
13438C44135j43907n7724D2899P7926R0772q9936a4366E67718C3684F930J8400
13427B5330L82400I8625L04127E8968M48330a64236B58942J73444d617E38617
13416G5287K20028p9037K10407Q8584H0738l6017J40000a40445j4808A30286a84671
13404B62134P6571A18369K10383a54042B10118J38261A31988J48818A13897L9840
13394A53737k3661M6077K28519A11493E1263R2401a08224C79698A5887J34873
13384A50760n6915J66776J88418j87173A19212Q2785J44564j18586a05962i031
$$ plain form
13458 304364 136188 -12943 -160741 255743 163828 329035 363946 182017 273502 327023
13448 327023 544268 129063 2360 -183348 -198254 144380 457069 13053 79896 344135
13438 344135 200228 142504 42899 120825 211597 121661 -14366 567718 33684 6930 25330
13427 25330 407730 98625 402752 58968 507298 -164236 258942 432386 -4617 538617
13416 75287 295315 216278 426685 515269 80738 44721 184721 -140445 -155253 130286 -184671
13404 262134 338705 118369 328752 -154042 210118 348379 131988 280806 113897 153737
13394 153737 130076 176153 404672 111493 51263 143664 -108224 379698 15887 150760
13384 150760 93845 260621 449039 261866 119212 201997 346561 227975 -105962 -9031
13373D15712j91133r9470J99832L3566a0326D49777R7711B58401N1456m44q1598
13362B27815O5042j9677J4566I9975M87969A91279J02343o2674A4540L30597r5219
13351B49918I4485J2058N0695o7538P6559i2008D30955k3223K39108B74607J20574
13340C95181K9878K67060B04636p3673k04o1102O96246l14765m5933M3529G6688
13328D6204L94608A55072e422A0755K11819o1471J99230G6531J87671k5700r6442
13317A42060N53915A16276K02164j28174K2935J74279I5841J3615E3039L87037
13307D40076j82983i8193C65046b3094A17889o323P9782J2627O185Q0084F2348
13295A94335e8299k47834B48459o7662n3874K95887A10759J13205D3518K77933
$$ plain form
13373 415712 224579 125109 324941 358507 -10326 449777 547488 258401 309857 309413 227815
13362 227815 292857 273180 287746 99975 587944 191279 293622 230948 14540 345137 249918
13351 249918 94485 106543 157238 89700 166259 -92008 430955 407732 646840 274607 395181
13340 395181 425059 692119 204636 130963 130759 69657 765903 451138 405205 448734 76688
13328 46204 440812 155072 -5422 10755 222574 161103 360333 76531 264202 238502 142060
13317 142060 695975 116276 318440 190266 213201 387480 95841 109456 53039 440076
13307 440076 257093 -98193 365046 -23094 117889 111566 191348 203975 210160 290244 62348
13295 194335 -58299 -306133 248459 180797 126923 422810 110759 223964 43518 321451
13285C21451J62460I1271L87401B20601c2777G3388a35789B13220r7222i2749
13274C29504p7379b88662D5784Q8632c0757B9651J89171a1835F2374K32626b90593
13262b57830B17458J53958a06587C18639j16801J841H5354a04047D5882M098g9645
13250A94451P1103Q2549I1766K70785o2030j47733K34266b71472g5748A52421
13239D53365A68359A6624J58006m9475a01847D1824Q0939J45912p8699q890C8474
13227A79199a88131h6367B07660q091p826G5610j5520i2207H543N6444J13904
13216A78891a1023B68676d6947o6662l6663A71032j9335R8816J50893A94510b48886
13204a67799A27107a27710C25050l404A04772j5105O8460b0582A68493J78759
$$ plain form
13285 321451 483911 91271 478672 220601 -32777 73388 -135789 213220 115998 -92749
13274 329504 252125 -288662 45784 134416 -30757 29651 218822 -11835 62374 295000 -290593
13262 -257830 217458 371416 -106587 318639 201838 203679 85354 -104047 45882 49980 -79645
13250 194451 265554 348103 91766 362551 300521 152788 387054 -271472 -75748 152421
13239 453365 168359 16624 174630 125155 -101847 41824 122763 268675 189976 181086 38474
13227 179199 -188131 -86367 207660 199569 191743 75610 60090 -92207 8543 64987 178891
13216 178891 -11023 268676 -46947 -113609 -150272 171032 151697 250513 401406 194510 -248886
13204 -167799 127107 -127710 325050 321646 104772 89667 158127 -20582 168493 347252
13194C47252g7131B36551r3315d1799E0090a41742c0687B36890c6242B42985q4295
13183A58690A6326K41800J3069B4656J34998a62137H796i3623B26315C9155J92610
13172B31765n584A04715C6857J2745b02868M5716A8182J93196g7549a5692A58733
13160B78850a3217I4226C3765b1233B35708q8095p2278a2796o6936a8055B04840
13148A53220D4957J85645q4534Q1666J6877k8457n2370j8493D5000K6425J94137
13137B65562F5703J77020R9872A62145m6314M9150J11308l3621D7007L26436j66364
13126B07079l5575J58964B7548a15694A05981b9928B13800f2805j37103A62588
13115B25080H7442J67042j00143i0365k4954n5197g8641m412r4667D00236A66570
$$ plain form
13194 347252 -77131 236551 143236 -41799 50090 -141742 -30687 236890 -36242 242985 158690
13183 158690 16326 258126 271195 24656 159654 -162137 8796 -93623 226315 39155 231765
13172 231765 226181 104715 36857 49602 -202868 -157152 18182 211378 -77549 -15692 158733
13160 278850 -13217 94226 33765 -21233 235708 147613 75335 -12796 -79732 -18055 204840
13148 153220 44957 230602 146068 227734 244611 216154 163784 145291 45000 71425 265562
13137 265562 65703 242723 342595 162145 115831 164981 276289 242668 47007 373443 207079
13126 207079 171504 330468 27548 -115694 105981 -29928 213800 -62805 -199908 162588
13115 225080 87442 254484 154341 -90365 -115319 -170516 -78641 -83053 -177720 400236 166570
13103A59926a14014l8054B27635O466r9265g7006n2375j94065A42267p14a69331
13091h1552d786E0205J76669E8390J9203J38700E7564a5779C2563J51844C5051
13079F1001d4541o1708L4175A36175a35317F2858K37031a3177j68624C24449F5975
13067E1573J45274c02160d8474E0798c7671k84923F1451a65469E0875L11620A42110
13055c7147m3028A98609f4263M306j63128c9199l2274E0789a85749f6733D03888
13043d9108A09978i2227F507a67631A13491M1194h1795J1567A05977Q6526O1612
13032B54115B9339J22875a93025A61099g7515b3420B73679j16169K14897a96567
13021I7964k5168a72906C64057a1437I6855J75673q2969a47012f325A5381b8959
$$ plain form
13103 159926 -114014 -152068 227635 234101 134836 -77006 -129381 -323446 142267 141553 -169331
13091 -81552 -4786 50205 226874 58390 77593 216293 57564 -15779 32563 184407 35051
13079 61001 -44541 -106249 -72074 136175 -135317 62858 299889 -13177 -181801 324449 65975
13067 51573 196847 -302160 -48474 50798 -37671 -322594 61451 -165469 50875 362495 142110
13055 -37147 -80175 198609 -64263 -59957 -223085 -39199 -71473 50789 -185749 -66733 403888
13043 -49108 109978 -92227 6507 -167631 113491 154685 -81795 -70228 105977 192503 254115
13032 254115 29339 152214 -193025 161099 -77515 -23420 273679 157510 372407 -196567
13021 97964 72796 -172906 364057 -11437 96855 272528 189559 -147012 -6325 15381 -28959
13009A57429h6383C6906m934F526K28182H0882C363P1187a32332G2911K8158K164
12997A03233C8124b9593A94867o8025b35344B45250e7783I9978a5423k51937f582
12985D2754b90940m7253C79325a42980b6962F7118c2730A58433k1942M4054b3723
12973A63110a69184a4686A76056c54778A80916Q7832l9591C5090J20877a08961
12962B82065M269m1790J52689b17107B4331M8534a40768A10939c54055e456k15888
12951b21344D640J3989g6233l4510B96648d6398B38709I9860L09854D5307a59594
12939I9479M9567F6218a8104B42103a55331A96169g5778j4515A55583b58586A60828
12927A57566e098D8523L35184A23718a7029D33458a66233B6195J59226a55582
$$ plain form
13009 157429 -86383 36906 31972 6526 234708 80882 3363 74550 -132332 72911 101069 103233
12997 103233 38124 -29593 194867 126842 -235344 245250 -57783 99978 -15423 -267360 -6582
12985 42754 -290940 -338193 379325 -142980 -26962 67118 -32730 158433 136491 180545 -23723
12973 163110 -169184 -14686 176056 -354778 180916 268748 229157 35090 155967 -108961
12962 282065 286334 244544 397233 -217107 24331 72865 -140768 110939 -354055 -5456 -221344
12951 -221344 4640 18629 -76233 -110743 296648 -46398 238709 99860 409714 45307 -159594
12939 99479 149046 66218 -18104 242103 -155331 196169 -75778 -90293 155583 -258586 160828
12927 157566 -5098 48523 383707 123718 -17029 433458 -166233 26195 185421 -155582
12916f515l29963j42348A45410b6114q7161j7235j409c7308B95363q0154L33167
12905E48376B42274E2936J27277n0961k0974Q3366i3907A40173e1560k17753k6868
12894b96181J40198D8868e2891j13519B5931a42095A8137a1974l7107J2588l04947
12883c41440I612O2882J82904c7046A5735K51714j07081a23158D5360R1470n1286
12872H5544J33813a92775B37026a3798l65527A75617R9046c5455j02476A3127
12861I6839i5120b0868l1092k8676j20523E9817K6263P0168b89871B85876o6269
12850B19607a38206B0592c04135B23606i7730k52575H2330M5988b83215B6112
12839b22932d798j18572B01076b5379B56221f1183j24579A17557E2501b5212j2860
$$ plain form
12916 -6515 -336478 -478826 145410 -26114 -113275 -130510 -131919 -37308 295363 215209 548376
12905 548376 242274 52936 180213 129252 108278 191644 -93907 140173 -51560 -269313 -296181
12894 -296181 -155983 48868 -52891 -166410 25931 -142095 18137 -11974 -49081 -36493 -341440
12883 -341440 9612 72494 255398 -37046 15735 267449 160368 -123158 45360 136830 85544
12872 85544 219357 -192775 237026 -13798 -379325 175617 274663 -35455 -137931 13127
12861 96839 -95120 -20868 -51960 -80636 -201159 59817 86080 156248 -289871 285876 219607
12850 219607 -138206 20592 -304135 223606 -97730 -350305 82330 128318 -283215 26112
12839 -222932 -4798 -123370 201076 -25379 256221 -61183 -185762 117557 52501 -25212 -38072
12828c8072A37108a89723E48b24900h779j87879A09272l291a88236B22522c4843
12816i811m5173o3622j1657e3932A10869A8125a04680H1493J62967A03964B7101
12804c33408a6092D03315b33608R1136K567j8239Q270k4633p0381e946H460N2618
12792F1078c16724J13871C1244R1067Q6796P9523a98676i2171l21060A0216a38123
12780c4209A2721a8564B95300I135K19437l408D9946a25119A10597b44182A17479
12768A28666c31916c7318p0045B7490b8907n2241b6555k5714K4906H1524P5513
12757A57037i097l7405j77465G4259M9641J06618B6759f2128K2350A31907K05221
12746C37128a08943C26134e808p3591D08098a29668b3287j46304A27192B3187
$$ plain form
12828 -38072 137108 -189723 548 -224900 -8779 -196658 109272 105981 -188236 222522 -34843
12816 -9811 -54984 -118606 -130263 -53932 110869 18125 -104680 81493 244460 103964 27101
12804 -333408 -16092 403315 -233608 -142472 -139905 -158144 -149874 -174507 -244888 -5946 8460 61078
12792 61078 -316724 -202853 31244 122311 209107 288630 -198676 -92171 -413231 10216 -138123
12780 -34209 12721 -18564 295300 9135 228572 225164 49946 -125119 110597 -244182 117479
12768 128666 -331916 -37318 -107363 27490 -28907 -81148 -26555 -52269 -27363 81524 157037
12757 157037 -9097 -46502 -223967 74259 123900 230518 26759 -62128 -39778 131907 337128
12746 337128 -108943 326134 -5808 -79399 408098 -129668 -23287 -169591 127192 23187
12735d27736a56487a9582l1613m6138D45958J8284A37981N1209b85681a08905
12724c14523d7642m1044k9272A93657c9870q7207C44839I0963c5276j26979C06327
12712c49014a13239A12401n3565O7702J13989L9777K5764i2362B98528b2065B53358
12700g1148f33k0602C1112J8004L4485a39801A40861a49164P2750p8794C26673
12688f2725A55081k2062D775N1190b30631d3429n9A34019b3520j65349f3933B44401
12675d07958h5129A7829J86474A3332d0320j7841A7686J55715L1389d11139B0288
12663d6938C42773P859A55173p4879a20381A20222D1810L09767j60146f3863B72670
12651C93420K63518I3127k7734h2462A77878b78774i9669A07480g4683b8743A56748
$$ plain form
12735 -427736 -156487 -19582 -51195 -97333 445958 464242 137981 189190 -285681 -108905
12724 -314523 -47642 -88686 -117958 193657 -39870 -127077 344839 90963 -35276 -162255 306327
12712 -349014 -113239 112401 58836 126538 240527 280304 306068 -92362 298528 -22065 253358
12700 -71148 -633 -21235 31112 49116 83601 -139801 140861 -149164 -76414 -155208 326673
12688 -62725 155081 133019 4775 55965 -230631 -43429 -43488 134019 -23520 -188869 -63933 244401
12675 -407958 -85129 17829 204303 13332 -40320 -58161 17686 173401 204790 -411139 20288
12663 -46938 342773 350632 155173 80294 -120381 120222 41810 351577 191431 -63863 272670
12651 393420 656938 93127 65393 -82462 177878 -278774 -99669 107480 -74683 -28743 156748
12639B10853a45123N207k53555g8999A61524G3523h892B75504J14671j29575D2151
12627H2628Q4987J52277L0397j4886A39985C3288M0559L08093I2379K42771A58406
12615H3690d0517p4993B93744a5495j30359e4007H2216c7047f544m4266D2639
12603b51611A53428a44292b0047j41005H7062B578d7807D45379A15482h6372B25379
12591d780A89686p6293c81077I8595O8141C5081h786j26075a1564j0761I813J73286
12579A83099C529K34673C3801a51239j35534B87034d726H6112a18145e3497B37455
12567g7836D6144a07577e875n5512B16097a26168k3116J8086F6153b93302B415
12555e0852A74343a70040m274A75682g6533j86407c1846k7803D9564K58J24135
$$ plain form
12639 210853 -145123 -139916 -393471 -78999 161524 73523 -8892 275504 390175 260600 42151
12627 82628 167615 319892 350289 335403 139985 33288 73847 381940 92379 335150 158406
12615 83690 -40517 -115510 293744 -15495 -145854 -54007 82216 -37047 -6544 -50810 42639
12603 -251611 153428 -144292 -20047 -161052 87062 2578 -47807 445379 115482 -86372 225379
12591 -4780 189686 113393 -381077 98595 166736 35081 -8786 -134861 -11564 -22325 9813 183099
12579 183099 3529 238202 33801 -151239 -286773 287034 -4726 86112 -118145 -53497 237455
12567 -77836 46144 -107577 -5875 -61387 216097 -126168 -149284 -131198 66153 -293302 2415
12555 -50852 174343 -170040 -174314 175682 -76533 -262940 -31846 -59649 49564 49822 173957
12544A73957i1322C08534c6113A38008b18205p4487I3114J80802I7825c428C9251
12532I807K06066K07513A85948L60938B35854K08519j81179a01276H3731d2424
12521g2871C3409a63878g8679B6212a11819g026C6141M7332K44885a40730A85477
12509E0034c38284i2485M5380A18801J61307A6340h0535C36790K06309L7864k56646
12498C24317M14910C21440j1653J41346A37763k6157O9432p5813r549e9771j00506
12487a60277A14398J39536b66203I8674f5797A52280Q4561o0038C8427K50881
12477B89308r3017j5851J13517b54168G2136J75525I1891a64767C31559A24687
12466I417c18816a21609l4131J1268C24288c6k9452A76402p4297M8081e6174F9819
$$ plain form
12544 173957 -91322 308534 -36113 138008 -218205 -292692 93114 273916 97825 -3428 39251
12532 9807 215873 423386 185948 546886 235854 444373 263194 -101276 83731 -42424
12521 -72871 33409 -163878 -78679 26212 -111819 -7026 36141 83473 328358 -140730 185477
12509 50034 -338284 -92485 -47105 118801 280108 16340 -80535 336790 543099 580963 324317
12498 324317 739227 321440 309787 451133 137763 111606 181038 105225 95676 -59771 -160277
12487 -160277 114398 253934 -266203 98674 -65797 152280 236841 176803 38427 289308
12477 289308 196291 180440 293957 -254168 72136 247661 91891 -164767 331559 124687
12466 9417 -318816 -121609 -155740 -144472 324288 -36 -29488 176402 102105 150186 -56174 69819
12453c81780B66545l2240e0674k20294j3675J39892k09614J51865A56338c46049
12442G9089a64221l668N7758k1447c4350F1761J88004a22207I0200P2868N879
12431A68947n8315b63267C34100d6501B71219b36877A20084A6786d12280a39150
12420d0367k15662R777C6564d03716F4476c89798D0395a47594L8785A16100J76188
12409B92288a17370G2242O9878j7238K7125b35188K5071d5476a8885l4505A31485
12397C43258I2471A1531a57892B41331c5973B35509c616j03184D2306b5465k21206
12386b46671A5101b5320A88410f807A70644l5999E9185a5060A73271K9938i6180
12374C744J72357c06455B07115J45681C5689N19718B8271A307b53990A979d0044
$$ plain form
12453 -381780 266545 234305 -50674 -270968 -284643 -144751 -354365 -202500 156338 -346049
12442 79089 -164221 -167889 -110131 -131578 -34350 61761 249765 -122207 90200 163068 168947
12431 168947 110632 -263267 334100 -46501 271219 -236877 120084 16786 -412280 -139150
12420 -40367 -256029 -246252 36564 -403716 64476 -389798 40395 -147594 -108809 116100 292288
12409 292288 -117370 72242 142120 124882 152007 -235188 -210117 -45476 -18885 -53390 131485
12397 343258 92471 11531 -157892 241331 -35973 235509 -3616 -106800 42306 -25465 -246671
12386 -246671 15101 -25320 188410 -6807 170644 134645 59185 -15060 173271 203209 -96180
12374 3744 176101 -306455 207115 352796 35689 555407 28271 1307 -253990 1979 -40044
12362a93876I8927d2657B16003p3962j7503J46769R2538A47285P5288C28J49989
12351A50317B2761K19724q4166b02028K5487B72101C7851N6947M7964E3139K6649
12340G9788a60976d5380A00591a10201B86125n8164n5221f853C73873j79099e800
12328i7497f943j29634A08344h2600E3689M15819A32842a41106B78643j6290K0042
12317B82395A00812J43309h5104D29839l2632A51158n4496D5180J78104j0349
12307B12935a86924C25937A41496J44986H3536m1273K0954J86179a13440F547
12296d4703A47216a49645A81573b44356a0076A79522a05643e779q8497A62520
12285i2826B84771C2931R9828P0469J39020j17923F7926L67436b57394f288A64913
$$ plain form
12362 -193876 98927 -42657 216003 142041 124538 271307 363845 147285 222573 328 150317
12351 150317 22761 242485 158319 -202028 -176541 272101 37851 94798 142762 53139 79788
12340 79788 -160976 -45380 100591 -110201 286125 227961 172740 -6853 373873 194774 -5800
12328 -97497 -6943 -136577 108344 -82600 53689 469508 132842 -141106 278643 262353 282395
12317 282395 100812 244121 -85104 429839 397207 151158 96662 45180 223284 212935
12307 212935 -186924 325937 141496 286482 83536 42263 63217 249396 -113440 6547
12296 -44703 147216 -149645 181573 -244356 -10076 179522 -105643 -5779 -94276 162520
12285 -92826 284771 32931 132759 203228 342248 224325 67926 435362 -257394 -6288 164913
12273a05685B95059j00779a9461I3798J80469L51617C5769g5273A38067F4527
12262H0751h7426E8165R266K88102o1875A21965k6773J45311B6643K31062b95196
12250B28992l7837l5271R9746l7645J63110n3897b0114o6175A98481j3450K281
12239A87312j4208C3694A2290b7652m9548A95003Q1891j26566K23877b19850B25210
12227B7040J14197j0532O0382j0476L12210q2624P6323A53999K85102j9578A65636
12215D26042J50016k03322a2433C80663j23126E6633K13761K14577G1307J28214
12205A99521p5149M9920g3373B40616G9216K0935h1645D11196n3841o7515L23297
12194F13137C00582k9774h9436B61166J90760m2887j19432J18746l8181j43153
$$ plain form
12273 -105685 295059 194280 -19461 93798 274267 625884 35769 -75273 138067 64527
12262 80751 -87426 58165 67431 355533 293658 121965 95192 240503 26643 257705 -295196
12250 228992 191155 155884 255630 217985 381095 327198 -20114 -86289 198481 185031 187312
12239 187312 173104 33694 12290 -27652 -77200 195003 276894 150328 374205 -219850 225210
12227 27040 141237 130705 191087 180611 492821 410197 486520 153999 439101 419523 165636
12215 426042 576058 372736 -12433 380663 257537 56633 270394 484971 71307 199521
12205 199521 124372 174292 -73373 240616 79216 100151 -81645 411196 357355 289840 613137
12194 613137 300582 270808 -89436 261166 451926 409039 289607 408353 370172 227019
12184B27019N2422P6788P1403A99765K12703j62468J83982J47286p0115A16808
12173B7167J87292D1627a08907D01775j65936D4016L31941j69076n1264p7601
12163G8016Q2970R5260J68758K2464G7386L42010E9192M4059J83211j5353a47558
12151H5485f1455j53442e8036A09779J3949M60347A63487d5512C06992F9045J31920
12140B00965B8305K31293f9987C31374r2424J08109n6896q502K9350j26126J90504
12129C75389r1056R6555j34215k5529k8890K15166C2171K04840m1524i5939G3581
12117G3516J23420r1764h8249j10902C67712b8148A97468K10947A17495J89654
12107C07149E1227O0238c33863C47883b86993A74779K63048A13499n6402K92316
$$ plain form
12184 227019 279441 356229 427632 199765 412468 250000 433982 581268 511153 116808
12173 27167 214459 41627 -108907 401775 235839 44016 375957 206881 155617 78016
12163 78016 160986 256246 425004 447468 77386 419396 59192 103251 286462 271109 -147558
12151 85485 -61455 -214897 -58036 109779 123728 584075 163487 -45512 306992 69045 200965
12140 200965 28305 259598 -69987 331374 238950 347059 290163 281661 311011 184885 375389
12129 375389 284333 380888 246673 221144 192254 407420 32171 237011 195487 -95939 73581
12117 73516 196936 105172 -88249 -199151 367712 -28148 197468 408415 117495 307149
12107 307149 51227 111465 -333863 347883 -286993 174779 437827 113499 57097 349413
12097C49413b44425A04624J1479M8345E0236b49036j12017C0524R2674d6340B68788
12085B13892a40757c9233A37163J70806N0442A09320K52520D1455N030b09735
12074A20119J35678a18860C6762J9856Q3910b66314A60547R2847p5381c1413r2523
12063a23936K5957G7147J63308J44145B7575a62726A52106a88221f8516k70827
12053c39343a3828B44209b2901j3138I0417b15217E3562K84118a81849A69577
12042B06582o817r1337k3851a75163k45670D5137Q0296o288a18318B4160b84377
12030B81462a15485A09568R0734k9063d1107b016j57816C7005a36940a5384B34610
12018D41564a91751A88184o3836i2436A63323a27699H7621a57201L3205e7365
$$ plain form
12097 349413 -244425 104624 116103 164448 50236 -249036 -361053 30524 123198 -46340 268788
12085 213892 -140757 -39233 137163 307969 358411 109320 361840 41455 46485 -209735
12074 120119 255797 -118860 36762 56618 140528 -266314 160547 253394 178013 -31413 -123936
12063 -123936 -97979 77147 240455 384600 27575 -162726 152106 -188221 -68516 -339343
12053 -339343 -13828 244209 -22901 -36039 90417 -215217 53562 337680 -181849 169577
12042 206582 199765 108428 84577 -175163 -420833 45137 125433 119145 -118318 24160 -284377
12030 281462 -115485 109568 200302 171239 -41107 -2016 -159832 37005 -136940 -15384 234610
12018 441564 -191751 188184 124348 -92436 163323 -127699 87621 -157201 -123996 -57365
12007A67514K8700c24575A30940o0643a28198B58643b38379M6481j74435a55691
11996a4825A11041d6366o2757C74768c2835B0618M7208f6010B85998G8617C1024
11984A1081M8982L6930q761j1683c95914a7826j16397B75168a71314N8281L6967
11973g6066C1755c27669a54477o4761A35194c5190C3698b77364j2723H5129f056
11961c7335a0638A52899a1484G0379J94072e1543a6435D412J45434a87312a3250
11949a49866j19102A12767J61127h020o7525j82224i9806q7576A86204b21150
11938c68254e2070m8362m1855A67592e0709H5511b07129B9155K57970b13874D4403
11926b61921Q0579a5703f823q1087B81025f4462C4301a98638o8842A8833e47546
$$ plain form
12007 167514 196214 -324575 130940 70297 -128198 258643 -238379 -191898 -366333 -155691
11996 -14825 111041 -46366 -109123 374768 -32835 20618 67826 -66010 285998 78617 31024
11984 11081 60063 96993 88232 76549 -395914 -17826 -134223 275168 -171314 -113033 -76066
11973 -76066 31755 -327669 -154477 -219238 135194 -35190 33698 -277364 -290087 85129 -6056
11961 -37335 -10638 152899 -11484 70379 264451 -51543 -16435 4412 149846 -187312 -13250
11949 -149866 -268968 112767 273894 -8020 -75545 -257769 -99806 -187382 186204 -221150
11938 -368254 -52070 -100432 -142287 167592 -50709 85511 -207129 29155 287125 -213874 44403
11926 -261921 -181342 -15703 -6823 -87910 281025 -64462 34301 -198638 -267480 18833 -547546
11914b33185B69135a94229O8755k8495r0168P5315B76099b95169a39611C49148
11903a63114A42413K32541n4799p5575B213d984A3743a82257J6447l7388k03639
11892d06837A76799i0833p721l0738b0329h945j19674l1991D5999L9864d69789
11880D17244b04300A28642n7646c89008C5332b98845A91764c4264o1504I5564
11869A11845g2030l1411H7746C1793a59167c7885G3547j0368J71527F668i9071
11857c04620A84934K58035c88035h1770A76682a03478h15l5452j45974o8585d2732
11845B29215a00853A17461c14307H6033a51666C421M7262c09353a29878c5489
11834A9269f9266j51196F4131J9670j7044B2015f1559B9481a34159a0751I7104
$$ plain form
11914 -233185 269135 -194229 -125474 -153969 -244137 -168822 276099 -295169 -139611 349148
11903 -163114 142413 374954 320155 244580 2213 -4984 13743 -182257 -165810 -203198 -406837
11892 -406837 176799 -90833 -98554 -129292 -20329 -8945 -128619 -160610 45999 85863 -469789
11880 417244 -204300 128642 70996 -389008 35332 -298845 191764 -34264 -95768 95564
11869 111845 -72030 -103441 87746 31793 -159167 -37885 73547 63179 234706 6668 -99071
11857 -304620 184934 442969 -388035 -81770 176682 -103478 -815 -36267 -182241 -250826 -42732
11845 229215 -100853 117461 -314307 86033 -151666 3421 50683 -309353 -129878 -35489
11834 19269 -69266 -220462 64131 83801 66757 22015 -61559 29481 -134159 -10751 97104
11822a77798c3245j20470I0695A9892g4893A5841e4141A12740a66011j55736d7755
11810A03434a27946l78075h36l1596p5741b687A7723b43072N6548e8400H7392
11798a56945K1280B9508f6145j98762b9267I2600a01530J6861K7150l7114m7015
11787a41648C43954b23373N610M3550B09320q9408a7980A3892b11704a2289o4030
11776g6319m7552C05297g25546b1768O633j8006A54267o5240a90806e0793o2809
11765a13602q6117D4847a87186B9109e4590O386a2687l22578f3452k30267K1914
11754b71805a18736m8968n9373A50099a66629F6582O6941c14306O9533E9580a22574
11742H8647c05074H0660a60734A82874F9771L9653K6267c69109J78406j11371
$$ plain form
11822 -177798 -33245 -153715 90695 19892 -74893 15841 -54141 112740 -166011 -321747 -47755
11810 103434 -127946 -506021 -836 -32432 -108173 -2687 17723 -243072 -186524 -58400 87392
11798 -156945 -135665 29508 -66145 -264907 -29267 92600 -101530 -84669 -57519 -94633 -141648
11787 -141648 343954 -223373 -217763 -174213 209320 119912 -17980 13892 -211704 -12289 -76319
11776 -76319 -123871 305297 -725546 -21768 -15135 -33141 154267 89027 -190806 -50793 -113602
11765 -113602 -199719 44847 -187186 29109 -54590 -48204 -12687 -335265 -63452 -293719 -271805
11754 -271805 -118736 -167704 -227077 150099 -166629 66582 133523 -314306 -244773 59580 -122574
11742 88647 -305074 80660 -160734 182874 69771 109424 135691 -369109 -190703 -302074
11732c02074B42709c19588J55334D4930o244a24076A6187a30756d6161B00169
11721b13784N6518A73498a53143G188a8480k7315C1547d2633k76815A96699b44531
11709C8791P6901J18107F6945d0725k39280O8409f202k30460H5504a59134K0229
11698a38905N7645a9282B16318d2395j75784F4343J12198c07435g5964C0294h7341
11686e0554j37202A24957c21821A10091b9259J1811A27766K0733a7454q6299A10642
11674A11560b09850P5964C7183b64818K6908k74484a70133C8894Q8991a96321
11663b00765J9383b4260A4573f3730k2231k4300d0087j27700K0240m6437O6472
11652a27512B95384C3709a34496k6873a9516A35561a56418n5532d6309B16178
$$ plain form
11732 -302074 242709 -319588 -164254 44930 38686 -124076 16187 -130756 -46161 200169
11721 -213784 -157266 173498 -153143 7188 -18480 -45795 31547 -42633 -319448 196699 -244531
11709 38791 115692 233799 66945 -40725 -280005 -211596 -6202 -236662 85504 -159134 -138905
11698 -138905 -81260 -19282 216318 -42395 -218179 64343 176541 -307435 -75964 30294 -87341
11686 -50554 -187756 124957 -321821 110091 -29259 -17448 127766 148499 -17454 -103753 110642
11674 111560 -209850 -133886 37183 -264818 -237910 -512394 -170133 38894 127885 -196321
11663 -200765 -181382 -24260 14573 -63730 -85961 -110261 -40087 -167787 -147547 -193984 -127512
11652 -127512 295384 33709 -134496 -161369 -19516 135561 -156418 -211950 -46309 216178
11641C53752A4738d4455l5674G2363J66804a23701d2205B9261J42118b21891M3628
11630a78263P7473L1769r2622M1810m38922J86600i1924m2147N7871A45838F3345
11618E8196g1008J3018a1888D5070j1290d8307J3371r1379p8863m0710A1399K27954
11606B39353c2480q1833M5182h074I0257a54733A18525K60355b54790J621j91383
11595d44552J93171A32680c22228C09612c56138A06014a42259N8119A91846g4506
11584A71978G3210Q257g1817A48154p1806a48347f9926j28727e3770B10589h5959
11572A39420b41664k58190a59683F1213J26502A3383J10405d17162f0130j31048
11562a91178a5267k76376D00738a38346A14366b19542e5587l26022A46710l2794
$$ plain form
11641 353752 14738 -44455 -80129 72363 239167 -123701 -42205 29261 171379 -221891 -178263
11630 -178263 -100790 -69021 -161643 -119833 -558755 -372155 -91924 -134071 -76200 145838 63345
11618 58196 -71008 -57990 -11888 45070 33780 -48307 -34936 -126315 -205178 -245888 11399 239353
11606 239353 -32480 -114313 -69131 -8074 90257 -154733 118525 378880 -254790 -253169 -444552
11595 -444552 -251381 132680 -322228 309612 -356138 106014 -142259 -84140 191846 -74506
11584 171978 73210 81467 -71817 148154 76348 -148347 -69926 -198653 -53770 210589 -85959
11572 139420 -241664 -499854 -159683 61213 187715 13383 123788 -417162 -60130 -191178
11562 -191178 -15267 -291643 400738 -138346 114366 -219542 -55587 -381609 146710 113916
11552A13916n2483d755j02431J1657j28281e8253B78310a52510E4289c20797a17724
11540a47150B07431B4675J07386b0416j38029f2857B5494b86424B23593i9039
11529C91352a46364q8847a5543B61209n1779A01669a53594k6534D58913e930E2954
11517B48688b21190h1214A06858A3623L01260a35100C35878k4174n2741B1346
11506D136a52068A27934B4693i3881E5804J44011J86607L8602j37338a26743A32467
11494A00345K39505J93060B37593o8696O4026J26987I3293a0474e215p3866E64368
11482C39270L7463m6113J01577A18007A3867a14091B83154G7863g2055H7733J67960
11471B55693O5641d0133F96911F3312K70840j50260O0234j10760K25920A18929
$$ plain form
11552 113916 61433 -4755 -107186 -95529 -223810 -58253 278310 -152510 54289 -320797 -117724
11540 -147150 207431 24675 132061 -20416 -158445 -62857 25494 -286424 223593 -99039
11529 391352 -146364 -235211 -15543 261209 209430 101669 -153594 -180128 458913 -5930 52954
11517 248688 -221190 -81214 106858 13623 314883 -135100 335878 311704 258963 21346
11506 4136 -152068 127934 24693 -93881 55804 199815 386422 425024 287686 -126743 132467
11494 100345 339850 532910 237593 168897 232923 359910 93293 -10474 -5215 -79081 564368
11482 339270 376733 330620 432197 118007 13867 -114091 283154 77863 -72055 87733 255693
11471 255693 321334 -40133 696911 63312 334152 183892 244126 133366 359286 118929
11460A51202r676D1619J80617R5564j00035J00959j26306A4940O47831D2655M6713
11449H9368a05546G6943M4296Q3769J2531A5764K88488A31187K80303f5110B37857
11437B2376J14383F2785J33122J04809j12271b66348C79470p1182i7536B82353
11426B78232b31024h2780J3542C4417d245A02234J78563F7048h6590A09281J53728
11415B63009r6159g0769J2972A02942N7150G358K38221b96104E8889d6466A52106
11403B09043C5854d3849A00958g1717j25642C42904b72634K3485A45998c05351
11392d8129k8606A15263m6757O1588b54867D1060a52085j06993H3346a4255L778
11381a0477B93706b32901A7527a33357M0172A9711K70148m1268a69661j79806
$$ plain form
11460 151202 141526 41619 222236 317800 217765 318724 192418 14940 662771 42655 89368
11449 89368 -105546 76943 121239 205008 217539 15764 304252 131187 411490 -65110 237857
11437 22376 136759 62785 195907 300716 188445 -266348 379470 308288 -97536 282353
11426 278232 -231024 -82780 -69238 34417 -4245 102234 280797 67048 -86590 109281 263009
11415 263009 166850 -70769 -57797 102942 160092 7358 245579 -296104 58889 -46466 152106
11403 209043 35854 -43849 100958 -71717 -197359 342904 -272634 -249149 145998 -305351
11392 -48129 -76735 115263 68506 130094 -254867 41060 -152085 -259078 83346 -14255 -10477
11381 -10477 293706 -232901 17527 -133357 -93185 19711 289859 248591 -169661 -349467
11371c49467J12410C6359C196K80568M1126b22206a00383j83223M1675g5007i530
11359c26217E7553b9886A05170E0718b43374a12047L1042j47789O9249j17090
11349b76635J38183G7023f3136D32801A70780H5052a0454m26567a63292g663B1993
11337a1685k82326d6176k40661J21068g2771j49520l3708q6223J16110J1934h8461
11325A96814p5296c16677A08159J3965B1569f9896j13273k09569N9257B6486K21099
11314B47585n4119H1070r35d9949A35311a24284E9130I681L76887c12490A92109
11302f6103m20619K11599A2669b25376C3643a21774l21219a98885i4163c6864
11291c45409E9083b89961H6938a90080d0031j546m3683D1657J002a80347J1856
$$ plain form
11371 -349467 -237057 36359 3196 283764 324890 -222206 -100383 -283606 -241931 -75007 -9530
11359 -326217 57553 -29886 105170 50718 -243374 -112047 -81005 -228794 -159545 -276635
11349 -276635 -138452 77023 -63136 432801 170780 85052 -10454 -437021 -163292 -7663 21993
11337 -11685 -294011 -46176 -286837 -165769 -72771 -222291 -255999 -342222 -226112 -214178 -88461
11325 196814 121518 -316677 108159 122124 21569 -69896 -183169 -392738 -333481 26486 247585
11314 247585 193466 81070 80135 -49949 135311 -124284 59130 9681 386568 -312490 192109
11302 -66103 -486722 -275123 12669 -225376 33643 -121774 -442993 -198885 -94163 -36864
11291 -345409 59083 -289961 86938 -190080 -40031 -41577 -85260 41657 42659 -180347 -168491
11280a68491d3967C52952j14554c19813a53263A90032B5642J29005n991a00365
11269b74162i4376A22184b46965h9017a4622I7085a9902C6312J3501h2155j6443
11258i8598E3248K3542j6582J67805J68044a89310n0047e6699l27506a2083j27964
11247a40047D0609i6034A59477b25056K2322M8822C767c62945h687A77165B3533
11235B00555b28484e2987F0141a02449p9649A6218K9861a02909k8219D7728a35203
11223a58061B15655A01249l5474a19824F7085a70052A33803B1325a3687j0057
11213b3744I3692A25Q0428J04096d4692o0321B47366a76044B08638a92479n53
11202a93032A40682g659A2163b90311a29294A28441a84693C60055r2987C239e5111
$$ plain form
11280 -168491 -43967 352952 238398 -319813 -153263 190032 25642 154647 148656 -100365
11269 -274162 -94376 122184 -246965 -89017 -14622 97085 -19902 36312 49813 -82155 -98598
11258 -98598 53248 76790 60208 228013 396057 -189310 -239357 -56699 -384205 -12083 -140047
11247 -140047 40609 -96034 159477 -225056 -202734 -153912 3767 -362945 -8687 177165 23533
11235 200555 -228484 -52987 60141 -102449 -182098 16218 46079 -102909 -131128 47728 -135203
11223 -158061 215655 101249 65775 -119824 67085 -170052 133803 21325 -13687 -23744
11213 -23744 93692 125 80553 184649 -44692 -105013 247366 -176044 208638 -192479 -193032
11202 -193032 140682 -7659 12163 -290311 -129294 128441 -184693 360055 267068 3239 -55111
11190g1772j80228c7086B30751b01098h9664C7874b45246c5618j21977L4621B8291
11178A91285E6103a57638F4296d3262k06818C2590c83447m60B32631b99477k80298
11167e79775a9820A6214e8724A7190b23117A43391P4789a49466b8236P39A34335
11155D7074b50721d4419A93717H5504j5198g6116k2968M471B82649J8199C21K96532
11143B96853E5033b44730P2589D4850K16731p6817b87289A64551a56998A70060
11132e9785n5959K413b3130J902A4059L42843F8795K91107r8765a36138G2092
11120B58994J5483a79011P9649B59866p0731i2319C4576b67664B38596c9489j359
11109d0848A44247K55239i5476C07900b02141A83177G40L58157l2073R1489O2617
$$ plain form
11190 -71772 -252000 -37086 230751 -201098 -89664 37874 -245246 -35618 -157595 -122974 28291
11178 191285 56103 -157638 64296 -43262 -250080 32590 -383447 -383907 232631 -299477 -579775
11167 -579775 -19820 16214 -58724 17190 -223117 143391 218180 -149466 -28236 -27497 134335
11155 47074 -250721 -44419 193717 85504 70306 -76116 -99084 -94613 282649 300848 321 296853
11143 296853 55033 -244730 -172141 44850 261581 184764 -287289 164551 -156998 170060
11132 -59785 -115744 -113331 -23130 -21228 14059 356902 68795 359902 261137 -136138 72092
11120 258994 274477 -179011 -99362 259866 189135 -92319 34576 -267664 238596 -39489 -40848
11109 -40848 144247 399486 -95476 307900 -202141 183177 740 358897 326824 418313 480930
11098D80930B11100J30258F4469P0706L45522j53904j06969K5739K58506B28046
11087C11995k5244Q2284A77693j3087J78643K45777p4713A44819a23082B39208
11076A58994n0433L91512J51037j85269J11007j75701p5297j1337L85141k76124
11066D23530J52279L5624L42876D08937J84176m2361J04813Q8811r4691o6393
11056E83292j20826N47704j83376P4050L5078j21868M20353m85683J73286J97327
11046A119337K10733k17602J45555J29658j58322P771J72811l31535K03186O386
11036A287978k55075K49342K10751r5224r375J61538m04452K16961N3352j06888
11026A308908j13676k50355L99039j73647k24450K93661K83281m53196K8528k4493
$$ plain form
11098 480930 211100 341358 64469 135175 480697 326793 219824 245563 504069 228046
11087 311995 286751 369035 177693 164606 343249 589026 514313 144819 -123082 239208
11076 158994 108561 500073 651110 465841 576848 401147 325850 314513 699654 423530
11066 423530 575809 611433 954309 408937 593113 550752 655565 744376 649685 583292
11056 583292 462466 1010170 826794 900844 935922 814054 1234407 748724 922010 1119337
11046 1119337 1330070 1112468 1258023 1387681 1229359 1237130 1409941 1078406 1281592 1287978
11036 1287978 1032903 1282245 1492996 1397772 1388397 1549935 1145483 1362444 1415796 1308908
11026 1308908 1195232 944877 1343916 1170269 945819 1239480 1522761 1069565 1098093 1073600
11016A073600R9396k2861l80981Q5804J79751J40226j55595j19293j52111L98853
11006A146789k85196K43303P1126j07246M31291k47569j19685l7268j82884K22963
10996A135624j21101J09001m12329L15086l8710j06530K79690m6891o3639j78031
10986H72170K9151M15611M0644k48713K28334M1634n82O2976O7559L18619j1433
10975A815970L33714r618K62781J22342L78022N92763J04545O35671K89240N14718
10965E040148L6593O10269m22140j091916q40662n77081o68562k05794k24035
10956A656820k33159l2625m58004L31618k46245L15549k96677l29555B40469L76959
10946F17428k0624b5051D19925B00306J32194o413F2900n953J41089P8918N7710
$$ plain form
11016 1073600 1172996 1150135 769154 854958 1034709 1174935 1019340 900047 747936 1146789
11006 1146789 861593 1104896 1176022 1068776 1500067 1252498 1132813 1095545 912661 1135624
10996 1135624 1014523 1123524 711195 1026281 987571 881041 1160731 1113840 1050201 872170
10986 872170 901321 1316932 1357576 1108863 1337197 1378831 1378249 1441225 1508784 1827403 1815970
10975 1815970 2149684 2140066 2402847 2525189 2903211 3495974 3600519 4236190 4525430 5040148
10965 5040148 5076741 5687010 5264870 4172954 3332292 2755211 2086649 1880855 1656820
10956 1656820 1423661 1391036 933032 1264650 1018405 1333954 1037277 707722 240469 617428
10946 617428 596804 -25051 419925 200306 332500 326087 62900 56947 198036 276954 334664
10935C34664A23496K38419K9885G0875N7336d7928Q688A36257E7533L07850H1796
10923a11619B1391L87567f5864o494A92435J07096l6223a98820D0380b47854B40029
10911A61127G8673R0902b7480l7875j5569k6749a8963k48176J4457d6004a7099
10899e1833I5295D5564Q0444J63489H3698a98546P6300I6163a68476A00431b02446
10887h8525R841A12990d349q9385C1397b30164i7289k12249C11665i6204B6289
10875b12930f2423G9782b86479J30140A17202n7026A6635c067k97512H6104R752
10864I5856b16476m3644f3049F5690a31875K5304H1500f4014N39a8069k78139
10853b96208b5065m55228o4348b19721j16505a43929F187b85288O1547L8588b3318
$$ plain form
10935 334664 123496 361915 391800 70875 128211 -47928 -39240 136257 57533 365383 81796
10923 -111619 21391 408958 -65864 -72358 192435 299531 263308 -198820 40380 -247854 240029
10911 161127 78673 169575 -27480 -65355 -80924 -107673 -18963 -267139 -252682 -46004 -17099
10899 -51833 95295 45564 126008 289497 83698 -198546 -122246 96163 -168476 100431 -202446
10887 -88525 -78684 112990 -4349 -93734 31397 -230164 -97289 -309538 311665 -96204 26289
10875 -212930 -62423 79782 -286479 -156339 117202 60176 16635 -3067 -300579 86104 95856
10864 95856 -216476 -260120 -63049 65690 -131875 -106571 81500 -64014 -63475 -18069 -296208
10853 -296208 -25065 -480293 -544641 -219721 -336226 -143929 6187 -285288 -223741 -185153 -23318
10841G1066f261k43593C78293a70514k02945g0618E9009c50745A85501a96006
10830a23947C70816f3420r9810B67768a64387D097J32212b0443j84163h1955G3655
10818b3056I7479b63212i0598a2996A69022b7382m741m9801p4560E7789b64515
10806B70258b52327R09h9826k76623g5283A26877b71918a27494B50139d1671k71085
10795c12756H6753c4261q9779i851m9940k08941C79946a35320k14528d6575l07308
10784c53883c3944n2939O249J2289E276K16102g4744C4657g1726b347B26065a38924
10771d8530n6424B78559b46081C34921a12461K7034j57968h1723j85610C0629
10760i7448C0855a19345A27972b16379Q1688k2820E1199N1662c2974k47268a16082
$$ plain form
10841 71066 -6261 -249854 378293 -170514 -373459 -70618 59009 -350745 185501 -196006
10830 -123947 370816 -63420 -163230 267768 -164387 4097 136309 -20443 -204606 -81955 73655
10818 -23056 97479 -263212 -90598 -12996 169022 -27382 -32123 -81924 -156484 57789 -264515
10806 270258 -252327 -251418 -89826 -366449 -75283 126877 -271918 -127494 250139 -41671 -312756
10795 -312756 86753 -34261 -124040 -9851 -59791 -268732 379946 -135320 -349848 -46575 -353883
10784 -353883 -33944 -86883 -80634 -68345 5276 221378 -74744 34657 -71726 -2347 226065 -138924
10771 -48530 -104954 278559 -246081 334921 -112461 -85427 -243395 -81723 -267333 30629
10760 -97448 30855 -119345 127972 -216379 -134691 -157511 51199 102861 -32974 -280242 -116082
10748b34151L6987f3574j2945j02471A1201b63088d2702k32495l061r6356i7194
10736d57490F6339b21126B66967d3154A97367p9442a32743B24652i2312B41719
10725a3089o7152j02785B9579R6770g8488j34532a05262A63844J21696b26714
10714c50117f2182j88175g7600A79447a45580A33696b77287a34764B6293J54002
10704A80295A9818h5535B32062q5846h4479o6845G7625b32557Q7158C55002a20487
10692B86462a22304m3906A70542B6458M86400c83436I7143b0042I7555b537A60196
10680C14152e4129k03026f4153I5677a24576G369d6415E8368M2058j8848b66171
10668b55480B94732b99596B05317a93907n6748g4417q8491O1368A8717c39018
$$ plain form
10748 -234151 -197164 -63574 -76519 -178990 11201 -263088 -42702 -275197 -278258 -374614 -97194
10736 -457490 66339 -221126 266967 -43154 197367 117925 -132743 224652 -92312 241719
10725 -13089 -80241 -183026 29579 126349 -78488 -213020 -105262 163844 285540 -226714
10714 -350117 -62182 -250357 -77600 179447 -145580 133696 -277287 -134764 26293 180295
10704 180295 19818 -85535 232062 146216 -84479 -151324 77625 -232557 -145399 355002 -120487
10692 286462 -122304 -166210 170542 26458 512858 -383436 97143 -20042 97555 -2537 160196
10680 314152 -54129 -257155 -64153 95677 -124576 7369 -46415 58368 100426 81578 -266171
10668 -255480 294732 -299596 205317 -193907 -250655 -74417 -162908 -101540 18717 -339018
10657B47554a57839e7099j05503H0254M445k6362a98215i278k23020n6703J22224
10646a66777g5565F8709e6423k4202A16789D1532b69204B071O2187b0B35877b03605
10633b53160C9577J02602i9512k54198i8468k3727j78100a30330A28002i8779
10622A03469b26783A46294J68320B6871g0029L1036j80929K9399c8443m35522
10612d73965K32200A93707H8689B9344d5764n2653B51554a53999I3535c4876H6071
10600e0488p3299F2069e2577B8508K21990D6977b63335d5441B24875m2368a6255
10588d54736J36245H9756a3937A56516e359m82418a21522D1729a04812C4475a80496
10576a8479B11046a80539E5924d20060A13649a85408A8082a41368j42600a9671
$$ plain form
10657 247554 -157839 -57099 -162602 80254 84699 58337 -198215 -9278 -232298 -289001 -166777
10646 -166777 -75565 68709 -56423 -80625 116789 41532 -269204 2071 64258 -20 235877 -203605
10633 -253160 39577 142179 -99512 -353710 -98468 -122195 -300295 -130330 128002 -98779
10622 103469 -226783 146294 314614 26871 -70029 -38993 -219922 -190523 -38443 -473965
10612 -473965 -241765 193707 88689 29344 -45764 -98417 251554 -153999 93535 -34876 86071
10600 -50488 -123787 62069 -52577 28508 250498 46977 -263335 -45441 224875 182507 -16255
10588 -454736 -318491 89756 -13937 156516 -5359 -487777 -121522 41729 -104812 34475 -180496
10576 -18479 211046 -180539 55924 -420060 113649 -185408 18082 -141368 -283968 -19671
10565B53676a80192K9698E2003i5264F2211O3909l3917D0461b73605I4379b90424
10553a22497A16383K20840b48726Q7566C4556b26817A61000a52303n9949C15290
10542A16388b8507n1309A12075F134b6869I5945r148A2252a49034d7895P396k9217
10530f9716J955i721k91468B14357c35394e8918K0554k90725A0656a74906q3258
10519b58164p468I785f8147o4675N1900k25465f0182r446A91457a14665A04260
10507b9981j96076g7689j52031E4674c4792m8290I8494a59040P9082b6348p0095
10496i6443o9007P3587A1639h9422n2890A06663c72106C908d3826A98827H7640
10484a30682B1929K8058a26758j740m4448k3484P8453A39361g7054b0545j02170
$$ plain form
10565 253676 -180192 -150494 52003 -95264 62211 126120 92203 40461 -273605 94379 -290424
10553 -122497 116383 337223 -248726 -161160 34556 -226817 161000 -152303 -212252 315290
10542 116388 -28507 -79816 112075 6134 -26869 95945 86797 12252 -149034 -47895 -40499 -69716
10530 -69716 -67761 -9721 -301189 214357 -335394 -58918 -38364 -329089 10656 -174906 -258164
10519 -258164 -265632 9785 -68147 -132822 -80922 -306387 -60182 -69628 191457 -114665 104260
10507 -29981 -226057 -77689 -229720 54674 -34792 -83082 98494 -159040 -79958 -26348 -96443
10496 -96443 -165450 -91863 11639 -89422 -142312 106663 -372106 3908 -43826 198827 87640
10484 -130682 21929 49987 -126758 -128498 -172946 -196430 -117977 139361 -77054 -20545 -122715
10473a22715o4726r8912p1480J71522h0979A40444P1798c06670a28452N7236m912
10462g6128A89343J06845A00516f3310j86796Q6005e0859n7980j95674J44942
10452a59571j62172G2120a9262H8417K76501f0301r3510O5304J8450g024A34674
10440A76764D0350c07305a28728L9443q5854m814B5375J3276a80568M1598A41903
10428A94610b62970A08892r549h4882j18076b3651j75748k57841E5187K703J02339
10417A60229C704i5367E165J07989b7655j90070Q2792B33402G795N0996a5163
10405B0046c06919B66055a80395C7172a84090k41187b5842I8844b14717R5668
10395a19049c1194D34802e7902I747K1149K53711j30701e187E97175E0957L95158
$$ plain form
10473 -122715 -187441 -286353 -357833 -186311 -80979 140444 212242 -306670 -128452 -71216 -76128
10462 -76128 189343 296188 100516 -63310 -250106 -164101 -50859 -108839 -304513 -159571
10452 -159571 -321743 72120 -19262 88417 364918 -60301 -153811 -88507 -70057 -7024 134674
10440 176764 40350 -307305 -128728 -89285 -175139 -179953 25375 38651 -180568 -138970 141903
10428 194610 -262970 108892 99343 -84882 -202958 -23651 -199399 -457240 55187 57890 160229
10417 160229 3704 -95367 5165 113154 -27655 -217725 -134933 233402 7795 58791 -15163
10405 20046 -306919 266055 -180395 37172 -184090 -425277 -25842 98844 -214717 -119049
10395 -119049 -31194 434802 -57902 9747 30896 284607 153906 -5187 597175 50957 446115
10384D46115A49036B6692K94527H9097R4172M050N3675J79787j7851B01443K03468
10373D04911K13397o7644a4355D48873k05520J59024Q4625m3938K64414K175k14677
10362D94976N16770k92315K50378l35679B20704K28532j57332J10206A34550K10916
10352C45466K44766k50939K80570J69767Q5190M69370m33802B90242p9573p784
10342B02885a6720q0504C99991l5205o726A00007J24381J28665q530j42892K60161
10331D61792k12136D2020a3198E5567K19342o3870J69479d6298C99210H4011f4205
10319C45447K24276A592K14068p5865F0498J93650B329b393k09610d3778r8563
10308a42341F6261a49000A13241J9501J22044b43283d2009r4117B20370a68528
$$ plain form
10384 446115 149036 26692 321219 89097 183269 187319 240994 420781 402930 201443 404911
10373 404911 618308 550664 -14355 448873 243353 402377 487002 443064 707478 709653 494976
10362 494976 1011746 719431 969809 634130 220704 449236 291904 402110 134550 345466
10352 345466 590232 339293 619863 789630 874820 1344190 910388 290242 210669 202885
10342 202885 -16720 -97224 399991 364786 358060 100007 224388 353053 344523 201631 461792
10331 461792 249656 42020 -13198 55567 274909 211039 380518 -46298 399210 84011 -64205
10319 345447 569723 1592 215660 139795 60498 254148 2329 -2393 -212003 -43778 -142341
10308 -142341 66261 -149000 113241 132742 254786 -243283 -42009 -136126 220370 -168528
10297A67581A7164J42015a38219A20415h1590k38964i8799F5252a07110j63944
10287b71054B9329N2781B4547N1273a45432k04389a43234F8112b59797a26683
10276b46162F7846J0706J758C6294K05982A1524c0695G3343h205j64429A81122
10264a09378A03076h1064A41613a13932A1714a30932Q997A66872m0347c7861j33667
10253a71528P7276C02842A29678K6851a42216A61847O8941D1554c8945a8735n3158
10242g1893G6608g1578j28678c3112A46692l0131c19343H9651g0843k29860c9799
10230a33004f5046A28650f7534R245C83112f6063F4876c7565H3626j4966d8322
10218c95673B4429b02245P8060j54459A98779B5783J6388J5057J63198a13083
$$ plain form
10297 167581 17164 159179 -138219 120415 -81590 -320554 -98799 65252 -107110 -271054
10287 -271054 29329 82110 24547 75820 -145432 -349821 -143234 68112 -259797 -126683
10276 -246162 67846 78552 80310 36294 242276 11524 -30695 73343 -8205 -172634 181122
10264 -109378 103076 -81064 141613 -113932 11714 -130932 -121935 166872 126525 -37861 -171528
10253 -171528 -94252 302842 129678 156529 -142216 161847 230788 41554 -38945 -18735 -71893
10242 -71893 76608 -71578 -200256 -33112 146692 116561 -319343 89651 -70843 -300703 -39799
10230 -133004 -65046 128650 -67534 -58289 383112 -66063 64876 -37565 83626 68660 -48322
10218 -395673 24429 -202245 -124185 -278644 198779 25783 42171 57228 220426 -113083
10207a51041B51697g5982A04634A9508a70884j53279o8719J70964A20029a07882
10196B18021r385b06875p358J1112h2646c6399B1900a78262j30651j84017B83191
10184A28922h5180j6457l66504J85377A0317d8150A53412a140j708B4287b93203
10172e3015l8544m9873L4579m7652a3617j45903k36437J35285A59537A3199b71161
10160a98966j30997P6439j6469C9406d22960a75027g812j74382A98778a07853
10149B24234A03923J81334b10447P3354M896j46514J31276L8244e010k82749A26298
10137a86966A6239i8053n837B33478d13663J85294d9707o4282k62707a58398M0283
10126a18115L8072j06813e433A24239K36141A2547h0853n3689j38531Q3720k6322
$$ plain form
10207 -151041 251697 -75982 104634 19508 -170884 -324163 -392882 -221918 120029 -107882
10196 218021 208636 -206875 -214233 -203121 -82646 -36399 21900 -178262 -308913 -492930 283191
10184 128922 -85180 -101637 -468141 -282764 10317 -48150 153412 -1140 -2848 24287 -293203
10172 -53015 -91559 -141432 -106853 -154505 -13617 -159520 -395957 -260672 159537 13199 -271161
10160 -198966 -329963 -253524 -269993 39406 -422960 -175027 -7812 -182194 198778 -107853
10149 224234 103923 285257 -210447 -137093 -132197 -278711 -147435 -109191 -5010 -287759 126298
10137 -186966 16239 -98053 -103890 233478 -413663 -228369 -49707 -113989 -376696 -158398 -118115
10126 -118115 -80043 -186856 -5433 124239 360380 12547 -80853 -134542 -273073 -189353 -215675
10115b15675l195P0392L4751B04253E5411f6187j9538f893H0399e66282b18663
10103c3175G1200a03978k827B6345M0555b30196o4397h1932B74900o9256c41230
10091G1418P4917a85164j96423e7141A8561a42386H1004d6606C46082a02872l08897
10080d11769J95071d0722m1965k8710p9030j46171a3249k12553A7230P6488c120
10068a08357j86806A15118J7271K42406A7202c50377a59154c9145F900J23348
10058A30248a16281F0767J7510e5451B33279L3627a7774j99470B3096b74663A82508
10046C2546g406j47465g2237A93731a20526k5814B691K50258G5818M1405n0915
10035F6308A7663b55024a24152J8402e2832N856o9219r5934D0134f76405C3179
$$ plain form
10115 -215675 -218870 -148478 -113727 204253 55411 -66187 -85725 -6893 80399 -566282 -218663
10103 -33175 71200 -103978 -106805 26345 66900 -230196 -294593 -81932 274900 205644 -341230
10091 71418 146335 -185164 -381587 -57141 18561 -142386 81004 -46606 346082 -102872 -411769
10080 -411769 -216698 -40722 -82687 -111397 -190427 -336598 -13249 -225802 17230 93718 -3120
10068 -108357 -295163 115118 132389 374795 17202 -350377 -159154 -39145 6900 130248
10058 130248 -116281 60767 78277 -55451 233279 266906 -17774 -217244 23096 -274663 182508
10046 32546 -7406 -154871 -72237 193731 -120526 -146340 2691 252949 75818 117223 66308
10035 66308 17663 -255024 -124152 -105750 -52832 -46976 -116195 -212129 40134 -676405 33179
10023a0649j00669j3327k0787j06908B90765d80767A5606h6719H724N9528c56374
10011f9918k77258A05686b7217A9259g2512q495j10866R2929j09466C6258b59686
9999a523A32416e50904J37925a36216k6967h1550j70673E8396K68609f2552k36134
9988b98686A08851M4413a44804m9333A6578K2306g5579j71222n9012I958R929
9977A9887b03684c2957k83995J24359j54614b6352l41844A37707a30662i466A18384
9965b79296J12447O6223E1327a2386B40227q4421f0883q4612j31313a4999r0075
9954a05074G4862K56890c5670G135d89580E9547b73232B05048G1752b02523G1013
9942C0350J1972b57688j93566a4702A42464b33831a04000B4098b03129n919a01098
$$ plain form
10023 -10649 -111318 -124645 -145432 -252340 290765 -480767 15606 -86719 8724 68252 -356374
10011 -69918 -347176 105686 -27217 19259 -72512 -81007 -191873 -98944 -208410 36258 -259686
9999 -1523 132416 -550904 -412979 -136216 -163183 -81550 -252223 58396 327005 -62552 -298686
9988 -298686 108851 153264 -144804 -194137 16578 38884 -75579 -246801 -305813 9958 19887
9977 19887 -203684 -32957 -316952 -192593 -347207 -26352 -368196 137707 -130662 -9466 118384
9965 -279296 -166849 -100626 51327 -12386 240227 155806 -60883 -145495 -276808 -14999 -105074
9954 -105074 74862 331752 -35670 7135 -489580 59547 -273232 205048 71752 -202523 71013
9942 30350 42322 -257688 -451254 -14702 142464 -233831 -104000 24098 -203129 -209048 -101098
9930G7478f5292j8602f128B9165b58768B03035C3792a76820A03662b7425k56710
9919b84135n2826b5041l790j47374j9350P5108H5045J33842f8094k35428J1316
9908b92206a4921C8489g5931j00498g6214o7619A12450c75475c2918m0706K9551
9897d4073m14513H3115h9902j35163f6292k2260j75864a8936D5771a5857B46345
9885A838K0163K7490L38685B3345a26608J5368A6515b9371o6499P825A25654a82350
9872a12083o4498A47755a32764l9036o3670B25952q4094a70035Q442A50798a16364
9860I33c57628A73852f2934j3382C48041G0479a0297k12091A61977G9639A9299
9848c8269j00759A80560b95095B6986f374o4159m7613n5374q0735h1792q0474
$$ plain form
9930 77478 -65292 -83894 -6128 29165 -258768 203035 33792 -176820 103662 -27425 -284135
9919 -284135 -336961 -25041 -28831 -176205 -195555 -120447 85045 218887 -68094 -303522 -292206
9908 -292206 -14921 38489 -75931 -176429 -76214 -143833 112450 -375475 -32918 -73624 -44073
9897 -44073 -458586 83115 -89902 -225065 -66292 -88552 -264416 -18936 45771 -15857 246345
9885 1838 22001 49491 388176 23345 -126608 -111240 16515 -29371 -95870 -88045 125654 -182350
9872 -112083 -176581 147755 -132764 -171800 -235470 225952 141858 -170035 -161593 150798 -116364
9860 933 -357628 173852 -62934 -76316 348041 70479 -10297 -222388 161977 79639 19299
9848 -38269 -139028 180560 -295095 26986 -6374 -70533 -118146 -173520 -254255 -81792 -162266
9837a62266f3522B3537b4472k80255J50431A7101b89653a15391K3184A2934f2028
9825e0611A39724F5067b17871c0707l11767k9618B58862o1705q0424b12791n0265
9814b63056D8578b22737b4940l21642i5961A89928o884k9884P878b02333N4428
9803a47905C7581M2211R9221R315P60o2144J6261L003c74916f3243n9868L7040
9791h6071d417j90031G5271P622L2166B869M8926g9254j49957g682E7601b73316
9778B51049G6195b04106K2875L5816e5314C980c26821P6442a00592j55347f0915
9766B76209b12585o0722J13876P2486m7271C69778a10346G0756d6787j02328B52613
9754B09811E3514f3974C9619l670K01558E7375b7811j27077N1512I0553b91659
$$ plain form
9837 -162266 -63522 23537 -24472 -304727 -154296 17101 -289653 -115391 -92207 12934 -62028
9825 -50611 139724 65067 -217871 -30707 -342474 -372092 258862 197157 116733 -212791 -263056
9814 -263056 48578 -222737 -24940 -346582 -95961 189928 183044 153160 161038 -202333 -147905
9803 -147905 37581 79792 179013 188328 189088 126944 143205 146208 -374916 -63243 -123111 -86071
9791 -86071 -4417 -194448 75271 82893 115059 2869 51795 -79254 -229211 -7682 57601 -273316
9778 251049 76195 -204106 -181231 -145415 -55314 3980 -326821 -250379 -100592 -255939 -60915
9766 276209 -212585 -273307 -159431 -86945 -134216 369778 -110346 70756 -46787 -149115 252613
9754 209811 53514 -63974 39619 35949 237507 57375 -27811 -154888 -103376 90553 -291659
9742c46550H0422a77166C1239a63006d7511j56485F1609e7171p8735j50049a00824
9730d412p6241A79112B8474a13928L7337n7346A91848a75297j35930g4756j97296
9719b72052a2958A5620a67098a0853A97021a38430E4619a65867l7911A70219C9921
9707a95276C17458e310j48730C42967d0275m05681Q1008M6680J11833A31890c8590
9695D3555d32748F9311J71680C4087b045n6631k76580a02061j38031J16680A72815
9683c38296K0040A81236a48542n6044A85921F6471g9663L9157k20661E6111b00090
9671c5411a823A72303G5434h8986l38702I4186b55687R6194P789b2290l52931
9660c75221d9390j95552b0724B87917b53834F7821J08255c3682D6395b47050B49164
$$ plain form
9742 -346550 80422 -177166 31239 -163006 -47511 -203996 61609 -57171 -135906 -285955 -100824
9730 -4412 -80653 179112 28474 -113928 -76591 -133937 191848 -175297 -311227 -74756 -272052
9719 -272052 -12958 15620 -167098 -10853 197021 -138430 54619 -165867 -203778 170219 39921
9707 -195276 317458 -5310 -154040 342967 -40275 -445956 -364948 -318268 -206435 131890 -38590
9695 43555 -432748 69311 240991 34087 -2045 -58676 -335256 -102061 -240092 -123412 172815
9683 -338296 -318256 181236 -148542 -204586 185921 66471 -79663 -40506 -261167 56111 -200090
9671 -35411 -1823 172303 75434 -88986 -427688 94186 -255687 -159493 -151704 -22290 -375221
9660 -375221 -49390 -244942 -20724 287917 -253834 67821 176076 -33682 46395 -247050 249164
9648b77730a05722k66831h8463c8709B509K4353M4519b22443K3784k5292j83295
9637d07246A29950a71777f4394j2573b5546j14794k30074b2148l19194a08992
9626B34418d8558k53212J10056n2992g4117K5886A35433f9473A29018a14410B4850
9614h4861A93724b21658b6360j97286c4727j34402c3547A2773a8858l0884C2430
9602C21658c84504B53221f3087K9133D01221F192L36799O4522c0185l7049k50985
9591c18219a50127K7913A14214h6676j0366C5138h3957B5480g2579A84055b46330
9579A64055b02703A24078a83528D3235J16536b49245B71545j03310B8108J0570
9569C8678P1343b46529M9902A36963B7146a16953j49026k3162c6484A10102b8732
$$ plain form
9648 -277730 -105722 -372553 -88463 -38709 2509 26862 71381 -222443 -198659 -223951 -407246
9637 -407246 129950 -171777 -64394 -76967 -25546 -140340 -370414 -22148 -341342 -108992
9626 234418 -48558 -301770 -191714 -244706 -74117 -48231 135433 -69473 129018 -114410 24850
9614 -84861 193724 -221658 -26360 -223646 -34727 -169129 -33547 12773 -18858 -49742 32430
9602 321658 -384504 253221 -63087 -33954 401221 6192 342991 407513 -30185 -67234 -318219
9591 -318219 -150127 -122214 114214 -86676 -97042 35138 -83957 25480 -72579 184055 -246330
9579 164055 -202703 124078 -183528 43235 159771 -249245 271545 168235 28108 38678
9569 38678 110021 -246529 -196627 136963 27146 -116953 -265979 -289141 -36484 110102 -28732
9557D2259b30456a4563l62433A65160L4128H2711d76917B2617a63056p6630O6921
9546a72765f9219k00395A12126d523F9009b16188D865O2791G960J29887h9391
9534a0965C5912b46661b5433B11212p9347b97643B34253n3605A9938h3099j85354
9523b68453g436B12340f52274a76659B72824A0047a62548L8071D1092a05706L0008
9512g5698B0474c18009K0403B53769a50981B08598g5080q8057B52608H067a52390
9500d93205b02736A99027a05968R754L8832j84441i3884r6498B59717j29291E395
9488c05763A9895a50084N4779A40755d78363e3074k50325J33374A08359b0326
9477c4973B3023a29633j8426A90583i6200b1313n386k53012h1483o7824A29509
$$ plain form
9557 42259 -230456 -14563 -376996 165160 199288 82711 -476917 22617 -163056 -239686 -172765
9546 -172765 -69219 -269614 112126 -4523 69009 -216188 4865 67656 7960 137847 -89391
9534 -10965 35912 -246661 -25433 211212 131865 -297643 234253 180648 19938 -83099 -268453
9523 -268453 -7436 212340 -652274 -176659 272824 10047 -162548 -124477 41092 -105706 -75698
9512 -75698 20474 -318009 -297606 253769 -150981 208598 -75080 -163137 252608 8067 -152390
9500 -493205 -202736 199027 -105968 -96214 -57382 -241823 -93884 -190382 259717 130426 5395
9488 -305763 19895 -150084 -95305 140755 -478363 -53074 -303399 -170025 108359 -20326
9477 -34973 23023 -129633 -148059 190583 -96200 -21313 -26699 -279711 -81483 -149307 129509
9465i7841o7057b2580B70305H3891K03199C6350c83206A09345m1096a81644B76012
9453b01883c9587q8722j46262j42768C5202a08543L009A58226k9739B5848K7270
9442E3118a28677n35206A18704a47701e4799k0568F053J24939a4145I7272P9251
9431A76523F3683d30075J65569F3115g3521I8961a67538A97898Q1403c38191B86885
9419I0913e00109a9838F1358N1508a52414C21285A13231a97582p816R0470n0596
9408a65524A07770m9457b1676l2879l95706a7781q2527j64685B15747a6943b131
9396A93560c18885F2357a46587j61152F8456e8935P82A923a12261B27058g4763
9384b17870C26121c8795C6756g960l8229k01721n8903B86592g2257p9084k9938
$$ plain form
9465 -97841 -164898 -22580 270305 83891 287090 36350 -383206 109345 68249 -181644 276012
9453 -201883 -39587 -128309 -274571 -417339 35202 -108543 -105534 158226 128487 25848 53118
9442 53118 -128677 -663883 118704 -147701 -54799 -75367 6053 130992 -14145 97272 176523
9431 176523 63683 -430075 -264506 63115 -73521 98961 -167538 197898 279301 -338191 286885
9419 90913 -500109 -19838 61358 112866 -152414 321285 113231 -197582 -205398 -114928 -165524
9408 -165524 107770 58313 -21676 -54555 -450261 -17781 -100308 -264993 215747 -16943 -2131
9396 193560 -318885 62357 -146587 -307739 68456 -58935 -58153 1923 -112261 227058 -74763
9384 -217870 326121 -38795 36756 -7960 -46189 -247910 -306813 286592 -72257 -151341 -181279
9373a81279A27634c54572N3221j07210D058J1340b47850B45013Q222D2972J03290
9362A46262e3369j1151j26272j65459B15849o2642d9046k01728C5006K04127a84852
9350b91225a44591j12717R4060F4350d5105a0747A75578d3559F3151d9787k39458
9339b89245C77530e6509j22816A65654d2467I470c52978B8617m311b03379A30830
9327a20754m7597A7299M9412J19608b59779f523l6912E6663a82808L3691k5533
9316a74650H9923b39106G943J327L2674a83866G8608d32821h4556b2525k89496
9305c12021f29j36097b7118j41386r6321A11212A3868a94447A5427K02211g7510
9293b39534i5522K2292L0344j48113A00135J67190C951a33644C28425h0790J7114
$$ plain form
9373 -181279 127634 -354572 -301351 -408561 4058 15398 -247850 245013 253235 42972 146262
9362 146262 -53369 -64520 -190792 -356251 215849 153207 -49046 -250774 35006 239133 -184852
9350 -291225 -144591 -257308 -163248 64350 -45105 -10747 175578 -43559 63151 -49787 -289245
9339 -289245 377530 -56509 -179325 165654 -42467 9470 -352978 28617 24306 -203379 130830
9327 -120754 -168351 17299 66711 186319 -259779 -6523 -43435 56663 -182808 -149117 -174650
9316 -174650 89923 -239106 7943 9270 41944 -183866 78608 -432821 -84556 -22525 -312021
9305 -312021 -629 -136726 -27118 -168504 -264825 111212 13868 -194447 15427 217638 -77510
9293 -239534 -95522 -73230 -42886 -190999 100135 267325 3951 -133644 328425 -80790 -63676
9282f3676k73867g2637J3215R685A05436l4140d0536L984g784l1359C49886d07799
9269E1132J59845a81368K5063f4985H2581b90427I0962J05933c30498E5472a02671
9257A1524h6648o1415p0483M1079A27416b9413k5824A09810b10868A82755a02782
9245i0708C8046c86585J74427j00495J10045E6040b1976A04302L35695d11808
9234D2526j6317a43443N736f0439J5066H7519g2440G3671J49335a57135F7701
9222b09278J2652A81274I541J05409K3354F6791e3682A8239b75289I0793L07738
9211C98531a56851k4087J4061N1160j0761B2568g4340b4244j59102L3503o5863
9200b15706G4742J4722J54771A03931c8083a981j64497A18692a94537e5385A29040
$$ plain form
9282 -63676 -337543 -72637 -59422 -49737 105436 71296 -40536 -36552 -7784 -39143 349886 -407799
9269 51132 210977 -181368 -156305 -64985 82581 -290427 90962 196895 -330498 55472 -102671
9257 11524 -86648 -148063 -218546 -177467 127416 -29413 -55237 109810 -210868 182755 -102782
9245 -90708 38046 -386585 -212158 -312653 -202608 56040 -21976 104302 439997 -411808
9234 42526 26209 -143443 -137707 -60439 -45373 87519 -72440 73671 223006 -157135 67701
9222 -209278 -196626 181274 9541 114950 138304 66791 -53682 18239 -275289 90793 398531
9211 398531 -156851 -180938 -166877 -115717 -126478 22568 -74340 -24244 -183346 -149843 -215706
9200 -215706 74742 89464 244235 103931 -38083 -1981 -166478 118692 -194537 -55385 129040
9188f399A32773b06569L6307A91130a71356B7515K3377l63R4081B7223K1799b45895
9175a41234d5467A29834a47569A76127b85434a20244j9821D5321b10651e1959
9164a62609p8890c3022A32824I976a81659a7493j38132A46624b88922h4566c9410
9152f175B90065i3327c2856k09991L4937P5805A92041A1993a10776K3004G5455
9140i2757C6158c6620k09685g2164D87O978g4875E2698a85318J5541P7311H6399
9127D189c0658k14643H3419J28992a37187L9829a9405K486j80698A08846b1886
9115F2706g889m13788B34975a55849N1973K0620B8173g4506J4785j5913j431I2486
9102g8817a4514I199b33365B2931f1567l7223D578P2956a12369N752A18787a38819
$$ plain form
9188 -6399 132773 -206569 -170262 191130 -171356 27515 50892 50529 144610 27223 49022 -245895
9175 -141234 -45467 129834 -147569 176127 -285434 -120244 -140065 45321 -210651 -51959
9164 -162609 -241499 -33022 132824 9976 -181659 -17493 -155625 146624 -288922 -84566 -39410
9152 -6175 290065 -93327 -32856 -242847 -207910 -132105 192041 11993 -110776 -87772 75455
9140 -92757 36158 -36620 -246305 -72164 487 7465 -74875 52698 -185318 -169777 -92466 86399
9127 4189 -30658 -245301 83419 212411 -137187 -97358 -19405 -16919 -197617 108846 -21886
9115 62706 -7889 -421677 234975 -155849 -103876 -83256 28173 -74506 -59721 -75634 -77065 92486
9102 -78817 -14514 9199 -233365 22931 -61567 -98790 4578 77534 -112369 -106617 118787 -138819
9089A67366c47069a31469d554A96400a50214C0840b08265k27313A00902C6724
9078c04347P681m695a11362M2111k2530q3037j7132j916B01669e00395D3541c11929
9065h5189J9147J0990k00067B36318L6672a5311k19846I1599L7510B2445J40780
9054A63225a25680J68l045G4971b38603B94581a31913A9387N0828b75485C06254
9042b22709B48538K30776a32220B54690b23793D8786a92296L4583A4055a10611
9031I7595D8635b65702C423b33774A5921b71635d1763j59261A3722i1235n028
9020i6263E8983J84831c79660c7826D2038d4792m2522p2751K5853f0848j15277
9009a76125h5533j32486d5660k45528b6134l97379K00553b28m87355G3596J47016
$$ plain form
9089 167366 -347069 -131469 -4554 196400 -150214 30840 -208265 -435578 100902 36724
9078 -304347 -296666 -301361 -111362 -69251 -91781 -174818 -191950 -193866 201669 -500395 43541 -311929
9065 -85189 -66042 -55052 -255119 236318 272990 -15311 -235157 91599 129109 22445 163225
9054 163225 -125680 -125512 -128557 74971 -238603 294581 -131913 19387 70215 -275485 306254
9042 -222709 248538 479314 -132220 254690 -223793 48786 -192296 -157713 14055 -110611
9031 97595 48635 -265702 3423 -233774 15921 -271635 -41763 -201024 13722 -91235 -96263
9020 -96263 58983 243814 -379660 -37826 42038 -44792 -87314 -160065 -134212 -60848 -176125
9009 -176125 -85533 -218019 -45660 -291188 -26134 -423513 -222960 -228 -487583 73596 220612
8998B20612E2125P3587a33266j57076b8258O713A75559a73981A01542K08381q3256
8987B26667b4205j54260A15554m9472F978h7658K9781p3182m55985a75011C74471
8975a84769k70523O3342a61437n8391N8431B07236b98990J34903k25889C94423
8964b92482j0323J40292N9929J5758H4117M3917a13590A12853N7916Q7826c80310
8952a40156c9096A8569J38796d9841q2923f3769A76305C665f7853m667k63059
8941c35579J44600e5568j49903C3974O6437R8320b13392J05625A21456J83006
8931C04462j31580q1550A778a87317g7157K7871C1858J37388M1195O32093O88771
8920A531305L842525J0909540D114696A298702E77906B69078d9878m7132K068
$$ plain form
8998 220612 52125 125712 -133266 -290342 -28258 -21545 175559 -173981 101542 309923 226667
8987 226667 -24205 -178465 115554 66082 6978 -87658 -57877 -131059 -587044 -175011 374471
8975 -184769 -455292 -391950 -161437 -219828 -161397 207236 -298990 -164087 -389976 394423
8964 -292482 -302805 -162513 -102584 -86826 84117 128034 -113590 112853 170769 258595 -380310
8952 -140156 -39096 18569 157365 -49841 -132764 -63769 176305 3665 -67853 -72520 -335579
8941 -335579 -190979 -55568 -205471 33974 100411 198731 -213392 -107767 121456 304462
8931 304462 172882 91332 1778 -187317 -77157 -49286 31858 169246 210441 842534 1531305
8920 1531305 5373830 16283370 4114696 1298702 577906 269078 -49878 -97010 -94942
8911i4942A4348b76570a9720A27642o2975K64257j48425J8557r7467l1864a35380
8899A68033c00379K6554l3291P5674I8647l7001G580a71216F216g3625j21539
8888a95164f9631r2137j5460C3895J8055b48965c6597j71777B62454I9141c9295
$$ plain form
8911 -94942 14348 -276570 -19720 127642 64667 328924 180499 199056 101589 69725 -135380
8899 168033 -300379 -273825 -307116 -231442 98647 61646 7580 -171216 6216 -73625 -195164
8888 -195164 -69631 -161768 -177228 33895 51950 -248965 -36597 -208374 262454 99141 -39295
$$ [...]
##END NTUPLES=NMR SPECTRUM
##END=
