
##TITLE=AC1258_UGARS11075_7163997_x7UjD6Vp5X
##JCAMPDX= 6.0         $$ Bruker NMR JCAMP-DX V2.0
##DATA TYPE= NMR SPECTRUM
##DATA CLASS= NTUPLES
##ORIGIN= BRUKER
##OWNER= Administrator
$$ 1.72 TOPSPIN		Version 2.1
$$ 2012-12-01 13:05:35.742 -0500  Administrator@X
$$ Compression mode = diff/dup
##.OBSERVE FREQUENCY= 400.02188249412
##.OBSERVE NUCLEUS= ^1H
##.ACQUISITION MODE= SIMULTANEOUS (DQD)
##.ACQUISITION SCHEME= undefined
##.AVERAGES= 64
##.DIGITISER RES= 22
##SPECTROMETER/DATA SYSTEM= spect
##.PULSE SEQUENCE= noesygpps1d.comp
##.SOLVENT NAME= COFFEE_meoh
##.SHIFT REFERENCE= INTERNAL, COFFEE_meoh, 1, 14.96237
##AUDIT TRAIL= $$ (NUMBER, WHEN, WHO, WHERE, PROCESS, VERSION, WHAT)
$$ ##TITLE= Audit trail, TOPSPIN		Version 2.1
$$ ##JCAMPDX= 5.01
$$ ##ORIGIN= Bruker BioSpin GmbH
$$ ##OWNER= Administrator
$$ $$ E:\/data/COFFEE/nmr/AC1258_UGARS11075_7163997_x7UjD6Vp5X/12/pdata/1/auditp.txt
$$ ##AUDIT TRAIL=  $$ (NUMBER, WHEN, WHO, WHERE, PROCESS, VERSION, WHAT)
(   1,<2012-12-01 13:05:30.529 -0500>,<Administrator>,<X>,<go>,<TOPSPIN 2.1>,
      <created by zg
	started at 2012-12-01 12:53:49.735 -0500,
	POWCHK enabled, PULCHK disabled,
       configuration hash MD5:
       86 BA 57 50 F2 9D 5C 9B 26 00 A9 28 5F 66 2E 89
       data hash MD5: 64K
       21 DB 5A 96 C8 85 C9 77 BA 02 1C 7A 91 16 60 F7>)
(   2,<2012-12-01 13:05:33.297 -0500>,<Administrator>,<X>,<proc1d>,<TOPSPIN 2.1>,
      <Start of raw data processing
       efp LB = 0.3 FT_mod = 6 PKNL = 1 PHC0 = 0 PHC1 = 0 SI = 128K 
       data hash MD5: 128K
       D3 65 05 E5 41 87 95 37 6A 4A 7C 08 6E CB B9 7B>)
(   3,<2012-12-01 13:05:34.224 -0500>,<Administrator>,<X>,<proc1d>,<TOPSPIN 2.1>,
      <pk PHC0 = -81.02966 PHC1 = 0 
       data hash MD5: 128K
       A8 0D 65 29 0A 86 C1 52 89 B5 6E 83 78 33 EC AA>)
(   4,<2012-12-01 13:05:34.851 -0500>,<Administrator>,<X>,<proc1d>,<TOPSPIN 2.1>,
      <abs ABSG = 1 
       data hash MD5: 128K
       20 EB E8 58 DD F4 96 A7 FB 48 FE A4 5A FD 08 36>)
(   5,<2012-12-01 13:05:34.988 -0500>,<Administrator>,<X>,<proc1d>,<TOPSPIN 2.1>,
      <abs ABSG = 2 
       data hash MD5: 128K
       77 05 74 FF CC 02 93 6A E1 60 95 2C BF 33 F5 48>)
(   6,<2012-12-01 13:05:35.138 -0500>,<Administrator>,<X>,<proc1d>,<TOPSPIN 2.1>,
      <abs ABSG = 3 
       data hash MD5: 128K
       8B 66 13 3E 22 34 9B C8 85 EE 6C B4 C4 CE BA BC>)
(   7,<2012-12-01 13:05:35.301 -0500>,<Administrator>,<X>,<proc1d>,<TOPSPIN 2.1>,
      <abs ABSG = 4 
       data hash MD5: 128K
       28 DE A6 E8 16 54 76 EE 47 4D 8B 27 2D 35 D3 12>)
(   8,<2012-12-01 13:05:35.465 -0500>,<Administrator>,<X>,<proc1d>,<TOPSPIN 2.1>,
      <abs ABSG = 5 
       data hash MD5: 128K
       1D 1C 7C 65 62 65 99 21 28 19 D8 3C 0C E5 3F 26>)
$$ ##END=
$$ 
$$ $$ hash MD5
$$ $$ B2 0C 07 86 83 97 FD 66 49 68 B5 65 E1 F4 B3 9E
##$RELAX= 
##$RELAX= 
##$RELAX= 
##$RELAX= 
##$RELAX= 
##$RELAX= 
##$RELAX= 
##$RELAX= 
$$ Bruker specific parameters
$$ --------------------------
##$DU= <E:\>
##$EXPNO= 12
$$ [...]
##$TP07= 0
##$TPNAME0= <>
##$TPNAME1= <>
##$TPNAME2= <>
##$TPNAME3= <>
##$TPNAME4= <>
##$TPNAME5= <>
##$TPNAME6= <>
##$TPNAME7= <>
##$TPOAL= (0..7)
0.5 0.5 0.5 0.5 0.5 0.5 0.5 0.5
##$TPOFFS= (0..7)
0 0 0 0 0 0 0 0
##$TUNHIN= 0
##$TUNHOUT= 0
##$TUNXOUT= 0
##$USERA1= <user>
##$USERA2= <user>
##$USERA3= <user>
##$USERA4= <user>
##$USERA5= <user>
##$V9= 5
##$VALIST= <valist>
##$VCLIST= <CCCCCCCCCCCCCCC>
##$VD= 0
##$VDLIST= <DDDDDDDDDDDDDDD>
##$VPLIST= <PPPPPPPPPPPPPPP>
##$VTLIST= <TTTTTTTTTTTTTTT>
##$WBST= 1024
##$WBSW= 4
##$XGAIN= (0..3)
0 0 0 0
##$XL= 0
##$YL= 0
##$YMAX_a= 7855371
##$YMIN_a= -17108627
##$ZGOPTNS= <>
##$ZL1= 120
##$ZL2= 120
##$ZL3= 120
##$ZL4= 120
##$ABSF1= 14.96237
##$ABSF2= -5.595812
##$ABSG= 5
##$ABSL= 3
##$ALPHA= 0
##$AQORDER= 0
##$ASSFAC= 0
##$ASSFACI= 0
##$ASSFACX= 0
##$ASSWID= 0
##$AUNMP= <proc_prof1d_extract.lims>
##$AXLEFT= 0
##$AXNAME= <>
##$AXNUC= <1H>
##$AXRIGHT= 0
##$AXTYPE= 0
##$AXUNIT= <>
##$AZFE= 0.1
##$AZFW= 0.1
##$BCFW= 0
##$BC_mod= 0
##$BYTORDP= 0
##$COROFFS= 0
##$CY= 15
##$DATMOD= 1
##$DC= 0
##$DFILT= <>
##$DTYPP= 0
##$F1P= 0
##$F2P= 0
##$FCOR= 0.5
##$FTSIZE= 131072
##$FT_mod= 6
##$GAMMA= 0
##$GB= 0
##$INTBC= 1
##$INTSCL= 1
##$ISEN= 128
##$LB= 0.3
##$LEV0= 0
##$LPBIN= 0
##$MAXI= 10000
##$MC2= 0
##$MEAN= 0
##$ME_mod= 0
##$MI= 0
##$NCOEF= 0
##$NC_proc= -2
##$NLEV= 6
##$NOISF1= 0
##$NOISF2= 0
##$NSP= 0
##$NTH_PI= 0
##$NZP= 0
##$OFFSET= 14.96237
##$PC= 1
##$PHC0= -81.02966
##$PHC1= 0
##$PH_mod= 1
##$PKNL= yes
##$PPARMOD= 0
##$PPDIAG= 0
##$PPIPTYP= 0
##$PPMPNUM= 2147483647
##$PPRESOL= 1
##$PSCAL= 4
##$PSIGN= 0
##$PYNMP= <proc.py>
##$REVERSE= no
##$SF= 400.020009087744
##$SI= 131072
##$SIGF1= 0
##$SIGF2= 0
##$SINO= 400
##$SIOLD= 131072
##$SPECTYP= <>
##$SREGLST= <1H.CDCl3>
##$SSB= 0
##$STSI= 131072
##$STSR= 0
##$SW_p= 8223.68421052631
##$SYMM= 0
##$S_DEV= 0
##$TDeff= 65536
##$TDoff= 0
##$TI= <>
##$TILT= no
##$TM1= 0
##$TM2= 0
##$TOPLEV= 0
##$USERP1= <user>
##$USERP2= <user>
##$USERP3= <user>
##$USERP4= <user>
##$USERP5= <user>
##$WDW= 1
##$XDIM= 131072
##$YMAX_p= 476666596
##$YMIN_p= -14962
##$CURPLOT= <Network HP LaserJet P1505>
##$CURPRIN= <$Network HP LaserJet P1505>
##$DFORMAT= <normdp>
##$LAYOUT= <+/1D_H.xwp>
##$LFORMAT= <normlp>
##$PFORMAT= <normpl>
##$SURQMSG= 1
$$ End of Bruker specific parameters
$$ ---------------------------------
##NTUPLES= NMR SPECTRUM
##VAR_NAME=  FREQUENCY,     SPECTRUM/REAL,   SPECTRUM/IMAG
##SYMBOL=    X,             R,               I
##VAR_TYPE=  INDEPENDENT,   DEPENDENT,       DEPENDENT
##VAR_FORM=  AFFN,          ASDF,            ASDF
##VAR_DIM=   131072,        131072,          131072
##UNITS=     HZ,            ARBITRARY UNITS, ARBITRARY UNITS
##FACTOR=    0.0627417313425164, 1,          1
##FIRST=     8223.62146879497, 1567,         -70261
##LAST=      0,             3166,            -70233
##MIN=       0,             -14962,          0
##MAX=       8223.62146879497, 476666596,    0
$$ Real data points
##PAGE= N=1
##DATA TABLE= (X++(R..R)), XYDATA
$$ [...]
60988A091031K9872L2384L3601L5359L9815M4830M7446M9349N3656N9040O2621
$$ 1091031 1120903 1153287 1186888 1222247 1262062 1306892 1354338 1403687 1457343 1516383 1579004
60977A579004O5844P1625P8279Q2619Q6376R3005J00545J04387J04836J05208
$$ 1579004 1644848 1716473 1794752 1877371 1963747 2056752 2157297 2261684 2366520 2471728
60967B471728J05264J03841J05181J14631J30512J48231J69416J97973K30078
$$ 2471728 2576992 2680833 2786014 2900645 3031157 3179388 3348804 3546777 3776855
60958C776855K58231K83242L12404L48624L92425M51372N34376O39279P60654
$$ 3776855 4035086 4318328 4630732 4979356 5371781 5823153 6357529 6996808 7757462
60949G757462R07518J096651J330883J605089J933778K348398K865820L487404
$$ 7757462 8664980 9761631 11092514 12697603 14631381 16979779 19845599 23333003
60941B3333003M219513N017165N650542N693211M790330L024613R81102o22086
$$ 23333003 27552516 32569681 38220223 43913434 48703764 51728377 52709479 52087393
60933E2087393j391120j366883p81497J50842J162327J794105J542458K50210
$$ 52087393 50696273 49329390 48547893 48698735 49861062 51655167 53197625 53447835
60925E3447835j681860l540923m778312n266430n184430m769959m196284l582303
$$ 53447835 51765975 48225052 43446740 38180310 32995880 28225921 24029637 20447334
60917B0447334l009973k513078k086859j722865j421816j178232r76331q06215
$$ 20447334 17437361 14924283 12837424 11114559 9692743 8514511 7538180 6731965
60909F731965o69341n65200m85153m21732l72902l34949l01083k69277k42743
$$ 6731965 6062624 5497424 5012271 4590539 4217637 3882688 3581605 3312328 3069585
60900C069585k21078j98945j74682j52232j33264j15089r7949q6836q3800q4636
$$ 3069585 2848507 2649562 2474880 2322648 2189384 2074295 1976346 1889510 1805710 1721074
60890A721074q5142q4895q3490p8926p1574o4679n9315n3362m6417m0942l7618
$$ 1721074 1635932 1551037 1467547 1388621 1317047 1252368 1193053 1139691 1093274 1052332 1014714
60879A014714l4271l0328k7736k6633k4660k1466j9400j8922j7720j5226j3600
$$ 1014714 980443 950115 922379 895746 871086 849620 830220 811298 793578 778352 764752
60868G64752j3370j2446j0495r963j1497j2461j1312r662q724p420n336m041m120
$$ 764752 751382 738936 728441 718478 706981 694520 683208 673546 664822 657402 652066 648025 643905
60855F43905m103l476l628m772n106m100l623m584n401m801l546k453j246j78
$$ 643905 639802 636326 632698 627926 622820 618720 615097 610513 605112 600311 596765 594312 593066 592888
60841E92888k32j028j076n46j226l286m841n198n767p078p691o884n867n479m992
$$ 592888 592656 591628 590552 590006 588780 585494 580653 575455 569688 562610 554919 548035 542168 536689 531697
60826E31697m005l291l089k657j969j776j727n37J620L084L300L318L558L344
$$ 531697 527692 524401 521312 518655 516686 514910 513183 512646 514266 517350 520650 523968 527526 530870
60812E30870K855L199M348N090N233N746O663P032O954P360P865P143N460M426
$$ 530870 533725 536924 541272 546362 551595 557341 564004 571036 577990 585350 593215 600358 605818 610244
60798F10244M245L575K137J017L13r81k720l651l816m450n447n462m633m567n400
$$ 610244 614489 618064 620201 621218 621531 620550 617830 614179 610363 605913 600466 595004 590371 585804 580404
60783E80404n505m462l709l848l777k964k245j924j380q33j236k132k001r98r14
$$ 580404 574899 570437 566728 562880 559103 556139 553894 551970 550590 549757 548521 546389 544388 543390 542476
60768E42476k116k935k553k082k296k590k647k899k968j844K1J073J262J993L266
$$ 542476 540360 537425 534872 532790 530494 527904 525257 522358 519390 517546 517567 518640 519902 521895 525161
60753E25161L515K593K268L223M085M111M271M990N298N040N464O642O670M483
$$ 525161 528676 531269 533537 536760 540845 544956 549227 554217 559515 564555 570019 576661 583331 587814
60739E87814J352j363l829o213p625p757p745q295q631q168p646p729p915p600
$$ 587814 589166 587803 583974 577761 570136 562379 554634 546339 537708 529540 521894 514165 506250 498650
60725D98650o922o091n269n193o426p902p961o774n885n515m536l157k981m049
$$ 498650 491728 485637 480368 475175 468749 460847 452886 446112 440227 434712 430176 427019 424038 419989
60711D19989m440l463k783l482m355m150l339k690k055j545k001l280l910l330
$$ 419989 415549 412086 409303 405821 401466 397316 393977 391287 389232 387687 385686 382406 378496 375166
60697C75166k724k796k626j600n65j28M16J407J812J003M0M3O91J270J877K679
$$ 375166 372442 369646 367020 365420 364855 364727 365143 366550 368362 369365 369405 369448 370139 371409 373286 375965
60681C75965L199L197L169L399L543L539L769M042L754L289L733N049N996O117
$$ 375965 379164 382361 385530 388929 392472 396011 399780 403822 407576 410865 414598 419647 425643 431760
60667D31760O158O370O175N737O013O940P431P486Q311R949J0874J0533J0181
$$ 431760 437918 444288 450463 456200 462213 469153 476584 484070 492381 502330 513204 523737 533918
60654E33918J0503J0528R791R467J0231J0824J0007Q372P042N965M645L247J960
$$ 533918 544421 554949 564740 574207 584438 595262 605269 613641 620683 626648 631293 634540 636500
60641F36500L03k013m420o395q070r466j0203j0283j0209j0007r281q267p603
$$ 636500 636803 634790 630370 623975 615905 606439 596236 585953 575744 565737 556456 548189 540586
60628E40586p004n630l813k814k751k415j379n92n94p67p23q57j141r14j88L33
$$ 540586 533582 527952 524139 521325 518574 516159 514780 514188 513594 512827 512104 511247 510106 509192 509004 509337
60612E09337O70J542K808L547L695M000M433M400M388N441P171Q259Q934J0606
$$ 509337 510007 511549 514357 517904 521599 525599 530032 534432 538820 544261 551432 559691 568625 579231
60598E79231J3134J4848J5445J6321J7800J8585J8450J8819K0010K0391J9096
$$ 579231 592365 607213 622658 638979 656779 675364 693814 712633 732643 753034 772130
60587G72130J7183J5308J2568Q515L980p98o531j2557j6645j8087j8550j9046
$$ 772130 789313 804621 817189 825704 829684 828886 822355 809798 793153 775066 756516 737470
60575G37470j8561j6709j5022j4248j2948j0362q176p779p944p097n810n263n055
$$ 737470 718909 702200 687178 672930 659982 649620 641444 633665 625721 618624 612814 607551 602496
60562F02496m388l728l611l277k107r67o74n80L5P03J108K045L677M571L923L089
$$ 602496 598108 594380 590769 587492 585385 584418 583744 583164 583199 583902 585010 587055 590732 595303 599226 602315
60546F02315L412M089L809K992K748K969L028L248M139N256O146P382R376J1244
$$ 602315 605727 609816 613625 616617 619365 622334 625362 628610 632749 638005 644151 651533 660909 672153
60532F72153J2093J2470J3392J4917J6661J8703K1087K3553K6532L1201L7693
$$ 672153 684246 696716 710108 725025 741686 760389 781476 805029 831561 862762 900455
60521I00455M4577N0858N7299O5029P4238Q4985R7677J11770J25290J36365J43876
$$ 900455 945032 995890 1053189 1118218 1192456 1277441 1375118 1486888 1612178 1748543 1892419
60510A892419J46109J40726J27017J06719Q1920N3984K5287j26j9176l1785l9550
$$ 1892419 2038528 2179254 2306271 2412990 2494910 2548894 2574181 2574055 2554879 2523094 2483544
60499B483544m4124m7643n2523n9301o6136p1372p5044p7037p6028p1503o4937
$$ 2483544 2439420 2391777 2339254 2279953 2213817 2142445 2067401 1990364 1914336 1842833 1777896
60488A777896n7529m8511l7042k4009j0525L653J8850L4210M9109O4229P9861
$$ 1777896 1720367 1671856 1634814 1610805 1600280 1603933 1622783 1656993 1706102 1770331 1850192
60477A850192R4452J05779J12099J11442J01982Q4398O2078L7906J2996j0481
$$ 1850192 1944644 2050423 2162522 2273964 2375946 2460344 2522422 2560328 2573324 2562843
60467B562843k8034l6304l5799k8601j5678J828K1271M1000O2360Q6950J13713
$$ 2562843 2534809 2498505 2462706 2434105 2418427 2420255 2441526 2482526 2544886 2631836 2745549
60456B745549J41052J70120K03478K41910K84919L33066L87226M46441N08600
$$ 2745549 2886601 3056721 3260199 3502109 3787028 4120094 4507320 4953761 5462361
60447E462361N72283O35417O92268P32946P45141P16097O36090N03763L28219
$$ 5462361 6034644 6670061 7362329 8095275 8840416 9556513 10192603 10696366 11024585
60438A1024585J24708r0605l00893m87330o32602p27283p71884p73644p42833
$$ 11024585 11149293 11058688 10757795 10270465 9637863 8910580 8138696 7365052 6622219
60429F622219o90633o27099n59600m93241m31715l76729l27751k83842k45240
$$ 6622219 5931586 5304487 4744887 4251646 3819931 3443202 3115451 2831609 2586369
60420B586369k12247j83889j58968j37361j19097j03352q9573p8233o9211o0894
$$ 2586369 2374122 2190233 2031265 1893904 1774807 1671455 1581882 1503649 1434438 1373544
60410A373544n2239m4291l8244l3513k9224k5991k4484k3715k2530k1503k1558
$$ 1373544 1321305 1277014 1238770 1205257 1176033 1150042 1125558 1101843 1079313 1057810 1036252
60399A036252k2012k1698k0813j9991j8814j6849j4875j3532j2127j0281r150
$$ 1036252 1014240 992542 971729 951738 932924 916075 901200 887668 875541 865260 856110
60388H56110r382r546q374o922o619o921o849p136q579r857r461q370q451r343
$$ 856110 846728 837182 828808 821886 815267 808346 801497 794361 785782 775925 766464 758094 749643 740300
60374G40300r276p939o257m495k587j291r25j24K116M466N261N031M967M606L416
$$ 740300 731024 723085 716828 712333 709746 708455 707530 707406 709522 713988 719249 724280 729247 733853 737269
60359G37269K944M583O662O733N498N454O746P563P787Q992J1175J2568J2541
$$ 737269 740213 744796 751458 758191 763689 769143 775889 783452 791239 800231 811406 823974 836515
60346H36515J1945J0811Q383N326L257K144N76j367j978o37J662M515Q637J3986
$$ 836515 848460 859271 867654 872980 876237 878381 878957 877590 875612 874975 876637 881152 889789 903775
60332I03775J9327K3897K7825L0969L2862L3605L3253L0783K5285J7818J0357
$$ 903775 923102 946999 974824 1005793 1038655 1072260 1105513 1136296 1161581 1179399 1189756
60321A189756L355l946j1352j7557k1700k3599k3033k0367j7164j4702j2725j0948
$$ 1189756 1193111 1189165 1177813 1160256 1138556 1114957 1091924 1071557 1054393 1039691 1026966 1016018
60309A016018j0431j1790j3521j4240j5107j7659k0549k1176j9447j7297j5306
$$ 1016018 1005587 993797 980276 966036 950929 933270 912721 891545 872098 854801 839495
60298H39495j2538r092o056l381l37K386L491L445L574L402J392k129n329p783
$$ 839495 826957 817865 811809 808428 808091 810477 813968 817413 820987 824389 825781 823652 818323 810540
60284H10540j0401j2902j3942j3613j3334j3364j2753j1499j0516r651q018n962
$$ 810540 800139 787237 773295 759682 746348 732984 720231 708732 698216 688565 680547 674585
60272F74585m589l678k192l97O83J305K292L083K849K741M400O998Q461Q932J0137
$$ 674585 669996 666318 664126 663729 664412 665717 668009 671092 673941 676682 681082 688080 696541 705473 715610
60257G15610J2025J3048J3327J4396J6075J6758J6639J7547J9586K1075K1915
$$ 715610 727635 740683 754010 768406 784481 801239 817878 835425 855011 876086 898001
60246H98001K3921K7590L1483L5161L9703M4984M9342N2403N5509N8845O0902
$$ 898001 921922 949512 980995 1016156 1055859 1100843 1150185 1202588 1258097 1316942 1377844
60235A377844O1286O1373O1630O0785N8163N4486M9942M3880L6717K9676K2481
$$ 1377844 1439130 1500503 1562133 1622918 1681081 1735567 1785509 1829389 1866106 1895782 1918263
60224A918263J3842M402l502r197j4104j8635k1550k2721k3605k4344k3351k0322
$$ 1918263 1932105 1936507 1933005 1923808 1909704 1891069 1869519 1846798 1823193 1798849 1775498 1755176
60212A755176j6837j3288q166j265N279J0225J4877K0425K6160L1407L6802M2546
$$ 1755176 1738339 1725051 1716885 1715620 1720899 1731124 1746001 1766426 1792586 1823993 1860795 1903341
60200A903341M7574N1504N5326N9269O2045O2880O2251O0006N5009M7356L8741
$$ 1903341 1950915 2002419 2057745 2117014 2179059 2241939 2304190 2364196 2419205 2466561 2505302
60189B505302K9924K0001Q727k685j3539k4073l3479m0074m4118m7826n1777n3827
$$ 2505302 2535226 2555227 2563954 2561269 2547730 2523657 2490178 2450104 2405986 2358160 2306383 2252556
60177B252556n2367m8180m2241l4311k4747j5146o038L774J4617K4955L3981M2826
$$ 2252556 2200189 2152009 2109768 2075457 2050710 2035564 2029526 2033300 2047917 2072872 2106853 2149679
60165B149679N2204O1213O9402P7622Q5753R2067R5937R8812J01400J02298J00612
$$ 2149679 2201883 2263096 2332498 2410120 2495873 2587940 2683877 2782689 2884089 2986387 3086999
60154C086999R7266R2359Q3765P0165N3403L6133J9154K719j1417k1076k5524
$$ 3086999 3184265 3276624 3360389 3430554 3483957 3520090 3539244 3541963 3530546 3509470 3483946
60143C483946k4938j9554j0651r90O918J2090J4258J3545J1547J0849J2662J6494
$$ 3483946 3459008 3439454 3428803 3427813 3434731 3446821 3461079 3474624 3486171 3497020 3509682 3526176
60131C526176K2545L2312M6170O2456P9693R7677J15749J32233J46350J58475
$$ 3526176 3548721 3581033 3627203 3689659 3769352 3867029 3982778 4115011 4261361 4419836
60121D419836J67832J72229J70904J65248J56004J42340J24547J04844Q4244O1280
$$ 4419836 4587668 4759897 4930801 5096049 5252053 5394393 5518940 5623784 5708028 5769308
60111E769308L5233Q016j8667m5507p3239j00392j25055j46809j65208j78474
$$ 5769308 5804541 5812557 5793890 5748383 5675144 5574752 5449697 5302888 5137680 4959206
60101D959206j85507j87424j85505j79379j68584j54188j37447j18652r8535p8903
$$ 4959206 4773699 4586275 4400770 4221391 4052807 3898619 3761172 3642520 3543985 3465082
60091C465082o0491m2042k2731l688J4001L0738M6508N9598O8521P3434P4513
$$ 3465082 3404591 3362549 3339818 3336130 3350131 3380869 3427377 3486975 3555496 3628930 3703443
60080C703443P1034O3288N3278M2215K9373J4733N00j1438k1496l0538l8209m4436
$$ 3703443 3774477 3837765 3891043 3933258 3962631 3977364 3977864 3966426 3944930 3914392 3876183 3831747
60068C831747n0281n5798n9264o0014n9775n9639n8110n3842m7913m1542l3823
$$ 3831747 3781466 3725668 3666404 3606390 3546615 3486976 3428866 3375024 3327111 3285569 3251746
60057C251746k3659j1921J73J2665K5092L5332M2183M7006N0934N2567N0580M6560
$$ 3251746 3228087 3216166 3216339 3229004 3254096 3289428 3331611 3378617 3429551 3482118 3532698 3579258
60045C579258M3022M0425L8124L6429L5534L4215L1610K8652K5896K1757J4769
$$ 3579258 3622280 3662705 3700829 3737258 3772792 3807007 3838617 3867269 3893165 3914922 3929691
60034C929691N768m070j5291k8385m2011n5016o8236q2097r4505j03361j09116
$$ 3929691 3935459 3931389 3916098 3887713 3845702 3790686 3722450 3640353 3545848 3442487 3333371
60023C333371j12669j12898j08897j02516r5886q8227p7941o6121n5009m4509
$$ 3333371 3220702 3107804 2998907 2896391 2800505 2712278 2634337 2568216 2513207 2468698
60013B468698l3225k1782j1968l593N047J4299K3225L1844M0821M9724N7896O6267
$$ 2468698 2435473 2413691 2401723 2398130 2403177 2417476 2440701 2472545 2513366 2563090 2620986 2687253
60001B687253P6017Q6099R4181R9184J00984R8768R2020Q2278P1672O0364M7419
$$ 2687253 2763270 2849369 2943550 3042734 3143718 3242486 3334506 3416784 3488456 3548820 3596239
59990C596239L3238J8994M503j1103k7218m2303n5932o8349p8668q5429q8374
$$ 3596239 3629477 3648471 3652974 3641871 3614653 3572350 3516418 3448069 3369401 3283972 3195598
59979C195598q7993q4036p6219o5708n4207m2178k9356j6191l293R658K3140L6852
$$ 3195598 3107605 3023569 2947350 2881642 2827435 2785257 2755901 2739710 2736417 2746075 2769215 2806067
59967B806067N0631O4975P9507R2404J02640J11041J17615J19835J15458J05291
$$ 2806067 2856698 2921673 3001180 3093584 3196224 3307265 3424880 3544715 3660173 3765464
59957C765464R1238P3508N2018K8912P229j1756k7935m0663m9733n6499o1783
$$ 3765464 3856702 3930210 3982228 4011140 4018369 4006613 3978678 3938015 3888282 3831783 3770000
59946C770000o4167o2420n7818n1794m3128l0246j4533J598J8488L8048N9955
$$ 3770000 3705833 3643413 3585595 3533801 3490673 3460427 3445894 3447492 3465980 3504028 3563983
59935C563983Q2129J04102J26926J50345J72820J93813K13344K29747K40213K43052
$$ 3563983 3646112 3750214 3877140 4027485 4200305 4394118 4607462 4837209 5077422 5320474
59925E320474K37357K21328J93456J54745J07637N3765m775o3059j15218j58395
$$ 5320474 5557831 5779159 5972615 6127360 6234997 6288762 6283987 6220928 6105710 5947315
59915E947315j92627k17677k32639k38167k36323k28426k15118j98152j79791
$$ 5947315 5754688 5537011 5304372 5066205 4829882 4601456 4386338 4188186 4008395
59906D008395j60722j40552j19817r9619p9931o0308m1507k4320p684R847K7571
$$ 4008395 3847673 3707121 3587304 3487685 3407754 3347446 3305939 3281619 3273935 3283782 3311353
59895C311353M3729N8276P2293Q5469R6405J04601J09900J10657J04816R2247
$$ 3311353 3355082 3413358 3485651 3571120 3667525 3772126 3882026 3992683 4097499 4189746
59885D189746P4118N0954K3340o581l6606o6383r5538j21287j40591j53603j62313
$$ 4189746 4263864 4314818 4338158 4331577 4294971 4228588 4133050 4011763 3871172 3717569 3555256
59874C555256j66929j66484j62017j55989j49093j40446j30375j20183j09765
$$ 3555256 3388327 3221843 3059826 2903837 2754744 2614298 2483923 2363740 2253975
59865B253975r8308q6761p6858o8183n9001m9464m1130l3883k6393j9202j4329
$$ 2253975 2155667 2068906 1992048 1923865 1864864 1815400 1774270 1740387 1713994 1694792 1680463
59854A680463j1848r748p245n556n400o157p411q952r492p785m696j866J034N220
$$ 1680463 1668615 1658867 1651622 1646066 1640666 1634509 1627098 1618146 1608654 1600869 1596173 1594307 1595341 1600561
59840A600561R739J2382J3063J3316J2803R417K831m944j2534j9958k6501l0674
$$ 1600561 1610300 1622682 1635745 1649061 1661864 1671281 1674112 1669168 1656634 1636676 1610175 1579501
59828A579501l2519l3441l3758l2773l1068l0079k9465k7507k4062k0616j7549
$$ 1579501 1546982 1513541 1479783 1447010 1415942 1385863 1356398 1328891 1304829 1284213 1266664
59817A266664j3921r837o421l518R2M334Q199J2151J7526K3704K8514L1378L3604
$$ 1266664 1252743 1242906 1236485 1232967 1233059 1237393 1245592 1257743 1275269 1298973 1327487 1358865 1392469
59804A392469L5767L7218L7847L7897L6452L2741K8300K5207K2805J9171J5029
$$ 1392469 1428236 1465454 1503301 1541198 1577650 1610391 1638691 1663898 1686703 1705874 1720903
59793A720903J3005J3609J5243J7580K1183K4130K3171J8725J5141J5413J8926
$$ 1720903 1733908 1747517 1762760 1780340 1801523 1825653 1848824 1867549 1882690 1898103 1917029
59782A917029K4749L3513M5023N7102O7830P6741Q3663Q9192R6327J08562J25988
$$ 1917029 1941778 1975291 2020314 2077416 2145246 2221987 2305650 2394842 2491169 2599731 2725719
59771B725719J45894J66746J87944K05543K12027K01324J71447J22885N8820j2250
$$ 2725719 2871613 3038359 3226303 3431846 3643873 3845197 4016644 4139529 4198349 4186099
59761D186099p8433j31232j68459j90574j98014j93033j80276j63456j43866j22956
$$ 4186099 4107666 3976434 3807975 3617401 3419387 3226354 3046078 2882622 2738756 2615800
59751B615800j03339q6159p0319n5345m2348l1388k0888j0488j627N623J3225
$$ 2615800 2512461 2426302 2355983 2300638 2258290 2226902 2206014 2195526 2193899 2199522 2212747
59740B212747K1865K9994L7036M4449N2737O0570O7917P6827Q7957R9456J10381
$$ 2212747 2234612 2264606 2301642 2346091 2398828 2459398 2527315 2604142 2692099 2791555 2901936
59729B901936J22167J35536J49158J62642J77688J94912K12694K30602K50640
$$ 2901936 3024103 3159639 3308797 3471439 3649127 3844039 4056733 4287335 4537975
59720D537975K73451K96249L16219L32899L45617L51720L49481L40132L25197
$$ 4537975 4811426 5107675 5423894 5756793 6102410 6454130 6803611 7143743 7468940
59711G468940L04628K79520K54076K32678K17100K08179K07678K16288K31911
$$ 7468940 7773568 8053088 8307164 8539842 8756942 8965121 9172799 9389087 9620998
59702I620998K51683K73793K95808L13456L22879L22311L10380K85117K46219
$$ 9620998 9872681 10146474 10442282 10755738 11078617 11400928 11711308 11996425 12242644
59693A2242644J96286J38491P5177R994n1241j03648j45549j76471j95191k01178
$$ 12242644 12438930 12577421 12652598 12662592 12611351 12507703 12362154 12185683 11990492 11789314
59683A1789314j95793j80514j55871j23290q5769m5351j761M5508R5822J48948
$$ 11789314 11593521 11413007 11257136 11133846 11048077 11002726 11000965 11046473 11142295 11291243
59673A1291243K05557K65076L25278L84702M42874M97092N41755N71920N84737
$$ 11291243 11496800 11761876 12087154 12471856 12914730 13411822 13953577 14525497 15110234
59664A5110234N76331N40532M72745L73024K44664R3112p1919k36401l86720n13327
$$ 15110234 15686565 16227097 16699842 17072866 17317530 17410642 17338723 17102322 16715602 16202275
59654A6202275o09784o71993p00396p00136o76942o34898n79047n16669m53909
$$ 16202275 15592491 14920498 14220102 13519966 12843024 12208126 11629079 11112410 10658501
59645A0658501l94061l41147l02179k83390k86118l07710l43220l84330m20187
$$ 10658501 10264440 9923293 9621114 9337724 9051606 8743896 8400676 8016346 7596159
59636G596159m42820m50563m44951m27242l99911l68010l35782l03862k72057
$$ 7596159 7153339 6702776 6257825 5830583 5430672 5062662 4726880 4423018 4150961
59627D150961k42293k16257j92602j69542j48187j30571j16080j02550q9476p7709
$$ 4150961 3908668 3692411 3499809 3330267 3182080 3051509 2935429 2832879 2743403 2665694
59617B665694o7391n8295n0758m4475l7873l0366k3583j8814j5219j2103j0729
$$ 2665694 2598303 2540008 2489250 2444775 2406902 2376536 2352953 2334139 2318920 2306817 2296088
59606B296088j2081j4967j8219k2543k8363l4072l8416m2367m6647m9717n0296
$$ 2296088 2284007 2269040 2250821 2228278 2199915 2165843 2127427 2085060 2038413 1988696 1938400
59595A938400m9637m9152m7957m4946m1123l7713l4059k9572k5569k2990k0403
$$ 1938400 1888763 1839611 1791654 1746708 1705585 1667872 1633813 1604241 1578672 1555682 1535279
59584A535279j6499j2460r670p254m142j355J29J723M964Q769J1255J2483J3346
$$ 1535279 1518780 1506320 1496650 1489396 1485254 1483899 1484028 1485751 1490715 1499484 1510739 1523222 1536568
59571A536568J3591J3084J3054J4019J4475J3579J3034J4301J6253J7617J9340
$$ 1536568 1550159 1563243 1576297 1590316 1604791 1618370 1631404 1645705 1661958 1679575 1698915
59560A698915K2399K5644K8158L1379L6547M2332M7291N2347N8587O5088P1226
$$ 1698915 1721314 1746958 1775116 1806495 1843042 1885374 1932665 1985012 2043599 2108687 2179913
59549B179913P8597Q8173R8099J06706J15160J24659J33761J41041J47521J53740
$$ 2179913 2258510 2346683 2444782 2551488 2666648 2791307 2925068 3066109 3213630 3367370
59539C367370J57356J56559J53050J48553J41451J30242J17320J05852R5604Q5205
$$ 3367370 3524726 3681285 3834335 3982888 4124339 4254581 4371901 4477753 4573357 4658562
59529D658562P5167O4771M9499K6703J450j8185k9892l6624l9661l7440l0008
$$ 4658562 4733729 4798500 4847999 4874702 4876152 4857967 4828075 4791451 4751790 4714350 4684342
59518D684342j9297n356J3178L5132N7215P7849R6892J12192J20214J19675J11150
$$ 4684342 4665045 4659689 4672867 4707999 4765214 4843063 4939955 5052147 5172361 5292036 5403186
59507E403186R3995O7323L3308m219m3933q6247j29086j68012k00218k25166k41893
$$ 5403186 5497181 5564504 5597812 5593593 5549660 5463413 5334327 5166315 4966097 4740931 4499038
59496D499038k49158k47981k40884k28960k12454j93388j74413j55789j36580
$$ 4499038 4249880 4001899 3761015 3532055 3319601 3126213 2951800 2796011 2659431
59487B659431j18013j02436q9601p7239o4764n3319m2887l2449k2455j4063o534
$$ 2659431 2541418 2438982 2349381 2272142 2207378 2154059 2111172 2078723 2056268 2042205 2035671
59476B035671J771J0570J8694K6881L6522M6632N5310O3290P2841Q3976R4956
$$ 2035671 2037442 2048012 2066706 2093587 2130109 2176741 2232051 2295341 2368182 2452158 2547114
59465B547114J05588J16733J27348J35433J41134J45586J47381J43503J33112
$$ 2547114 2652702 2769435 2896783 3032216 3173350 3318936 3466317 3609820 3742932
59456C742932J17303R6075O8971L7968O246k5224n6693q6219j10825j30253j45987
$$ 3742932 3860235 3956310 4025281 4063249 4069495 4044271 3987578 3901359 3790534 3660281 3514294
59445C514294j57352j62335j61650j58198j52885j44650j34285j24409j15750
$$ 3514294 3356942 3194607 3032957 2874759 2721874 2577224 2442939 2318530 2202780
59436B202780j06871r7501q8834q0682p1728o2436n4664m8568m2848l7445l3069
$$ 2202780 2095909 1998408 1909574 1828892 1757164 1694728 1640064 1591496 1548648 1511203 1478134
59425A478134k8775k3265j7826j4607j2834j0036o171k980k38L534P505R653J0763
$$ 1478134 1449359 1426094 1408268 1393661 1380827 1370791 1364620 1361640 1361402 1364936 1372441 1382094 1392857
59412A392857J3255J6748J8804J9499K1224K4591K8468L3024L8057L9386L2472
$$ 1392857 1406112 1422860 1441664 1461163 1482387 1506978 1535446 1568470 1606527 1645913 1678385
59401A678385J9789R446N997P387J1042J7336K5986L4537M2343N1313O0577O4959
$$ 1678385 1698174 1707620 1713617 1721004 1732046 1749382 1775368 1809905 1852248 1903561 1964138 2029097
59389B029097O1430N3729M8348M8650N4475O4404P6350Q8390J00736J15098J31541
$$ 2029097 2090527 2144256 2192604 2241254 2295729 2360133 2436483 2524873 2625609 2740707 2872248
59378B872248J48249J64828J83046K03787K25996K49113K73721K99133L22900
$$ 2872248 3020497 3185325 3368371 3572158 3798154 4047267 4320988 4620121 4943021
59369D943021L43178L59069L68590L69160L60461L44359L22304K95529K67216
$$ 4943021 5286199 5645268 6013858 6383018 6743479 7087838 7410142 7705671 7972887
59360G972887K40939K17168J94511J73909J57848J45752J34254J21927J09557
$$ 7972887 8213826 8430994 8625505 8799414 8957262 9103014 9237268 9359195 9468752
59351I468752R5712P6595N1107K1841r704m4723q2919j20755j55245j86032k12773
$$ 9468752 9564464 9641059 9692166 9714007 9704303 9659580 9576661 9455906 9300661 9114629 8901856
59340H901856k34218k51022k65985k80151k91722k99510l04253l05839l02774
$$ 8901856 8667638 8416616 8150631 7870480 7578758 7279248 6974995 6669156 6366382
59331F366382k95164k84907k72330k56087k37011k18320k01306j84442j67384
$$ 6366382 6071218 5786311 5513981 5257894 5020883 4802563 4601257 4416815 4249431
59322D249431j52050j38935j26261j13595j02566r3098q2946p1808o2028n4172
$$ 4249431 4097381 3958446 3832185 3718590 3616024 3522926 3439980 3368172 3306144 3251972
59312C251972m5973l6745k8767k2956j7169j0225l764J338O558J2358J6928J9770
$$ 3251972 3205999 3169254 3140487 3117531 3100362 3090137 3086373 3087711 3094269 3106627 3123555 3143325
59300C143325K2705K5898K6720K4101K0349J7048J2847O849M99n509j2596k0914
$$ 3143325 3166030 3191928 3218648 3242749 3263098 3280146 3292993 3299842 3300341 3294832 3282236 3261322
59288C261322k8118l2948l6675l9737m0580l9084l7237l5235l0860k4070j7829
$$ 3261322 3233204 3200256 3163581 3123844 3083264 3044180 3006943 2971708 2940848 2916778 2898949
59277B898949j2847n975M191J4472K2085K8313L4820M0460M4135M6951M8850M6848
$$ 2898949 2886102 2880127 2884318 2898790 2920875 2949188 2984008 3024468 3068603 3115554 3164404 3211252
59265C211252L9228K8131J5588O24j7307l5562n1685o6221p9695r0092r5854r8321
$$ 3211252 3250480 3278611 3294199 3294823 3277516 3241954 3190269 3124048 3044353 2954261 2858407 2760086
59253B760086r8752r6143r0192q3154p6391o8322n8090m7954l9583l1281k1318
$$ 2760086 2661334 2565191 2474999 2391845 2315454 2247132 2189042 2141088 2101505 2070224 2048906
59242B048906j0843j084R252K1315L3624M4018N0975N1650M2975K7288J2983O760
$$ 2048906 2038063 2036979 2046231 2067546 2101170 2145188 2196163 2247813 2290788 2318076 2331059 2337819
59230B337819Q392J4997K5937M0575N5760O9527Q4065J01553J20321J38352J57179
$$ 2337819 2346211 2361208 2387145 2427720 2483480 2553007 2637072 2738625 2858946 2997298 3154477
59219C154477J78681K01102K21855K41356K60493K76976K87627K91717K88691
$$ 3154477 3333158 3534260 3756115 3997471 4257964 4534940 4822567 5114284 5402975
59210E402975K75438K49561K13222J70350J22229O8883J2677m2639r4464j40177
$$ 5402975 5678413 5927974 6141196 6311546 6433775 6502658 6515335 6472696 6378232 6238055
59200F238055j75832j99023k11109k14253k08630j95006j77272j59335j41716
$$ 6238055 6062223 5863200 5652091 5437838 5229208 5034202 4856930 4697595 4555879
59191D555879j24013j08203r6687q9258q4655q2842q3445q4386q4572q5426q7549
$$ 4555879 4431866 4323663 4226976 4137718 4053063 3970221 3886776 3802390 3717818 3632392 3544843
59180C544843q8775q7700q6066q5117q2981p8414p3707p0770o7692o2404n6552
$$ 3544843 3456068 3368368 3282302 3197185 3114204 3035790 2962083 2891313 2823621 2761217 2704665
59169B704665n2252m8177m2412l6272l1717k7761k2920j8459j5649j2741q165
$$ 2704665 2652413 2604236 2561824 2525552 2493835 2466074 2443154 2424695 2409046 2396305 2388140
59158B388140l943k155q67K551O821R444J1402J5046J9648K3160K6225L0443L4650
$$ 2388140 2384197 2382042 2381175 2383726 2390547 2399991 2411393 2426439 2446087 2469247 2495472 2525915 2560565
59145B560565L6878L8112M0192M1943M1114L8378L5613L2034K5753J7511R280
$$ 2560565 2597443 2635555 2675747 2717690 2758804 2797182 2832795 2864829 2890582 2908093 2917373
59134B917373P85r091j9169k7513l4432m0777m5199m6306m5501m4511m2178l6998
$$ 2917373 2918158 2909067 2889898 2862385 2827953 2787176 2741977 2695671 2650170 2605659 2563481 2526483
59122B526483l0515k4909j9461j2858o535k127K085Q414J5710K1705K6961L2743
$$ 2526483 2495968 2471059 2451598 2438740 2432205 2430078 2432163 2440577 2456287 2477992 2504953 2537696
59110B537696L7538L9750M1545M5579N0094N1663N0867N0831N1942N2541N3343
$$ 2537696 2575234 2614984 2656529 2702108 2752202 2803865 2854732 2905563 2957505 3010046 3063389
59099C063389N6561O1702O6276O9579P1869P1033O3931N0142L0941O165k4287
$$ 3063389 3119950 3181652 3247928 3317507 3389376 3460409 3524340 3574482 3605423 3611588 3587301
59088C587301n7178q7942j14765j37573j54729j64337j67334j65882j60275j50614
$$ 3587301 3530123 3442181 3327416 3189843 3035114 2870777 2703443 2537561 2377286 2226672
59078B226672j39440j29115j18574j06204r3800q3966p5830o7239n9021n3055
$$ 2226672 2087232 1958117 1839543 1733339 1639539 1555573 1479743 1412504 1353483 1300428
59068A300428m8303m2809l7557l4179l1095k6226k1297j8989j7971j5359j1923
$$ 1300428 1252125 1209316 1171759 1137580 1106485 1080259 1058962 1039973 1022002 1006643 994720
59057I94720j0108q886n573j031J890L410N358O409L963n19l169l520l834l949
$$ 994720 984612 975726 970153 969122 971012 974422 979780 986189 990152 989633 986464 982944 979110 975161
59043I75161j804J963N007P933J3217K0442K7154L3404M0717M7627N0881N0009
$$ 975161 973357 975320 980327 988260 1001477 1021919 1049073 1082477 1123194 1170821 1221702 1271711
59031A271711M6252L8589K5983J2191K974p33k068j985Q21M926O787O111N436
$$ 1271711 1317963 1356552 1382535 1394726 1397700 1396967 1394899 1392914 1393735 1398661 1405448 1411559 1416995
59018A416995M874K390j240l011l005m119o814q877r985j1571j2532j0131m985
$$ 1416995 1421869 1424259 1423019 1420008 1417003 1412884 1406070 1397193 1387208 1375637 1363105 1352974 1347989
59005A347989m68K563N766Q655Q796O200K750k075j0032j9361k6283l0653l5029
$$ 1347989 1347521 1350084 1355850 1364505 1373301 1379501 1382251 1380176 1370144 1350783 1324500 1293847 1258818
58992A258818l8881l9183l6344l3912l2556k9679k5073k1386j8902j5127r911
$$ 1258818 1219937 1180754 1144410 1110498 1077942 1048263 1023190 1001804 982902 967775 957864
58981I57864n857l435o98K151L023K784M722Q949J2396J4387J7145K0792K3121
$$ 957864 952007 948572 947874 950025 953048 955832 960554 969503 981899 996286 1013431 1034223 1057344
58968A057344K4414K7206L1019L2519L1081K9108K6885K2440J6600J2644J0707
$$ 1057344 1081758 1108964 1139983 1172502 1203583 1232691 1259576 1282016 1298616 1311260 1321967
58957A321967P931M323K945M129N168O008R398J4954J8938K0500K2317K4493K3877
$$ 1321967 1329898 1334221 1337166 1341295 1346463 1352471 1361869 1376823 1395761 1416261 1438578 1463071 1486948
58944A486948K0311J7586J7082J6397J5291J6970K2041K7070L0761L5787M2831
$$ 1486948 1507259 1524845 1541927 1558324 1573615 1590585 1612626 1639696 1670457 1706244 1749075
58933A749075M8413N0508N1183N1872N1165M8989M8012M9310N1349N4435O1156
$$ 1749075 1797488 1847996 1899179 1951051 2002216 2051205 2099217 2148527 2199876 2254311 2315467
58922B315467P1221Q1039Q9691J00259J14065J28830J43684J60634J79780J98502
$$ 2315467 2386688 2467727 2557418 2657677 2771742 2900572 3044256 3204890 3384670 3583172
58912C583172K16759K37754K62016K86253L09388L34087L60699L85221M04856
$$ 3583172 3799931 4037685 4299701 4585954 4895342 5229429 5590128 5975349 6380205
58903F380205M19986M29021M27028M11323L82981L41333K83034K08807J25358
$$ 6380205 6800191 7229212 7656240 8067563 8450544 8791877 9074911 9283718 9409076
58894I409076L8479n0247j37824k17139k82829l34829l73779l98104m08035m07365
$$ 9409076 9447555 9397308 9259484 9042345 8759516 8424687 8050908 7652804 7244769 6837404
58884F837404l98748l82084l59359l35672l13325k90153k65710k43532k25164
$$ 6837404 6438656 6056572 5697213 5361541 5048216 4758063 4492353 4248821 4023657
58875D023657k07757j89998j74674j62824j51103j37761j25592j16063j06118
$$ 4023657 3815900 3625902 3451228 3288404 3137301 2999540 2873948 2757885 2651767
58866B651767r3854q2026p2828o4611n6802n2678n3864n6936n8672n9829o0957
$$ 2651767 2557913 2475887 2403059 2338448 2281646 2228968 2175104 2118168 2059496 1999667 1938710
58855A938710n9657n5100n0328m7023m2827l6565l1002k7544k3463j7447j2586
$$ 1938710 1879053 1823953 1773625 1726602 1683775 1647210 1616208 1588664 1565201 1547754 1535168
58844A535168j0697q882m918r58J368M286R100J3201J5135J7561K1945K5562K7068
$$ 1535168 1524471 1515589 1510671 1509713 1511081 1515367 1524467 1537668 1552803 1570364 1592309 1617871 1644939
58831A644939K9712L5473M1362M5106M9277N6020O2927O7945P3261Q0490Q7132
$$ 1644939 1674651 1710124 1751486 1796592 1845869 1901889 1964816 2032761 2106022 2186512 2273644
58820B273644R1734R7491J06725J16797J25415J34962J47635J61375J74661J90261
$$ 2273644 2365378 2462869 2569594 2686391 2811806 2946768 3094403 3255778 3430439 3620700
58810C620700K09962K30699K50149K71119K95780L20631L41866L60959L79921
$$ 3620700 3830662 4061361 4311510 4582629 4878409 5199040 5540906 5901865 6281786
58801F281786L95436M02554M00079L87653L61829L19813K63491J95684J16586
$$ 6281786 6677222 7079776 7479855 7867508 8229337 8549150 8812641 9008325 9124911
58792I124911K8183o2079j46537k22583k89091l42216l79184m02100m13777m13851
$$ 9124911 9153094 9091015 8944478 8721895 8432804 8090588 7711404 7309304 6895527 6481676
58782F481676m02922l85969l67301l46242l21750k96709k73589k50533k26151
$$ 6481676 6078754 5692785 5325484 4979242 4657492 4360783 4087194 3836661 3610510
58773C610510k03549j85345j69419j53864j41222j33145j25967j16464j07121
$$ 3610510 3406961 3221616 3052197 2898333 2757111 2623966 2497999 2381535 2274414
58764B274414j00678r4378q4976p4839o7467o1371n3784m6272m1251l6887l0656
$$ 2274414 2173736 2079358 1994382 1919543 1852076 1790705 1736921 1690649 1649398 1612511 1581855
58753A581855k4121j9148j3585n622J822O135J0053J6663K3853K9025L4699M3814
$$ 1581855 1557734 1538586 1525001 1519379 1521201 1527336 1537389 1554052 1577905 1606930 1641629 1685443
58741A685443N3833O1004O6111P0239O9236N8607M0177J8462n415l0474n1143
$$ 1685443 1739276 1800280 1866391 1936630 2005866 2064473 2104650 2123112 2117697 2087223 2036080
58730B036080o2358o6043o6760o4728n8850n2444m9513m8753m7223m6410m8763
$$ 2036080 1973722 1907679 1840919 1776191 1717341 1664897 1615384 1566631 1519408 1472998 1424235
58719A424235n1916n2500n2101n3457n4344n1426m6706m4005m2282l8491l3756
$$ 1424235 1372319 1319819 1267718 1214261 1159917 1108491 1061785 1017780 975498 937007 903251
58708I03251l0735k8195k4049k0373j9603j9276j6358j3095j2633j2747j0090
$$ 903251 872516 844321 820272 799899 780296 761020 744662 731567 718934 706187 696097
58697F96097o822o593p685o646m987n781p163n894l872m424n631m025j458j470
$$ 696097 689275 682682 674997 668351 663364 657583 650420 644526 640654 636230 630599 626574 625116 623646
58683F23646k253p3L640N397O464R727J3182J3416J2412J3895J6290J6161J5341
$$ 623646 621393 621320 624960 630357 636821 646548 659730 673146 685558 699453 715743 731904 747245
58670G47245J7557K1287K2921K3598K5719K6392K1857J5144J1693J0543P426L133
$$ 747245 764802 786089 809010 832608 858327 884719 906576 921720 933413 943956 951382 954515
58658I54515R84p54n831j2399j6405j9521k5486l1573l2276k8863k6844k6289
$$ 954515 955499 954745 948914 936515 920110 900589 875103 843530 811254 782391 755547 729258
58646G29258k3184j8189j5425j4385j1316o994n111m735k251J127J623P09K634
$$ 729258 706074 687885 672460 658075 646759 639765 634654 629919 627668 628795 630418 631127 633761
58633F33761O261P226O236P184R149Q421O488P712J1016J2042J1621J3913J8095
$$ 633761 640022 647248 653484 660668 669817 678238 684726 692438 703454 715496 727117 741030 759125
58620G59125K0347K2115K7919L6779M4132N0384N9111O8765P4982P9319Q6899
$$ 759125 779472 801587 829506 866285 910417 960801 1019912 1088677 1163659 1242978 1329877
58609A329877R6980J04564J09751J16708J24867J29778J31010J30543J25318J10429
$$ 1329877 1426857 1531421 1641172 1757880 1882747 2012525 2143535 2274078 2399396 2509825
58599B509825Q7994O3996L8399P706k4821n1506p1295q8626j02929j09296j08507
$$ 2509825 2597819 2661815 2700214 2707920 2683099 2631593 2560298 2471672 2368743 2259447 2150940
58588B150940j06227j03147r5657q5268p7207p0569n9974m6275l5539k8161j9240
$$ 2150940 2044713 1941566 1845909 1760641 1683434 1612865 1552891 1506616 1471077 1442916 1423676
58577A423676r075k754K48N523J3079J7665J9478K4041L1593L7313M2034N1844
$$ 1423676 1414601 1411847 1412095 1417618 1430697 1448362 1467840 1491881 1523474 1560787 1602821 1654665
58565A654665O6610P9640Q9017R8300J05410J01915Q4697N8121K4251j8046o3278
$$ 1654665 1721275 1800915 1889932 1988232 2093642 2195557 2280254 2338375 2362626 2344580 2281302
58554B281302j00026j23488j37589j44004j39889j27545j14991j04795r2654p8459
$$ 2281302 2181276 2057788 1920199 1776195 1636306 1508761 1393770 1288975 1196321 1117862
58544A117862o8070o2419n5643m6028l8513l4525k9706k3513k0573k0761j8352
$$ 1117862 1049792 987373 931730 885702 847189 812664 782958 759445 738872 718111 699759
58533F99759j2814r915j0502q878m131k045l802l752o33%l140m508k655k845o188
$$ 699759 686945 677030 666528 657650 653519 651474 647672 643920 643287 643287 640147 635639 632984 630139 623951
58518F23951p018l742j737k860k647k39l26k932k144K624N079L857M582Q109Q555
$$ 623951 616933 613191 611454 608594 605947 605708 605382 602450 600306 602930 608009 611866 616448 624557 633112
58503F33112N433N658J0640J3551J2470J3924K0048K4631K5705K9613L8463M5834
$$ 633112 638545 644203 654843 668394 680864 694788 714836 739467 765172 794785 833248 879082
58491H79082M9294N4870O4453P0843P0148O7273O4440N6284M1519K7580J8333
$$ 879082 928376 983246 1047699 1118542 1188690 1255963 1320403 1376687 1418206 1445786 1464119
58480A464119Q481m899j6921k5810l7253n2420o3376o5984o6003o7049o4288n5689
$$ 1464119 1472600 1467701 1450780 1424970 1387717 1335297 1271921 1205937 1139934 1072885 1008597 952908
58468I52908m7789m4246l9942l2219k6623k5677k3393j6796j1706j1279j0100
$$ 952908 905119 860873 820931 788712 762089 736412 713019 696223 684517 673238 663138
58457F63138n335k347l583l386M69J841j555k866J156M166K731K560O337P873
$$ 663138 657803 655456 651873 648487 648956 650797 649242 646376 647532 651698 654429 656989 663326 671199
58443F71199M787M321R886J4256J3072J2581J7023K0852K0687K2350K8607L2300
$$ 671199 675986 680307 690193 704449 717521 730102 747125 767977 788664 811014 839621 871921
58431H71921K9081K4612K2008J5075J563r926j4193j7632k4425k7849k3729j9258
$$ 871921 901002 925614 947622 962697 964260 954334 940141 922509 898084 870235 846506 827248
58419H27248j9582j8632j2157o845p288o830o57M705M326M527J0285J5685J6380
$$ 827248 807666 789034 776877 770032 762744 755914 755257 759962 764288 768815 779100 794785 811165
58406H11165J8647K6565L2870L2184L0520L2193L0413K0569R730L210m774j7302
$$ 811165 829812 856377 889247 921431 951951 984144 1014557 1035126 1044856 1048066 1043292 1025990
58394A025990k5725k4807k2920k6415k8018k1802j5294j5089j4593q061k694m450
$$ 1025990 1000265 975458 952538 926123 898105 876303 861009 845920 831327 823266 820572 816122
58382H16122n791k10M882K449p07K386N453K322k1M976J0143Q025M372N375N204
$$ 816122 810331 810121 815003 817452 816745 819131 824584 826906 826885 831861 842004 850029 854401 859776 864980
58367H64980p16m210N55M775J323j391M309J0294Q455O318J1759J7264J5109J3195
$$ 864980 864264 860054 860609 865384 866707 865316 869625 879919 888374 894692 906451 923715 938824 952019
58353I52019J9615K6427K5142K3484K9853L6031L2614K6779K7157K5904J4086
$$ 952019 971634 998061 1023203 1046687 1076540 1112571 1145185 1171964 1199121 1225025 1239111
58342A239111L06m511o517j4734k1995j9135j3821j5902j8184j1228k963l800
$$ 1239111 1239417 1234906 1228389 1213655 1191660 1172525 1158704 1142802 1124618 1113390 1110427 1106627
58330A106627o449n62O781N532L033R284J6363J3709R434J4866K2437K0818J7462
$$ 1106627 1100178 1099616 1106397 1111929 1114962 1124246 1140609 1154318 1163752 1178618 1201055 1221873 1239335
58317A239335K3647L1738L0321K7288L4472M3717M2180L6894L9791M2820L3022
$$ 1239335 1262982 1294720 1325041 1352329 1386801 1430518 1472698 1509592 1549383 1592203 1625225
58306A625225J8206J2418J0014l80j0662q205j612m912j0382m068O174N805K139
$$ 1625225 1643431 1655849 1665863 1665483 1654821 1646616 1645004 1640092 1629710 1625642 1631816 1637621 1639760
58293A639760R442K0042J9269J4761K1439L1591L0086K5017L2415M4657M5528
$$ 1639760 1649202 1669244 1688513 1703274 1724713 1756304 1786390 1811407 1843822 1888479 1934007
58282A934007M2513N2082O6974P0797P1047Q4209J02113J07255J07444J20293
$$ 1934007 1976520 2028602 2095576 2166373 2237420 2321629 2423742 2530997 2638441 2758734
58272B758734J37148J38092J28876J26724J23542J00611O6255M1232K0655j1197
$$ 2758734 2895882 3033974 3162850 3289574 3413116 3513727 3579982 3621214 3641869 3630672
58262C630672m2835n2313m7905n1665n6942m3779k1689j3853j3010K887K5633
$$ 3630672 3587837 3535524 3487619 3435954 3379012 3335233 3313544 3299691 3286681 3289568 3315201
58251C315201L2363L1320M5732O6850P0707O6531P9326R9665J01572R4669J05988
$$ 3315201 3347564 3378884 3424616 3491466 3562173 3628704 3708030 3807695 3909267 4003936 4109924
58240D109924J25773J26068J17234J29149J52100J55359J48551J63328J90011
$$ 4109924 4235697 4361765 4478999 4608148 4760248 4915607 5064158 5227486 5417497
58231E417497J96166J92174K11927K44367K53473K50455K73884L13822L30993
$$ 5417497 5613663 5805837 6017764 6262131 6515604 6766059 7039943 7353765 7684758
58222G684758L35552L67963M17388M41728M53197M97442N63434O05023O35810
$$ 7684758 8020310 8388273 8805661 9247389 9700586 10198028 10761462 11366485 12002295
58213A2002295P06459Q04369Q77993R44059J062206J220496J362546J510557J736332
$$ 12002295 12708754 13513123 14391116 15335175 16397381 17617877 18980423 20490980 22227312
58204B2227312K028322K322779K647895L089972L637318M220684M887341N755241
$$ 22227312 24255634 26578413 29226308 32316280 35953598 40174282 45061623 50816864
58196E0816864O822173Q032008R507611J1475571J3979037J6947627K0538113
$$ 50816864 57639037 65671045 75178656 86654227 100633264 117580891 138119004
58189A38119004K5075253L0668571L7240882M4674516N1900641N5485939N0411288
$$ 138119004 163194257 193862828 231103710 275778226 327678867 383164806 433576094
58182D33576094L3953742R136760j6469298l5827308m6320792m9342200m7525539
$$ 433576094 467529836 476666596 460197298 424369990 378049198 328706998 281181459
58175B81181459m3001963l7315425l1593679k6404224k1843720j7929066j4730613
$$ 281181459 238179496 200864071 169270392 142866168 121022448 103093382 88362769
58168H8362769j2193639j0126352q410640p043890n975119n078127m296329l662865
$$ 88362769 76169130 66042778 57632138 50588248 44613129 39535002 35238673 31575808
58160C1575808l167730k735112k337649k014313j766881j542221j323423j145142
$$ 31575808 28408078 25672966 23335317 21321004 19554123 18011902 16688479 15543337
58152A5543337j012023q84848p52781o44740n64339m80106l84120l01140k37095
$$ 15543337 14531314 13646466 12893685 12248945 11684606 11204500 10820380 10519240 10282145
58143A0282145j71718j03837n6116l1931p073L4909R1526J63507K60322L84903
$$ 10282145 10110427 10006590 9950474 9918543 9911470 9946379 10037905 10201412 10461734 10846637
58133A0846637N31765O97920Q88216J118381J412071J781968K225622K759068
$$ 10846637 11378402 12076322 12964538 14082919 15494990 17276958 19502580 22261648
58125B2261648L429581M271484N295877O537094P947481R069302Q943486O731539
$$ 22261648 25691229 29962713 35258590 41795684 49743165 58812467 67755953 74487492
58117G4487492K624844k031012n698363p688863q253692p939962p136794o110142
$$ 74487492 77112336 75081324 69382961 61694098 53440406 45500444 38363650 32253508
58109C2253508n096014m217150l455821k788002k250789j852579j531338j245614
$$ 32253508 27157494 22940344 19484523 16696521 14445732 12593153 11061815 9816201
58101I816201j017671q54178p09842n62761m47840l83105l32973k74207k32341
$$ 9816201 8798530 7944352 7234510 6671749 6223909 5840804 5507831 5233624 5001283
58092E001283k23820k22868k12769k12897k29422k33399k12269j92094j86261
$$ 5001283 4777463 4554595 4341826 4128929 3899507 3666108 3453839 3261745 3075484
58083C075484j71908j39139j15049j16231j22582j19257j20730j32909j34433
$$ 3075484 2903576 2764437 2649388 2533157 2410575 2291318 2170588 2037679 1903246
58074A903246j16585j01388j00467r5066p5324o0457o1070n9338m5396l6690m2516
$$ 1903246 1786661 1685273 1584806 1489740 1414416 1353959 1292889 1233551 1188155 1151465 1108949
58063A108949m4921l3524k5031k9755l2117k2519j6172k2311k6057j8526j4407
$$ 1108949 1064028 1030504 1005473 975718 943601 921082 904910 882599 856542 838016 823609
58052H23609k2283k7217k0002j4638k0016k2638j4177q360j3830j7407j0600o152
$$ 823609 801326 774109 754107 739469 719453 696815 682638 674278 660448 643041 632441 626289
58040F26289j2085j5460q072k695p866j1514n426j302o878j0368m311q65p774
$$ 626289 614204 598744 590672 587977 580111 568597 563171 561869 554991 544623 540312 539447 531673
58027E31673j2708p233l064q675j2592o068n1l367n867N25N143o11o346k759J235
$$ 531673 518965 511732 508668 499993 487401 481333 481282 477915 472048 472573 477716 477105 470759 468000 469235
58012D69235k519m855K220R319P922O594J3403K0075J9080J8881K6829L4094L2803
$$ 469235 466716 461861 464081 473400 481322 487916 501319 521394 540474 559355 586184 620278 653081
57999F53081L1163L6413L9572L2268K2338J7666J0897m546j9141k3443k4335l0109
$$ 653081 684244 720657 760229 792497 814835 832501 843398 838852 819711 796268 771933 741824
57987G41824l4460l0425k5484k7506k9776k4863j9609k1563k4126j9804j4905
$$ 741824 707364 676939 651455 623949 594173 569310 549701 528138 504012 484208 469303
57976D69303j6483j7903j1999n761p353j0827q139m256o143q604n048q20k066
$$ 469303 452820 434917 422918 417157 409804 398977 390838 386582 380439 371835 366787 365967 363901
57963C63901k949K528P613N254J915N283R584O969K304K740L443k187q552q109
$$ 363901 360952 363480 371093 376347 378262 383545 393129 400098 402402 405142 408585 406398 397846 389737
57949C89737n511p848j0648p382l111m972q304n829j634k659n107k489J411N43
$$ 389737 384226 376378 365730 358348 355237 350265 341961 336132 334498 331839 326732 324243 325654 326197
57935C26197j005K650P024O015M189P592J1000P189P28l78J324k61j933J799O608
$$ 326197 325192 327842 334866 340881 345070 352662 363662 370851 371579 371201 372525 372264 370331 372130 378738
57920C78738O025L766N990Q840O077J602J824L098o81n412m492j943m928j0099
$$ 378738 384763 388529 394519 403359 409436 411038 412862 415960 415279 409867 405375 403432 398504 388405
57906C88405j0285q073r804j2594j0391o836r057j4233j5027j2886j3526j4744
$$ 388405 378120 370047 360243 347649 337258 330422 321365 307132 292105 279219 265693 250949
57894B50949j1227o168n754p148m136N31N10j607N76M693M448K222M476R073R401
$$ 250949 239722 233554 227800 220652 216516 217047 217557 215950 216526 221219 225667 227889 232365 241438 250839
57879B50839O924P560R759Q087M797N814R042Q242M894M646N839L124j239j318
$$ 250839 257763 265323 275082 283169 287966 293780 302822 311064 315958 320604 326443 329567 328328 327010
57865C27010Q15j047n245n596l446m732q152p797m709m473o062m287o70o84k818
$$ 327010 327825 326778 321533 315937 312491 307759 299607 291810 287101 282628 276566 272279 271609 270925 268107
57850B68107j390K320K784J448M028R037J0172Q013Q331J0727J0053P290P972
$$ 268107 266717 269037 271821 273269 277297 286334 296506 304519 312850 323577 333630 340920 348892
57837C48892J1176J0930P329N814O559M886J097k07L85j828o180p813p045q224
$$ 348892 360068 370998 378327 384141 390700 395586 396683 396476 396861 395033 388853 381040 373995 365771
57823C65771j0632r942p244p175q702p127l616l144m747l471l00l13k616j981
$$ 365771 355139 345197 337953 330778 322076 314949 311333 308189 303442 299971 299671 299358 296742 294761
57809B94761R24R03j548j301J326J400r42j358n98k990o941p010m314m715p665
$$ 294761 295685 296588 295040 293739 295065 296465 295523 294165 293567 290577 283636 276626 272312 267597 259932
57794B59932p296l842l331o185o676l878k778m102l131O67K603K054L235O168
$$ 259932 252636 248794 245463 239278 232602 228724 225946 221844 218713 219380 221983 224037 227272 233440
57780B33440O298L728L445N657N238J574k68J040J532O10K138O058P790O862P497
$$ 233440 239738 243466 246911 252568 257806 259380 259112 260152 261684 262294 264432 270490 278280 285142 292639
57765B92639R914R944P874Q518J1788J2280R232P709Q798P919M131J931K275R55
$$ 292639 302553 312497 320371 328889 340677 352957 362189 369898 378696 386615 390746 392677 394952 395907
57751C95907k496l345r76p37m377p372p760r053j2084j2625r701p959r196r461
$$ 395907 393411 390066 389090 388353 383976 376604 368844 359791 347707 335082 325381 317422 308226 298765
57737B98765p063n637o630o503l921k331k921k325L03J189p70j706N6J477J422
$$ 298765 291702 286065 279435 272932 269011 266680 263759 261434 261737 262926 262156 260450 260506 261983 263405
57722B63405K653N362N818L434K213L367L654K542L570O816P692N227L994N715
$$ 263405 266058 271420 277238 280672 282885 286252 289906 292448 296018 302834 310526 315753 319747 325462
57708C25462O535M855M271O314P767P584R022J2536J4068J2879J3546J7626K0853
$$ 325462 331997 336852 341123 347437 355204 362788 371810 384346 398414 411293 424839 442465 463318
57695D63318K1325K2816K6994K9875K9160K7856K7544K5348K0742J8167J9627
$$ 463318 484643 507459 534453 564328 593488 621344 648888 674236 694978 713145 732772
57684G32772K1642K2703K6455L4368M2481M8956N7608P0298Q3051R3535J05265
$$ 732772 754414 777117 803572 837940 880421 929377 986985 1057283 1140334 1233869 1339134
57673A339134J20359J35050J46471J57021J67736J74108J73150J68174J62189
$$ 1339134 1459493 1594543 1741014 1898035 2065771 2239879 2413029 2581203 2743392
57664B743392J53039J39790J26958J15971R7477N8599m244q2330j59911k20132
$$ 2743392 2896431 3036221 3163179 3279150 3376627 3435226 3430982 3348652 3188741 2968609
57654B968609k52047k57185k46310k27715k02853j73820j47211j26890j09758
$$ 2968609 2716562 2459377 2213067 1985352 1782499 1608679 1461468 1334578 1224820
57645A224820r2717p7844o6889n7040m6501l8301l4108l0083k3345j6897j3610
$$ 1224820 1132103 1054259 987370 930330 883829 845528 811420 781337 757992 741095 727485
57634G27485j0849n758o26J861L717P382J1071J2880J4947J9160K3329K5742K8902
$$ 727485 716636 710878 710252 712113 715830 723212 734283 747163 762110 781270 804599 830341 859243
57621H59243L4658M0313M3749M7709N4796O2875O9526P6429Q5215R3576R9579
$$ 859243 893901 934214 977963 1025672 1080468 1143343 1212869 1289298 1374513 1468089 1567668
57610A567668J05077J10681J12119J05849R3695P7892N6553K8581j761k9784n5486
$$ 1567668 1672745 1783426 1895545 2001394 2095089 2172981 2229534 2258115 2256354 2226570 2171084
57599B171084p9397r8175j09084j14489j17273j16136j09934j02078r5817q9367
$$ 2171084 2091687 1993512 1884428 1769939 1652666 1536530 1426596 1324518 1228701 1139334
57589A139334q0465p1511o5420o0504n4232m8087m4083m0474l5517l1448l0145
$$ 1139334 1058869 987358 921938 861434 807202 759115 715032 674558 639041 607593 577448
57578E77448k8941k5254k1231j9329j7637j4314j2034j3006j4010j1709q614q382
$$ 577448 548507 523253 502022 482693 465056 450742 438708 425702 411692 399983 391369 382987
57566C82987r274p971n848n752o143m278j904k000k989j760N21J042Q14K218L979
$$ 382987 373713 365742 359894 354142 347999 343721 341817 339817 336828 335068 335589 336631 337445 339663 343642
57551C43642L817L221M491N996N424M675O254Q119P416O229P979J1113J2067J1736
$$ 343642 347459 350680 355171 361167 366591 371266 377520 385639 393055 399284 407263 418376 430443 442179
57537D42179J3196J5616J6239J6017J7600J9874K0164J9730K1653K5196K7650
$$ 442179 455375 470991 487230 503247 520847 540721 560885 580615 602268 627464 655114
57526F55114K9717L3790L8927M2799M6589N2683N9592O4466O8573P4867Q1956
$$ 655114 684831 718621 757548 800347 846936 899619 959211 1023677 1092250 1167117 1249073
57515A249073Q5928Q6288Q4750P9968O8923N2133L2347R871j5629m0518n9849
$$ 1249073 1335001 1421289 1506039 1586007 1654930 1707063 1739410 1749281 1733652 1693134 1633285
57504A633285p3268q3319q9791r1014q8888q6883q4438p8840p1246o5279o0823
$$ 1633285 1560017 1476698 1386907 1295893 1207005 1120122 1035684 956844 885598 820319 759496
57493G59496n4862m7485m1589l7408l2621k7225k3201k0068j5706j0911q319p541
$$ 759496 704634 657149 615560 578152 545531 518306 495105 475037 459331 448420 440101 432560
57481D32560n986l633k372j683L28K733L371L410N489Q648J0070J0629J3434J7951
$$ 432560 426574 422941 420569 418886 419214 421947 425318 428728 434217 442865 452935 463564 476998 494949
57467D94949K0951K2538K5920L1670L7350M2351M8133N4214N8853O3189O9860
$$ 494949 515900 538438 564358 596028 633378 675729 723862 778076 836929 900118 969978
57456I69978P7886Q3631Q6194Q7114Q5475P8367O5704M9781L0651O957j9035m2276
$$ 969978 1047864 1131495 1217689 1304803 1390278 1468645 1534349 1584130 1614781 1621738 1602703 1560427
57444A560427o0617p5161q5640r0377r0466q9012q6413q0946p3502o6970o1371
$$ 1560427 1499810 1424649 1339009 1248632 1158166 1069154 982741 901795 828293 761323 699952
57433F99952n4534m7076m1840l8725l5010l0494k7430k5694k2995j9547j7614
$$ 699952 645418 598342 556502 517777 482767 452273 424843 399149 376154 356607 338993
57422C38993j6782j4617j1621j0451j0636r314o786n993o706n825l341k340k986
$$ 338993 322211 307594 295973 285522 274886 265572 258786 252793 246087 240262 236921 234581 231595
57409B31595k218K27J125k23r03%J47q69m61J765L000K403K373L681M248L673
$$ 231595 229377 229604 230729 230506 229603 229603 229750 228881 228420 230185 233185 235588 237961 241642 245890 249563
57393B49563M053N436N396L990M088N859O160M417L825N408O141M578L240L680
$$ 249563 253616 259052 264448 268438 272526 278385 284545 288962 292787 298195 304336 308914 312154 315834
57379C15834M000L037K465K946K613J023L56J133J042o03j572j202j701l572m245
$$ 315834 319834 322871 325336 328282 330895 331918 332274 333407 334449 333846 332274 331072 329371 325799 321554
57364C21554k905k174l305m028k906j665j531j268m54o27j732j485L90J394R34
$$ 321554 318649 316475 313170 309142 306236 304571 303040 301772 301318 300691 298959 297474 297864 299258 300192
57349C00192J359L177L809K641K481M326N341M076L040L928M736L909L160L827
$$ 300192 301551 304728 308537 311178 313659 317985 323326 327402 330442 334370 339106 343015 346175 350002
57335C50002M384L810L638M603N038M483N044P302Q801Q397Q144R177R785R391
$$ 350002 354386 358196 361834 366437 371475 375958 381002 388304 397105 405502 413646 422823 432608 441999
57321D41999J0063J2150J2863J1225J0103J1081J1705J0296R051R775J0731J0457
$$ 441999 452062 464212 477075 488300 498403 509484 521189 531485 540536 550311 561042 571499
57309E71499J0623J2280J3250J2123J1122J2114J3396J3148J2617J3116J3429
$$ 571499 582122 594402 607652 619775 630897 643011 656407 669555 682172 695288 708717
57298G08717J2710J2540J3660J4160J3193J2860J4128J4795J3912J4031J6408
$$ 708717 721427 733967 747627 761787 774980 787840 801968 816763 830675 844706 861114
57287H61114J8143J7159J5919J6962J8587J8437J7731J8409J9429J9253J8938
$$ 861114 879257 896416 912335 929297 947884 966321 984052 1002461 1021890 1041143 1060081
57276A060081J9517J9413J7553J5911J5925J5602J3184J0366Q822O913L070p75
$$ 1060081 1079598 1099011 1116564 1132475 1148400 1164002 1177186 1187552 1196374 1203287 1206357 1205582
57264A205582k550l531n241o107m654k910k902k811k28L437N479O254P557R085
$$ 1205582 1203032 1199501 1194260 1188153 1183499 1180589 1177687 1174876 1174648 1178085 1183564 1189818 1197375 1206460
57250A206460R835J0670J2385J3594J3407J3623J5402J6616J5497J3953J4204
$$ 1206460 1216295 1226965 1239350 1252944 1266351 1279974 1295376 1311992 1327489 1341442 1355646
57239A355646J5021J4539J3794J4219J4526J3469J2746J3902J5214J5017J5071
$$ 1355646 1370667 1385206 1399000 1413219 1427745 1441214 1453960 1467862 1483076 1498093 1513164
57228A513164J7125J9314J9573J9476K0936K2196K1200J9877K0920K3022K3605
$$ 1513164 1530289 1549603 1569176 1588652 1609588 1631784 1652984 1672861 1693781 1716803 1740408
57217A740408K3516K4765K6166K5604K4257K4279K4616K3363K1832K2041K2536
$$ 1740408 1763924 1788689 1814855 1840459 1864716 1888995 1913611 1936974 1958806 1980847 2003383
57206B003383K1146J9455J9997K1323K0702J9470K0722K3460K4152K2677K1855
$$ 2003383 2024529 2043984 2063981 2085304 2106006 2125476 2146198 2169658 2193810 2216487 2238342
57195B238342K2365K2717K3148K4955K7070K7601K7616K9187L1132L1068L0215
$$ 2238342 2260707 2283424 2306572 2331527 2358597 2386198 2413814 2443001 2474133 2505201 2535416
57184B535416L1481L4077L4851L3928L4151L5705L6089L5010L4625L5263L5287
$$ 2535416 2566897 2600974 2635825 2669753 2703904 2739609 2775698 2810708 2845333 2880596 2915883
57173B915883L4932L5988L7840L7942L6156L4716L4080L2588L0079K8213K7347
$$ 2915883 2950815 2986803 3024643 3062585 3098741 3133457 3167537 3200125 3230204 3258417 3285764
57162C285764K6379K5369K5150K4942K3549K1961K1642K1333J8972J5516J3203
$$ 3285764 3312143 3337512 3362662 3387604 3411153 3433114 3454756 3476089 3495061 3510577 3523780
57151C523780J1426Q204M400K261J061j593n103o896p061p532p678n234q99K604
$$ 3523780 3535206 3543410 3547810 3550071 3551132 3549539 3544436 3537540 3530479 3522947 3515269 3510035 3509136 3511740
57137C511740N334R578J5078J9465K2782K6866L0752L1498K9251K6817K4497K0206
$$ 3511740 3517074 3526652 3541730 3561195 3583977 3610843 3641595 3673093 3702344 3729161 3753658 3773864
57125C773864J4299R403N711J488j879o26N289J2025J8040K5257L3613L9856M2684
$$ 3773864 3788163 3797566 3803277 3804765 3802886 3802260 3807549 3819574 3837614 3862871 3896484 3936340 3979024
57112C979024M4256M5824M6866M9325N7617P3255R4108J19586J51604J90059K33247
$$ 3979024 4023280 4069104 4115970 4165295 4222912 4296167 4390275 4509861 4661465 4851524 5084771
57101E084771K83932L49195M32897N34037O53947P98550R71469J171724J401491
$$ 5084771 5368703 5717898 6150795 6684832 7338779 8137329 9108798 10280522 11682013
57092A1682013J669564J983078K340854K737098L163390L601459M020676M388390
$$ 11682013 13351577 15334655 17675509 20412607 23575997 27177456 31198132 35586522
57084C5586522M675186M844032M848870M666791M333676L926602L492514K994646
$$ 35586522 40261708 45105740 49954610 54621401 58955077 62881679 66374193 69368839
57076F9368839K337526J448321L39490q91317k105594l171988l998274m546885
$$ 69368839 71706365 73154686 73494176 72602859 70497265 67325277 63327003 58780118
57068E8780118m832850m903194m810026m596102m296849l945214l569431l189500
$$ 58780118 53947268 49044074 44234048 39637946 35341097 31395883 27826452 24636952
57060B4636952k819680k472192k155600j872223j621179j402824j217224j060397
$$ 24636952 21817272 19345080 17189480 15317257 13696078 12293254 11076030 10015633
57052A0015633r26303q11538p14520o31417n57400m91387m35215l88250l46958
$$ 10015633 9089330 8277792 7563272 6931855 6374455 5883068 5447853 5059603 4712645
57043D712645l09773k78078k51928k28773k07233j88373j72462j57848j43914
$$ 4712645 4402872 4124794 3872866 3644093 3436860 3248487 3076025 2918177 2774263
57034B774263j31754j21333j11052j00842r2372q5650p8724p1320o5440o1675
$$ 2774263 2642509 2521176 2410124 2309282 2216910 2131260 2052536 1981216 1915776 1854101
57024A854101n8187n4139n0849m8823m6813m4572m3427m3428m2936m1523m0303
$$ 1854101 1795914 1741775 1690926 1642103 1595290 1550718 1507291 1463863 1420927 1379404 1339101
57013A339101l9055l6391l2863l0541k9161k6461k2542j9978j9141j7565j4470
$$ 1339101 1300046 1263655 1230792 1200251 1171090 1144629 1122087 1102109 1082968 1065403 1050933
57002A050933j1869j0394q329n629m542n191m807k528o69m2J584N030Q191J0383
$$ 1050933 1039064 1028670 1020341 1014712 1010170 1004979 1000172 997644 996975 996933 998517 1003547 1011738 1022121
56988A022121J3720J8658K2778K5649L0333L8316M7398N6027O4774P2171P5125
$$ 1022121 1035841 1054499 1077277 1102926 1133259 1171575 1218973 1275000 1339774 1411945 1487070
56977A487070P5790Q2180R9230J24978J57983K01674K58218L25800M04913M94439
$$ 1487070 1562860 1645040 1744270 1869248 2027231 2228905 2487123 2812923 3217836 3712275
56967C712275N70183N77475M66144K40261l3853k72661m26391m91890m91986m52368
$$ 3712275 4282458 4859933 5326077 5566338 5532485 5259824 4833433 4341543 3849557 3397189
56957C397189l92483l26064k63177k10976j73097j49159j35701j28001j21470
$$ 3397189 3004706 2678642 2415465 2204489 2031392 1882233 1746532 1618531 1497061
56948A497061j12908j01709q9332p7049o5145n4403m6363m1206l7113l2645k8051
$$ 1497061 1384153 1282444 1193112 1116063 1050918 996515 950152 908946 871833 839188 811137
56937H11137k3498j8155j1954n986p0P656J7645K7698L5500L9478L6466K2688
$$ 811137 787639 769484 757530 751544 751474 759130 776775 804473 839973 879451 915917 938605
56925I38605n53k5356m3915n4278n8069n6365n0574m3946l8638l3492k7321k1869
$$ 938605 938052 912696 868781 814503 756434 700069 649495 605549 566911 533419 506098 484229
56913D84229j8849j6852j4080j1521j0482r589p468n821o426p513o576m564l761
$$ 484229 465380 448528 434448 422927 412445 402856 395388 389567 383141 375628 369052 364488 360727
56900C60727l563k040J51J096J393L013N777Q190J0526J3971J7967K1482K5536
$$ 360727 357164 355124 355275 356371 357764 360777 366554 374744 385270 399241 417208 438690 464226
56887D64226L1500L8231M3696M7690M9954M7469L7513K2319P284m526j3167j8581
$$ 464226 495726 533957 577653 625343 675297 722766 760279 782598 789882 785356 772189 753608
56875G53608k0259j9417j8118j6543j3702j0046o764l324J539P330J2822J8635
$$ 753608 733349 713932 695814 679271 665569 655523 648759 645435 646974 654304 667126 685761
56863F85761K6218L5284M4838N5710O9062Q2640R0569Q6596O6993L2918p689m2837
$$ 685761 711979 747263 792101 847811 916873 999513 1090082 1176678 1243671 1276589 1268900 1226063
56851A226063o4407p2838p2822o7161n7186m5809l5809k6696j6753o606K363J1328
$$ 1226063 1161656 1088818 1015996 948835 891649 845840 810031 783335 766582 759976 762339 773667
56839G73667K2184L4174M5831N8493P4344R2729J11802J30925J46315J46534J19388
$$ 773667 795851 830025 875856 934349 1008693 1101422 1213224 1344149 1490464 1636998 1756386
56828A756386O4927k130o3329j07014j29916j34571j27179j14295r9260q2787
$$ 1756386 1821313 1819183 1755854 1648840 1518924 1384353 1257174 1142879 1043619 960832
56818I60832o6220n1582l8864k6425j4011k765P544J8577L0902M3914N8038P4322
$$ 960832 894612 843030 804166 777741 763730 760965 768509 787086 817988 861902 919940 994262
56806I94262R1527J04968J07702R2569N6408N560m4899q1278j00237j06206j03257
$$ 994262 1085789 1190757 1298459 1391028 1447436 1452996 1408097 1326819 1226582 1120376 1017119
56795A017119r3464q0349o8044n7197m5999l4728k5510j8240j0835l003M051J1033
$$ 1017119 923655 843306 775262 718065 672066 637338 611828 593588 582753 579750 583801 594834
56783E94834J9770K9670L8776M7337N5910O0550N4798L6917J1571j5331l9468
$$ 594834 614604 644274 683050 730387 786297 846847 901645 938562 950133 934802 895334
56772H95334n6653o3891o2835n8342n3015m6465l9419l4108l0378k5871k0597
$$ 895334 838681 774790 711955 653613 600598 554133 514714 480606 450228 424357 403760
56761D03760j7188j6086j4664j1861r604q755p636n616m411m695m864m171l855
$$ 403760 386572 370486 355822 343961 334357 325602 317966 312350 307939 303244 298380 294209 290354
56748B90354m293m213l382l048l193k478j259j299k280k020m07M01k7N1Q01M12
$$ 290354 286061 281848 278466 275418 272225 269747 268488 267189 264909 262889 262482 262883 262856 262907 263708 264120
56732B64120j060j407l63j57j346j956j417j364j900j051J030J560n6r06N44K066
$$ 264120 263060 261653 261290 261133 259787 257831 256414 255050 253150 252099 253129 254689 254633 253727 254271 256337
56716B56337J666M15k79q28j488j351n50m60q39M2J773J864J56o23L72O87q77
$$ 256337 258003 258418 258139 257311 255823 254472 253922 253462 252623 252665 254438 256302 256458 255835 256207 256894 256017
56699B56017k164j597n32j63L74J365J413L85Q0P29L14j426j994n61M30m59j431
$$ 256017 253853 252256 251724 251561 251935 253300 254713 255098 255178 255907 256221 254795 252801 252240 252670 252211 250780
56682B50780j150r81j804k096j102n15j244j770j354j477k544k583r44J84k77
$$ 250780 249630 248649 246845 244749 243647 243132 241888 240118 238764 237287 234743 232160 231216 231400 231123
56667B31123m05Q82J614M33r34r17n64q18n51P02J205J42q06o46o90j424j201
$$ 231123 230718 231600 233214 233647 232713 231796 231232 230414 229863 230565 231770 231912 231106 230460 229770 228346 227145
56650B27145K36M71j416l023k869k851m303n272m129k507k124j928q39j38p43
$$ 227145 227381 227852 226436 223413 220544 217693 213390 208118 203989 201482 199358 197430 196591 196453 195710
56635A95710j093j39O14K22L74K124L676L660L482M179M214K681J541K213L101
$$ 195710 194617 194478 195092 195314 195688 197812 201488 205148 208630 212809 217023 219704 221245 223458 226559
56620B26559K797K591L456L724K232O41K92j0r09o43J343K420R98o95o78m05j236
$$ 226559 229356 231947 235403 239127 241359 242000 242292 242282 241373 240730 242073 244493 245491 244796 244118 243713 242477
56603B42477j401M19K018J424M19J019J734P09n56o8R34N17m03l01j07q45j044
$$ 242477 241076 241495 243513 244937 245356 246375 248109 248818 248262 248194 249128 249645 249242 248941 248834 247989 246945
56586B46945L96J482N22n75L63J884J712P40R31J719J781J885K851L199J893Q38
$$ 246945 247341 248823 249345 248770 249133 251017 252729 253469 254400 256119 257900 259785 262636 265835 267728 268566
56570B68566J616K503J783J176K590M363M169L092L312M211M240M167N145N959
$$ 268566 270182 272685 274468 275644 278234 282597 286766 289858 293170 297381 301621 305788 310933 316892
56556C16892N419N080O422P903P851P604Q640R471Q659P951R076J0298R601Q334
$$ 316892 322311 327391 333813 341716 349567 357171 365811 375282 383941 391892 400968 411266 420867 429201
56542D29201Q210P829N797M165M878N816M360J898Q04Nk310m530m526l928n142
$$ 429201 437411 445240 451037 455202 460080 465896 470256 472154 472958 472963 470653 466123 461597 457669 452527
56527D52527o912p069o918q384r681q448o554o959q382p854o222o245p410p429
$$ 452527 445615 438546 431628 423244 413563 405115 398561 391602 383220 375366 369144 362899 355489 348060
56513C48060o771p035p047n185l394m195n994n983n289o256p243n451k658k556
$$ 348060 341289 334254 327207 322022 318628 314433 308439 302456 297167 290911 283668 278217 275559 273003
56499B73003m283m170k206j267j433n57Q50O37l07L89J654P70j201j083N86O86
$$ 273003 268720 264550 262344 261077 259644 259087 259937 260574 260267 260656 262310 263080 261879 260796 261382 262068
56483B62068o00l89J265J635N44K76R12N68l29L07J961K371J779K041K578J572
$$ 262068 261468 261079 262344 263979 264523 264799 265711 266279 265950 266257 268218 270589 272368 274409 276987 278559
56467B78559L1K20J449J762K079M077N890M941L103L770N637N097L021L209N432
$$ 278559 278590 278810 280259 282021 284100 288177 294067 299008 302111 305881 311518 316615 319636 322845 328277
56452C28277O052M628M055M811M815M285N134O383N565L902M538O605O613M776
$$ 328277 334329 338957 343012 347823 352638 356923 362057 368440 374005 377907 382445 389050 395663 400439
56438D00439M194M820M074K514K849M177L346J221J415L448L529J563R74J918
$$ 400439 404633 409453 413527 416041 418890 423067 426413 427634 429049 432497 436026 437589 438563 440481
56424D40481J164j443k742k409l126m791m759l639m582o977p212n450n169o293
$$ 440481 441645 440202 437460 435051 431925 427134 422375 418736 414154 407177 399965 394515 389346 383053
56410C83053n507l185l078n038n175l356l362n287n158k777k406m676n306l238
$$ 383053 377546 374361 371283 366245 361070 357714 354352 349065 343907 341130 338724 334048 328742 325504
56396C25504k557m587n324k861n06m04m80J87p20l420m706l858m015o014o919
$$ 325504 322947 318360 313036 310175 309669 309265 308785 308972 308252 304832 300126 296268 292253 286239 279320
56381B79320o172o870r256r260n456j430N45K159L878L494J609K204N752P932
$$ 279320 273148 266278 257022 247762 242306 240876 241421 243580 247458 250952 252561 254765 260517 268449
56367B68449P003O196P031O730M389L231M418M785K982J800K299J702p68k073
$$ 268449 275452 281648 288679 295409 299798 303029 307447 312232 315214 317014 319313 321015 320247 318174
56353C18174j296j289k541j852J080K330J003J056L697M903K944J552K857L864
$$ 318174 316878 315589 313048 311196 312276 314606 315609 316665 320362 325265 328209 329761 332618 336482
56339C36482K768K195L314L247J170O27K861M244L001K138L028K716L29n41J355
$$ 336482 339250 341445 344759 348006 349176 349803 352664 356908 359909 362047 365075 367791 368120 367579 368934
56324C68934K386J095R61L397M902M143M683P639Q891O832N625P363Q313O535
$$ 368934 371320 372415 373376 376773 381675 385818 390501 398140 407031 413863 419488 426851 435164 441699
56310D41699N796Q021R294P387N975P218P520M911L325M989N832L127N84J099
$$ 441699 447495 455516 464810 472197 478172 485390 492910 497821 501146 506135 511967 515094 515678 516777
56296E16777J531m61j534M05J405j211l592k608j572l489n280m082k757l826m358
$$ 516777 518308 517847 516313 516718 518123 516912 513320 510712 509140 505651 500371 496289 493532 489706 485348
56281D85348k172o29k063k957q20Q44l83p82K142M326K890K111N567R208Q645
$$ 485348 483176 482547 480484 477527 476707 477551 477168 476386 478528 482854 485744 487855 493422 502630 511275
56266E11275O734P588R352R205R301J1579J2909J1434J1309J5157J8483J7826
$$ 511275 518009 525597 534949 544154 553455 565034 577943 589377 600686 615843 634326 652152
56254F52152J7485K1623K6559K7979K8934L3360L8202L9473L9986M3496M7026
$$ 652152 669637 691260 717819 745798 774732 808092 846294 885767 925753 969249 1016275
56243A016275M6543M4527M4625M4352M0258L4735L0766K5712J7270R509N896K524
$$ 1016275 1062818 1107345 1151970 1196322 1236580 1271315 1302081 1327793 1345063 1354572 1360468 1362992
56231A362992m452j1008j2421j1894j4174j6788j5720j3737j4833j6104j3456
$$ 1362992 1358540 1347532 1335111 1323217 1309043 1292255 1276535 1262798 1247965 1231861 1218405
56220A218405r841r679j0607q906p471j0244j4178j4953j5130j8502k1997k1462
$$ 1218405 1208564 1198885 1188278 1179372 1171901 1161657 1147479 1132526 1117396 1098894 1076897 1055435
56208A055435j9928k1751k4178k3008k0918k1809k2790k0156j7333j8284j9192
$$ 1055435 1035507 1013756 989578 966570 945652 923843 901053 880897 863564 845280 826088
56197H26088j5630j1587j2201j3871j1226p558q364j0606q670n203n609p372n329
$$ 826088 810458 798871 786670 772799 761573 754015 745651 735045 726375 721172 715563 708191 702862
56184G02862k189l243n845m586j822k582m263j902J497N68j737J85L563K776N99
$$ 702862 700673 697430 691585 686999 685177 682595 678332 676430 677927 678495 676758 676943 680506 683282 683881
56169F83881K785O595O055L603N061P987O647L619M699P094M650J31K08K784J396
$$ 683881 686666 693261 699316 702919 707980 715967 722614 726233 730932 738026 742676 742807 743015 745799 747195
56154G47195k217k084p4j755m562k439J977K042k72J238M617M084K205N026R643
$$ 747195 744978 742894 742820 741065 736503 734064 736041 738083 737811 739049 743666 747750 749955 754981 764624
56139G64624R506P416J0146J4855J4414J1531J3700J8619J8859J6704J9880K6569
$$ 764624 774130 781546 791692 806547 820961 832492 846192 864811 883670 900374 920254 946823
56127I46823K9336L0024L6020M5442N0943N4737O4810P9685R2032J04004J23621
$$ 946823 976159 1006183 1042203 1087645 1138588 1193325 1258135 1337820 1429852 1533856 1657477
56116A657477J48908J70633J87545K03740K14353K09784J91490J68826J43936
$$ 1657477 1806385 1977018 2164563 2368303 2582656 2792440 2983930 3152756 3296692
56107C296692J15023Q9983P9594Q0043P8257P0977O2528M8967K3236p289k7118
$$ 3296692 3411715 3501698 3581292 3661335 3739592 3810569 3873097 3922064 3945300 3938011 3910893
56096C910893l4406l9229m4117m5093m8604o7069r8604j29602j55322j79657j97747
$$ 3910893 3876487 3837258 3793141 3748048 3699444 3632375 3533771 3404169 3248847 3069190 2871443
56085B871443j99313j87623j75412j63696j44170j19994j03174r3078p8637o0515
$$ 2871443 2672130 2484507 2309095 2145399 2001229 1881235 1778061 1684983 1606346 1545831
56075A545831m9706m5558l7058k4869k0009k1416j7273p997n291q788o651Q52
$$ 1545831 1496125 1450567 1413509 1388640 1368631 1347215 1329942 1321945 1316654 1307866 1301215 1302067
56063A302067J884l033j451O479Q119L314M697J2458J3742Q218Q983J6744J8558
$$ 1302067 1303951 1300918 1299467 1305946 1314065 1317379 1322076 1334534 1348276 1356494 1365477 1382221 1400779
56050A400779J3636J4584K1560K1546J4895J5733K4263K6045K0544K2307L1708
$$ 1400779 1414415 1428999 1450559 1472105 1487000 1502733 1526996 1553041 1573585 1595892 1627600
56039A627600L3485K6720K6681L4191L3480K3708K1607K9111K9850K1872K1605
$$ 1627600 1661085 1687805 1714486 1748677 1782157 1805865 1827472 1856583 1886433 1908305 1929910
56028A929910L0982L3517K7797L1106M4607M9421M2967M3855N4757N6842M7716
$$ 1929910 1960892 1994409 2022206 2053312 2097919 2147340 2190307 2234162 2288919 2345761 2393477
56017B393477M7428N9263O2866N4378N4309O6811P1275O3855O6179Q2522R0264
$$ 2393477 2440905 2500168 2563034 2617412 2671721 2738532 2809807 2873662 2939841 3022363 3112627
56006C112627Q3921Q5797J01392J08283J01388J03964J20770J27086J17923J19876
$$ 3112627 3196548 3282345 3383737 3492020 3593408 3697372 3818142 3945228 4063151 4183027
55996D183027J39582J50179J44403J49527J73072J87040J83831J92653K21558
$$ 4183027 4322609 4472788 4617191 4766718 4939790 5126830 5310661 5503314 5724872
55987E724872K40237K40290K53356K88401L12879L18344L39893L86802M21981
$$ 5724872 5965109 6205399 6458755 6747156 7060035 7378379 7718272 8105074 8527055
55978H527055M35571M67233N28088N76561O01426O48611P33201Q10012Q66803
$$ 8527055 8962626 9429859 9957947 10534508 11135934 11784545 12517746 13327758 14194561
55969A4194561R56110J096056J236672J367146J552407J816429K101613K395592
$$ 14194561 15150671 16246727 17483399 18850545 20402952 22219381 24320994 26716586
55961B6716586K775922L272052L818909M412695N162793O117761P215847Q498937
$$ 26716586 29492508 32764560 36583469 40996164 46158957 52276718 59492565 67991502
55953F7991502J0177032J2369249J5009177J8145943K2075410K7005626L2893046
$$ 67991502 78168534 90537783 105546960 123692903 145768313 172773939 205666985
55946B05666985L9677663M6869088N2125600N0916201L9309122J8000186o952841
$$ 205666985 245344648 292213736 344339336 395255537 434564659 452564845 445612004
55939D45612004k8073338m1168386m6436509m6214591m2734188l7620868l2117967
$$ 445612004 417538666 376370280 329933771 283719180 240984992 203364124 171246157
55932A71246157k6988108k2442491j8482171j5177627j2544243j0419831q643150
$$ 171246157 144258049 121815558 103333387 88155760 75611517 65191686 56548536
55925E6548536p197955o076977n166165m368757l705785l199667k779589k384672
$$ 56548536 49350581 43273604 38107439 33738682 30032897 26833230 24053641 21668969
55917B1668969k048420j802204j595441j383001j198760j074566r71033q51732
$$ 21668969 19620549 17818345 16222904 14839903 13641143 12566577 11595544 10743812
55909A0743812p47288o86107o34591n62354m98354m68679m42849l93117l46653
$$ 10743812 9996524 9310417 8675826 8113472 7615118 7146439 6703590 6310473 5963820
55900E963820l29668l16635k82123k49162k40637k33576k05679j79161j75958
$$ 5963820 5634152 5317517 5035394 4786232 4545595 4312019 4106340 3927179 3751221
55891C751221j74980j54679j34598j35047j36941j20192j02592j03332j05528
$$ 3751221 3576241 3421562 3286964 3151917 3014976 2894784 2792192 2688860 2583332
55882B583332r0971p6083p8248q1022o6899n1546n2393n5069m3193l0641l2780
$$ 2583332 2492361 2416278 2338030 2257008 2190109 2138563 2086170 2031101 1987908 1957267 1924487
55871A924487l5336k2698q455p741p006R142K7932L3978L8339N3387O4017N2675
$$ 1924487 1889151 1866453 1857998 1850257 1843251 1852393 1880325 1914303 1952642 2006029 2070046 2122721
55859B122721K9608J0955r888m2150p1976q4113q8300r8250j05043r6708q3844
$$ 2122721 2152329 2163284 2153396 2111246 2039270 1955157 1866857 1768607 1663564 1566856 1483012
55848A483012q0405p8458o6362n3140n0669n0250m0403k9897k9925l1335k2521
$$ 1483012 1402607 1324149 1257787 1204647 1153978 1103728 1063325 1033428 1003503 972168 949647
55837I49647j2295j2214j3480m180P347Q967Q164J6461K6314K6120K3203K9475
$$ 949647 937352 925138 911658 907478 914825 923792 931956 948417 974731 1000851 1024054 1053529
55825A053529L8291L7008K8789K1124P291j9279m5828n6971n7974o1299o3366
$$ 1053529 1091820 1128828 1157617 1178741 1186032 1166753 1120925 1063954 1005980 944681 881315
55814H81315n5515m4813m2352m2508l4801k5058k4137k6632k1429j3018j1972
$$ 881315 825800 780987 738635 696127 661326 636268 612131 585499 564070 551052 539080
55803E39080j4182r612k223j480l145K074R478R041M491N245P737L336l438l134
$$ 539080 524898 515286 513063 511583 508438 510512 519990 529031 533522 538767 546504 549840 546402 543268
55789E43268J13l497j0530j1413q977j2027j7292j5723j0243r804j1923q236j448
$$ 543268 543381 539884 529354 517941 508964 496937 479645 463922 453679 443875 431952 423716 422268
55776D22268R3j065L089R607R685M794K155j55p940j6536j7465j4089j5300j8987
$$ 422268 422361 421296 424385 433992 443677 448471 450626 450471 442531 425995 408530 394441 379141 360154
55762C60154j7096j1687j0478j1576q071k889l878q639r212p163r241j2850j0829
$$ 360154 343058 331371 320893 309317 301246 298357 294479 285840 276628 269465 260224 247374 236545
55749B36545o050o283q966o030K40J365j373j46L884L215j020j424J148j62m215
$$ 236545 230495 224212 215246 209216 209456 210821 209448 209302 213186 216401 215381 213957 215105 214943 210728
55734B10728m181j164j700m385k653J737J614j882j925L71j521n965n802k205
$$ 210728 206547 205383 203683 199298 196645 198382 199996 198114 196189 196560 195039 189074 183272 181067
55720A81067k399n691n201j598j632m683m068k93O2k603j830K165L243J601K868
$$ 181067 178668 172977 167776 166178 164546 159863 155795 155502 155564 152961 151131 153296 156539 158140 161008
55705A61008O323O328M152N906R989R098L686J071K040P25l017l485q42q30l234
$$ 161008 167331 173659 177811 183717 193706 202804 206490 207561 209601 210326 207309 203824 202982 202152 198918
55690A98918k421J162J808K30K487P804R401P125P362J0525J0642P366O451P950
$$ 198918 196497 197659 199467 199697 202184 209988 219389 226514 233876 244401 255043 262409 268860 276810
55676B76810N755n01m614n420p960j2542j3880j1842j1906j4204j3193q911p500
$$ 276810 282565 282064 277450 272030 264070 251528 237648 225806 213900 199696 186503 177592 170092
55663A70092r621r381n787m310n914n448k138j000k486j354K765M243K234K122
$$ 170092 160471 151090 145303 140993 135079 129631 127493 126493 124007 122653 125418 129661 131895 134017
55649A34017M752M801J442J11J836J313k404l611p17Q05j383l031k357k953n296
$$ 134017 138769 143570 145012 145123 146959 148272 145868 142257 141540 142345 140962 137931 135574 132621 127325
55634A27325m819r46J066l93r42P23O02j765j600J694K709n6j651l54n89l582
$$ 127325 122506 121560 122626 122233 121291 122014 122616 120851 119251 120945 123654 123598 121947 121593 121004 117422
55618A17422m407j316R27P1QK345K986L24j411j31P49k70Q2K456K709j13j486
$$ 117422 113015 111699 112626 112697 112705 115050 118036 118360 116949 116818 117567 117297 117379 119835 122544 122431 120945
55601A20945J92P51j492k591q82r1j693k057k5M03k106l436j876j117k568k525
$$ 120945 121137 121888 120396 117805 116923 116832 115139 113082 113057 113460 111354 107918 106042 104925 102357 99832
55585I9832J53J257p71j803L3R96n93r86J429K880J732J761M604O385N329N232
$$ 99832 99985 101242 100471 98668 98701 99697 99104 98118 99547 102427 104159 105920 110524 116909 122238 127470
55569A27470P980J0003R712J0969J5527J9331K0149K1473K4869K5756K1131J4645
$$ 127470 135450 145453 155165 166134 181661 200992 221141 242614 267483 293239 314370 329015
55557C29015R738M442k819q905j1853j4757j9459k2427k1148j8712j8013j7146
$$ 329015 338753 343195 340376 331471 319618 304861 285402 262975 241827 223115 205102 187956
55545A87956j4506j2562j2709j2014q875o315o220n991m258l940o174p283n331
$$ 187956 173450 160888 148179 136165 127290 120975 114755 108764 104506 100566 94392 87109 81778
55532H1778l689m533m914k963j728l091l960k357j192k120j892J137L072J422
$$ 81778 78089 73556 68642 65679 63951 60860 56900 54543 53351 51231 49339 50476 53548 54970
55518E4970j89J401L432K957K182L508M784M219M624P970J0749R428N874L096
$$ 54970 54781 56182 59614 62571 64753 68261 73045 77264 81888 89858 100607 110035 115909 119005
55504A19005L93l129n220m796m773o684p499n520m083n398o258m140k085k955
$$ 119005 119398 116269 111049 106253 101480 94796 87297 81777 77694 72296 66038 61898 59813 56858
55490E6858m217l167k083l347m498l039j339j896k466p75O50p09k329j420j84
$$ 56858 52641 49474 47391 44044 39546 36507 35168 33272 30806 30031 30681 29972 27643 26223 26039
55475B6039j343k774j678J3n48j813j208m6m04q47K99J199L40J25K247L710J913
$$ 26039 24696 21922 20244 20257 19709 17896 16688 16642 16238 15391 15690 16889 17229 17354 19601 23311 25224
55458B5224m18n0J217M80p75k2J257P45j24O00J207r1j123K42J780J081J22J146
$$ 25224 24806 24756 25973 26453 25678 25656 26913 27658 27534 28134 29341 29250 28127 28369 30149 31230 31352 32498
55440C2498J984K81j489l04J854J722M74P47J377J99j192m78P25Jj164m58O54
$$ 32498 34482 34763 33274 32970 34824 36546 37020 37767 39144 39343 38151 37673 38398 38399 37235 36777 37431
55423C7431L1p93J45R79l16j537l09J092j28j785o10J768K005J016J500K548K020
$$ 37431 37462 36669 36814 37793 37477 35940 35631 36723 36595 34810 34200 35968 37973 38989 40489 43037 45057
55406D5057J438L131N329N212M129M643N313L638J355J381K198P45j692j956r33
$$ 45057 46495 49626 54955 60167 64296 68939 74252 77890 79245 80626 82824 83569 81877 79921 78988
55391G8988j499k868k580j822l251n424m934k450j346j942k073j718k187k458
$$ 78988 77489 74621 72041 70219 66968 61544 56610 54160 52814 50872 48799 47081 44894 42436
55377D2436j064K01q95k532j864k76p60k299k072r46j520k649j392J364K485K105
$$ 42436 41372 41573 40678 38146 36282 36006 35246 32947 30875 29929 28409 25760 24368 25732 28217 30322
55361C0322K435K798J182r53p66N45k27k292k285m09K69m55j61J077R78k67m16
$$ 30322 32757 35555 36737 35784 35018 35563 35336 33044 30759 30350 30619 30164 30003 31080 32058 31791 31375
55344C1375M30L80j94L94J302O29n80j92P19r3j338l70J581J390k86m46O30L93
$$ 31375 31805 32185 31991 32385 33687 34316 33736 33544 34263 34170 32832 32462 34043 35433 35147 34701 35331 35724
55326C5724p03k88Q17k4j821j418O58J186J83L70J466P62j181j098R16J509J45
$$ 35724 35021 34733 35550 35526 33705 32287 32945 34131 34314 34684 36150 36912 35731 34633 35549 37058 37203
55309C7203l22P67J062J84K89J358R34j014j730n94J87R8R20K511K549Q80j58
$$ 37203 36881 37648 38710 38894 39183 40541 41475 40461 38731 38137 38324 38422 39342 41853 44402 45282 45124
55292D5124n8n24j455r16O97Q12o96j229r9P03M85N76R33J29j226j083O2j68j469
$$ 45124 45066 44542 43087 42171 42868 43680 42984 41755 41656 42359 42844 43420 44353 44482 43256 42173 42235 42067 40598
55273D0598j225O14J292P8q67o35n35p76j83P25K77q00l12J170J088l60n70O02
$$ 40598 39373 39987 41279 41357 40490 39855 39320 38544 38361 39086 39363 38563 38251 39421 40509 40149 39579 40181
55255D0181P49l75n31M90M78q40j320n67l97r75o63J42o29k427k420l57J110J088
$$ 40181 40930 40555 40024 40514 40992 40152 38832 38265 37868 36893 36230 36372 35743 33316 30896 30539 31649 32737
55237C2737J149J412L83j153p13J114J067j204k511j575n47n24n0J169J398M95
$$ 32737 33886 35298 35681 34528 33815 34929 35996 34792 32281 30706 30159 29635 29585 30754 32152 32647
55221C2647L17Q86L20j044q12Q90J349K50J31J468J945J213J522K885K539K10
$$ 32647 32964 33850 34170 33126 32314 33204 34553 34803 34934 36402 38347 39560 41082 43967 46506 46716
55205D6716r37K59J199M90k1N49M89n59m88R63J238k91r95J77Q84k9n47K93N19
$$ 46716 45779 46038 47237 47727 47706 48255 48744 48185 47697 48660 49898 49607 48612 48789 49673 49644 49097 49390 49909
55186D9909p44j506q60o21j468j474j30L89n30n87Q88J332k96j420n10L25n21
$$ 49909 49165 47659 46799 46178 44710 43236 43106 43495 42965 42378 43266 44598 44302 42882 42372 42697 42176
55169D2176j394r19l96o31j49J334J501l91j646n79P97O61K71Q23J036J14l30
$$ 42176 40782 39863 39467 38836 38687 40021 41522 41131 39485 38906 39703 40364 40635 41458 42494 42608 42278
55152D2278M72O95m82r47M47J575P87l20j71N9p44j292o12p0n37n76N60J129J13
$$ 42278 42750 43445 42963 42016 42463 44038 44825 44505 44334 44393 43649 42357 41745 41675 41138 40562 41122 42251 42364
55133D2364q89q64j246k641l037j375L19M96N55J679K445J803J192J533J316j18
$$ 42364 41475 40611 39365 36724 33687 32312 32631 33127 33682 35361 37806 39609 40801 42334 43650 43532
55117D3532o77Q24K298K036J511K143K518J459P22J837L088K454R79N85Q64N16
$$ 43532 42855 43679 45977 48013 49524 51667 54185 55644 56366 58203 61291 63745 64724 65309 66173 66689
55101F6689j98o27j139j596q52O53O19j212j995l82J202Q04K7N37R89N0q04k49
$$ 66689 66491 65864 64725 63129 62277 62930 63549 62337 60342 59960 61162 61966 61993 62530 63519 63569 62765 62516
55083F2516J86p89j440j49J438J280L02J33J43n40o49P17J722O78j037j504j316
$$ 62516 62702 61913 60473 60324 61762 63042 63344 63477 63620 63080 62431 63148 64870 65548 64511 63007 61691
55066F1691j556j266L49J588Q78m66o18j55k12j13P17Q51n68j745j086J36L27
$$ 61691 60135 58869 59218 60806 61684 61218 60600 60445 60233 60120 60837 61688 61120 59375 58289 58425 58752
55049E8752K40Q05Q72l34j111j68R21O53L36J295K000Q05r53j340q82o40J79K009
$$ 58752 58992 59797 60669 60335 59224 59056 59977 60630 60966 62261 64261 65066 64113 62773 61891 61251 61430 63439
55031F3439K914J616J2l2L14l03m59J119K495J724M28Q32J828J421N88J113J958
$$ 63439 66353 67969 67981 67949 68263 67960 67501 68620 71115 72839 73267 74099 75927 77348 77936 79049 81007
55014H1007J368M48J066K241K155J684K427L207K094J38n05k57o39r87j29N63
$$ 81007 82375 82823 83889 86130 88285 89969 92396 95603 97697 97835 97330 97073 96434 95447 95318 95881
54998I5881o26k277k147j231j897l579l916k814j910j413p17o31j768k362r09
$$ 95881 95255 92978 90831 89600 87703 84124 80208 77394 75484 74071 73354 72723 70955 68593 67684
54983F7684P46L15r18m97P80O69j90K28J161N48o75j1K068L010K600K483K410
$$ 67684 68430 68745 67827 67330 68110 68779 68589 68817 69978 70526 69851 69840 71908 74918 77518 80001 82411
54966H2411J015o00j73J587K091J342J355J894R54j012j462j80O07L40N73J444
$$ 82411 83426 82826 82653 84240 86331 87673 89028 90922 91876 90864 89402 89222 89829 90169 90742 92186
54950I2186J440P48J225K940M068M367N441P511R079R868J1022J2379J2636J2165
$$ 92186 93626 94374 95599 98539 102607 106974 112415 119926 129005 138873 149895 162274 174910 187075
54936A87075J2680J4098J4618J3773J2526J0559O413M50n235r734j3561j6322
$$ 187075 199755 213853 228471 242244 254770 265329 271742 272192 266957 257223 243662 227340
54924B27340j6922j5852j4651j3410j1398r420q765q567p199n519n465o186n141
$$ 227340 210418 194566 179915 166505 155107 145687 136922 128355 121156 115637 110172 103986 98845
54911I8845k560j122j411j395m26p0o24l92J059K109K259L005M951O791P803Q732
$$ 98845 96285 95163 93752 92357 91931 91861 91237 90845 91904 94013 96272 99277 104228 111019 118822 127554
54895A27554R803J0370J0841J2393J4429J4808J2834R756O263K022k399n706q120
$$ 127554 137357 147727 158568 170961 185390 200198 213032 222788 229051 231073 228674 222968 214848
54882B14848j0906j3681j4649j3575j2014j0666q921p005n955n480m354k820k248
$$ 214848 203942 190261 175612 162037 150023 139357 130436 123431 117476 111996 107642 104822 102574
54869A02574k475k032q11q3p8no1q82j519o81N16m7j823k399j501j003j220n60
$$ 102574 100099 98067 97256 97173 97095 97090 97029 96147 94628 93947 94463 94416 92593 90194 88693 87690 86470 85910
54851H5910J037J651O65m53q89j142j005K06J403O82j458k711k683k928l526k964
$$ 85910 86947 88598 89263 88810 87921 86779 85774 85980 87383 88065 86607 83896 81213 78285 74759 71795
54835G1795j468j014j737j745p49n23j324j311l5P65M83M74R45L85j183j657l92
$$ 71795 70327 69313 67576 65831 65082 64559 63235 61924 61889 62654 63137 63611 64556 64941 63758 62101 61709
54818F1709P25O55N15Q40N69l08k17J005J503O60O2L66K94m32k02J342K294J726
$$ 61709 62434 63089 63604 64444 65013 64705 64488 65493 66996 67656 67718 68084 68378 67946 67744 69086 71380 73106
54800G3106J099J429J784J658K050L114L544L180L564M994N888N883O596Q391
$$ 73106 74205 75634 77418 79076 81126 84240 87784 90964 94528 99522 105410 111293 117889 126280
54786A26280R519R556J0486J3081J5275J5649J5507J5937J5700J3719J0916P968
$$ 126280 135799 145355 155841 168922 184197 199846 215353 231290 246990 260709 271625 279593
54774B79593L906j401n933q376r886j1416j1798j0192q046o837o001m690l453
$$ 279593 283499 282098 276165 267789 257903 246487 234689 224497 216451 209614 203613 198923 195470
54761A95470k586r38K021M900O526P583Q923J0227J1393J3092J4849J4865J2809
$$ 195470 192884 191946 193967 198867 205393 212976 221899 232126 243519 256611 271460 286325 299134
54748B99134J0530Q953O780L410M99q11j634k787l006j422O30J883K945M222M353
$$ 299134 309664 318617 325397 328807 329306 328495 326861 324074 321068 319646 320276 322159 325104 329326 333679
54733C33679K443l32k949o145j0237j3536j4790j5019j5252j4640j2601j0707
$$ 333679 336122 335790 332841 326696 316459 302923 288133 273114 257862 243222 230621 219914
54721B19914j0378j0578r712q086o782n810m983m903n513n436m221l368l786m193
$$ 219914 209536 198958 189246 181160 174378 168568 163585 158682 153169 147733 143512 140144 136358 132165
54707A32165l544k880l125l236k319j526j906k342j586n14m35q21o32k87m39m36
$$ 132165 128621 125741 122616 119380 117061 115535 113629 111287 109701 109187 108752 107931 107299 107012 106573 106137
54691A06137K41O79L17L38J488K286J350j81m73K32O60Q33J425K077K201K304
$$ 106137 106378 107057 107374 107712 109200 111486 112836 112655 112182 112414 113074 113907 115332 117409 119610 121914
54675A21914K902L332L134L222M137M719M099L518M346N711N951N096M224L523
$$ 121914 124816 128148 131282 134504 138641 143360 147459 150977 155323 161034 166985 172081 176305 179828
54661A79828K695K248K669L307L438L514M167N062N771O576P483P949Q387J0291
$$ 179828 182523 184771 187440 190747 194185 197699 201866 206928 212699 219275 226758 234707 243094 253385
54647B53385J3813J7068J8942K0710K3556K6533K8412K9483K9936K8316K3407
$$ 253385 267198 284266 303208 323918 347474 374007 402419 431902 461838 490154 513561
54636E13561J5981P216k738j3067k1193k5375k6827k7483k7315k5581k2914k0338
$$ 513561 529542 536758 534020 520953 499760 474385 447558 420075 392760 367179 344265 323927
54624C23927j7765j5102j3322j2648j1493q850o072m593l747k582j833k153k235
$$ 323927 306162 291060 277738 265090 253597 244747 238675 234082 230335 227753 225920 223767 221532
54611B21532r44M61L20q09j548k061k959l557l319l425m781o033n764m979n270
$$ 221532 220588 221049 221369 220560 219012 216951 213992 210435 207116 203691 198910 192877 187113 182134 176864
54596A76864o040n867n064m615m116k974k240k918l877l672k972k987l076k272
$$ 176864 170824 164957 159893 155278 151162 148188 145948 143030 139153 135481 132509 129522 126446 124174
54582A24174j474j680j663r5J574J204m55j164r25j261j956j510k13K82r4J5O55
$$ 124174 122700 121020 119357 119262 120836 122040 121585 120421 119496 118235 116279 114769 114556 114838 114744 114759 115414
54565A15414O30q8l93j67j89k78L64J420J977K199K679K920K234J320J062R13
$$ 115414 116044 115956 115563 115396 115207 114929 115293 116713 118690 120889 123568 126488 128722 130042 131104 132017
54549A32017K85K66J799L501L658L058L437M382M474M200M949O223O759P345R461
$$ 132017 132302 132568 134367 137868 141526 144584 148021 152403 156877 161077 166026 172249 179008 186353 195814
54534A95814J2025J2753J2101J2586J4529J5638J4699J2544R406M508j414o030
$$ 195814 207839 220592 232693 245279 259808 275446 290145 302689 312095 316603 315189 309159
54522C09159q455r982j1477j2365j2419j2305j2000j0725q783p493p170o910o309
$$ 309159 300704 290722 279245 266880 254461 242156 230156 219431 210648 203155 195985 189075 182766
54509A82766n634m591k839j379j423k236k143j167n56l32L60R49J56j307j419
$$ 182766 177132 172541 169702 168323 166900 164664 162521 161354 160798 160466 160826 161775 161931 160624 159205
54494A59205j80M00l88j214j359j503j573m80J522K591K027J175J066J199J089
$$ 159205 159025 159425 159037 157823 156464 154961 153388 152908 154430 157021 159048 160223 161289 162488 163577
54479A63577J088J132N67l65n66P4N65O87J180J899J723N75k41j18J71J00J48
$$ 163577 164665 165797 166364 165999 165433 165507 166072 166759 167939 169838 171561 172136 171895 171777 171948 172048 172196
54462A72196N39P30M57j7o39j375j565q50k62q18j640j287l58o17j985k682k229
$$ 172196 172735 173465 173922 173905 173266 171891 170326 169476 169214 168396 166756 165469 165111 164494 162509 159827 157598
54445A57598j922k287k307j541r29j055j366j492j741k064k024j827j974k068
$$ 157598 155676 153389 151082 149541 148612 147557 146191 144699 142958 140894 138870 137043 135069 133001
54431A33001j414n22l97p37n28Qr1o08n81k08l41n40K28J418J645J136J252J936
$$ 133001 131587 131065 130668 129931 129403 129411 129320 128712 128131 127923 127582 127042 127270 128688 130333 131469 132721 134657
54413A34657J976J505J756K627K872K593L083M330N085N257N823O528O201N239
$$ 134657 136633 138138 139894 142521 145393 147986 151069 155399 160484 165741 171564 178092 184293 189532
54399A89532N196N950N922M999M516M410L300J425N18N41l78k392l438k888k569
$$ 189532 194728 200678 206600 211599 216115 220525 223825 225250 225768 226309 225931 223539 220101 217213 214644
54384B14644l355l807l175k822l490l900l324k976l606m077l614l157l315l151
$$ 214644 211289 207482 204307 201485 197995 194095 190771 187795 184189 180112 176498 173341 170026 166875
54370A66875k224j610j852j892j180p39j067j102l40J05l39n27K97J116J041O81
$$ 166875 164651 163041 161189 159297 158117 157378 156311 155209 154869 154974 154635 154108 154405 155521 156562 157243
54354A57243O59N74L81R29K189K888K725K983M109M768M211L455L196K663J588
$$ 157243 157902 158476 158857 159786 161975 164863 167588 170571 174680 179448 183659 187114 190310 192973 194561
54339A94561J126J697J929R91j61q78j999l779m815m445m114m841n388m477l058
$$ 194561 195687 197384 199313 200304 200143 199265 197266 193487 188672 184227 180113 175272 169884 165407 162349
54324A62349k664l152l515l553l411k857k181k294l037l005j972j564k565l557
$$ 162349 159685 156533 153018 149465 146054 143197 141016 138722 135685 132680 130708 129144 126579 123022
54310A23022l441l211l796m166l211j846j526k124k684k946k889k194j271j286
$$ 123022 119581 116370 112574 108408 105197 103351 101825 99701 97017 94071 91182 88988 87717 86431
54296H6431k190k392j366o23j004j161j18P61Q1j218j630j495j816k185j675o24
$$ 86431 84241 81849 80483 79860 78856 77695 77577 78338 78419 77201 75571 74076 72260 70075 68400 67776
54280F7776J07M95O72K14o62o40O84J893J971J783K067J904O69l84k15J32m36
$$ 67776 67883 68378 69050 69264 68602 67962 68646 70539 72510 74293 76360 78264 78933 78549 78334 78466 78030
54263G8030q99J1J373J585R99R56J369J156K20p44j500j890j268K74J318J067
$$ 78030 77131 77142 78515 80100 81099 82055 83424 84580 84800 84056 82556 80666 79398 79672 80990 82057
54247H2057N91Q82J193P37L10N65M03r62j936p51J629K868K396J234j01j454j884
$$ 82057 82648 83530 84723 85460 85770 86335 86738 85776 83840 83089 84718 87586 89982 91216 91115 89661 87777
54230H7777p88P12J284J294J510J276n9j270j059m96j261k527k225o72j51j270
$$ 87777 86989 87701 88985 90279 91789 93065 93006 91736 90677 90181 88920 86393 84168 83496 83345 82075
54214H2075k300k088j372r99q87r10j167j237o30R5rp73j303j501j802j886j180
$$ 82075 79775 77687 76315 75316 74429 73519 72352 71115 70485 70580 70571 69798 68495 66994 65192 63306 62126
54197F2126j77J87J11L77P40L24o49j093p94m95m82l28R5M94P34O56j35j363j731
$$ 62126 61949 62136 62247 62624 63364 63688 63039 61946 61152 60657 60175 59847 59942 60436 61170 61826 61691 60328 58597
54178E8597o20P12Q17P0l57n16j084j574j001K31Q34O64O38R88J130R58Q07M54
$$ 58597 57977 58689 59506 59576 59219 58703 57619 56045 55044 55275 56109 56773 57411 58399 59529 60487 61294 61748
54160F1748m36j207r79k23j54p97j048m19N05J183J532J394P04m9l69m24m49j44
$$ 61748 61312 60105 59126 58903 58749 57952 56904 56485 56990 58173 59705 61099 61803 61754 61385 60961 60512 60368
54142F0368N25P21K8n91k06N27N67K42M37Q27N29j40j53N15J041J232J418J396
$$ 60368 60893 61614 61642 61051 60845 61372 61939 62181 62618 63445 63974 63834 63681 64196 65237 66469 67887 69283
54124F9283Q25J75R6K56M1k46r1P6k95o30k32K70om73qJ010J220M04m69q51q27
$$ 69283 70108 70283 70379 70635 70676 70430 70339 70415 70120 69490 69258 69528 69522 69049 69041 70051 71271 71675 71206 70355 69528
54103F9528j71J185K197J772N14l0M25Q03M89j00m74m22K60J306J738J109L92
$$ 69528 69357 70542 72739 74511 75025 74995 75420 76223 76712 76612 76138 75716 75976 77282 79020 80129 80521
54086H0521N73J093Q89J60j93j50k30l50l35p27j817k639k271j236l88M56J451
$$ 80521 81094 82187 83076 83236 83043 82893 82663 82313 81978 81251 79434 76795 74524 73288 72900 73356 74807
54069G4807J623N25l75J68J015O35j04M24J503J265J09mR61J273P14P79J567J409
$$ 74807 76430 76955 76580 76748 77763 78398 78294 78718 80221 81486 81595 81591 82552 83825 84539 85318 86885 88294
54051H8294j0q21P1J464K005J865J637J291Q92Q75J121J097R79J388K047K154
$$ 88294 88284 87463 87534 88998 91003 92868 94505 95796 96688 97563 98684 99781 100760 102148 104195 106349
54035A06349J949K224K579J959P69N58J595K590K938L346M149M719M827M940N004
$$ 106349 108298 110522 113101 115060 115829 116387 117982 120572 123510 126856 131005 135724 140551 145491 150495
54020A50495M511L837L911M618N002M916M866M532L341K191K481L584L450J803
$$ 150495 155006 158843 162754 167372 172374 177290 182156 186688 190029 192220 194701 198285 201735 203538
54006B03538L91J6m04j396j906j459j203j951k963l476l786m142m177m000m347
$$ 203538 203929 203945 203541 202145 200239 198780 197577 195626 192663 189187 185401 181259 177082 173082 168735
53991A68735n055m945l767k706k450k307j772j410j619j900j982k258k692k556
$$ 168735 163680 158735 154968 152262 149812 147505 145733 144323 142704 140804 138822 136564 133872 131316
53977A31316j780j267j428j653j479j145p83l92n57j802l207l223j865n54J18
$$ 131316 129536 128269 126841 125188 123709 122564 121781 121389 120832 119030 115823 112600 110735 110181 110299
53962A10299O51Q84J00j017q79K83M52p93j378l2J740K210J817J771J982J874
$$ 110299 110950 111834 111934 110917 110038 110321 110773 109980 108602 108570 110310 112520 114337 116108 118090 119964
53946A19964J710J790J546P73N53J801L753M974N050M503L876L643M143M919N012
$$ 119964 121674 123464 125010 125783 126336 128137 131890 136864 141914 146417 150293 153936 158079 162998 168010
53931A68010M412M329N404O691P025O457N768N291M765L834K381Q27j3J0j46j258
$$ 168010 172422 176751 182155 188846 195871 202328 208096 213387 218152 221986 224367 225194 225181 225191 225045 223787
53915B23787k424k298j223n63l77M85K146L504M189M888N636N776N640O310P527
$$ 223787 221363 219065 217842 217279 216902 217387 219533 223037 227226 232114 237750 243526 249166 255476 263003
53900B63003P838P062O541O631O088M497L107K635K216J285N17K09l95j428j957
$$ 263003 270841 277903 284444 291075 297163 301660 304767 307402 309618 310903 311420 311629 311234 309806 307849
53885C07849j840k147l047l345k843l021m513n913o134n906n945n728n160n383
$$ 307849 306009 303862 300815 297470 294627 291606 287093 281180 275046 269140 263195 257467 252307 246924
53871B46924o635p326o509n453n338n356m559l705l695l785l070k287k469l119
$$ 246924 240289 232963 226454 221001 215663 210307 205748 202043 198348 194563 191493 189206 186737 183618
53857A83618l219k955k962l003k643k229k098j969j934k698l907l958k488j311
$$ 183618 180399 177444 174482 171479 168836 166607 164509 162540 160606 157908 154001 150043 147555 146244
53843A46244j689k458k226j591j541j456n29L51P4o44n45L6O6k64k27r9l10k15
$$ 146244 144555 142097 139871 138280 136739 135283 134754 135105 135179 134535 133990 134026 134092 133828 133601 133502 133192 132977
53825A32977O13J052J57r09n93N03P57K63L24R11Q28j3n15m03m19o69m31L30Q14
$$ 132977 133590 134642 134799 133890 133297 133800 134557 134820 135144 136055 136883 136870 136355 135952 135533 134864 134433 134763 135577
53806A35577P59O79P40N78K36K71Q36J538K108K576K952L305L817M333M354L881
$$ 135577 136336 137015 137755 138333 138569 138840 139676 141214 143322 145898 148850 152155 155972 160305 164659 168540
53790A68540L589L813M143M456N192O152O237N129L932L375K749J600R29J433
$$ 168540 172129 175942 180085 184541 189733 195885 202122 207251 211183 214558 217307 218907 219836 221269
53776B21269J957J257N3k25K55K87k81o97q69j312j960k344k547k803k729j980
$$ 221269 223226 224483 224536 224311 224566 224853 224572 223875 223006 221694 219734 217390 214843 212040 209311 207331
53760B07331j195j250k101l128l930m097l202j846j530k548l238k428j243j221
$$ 207331 206136 204886 202785 199657 195727 191630 188428 186582 185052 182504 179266 176838 175595 174374
53746A74374j929k073j678j510j363o96j81p36j767k041j702j779k271k397k212
$$ 174374 172445 170372 168694 167184 165821 165125 164944 164208 162441 160400 158698 156919 154648 152251 150039
53731A50039k299k317j515l20J56k2K21J098J646J246K49q08j656k045j915j571
$$ 150039 147740 145423 143908 143588 143744 143722 143943 145041 146687 147933 148182 147374 145718 143673 141758 140187
53715A40187j106k05R03J210L80m97n67n02j083j643j224k35M51J036J982K644
$$ 140187 139081 138876 139779 140989 141369 140872 140305 139803 138720 137077 135853 135618 136069 137105 139087 141731
53699A41731K245J406J186J396J367J464K307L257L321K850K719K674K049J378
$$ 141731 143976 145382 146568 147964 149331 150795 153102 156359 159680 162530 165249 167923 169972 171350
53685A71350J555K123K084J770K109K795K906K729L089L559L189K478K637L373
$$ 171350 172905 175028 177112 178882 180991 183786 186692 189421 192510 196069 199258 201736 204373 207746
53671B07746L379K645K301K438K082J180O43N76K46k66j88L03K79j92k21J29n6
$$ 207746 211125 213770 216071 218509 220591 221771 222414 222990 223236 222970 222782 223085 223364 223172 222951 223080 223024
53654B23024p71j143j107j266j320m24R20J271N17n3j9k70j053j488j310j299
$$ 223024 222253 221110 220003 218737 217417 216993 217913 219184 219701 219648 219629 219359 218306 216818 215508 214209
53638B14209j654j601j021q25j255j400q95n88r65j277r04l26j59k08m7K97O21
$$ 214209 212555 210954 209933 209108 207853 206453 205558 204970 204005 202728 201824 201498 201339 201131 201084 201381 202002
53621B02002Q81J028J023J012R59N44m4J82J569K952L277L219L822M468L955K867
$$ 202002 202883 203911 204934 205946 206905 207449 207405 207587 209156 212108 215385 218604 222426 226894 230849 233716
53605B33716K863M057N036N244N342N423M821L775L401L829M042L636L204L036
$$ 233716 236579 240636 245672 250916 256258 261681 266502 270277 273678 277507 281549 285185 288389 291425
53591B91425K988L442M682N633N140M171M577N897N889M261L261M038N017M766
$$ 291425 294413 297855 302537 308170 313310 317481 322058 327955 333844 338105 341366 345404 350421 355187
53577C55187M099M128M323L834L052K550J905P54k08l70k52m87q19r17j120j589
$$ 355187 359286 363414 367737 371571 374623 377173 379078 379832 379624 379254 379002 378515 377696 376779 375659 374070
53561C74070j730j227p34q99j469j895j982j694j117q30j420k407k708k157j522
$$ 374070 372340 371113 370379 369480 368011 366116 364134 362440 361323 360493 359073 356666 353958 351801 350279
53546C50279j037k59O31Q49M64L76O70N30O3M71J958L081K824J950J599J883K442
$$ 350279 349242 348983 349614 350463 350927 351303 351973 352503 352566 353037 354995 358076 360900 362850 364449 366332 368774
53529C68774L162L797L974M027M682N663N865N249N151O344Q127R723J1131J2254
$$ 368774 371936 375733 379707 383734 388416 394079 399944 405193 410344 416688 424815 434538 445669 457923
53515D57923J2635J2601J3240J4738J6077J6798J7638J8941K0015K0653K1712
$$ 457923 470558 483159 496399 511137 527214 544012 561650 580591 600606 621259 642971
53504F42971K3479K4972K5646K6423K8147L0306L2135L3803L5684L7477L8779
$$ 642971 666450 691422 717068 743491 771638 801944 834079 867882 903566 941043 979822
53493I79822L9660M0150M0085L9797L9828L9826L9013L7928L8184M0147M2471
$$ 979822 1019482 1059632 1099717 1139514 1179342 1219168 1258181 1296109 1334293 1374440 1416911
53482A416911M4330M6393M9090N1664N3638N5530N7233N7345N5059N1331M7293
$$ 1416911 1461241 1507634 1556724 1608388 1662026 1717556 1774789 1832134 1887193 1938524 1985817
53471A985817M2991L8465L4530L1489K8496K5146K2321K0637J9500J8654J9103
$$ 1985817 2028808 2067273 2101803 2133292 2161788 2186934 2209255 2229892 2249392 2268046 2287149
53460B287149K1449K4600K7198K8902K9400K7683K3525J8395J3707R365M958Q83
$$ 2287149 2308598 2333198 2360396 2389298 2418698 2446381 2469906 2488301 2502008 2511373 2516331 2517214
53448B517214k855p448j3507j9742k4746k8932l3308l7496m0421m2048m3092m3885
$$ 2517214 2514359 2506911 2493404 2473662 2448916 2419984 2386676 2349180 2308759 2266711 2223619 2179734
53436B179734m4726m6379m8955n1139n1688n1016n0287m9805m9340m9059m9139
$$ 2179734 2135008 2088629 2039674 1988535 1936847 1885831 1835544 1785739 1736399 1687340 1638201
53425A638201m9186m8951m8685m8070m6006m2257l8079l4249k9933k4569j9370
$$ 1638201 1589015 1540064 1491379 1443309 1397303 1355046 1316967 1282718 1252785 1228216 1208846
53414A208846j5526j2251q152l341J325N989J1129J6130K0185K3775K7711L1510
$$ 1208846 1193320 1181069 1172917 1169576 1170901 1176890 1188019 1204149 1224334 1248109 1275820 1307330
53402A307330L4234L6209L8342M0438M1718M2442M3580M5369M7533N0224N3462
$$ 1307330 1341564 1377773 1416115 1456553 1498271 1540713 1584293 1629662 1677195 1727419 1780881
53391A780881N6326N8160N9966O3202O7736P2386P6844Q1710Q7054R2343R7282
$$ 1780881 1837207 1895367 1955333 2018535 2086271 2158657 2235501 2317211 2404265 2496608 2593890
53380B593890J01563J04372J05522J06362J08221J10551J12014J12685J13562
$$ 2593890 2695453 2799825 2905347 3011709 3119930 3230481 3342495 3455180 3568742
53371C568742J14445J14092J12096J08981J04715R8758R1563Q4464P8178P2707
$$ 3568742 3683187 3797279 3909375 4018356 4123071 4221829 4313392 4397856 4476034 4548741
53361D548741O8588O6675O6679O7154O7061O6212O4324O0912N6090N0317M3311
$$ 4548741 4617329 4684004 4750683 4817837 4884898 4951110 5015434 5076346 5132436 5182753 5226064
53350E226064L4251K2707Q210j0540l4256o0651q5109j04242j17786j26933j32446
$$ 5226064 5260315 5283022 5291232 5280692 5246436 5185785 5100676 4996434 4878648 4751715 4619269
53339D619269j34962j35773j36147j36415j36348j35879j34945j33249j30813
$$ 4619269 4484307 4348534 4212387 4075972 3939624 3803745 3668800 3535551 3404738
53330C404738j28508j27348j27361j27428j26418j24294j21882j19552j16597
$$ 3404738 3276230 3148882 3021521 2894093 2767675 2643381 2521499 2401947 2285350
53321B285350j12235j06786j01129r5276q8570q1199p4208o7800o0905n3038m5203
$$ 2285350 2173115 2066329 1965200 1869924 1781354 1700155 1625947 1558147 1497242 1444204 1399001
53310A399001l8279l1773k5107j8965j4161j0257o501l186p89J300L800O040O946
$$ 1399001 1360722 1328949 1303842 1284877 1270716 1260459 1253958 1250772 1249983 1251283 1255083 1261123 1268069
53297A268069P005P718R434J1110J2035J2495J2955J3810J5771J9261K3435K6820
$$ 1268069 1275074 1282792 1292226 1303336 1315371 1327866 1340821 1354631 1370402 1389663 1413098 1439918
53285A439918K9022L0942L3475L6741M0453M4126M7033M8785M9789N0604N1156
$$ 1439918 1468940 1499882 1533357 1570098 1610551 1654677 1701710 1750495 1800284 1850888 1902044
53274A902044N1182N1000N1081N1331N1459N1513N1323N0113M7675M5247M4190
$$ 1902044 1953226 2004226 2055307 2106638 2158097 2209610 2260933 2311046 2358721 2403968 2448158
53263B448158M4309M4530M4682M5359M6397M6635M5111M1545L6003K9038K1813
$$ 2448158 2492467 2536997 2581679 2627038 2673435 2720070 2765181 2806726 2842729 2871767 2893580
53252B893580J5093Q333N45q331j7770k7746l8387m8954n8231o5704p1510p5698
$$ 2893580 2908673 2917006 2917551 2909220 2891450 2863704 2825317 2776363 2718132 2652428 2580918 2505220
53240B505220p8516q0855q3249q4746q3935q0729p6227p1250o6194o1822n8954
$$ 2505220 2426704 2345849 2262600 2177854 2093919 2013190 1936963 1865713 1799519 1737697 1678743
53229A678743n7506n6872n7038n8262o0063o1675o3235o5300o7422o8328o7447
$$ 1678743 1621237 1564365 1507327 1449065 1389002 1327327 1264092 1198792 1131370 1063042 995595
53218I95595o5214o2008n7795n2716m7125m1254l5528l0782k7315k4231k0681
$$ 995595 930381 868373 810578 757862 710737 669483 633955 603173 575858 551627 530946
53207E30946j7255j4994j3680j2331j0928j0213j0099r763r137q915r100q853
$$ 530946 513691 498697 485017 472686 461758 451545 441446 431683 422546 413631 404531 395678
53195C95678p895o915o517o722p483q642r463r194q133p193o596n856m991m670
$$ 395678 387783 380868 374351 367629 360146 351504 342041 332847 324714 317521 310925 305069 300078 295408
53181B95408n118n743n932n597m963m358m028l836l479l264l872m976n240m274
$$ 295408 290290 284547 278615 273018 268055 263697 259669 255833 252354 249090 245218 240242 235002 230728
53167B30728l380l420l459k676k094k694l284k314o74l81j289j560r40r38j926
$$ 230728 227348 223928 220469 217793 215699 213005 209721 207407 206733 206352 205063 203503 202563 201625 199699
53152A99699k464j833j048r49j167j393j882k300j784n32J57j52n72o17q24j336
$$ 199699 197235 195402 194354 193405 192238 190845 188963 186663 184879 184347 184504 184352 183780 183163 182339 181003
53136A81003j470j117j115j734k146j866j398j083n37K95P36N01J79K56O24J125
$$ 181003 179533 178416 177301 175567 173421 171555 170157 169074 168537 168832 169568 170069 170248 170504 171128 172253
53120A72253J639J591N19q43j257p13k96m38n56l36o9L20J206K266K787K910L208
$$ 172253 173892 175483 176002 175159 173902 173189 172893 172455 171899 171563 171494 171814 173020 175286 178073 180983 184191
53103A84191L280K301P50p2j14l86q35l39J075J995J853J602J804J907J779K065
$$ 184191 187471 189772 190522 190450 190336 189950 189115 188776 189851 191846 193699 195301 197105 199012 200791 202856
53087B02856K616K357J191K20l43j496l188l834k904k009k401l194l196k825k990
$$ 202856 205472 207829 209020 209240 208897 207401 204213 200379 197475 195466 193065 189871 186675 183850 180860
53072A80860l504l801l988m112l576k301j351j501k145k420k329k176j885j554
$$ 180860 177356 173555 169567 165455 161879 159578 158227 156726 154581 152161 149832 147656 145771 144217
53058A44217j554j629j040LL88m9j93L40M76l78j290j457j349j410j185o27o78
$$ 144217 142663 141034 139994 139997 140385 140336 140143 140483 140959 140581 139291 137834 136485 135075 133890 133263 132585
53041A32585j561k068j515r87j505k401k666k529k578k538k086j673j528j016
$$ 132585 131024 128956 127441 126454 124949 122548 119882 117353 114775 112237 110151 108478 106950 105934
53027A05934m7K01q60j999j953j269j117j466j681j843k181k184j487p22m61k86
$$ 105934 105887 106088 105228 103229 101276 100007 98890 97424 95743 93900 91719 89535 88048 87326 86865 86579
53011H6579J00j3r61j701j363p18q12j265j251j056j306j634j460j221j459j612
$$ 86579 86679 86666 85705 84004 82641 81923 81111 79846 78595 77539 76233 74599 73139 71918 70459 68847
52995F8847j002j35K96P23J686K456K179J447J255J269O54j66k47J30P4j00N51
$$ 68847 67845 67710 68006 68729 70415 72871 75050 76497 77752 79021 79675 79509 79262 79392 79466 79366 79917
52978G9917J705K060J292K43n67j156j168j94J067J401P78K75M22P75R44R56P16
$$ 79917 81622 83682 84974 85217 84650 83494 82326 82132 83199 84600 85378 85653 86075 86850 87794 88750 89466
52961H9466K14O1P21J510J418P22N96J312K011K201K273K536K775K939L277L688
$$ 89466 89680 89741 90462 91972 93390 94112 94708 96020 98031 100232 102505 105041 107816 110755 114032 117720
52945A17720L772L624L809M423M856M627L877K987K211J679J338Q79M3j110k410
$$ 117720 121492 125116 128925 133348 138204 142831 146708 149695 151906 153585 154923 155802 155845 154735 152325
52930A52325l763m856n128m363l008j685q14p76j757l170m005m005l792l694l393
$$ 152325 148562 143706 138578 134215 131207 129522 128708 127932 126175 123005 119000 114995 111203 107509 104116
52915A04116k956l004l405l036j566k52k31j039j680j971k018j495m92k4o26j372
$$ 104116 101160 98156 94751 91715 90149 89897 89666 88627 86947 84976 82958 81463 80971 80947 80321 78949
52899G8949j351j036j167j364j093r19j450j946j403l06R5l79q76q80l46P19J778
$$ 78949 77598 76562 75395 74031 72938 72019 70569 68623 67220 66914 67009 66630 65754 64874 64528 65247 67025
52882F7025J717L54q76r27o61j103j458n61P99J027L84L86J096J179L93p1K59
$$ 67025 68742 69096 68220 67293 66632 65529 64071 63510 64309 65336 65720 66106 67202 68381 68774 68703 68962
52865F8962N09J31m03p39r91q73M7J219J561J100Q64J136J203P87M36L69K10k5
$$ 68962 69471 69602 69199 68460 67469 66596 66643 67862 69423 70523 71387 72523 73726 74513 74949 75318 75528 75503
52847G5503J35O56R78J013J073J017N52J56N20J234J336R52J091J922K582K678
$$ 75503 75638 76294 77272 78285 79358 80375 80927 81083 81603 82837 84173 85125 86216 88138 90720 93398
52831I3398K695K914L206L785M906N823N392L738K100J102L80j34J4O69J095J166
$$ 93398 96093 99007 102213 105998 110904 116727 122119 125857 127957 129059 129439 129305 129319 129988 131083 132249
52815A32249J305J207J37j459k168j666j212j675k476k880l008l118l014k711
$$ 132249 133554 134761 134898 133439 131271 129605 128393 126718 124242 121362 118354 115236 112222 109511
52801A09511k610k674k361j738j569k046k438k355k266k464k570k398k322k353
$$ 109511 106901 104227 101866 100128 98559 96513 94075 91720 89454 86990 84420 82022 79700 77347
52787G7347j936j072n92q56j088n71L11P49N74J80l5J71P39J144R08L26J28M36
$$ 77347 75411 74339 73747 72891 71803 71232 71543 72292 72866 73046 73011 73182 73921 75065 75973 76299 76427 76863
52769G6863P09O48M05K7m94p74n48m25j121k082k049r39P3L93N71Q68O57k75j067
$$ 76863 77572 78220 78625 78652 78158 77384 76836 76411 75290 73208 71159 70220 70293 70686 71257 72125 72782 72507 71440
52750G1440j005m96k67m42q24j210j159k23J117J592O77p15j412j162m50K12N14
$$ 71440 70435 69939 69672 69230 68406 67196 66037 65814 66931 68523 69200 68485 67073 65911 65461 65673 66187
52733F6187M70M59O86P17J91k87O5Q42R71M77L52O70L34r37j866j494n45j42k40
$$ 66187 66657 67116 67802 68519 68710 68423 68488 69330 70301 70778 71130 71800 72134 71197 69331 67837 67292 67150 66910
52714F6910j32K95O87R78J284J492J455J303J183J030P93N57L43K08L51P15O74
$$ 66910 66778 67073 67760 68738 70022 71514 72969 74272 75455 76485 77278 77835 78178 78386 78737 79452 80126
52697H0126j86j245j635j491j451j254j48J402J912R33l02o40k00M98J355K201
$$ 80126 79940 78695 77060 75569 74118 72864 72716 74118 76030 76963 76661 76021 75821 76319 77674 79875
52681G9875K594K556K608K763K516K099K507L834M788M463L489K887K734K660
$$ 79875 82469 85025 87633 90396 92912 95011 97518 101352 106140 110603 114092 116979 119713 122373
52667A22373K632K509J734K01j293k086k466k915l325l491l672l972l894l115
$$ 122373 125005 127514 129248 129449 128156 126070 123604 120689 117364 113873 110201 106229 102335 99220
52653I9220k110j498j278j200j300j605j881k067k448l017l181k537j381k60N16
$$ 99220 97110 95612 94334 93134 91834 90229 88348 86281 83833 80816 77635 75098 73717 73457 73973
52638G3973P15J92o98j278j364j342j308q75l6N71N24J70L2K02N38Q33P52J43
$$ 73973 74688 74880 74182 72904 71540 70198 68890 68015 67979 68550 69074 69244 69276 69478 70016 70849 71601 71744
52620G1744n11o04k67j00k20k95l20m70m21K04Q91Q75M99O73J168Q87j36n73J07
$$ 71744 71233 70629 70362 70262 70042 69747 69427 68957 68536 68740 69631 70506 71005 71678 72846 73733 73597 73024 73131
52601G3131Q09N63k48q17r47o18K31J159J393R43N66M68K12p5K46R30R34J61l36
$$ 73131 73940 74503 74255 73438 72491 71873 72104 73263 74656 75599 76165 76633 76845 76770 77016 77946 78880 79041 78705
52582G8705j77j29m28k93M02O81K46M8M13L25o16j255q40k02l7K99J121J317K64
$$ 78705 78528 78399 77971 77678 78080 78761 79007 79055 79468 79793 79177 77922 77082 76880 76843 77142 78263 79580 79844
52563G9844o83j92R68J307Q69O17O00L62K42P17J233J038N08M36O90P33O57O47
$$ 79844 79161 78969 79937 81244 82113 82730 83330 83692 83934 84651 85884 86922 87430 87866 88556 89289 89946 90593
52545I0593K88m60n82N10J722J818J206R45R08M14j38J00Q00R56N23K19J53j0
$$ 90593 90881 90421 89839 90349 92071 93889 95095 96040 96948 97362 97224 97324 98124 99080 99603 99822 99975 99965
52527I9965l3N09J194J351J221J369J448Q62J20K01R19J156N33k59o36n99m02
$$ 99965 99932 100441 101635 102986 104207 105576 107024 107886 108006 108207 109126 110282 110815 110556 109920 109321 108919
52510A08919m05q86j319o44R72J700M61j309j704j032q37j198r85k26q4o06n98
$$ 108919 108514 107628 106309 105665 106637 108337 108798 107489 105785 104753 103916 102718 101733 101507 101423 100817 100219
52493A00219J75N27j5l87J96R67R57L98J22K94L86k7q43j460j268l87K44no19
$$ 100219 100394 100921 100906 100519 100715 101682 102639 103037 103159 103453 103839 103812 102969 101509 100241 99854 100098 100093 99474
52474I9474p31k83J96N17P49P19M16L48P73J037N97K1J4J53k90q94p75k23j92
$$ 99474 98743 98460 98656 99173 99922 100641 101057 101405 102178 103215 103812 103833 103847 104000 103710 102816 102041 101818 101626
52455A01626n55l10O06J203J083Q28O77J76o45r54l26O64J265J249O89j41o53
$$ 101626 101071 100761 101367 102570 103653 104481 105158 105334 104689 103735 103409 104073 105338 106587 107276 107135 106482
52438A06482m87o8M1O7M51P69K99o18r66o99p58j447j867j260M4J199J596J034
$$ 106482 105995 105927 105968 106035 106486 107255 107554 106936 105970 105271 104513 103066 101199 99939 99983 101182 102778 103812
52420A03812j25r40p44R8P91J190J479J347M68n68r06o84n48l36M28J069L79j291
$$ 103812 103687 102747 102003 102101 102892 104082 105561 106908 107376 106808 105902 105218 104670 104334 104762 105831 106210 104919
52402A04919k099j180L40J118J073O77N5n80o19N7O41L88m11r22p43j07N17Q27
$$ 104919 102820 101640 101980 103098 104171 104848 104903 104323 103704 103761 104402 104790 104379 103457 102714 102607 103124 103951
52384A03951R09J106J393J261O18K56P48J411J248M64L5J67L40N27J125J815J780
$$ 103951 104860 105966 107359 108620 109238 109494 110242 111653 112901 113365 113400 113567 113907 114434 115559 117374 119154
52367A19154J072N36M11K06j9M38J531K202J902J233P99M76J39J24M87P44P13
$$ 119154 120226 120762 121173 121379 121360 121798 123329 125531 127433 128666 129465 129941 130080 130204 130691 131435 132148
52350A32148Q31J259J451R43l9r62j398r97K25J481J833J290O28J62m37j198j637
$$ 132148 132979 134238 135689 136632 136593 135631 134233 133236 133461 134942 136775 138065 138693 138855 138418 137220 135583
52333A35583j581j329r54l01L08K94j62k32K57N21l2j100k102k716k728k065j060
$$ 135583 134002 132673 131719 131418 131726 132020 131858 131626 131883 132404 132372 131272 129170 126454 123726 121661 120601
52316A20601j48N70J006P81qm01J68P88N30J67R65K381K820K287K224K814K699
$$ 120601 120453 121023 122029 122810 122802 122401 122569 123357 123887 124054 125019 127400 130220 132507 134731 137545 140244
52299A40244J653J245K132K816K092R16O68J153J548J984K848L629L713L493L598
$$ 140244 141897 143142 145274 148090 150182 151098 151766 152919 154467 156451 159299 162928 166641 170134 173732
52284A73732L736L337K611K132J979K031K415K915K704J447R8j68O68J720K222
$$ 173732 177468 180805 183416 185548 187527 189558 191973 194888 197592 199039 199137 198969 199637 201357 203579
52269B03579J874Q44j49l81j41l97j187j364l31J012J670J772J770J556J182J418
$$ 203579 205453 206297 206148 205767 205626 205229 204042 202678 202347 203359 205029 206801 208571 210127 211309 212727
52253B12727K571L588L391K348J541J228J057J122J690K357K428J945J545J572
$$ 212727 215298 218886 222277 224625 226166 227394 228451 229573 231263 233620 236048 237993 239538 241110
52239B41110J934K485K999L107K780K504K550K578K310K006J847J565J128J068
$$ 241110 243044 245529 248528 251635 254415 256919 259469 262047 264357 266363 268210 269775 270903 271971
52225B71971J511J669J050M35Q36J987K713K437J640J099J241J895K272J603K09
$$ 271971 273482 275151 276201 276636 277472 279459 282172 284609 286249 287348 288589 290484 292756 294359 294568
52210B94568n94l8J255K282K849L287L685L943M006L648K715J898K280L704M639
$$ 294568 293974 293936 295191 297473 300322 303609 307294 311237 315243 318891 321606 323504 325784 329488 334127
52195C34127M328L838M180M637M187L448L606M229L857K453J535J883K513K347
$$ 334127 338455 342293 346473 351110 355297 358745 362351 366580 370437 372890 374425 376308 378821 381168
52181C81168J613J176J336J761K040J988J730J600J722J755J444J087J046J031
$$ 381168 382781 383957 385293 387054 389094 391082 392812 394412 396134 397889 399333 400420 401466 402497
52167D02497N60j01j74M56R00L13j121k426k818k335j619j187j011q85q35q91
$$ 402497 403057 402956 402782 403238 404138 404451 403330 400904 398086 395751 394132 392945 391934 391049 390214 389323
52151C89323p25k14l3q20j924k060j321j223k353l280k591q98J92J83k70p11j089
$$ 389323 388598 388384 388351 387531 385607 383547 382226 381003 378650 375370 372779 371881 372073 372256 371986 371275 370186
52134C70186j165q11n80j080j945k372k305k287k367k076j383q48q42j213j671
$$ 370186 369021 368210 367630 366550 364605 362233 359928 357641 355274 353198 351815 350967 350125 348912 347241
52119C47241j989j983j751j707j972k064j659j193j181j407j447j541k107k788
$$ 347241 345252 343269 341518 339811 337839 335775 334116 332923 331742 330335 328888 327347 325240 322452
52105C22452k809k090j275p75n16m42o02p85o52k02K82O31P55N64L29P11J922
$$ 322452 319643 317553 316278 315503 314987 314545 313943 313158 312506 312304 312586 313217 313972 314536 314865 315576 317498
52088C17498L113L320K661K048K006K372K829L099K830J992J196J117J722K499
$$ 317498 320611 323931 326592 328640 330646 333018 335847 338946 341776 343768 344964 346081 347803 350302
52074C50302L105L360L025K200J562J539J679J462J284J744K375K144J058K85
$$ 350302 353407 356767 359792 361992 363554 365093 366772 368234 369518 371262 373637 375781 376839 377124
52060C77124N72J440K064K214K096J878J672J548J431J227J075J070R63N18L7
$$ 377124 377696 379136 381200 383414 385510 387388 389060 390608 392039 393266 394341 395411 396374 396892 396929
52045C96929O2N82J014J006P57N72M75L74K68K22K28J14l96j281j928j662o81
$$ 396929 396991 397573 398587 399593 400350 400922 401397 401771 402039 402261 402489 402603 402207 400926 398998 397336 396655
52028C96655k1l17j126j735k044k256k297k102k020k318k617k426j939j715j893
$$ 396655 396634 396317 395191 393456 391412 389156 386859 384757 382737 380419 377802 375376 373437 371722 369829
52013C69829k138k172j945j537j223j304j554j314m49L08L69O3p0j10k89k59M08
$$ 369829 367691 365519 363574 362037 360814 359510 357956 356642 356193 356501 356870 356933 356863 356753 356464 356205 356613
51996C56613J354J813J477N03r68k668m042m797n303n901o294o090n490m866m251
$$ 356613 357967 359780 361257 361760 360792 358124 354082 349285 343982 338081 331787 325697 320207 315341 311090
51981C11090l848m334n865p361p682p059o553o587o822p007p036o585n607m876
$$ 311090 307242 302908 297043 289682 282000 274941 268388 261801 254979 247972 240936 234351 228744 223868
51967B23868n174o212p113p555p678p344o405n312m595m053l322k714k623k598
$$ 223868 218694 212482 205369 197814 190136 182792 176387 171075 166480 162427 159105 156391 153768 151170
51953A51170k075j570j964k960l432l056k461j953j315p95r72j624j759r91M3
$$ 151170 149095 147525 145561 142601 139169 136113 133652 131699 130384 129589 128617 126993 125234 124243 124286
51938A24286O70P28J70r43k043k479k353k164j843j053j53J51J3J71O17O21R6
$$ 124286 124956 125684 125854 124911 122868 120389 118036 115872 114029 112976 112823 112974 112987 113158 113775 114396 114492
51921A14492k24K8M55P20P89L72o90j584j240O8J013J110J047J079N78m27p71
$$ 114492 114268 114296 114751 115471 116260 116632 115942 114358 113118 113186 114199 115309 116356 117435 118013 117586 116815
51904A16815J41J322J638J207O88J59n27j073j206j162j166j010o40m80p10q46
$$ 116815 116956 118278 119916 121123 121811 121970 121443 120370 119164 118002 116836 115826 115186 114706 113996 113150
51888A13150n76k97l28k89J99P45Q44O88P07O89J77o06q85m03J72M3p86j513j415
$$ 113150 112574 112277 111949 111660 111859 112604 113448 114136 114843 115532 115709 115103 114218 113815 113987 114030 113244 111731 110316
51869A10316o72j66m04q92q63k68L53O81P64O58M79N92J102J380Q19j15l72J93
$$ 110316 109644 109478 109074 108182 107319 107051 107404 108085 108849 109507 109986 110578 111680 113060 113879 113764 113392 113585
51851A13585O78M79k1k41j37P0K98N24P37J021J371J525J378J259J349J245P09
$$ 113585 114263 114742 114721 114480 114343 114413 114711 115235 115972 116993 118364 119889 121267 122526 123875 125120 125829
51834A25829L50P15J233J009L12J47O76J185J380J508J465R75N34Q35J424J320
$$ 125829 126179 126894 128127 129136 129448 129595 130271 131456 132836 134344 135809 136784 137318 138153 139577 140897
51818A40897P94R98J868K145J649J680K695L418L054K643L279M397M980N173N619
$$ 140897 141691 142689 144557 146702 148351 150031 152726 156144 159198 161841 165120 169517 174497 179670 185289
51803A85289O236O729P410Q416Q949Q217O463M282J766r41l108m310n078n827
$$ 185289 191525 198254 205664 214080 223029 231246 237709 241991 243757 242816 239708 235398 230320 224493
51789B24493o000n161m047l581l577l367k934k505j836r29p00j698k841k693j519
$$ 224493 218493 213332 209285 205704 202127 198760 195826 193321 191485 190556 189856 188158 185317 182624 181105
51774A81105p50q41r72o74m23n14n36j96J82K30o4o74j575k433k719k293j501
$$ 181105 180355 179514 178542 177868 177445 176931 176395 176199 176381 176611 176547 175873 174298 171865 169146 166853 165352
51757A65352p70m41p23j349j562j036n09q96j921k379j706n61J86M24N21O35N79
$$ 165352 164582 164141 163418 162069 160507 159471 158962 158066 156145 153766 152060 151499 151685 152109 152630 153265 153844
51740A53844J86m19r05j026q74p84r34j175j259j063o08j07K2m17r83j039n59
$$ 153844 154030 153611 152706 151680 150806 150022 149088 147913 146654 145591 144983 144876 144898 144481 143498 142459 141900
51723A41900p7K05O39J379K053K423K702K977K881K257J564J237J112Q64N50M05
$$ 141900 141823 142028 142667 144046 146099 148522 151224 154201 157082 159339 160903 162140 163252 164116 164666 165071
51707A65071M34N79Q52J080R19L70j76n96j199k043k620k584k244k107k343k896
$$ 165071 165505 166084 166936 168016 168935 169305 169129 168533 167334 165291 162671 160087 157843 155736 153393 150497
51691A50497l577l914l527k804k523k699k538j649m96N50J550K212J915R32N26
$$ 150497 146920 143006 139479 136675 134152 131453 128915 127266 126770 127320 128870 131082 132997 133929 134455
51676A34455J207J987K052J988K421K610J554l09j689k167k218k069j599r87m70
$$ 134455 135662 137649 139701 141689 144110 146720 148274 147965 146276 144109 141891 139822 138223 137236 136766
51661A36766J65J034J505J002N9l52j59M5J81O86J518K140K361K493K734K998
$$ 136766 136931 137965 139470 140472 140531 140179 140020 140065 140246 140932 142450 144590 146951 149444 152178 155176
51645A55176L155K936J947K51j439k631l524m143l850k508j288j230j680j346
$$ 155176 158331 161267 163214 163465 162026 159395 155871 151728 147878 145370 144082 142852 141172 139826
51631A39826l31J99n8l37k32n9K03R76K029K558K429K188J875R35m46j176p74
$$ 139826 139495 139694 139636 139299 139067 139008 139211 140187 142216 144774 147203 149391 151266 152201 151755 150579 149805
51614A49805K0M84P94J178J210O29O3K38Q84J100N44k36n29k19J95J97q6rO46
$$ 149805 149825 150309 151103 152281 153491 154120 154183 154421 155305 156405 156949 156713 156184 155965 156160 156357 156271 156262 156908
51595A56908J266J294J107J374J826J534L01j043j759j872j616j049m05j06j88
$$ 156908 158174 159468 160575 161949 163775 165309 165610 164567 162808 160936 159320 158271 157866 157760 157572
51580A57572k65k63n32j056j275j034j014j699k484k403j398k89K93M66O15R11
$$ 157572 157307 157044 156512 155456 154181 153147 152133 150434 147950 145547 144149 143860 144153 144619 145234 146145
51564A46145J304J675J805J477O97j70o35m85J01P21R96P08K0m52o7R92J673J238
$$ 146145 147449 149124 150929 152406 153103 152933 152298 151813 151914 152635 153631 154339 154359 153907 153840 154832 156505 157743
51546A57743K91JN24Q79M34l40p15n72j43M09P71O01J88L09J063J597J469J338
$$ 157743 158034 158035 158559 159438 159872 159532 158817 158245 158102 158511 159282 159883 160071 160380 161443 163040 164509 165847
51528A65847J708J986J586J088J229J522J131N01O97J545J860J410J181J576J737
$$ 165847 167555 169541 171127 172215 173444 174966 176097 176598 177295 178840 180700 182110 183291 184867 186604
51513A86604J104L87L89Q06Q91N77K89J38J4J23P30J496J609P13n74j219p68K99
$$ 186604 187708 188095 188484 189290 190181 190758 191047 191185 191199 191322 192052 193548 195157 195870 195296 194077 193309 193608
51495A93608J141J329R31J38q13j426j270o46m29r91j787k216k361k520k657k722
$$ 193608 194749 196078 197009 197147 196334 194908 193638 192992 192563 191572 189785 187569 185208 182688 180031 177309
51479A77309k914l150k860j893j029r74j350j377r81n42q8M29N72J3o85p97o13
$$ 177309 174395 171245 168385 166492 165463 164489 163139 161762 160781 160239 160151 160580 161152 161165 160480 159683 159070
51462A59070q98j504j666j412j581k337k840k635k426k941l761l863k950j814
$$ 159070 158172 156668 155002 153590 152009 149672 146832 144197 141771 138830 135069 131206 128256 126442
51448A26442j351j555j583q91j4J91j42q5N45Q32K42n32p49o33n24o4Q15J169
$$ 126442 125091 123536 121953 121062 121048 121239 121097 121012 121557 122389 122631 122099 121350 120717 120193 120129 120944 122113
51430A22113M53l28j70J91m74j632j737p26M7J15K94Q57J048O43L57L69j1p99
$$ 122113 122566 122238 122068 122259 121785 120153 118416 117690 117737 117852 118146 119003 120051 120694 121051 121420 121409 120610
51412A20610r47oJ018J070K50p98j649j875j106K19J067J100R03Q09N50K76O82
$$ 120610 119663 119657 120675 121745 121995 121197 119548 117673 116567 116786 117853 118953 119856 120665 121215 121491 122173
51395A22173J688K165J467K87m94p39m99L82J513J842R92j05m74j79K61O61Q87
$$ 122173 123861 126026 127493 127780 127286 126547 126048 126430 127943 129785 130777 130672 130198 130019 130280 130941 131828
51378A31828O15l9m23l79m69q20p55j08J81m36j059p11J0j81j278j994j562o42
$$ 131828 132443 132404 131981 131602 131133 130313 129558 129450 129631 129195 128136 127425 127435 127254 125976 123982 122420 121778
51360A21778m06j270k574l309l171k860l031l196k436r84j84n89j257j283r61
$$ 121778 121372 120102 117528 114219 111048 108188 105157 101961 99525 98541 98357 97768 96511 95228 94267
51345I4267q88q41l44M34J052J449J622J275L90l64m17l1K28K35R2k01m18j19
$$ 94267 93379 92538 92194 92628 93680 95129 96751 98026 98416 98052 97635 97604 97832 98067 98159 97958 97540 97421
51327I7421N09N50l58j259j107j58N14L48l91j158j391p80K49P09K20m98o87m36
$$ 97421 97930 98480 98122 96863 95756 95598 96112 96460 96069 94911 93520 92740 92989 93698 93918 93420 92733 92297
51309I2297j35K14N26L67k51m80J27P66N64qO6P65J276J377J445J304L30j259
$$ 92297 92162 92376 92902 93269 93018 92538 92665 93431 93995 93987 94053 94818 96094 97471 98916 100220 100550 99291
51291I9291k258j908p31K98P94R64J016R39O46J46l39n38m11k07j07m5Q4K58M35
$$ 99291 97033 95125 94394 94692 95486 96450 97466 98405 99051 99197 98858 98320 97909 97702 97595 97550 97634 97892 98327
51272I8327N32K72n07j368j582r98j80M30Q93J215J152P98O28P04M50l70j194
$$ 98327 98859 99131 98624 97256 95674 94676 94496 94926 95819 97034 98186 98984 99612 100316 100766 100396 99202
51255I9202j508j486j338p93K18R87Q40R3l83k45R1M7n19j053o15J024K689K938
$$ 99202 97694 96208 94870 94077 94295 95282 96122 96215 95832 95587 95678 95725 95206 94153 93538 94562 97251 100189
51237A00189J899R89P57L38o99j357q09K49P70P68O55K20o34j105n85K71O48R05
$$ 100189 102088 103077 103834 104172 103473 102116 101307 101556 102326 103094 103749 103969 103335 102230 101645 101916 102564 103469
51219A03469J531J697M31j391j893q52J21mm77k71M82R98Q58J68o53j054p77k46
$$ 103469 105000 106697 107128 105737 103844 102992 103113 103109 102632 102361 102843 103841 104699 104867 104214 103160 102383 102137
51201A02137n0j95l05l15l90m39l01j53j18K03J065J812J607O49j48m26n46o72
$$ 102137 102087 101892 101587 101272 100882 100443 100142 99989 99871 100074 101139 102951 104558 105207 105059 104633 104087 103415
51183A03415n69k46N6M07R65J348J006J89k78j42M9k00p91j319j329n39O45J191
$$ 103415 102846 102600 102656 103063 104028 105376 106382 106571 106293 106151 106200 106000 105209 103890 102561 102022 102667 103858
51165A03858O92M8J63M65k08j661k614k596k218j670m38J202J956J330M87N65
$$ 103858 104550 104598 104761 105226 105018 103357 100743 98147 95929 94259 93821 95023 96979 98309 98796 99361
51149I9361J152J239P77M74N53O22M76L01K99N23R90J578K004K123K045J818J271
$$ 99361 100513 101752 102529 103003 103556 104178 104654 104955 105254 105777 106767 108345 110349 112472 114517 116335 117606
51132A17606M69n4J18O87R75P28L64L90Q05J213J373J474J760K044J899J221L26
$$ 117606 118075 118021 118139 118826 119801 120529 120893 121283 122088 123301 124674 126148 127908 129952 131851 133072 133398
51115A33398n43j317j753j472n95J84M41L73J62m07j261j679j258o05m46n26k25
$$ 133398 132855 131538 129785 128313 127718 127902 128343 128716 128878 128471 127210 125531 124273 123668 123222 122696 122471
51098A22471L05M27J29j03k53p29j472j944j928j650j208n54L0K09K20N16R16
$$ 122471 122776 123203 123332 123229 122976 122247 120775 118831 116903 115253 114045 113491 113521 113730 113950 114466 115382
51081A15382Q28K38k34k68r3J64O16J077J123Q02O32Q01R27P27L45J0k06j51L50
$$ 115382 116210 116448 116214 115946 115853 116017 116633 117710 118833 119635 120267 121068 121995 122722 123067 123077 122871 122720 123070
51062A23070J152J799J952J506N85l70p38m13jL1l2J56L18K29L98J161J691J026
$$ 123070 124222 126021 127973 129479 130064 129694 128956 128543 128542 128573 128541 128697 129015 129244 129642 130803 132494 133520
51044A33520k90p96j54N62N84K81K21M73R33J448J550R42K46L57J065J354R82
$$ 133520 133230 132434 132280 132842 133426 133707 133928 134401 135334 136782 138332 139274 139520 139877 140942 142296 143278
51027A43278O72P41P55O87J114J972K329J821J232J278J775K395L144L614K992
$$ 143278 143950 144691 145446 146133 147247 149219 151548 153369 154601 155879 157654 160049 163193 166807 169799
51012A69799J439L22L94P59M35q6J29P96R31M95K94N93Q51P66O68Q01R42Q62O84
$$ 169799 171238 171560 171954 172713 173148 173062 173191 173987 174918 175413 175707 176300 177151 177917 178585 179386 180328 181190 181874
50993A81874N92N41L71Jn87j334k079k564k505j836r12k72l6J58M29L17l63q56
$$ 181874 182466 183007 183378 183379 182792 181458 179379 176815 174310 172474 171562 171290 171254 171412 171841 172158 171795 170939
50975A70939m06N28Q56M75K74O05Q21N11K07M91J192J835K172K064J465Q17Q24
$$ 170939 170533 171061 171917 172392 172666 173271 174092 174603 174810 175301 176493 178328 180500 182564 184029 184846 185670
50958A85670J539K362K962L598M316M740M862N179N814O274O384O684P514Q507
$$ 185670 187209 189571 192533 196131 200447 205187 210049 215228 221042 227316 233700 240384 247898 256405
50944B56405R372J0402J1810J3264J4458J5471J6261J6558J6553J6879J7576J7952
$$ 256405 265777 276179 287989 301253 315711 331182 347443 364001 380554 397433 415009 432961
50932D32961J7792J7636J7455J6162J3206R651O805M560J988j102m123o708q936
$$ 432961 450753 468389 485844 502006 515212 524863 531668 536228 538216 537114 532991 526283 517347
50919E17347j0937j2942j5255j7567j8826j8429j7050j5691j4518j3286j2195
$$ 517347 506410 493468 478213 460646 441820 423391 406341 390650 376132 362846 350651
50908C50651j1500j0796r536p954o668n693m626l518k832k647k518j977q12Q14
$$ 350651 339151 328355 318819 310865 304197 298504 293878 290360 287528 284881 282363 280386 279574 280388
50894B80388K225K693K446K580L539M362M135L363L006K914K333J379Q59Q62Q08
$$ 280388 282613 285306 287752 290332 293871 298233 302368 305731 308737 311651 313984 315363 316222 317084 317892
50879C17892O52R30J534J594Q08o2l38l29p06j500k146k200j795j528j842k468
$$ 317892 318544 319474 321008 322602 323410 323348 323010 322681 321975 320475 318329 316129 314334 312806 310964 308496
50863C08496k651k169j651j622j685j254n78k88k78M8O64R52Q68J134K106L232
$$ 308496 305845 303676 302025 300403 298718 297464 296886 296598 296320 296368 297032 297984 298852 299986 302092 305324
50847C05324L916M225M505M823N171N736O604P466P991Q275Q780R809J1188J2463
$$ 305324 309240 313465 317970 322793 327964 333700 340304 347770 355761 364036 372816 382625 393813 406276
50833D06276J3462J4642J6626J9308K1781K3480K4971K7223L0409L3925L7370
$$ 406276 419738 434380 451006 470314 492095 515575 540546 567769 598178 632103 669473
50822F69473M0827M4313M7584N0593N3511N6155N7875N8178N7058N4476M9946
$$ 669473 710300 754613 802197 852790 906301 962456 1020331 1078509 1135567 1190043 1239989
50811A239989M3086L4317K4726J5213O018k921j1402j8903k4999k9621l2855l4694
$$ 1239989 1283075 1317392 1342118 1357331 1363349 1360428 1349026 1330123 1305124 1275503 1242648 1207954
50799A207954l5131l4300l2268k8889k4183j8683j3024p289j256M867J0601J6103
$$ 1207954 1172823 1138523 1106255 1077366 1053183 1034500 1021476 1014187 1012931 1017798 1028399 1044502
50787A044502K2168K9165L6639M4291N2567O1782P1205P9547Q5954R0066R1531
$$ 1044502 1066670 1095835 1132474 1176765 1229332 1291114 1362319 1441866 1527820 1617886 1709417
50776A709417R0040Q5577P8308O8474N6826M4779L3705K4143J5889Q441J133o712
$$ 1709417 1799457 1885034 1963342 2031816 2088642 2133421 2167126 2191269 2207158 2215599 2216732 2210020
50764B210020j5296k4315l3605m3377n3516o3230p1788p9068q4939q8712q9804
$$ 2210020 2194724 2170409 2136804 2093427 2039911 1976681 1904893 1825825 1740886 1652174 1562370
50753A562370q8460q5293q0592p4676o8310o2065n5706m8998m2604l7302l2665
$$ 1562370 1473910 1388617 1308025 1233349 1165039 1102974 1047268 998270 955666 918364 885699
50742H85699k7605k2098j7323j3933j1173q028m466j063K065N313Q760J1817J3995
$$ 885699 858094 835996 818673 804740 793567 785539 781073 780010 782075 787388 796148 807965 821960
50729H21960J5740J8128K1547K5024K7309K8276K8601K8320K6670K3531K0026
$$ 821960 837700 855828 877375 902399 929708 957984 986585 1014905 1041575 1065106 1085132
50718A085132J7328J5623J4731J4753J5471J6000J5835J5588J5910J6366J6165
$$ 1085132 1102460 1118083 1132814 1147567 1163038 1179038 1194873 1210461 1226371 1242737 1258902
50707A258902J5340J4329J3010J1092Q933P067N466M201M159N908Q339R731R760
$$ 1258902 1274242 1288571 1301581 1312673 1321606 1328673 1334139 1338340 1342499 1348407 1356746 1366477 1376237
50694A376237R209Q079N491J455k784o282r087j1118j1667j0372p719m246j22
$$ 1376237 1385446 1393525 1399016 1400471 1397687 1391405 1382318 1371200 1359533 1349161 1341442 1337196 1337074
50681A337074M291Q437J2454J7101K2439K7541L1818L5731L9834M4083M8777N5257
$$ 1337074 1341365 1349802 1362256 1379357 1401796 1429337 1461155 1496886 1536720 1580803 1629580 1684837
50669A684837O4775P7172R1350J06663J23081J40215J56775J71068J81709J87829
$$ 1684837 1749612 1826784 1918134 2024797 2147878 2288093 2444868 2615936 2797645 2985474
50659B985474J88811J84023J73156J57043J37891J18205R9458Q1959O5682N0562
$$ 2985474 3174285 3358308 3531464 3688507 3826398 3944603 4044061 4126020 4191702 4242264
50649D242264L6194K1906P180q415k5474m4221o3698q2170r8282j11382j20904
$$ 4242264 4278458 4300364 4307544 4299129 4273655 4229434 4165736 4083566 3985284 3873902 3752998
50638C752998j26321j27768j25941j21191j13389j02782r0350p7164o3975n1552
$$ 3752998 3626677 3498909 3372968 3251777 3138388 3035606 2945256 2868092 2804117 2752565
50628B752565m0781l2217k5913k1775j9636j9073j9569k0806k2388k3622k4179
$$ 2752565 2711784 2679567 2653654 2631879 2612243 2593170 2573601 2552795 2530407 2506785 2482606
50617B482606k4566k5174k5207k3478j9964j5407r746k338O271J4275K0552K5412
$$ 2482606 2458040 2432866 2407659 2384181 2364217 2348810 2339064 2336726 2342997 2357272 2377824 2403236
50605B403236K9124L1091L0970K9314K6427K1759J5041O918k238j3070k5901l9686
$$ 2403236 2432360 2463451 2494421 2523735 2550162 2571921 2586962 2593880 2591642 2578572 2552671 2512985
50593B512985n3074o5576p6878q5960r1967r5167r6129r4739r0985q5909q0684
$$ 2512985 2459911 2394335 2317457 2231497 2139530 2044363 1948234 1853495 1762510 1676601 1595917
50582A595917p5361o9521o3476n7724n1840m5285l8761l3465k9284k5108k0677
$$ 1595917 1520556 1451035 1387559 1329835 1277995 1232710 1193949 1160484 1131200 1106092 1085415
50571A085415j6694j3152r083m255J35L116N179P355R859J2269J4313J5902J6925
$$ 1085415 1068721 1055569 1046486 1042231 1042366 1045482 1050661 1058016 1067875 1080144 1094457 1110359 1127284
50558A127284J7619J8731K0844K3831K7338L1487L6634M2719M9441N6968O6033
$$ 1127284 1144903 1163634 1184478 1208309 1235647 1267134 1303768 1346487 1395928 1452896 1518929
50547A518929P7049Q9342J01481J12413J22062J30570J37021J39351J36001J27508
$$ 1518929 1595978 1685320 1786801 1899214 2021276 2151846 2288867 2428218 2564219 2691727
50537B691727J16128J03987R2004Q0506P0278O2475N7701N5275N3516N0610M5508
$$ 2691727 2807855 2911842 3003846 3084352 3154630 3217105 3274806 3330081 3383597 3434207 3479715
50526C479715L8222K9506K0324J1624M409k85j617P36O328J4000K2389L0542L8022
$$ 3479715 3517937 3547443 3567767 3579391 3583800 3583515 3581898 3582634 3588962 3602962 3625351 3655893 3693915
50513C693915M4351M8720N0345M8900M4249L5987K3812Q301r145k7224m5332o3013
$$ 3693915 3738266 3786986 3837331 3886231 3930480 3966467 3990279 3998580 3989435 3962211 3916879 3853866
50501C853866p9360r3382j04673j13196j18371j18993j14288j04803r1957p7036
$$ 3853866 3774506 3681124 3576451 3463255 3344884 3225891 3111603 3006800 2914843 2837807
50491B837807o0859m4089k7285j0797M855J8432K8338L3697L4625L1249K3131
$$ 2837807 2776948 2732859 2705574 2694777 2699632 2718064 2746402 2780099 2814724 2845973 2869104
50480B869104J0029p236k6968m7357o6676q3348r6483j06085j12337j15032j14351
$$ 2869104 2879133 2871897 2844929 2797572 2730896 2647548 2551065 2444980 2332643 2217611 2103260
50469B103260j11622j08432j05049j00582r4592q7782q0992p4385o7830o1394
$$ 2103260 1991638 1883206 1778157 1677575 1582983 1495201 1414209 1339824 1271994 1210600
50459A210600n5157m9091m3414l8549l4515l0797k7022k3385k0201j7478j5016
$$ 1210600 1155443 1106352 1062938 1024389 989874 959077 932055 908670 888469 870991 855975
50448H55975j2627j0174p763n855m720l855k500o73R19K011L084M430N779O986
$$ 855975 843348 833174 825411 819556 814836 810981 808481 807808 808727 810738 813822 818252 824031 831017
50434H31017Q342R857J1075J1978J3342J5770J8974K2436K6054K9681L2808L5420
$$ 831017 839359 849216 860291 872269 885611 901381 920355 942791 968845 998526 1031334 1066754
50422A066754L8507M2899M7941N2116N4708N6250N7460N8440N8879N8630N7967
$$ 1066754 1105261 1148160 1196101 1248217 1302925 1359175 1416635 1475075 1533954 1592584 1650551
50411A650551N7403N7245N7275N7202N7306N8043N9002N9068N7885N6318N4931
$$ 1650551 1707954 1765199 1822474 1879676 1936982 1995025 2054027 2113095 2170980 2227298 2282229
50400B282229N2902M9339M4846M0818L7477L3689K8625K2621J6266R326R45r486
$$ 2282229 2335131 2384470 2429316 2470134 2507611 2541300 2569925 2592546 2608812 2618138 2619083 2609597
50388B609597k1787l5111m8435o1055p2430q1763q8231r1756r2898r1753q7732
$$ 2609597 2587810 2552699 2504264 2443209 2370779 2289016 2200785 2109029 2016131 1924378 1836646
50377A836646q0806p2195o3080n3449m3040l2634k3302j4889o674P84N833P845
$$ 1836646 1755840 1683645 1620565 1567116 1524076 1491442 1468140 1453251 1446577 1447361 1453194 1461039
50365A461039P716N955J690n656j4691k3054k9584l4728l9155m2782m5100m5838
$$ 1461039 1468755 1474710 1476400 1470744 1456053 1432999 1403415 1368687 1329532 1286750 1241650 1195812
50353A195812m5210m3717m1865l9825l7494l4848l2156k9711k7569k5552k3434
$$ 1195812 1150602 1106885 1065020 1025195 987701 952853 920697 890986 863417 837865 814431
50342H14431k1037j8386j5779j3598j1961j0693r617q716p952p098n890m325k779
$$ 814431 793394 775008 759229 745631 733670 722977 713360 704644 696692 689594 683704 679379 676600
50329F76600j776j481j411r06K8O65M99j14n48p09p87n22O01K375L787M037L386
$$ 676600 674824 673343 671932 671026 671054 671719 672218 672104 671556 670847 670060 669538 670139 672514 676301 680338 683724
50312F83724K848L330N083P642J0204J2284J4091J6099J8366K0531K2340K3727
$$ 683724 686572 689902 694985 702627 712831 725115 739206 755305 773671 794202 816542 840269
50300H40269K4479K4406K3947K3953K4550K4654K3116K0029J6517J3411J0571
$$ 840269 864748 889154 913101 937054 961604 986258 1009374 1029403 1045920 1059331 1069902
50289A069902P479M073Q43j686l513n343q164j2393j7360k1800k4926k6882k8168
$$ 1069902 1077381 1081454 1082297 1080611 1077098 1071755 1063591 1051198 1033838 1012038 987112 960230 932062
50276I32062k8867k8677k7407k5213k2405j9325j6443j4208j2725j1768j1146
$$ 932062 903195 874518 847111 821898 799493 780168 763725 749517 736792 725024 713878
50265G13878j0834j0694j0411r830r116q398p589o730o201o224o432o268n658
$$ 713878 703044 692350 681939 672109 662993 654595 647006 640276 634075 627851 621419 615151 609493
50252F09493m966m531m518m911n340n155m131k801j750r67l15r8m41o25N7J085
$$ 609493 604527 599996 595478 590567 585227 580072 575941 573140 571390 570423 570108 570010 569569 568944 569001 570086
50236E70086J414J098J121J703K069J983K171K924L490L403L211L283L044K166
$$ 570086 571500 572598 573719 575422 577491 579474 581645 584569 588059 591462 594673 597956 601000 603166
50222F03166J454J582J869J300N1j016j727k415k937k889k441j953j172J96J449
$$ 603166 604620 606202 608071 609371 609422 608406 606679 604264 601327 598438 595997 594044 592872 593068 594517
50207E94517J539N76k77m06k62l63n91o00j95P87K306L788M474M241L600L065
$$ 594517 596056 596632 596355 595949 595687 595324 594733 594133 593938 594725 597031 600819 605293 609534 613134 616199
50191F16199K936L482M655N861O581P098P961Q953R310Q871Q302Q162Q389Q696
$$ 616199 619135 622617 627272 633133 639714 646812 654773 663726 673036 681907 690209 698371 706760 715456
50177G15456Q871Q694Q078P324O790O410O026N879O252O880P331P672Q117Q444
$$ 715456 724327 733021 741099 748423 755213 761623 767649 773528 779780 786660 793991 801663 809780 818224
50163H18224Q527R067J0718J2805J4081J4568J5429J6981J8235J8656J9100K0429
$$ 818224 826751 835818 846536 859341 873422 887990 903419 920400 938635 957291 976391 996820
50151I96820K2411K4567K7082L0155L3342L6373L9823M4231M9204N4271O0094
$$ 996820 1019231 1043798 1070880 1101035 1134377 1170750 1210573 1254804 1304008 1358279 1418373
50140A418373O7870P7883Q9547J02633J17666J35119J54844J76326J98886K21411
$$ 1418373 1486243 1564126 1653673 1756306 1873972 2009091 2163935 2340261 2539147 2760558
50130B760558K42252K59390K70508K73034K64821K45350K16526J82522J48574
$$ 2760558 3002810 3262200 3532708 3805742 4070563 4315913 4532439 4714961 4863535
50121D863535J19295R7294Q2895P4798P0669O7257O0578M6760K3001j1789n6645
$$ 4863535 4982830 5080124 5163019 5237817 5308486 5375743 5436321 5483081 5506082 5494293 5437648
50110E437648j08279j61473k10433k50409k78606k94172k97781k91141k76548
$$ 5437648 5329369 5167896 4957463 4707054 4428448 4134276 3836495 3545354 3268806
50101C268806k56571k33683k09868j86448j64306j44128j26258j10444r6173q3257
$$ 3268806 3012235 2778552 2568684 2382236 2217930 2073802 1947544 1837100 1740927 1657670
50091A657670p1910o2285n4208m7324m1263l5757l0862k6999k4342k2271j9857
$$ 1657670 1585760 1523475 1469267 1421943 1380680 1344923 1314061 1287062 1262720 1240449 1220592
50080A220592j6921j4162j2194j0901r855q911q057p004n358l123q75O73J267
$$ 1220592 1203671 1189509 1177315 1166414 1156559 1147648 1139591 1132587 1127229 1124106 1123231 1123904 1125171
50067A125171J337J595K267K990L573M525O361Q649J0290J0872J1110J1798J2807
$$ 1125171 1126508 1128103 1130370 1133360 1136933 1141458 1147819 1156468 1166758 1177630 1188740 1200538 1213345
50054A213345J3411J3416J3533J4646J6798J9072K0569K1371K2338K3902K5624
$$ 1213345 1226756 1240172 1253705 1268351 1285149 1304221 1324790 1346161 1368499 1392401 1418025
50043A418025K7046K8457L0318L2371L4043L5413L7117L9391M1885M4365M7064
$$ 1418025 1445071 1473528 1503846 1536217 1570260 1605673 1642790 1682181 1724066 1768431 1815495
50032A815495N0291N4219N9006O4619P0656P6827Q3642R2076J02678J15516J30851
$$ 1815495 1865786 1920005 1979011 2043630 2114286 2191113 2274755 2366831 2469509 2585025 2715876
50021B715876J49155J70538J94876K22463K53796K88581L25507L62848L98330
$$ 2715876 2865031 3035569 3230445 3452908 3706704 3995285 4320792 4683640 5081970
50012E081970M28222M47622M52429M41124M15142L78694L38373L01402K72742
$$ 5081970 5510192 5957814 6410243 6851367 7266509 7645203 7983576 8284978 8557720
50003H557720K53326K40881K31736K21766K06657J82253J44914R1985K3143n7948
$$ 8557720 8811046 9051927 9283663 9505429 9712086 9894339 10039253 10131238 10154381 10096433
49993A0096433j43887k26346k99013l58508m03781m35448m55102m64390m64635
$$ 10096433 9952546 9726200 9427187 9068679 8664898 8229450 7774348 7309958 6845323
49984F845323m57397m44589m27512m06265l80788l52182l22428k93041k64576
$$ 6845323 6387926 5943337 5515825 5109560 4728772 4376590 4054162 3761121 3496545
49975C496545k37256k11429j87463j65648j46246j29365j14731j01860r0471q0577
$$ 3496545 3259289 3047860 2860397 2694749 2548503 2419138 2304407 2202547 2112076 2031499
49965B031499p2243o5303n9447n4443n0422m7640m5901m4413m2640m1042m0427
$$ 2031499 1959256 1893953 1834506 1780063 1729641 1682001 1636100 1591687 1549047 1508005 1467578
49954A467578m0710m0855m0084l8472l6414l4185l2087l0275k8196k5010k0869
$$ 1467578 1426868 1386013 1345929 1307457 1271043 1236858 1204771 1174496 1146300 1121290 1100421
49943A100421j7050j4520j3016j1886j0987j0293r376p991o615n717m991l841
$$ 1100421 1083371 1068851 1055835 1043949 1032962 1022669 1013293 1005302 998687 992970 987979 984138
49931I84138k270o04J123K869M148M640M944N865P190P997Q111Q386R403J0670
$$ 984138 981868 981264 982387 985256 989404 994044 998988 1004853 1012043 1020040 1028151 1036537 1045940 1056610
49917A056610J1523J2252J3789J6385J9174K1223K2818K5264K9328L4318L9104
$$ 1056610 1068133 1080385 1094174 1110559 1129733 1150956 1173774 1199038 1228366 1262684 1301788
49906A301788M3631M8811N5163O2430P0612Q0451R2525J06562J22202J39806J60024
$$ 1301788 1345419 1394230 1449393 1511823 1582435 1662886 1755411 1861973 1984175 2123981 2284005
49895B284005J82973K08228K35057K61922K85938L03298L10376L04704K85735
$$ 2284005 2466978 2675206 2910263 3172185 3458123 3761421 4071797 4376501 4662236
49886D662236K55457K18060J78694J42333J13191R3835Q4023Q0746P9680P6220
$$ 4662236 4917693 5135753 5314447 5456780 5569971 5663806 5747829 5828575 5908255 5984475
49876E984475O5370M2191L812m8945j11998j79301k43565k97333l35336l56103
$$ 5984475 6049845 6092036 6095848 6046903 5934905 5755604 5512039 5214706 4879370 4523267
49866D523267l61015l52386l33096l07045k78273k49322k21071j94047j69063
$$ 4523267 4162252 3809866 3476770 3169725 2891452 2642130 2421059 2227012 2057949
49857B057949j46786j27427j10878r6590q3612p1478o0884n2754m6818m1877l7176
$$ 2057949 1911163 1783736 1672858 1576268 1492656 1421178 1360294 1307540 1260722 1218845 1181669
49846A181669l2743k8572k4531k1067j8977j8224j7762j6845j5809j5236j5006
$$ 1181669 1148926 1120354 1095823 1074756 1055779 1037555 1019793 1002948 987139 971903 956897
49835I56897j4569j3722j2733j1956j1532j1372j1266j1113j0914j0544r743q659
$$ 956897 942328 928606 915873 903917 892385 881013 869747 858634 847720 837176 827433 818774
49823H18774p920p780p613o856o000n868o187n841m512l209k920l485m045m016
$$ 818774 810854 803074 795461 788605 782605 776737 770550 764709 760197 756988 754068 750583 746538 742522
49809G42522l350k397j701j545j503r74j37J67l24q17n53J93O41O19O47J082J677
$$ 742522 739172 736775 735074 733529 732026 731052 730915 731082 730758 729941 729388 729581 730222 730841 731488 732570 734247
49792G34247J976J880J661J511J267O78j32p85j283k089l338m338m304l381k424
$$ 734247 736223 738103 739764 741275 742542 743220 743088 742303 741020 738931 735593 731255 726951 723570 721146
49777G21146j948j812j784j862k005k039j971k003k169k217j940j410r00p14j022
$$ 721146 719198 717386 715602 713740 711735 709696 707725 705722 703553 701336 699396 697986 697086 696372 695350
49762F95350j612j971j828j435j074o96k83j92o58j241j364j140j109j379j625
$$ 695350 693738 691767 689939 688504 687430 686734 686451 686259 685601 684360 682996 681856 680747 679368 677743
49747F77743j712j722j518j032q41j638l087l930l473k336j536j404j630j851
$$ 677743 676031 674309 672791 671759 670918 669280 666193 662263 658790 656454 654918 653514 651884 650033
49733F50033j907j803j650j459j068m48N1J67J85M57O63K04q15j737k394l246
$$ 650033 648126 646323 644673 643214 642146 641698 641749 641916 642101 642558 643221 643425 642610 640873 638479 635233
49717F35233m312m893m578l871l425l214k812k055j092j87K98J56j92O5J080J961
$$ 635233 630921 626028 621450 617579 614154 610940 608128 606073 604981 604794 605092 605248 605056 605121 606201 608162
49701F08162J840R93M77R11J925K781L157L260L316L125K355J321J013J982L431
$$ 608162 610002 610995 611472 612383 614308 617089 620246 623506 626822 629947 632302 633623 634636 636618 640049
49686F40049L981L235K058J347J180J234J443J922K600L219L476L151K352J699
$$ 640049 644030 647265 649323 650670 651850 653084 654527 656449 659049 662268 665744 668895 671247 672946
49672F72946J873K890M053M654M512L938L471L576M239M905N186N394N983O703
$$ 672946 674819 677709 681762 686416 690928 694866 698337 701913 706152 711057 716243 721637 727620 734323
49658G34323O925O575O063N457M498L426K911L040L177L000K928L288L777M114
$$ 734323 741248 747823 753886 759343 763841 767267 770178 773218 776395 779395 782323 785611 789388 793502
49644G93502M487N039N550O008O833Q104R179R481R260R060Q922Q512P735O816
$$ 793502 797989 803028 808578 814586 821419 829523 838702 848183 857443 866503 875425 883937 891672 898488
49630H98488O042N656N660N634N191M690M870N658O085N692N253N577O365O911
$$ 898488 904530 910186 915846 921480 926671 931361 936231 941889 947974 953666 958919 964496 970861 977772
$$ [...]
##END NTUPLES=NMR SPECTRUM
##END=
