
##TITLE=AC1258_UGARS11075_7163997_x7UjD6Vp5X
##JCAMPDX= 6.0         $$ Bruker NMR JCAMP-DX V2.0
##DATA TYPE= NMR SPECTRUM
##DATA CLASS= NTUPLES
##ORIGIN= BRUKER
##OWNER= Administrator
$$ 1.72 TOPSPIN		Version 2.1
$$ 2013-01-29 22:56:06.484 -0500  Administrator@X
$$ Compression mode = diff/dup
##.OBSERVE FREQUENCY= 400.02188249412
##.OBSERVE NUCLEUS= ^1H
##.ACQUISITION MODE= SIMULTANEOUS (DQD)
##.ACQUISITION SCHEME= undefined
##.AVERAGES= 64
##.DIGITISER RES= 22
##SPECTROMETER/DATA SYSTEM= spect
##.PULSE SEQUENCE= noesygpps1d.comp
##.SOLVENT NAME= COFFEE_meoh
##.SHIFT REFERENCE= INTERNAL, COFFEE_meoh, 1, 14.96269
##AUDIT TRAIL= $$ (NUMBER, WHEN, WHO, WHERE, PROCESS, VERSION, WHAT)
$$ ##TITLE= Audit trail, TOPSPIN		Version 2.1
$$ ##JCAMPDX= 5.01
$$ ##ORIGIN= Bruker BioSpin GmbH
$$ ##OWNER= Administrator
$$ $$ E:\/data/COFFEE/nmr/AC1258_UGARS11075_7163997_x7UjD6Vp5X/22/pdata/1/auditp.txt
$$ ##AUDIT TRAIL=  $$ (NUMBER, WHEN, WHO, WHERE, PROCESS, VERSION, WHAT)
(   1,<2013-01-29 22:56:00.562 -0500>,<Administrator>,<X>,<go>,<TOPSPIN 2.1>,
      <created by zg
	started at 2013-01-29 22:44:30.530 -0500,
	POWCHK enabled, PULCHK disabled,
       configuration hash MD5:
       86 BA 57 50 F2 9D 5C 9B 26 00 A9 28 5F 66 2E 89
       data hash MD5: 64K
       A2 2C A2 CC 5C 7F 24 5D 44 25 98 D9 AA 88 4E DD>)
(   2,<2013-01-29 22:56:03.655 -0500>,<Administrator>,<X>,<proc1d>,<TOPSPIN 2.1>,
      <Start of raw data processing
       efp LB = 0.3 FT_mod = 6 PKNL = 1 PHC0 = 0 PHC1 = 0 SI = 128K 
       data hash MD5: 128K
       7D F5 C6 FC 2E 57 A9 DB 1C 95 9A C0 CD B3 4D EA>)
(   3,<2013-01-29 22:56:04.734 -0500>,<Administrator>,<X>,<proc1d>,<TOPSPIN 2.1>,
      <pk PHC0 = -78.92578 PHC1 = 0 
       data hash MD5: 128K
       E3 23 76 ED 99 8D 08 F7 0A B8 09 8C BA D2 8A 2A>)
(   4,<2013-01-29 22:56:05.421 -0500>,<Administrator>,<X>,<proc1d>,<TOPSPIN 2.1>,
      <abs ABSG = 1 
       data hash MD5: 128K
       D7 EC F9 5C 85 70 40 44 A0 25 EC 9F 77 4C DA DF>)
(   5,<2013-01-29 22:56:05.609 -0500>,<Administrator>,<X>,<proc1d>,<TOPSPIN 2.1>,
      <abs ABSG = 2 
       data hash MD5: 128K
       33 E2 9D 1A 5E 31 A2 55 CD EA 99 0C 86 16 D0 1B>)
(   6,<2013-01-29 22:56:05.765 -0500>,<Administrator>,<X>,<proc1d>,<TOPSPIN 2.1>,
      <abs ABSG = 3 
       data hash MD5: 128K
       DF EA 3E 35 A0 50 91 78 2E AA 32 D4 29 A3 05 08>)
(   7,<2013-01-29 22:56:05.968 -0500>,<Administrator>,<X>,<proc1d>,<TOPSPIN 2.1>,
      <abs ABSG = 4 
       data hash MD5: 128K
       30 14 57 7A E4 DF 7C 3B 95 36 BE D5 AC 2C 80 50>)
(   8,<2013-01-29 22:56:06.155 -0500>,<Administrator>,<X>,<proc1d>,<TOPSPIN 2.1>,
      <abs ABSG = 5 
       data hash MD5: 128K
       63 B1 7F 1C 47 9F 44 4A 7D 75 7D DB 27 18 C6 5B>)
$$ ##END=
$$ 
$$ $$ hash MD5
$$ $$ 62 B6 7C 3C 34 80 5E 35 F7 0A 08 86 1E C4 20 D2
##$RELAX= 
##$RELAX= 
##$RELAX= 
##$RELAX= 
##$RELAX= 
##$RELAX= 
##$RELAX= 
##$RELAX= 
$$ Bruker specific parameters
$$ --------------------------
##$DU= <E:\>
##$EXPNO= 22
$$ [...]
150 150 150 150 150 150 150 150
##$TP07= 0
##$TPNAME0= <>
##$TPNAME1= <>
##$TPNAME2= <>
##$TPNAME3= <>
##$TPNAME4= <>
##$TPNAME5= <>
##$TPNAME6= <>
##$TPNAME7= <>
##$TPOAL= (0..7)
0.5 0.5 0.5 0.5 0.5 0.5 0.5 0.5
##$TPOFFS= (0..7)
0 0 0 0 0 0 0 0
##$TUNHIN= 0
##$TUNHOUT= 0
##$TUNXOUT= 0
##$USERA1= <user>
##$USERA2= <user>
##$USERA3= <user>
##$USERA4= <user>
##$USERA5= <user>
##$V9= 5
##$VALIST= <valist>
##$VCLIST= <CCCCCCCCCCCCCCC>
##$VD= 0
##$VDLIST= <DDDDDDDDDDDDDDD>
##$VPLIST= <PPPPPPPPPPPPPPP>
##$VTLIST= <TTTTTTTTTTTTTTT>
##$WBST= 1024
##$WBSW= 4
##$XGAIN= (0..3)
0 0 0 0
##$XL= 0
##$YL= 0
##$YMAX_a= 8756724
##$YMIN_a= -18557495
##$ZGOPTNS= <>
##$ZL1= 120
##$ZL2= 120
##$ZL3= 120
##$ZL4= 120
##$ABSF1= 14.96269
##$ABSF2= -5.595491
##$ABSG= 5
##$ABSL= 3
##$ALPHA= 0
##$AQORDER= 0
##$ASSFAC= 0
##$ASSFACI= 0
##$ASSFACX= 0
##$ASSWID= 0
##$AUNMP= <proc_prof1d_extract.lims>
##$AXLEFT= 0
##$AXNAME= <>
##$AXNUC= <1H>
##$AXRIGHT= 0
##$AXTYPE= 0
##$AXUNIT= <>
##$AZFE= 0.1
##$AZFW= 0.1
##$BCFW= 0
##$BC_mod= 0
##$BYTORDP= 0
##$COROFFS= 0
##$CY= 15
##$DATMOD= 1
##$DC= 0
##$DFILT= <>
##$DTYPP= 0
##$F1P= 0
##$F2P= 0
##$FCOR= 0.5
##$FTSIZE= 131072
##$FT_mod= 6
##$GAMMA= 0
##$GB= 0
##$INTBC= 1
##$INTSCL= 1
##$ISEN= 128
##$LB= 0.3
##$LEV0= 0
##$LPBIN= 0
##$MAXI= 10000
##$MC2= 0
##$MEAN= 0
##$ME_mod= 0
##$MI= 0
##$NCOEF= 0
##$NC_proc= -2
##$NLEV= 6
##$NOISF1= 0
##$NOISF2= 0
##$NSP= 0
##$NTH_PI= 0
##$NZP= 0
##$OFFSET= 14.96269
##$PC= 1
##$PHC0= -78.92578
##$PHC1= 0
##$PH_mod= 1
##$PKNL= yes
##$PPARMOD= 0
##$PPDIAG= 0
##$PPIPTYP= 0
##$PPMPNUM= 2147483647
##$PPRESOL= 1
##$PSCAL= 4
##$PSIGN= 0
##$PYNMP= <proc.py>
##$REVERSE= no
##$SF= 400.02000896079
##$SI= 131072
##$SIGF1= 0
##$SIGF2= 0
##$SINO= 400
##$SIOLD= 131072
##$SPECTYP= <>
##$SREGLST= <1H.CDCl3>
##$SSB= 0
##$STSI= 131072
##$STSR= 0
##$SW_p= 8223.68421052631
##$SYMM= 0
##$S_DEV= 0
##$TDeff= 65536
##$TDoff= 0
##$TI= <>
##$TILT= no
##$TM1= 0
##$TM2= 0
##$TOPLEV= 0
##$USERP1= <user>
##$USERP2= <user>
##$USERP3= <user>
##$USERP4= <user>
##$USERP5= <user>
##$WDW= 1
##$XDIM= 131072
##$YMAX_p= 437328587
##$YMIN_p= -35284
##$CURPLOT= <Network HP LaserJet P1505>
##$CURPRIN= <$Network HP LaserJet P1505>
##$DFORMAT= <normdp>
##$LAYOUT= <+/1D_H.xwp>
##$LFORMAT= <normlp>
##$PFORMAT= <normpl>
##$SURQMSG= 1
$$ End of Bruker specific parameters
$$ ---------------------------------
##NTUPLES= NMR SPECTRUM
##VAR_NAME=  FREQUENCY,     SPECTRUM/REAL,   SPECTRUM/IMAG
##SYMBOL=    X,             R,               I
##VAR_TYPE=  INDEPENDENT,   DEPENDENT,       DEPENDENT
##VAR_FORM=  AFFN,          ASDF,            ASDF
##VAR_DIM=   131072,        131072,          131072
##UNITS=     HZ,            ARBITRARY UNITS, ARBITRARY UNITS
##FACTOR=    0.0627417313425164, 1,          1
##FIRST=     8223.62146879497, -656,         -74132
##LAST=      0,             124,             -74294
##MIN=       0,             -35284,          0
##MAX=       8223.62146879497, 437328587,    0
$$ Real data points
##PAGE= N=1
##DATA TABLE= (X++(R..R)), XYDATA
$$ [...]
63392H53368k5839k6327k5454k3988k2366k0582j8696j6798j4718j2323r860p643
$$ 853368 827529 801202 775748 751760 729394 708812 690116 673318 658600 646277 636417 628774
63380F28774n595l527j552R5J444K684L875N054O268P369Q155Q923J0360J2555
$$ 628774 623179 619652 618100 618195 619639 622323 626198 631252 637520 644889 653044 661967 672327 684882
63366F84882J4639J5800J6245J6816J8069K0110K2750K5372K7083K7611K7665
$$ 684882 699521 715321 731566 748382 766451 786561 809311 834683 861766 889377 917042
63355I17042K7932K8119K7435K5596K2744J8738J3317O809J45n759j0312j3264
$$ 917042 944974 973093 1000528 1026124 1048868 1067606 1080923 1087732 1087877 1082118 1071806 1058542
63343A058542j4905j5974j6874j7293j7043j6826j7494j8829j9874k0378k1086
$$ 1058542 1043637 1027663 1010789 993496 976453 959627 942133 923304 903430 883052 861966
63332H61966k2568k4425k5863k6520k6501k6012k5162k3958k2389k0602j8899
$$ 861966 839398 814973 789110 762590 736089 710077 684915 660957 638568 617966 599067
63321E99067j7417j5999j4547j3246j2234j1340j0434r654q975q004o698n773
$$ 599067 581650 565651 551104 537858 525624 514284 503850 494196 485221 477217 470519 464746
63309D64746n781o195o127n686n768o600p388p485p124o789o526o147n655n218
$$ 464746 458965 452770 446643 440957 435189 428589 421201 413716 406592 399803 393277 387130 381475 376257
63295C76257n023n200n575n575m913m209m298m902m778l451k039j860k767l470
$$ 376257 371234 366034 360459 354884 349971 345762 341464 336562 331784 328333 326294 324434 321667 318197
63281C18197l165k251j471r80m53K07O00L64k53o17m63j55p8j08NR6j17m51m67
$$ 318197 315032 312781 311310 310330 309877 310084 310684 311048 310795 310178 309715 309560 309482 309374 309379 309475 309358 308907 308440
63262C08440j78n0k68n51o42o16o00n92n77n29l23K7K08K6j65K7L53L61M12J304
$$ 308440 308262 308212 307944 307393 306751 306135 305535 304943 304366 303837 303514 303541 303749 303775 303610 303637 303990 304351 304763 306067
63242C06067K870L870L634K953K863L237L249K653J939J531J481J700K019K223
$$ 306067 308937 312807 316441 319394 322257 325494 328743 331396 333335 334866 336347 338047 340066 342289
63228C42289K519L557N499P328P821P067O333O475P143P630P781P731P355O372
$$ 342289 344808 348365 353864 361192 369013 376080 382413 388888 396031 403661 411442 419173 426528 432900
63214D32900M785K861R20o21j372j450j617k434l358l241j802j57M34j8m66l01
$$ 432900 437685 440546 441466 440845 439473 438023 436406 433972 430614 427373 425571 425414 425848 425830 425364 425063
63198D25063P7J75K39P57J497J769J537J606K487L627M164M063L999M331M789
$$ 425063 425140 425315 425554 426311 427808 429577 431114 432720 435207 438834 442998 447061 451060 455391 460180
63183D60180N192N845O991Q330R427J0314J1245J2042J2264J2003J2021J2815
$$ 460180 465372 471217 478208 486538 495965 506279 517524 529566 541830 553833 565854 578669
63171E78669J3946J4603J4481J3867J3114J2466J2151J2134J1846J0679Q828P139
$$ 578669 592615 607218 621699 635566 648680 661146 673297 685431 697277 707956 716784 723923
63159G23923O042N136L991K787J855J042k8j461l218n390p881j0152j1785j2997
$$ 723923 729965 735101 739092 741879 743734 744776 744748 743287 740069 734679 726798 716646 704861 691864
63145F91864j4115j4803j4457j3260j2089j1439j1055j0705j0497j0310r598q180
$$ 691864 677749 662946 648489 635229 623140 611701 600646 589941 579444 569134 559536 551356
63133E51356o639n483m493l333k295j774j398m32J069K260K676K710K815K856
$$ 551356 544717 539234 534741 531408 529113 527339 525941 525509 526578 528838 531514 534224 537039 539895
63119E39895K601K358K565L033L104K554J929J885K463L186L668L930M167M430
$$ 539895 542496 544854 547419 550452 553556 556110 558039 559924 562387 565573 569241 573171 577338 581768
63105E81768M532M280L738L302L390M004M692N004M881M482L826K849J729P48
$$ 581768 586300 590580 594318 597620 601010 605014 609706 614710 619591 624073 627899 630748 632477 633225
63091F33225k15j683l763n682o500o221n864o301p244p532o364m186k301j590
$$ 633225 633010 631327 627564 621882 615382 609161 603297 596996 589752 582220 575856 571670 569369 567779
63077E67779j677j416j73J643L234M318N185O174P358Q554R422R647R334R030
$$ 567779 566102 564686 564513 566156 569390 573708 578893 585067 592425 600979 610401 620048 629382 638412
63063F38412R122R289Q874P712O245M908L784K794J808N04j377l516n124n885
$$ 638412 647534 656823 665697 673409 679654 684562 688346 691140 692948 693452 692075 688559 683435 677550
63049F77550o383p304q498r333r664r916j0264j0294r713q891q339p980p382o550
$$ 677550 671167 663863 655365 646032 636368 626452 616188 605894 596181 587290 578951 570971 563589 557039
63035E57039o004o036o312o335n965n284m318l229k471k344k498k354j966j974
$$ 557039 551035 544999 538687 532352 526387 521103 516785 513556 511085 508741 506243 503889 501923 499949
63021D99949k583l122k860j892r26l67m4L00O18O87M44P5j43k1M91J357K515L811
$$ 499949 497366 494244 491384 489492 488566 488199 488155 488455 489073 489760 490204 490279 490136 490115 490606 491963 494478 498289
63003D98289N020O026O908P724Q357Q819R435J0421J1389J1850J2061J2800J4252
$$ 498289 503309 509335 516243 523967 532324 541143 550578 560999 572388 584238 596299 609099 623351
62990F23351J5772J6810J7381J7433J6641J5232J4159J3769J3065J1193R060Q300
$$ 623351 639123 655933 673314 690747 707388 722620 736779 750548 763613 774806 783866 792166
62978G92166Q881Q962P177M078J048j296l281n436q093j1266j4566j7552k0309
$$ 792166 801047 810009 817186 821264 822312 821016 817735 812299 804206 792940 778374 760822 740513
62965G40513k3172k5768k6998k6429k5097k4388k4446k4340k3445k2054k0641
$$ 740513 717341 691573 664575 638146 613049 588661 564215 539875 516430 494376 473735
62954D73735j9219j7627j5986j4600j3558j2674j1713j0569r309q218p601p447
$$ 473735 454516 436889 420903 406303 392745 380071 368358 357789 348480 340262 332661 325214
62942C25214p285o617n509m482l812l246k557k084k262k827l088k928k911l177
$$ 325214 317929 311312 305803 301321 297509 294263 291706 289622 287360 284533 281445 278517 275606 272429
62928B72429k953j671k3P39L21m38q11r24j088j109n97K60P73N79J29Q9M02L27
$$ 272429 269476 267805 267782 268521 268842 268404 267593 266669 265581 264472 263875 264135 264908 265487 265616 265705 266107 266434
62910B66434m98j425j658j371j336j561j277l74J77j73n27J49J414J966J439O81
$$ 266434 265936 264511 262853 261482 260146 258585 257308 256934 257111 256938 256411 256560 257974 259940 261379 262060
62894B62060M75Q70J564K136J997R54j86l61M83J411J746J581J196P32M11L24
$$ 262060 262535 263405 264969 267105 269102 270056 269870 269509 269992 271403 273149 274730 275926 276658 277069 277393
62878B77393J69j74m5J073K372K664K333K895M509N578N269M811N383O232O108
$$ 277393 277562 277388 277343 278416 280788 283452 285785 288680 293189 298767 304036 308847 314230 320462 326570
62863C26570N405N376O000O169N523M677L830K443M42j428k659l476m016l981
$$ 326570 331975 337351 343351 349520 355043 359720 363550 365993 366435 365007 362348 358872 354856 350875
62849C50875l382k907l106l704m121m236m262m275m240m281m517m753m579l814
$$ 350875 347493 344586 341480 337776 333655 329419 325157 320882 316642 312361 307844 303091 298512 294698
62835B94698k757j972j867k396l131l597l609l314k979k738k482j991j270o98
$$ 294698 291941 289969 288102 285706 282575 278978 275369 272055 269076 266338 263856 261865 260595 259897
62821B59897p24j431k479l430l907l613k585j425q85j093j532j770j868j933j777
$$ 259897 259173 257742 255263 251833 247926 244313 241728 240303 239418 238325 236793 235023 233155 231222 229445
62806B29445j269o41j84J04L20L91K82J88K44K87J19j86m29n56n86n41n71q52
$$ 229445 228176 227535 227351 227455 227775 228166 228448 228636 228880 229167 229286 229100 228671 228115 227529 226988 226417 225565
62788B25565j207j150n75J1J14j64m44n97o85o68n27l93k78O7O84J144J109Q94
$$ 225565 224358 223208 222633 222644 222758 222594 222150 221553 220868 220200 219673 219280 219002 219069 219753 220897 222006 222900
62770B22900J017J392J441R62M74N66J150J502J029Rn87j78P38J272J367J709
$$ 222900 223917 225309 226750 227712 228186 228752 229902 231404 232433 232442 231855 231677 232415 233687 235054 236763
62754B36763K522L226L441L542L809L838L330K791K763K884K496J778J434J492
$$ 236763 239285 242511 245952 249494 253303 257141 260471 263262 266025 268909 271405 273183 274617 276109
62740B76109J258M36m48q01o91o89j284k420l373l314k341j591j887k708l105
$$ 276109 277367 277803 277355 276554 275863 275174 273890 271470 268097 264783 262442 260851 258964 256256 253151
62725B53151l165l711m696m969l826k032q61p36j150j437j321r00m98l80m38k37
$$ 253151 249986 246275 241579 236610 232784 230752 229891 229155 228005 226568 225247 224347 223849 223469 223031 222794
62709B22794N44J792L050L800L842L557L637M310N031N238N159N452O255P110
$$ 222794 223338 225130 228180 231980 235822 239379 243016 247326 252357 257595 262754 268206 274461 281571
62695B81571P830Q750J0038J1305J2225J3139J4646J6806J9065K0936K2472K4053
$$ 281571 289401 298151 308189 319494 331719 344858 359504 376310 395375 416311 438783 462836
62683D62836K5876K7793K9528L0837L1433L1096L0065K8949K7831K5665K1292
$$ 462836 488712 516505 546033 576870 608303 639399 669464 698413 726244 751909 773201
62672G73201J5016Q473K809k266p351j2197j6263j9672k2822k5525k7338k8406
$$ 773201 788217 796690 799499 797233 789882 777685 761422 741750 718928 693403 666065 637659
62660F37659k9133k9282k8300k6400k4539k3251k2194k0973j9731j8694j7603
$$ 637659 608526 579244 550944 524544 500005 476754 454560 433587 413856 395162 377559
62649C77559j5955j3662j1344r931r736r915r242p629o290o060o285n987n394
$$ 377559 361604 347942 336598 326667 316931 307016 297774 290145 283855 277795 271510 265523 260129
62636B60129n364n757n638m824m101l817l405k527j667j286j233j283j505j815
$$ 260129 254765 249008 243370 238546 234445 230628 227223 224696 223029 221743 220510 219227 217722 215907
62622B15907j844j589j555j891k120j931j634j444j074m52j19l37m68J42J097
$$ 215907 214063 212474 210919 209028 206908 204977 203343 201899 200825 200373 200254 199917 199449 199591 200688
62607B00688J496J162O92M58K74l9k33kO29J343J829J961J857J736J752J939K293
$$ 200688 202184 203346 204038 204496 204770 204731 204498 204496 205125 206468 208297 210258 212115 213851 215603 217542 219835
62590B19835K762L108L013K396J636J372J990L144L855L387K176J437J729K324
$$ 219835 222597 225705 228718 231114 232750 234122 236112 239256 243111 246498 248674 250111 251840 254164
62576B54164K317J746J094L56o45j400j245n55m57j282k199k470k195j714j130
$$ 254164 256481 258227 259321 259677 259032 257632 256387 255832 255375 254093 251894 249424 247229 245515 244385
62561B44385o55o19q73r16p65r55j435j393n55J75l4p88j096n84L76J205J351
$$ 244385 243730 243111 242238 241322 240557 239602 238167 236774 236219 236394 236360 235572 234476 233892 234268 235473 236824
62544B36824N35p39j455j294j022j259j558j255n67j75j42oM24R73J486J745J415
$$ 236824 237359 236620 235165 233871 232849 231590 230032 228777 228210 228035 227893 227887 228311 229284 230770 232515 233930
62527B33930O11J70O82J598J960J695J535J904K546L061L237K981K548K633L621
$$ 233930 234541 234711 235393 236991 238951 240646 242181 244085 246631 249692 252929 255910 258458 261091 264712
62512B64712M904N596N755O229P335Q472R110R440R904J0683J1874J3554J5384
$$ 264712 269616 275212 280967 287196 294531 303003 312113 321553 331457 342140 354014 367568 382952
62499C82952J6665J7168J7460J8092J8810J8970J8421J7438J5954J3555J0353
$$ 382952 399617 416785 434245 452337 471147 490117 508538 525976 541930 555485 565838
62488E65838P244M784K248j484o188j0207j2297j2906j3225j3657j3914j4049
$$ 565838 573082 577866 580114 578630 572442 562235 549938 537032 523807 510150 496236 482187
62476D82187j4347j4401j3377j1326r347q210p643p212p011p027o667n583m355
$$ 482187 467840 453439 440062 428736 419389 411179 403536 396324 389313 382286 375619 370036 365681
62463C65681l704l485l031k137j109k45K60K33j54k98J08O22P23N67O41J001J382
$$ 365681 361977 358492 355461 353324 352215 351970 352230 352463 352309 352011 352119 352741 353464 354031 354672 355673 357055
62446C57055J687J870J744J405J454K185K937K832J873P34k11r52j357j302j156
$$ 357055 358742 360612 362356 363761 365215 367400 370337 373169 375042 375776 375565 374613 373256 371954 370798
62431C70798j447k160k877l390l641l370k526j712j462j381p24L47R98J049J179
$$ 370798 369351 367191 364314 360924 357283 353913 351387 349675 348213 346832 346108 346455 347453 348502 349681
62416C49681J872K973M252N524O231N882N077N154O509Q110Q991R339R746J0250
$$ 349681 351553 354526 358778 364302 370533 376415 381492 386646 393155 401265 410256 419595 429341 439591
62402D39591J0662J1188J2014J2738J2766J2058J1048J0084R278Q617P865O686
$$ 439591 450253 461441 473455 486193 498959 511017 522065 532149 541427 550044 557909 564595
62390E64595N069L427K076Q81l78j646k727l446l548k820j444P8J475K722L611
$$ 564595 569664 573091 575167 576048 575670 574024 571297 567851 564303 561483 560039 560117 561592 564314 567925
62375E67925L888M022N012P077R259J0799J2197J4198J6459J8134J9481K1755
$$ 567925 571813 575835 580847 587924 597183 607982 620179 634377 650836 668970 688451 710206
62363G10206K5493K9787L3542L6760M0192M4183M8306N1985N5130N8094O1018
$$ 710206 735699 765486 799028 835788 875980 920163 968469 1020454 1075584 1133678 1194696
62352A194696O3303O3922O2278N8542N3004M5477L5732K4342J2572J429q788j8062
$$ 1194696 1257999 1321921 1384199 1442741 1495745 1541222 1576954 1601296 1613868 1615297 1606509 1588447
62340A588447k6213l3034l8534m2883m6302m9021n1111n2281n2143n0764m8644
$$ 1588447 1562234 1529200 1490666 1447783 1401481 1352460 1301349 1249068 1196925 1146161 1097517
62329A097517m6072m2807l8629l3911k9378k5474k2180j9312j6735j4376j2221
$$ 1097517 1051445 1008638 970009 936098 906720 881246 859066 839754 823019 808643 796422
62318G96422j0265q347o176l725j413L56J666K799L672M038M153M659N651O428
$$ 796422 786157 777810 771634 767909 766496 766852 768518 771317 774989 779027 783180 787839 793490 799918
62304G99918O340N485M284K960J758J181J362J542R50m0l12M47J397J816J952
$$ 799918 806258 811743 816027 818987 820745 821926 823288 824830 825780 825740 825428 825875 827272 829088 831040
62289H31040K364L110L972N008O307P524Q193Q369Q590R240J0251J1275J1982
$$ 831040 833404 836514 840486 845494 851801 859325 867518 875887 884477 893717 903968 915243 927225
62276I27225J2302J2556J3193J4208J5099J5568J6039J7188J9156K1452K3470
$$ 927225 939527 952083 965276 979484 994583 1010151 1026190 1043378 1062534 1083986 1107456
62265A107456K4900K5866K6932K8823L1845L5591L9426M3114M6934N1306N6467
$$ 1107456 1132356 1158222 1185154 1213977 1245822 1281413 1320839 1363953 1410887 1462193 1518660
62254A518660O2174O7650P2025P4976P6569P6379P3366O6993N7913M7101L4763
$$ 1518660 1580834 1648484 1720509 1795485 1872054 1948433 2021799 2088792 2146705 2193806 2228569
62243B228569K0901O599o171j6122k3419k8877l3051l6298l8949m1013m2000m1482
$$ 2228569 2249470 2256069 2249898 2233776 2210357 2181480 2148429 2112131 2073182 2032169 1990169 1948687
62231A948687l9654l7118l4279l1080k7306k2931j8246j3676r470n560j793J742
$$ 1948687 1909033 1871915 1837636 1806556 1779250 1756319 1738073 1724397 1714927 1709367 1707574 1709316
62219A709316M730O926Q408R586J0964J2775J4749J6374J7456J8250J9037J9872
$$ 1709316 1714046 1720972 1729380 1738966 1749930 1762705 1777454 1793828 1811284 1829534 1848571 1868443
62207A868443K0817K2063K3584K5017K6182K7410K9060L0955L2711L4318L6003
$$ 1868443 1889260 1911323 1934907 1959924 1986106 2013516 2042576 2073531 2106242 2140560 2176563
62196B176563L7720L9274M0818M2769M5204M7702M9763N1234N2308N3330N4434
$$ 2176563 2214283 2253557 2294375 2337144 2382348 2430050 2479813 2531047 2583355 2636685 2691119
62185B691119N5300N5462N4910N4002N2634N0074M5963M0874L5445K9582K3203
$$ 2691119 2746419 2801881 2856791 2910793 2963427 3013501 3059464 3100338 3135783 3165365 3188568
62174C188568J7237J2924J0440R193R128J0749J3905J7709K1784K6609L2281L7909
$$ 3188568 3205805 3218729 3229169 3238362 3247490 3258239 3272144 3289853 3311637 3338246 3370527 3408436
62162C408436M2592M6257M9002N0335M9660M6972M2551L6446K8792K0339J2065
$$ 3408436 3451028 3497285 3546287 3596622 3646282 3693254 3735805 3772251 3801043 3821382 3833447
62151C833447M447k527q813j4283j9039k3371k7334l0664l3213l5216l6985l8360
$$ 3833447 3837894 3835367 3826554 3812271 3793232 3769861 3742527 3711863 3678650 3643434 3606449 3568089
62139C568089l8682l7448l4970l2123k9453k6873k4300k2160k0848k0089j9256
$$ 3568089 3529407 3491959 3456989 3424866 3395413 3368540 3344240 3322080 3301232 3281143 3261887
62128C261887j8085j6645j4955j3130j1596j0583r579q026o257n018m257l254
$$ 3261887 3243802 3227157 3212202 3199072 3187476 3176893 3167314 3159288 3153031 3148013 3143756 3140502
62116C140502j927j101j288k042k769l524m703o477q767j1322j3694j5627j7401
$$ 3140502 3138575 3137474 3136186 3134144 3131375 3127851 3123148 3116671 3107904 3096582 3082888 3067261 3049860
62103C049860j9292k0760k1029k0446k0297k1081k1871k1723k0855k0007j9474
$$ 3049860 3030568 3009808 2988779 2968333 2948036 2926955 2905084 2883361 2862506 2842499 2823025
62092B823025j9180j8948j8249j6481j3929j1725j0391r251p701o167n073l880
$$ 2823025 2803845 2784897 2766648 2750167 2736238 2724513 2714122 2704871 2697170 2691003 2685930 2682050
62080B682050k009j6J183J701K303L147L811M196M413M127K979J415J90p35j896
$$ 2682050 2680041 2680025 2681208 2682909 2685212 2688359 2692170 2696366 2700779 2704906 2707885 2709300 2709490 2708755 2706859
62065B706859l145l829m093m891o440p553o953m652j739N92J476L06l269r295
$$ 2706859 2703714 2699885 2695792 2690901 2684461 2676908 2669955 2665303 2663564 2664156 2665632 2665938 2662669 2653374
62051B653374j7468k6947l6369m4362n0122n3404n4344n3753n3291n4507n7654
$$ 2653374 2635906 2608959 2572590 2528228 2478106 2424702 2370358 2316605 2263314 2208807 2151153
62040B151153o1785o5878o9260p1123p0522o7209o1995n6046n0069m4275l8667
$$ 2151153 2089368 2023490 1954230 1883107 1812585 1745376 1683381 1627335 1577266 1532991 1494324
62029A494324l3187k7932k3371k0088j8317j7939j8865k0870k3159k4777k5587
$$ 1494324 1461137 1433205 1409834 1389746 1371429 1353490 1334625 1313755 1290596 1265819 1240232
62018A240232k6283k7174k7546k6562k4373k1819j9340j6674j3460r758n879k035
$$ 1240232 1213949 1186775 1159229 1132667 1108294 1086475 1067135 1050461 1037001 1027243 1021364 1019329
62006A019329J801N797J0028J4315J8397K2235K5921K9135L0973L0614K7991K3607
$$ 1019329 1021130 1026927 1036955 1051270 1069667 1091902 1117823 1146958 1177931 1208545 1236536 1260143
61994A260143J7667R868J03j0821k1447l0597l7869m3326m6957m8557m7976m5365
$$ 1260143 1277810 1287678 1287781 1276960 1255513 1224916 1187047 1143721 1096764 1048207 1000231 954866
61982I54866m1292l6655l2275k8377k4647k0934j7628j5057j2834j0361p784n852
$$ 954866 913574 876919 844644 816267 791620 770686 753058 738001 725167 714806 707022 701170
61970G01170m735l685k112m42N71R41J404K506M134N831P274Q532J0001J1959
$$ 701170 696435 692750 690638 690196 690767 691708 693112 695618 699752 705583 712857 721389 731390 743349
61956G43349J4190J6215J7975J9868K2140K4701K7661L1412L5959M0752M5580
$$ 743349 757539 773754 791729 811597 833737 858438 886099 917511 953470 994222 1039802
61945A039802N1009N7480O4495P1229P7384Q2889Q7321R0379R2410R3702R3706
$$ 1039802 1090811 1148291 1212786 1284015 1361399 1444288 1531609 1621988 1714398 1808100 1901806
61934A901806R1842Q8767Q5741Q2871P8960P3172O5896N7838M9140L9653K9425
$$ 1901806 1993648 2082415 2168156 2251027 2329987 2403159 2469055 2526893 2576033 2615686 2645111
61923B645111J8810Q760R50l152l440o13N468J5735L0068M6709O4140Q2324J01358
$$ 2645111 2663921 2672681 2673631 2670479 2667039 2666426 2671894 2687629 2717697 2764406 2828546 2910870 3012228
61910C012228J20007J36760J51460J64714J76178J84965J91606J98344K07159
$$ 3012228 3132235 3268995 3420455 3585169 3761347 3946312 4137918 4336262 4543421
61901D543421K18571K32463K48905K67285K85104K98127L01328K89592K58459
$$ 4543421 4761992 4994455 5243360 5510645 5795749 6093876 6395204 6684796 6943255
61892F943255K05452J31316M0277o0453j61488k52960l27027l79711m10633m21624
$$ 6943255 7148707 7280023 7320300 7259847 7098359 6845399 6518372 6138661 5728028 5306404
61882E306404m15852l97614l71572l41447l09494k77113k45486k15609j88178
$$ 5306404 4890552 4492938 4121366 3779919 3470425 3193312 2947826 2732217 2544039
61873B544039j63713j42314j23271j05512q8714p3543o0433m8713l7442k6477
$$ 2544039 2380326 2238012 2114741 2009229 1920515 1846972 1786539 1737826 1700384 1673907
61863A673907j6069n839M918J6128K7065L7567M8288N9683P1576Q3785R6269J08387
$$ 1673907 1657838 1651999 1656917 1673045 1700110 1737677 1785965 1845648 1917224 2001009 2097278 2205665
61851B205665J18946J27431J34359J39875J42746J41500J35868J26357J13030
$$ 2205665 2324611 2452042 2586401 2726276 2869022 3010522 3146390 3272747 3385777
61842C385777R5725P5213N3143L0883R253j0546k6599l7186m1695m0523l4528
$$ 3385777 3481502 3556715 3609858 3640741 3649994 3639448 3612849 3575663 3533968 3493445 3458917
61831C458917k4733j2332J189J3939K3964K9938L1299K7562J8073K971j6079l6846
$$ 3458917 3434184 3421852 3423041 3436980 3460944 3490882 3522181 3549743 3567816 3570787 3554708 3517862
61819C517862n8004p9016r8829j15678j28235j36310j40324j40739j38135j33131
$$ 3517862 3459858 3380842 3282013 3166335 3038100 2901790 2761466 2620727 2482592 2349461
61809B349461j26004j16844j06224r5143q4281p3697o3364n3451m3988l4889k6374
$$ 2349461 2223457 2106613 2000389 1905246 1820965 1747268 1683904 1630453 1586465 1551576 1525202
61798A525202j8807j2051n606N56N989J0745J5518K0558K5308K9620L4521M1118
$$ 1525202 1506395 1494344 1488738 1489294 1495283 1506028 1521546 1542104 1567412 1597032 1631553 1672671
61786A672671M9417N8872O9440Q1345R4293J07864J22466J39108J58388J80409
$$ 1672671 1722088 1780960 1850400 1931745 2026038 2133902 2256368 2395476 2553864 2734273
61776B734273K05467K34054K66256L01953L41694L86499M36564M90560N46123
$$ 2734273 2939740 3173794 3440050 3742003 4083697 4470196 4906760 5397320 5943443
61767E943443N99961O46978O79829O89972O69080O10084N08745L66403J91808
$$ 5943443 6543404 7190382 7870211 8560183 9229263 9839347 10348092 10714495 10906303
61758A0906303j64j92139l67483n12326o17531o80486p04899o98047o67788o21519
$$ 10906303 10906139 10714000 10346517 9834191 9216660 8536174 7831275 7133228 6465440 5843921
61748E843921n66331n08455m52100l99260l50759l07166k68693k34956k05304
$$ 5843921 5277590 4769135 4317035 3917775 3567016 3259850 2991157 2756201 2550897
61739B550897j79338j56937j37882j21627j07339r4200q1799p0206n9488m9343
$$ 2550897 2371559 2214622 2076740 1955113 1847774 1753574 1671775 1601569 1542081 1492738
61729A492738l9579l0726k3545j7976j3345r802q676j0805j5251k0333k5373l0584
$$ 1492738 1453159 1422433 1398888 1380912 1367567 1357765 1349089 1338284 1323033 1302700 1277327 1246743
61717A246743l5682l9759m2465m4238m5206m4728m2489l9214l5870l2611k9107
$$ 1246743 1211061 1171302 1128837 1084599 1039393 994665 952176 912962 877092 844481 815374
61706H15374k5366k1778j8619j6025j4258j3477j3374j3404j3302j3042j2480
$$ 815374 790008 768230 749611 733586 719328 705851 692477 679073 665771 652729 640249
61695F40249j1502j0494j0118j0463j0867j0822j0670j0959j1416j1201j0109
$$ 640249 628747 618253 608135 597672 586805 575983 565313 554354 542938 531737 521628
61684E21628q919q288p912p211o377o083o350o428n796m716l752l232l277l724
$$ 521628 512709 504421 496509 489298 482921 476838 470488 464060 458264 453548 449796 446564 443287 439563
61670D39563m008l621k814k243j861r85L90J342J517J831K982M259M769M885N386
$$ 439563 435555 431934 429120 426877 425016 424031 424421 425763 427280 429111 432093 436352 441121 446006 451392
61655D51392N935N846N804P224J0018J2624J4256J5662J7310J8388J8220J7340
$$ 451392 457327 463173 468977 476201 486219 498843 513099 528761 546071 564459 582679 600019
61643F00019J6345J4799J2158Q899N798K839j61k491l211k534j502m23J437M548
$$ 600019 616364 631163 643321 652220 658018 660857 660696 658205 654994 652460 650958 650535 651972 656520
61629F56520Q360J1995J4993J7122J7903J6810J3798R325L834k604r916j7285
$$ 656520 664880 676875 691868 708990 726893 743703 757501 766826 770660 768056 758140 740855
61617G40855k3162k6456k7617k8079k8577k8570k7368k5171k2634j9946j6917
$$ 740855 717693 691237 663620 635541 606964 578394 551026 525855 503221 483275 466358
61606D66358j3663j0705q496p171o601o379n964n159m314l769l304k498j472q26
$$ 466358 452695 441990 433494 426323 419722 413343 407379 402220 397906 394137 390833 388335 386863 386037
61592C86037q01q63l17Q51J925K319K370L024M704O723Q049Q468Q619R105R992
$$ 386037 385236 384373 384056 384907 386832 389151 391521 394545 399249 405972 414021 422489 431108 440213 450205
61577D50205J1071J2136J3008J3732J4714J6125J7271J7235J6193J5300J5067
$$ 450205 461276 473412 486420 500152 514866 530991 548262 565497 581690 596990 612057
61566F12057J4724J3573J2116J1265J1098J1161J1409J1979J2415J1996J0856
$$ 612057 626781 640354 652470 663735 674833 685994 697403 709382 721797 733793 744649
61555G44649R892R607R604R393R065Q974R123R143Q685P722O555N516M622L527
$$ 744649 754541 764148 773752 783145 792210 801184 810307 819450 828135 835857 842412 847928 852550 856077
61541H56077J896l14l024o192r618j2810j5295j6904j7572j7148j5690j3657j1510
$$ 856077 857973 857659 854635 848443 838825 826015 810720 793816 776244 759096 743406 729749 718239
61528G18239r256o729m066j561Q26L354O040Q612J0990J3495J6536K0250K4472
$$ 718239 708983 702254 698188 696627 697453 700807 706847 715459 726449 739944 756480 776730 801202
61515H01202K8888L3303L7850M2881M8580N4791O1345O8346P6008Q4381R3402
$$ 801202 830090 863393 901243 944124 992704 1047495 1108840 1177186 1253194 1337575 1430977
61504A430977J02972J12723J21833J29194J33653J33951J28756J17209R9491P6814
$$ 1430977 1533949 1646672 1768505 1897699 2031352 2165303 2294059 2411268 2510759 2587573
61494B587573N0935K3701l219k8524n1122o9883q3758r2472r6808r8002r6836
$$ 2587573 2638508 2662209 2658990 2630466 2579344 2509461 2425703 2333231 2236423 2138421 2041585
61483B041585r3429q7752q0174p1553o2843n4601m6868l9555l2718k6239j9675
$$ 2041585 1948156 1860404 1780230 1708677 1645834 1591233 1544365 1504810 1472092 1445853 1426178
61472A426178j2897o649j785J957N696R920J4059J7605K0702K3347K4962K5407
$$ 1426178 1413281 1406632 1404847 1406804 1412500 1422420 1436479 1454084 1474786 1498133 1523095 1548502
61460A548502K5527K6018K6397K5935K4922K4169K3746K3261K3079K4146K6612
$$ 1548502 1574029 1600047 1626444 1652379 1677301 1701470 1725216 1748477 1771556 1795702 1822314
61449A822314K9534L2110L4455L6978L9683M2273M4335M5136M3764L9872L4140
$$ 1822314 1851848 1883958 1918413 1955391 1995074 2037347 2081682 2126818 2170582 2210454 2244594
61438B244594K7671K1116J4552Q101K392j834m624o931r556j2114j3766j4821
$$ 2244594 2272265 2293381 2307933 2316034 2318426 2316592 2311968 2305037 2295481 2283367 2269601 2254780
61426B254780j6773k0307k4200k6759k7775k8181k8442k8165k7104k5493k3458
$$ 2254780 2238007 2217700 2193500 2166741 2138966 2110785 2082343 2054178 2027074 2001581 1978123
61415A978123k0912j8098j5519j3205j0746q191o302n677o163p303q862j0674
$$ 1978123 1957211 1939113 1923594 1910389 1899643 1891452 1885150 1879473 1873310 1866007 1857145 1846471
61403A846471j2348j3478j3984j4068j3934j3526j2434j0152o521j786L930J0888
$$ 1846471 1834123 1820645 1806661 1792593 1778659 1765133 1752699 1742547 1736026 1734240 1738170 1749058
61391A749058J9147K8042L6782M5390N4555O4660P5492Q6842R8734J10928J22626
$$ 1749058 1768205 1796247 1833029 1878419 1932974 1997634 2073126 2159968 2258702 2369630 2492256
61380B492256J32874J40959J46279J48011J45139J36779J22571J02852P8511N0821
$$ 2492256 2625130 2766089 2912368 3060379 3205518 3342297 3464868 3567720 3646231 3697052
61370C697052K1683o293l0729n0857o7449q1305r2460j01088j07971j13284j15809
$$ 3697052 3718735 3712442 3681713 3630856 3563407 3482102 3389642 3288554 3180583 3067299 2951490
61359B951490j14504j10213j04700r8457r0787q1692p2245o3083n3954m5008l7250
$$ 2951490 2836986 2726773 2622073 2523616 2432829 2351137 2278892 2215809 2161855 2116847 2079597
61348B079597l1231k6392k2240j9231j7853j7691j7986j8382j8542j7721j5535
$$ 2079597 2048366 2021974 1999734 1980503 1962650 1944959 1926973 1908591 1890049 1872328 1856793
61337A856793j2590r702o873l758p28J418K611L714N426P508R234J0183J0407
$$ 1856793 1844203 1834501 1827628 1823870 1823142 1824560 1827171 1830885 1836311 1843819 1853053 1863236 1873643
61324A873643J0005Q902P044M696K398N38q76k012k935l669m247m509m116l078
$$ 1873643 1883648 1892550 1899594 1904290 1906688 1907226 1906350 1904338 1901403 1897734 1893487 1888978 1884862 1881784
61310A881784k007j532j696k280l294m708o044o917p716r000j0574j1848j2897
$$ 1881784 1879777 1878245 1876549 1874269 1870975 1866267 1860223 1853306 1845590 1836590 1826016 1814168 1801271
61297A801271j4174j5366j5612j4903j4160j3752j3111j2164j1978j3241j5086
$$ 1801271 1787097 1771731 1756119 1741216 1727056 1713304 1700193 1688029 1676051 1662810 1647724
61286A647724j6189j6351j6155j5656j4306j1894q815n606k721m84J228L066N463
$$ 1647724 1631535 1615184 1599029 1583373 1569067 1557173 1548358 1542752 1540031 1539547 1540775 1543841 1549304
61273A549304Q058J0315J2421J5093J8756K3422K9100L5741M2753M9112N3956
$$ 1549304 1557362 1567677 1580098 1595191 1613947 1637369 1666469 1702210 1744963 1794075 1848031
61262A848031N6868N7619N6052N2280M6770M0195L3288K6844K1703J8759J8741
$$ 1848031 1904899 1962518 2018570 2070850 2117620 2157815 2191103 2217947 2239650 2258409 2277150
61251B277150K1726K6885L2978L9004M3998M6358M4148L6373K3472O414j3948
$$ 2277150 2298876 2325761 2358739 2397743 2441741 2488099 2532247 2568620 2592092 2598506 2584558
61240B584558l6218n7841p6046q9351r7775j01898j02189r9159r3529q6154p7852
$$ 2584558 2548340 2490499 2414453 2325102 2227327 2125429 2023240 1924081 1830552 1744398 1666546
61229A666546o9234o0516n1683m3011l5274k9225k5008k2207k0199j8391j6419
$$ 1666546 1597312 1536796 1485113 1442102 1406828 1377603 1352595 1330388 1310189 1291798 1275379
61218A275379j4369j2607j1285j0260r547r382r648r762r414r012r014r250r246
$$ 1275379 1261010 1248403 1237118 1226858 1217311 1207929 1198281 1188519 1179105 1170093 1161079 1151829 1142583
61205A142583q871q149o818m652k064J19J455K090K282K125J734J369J317J803
$$ 1142583 1133712 1125563 1118745 1114093 1112029 1112148 1113603 1115693 1117975 1120100 1121834 1123203 1124520 1126323
61191A126323K975M774O971R376J1917J4420J6603J8493K0477K2750K4846K5927
$$ 1126323 1129298 1134072 1141043 1150419 1162336 1176756 1193359 1211852 1232329 1255079 1279925 1305852
61179A305852K5296K2463J7139R684J340o453j3034j8675k3797k8269l1476l2953
$$ 1305852 1331148 1353611 1370750 1380434 1381774 1375321 1362287 1343612 1319815 1291546 1260070 1227117
61167A227117l2956l2340l1879l1692l1473l0993l0103k8498k6032k3191k0757
$$ 1227117 1194161 1161821 1129942 1098250 1066777 1035784 1005681 977183 951151 927960 907203
61156I07203j8875j7092j5245j3648j2292j0553q082n367l028j126N13J893L142
$$ 907203 888328 871236 855991 842343 830051 819498 811416 806049 803021 801895 802408 804301 807443
61143H07443M634O356P746Q665R819J1626J3284J3634J2467J0165O639J586m360
$$ 807443 812077 818433 826179 834844 844663 856289 869573 883207 895674 905839 912478 914064 909704
61130I09704r737j3570j5929j7231j7653j7336j6499j5165j3243j1024r275q622
$$ 909704 899967 886397 870468 853237 835584 818248 801749 786584 773341 762317 753042 744420
61118G44420r006r702r887r296q454q071q137q051p631p391p547p501o770n735
$$ 744420 735414 725712 715825 706529 698075 690004 681867 673816 666185 658794 651247 643746 636976 631241
61104F31241m841l802k301q84j15N93K193M450O259P394Q640J0273J1579J2107
$$ 631241 626400 622598 620297 619413 619298 619891 622084 626534 632793 640187 648827 659100 670679 682786
61090F82786J2100J1341Q785M104j331n801q982j1509j3407j3912j2755j0829
$$ 682786 694886 706227 715012 719116 717785 711984 703002 691493 678086 664174 651419 640590
61078F40590r326q611q112p096n430l667k439j818j314m71O30J502J812J820K141
$$ 640590 631264 622653 614541 607445 602015 598348 595909 594091 592777 592306 592936 594438 596250 598070 600211
61063F00211K980L681L451K538K050K504L144L120K654K419K392K241K319L221
$$ 600211 603191 606872 610323 612861 614911 617415 620559 623679 626333 628752 631144 633385 635704 638925
61049F38925M501M933M103K859K074J842J984K424K750K344J343P49J152J946
$$ 638925 643426 648359 652462 655321 657395 659237 661221 663645 666395 668739 670082 670831 671983 673929
61035F73929K262K117K137K668L548M436N038N301N590O197O668O176M786L575
$$ 673929 676191 678308 680445 683113 686661 691097 696135 701436 707026 713223 719891 726067 730853 734428
61021G34428L176K909J926N11l53k98J81M77K74m20j202j402p74J91R76J726K876
$$ 734428 737604 740513 742439 742950 742597 742299 742480 742957 743231 742811 741609 740207 739433 739624 740600 742326 745202
61004G45202M375N735O632P145P618Q450R799J1341J2718J4193J6250J8551K0194
$$ 745202 749577 755312 761944 769089 776707 785157 794956 806297 819015 833208 849458 868009 888203
60991H88203K1244K2900K5626K8329L0146L1826L4202L6361L6915L6263L6002
$$ 888203 909447 932347 957973 986302 1016448 1048274 1082476 1118837 1155752 1192015 1228017
60980A228017L6482L6633L6003L5264L4732L4055L3557L4197L5961L7805L9699
$$ 1228017 1264499 1301132 1337135 1372399 1407131 1441186 1474743 1508940 1544901 1582706 1622405
60969A622405M3077M8664N5372O2059O8820P5676Q1569Q5910Q9932R5381J03025
$$ 1622405 1665482 1714146 1769518 1831577 1900397 1976073 2057642 2143552 2233484 2328865 2431890
60958B431890J13502J28133J47452J70175J95179K23439K56338K93286L33114
$$ 2431890 2545392 2673525 2820977 2991152 3186331 3409770 3666108 3959394 4292508
60949D292508L77020M28296M90063N65493O59419P77517R24906J108142J337289
$$ 4292508 4669528 5097824 5587887 6153380 6812799 7590316 8515222 9623364 10960653
60940A0960653J622888J972985K397503K910129L508744M139726M681393M970654
$$ 10960653 12583541 14556526 16954029 19864158 23372902 27512628 32194021 37164675
60932C7164675M856945M254301L185934J820670M65458n30859r37638p58725k15823
$$ 37164675 42021620 46275921 49461855 51282525 51747983 51217124 50279486 49520761 49304938
60923D9304938L73570P16926O06159n0774j186069k553646l804992m645815m962776
$$ 49304938 49678508 50395434 51001593 50950819 49764750 47211104 43406112 38760297 33797521
60914C3797521m827351m399671l831566l230539k666093k177070j772984j443728
$$ 33797521 28970170 24570499 20738933 17508394 14842301 12665231 10892247 9448519
60906I448519j175971r60704p89737o53510n44811m60413l97134l49337l11604
$$ 9448519 8272548 7311844 6522107 5868597 5323786 4863373 4466239 4116902 3805298
60897C805298k81023k55419k31858k08592j86344j65956j46489j27166j09557
$$ 3805298 3524275 3268856 3036998 2828406 2642062 2476106 2329617 2202451 2092894
60888B092894r5936q6630q0477p6846p5473p5162p4295p2319o9443o5385n9723
$$ 2092894 1996958 1910328 1829851 1753005 1677532 1602370 1528075 1455756 1386313 1320928 1261205
60877A261205n3153m7262m3026m0207l7949l5371l2026k8398k5537k3727k2105
$$ 1261205 1208052 1160790 1117764 1077557 1039608 1004237 972211 943813 918276 894549 872444
60866H72444k0134j8507j7872j7505j6322j4507j3114j2546j2426j2459j2406
$$ 872444 852310 833803 815931 798426 782104 767597 754483 741937 729511 717052 704646
60855G04646j1704j0084q261p038o240n421n033n673o580o271m524k621j591j339
$$ 704646 692942 682858 674597 667559 661319 655898 650865 645192 638612 632341 627817 625196 623605 622266
60841F22266j444j778k184k449k762l469m410n164n787o499o842o119m573l190
$$ 622266 620822 619044 616860 614411 611649 608180 603770 598606 592819 586320 579478 573359 568786 565596
60827E65596k305j373j70P50J026J097J493K246L235M513O005P353Q251Q626Q500
$$ 565596 563291 561918 561748 562498 563524 564621 566114 568360 571595 576108 582113 589466 597717 606343 614843
60812F14843Q086P857Q056Q168P456N789L616J366n77j769k321l137m765o328
$$ 614843 622929 630786 638842 647010 654466 660255 663871 665237 664660 662891 660570 657433 652668 646340
60798F46340o658o063n920o643p339p375p127o984o763o382o061n698m947m165
$$ 646340 639682 633619 627699 621056 613717 606342 599215 592231 585468 579086 573025 567327 562380 558215
60784E58215m201n012n488n016m312m196m462m419l844k936j961j320j315j560
$$ 558215 554014 549002 543514 538498 534186 529990 525528 521109 517265 514329 512368 511048 509733 508173
60770E08173j252k58P58J442K154L033L565L520L465L865M402M622M630M684M712
$$ 508173 506921 506663 507421 508863 511017 514050 517615 521135 524600 528465 532867 537489 542119 546803 551515
60755E51515M624M525M289L589K578J819J271K36j351k465k415j823j604j804
$$ 551515 556139 560664 564953 568542 571120 572939 574210 574446 573095 570630 568215 566392 564788 562984
60741E62984k166l026m727o684p924q260q224q189q185q285q532q591q101p198
$$ 562984 560818 557792 553065 546381 538457 530197 521973 513784 505599 497314 488782 480191 472090 464892
60727D64892o372n928n807n742n454m932m611m800m996m401l182k339k188j994
$$ 464892 458520 452592 446785 441043 435589 430657 426046 421246 416250 411849 408667 406328 404140 402146
60713D02146j394j059j298j168O4J472J547K06j370k363k769k586j748p24k57
$$ 402146 400752 399693 398395 397227 397291 398763 400310 400516 399146 396783 394014 391428 389680 388956 388699
60698C88699m35p29q48q25m71M67J565J981J601J262J601K314K756K814K935L438
$$ 388699 388264 387535 386687 385862 385391 385858 387423 389404 391005 392267 393868 396182 398938 401752 404687 408125
60682D08125M140M556M426M075M075M559N067N159M948M855N141N787O579P172
$$ 408125 412265 416821 421247 425322 429397 433956 439023 444182 449130 453985 459126 464913 471492 478664
60668D78664P366P486Q102R300J0546J1348J1573J1115R944Q610P950P927P531
$$ 478664 486030 493516 501618 510918 521464 532812 544385 555500 565444 574054 582004 589931 597462
60655E97462O230M753L877L208J901m6j986l609m942n808o046o036o183o227n739
$$ 597462 603692 608445 612322 615530 617431 617385 615399 611790 606848 601040 594994 588958 582775 576548 570809
60640E70809n084n079n866o764p209p175o777o024n053m159l577l374l375l048
$$ 570809 565725 560646 554780 548016 540807 533632 526855 520831 515778 511619 508042 504668 501293 498245
60626D98245j949n22J63j95o33l97n7l70q03k77J039J967K158K543L809N433O471
$$ 498245 496296 495774 495937 495742 495109 494712 494655 494285 493482 493205 494244 496211 498369 500912 504721 510154 516625
60609E16625O650O451O592P485Q728R304Q734P838P712Q248Q357P525O282N300
$$ 516625 523275 529726 536318 543803 552531 561835 570569 578407 586119 594367 602724 610249 616531 621831
60595F21831M783M747N100N459N609O115P689J0001J1894J2811J3159J3207J2557
$$ 621831 626614 631361 636461 641920 647529 653644 661333 671334 683228 696039 709198 722405 734962
60582G34962J0896Q391N153J130l171o768r370j1732j4359j6620j7565j7123j5920
$$ 734962 745858 754249 759402 760532 757361 750593 741223 729491 715132 698512 680947 663824 647904
60569F47904j4467j2994j1604j0144q322o333m942m508m399l885l148k786k689
$$ 647904 633437 620443 608839 598695 590373 584040 579098 574590 570191 566306 563158 560372 557683
60556E57683k123q42N06J254J438J533J759J998K199K557L176L700L549K641J627
$$ 557683 555560 554718 555224 556478 557916 559449 561208 563206 565405 567962 571138 574838 578387 581028 582655
60541E82655J207J403J726J903J997K030J984K153K968M367N799P013Q361J0148
$$ 582655 583862 585265 586991 588894 590891 592921 594905 597058 600026 604393 610192 617205 625566 635714
60527F35714J2153J4125J6315J9058K2150K5159K8200L1936L6749M2326M8166
$$ 635714 647867 661992 678307 697365 719515 744674 772874 804810 841559 883885 932051
60516I32051N4279O1143O9112P8108Q7921R8614J10334J22666J34189J42770J46201
$$ 932051 986330 1047473 1116585 1194693 1282614 1381228 1491562 1614228 1748417 1891187 2037388
60505B037388J42736J31591J13395R0184O4536L8517J3431r691k9746m5937n8261
$$ 2037388 2180124 2311715 2425110 2515294 2579830 2618347 2631778 2622087 2592341 2546404 2488143
60494B488143o7501p4686q0538q5221q8424q9585q8049q3261p5158o4416n2227
$$ 2488143 2420642 2345956 2265418 2180197 2091773 2002188 1914139 1830878 1755720 1691304 1639077
60483A639077l9638k7116j4587j638J2159K6791M1619N5899O9378Q1845R2136
$$ 1639077 1599439 1572323 1557736 1556098 1568257 1595048 1636667 1692566 1761944 1843789 1935925
60472A935925R8254R8761R3441Q2447O5792M4382K0935j129j9493l3073m0799
$$ 1935925 2034179 2132940 2226381 2308828 2374620 2419002 2439937 2438808 2419315 2386242 2345443
60461B345443m1484l5026k2893p035J1213L1113N2133P4183R7823J23873J52770
$$ 2345443 2303959 2268933 2246040 2239005 2250218 2281331 2333464 2407647 2505470 2629343 2782113
60450B782113J84519K19170K57241K99616L46928L98993M54913N13553N73207
$$ 2782113 2966632 3185802 3443043 3742659 4089587 4488580 4943493 5457046 6030253
60441F030253O30256O78164P08261P11440O79393O05741M88171L30748J44146
$$ 6030253 6660509 7338673 8046934 8758374 9437767 10043508 10531679 10862427 11006573
60432A1006573n6618k54961m34685n81756o86680p46275p63485p45485p01577
$$ 11006573 10949955 10694994 10260309 9678553 8991873 8245598 7482113 6736628 6035051
60423F035051o41589n74450n06880m42808l84018l31374k85389k45919k11976
$$ 6035051 5393462 4819012 4312132 3869324 3485306 3153932 2868543 2622624 2410648
60414B410648j82405j56723j34941j16746j01278q7723p5617o4688n4921m6784
$$ 2410648 2228243 2071520 1936579 1819833 1718555 1630832 1555215 1490527 1435606 1388822
60404A388822m0717l6235l2179k8138k4936k3381k3198k3591k4173k4742k4791
$$ 1388822 1348105 1311870 1279691 1251553 1226617 1203236 1180038 1156447 1132274 1107532 1082741
60393A082741k3981k2704k1600k0824k0268k0005j9966j9641j8708j7489j6267
$$ 1082741 1058760 1036056 1014456 993632 973364 953359 933393 913752 895044 877555 861288
60382H61288j4687j2567j0686r908r978r991r695r400r031q306p545p220o892
$$ 861288 846601 834034 823348 813440 803462 793471 783776 774376 765345 757039 749494 742274 735382
60369G35382n660l594j667l05J005K531L785M374M509M415M033L480L153L148
$$ 735382 729722 726128 724461 724156 725161 727692 731477 735851 740360 744775 748808 752288 755441 758589
60355G58589L277L693M733O053O740O555O320O791P818Q809R415R526R157Q601
$$ 758589 761866 765559 770292 776345 783085 789640 795960 802751 810569 819378 828793 838319 847476 856077
60341H56077Q133P480O133M258K679J912J876K631M514P394J0543J3582J6894
$$ 856077 864210 871690 877823 882081 884760 886672 888548 891179 895693 903087 913630 927212 944106
60328I44106K0804K4887K8384L0691L1240K9440K5108J8642J0650J851o819j4646
$$ 944106 964910 989797 1018181 1048872 1080112 1109552 1134660 1153302 1163952 1165803 1158984 1144338
60316A144338k1681k8166l3452l6306l6374l4557l1798k8389k4618k1116j8127
$$ 1144338 1122657 1094491 1061039 1024733 988359 953802 922004 893615 868997 847881 829754
60305H29754j5305j2643j0764r813q870p058m571k062L00K555M386N564O563Q015
$$ 829754 814449 801806 791042 781229 772359 765301 760730 758668 758968 761523 765909 771473 778036 786051
60291G86051R746J0879J0723R240O824L974J006k083n288q161j0090j1090j1768
$$ 786051 795797 806676 817399 826639 833463 837437 838443 836360 831072 822911 812821 801731 789963
60278G89963j2437j2775j2511j1803j0790r286p283n236l575k470k057k290k384
$$ 789963 777526 764751 752240 740437 729647 720361 713078 707842 704267 701797 699740 697450 695066
60265F95066j185J509M588O869Q170Q936R600J0633J2439J4638J6210J6875J7689
$$ 695066 693881 695390 699978 706847 715017 723953 733553 744186 756625 771263 787473 804348 822037
60252H22037J9616K2117K3939K4908K6140K8635L2295L6292L9884M2864M5490
$$ 822037 841653 863770 887709 912617 938757 967392 999687 1035979 1075863 1118727 1164217
60241A164217M8100N0752N3310N5683N7673N8732N8376N6783N4467N1444M7345
$$ 1164217 1212317 1263069 1316379 1372062 1429735 1488467 1546843 1603626 1658093 1709537 1756882
60230A756882M2270L6740L0837K4187J6885R488K040n854j3738k0215k4583k7532
$$ 1756882 1799152 1835892 1866729 1890916 1907801 1917289 1919329 1913475 1899737 1879522 1854939 1827407
60218A827407k9657l0391k9108k6265k2603j8027j2221n656R82P743J4977K2397
$$ 1827407 1797750 1767359 1738251 1711986 1689383 1671356 1659135 1653479 1654461 1662204 1677181 1699578
60206A699578K9477L6293M3162M9793N5599O0412O4110O5972O5306O2483N8528
$$ 1699578 1729055 1765348 1808510 1858303 1913902 1974314 2038424 2104396 2169702 2232185 2290713
60195B290713N3855M8061M0882L2603K3654J4342M879m744j4708k4745l3821m0932
$$ 2290713 2344568 2392629 2433511 2466114 2489768 2504110 2508989 2504245 2489537 2464792 2430971 2390039
60183B390039m5976m9378n1157n0901m8403m3854l7588l0069k1938j3633n166
$$ 2390039 2344063 2294685 2243528 2192627 2144224 2100370 2062782 2032713 2010775 1997142 1991976
60172A991976L466J1971K0094K7877L5258M1889M7716N3159N8235O1976O3342
$$ 1991976 1995442 2007413 2027507 2055384 2090642 2132531 2180247 2233406 2291641 2353617 2416959
60161B416959O2408O0173N7544N4911N2315M9660M7094M5437M5667M7616M9826
$$ 2416959 2479367 2539540 2597084 2651995 2704310 2753970 2801064 2846501 2892168 2939784 2989610
60150B989610N1091N1477N1324N0176M7489M3713L9749L5894L2220K9533K9070
$$ 2989610 3040701 3092178 3143502 3193678 3241167 3284880 3324629 3360523 3392743 3422276 3451346
60139C451346L1386L6239M3120N1083N8554O4338O8790P3253P8462Q4195R0283
$$ 3451346 3482732 3518971 3562091 3613174 3671728 3736066 3804856 3878109 3956571 4040766 4131049
60128D131049R7084J04875J13238J21162J27504J31469J32932J31900J27692J19264
$$ 4131049 4228133 4333008 4446246 4567408 4694912 4826381 4959313 5091213 5218905 5338169
60118E338169J06602R0941P3176N2964L0084N641j9162m4487p0827r6990j20499
$$ 5338169 5444771 5535712 5608888 5661852 5691936 5697577 5678415 5633928 5563101 5466111 5345612
60107E345612j39715j54461j64701j69933j69963j65387j57063j45795j32550
$$ 5345612 5205897 5051436 4886735 4716802 4546839 4381452 4224389 4078594 3946044
60098C946044j18245j03376q8202p3082n8105m2870k7246j1782L187J8125L2990
$$ 3946044 3827799 3724423 3636221 3563139 3505034 3462164 3434918 3423136 3426323 3444448 3477438
60087C477438M6153N5784O1746O4818O4676O0306N2075M1713L0136J7006K611
$$ 3477438 3523591 3579375 3641121 3705939 3770615 3830921 3882996 3924709 3954845 3971851 3974462
60076C974462j1460k4053l5441m5928n4840o1647o6977p1597p5283p7529p8548
$$ 3974462 3963002 3938949 3903508 3857580 3802740 3741093 3674116 3602519 3527236 3449707 3371159
60065C371159p8640p7194p3288o6969n9184n0579m1031l0255j8364n860O612J8564
$$ 3371159 3292519 3215325 3142037 3075068 3015884 2965305 2924274 2894019 2875655 2869795 2876407 2894971
60053B894971L0000M1421N3216O5049P5944Q4977R1840R6681R9466R9669R6779
$$ 2894971 2924971 2966392 3019608 3084657 3160601 3245578 3337418 3434099 3533565 3633234 3730013
60042C730013R0931Q2620P1860N8322M2366K5250Q044q898k4989l9014n0511o0778
$$ 3730013 3820944 3903564 3975424 4033746 4076112 4101362 4109406 4100508 4075519 4036505 3985994 3925216
60030C925216p1419q2305r1965r9578j05424j09586j11403j10328j06571j00764
$$ 3925216 3853797 3771492 3679527 3579949 3474525 3364939 3253536 3143208 3036637 2935873
60020B935873r3576q5503p6517o6129n4403m2542l1761k2005j2530l164O030J5753
$$ 2935873 2842297 2756794 2680277 2614148 2559745 2517203 2485442 2463437 2450907 2447743 2453773 2469526
60008B469526K6787L8572M9737N9881O9587P8711Q6099R1064R3834R4313R1639
$$ 2469526 2496313 2534885 2584622 2644503 2714090 2792801 2878900 2969964 3063798 3158111 3249750
59997C249750Q5373P6029O4178N0075L4475J8650L217j2060k7004m0637n2419
$$ 3249750 3335123 3411152 3475330 3525405 3559880 3578530 3581747 3569687 3542683 3502046 3449627
59986C449627o2730p1586p7970q1015q1039p8853p4890o9496o3221n6178m7845
$$ 3449627 3386897 3315311 3237341 3156326 3075287 2996434 2921544 2852048 2788827 2732649 2684804
59975B684804l7994k7127j5649l424R365K1863L3593M5014N6336O6630P4909Q1412
$$ 2684804 2646810 2619683 2604034 2600610 2609975 2631838 2665431 2710445 2766781 2833411 2908320 2989732
59963B989732Q7040R2027R5941R8474R9366R7957R3568Q6226P6439O4407M9989
$$ 2989732 3076772 3168799 3264740 3363214 3462580 3560537 3654105 3740331 3816770 3881177 3931166
59952C931166L3319J5056l740k1557l6506m6956n2289n2901m9588m2900l2823
$$ 3931166 3964485 3979541 3975801 3954244 3917738 3870782 3818493 3765592 3716004 3673104 3640281
59941C640281j9027j510J8984M1412O5135Q9854J15008J39763J63429J85400K04731
$$ 3640281 3621254 3619744 3638728 3680140 3745275 3835129 3950137 4089900 4253329 4438729 4643460
59930D643460K20100K29987K32398K25055K06702J77999J40382R4629M1868j4449
$$ 4643460 4863560 5093547 5325945 5551000 5757702 5935701 6076083 6170712 6212580 6198131
59920F198131o9220j18581j60786j94409k17658k30242k34128k31458k22927k09161
$$ 6198131 6128911 6010330 5849544 5655135 5437477 5207235 4973107 4741649 4518722 4309561
59910D309561j92233j74361j56011j36657j16676r7131p8221n9260m0029k1065
$$ 4309561 4117328 3942967 3786956 3650299 3533623 3436492 3358271 3299011 3258982 3237917
59900C237917k769J4807L1495M7109O1866P5882Q8469R8629J05957J10277J10636
$$ 3237917 3235148 3249955 3281450 3328559 3390425 3466307 3554776 3653405 3759362 3869639 3980275
59889C980275J05535R4067P6253N2465K3566q473m1029p2135j00722j25592j45059
$$ 3980275 4085810 4179877 4256130 4308595 4332161 4323688 4282659 4210524 4109802 3984210 3839151
59878C839151j58118j65301j67988j67171j63296j56881j48710j39416j29267
$$ 3839151 3681033 3515732 3347744 3180573 3017277 2860396 2711686 2572270 2443003
59869B443003j18520j07672r7197q7106p6998o6597n6128m6147l7169k9529k3328
$$ 2443003 2324483 2216811 2119614 2032508 1955510 1888913 1832785 1786638 1749469 1719940 1696612
59858A696612j8321j4144j0778q658q036q502r352j0117j0444r855q121n580k592
$$ 1696612 1678291 1664147 1653369 1644711 1636675 1628173 1618821 1608704 1598260 1588405 1580284 1574704 1572112
59845A572112R90N271R546J2755J4478J4833J3655J0541N527r71q638j6917k4438
$$ 1572112 1573102 1578373 1587919 1600674 1615152 1629985 1643640 1654181 1659708 1658737 1650099 1633182 1608744
59832A608744k9889l3351l5829l7567l7869l6568l4411l1870k8685k4903k1218
$$ 1608744 1578855 1545504 1509675 1472108 1434239 1397671 1363260 1331390 1302705 1277802 1256584
59821A256584j7915j4464j0569o615k725J601O445J1073J5063J8905K2936K6708
$$ 1256584 1238669 1224205 1213636 1207021 1204296 1205897 1212342 1223415 1238478 1257383 1280319 1307027
59809A307027K9900L2823L5345L6317L4980L2143K9079K5914K1933J6899J1314
$$ 1307027 1336927 1369750 1405095 1441412 1476392 1508535 1537614 1563528 1585461 1602360 1613674
59798A613674N900J470j208k069j834r12J237N132J0430J6623K3881L2454M1904
$$ 1613674 1619574 1621044 1619836 1617767 1615933 1615021 1616258 1621390 1631820 1648443 1672324 1704778 1746682
59785A746682N1639O1624P1726Q0993Q8507R4752J01398J10141J22211J38348
$$ 1746682 1798321 1859945 1931671 2012664 2101171 2195923 2297321 2407462 2529673 2668021
59775B668021J58091J79103J97765K10294K12914K01733J73789J28900P0518M996
$$ 2668021 2826112 3005215 3202980 3413274 3626188 3827921 4001710 4130610 4201128 4206124
59765D206124o0018j17447j62366j92471k07543k08943j99504j82874j62276j40076
$$ 4206124 4146106 4028659 3866293 3673822 3466279 3257336 3057832 2874958 2712682 2572606
59755B572606j18306r8598q1210o5160m9952l6423k5407j6434q408q25O459J3867
$$ 2572606 2454300 2355702 2274492 2209332 2159380 2122957 2097550 2081116 2072708 2071883 2078342 2092209
59743B092209K1613K9166L6131M3232N1582O1204P1075Q0387Q9211R8157J07896
$$ 2092209 2113822 2142988 2179119 2222351 2273933 2335137 2406212 2486599 2575810 2673967 2781863
59732B781863J18865J31098J44506J59297J75600J92777K09991K27509K46236
$$ 2781863 2900728 3031826 3176332 3335629 3511229 3704006 3913997 4141506 4387742
59723D387742K65708K83789K98927L11123L19881L22763L17595L05019K87458
$$ 4387742 4653450 4937239 5236166 5547289 5867170 6189933 6507528 6812547 7100005
59714G100005K66449K42778K18749J98407J85198J80469J84188J95876K14542
$$ 7100005 7366454 7609232 7827981 8026388 8211586 8392055 8576243 8772119 8986661
59705H986661K38598K66060K94386L20249L40052L50696L49631L34846L05623
$$ 8986661 9225259 9491319 9785705 10105954 10446006 10796702 11146333 11481179 11786802
59696A1786802K63005K09073J46284P8039R110n5536j12059j57502j89243k05913
$$ 11786802 12049807 12258880 12405164 12483203 12492313 12436777 12324718 12167216 11977973 11772060
59686A1772060k08390j98776j78749j49633j13375p2058k6662K2589P4931J29218
$$ 11772060 11563670 11364894 11186145 11036512 10923137 10851079 10824417 10847006 10921937 11051155
59676A1051155J85207K43536L04310L66448M28138M86934N39266N80570O05805
$$ 11051155 11236362 11479898 11784208 12150656 12578794 13065728 13604994 14185564 14791369
59667A4791369O09414N85494N29357M39428L17668J69265L141j67982l30039m71235
$$ 14791369 15400783 15986277 16515634 16955062 17272730 17441995 17445136 17277154 16947115 16475880
59657A6475880n83627o62489p06099p16364o98375o58595o03613n40121m74900
$$ 16475880 15892253 15229764 14523665 13807301 13108926 12450331 11846718 11306597 10831697
59648A0831697m14369l64459l30400l15447l19376l38616l67631l99840m28119
$$ 10831697 10417328 10052869 9722469 9407022 9087646 8749030 8381399 7981559 7553440
59639G553440m46298m51118m42776m23719l97286l66817l34816l02609k71030
$$ 7553440 7107142 6656024 6213248 5789529 5392243 5025426 4690610 4388001 4116971
59630D116971k41112k13726j89051j67008j47762j31089j15942j01554q8460p7472
$$ 4116971 3875859 3662133 3473082 3306074 3158312 3027223 2911281 2809727 2721267 2643795
59620B643795o8144n9297n0625m2628l5336k8377k2095j7264j3792j0923q781
$$ 2643795 2575651 2516354 2465729 2423101 2387765 2359388 2337293 2320029 2306237 2295314 2286533
59609B286533q550j0897j5228k0628k6560l2514l7815m2190m5830m8827n0953
$$ 2286533 2277983 2267086 2251858 2231230 2204670 2172156 2134341 2092151 2046321 1997494 1946541
59598A946541n2035n1953n0473m7653m4166m0595l6788l2562k8492k5116k1879
$$ 1946541 1894506 1842553 1792080 1744427 1700261 1659666 1622878 1590316 1561824 1536708 1514829
59587A514829j7981j3848j0620q356o026l147k71K177M425O662Q760J0672J2269
$$ 1514829 1496848 1483000 1472380 1464024 1457998 1454851 1454580 1456757 1461182 1467844 1476604 1487276 1499545
59574A499545J2943J2291J1048J0366J0327J0218R963J0178J1055J2437J4780
$$ 1499545 1512488 1524779 1535827 1546193 1556520 1566738 1576701 1586879 1597934 1610371 1625151
59563A625151J8686K3451K7555L0683L3995L8243M2980M7958N3855O1047O8802
$$ 1625151 1643837 1667288 1694843 1725526 1759521 1797764 1840744 1888702 1942557 2003604 2072406
59552B072406P6413Q4290R3200J03125J13345J23159J32149J40074J46805J52090
$$ 2072406 2148819 2233109 2326309 2429434 2542779 2665938 2798087 2938161 3084966 3237056
59542C237056J55599J57360J57684J56099J51124J42111J30678J19170J08172
$$ 3237056 3392655 3550015 3707699 3863798 4014922 4157033 4287711 4406881 4515053
59533D515053R6871Q5410P5109O6425N8262M9538M0011K9525J8081P261J84o93
$$ 4515053 4611924 4697334 4772443 4838868 4897130 4946668 4986679 5016204 5034285 5041546 5041730 5041037
59521E041037M922J5880L0577M6885O2366P5056Q3406Q5424P9190O4476M2709
$$ 5041037 5045959 5061839 5092416 5139301 5201667 5276723 5360129 5445553 5524743 5589219 5631928
59510E631928J5189j7461n3873r1367j27489j60983j90774k15151k32692k43153
$$ 5631928 5647117 5629656 5575783 5484416 5356927 5195944 5005170 4790019 4557327 4314174
59500D314174k46858k44026k35186k21569k04649j85789j66466j47990j30791
$$ 4314174 4067316 3823290 3588104 3366535 3161886 2976097 2809631 2661641 2530850
59491B530850j14656r9683q6205p3889o2050n0881m1214l3008k5228j7326r656
$$ 2530850 2416194 2316511 2230306 2156417 2094367 2043486 2002272 1969264 1944036 1926710 1917054
59480A917054k301N232J2922K0203K7240L4958M3452N1800N9775O8377P8117Q8285
$$ 1917054 1914753 1919985 1932907 1953110 1980350 2015308 2058760 2110560 2170335 2238712 2316829 2405114
59468B405114R8386J08994J20313J31179J40210J46849J50597J50340J45175J34931
$$ 2405114 2503500 2612494 2732807 2863986 3004196 3151045 3301642 3451982 3597157 3732088
59458C732088J19293R7631P0451L9876P935k4597n6906q6922j12551j33216j49183
$$ 3732088 3851381 3949012 4019463 4059339 4067274 4042677 3985771 3898849 3786298 3653082 3503899
59447C503899j60120j65439j65547j61735j55037j45957j35120j23643j12750
$$ 3503899 3343779 3178340 3012793 2851058 2696021 2550064 2414944 2291301 2178551
59438B178551j03153r4565q5940p6671o7409n9198n2167m5835m0225l5529l1073
$$ 2178551 2075398 1980833 1894893 1818222 1750813 1691615 1639448 1593613 1553388 1517859 1486786
59427A486786k5961k0631j6273j2825r099m929j430J051L474O258Q668J0536J2751
$$ 1486786 1460825 1440194 1423921 1411096 1401997 1397068 1395638 1396689 1400163 1406421 1415089 1425625 1438376
59414A438376J5437J7415J8296J9286K1164K3157K4887K7607L2148L7156M0633
$$ 1438376 1453813 1471228 1489524 1508810 1529974 1553131 1578018 1605625 1637773 1674929 1715562
59403A715562M2012M1501L8871L4451L0319K8969L1340L6999M5272N5255O5687
$$ 1715562 1757574 1799075 1837946 1872397 1902716 1931685 1963025 2000024 2045296 2100551 2166238
59392B166238P5848Q5708R4527J00635J03662J05803J09754J16483J26094J39399
$$ 2166238 2242086 2327794 2422321 2522956 2626618 2732421 2842175 2958658 3084752 3224151
59382C224151J57020J77810J99679K21548K43487K65608K87787L09553L29324
$$ 3224151 3381171 3558981 3758660 3980208 4223695 4489303 4777090 5086643 5415967
59373E415967L44499L53317L55719L51774L40545L21787K97621K71178K44433
$$ 5415967 5760466 6113783 6469502 6821276 7161821 7483608 7781229 8052407 8296840
59364H296840K18406J94377J73296J54672J37232J20081J02182Q1720N7288K9070
$$ 8296840 8515246 8709623 8882919 9037591 9174823 9294904 9397086 9478806 9536094 9565164
59354I565164k130l6147p2483j09039j43225j73673j99638k19584k31931k36930
$$ 9565164 9563034 9526887 9454404 9345365 9202140 9028467 8828829 8609245 8377314 8140384
59344H140384k36704k33731k30126k27581k26847k27579k29347k32127k35189
$$ 8140384 7903680 7669949 7439823 7212242 6985395 6757816 6528469 6296342 6061153
59335F061153k36627k34968k30322k23226k13537k01451j88273j74881j60647
$$ 6061153 5824526 5589558 5359236 5136010 4922473 4721022 4532749 4357868 4197221
59326D197221j45155j29732j15777j02828q9858p7340o6223n5904m5133l4246
$$ 4197221 4052066 3922334 3806557 3703729 3613871 3536531 3470308 3414404 3369271 3335025
59316C335025k4576j6363q951k518K206N455P920R159Q239N540K249j636p083
$$ 3335025 3310449 3294086 3285135 3282617 3284823 3290278 3298198 3307357 3315596 3321136 3323385 3321749 3314666
59303C314666j4033k1250k8094l4989m2195m9300n5784o1076o4432o5803o6248
$$ 3314666 3300633 3279383 3251289 3216300 3174105 3124805 3069021 3007945 2943513 2877710 2811462
59292B811462o6465o5666o3062n9363n5373n0202m2801l4336k6847k0189j2548
$$ 2811462 2744997 2679331 2616269 2556906 2501533 2451331 2408530 2374194 2347347 2327158 2314610
59281B314610l644M953J2679K0850L0321M0206M9438N7895O5494P1554P5627P7695
$$ 2314610 2310966 2315919 2328598 2349448 2379769 2419975 2469413 2527308 2592802 2664356 2739983 2817678
59269B817678P7228P3145O4936N2976L7693J9602J6j9357l7576n4327o8863q0165
$$ 2817678 2894906 2968051 3032987 3085963 3123656 3143258 3143274 3123917 3086341 3032014 2963151 2882986
59257B882986q7924r2248r2880q9872q4504p8253p1211o2869n3880m5405l7163
$$ 2882986 2795062 2702814 2609934 2520062 2435558 2357305 2286094 2223225 2169345 2123940 2086777
59246B086777k7996j8158r225j663N778J4008K2557L0844L9106M7805N7296O8231
$$ 2086777 2058781 2040623 2031398 2029735 2035513 2049521 2072078 2102922 2142028 2189833 2247129 2315360
59234B315360Q1094R5286J09632J23617J36925J48069J55067J57667J57900J58653
$$ 2315360 2396454 2491740 2601372 2724989 2861914 3009983 3165050 3322717 3480617 3639270
59224C639270J62656J72173J87776K07303K27269K45236K59707K68418K68630
$$ 3639270 3801926 3974099 4161875 4369178 4596447 4841683 5101390 5369808 5638438
59215E638438K59051K39971K11777J74843J30762Q2007L0489k2110p2926j18598
$$ 5638438 5897489 6137460 6349237 6524080 6654842 6736849 6767338 6745228 6672302 6553704
59205F553704j57152j87675k08724k19224k20721k16584k08905j98116j85449
$$ 6553704 6396552 6208877 6000153 5780929 5560208 5343624 5134719 4936603 4751154
59196D751154j73283j62760j53236j44505j37395j31860j26629j21334j16800
$$ 4751154 4577871 4415111 4261875 4117370 3979975 3848115 3721486 3600152 3483352
59187C483352j12754j07420j00183r2525q5551p8626p1289o4388n8282n1903m4903
$$ 3483352 3370598 3263178 3162995 3070470 2984919 2906293 2835004 2770616 2712334 2660431 2615528
59176B615528l8782l4600l1199k7084k2511j8376j4523j0588p256n170l477q27
$$ 2615528 2576746 2542146 2510947 2483863 2461352 2442976 2428453 2417865 2410609 2405439 2401962 2401135
59164B401135K935P102J1289J5335J8896K1942K4980K8094L0631L2325L3640L4411
$$ 2401135 2404070 2411172 2422461 2437796 2456692 2478634 2503614 2531708 2562339 2594664 2628304 2662715
59152B662715L3363K9823K4799J9477J3697O805r48q799j6443k3772l0380l6065
$$ 2662715 2696078 2725901 2750700 2770177 2783874 2790679 2789731 2780932 2764489 2740717 2710337 2674272
59140B674272m1133m5750m9742n3279n6652n9080n9057n6477n2933m9271m4317
$$ 2674272 2633139 2587389 2537647 2484368 2427716 2368636 2309579 2253102 2200169 2150898 2106581
59129B106581l7086k8767k1165j4345p237K06P058J3073J8993K5332L1876L8243
$$ 2106581 2069495 2040728 2019563 2005218 1997981 1998187 2005245 2018318 2037311 2062643 2094519 2132762
59117B132762M4190M9487N4069N8105O1594O4147O5622O6523O7532O8977P0935
$$ 2132762 2176952 2226439 2280508 2338613 2400207 2464354 2529976 2596499 2664031 2733008 2803943
59106B803943P3331P5725P7622P9074Q0326Q0862P9507P5551O8806N8535M3394
$$ 2803943 2877274 2952999 3030621 3109695 3190021 3270883 3350390 3425941 3494747 3553282 3596676
59095C596676K2932j660k8491n5933q2525j06828j27785j44653j56609j63157
$$ 3596676 3619608 3617948 3589457 3533524 3450999 3344171 3216386 3071733 2915124 2751967
59085B751967j64797j62440j56411j46981j35564j23923j12460j00627q8910p8684
$$ 2751967 2587170 2424730 2268319 2121338 1985774 1861851 1749391 1648764 1559854 1481170
59075A481170p0099o1905n3721m6696m1385l6717l1733k6878k2779j9148j5620
$$ 1481170 1411071 1349166 1295445 1248749 1207364 1170647 1138914 1112036 1089257 1070109 1054489
59064A054489j2452r657o629l174J99L349O629R549J0793J0063Q502O737M078
$$ 1054489 1042037 1032380 1025751 1022577 1022776 1026125 1032754 1042303 1053096 1063159 1071661 1078398 1082476
59051A082476K94l274n125m791k098L186J0320J7740K5100L3624M3640N3247O0286
$$ 1082476 1082770 1079496 1074371 1069580 1067482 1070668 1080988 1098728 1123828 1157452 1201092 1254339 1314625
59038A314625O4033O4041N9013M8242L3052J5723j791j7213k7594l1205k9005
$$ 1314625 1378658 1442699 1501712 1549954 1583006 1598729 1596938 1579725 1552131 1520926 1491921
59027A491921k3155j5066n756L141J0122J4846J7402J7326J4190Q448R82p438
$$ 1491921 1468766 1453700 1447944 1451085 1461207 1476053 1493455 1510781 1524971 1533419 1534401 1526963
59015A526963j5702k2425k6989k9537k9644k6324j9925j2503n658O17O319J0286
$$ 1526963 1511261 1488836 1461847 1432310 1402666 1376342 1356417 1343914 1338256 1338873 1345192 1355478
59003A355478J1645J0821Q189L217l979j1781j8941k5770l2404l7341l9209l8691
$$ 1355478 1367123 1377944 1386133 1389350 1385371 1373590 1354649 1328879 1296475 1259134 1219925 1181234
58991A181234l7253l5078l1639k7210k2493j7643j2767q565n358k483M74K950
$$ 1181234 1143981 1108903 1077264 1050054 1027561 1009918 997151 988586 983228 980745 981219 984169
58979I84169M778P023J0403J4108J7313K0542K4414K8268L1262L3591L5403L5767
$$ 984169 988947 995970 1006373 1020481 1037794 1058336 1082750 1111018 1142280 1175871 1211274 1247041
58967A247041L3990L0850K7350K3409J8968J5093J2688J1292J0399J0665J2622
$$ 1247041 1281031 1311881 1339231 1362640 1381608 1396701 1409389 1420681 1431080 1441745 1454367
58956A454367J5419J8111K0939K3980K5985K5895K4206K1489J7148J1225N871
$$ 1454367 1469786 1487897 1508836 1532816 1558801 1584696 1608902 1630391 1647539 1658764 1664635
58945A664635L151K674L206N263J0112J7292K5336L3992M3593N2960O0026O4189
$$ 1664635 1667786 1670460 1673666 1678929 1689041 1706333 1731669 1765661 1809254 1862214 1922240 1986429
58933A986429O6253O6515O4640O1145N7501N5014N4703N7640O4168P3382Q4493
$$ 1986429 2052682 2119197 2183837 2244982 2302483 2357497 2412200 2469840 2534008 2607390 2691883
58922B691883R7961J14205J32271J51082J70948J92536K15392K38911K63701K90382
$$ 2691883 2789844 2904049 3036320 3187402 3358350 3550886 3766278 4005189 4268890 4559272
58912D559272L18008L45156L71513L96760M18787M34572M41947M39078M23332
$$ 4559272 4877280 5222436 5593949 5990709 6409496 6844068 7286015 7725093 8148425
58903H148425L92434L46005K84720K09203J21580K7014o8090j58695k40815l10298
$$ 8148425 8540859 8886864 9171584 9380787 9502367 9529381 9461291 9302596 9061781 8751483
58893H751483l64126m02043m25111m33785m29235m15094l95507l72147l45240
$$ 8751483 8387357 7985314 7560203 7126418 6697183 6282089 5886582 5514435 5169195
58884E169195l16454k88464k62399k37993k15630j96040j78564j61952j46427
$$ 5169195 4852741 4564277 4301878 4063885 3848255 3652215 3473651 3311699 3165272
58875C165272j32982j21175j09687r8439q8176p8586o8934o0074n3748n0357m9280
$$ 3165272 3032290 2911115 2801428 2702989 2614813 2536227 2467293 2407219 2353471 2303114 2253834
58864B253834n0668n4734n9869o3647o5321o5436o3779n9846n4616m9488m4103
$$ 2253834 2203166 2148432 2088563 2024916 1959595 1894159 1830380 1770534 1715918 1666430 1622327
58853A622327l7501l0723k5660k1950j7765j3211j0032q092n211p54L482O471
$$ 1622327 1584826 1554103 1528443 1506493 1488728 1475517 1465485 1457393 1452182 1451428 1454910 1461381
58841A461381R408J3226J7122K0375K3571K7165L0564L3484L6602M0348M4393
$$ 1461381 1470789 1484015 1501137 1521512 1545083 1572248 1602812 1636296 1672898 1713246 1757639
58830A757639M8808N4287O0891O7805P4524Q1236Q8096R5384J03937J14088J24683
$$ 1757639 1806447 1860734 1921625 1989430 2063954 2145190 2233286 2328670 2432607 2546695 2671378
58819B671378J34697J45318J58597J74550J91559K09220K28644K50188K73059
$$ 2671378 2806075 2951393 3109990 3284540 3476099 3685319 3913963 4164151 4437210
58810D437210K97015L22367L48093L71887L92104M07863M17240M17275M05797
$$ 4437210 4734225 5056592 5404685 5776572 6168676 6576539 6993779 7411054 7816851
58801G816851L81552L42888K88436K19290J38815N0542m1872j33059k16757k88656
$$ 7816851 8198403 8541291 8829727 9049017 9187832 9238374 9196502 9063443 8846686 8558030
58791H558030l46896l90209m17768m30853m32447m24864m09405l88039l63330
$$ 8558030 8211134 7820925 7403157 6972304 6539857 6114993 5705588 5317549 4954219
58782D954219l36780l09151k82162k57686k35414k13604j92165j72825j56329
$$ 4954219 4617439 4308288 4026126 3768440 3533026 3319422 3127257 2954432 2798103
58773B798103j41704j28467j17214j07871r9441r1738q5394q0002p4251o7925
$$ 2798103 2656399 2527932 2410718 2302847 2203406 2111668 2026274 1946272 1872021 1804096
58763A804096o1824n5797m9003m1918l5867l0596k4528j7416j0450l806L489J1260
$$ 1804096 1742272 1686475 1637472 1595554 1559687 1529091 1504563 1487147 1476697 1472891 1476380 1487640
58751A487640J8202K4367L1374L9993M9696O0513P3014Q6362R8506J07987J13325
$$ 1487640 1505842 1530209 1561583 1601576 1651272 1711785 1784799 1871161 1969667 2077654 2190979
58740B190979J11355R9113P7246M8875J5804k0757n6298q4143j01291j09800j12036
$$ 2190979 2302334 2401447 2478693 2527568 2543372 2522615 2466317 2382174 2280883 2171083 2059047
58729B059047j08267r9775r0205q2123p5157o8845o4247o1417n8401n4283n0552
$$ 2059047 1950780 1851005 1760800 1678677 1603520 1534675 1470428 1409011 1350610 1296327 1245775
58718A245775m8065m5504m2209l9695l8798l7972l6002l3830l2222l0139k7075
$$ 1245775 1197710 1152206 1109997 1070302 1031504 993532 957530 923700 891478 861339 834264
58707H34264k4417k2883k0995j7722j4305j1848r517o734m783m525m649l933l110
$$ 834264 809847 786964 765969 748247 733942 722094 712577 705843 701060 696535 691886 687953 684843
58694F84843k920k452j123j64l88m56Q85K688L618L929M096L414J688N41J287
$$ 684843 681923 679471 678348 678184 677796 677340 678225 680913 684531 688460 692556 695970 697658 698199 699486
58679F99486L105M817O943J0422J4883J9666K5031L1037L6606M0820M3617M4297
$$ 699486 702591 707408 714351 724773 739656 759322 784353 815390 851996 892816 936433 980730
58667I80730M1267L4412K6016J8256J1481N777J979j63k795p575j4040k1211k8859
$$ 980730 1021997 1056409 1082425 1100681 1112162 1117939 1119918 1119755 1116960 1109385 1095345 1074134 1045275
58654A045275l6204m1505m4073m4773m3764m0061l4227k8888k5276k1732j6876
$$ 1045275 1009071 967566 923493 878720 834956 794895 760668 731780 706504 684772 667896
58643F67896j1820p862m566j624p8nN73K746N014O092P070R085J1264J2801J4738
$$ 667896 656076 648214 643648 642024 641946 641941 642514 645260 650274 656366 663436 672521 683785 696586 711324
58628G11324J7796K0709K2510K4323K7091K9866L2146L5504M0967M7031N2369
$$ 711324 729120 749829 772339 796662 823753 853619 885765 921269 962236 1009267 1061636
58617A061636N8172O5819P4340Q2378R0578R9887J09432J17947J25503J31895
$$ 1061636 1119808 1185627 1259967 1342345 1432923 1532810 1642242 1760189 1885692 2017587
58607B017587J35322J34359J29194J19403J02917P9069N0403J9719j2038m3293
$$ 2017587 2152909 2287268 2416462 2535865 2638782 2717851 2768254 2787973 2775935 2732642
58597B732642p0203r0044j03748j12871j16629j14367j08277j00962r2554q2671
$$ 2732642 2662439 2572395 2468647 2355776 2239147 2124780 2016503 1915541 1822987 1740316
58587A740316p2702o3489n3337m1154k9174j9701j1462k276P102J4907K1911K9605
$$ 1740316 1667614 1604125 1550788 1509634 1480460 1460759 1449297 1447021 1454123 1469030 1490941 1520546
58575A520546L6939M2420M7733N5788O6531P8002R0224J04772J21419J38046J52599
$$ 1520546 1557485 1599905 1647638 1703426 1769957 1847959 1938183 2042955 2164374 2302420 2455019
58564B455019J62306J62234J47808J18234P5603K2401l7378r6377j46525j83149
$$ 2455019 2617325 2779559 2927367 3045601 3121204 3143605 3106227 3009850 2863325 2680176
58554B680176k04911k11750k05565j91119j73057j52962j31384j10784r3679p9654
$$ 2680176 2475265 2263515 2057950 1866831 1693774 1540812 1409428 1298644 1204965 1125311
58544A125311o7168n6726m9375m3794l7988l2430k8568k5644k2043j8325j5922
$$ 1125311 1058143 1001417 952042 908248 870260 837830 809262 783618 761575 743250 727328
58533G27328j4228j1952r938r495r411p761n430m638n190n299m936n226n616m801
$$ 727328 713100 701148 691210 681715 672304 664543 659113 654475 649285 643986 639050 633824 628208 623407
58519F23407l483l142l102j726M84J868K681M269O182O963O926P496Q758J0073
$$ 623407 619924 616782 613680 611954 612438 614306 616987 621256 627438 634401 641327 648823 657581 667654
58505F67654J1970J5073J8440K1359K5120L0734L6713M1789M7721N6491O6803
$$ 667654 679624 694697 713137 734496 759616 790350 827063 868852 916573 973064 1039867
58494A039867P6397Q5738R5914J04857J09155J08058J02431R1760P5732N7005
$$ 1039867 1116264 1202002 1297916 1402773 1511928 1619986 1722417 1814177 1889909 1946914
58484A946914L8700K0685J593j7458l4874n2022p0515q7846r9908j06314j09124
$$ 1946914 1985614 2006299 2007892 1990434 1955560 1903538 1833023 1745177 1645269 1538955 1429831
58473A429831j08095j01642r1253q0409p0149n9628m9833m2571l6976l1055k5446
$$ 1429831 1321736 1220094 1128841 1048432 978283 918655 868822 826251 789275 758220 732774
58462G32774k1738j8657j4202r916q488q567o795l611k184k681k596j784k143
$$ 732774 711036 692379 678177 668261 659773 651206 644411 640800 638616 635935 633339 631555 629412
58449F29412k937j513J832M324N642P731J0404J1869J3084J6784K2448K6885K9391
$$ 629412 626475 624962 626794 631118 636760 644491 654895 666764 679848 696632 719080 745965 775356
58436G75356L1724L3473L2163K7659K1913J4809M888o276j5112k1035k5960k9561
$$ 775356 807080 840553 872716 900375 922288 937097 941985 935709 920597 899562 873602 844041
58424H44041k9742k7200k4567k1705j6712j0931p692o556m026M50M295P065J0610
$$ 844041 814299 787099 762532 740827 724115 713184 705492 698936 694910 695360 699655 706720 717330
58411G17330J4485J6653J8316K2468K7953L0582K9848K8807K7593K3047J4866
$$ 717330 731815 748468 766784 789252 817205 847787 877635 906442 934035 957082 971948
58400I71948O200j967j1200k0293k5741k7661k9315l0559k8154k2817j9268j8469
$$ 971948 978148 976181 964981 944688 918947 891286 861971 831412 803258 780441 761173 742704
58388G42704j6374j1550p497o019m634k192j060j891j999n09K25k63M74K645L578
$$ 742704 726330 714780 707283 701264 696630 694438 693378 691487 689488 688979 689204 688941 689415 692060 695638
58373F95638L288M934Q727J1181J1459J2549J5009J5643J3573J1670J0708Q361
$$ 695638 698926 703860 712587 723768 735227 747776 762785 778428 792001 803671 814379 822740
58361H22740N063M559P262R408J0114J2782J8072K2166K3716K5831K9328L0598
$$ 822740 827803 832362 839624 849032 859146 871928 890000 912166 935882 961713 991041 1021639
58349A021639K8114K4573K0781J4009M296m253j0261j6510k2935k5320k2922k0248
$$ 1021639 1049753 1074326 1095107 1109116 1113412 1109159 1098898 1082388 1059453 1034133 1011211 990963
58337I90963j9079j6052j0369o392n854m812j213J686K332L963P787J0240J0091
$$ 990963 971884 955832 945463 939071 933217 928405 927192 928878 931210 935173 942960 953200 963291
58324I63291J1208J5201J8391J9043K0503K4250K7073K8020L0750L5987L9108
$$ 963291 974499 989700 1008091 1027134 1047637 1071887 1098960 1126980 1157730 1193717 1232825
58313A232825L8201L6916L6421L2538K3989J5424R086J704p150j2320j2231j2053
$$ 1232825 1271026 1307942 1344363 1376901 1400890 1416314 1425400 1427104 1419954 1407634 1395403 1383350
58301A383350j3995j3308p805k335L68M143J0474J4490J4517J6166K2105K7282
$$ 1383350 1369355 1356047 1348242 1345907 1346275 1350418 1360892 1375382 1389899 1406065 1428170 1455452
58289A455452K9139L2810M0828M7814N1072N6499O7789P9774Q8847J00069J17180
$$ 1455452 1484591 1517401 1558229 1606043 1657115 1713614 1781403 1861177 1950024 2050093 2167273
58278B167273J35346J50455J65690J81951J91640J89156J77881J60105J30577
$$ 2167273 2302619 2453074 2618764 2800715 2992355 3181511 3359392 3519497 3650074
58269C650074Q7539L9583n801n0007r2295j22854j35684j37417j34761j24383
$$ 3650074 3737613 3777196 3771395 3721388 3629093 3506239 3370555 3233138 3098377 2973994
58259B973994j04151q2482o6357n1188l2470j6191p386K02J2417K3958K9836L5738
$$ 2973994 2869843 2787361 2721004 2669816 2637346 2621155 2613769 2613971 2626388 2650346 2680182 2715920
58247B715920M6179N4349N5131N6084O3855P2059P4502P7451Q6424R4213R5118
$$ 2715920 2762099 2816448 2871579 2927663 2991518 3063577 3138079 3215530 3301954 3396167 3491285
58236C491285R7416J07967J18427J21032J23719J34730J46888J52760J60181J76519
$$ 3491285 3588701 3696668 3815095 3936127 4059846 4194576 4341464 4494224 4654405 4830924
58226D830924J93127K02501K14468K37481K60933K75129K91071L20100L52306
$$ 4830924 5024051 5226552 5441020 5678501 5939434 6214563 6505634 6825734 7178040
58217G178040L76859M04716M48034M96748N40303N92020O65682P49661Q32734
$$ 7178040 7554899 7959615 8407649 8904397 9444700 10036720 10702402 11452063 12284797
58208A2284797R32824J069846J235296J423371J666214J998150K407920K866252
$$ 12284797 13217621 14287467 15522763 16946134 18612348 20610498 23018418 25884670
58200B5884670L376008L954862M601035N329104O214113P351494Q807433J0661420
$$ 25884670 29260678 33215540 37816575 43145679 49359792 56711286 65518719 76180139
58192G6180139J3050591J6107093J9911506K4574709L0210736L6546718M2476104
$$ 76180139 89230730 105337823 125249329 149824038 180034774 216581492 259057596
58185B59057596M6147056M5613744L9496948K7398588J0325475q989728k6633918
$$ 259057596 305204652 350818396 390315344 417713932 428039407 419049679 392415761
58178C92415761l9160893m5196556m5613484m2342503l7156499l1302893k5644671
$$ 392415761 353254868 308058312 262444828 220102325 182945826 151642933 125998262
58171A25998262k0707501j6643991j3370475j0776576q769424p215362n971878
$$ 125998262 105290761 88646770 75276295 64499719 55730295 48514933 42543055
58164D2543055m967315m179016l558190l040071k602653k252587j969498j716824
$$ 42543055 37575740 33396724 29838534 26798463 24195810 21943223 19973725 18256901
58156A8256901j490934j309363j163188j025793q96711p94098p13248o32152n50101
$$ 18256901 16765967 15456604 14293416 13267623 12370912 11576814 10863566 10231414 9681313
58147I681313m83614m30620l73712l13510k65392k27205j81781j28683q3363m6962
$$ 9681313 9197699 8767079 8393367 8079857 7814465 7587260 7405479 7276796 7193433 7146471
58137G146471o053L8634P1765R2506J17784J55280J98553K50513L25692M25614
$$ 7146471 7140418 7179052 7250817 7343323 7461107 7616387 7814940 8065453 8391145 8816759
58127H816759N37033O60037Q14380J013126J255538J553533J938687K432304L036727
$$ 8816759 9353792 10013829 10828209 11841335 13096873 14650406 16589093 19021397 22058124
58118B2058124L770352M671598N718884O743152P441903P483609O609382M708882
$$ 22058124 25828476 30500074 36218958 42962110 50404013 57887622 64497004 69205886
58110F9205886J915271j321159m322211o470774p503054p559396o983552o092825
$$ 69205886 71121157 69799998 65477787 59007013 51503959 43944563 36961011 30868186
58102C0868186n098048m137527l300900k618049k070566j633487j294817j039658
$$ 30868186 25770138 21632611 18331711 15713662 13643096 12009609 10714792 9675134
58094I675134q42916o87458n72372m95498m42633m01493l72254l55752l43598
$$ 9675134 8832218 8144760 7572388 7076890 6634257 6232764 5860510 5504758 5161160
58085E161160l28650l14196l03753k91445k71201k46553k22686j97181j67255
$$ 5161160 4832510 4518314 4214561 3923116 3651915 3405362 3182676 2985495 2818240
58076B818240j38436j17311j02536r1123q6415r1027r8356j00147r7214r4483
$$ 2818240 2679804 2562493 2459957 2368834 2282419 2191392 2093036 1992889 1895675 1801192
58066A801192r0931q3029p3187o6075o0574n3265m5926m1940l9166l3995k8689
$$ 1801192 1710261 1627232 1554045 1487970 1427396 1374131 1328205 1286265 1247099 1213104 1184415
58055A184415k7360k8149k6713k4016k3467k3757k1670j8835j8569j9109j6955
$$ 1184415 1157055 1128906 1102193 1078177 1054710 1030953 1009283 990448 971879 952770 935815
58044I35815j3939j3985j5589j4598j1765j0761j1145j0052q469r075j0099q111
$$ 935815 921876 907891 892302 877704 865939 855178 844033 833981 825512 816437 806338 798227
58032G98227m803m322n888n767m647o143r473j0425q589p202o759m956k152r22
$$ 798227 793424 789102 783214 777447 772800 766657 757184 746759 738170 730968 724209 719253 717101 716179
58018G16179p69J088M374O529P871J0720J4334J6123J6911J9795K4630K8859L2833
$$ 716179 715410 716498 720872 727401 735272 745992 760326 776449 793360 813155 837785 866644 899477
58005H99477L9024M6762N2872N6732N9691O0347N5648M5957L4093K0224K833j6113
$$ 899477 938501 985263 1038135 1094867 1154558 1214905 1270553 1316510 1350603 1370827 1373660 1357547
57993A357547l2223m4423n4643o2485o5439o3943o1091n7447n1232m3322l7002
$$ 1357547 1325324 1280901 1226258 1163773 1098334 1034391 973300 915853 864621 821299 784297
57982G84297l2703k7905k2375j8664j7165j5405j2632j0702r979q715o865o332
$$ 784297 751594 723689 701314 682650 665485 650080 637448 626746 616767 608052 601187 594855
57970E94855p050o801n243m242m035k940j021j64l20M66K226L042K854L417M373
$$ 594855 587805 581004 575761 571519 567484 564544 563523 563359 563039 563505 565731 568773 571627 575044 579417
57955E79417L390L67k227l521m971o754p242o380n928o016n002l038k134k421
$$ 579417 582807 583174 580947 577426 572455 565701 558459 552079 546151 540135 535133 532095 529961 527540
57941E27540j912k25R52J390K680M721N494M683M154M408L960K640K078K465K181
$$ 527540 525628 525403 526355 527745 530425 535146 540640 545323 549477 553885 557845 560485 562563 565028 567209
57926E67209J018N67J077J239J257K708N024N707M436L428L273K038q33l333m486
$$ 567209 568227 568794 569871 571110 572367 575075 580099 585806 590242 593670 596943 598981 598148 594815 590329
57911E90329n748p828r458j0208j1399j3206j3903j2998j2237j2528j2657j1927
$$ 590329 584581 576753 567295 557087 545688 532482 518579 505581 493344 480816 468159 456232
57899D56232j1305j1074j0134q422p426p429o815m846k648q97R51K665L140K771
$$ 456232 444927 433853 423719 415297 407871 400442 393627 388781 386133 385236 386187 388852 391992 394763
57885C94763L295M791N509N094N186O377P358P637Q203R065Q917P750P029O826
$$ 394763 398058 402849 408358 413452 418638 425015 432373 440010 448213 457278 466195 473945 480974 487800
57871D87800N709L775K662K152K23k916m427l441k635l916n812o603o796p002
$$ 487800 493509 497284 499946 502098 502321 499405 494978 491537 488902 484986 479174 472571 465775 458773
57857D58773o285m398k984k894k762j617l99L83J956M725O968P638Q099R570J1075
$$ 458773 452488 448090 445106 442212 439450 437833 437434 437817 439773 444498 451466 459104 467203 476773 487848
57842D87848J1420J1028J0429R147P355O484O752O327M227J881M94q29k877m583
$$ 487848 499268 510296 520725 529872 537227 543711 550463 556790 561017 562898 563392 562563 559686 555103
57828E55103n107n575p055q656r168q855q235o889m797l175k606k112j147o54
$$ 555103 549996 544421 537366 528710 519542 510687 502452 495563 490766 487591 484985 482873 481726 481072
57814D81072j022r58K88J509J713J704K160K045N06j401k389k863l786n037o113
$$ 481072 480050 479092 479380 480889 482602 484306 486466 488511 489017 487616 485227 482364 478578 473541 467428
57799D67428p014p470o883n866o041p389p832o416m780m238l670j871J51J046
$$ 467428 460414 452944 446061 440195 434154 426765 418933 412517 407737 403499 399829 397958 398109 399155
57785C99155J399K324L357L563L341L423L373K661K014K246K799K873K861L457
$$ 399155 400554 402878 406235 409798 413139 416562 419935 422596 424610 426856 429655 432528 435389 438846
57771D38846M387N168O055P329Q675R985J1508J2671J2314J0699R448Q821P097
$$ 438846 443233 448401 454456 461785 470460 480445 491953 504624 516938 527637 537085 545906 553003
57758E53003L557n4k240l821n942q038r281j0189j1246j1634j0909j0207j0285
$$ 553003 556560 556506 554266 550445 544503 536465 527184 516995 505749 494115 483206 472999 462714
57745D62714j0019q399o372n146m219k735j232m60J50J267K243K400K311K493
$$ 462714 452695 444296 437924 432778 428559 425824 424592 424132 424282 425549 427792 430192 432503 434996
57731D34996K299J483J224K152L014K802K551L438M778N576O284P245P237N536
$$ 434996 437295 438778 440002 442154 445168 447970 450521 453959 458737 464313 470597 477842 485079 490615
57717D90615L879M130N413N669M873M523N008N574O010O455O415N670N236N846
$$ 490615 494494 498624 504037 509706 514579 519102 524110 529684 535694 542149 548564 554234 559470 565316
57703E65316O528O333O232P589R951J2197J4636J8059K1787K4721K7256L0291
$$ 565316 571844 578177 584409 591998 601949 614146 628782 646841 668628 693349 720605 750896
57691G50896L3310L5415L7259M0036M3557M7242N1925N8671O6821P5301Q4805
$$ 750896 784206 819621 856880 896916 940473 987715 1039640 1098311 1165132 1240433 1325238
57680A325238R6465J09317J21398J32396J42685J50457J52491J47492J36384J19653
$$ 1325238 1421703 1531020 1652418 1784814 1927499 2077956 2230447 2377939 2514323 2633976
57670B633976R7100P0307M3031J8869K99j0097r987J09J5737L0220L6658K9057
$$ 2633976 2731076 2801383 2844414 2863283 2863582 2853485 2843498 2843607 2859344 2889564 2926222 2955279
57658B955279M119l6643q6729j36693j76764j99822k04363j94648j76777j54837
$$ 2955279 2959398 2922755 2836026 2699333 2522569 2322747 2118384 1923736 1746959 1592122
57648A592122j31231j08708q9674p4227o1042m9778m0914l3797k7022k0413j4792
$$ 1592122 1460891 1352183 1262509 1188282 1127240 1077462 1036548 1002751 975729 955316 940524
57637I40524j0034n181k82L704O748R866J3594J7775K2563K8150L3853L8992M4222
$$ 940524 930490 925309 925027 928731 935479 945345 958939 976714 999277 1027427 1061280 1100272 1144494
57624A144494N0584N7809O5132P2929Q1813R0820R8550J05433J12573J18805J21071
$$ 1144494 1195078 1252887 1318019 1390948 1472761 1563581 1662131 1767564 1880137 1998942 2120013
57613B120013J17462J07820R1852O9098M0861R955k1431n1754p8481r8901j12644
$$ 2120013 2237475 2345295 2437147 2506245 2547106 2557061 2535630 2483876 2405395 2306494 2193850
57602B193850j21146j24762j22827j16582j09171j02161r4529q5716p7168p0010
$$ 2193850 2072704 1947942 1825115 1708533 1599362 1497201 1402672 1316956 1239788 1169778
57592A169778o3512n7010n1255m6764m2636l8158l3945l0531k7406k4356k2174
$$ 1169778 1106266 1049256 998001 951237 908601 870443 836498 805967 778561 754205 732031
57581G32031k1069j9859j7800j5768j4652j3871j2519j0807r343q061o781n868
$$ 732031 710962 691103 673303 657535 642883 629012 616493 605686 596343 588282 581501 575633
57569E75633n549n376m970m519m093l424k705k512k658k238j203n94q23r89m34
$$ 575633 570084 564708 559738 555219 551126 547702 544997 542485 539827 537589 536386 535792 534969 533980 533546
57554E33546L21O94R56J435J973K666M060O053P749Q734R541J0507J1366J2233
$$ 533546 533867 534561 535517 536952 538925 541591 545651 551704 559453 568187 577728 588235 599601 611834
57540F11834J3700J5725J7739K0066K3712K8361L2337L5018L7699M1409M5609
$$ 611834 625534 641259 658998 679064 702776 731137 763474 798492 836191 877600 923209
57529I23209M9777N4558O0439O6781P3142P9903Q6717R1883R4427R5174R4524
$$ 923209 972986 1027544 1087983 1154764 1227906 1307809 1394526 1486409 1580836 1676010 1770534
57518A770534R0700Q1579O7006M7936K4844j253k7433n0493o9315q4185r4601
$$ 1770534 1861234 1942813 2009819 2057755 2082599 2081346 2053913 2003420 1934105 1849920 1755319
57507A755319r9567r9531r6322r1269q4769p7388o9989o2797n5527m8428m2244
$$ 1755319 1655752 1556221 1459899 1368630 1283861 1206473 1136484 1073687 1018160 969732 927488
57496I27488l7159l2673k8466k4678k1438j8768j6757j5304j3851j1912r587p203
$$ 927488 890329 857656 829190 804512 783074 764306 747549 732245 718394 706482 696895 689692
57484F89692m843k656j051q8Q47K360M548P493J1410J5878J9774K2644K5406K9039
$$ 689692 684849 682193 681142 681054 681901 684261 688809 696302 707712 723590 743364 766008 791414 820453
57470H20453L3365L7821M2583M8088N4124O0326O6930P4214Q1631Q8219R3265
$$ 820453 853818 891639 934222 982310 1036434 1096760 1163690 1237904 1319535 1407754 1501019
57459A501019R5875R4587Q8279P6899O0800M0093J5528j0734l6144n8990p8027
$$ 1501019 1596894 1691481 1779760 1856659 1917459 1957552 1973080 1962346 1926202 1867212 1789185
57448A789185r1856r9825j02833j02252r8630r2354q4679p6903o9129o1100n3589
$$ 1789185 1697329 1597504 1494671 1392419 1293789 1201435 1116756 1039853 970724 909624 856035
57437H56035m7605m2748l7862l2933k8907k5895k3057k0230j8189j7050j5793
$$ 856035 808430 765682 727820 694887 665980 640085 617028 596798 578609 561559 545766
57426E45766j3766j1645j0456j0357j0681j0541r329p259n380m519m345m081l721
$$ 545766 532000 520355 509899 499542 488861 478320 468991 461732 456352 451833 447488 443407 439686
57413D39686l653l523k591j131k37k54m83n06o52r54q84l79j00k65k07M72J234
$$ 439686 436033 432510 429919 428788 428551 428297 427814 427308 426656 425702 424818 424439 424339 424074 423867 424339 425573
57396D25573J600J845K187K159J565J222J915L105L641L329L016L254L694L847
$$ 425573 427173 429018 431205 433364 434929 436151 438066 441171 444812 448141 451157 454411 458105 461952
57382D61952L725L620L628L657L598L373L031K813K915L180L144K599J842J273
$$ 461952 465677 469297 472925 476582 480180 483553 486584 489397 492312 495492 498636 501235 503077 504350
57368E04350Q26J58p12j222j020n53n68j138j645j696j596j795k223k498k434
$$ 504350 505176 505334 504622 503400 502380 501827 501259 500121 498476 496780 495184 493389 491166 488668 486234
57353D86234k177j977j948j949j698j194q46q72q18k42M08L60j67j98M44R00Q10
$$ 486234 484057 482080 480132 478183 476485 475291 474445 473573 472755 472513 472921 473281 473114 472916 473360 474260 475070
57336D75070Q63J396J664J277J137J938K821K731K157K171K482K031J048Q83J845
$$ 475070 475933 477329 478993 480270 481407 483345 486166 488897 491054 493225 495707 497738 498786 499669 501514
57321E01514K795K980K882K953K831K270J831K105K972L994M823N080M608M104
$$ 501514 504309 507289 510171 513124 515955 518225 520056 522161 525133 529127 533950 539030 543638 547742
57307E47742M629O215P681Q054P516O754O209O235P002P949Q103P404O883P131
$$ 547742 552371 558586 566267 574321 581837 588591 594800 601035 608037 615986 624089 631493 638376 645507
57293F45507P461P168O721O915P545P869P922Q363R229R755R515R050R147R901
$$ 645507 652968 660136 666857 673772 681317 689186 697108 705471 714700 724455 733970 743020 752167 762068
57279G62068J0764J1207J1265J1388J1776J1941J1145R251O782M119J061k574
$$ 762068 772832 784039 795304 806692 818468 830409 841554 850805 857587 861706 862767 860193
57267H60193o298r266j1076j1973j2388j2531j2322j1659j0700r889r420q864
$$ 860193 853895 844629 833553 821580 809192 796661 784339 772680 761980 752091 742671 733807
57255G33807p661n950m480l621k933j884n23P25J607K115K331K421K561K759K891
$$ 733807 726146 720196 715716 712095 709162 707278 706755 707480 709087 711202 713533 715954 718515 721274 724165
57240G24165K964L070L127K997K830K918L276L734M301M911M994M125L056L154
$$ 724165 727129 730199 733326 736323 739153 742071 745347 749081 753382 758293 763287 767412 770468 773622
57226G73622M568N844N832N077M821N344O054O582O965P134P009O914P302Q157
$$ 773622 778190 784034 789866 794943 799764 805108 811162 817744 824709 831843 838852 845766 853068 861225
57212H61225R007R369Q947P861O928P167Q582R983J0479J0503J0840J1394J1695
$$ 861225 870232 879601 888548 896409 903337 910504 919086 929069 939548 950051 960891 972285 983980
57199I83980J1942J2524J3040J2896J2487J2637J3123J2899J1771J0670J0152
$$ 983980 995922 1008446 1021486 1034382 1046869 1059506 1072629 1085528 1097299 1107969 1118121
57188A118121R852R590R878J0889J1893J2260J2250J2304J2288J2022J1934J2570
$$ 1118121 1127973 1137563 1147441 1158330 1170223 1182483 1194733 1207037 1219325 1231347 1243281 1255851
57176A255851J3848J5263J6638J8202K0177K2444K4520K5838K6444K7243K9052
$$ 1255851 1269699 1284962 1301600 1319802 1339979 1362423 1386943 1412781 1439225 1466468 1495520
57165A495520L1449L3287L4266L5220L6733L8402L9789M1177M3021M5376M8224
$$ 1495520 1526969 1560256 1594522 1629742 1666475 1704877 1744666 1785843 1828864 1874240 1922464
57154A922464N1628N5121N7796N9482O1003O2827O4433O5536O6989O9598P2874
$$ 1922464 1974092 2029213 2087009 2146491 2207494 2270321 2334754 2400290 2467279 2536877 2609751
57143B609751P5681P7239P6736P3165O6893O0731N7963N9575O4204P0089P5951
$$ 2609751 2685432 2762671 2839407 2912572 2979465 3040196 3098159 3157734 3221938 3292027 3367978
57132C367978Q0772Q4396Q8042R2880R8298J02895J06741J11173J16590J22114
$$ 3367978 3448750 3533146 3621188 3714068 3812366 3915261 4022002 4133175 4249765 4371879
57122D371879J27488J33677J41354J50068J59380J69641J81470J95303K11475
$$ 4371879 4499367 4633044 4774398 4924466 5083846 5253487 5434957 5630260 5841735
57113E841735K29703K48739K67767K88138L12566L42831L79516M23726M77892
$$ 5841735 6071438 6320177 6587944 6876082 7188648 7531479 7910995 8334721 8812613
57104H812613N45534O31703P43050Q85790J064113J281704J542805J849599K201648
$$ 8812613 9358147 9989850 10732900 11618690 12682803 13964507 15507312 17356911 19558559
57095A9558559K602944L068694L620053M271464N025294N874163O799049P764667
$$ 19558559 22161503 25230197 28850250 33121714 38147008 44021171 50820220 58584887
57087E8584887Q725640R640061J0471351J1179615J1723655J2065886J2142087
$$ 58584887 67310527 76950588 87421939 98601554 110325209 122391095 134533182
57080A34533182J1806478J0841167R085458O592340L648370O20722k224408m778123
$$ 134533182 146339660 157180827 166266285 172858625 176506995 177127717 174903309 170125186
57072A70125186p019490q931446j0474124j1599542j2271276j2480968j2261145
$$ 170125186 163105696 154174250 143700126 132100584 119829308 107348340 95087195
57065I5087195j1683551j0841103r829052q735552p635605o584310n615900m750482
$$ 95087195 83403644 72562541 62733489 53997937 46362332 39778022 34162122 29411640
57057B9411640l999230l363411k834304k398272k041012j747252j501341j291677
$$ 29411640 25412410 22048999 19214695 16816423 14775411 13028159 11526818 10235141
57049A0235141j112971r62633q36871p31280o42551n67624n03049m46671l98205
$$ 10235141 9122170 8159537 7322666 6591386 5948835 5381211 4878162 4431491 4033286
57040D033286l56919l20485k87312k57957k32809k10287j88822j69036j52293
$$ 4033286 3676367 3355882 3068570 2810613 2577804 2367517 2178695 2009659 1857366
57031A857366j38451j26524j16295j07822j00339r2974q5750p8895p2111o5447
$$ 1857366 1718915 1592391 1476096 1368274 1267935 1174961 1089211 1010316 938205 872758
57021H72758n9691n5025n0358m5027l9976l6212l3299l0477k8094k6712k5705
$$ 872758 813067 758042 707684 662657 622681 586469 553170 522693 494599 467887 442182
57010D42182k4073k1898j9943j8465j7341j6659j6267j5507j4227j3220j2897
$$ 442182 418109 396211 376268 357803 340462 323803 307536 292029 277802 264582 251685
56999B51685j2556j1731j1195j1508j1684j0538q517o932o022m912k921J62M501
$$ 251685 239129 227398 216203 204695 193011 182473 173956 167024 161002 156090 153169 153331 157832
56986A57832R950J5864K1969K8716L5931M1808M4137M2021L6010K7743K0252J7181
$$ 157832 167782 183646 205615 234331 270262 312070 356207 398228 434238 461981 482233 499414
56974D99414K0431K9298M2820O1663Q6715J17399J53084J95009K45163L04504
$$ 499414 519845 549143 591963 653626 740341 857740 1010824 1205833 1450996 1755500
56964A755500L73620M52633N35844O05317O32073N86863M54322K43879p557k46384
$$ 1755500 2129120 2581753 3117597 3722914 4354987 4941850 5396172 5640051 5632494 5386110
56954E386110m25292n24264n53000n35241m91957m36168l76046l17418k63883
$$ 5386110 4960818 4436554 3883554 3348313 2856356 2420188 2044142 1726724 1462841
56945A462841k17202j77998j45617j18353r4984p5496n9848m6982l5843k6364
$$ 1462841 1245639 1067641 922024 803671 708687 633191 573343 526361 490518 464154
56935D64154j8599j1669m426L572J2245K1156K8623L1452K6764J4089m440k5207
$$ 464154 445555 433886 429460 433032 445277 466433 495056 526508 553272 567361 562921 537714
56923E37714m4022n7199o3091o2619n7966n0997m3134l5727k9610k4635k0289
$$ 537714 493692 436493 373402 310783 252817 201820 158686 122959 93349 68714 48425
56912D8425j6519j3490G423a263o667n314m626m094l154j621J33J443K020K258
$$ 48425 31906 18416 7423 -1263 -7930 -13244 -17870 -21964 -25118 -26739 -26606 -25163 -23143 -20885
56898b0885K588K894L015L556c623C952R719J1734J4638J8519K2200K5186K8545
$$ -20885 -18297 -15403 -12388 -8832 -3623 3952 13671 25405 40043 58562 80762 105948 134493
56885A34493L2928L6755L7340L3204K4503J2069k679j7198k8408l4300l4768l1191
$$ 134493 167421 204176 241516 274720 299223 311292 308613 291415 263007 228707 193939 162748
56873A62748k5525j9484j3867q531l114K399P906J3576J9850K7246L6209M6840
$$ 162748 137223 117739 103872 95341 92227 94626 102532 116108 135958 163204 199413 246253
56861B46253N8682P1014Q2977R2663R6347Q9731P0705M0909N128l0073n7978p4199
$$ 246253 304935 375949 458926 551589 647936 737667 808372 849281 854409 824336 766358 692159
56849F92159p8704p4838o6037n4158m0636k7359j5459m495O213J6544K6736L8413
$$ 692159 613455 538617 472580 418422 377786 350427 334968 330473 336686 353230 379966 418379
56837D18379N3127P0590Q9451J09027J28712J45667J54073J47090J19949P2878
$$ 418379 471506 542096 631547 740574 869286 1014953 1169026 1316116 1436065 1508943
56827A508943J2724m8593r9091j31711j45583j43967j31797j14022r4355p4775
$$ 1508943 1521667 1473074 1373983 1242272 1096689 952722 820925 706903 612548 537773
56817E37773n6364m0079k6218j3732j135J2050K5407L8950N3503O9674Q6726J02068
$$ 537773 481409 441330 415112 401380 400245 412295 437702 476652 530155 599829 686555 788623
56805G88623J11350J09527R2926O1137J7768k9874p2388j01800j15342j15827
$$ 788623 899973 1009500 1102426 1163563 1181331 1151457 1079069 977269 861927 746100
56795G46100j08032r5334p9896o4122n0100l8160k7450j7667r084j301O754J5581
$$ 746100 638068 542734 462838 398716 348616 310456 283006 265339 256255 254954 261708 277289
56783B77289K4898L4480M4137N2814N8468N8833N1871L6263J2860j4288l9333
$$ 277289 302187 336667 380804 433618 492086 550919 602790 639053 651913 637625 598292
56772E98292n7513o6836o7900o3198n6086m8992m2319l5565k9066k3824k0073
$$ 598292 540779 473943 406043 342845 286759 237767 195448 159883 130817 106993 86920
56761H6920j7126j4482j2119j0005q231p321p341C200b183k910j542j772k229
$$ 86920 69794 55312 43193 33188 24957 17636 10295 3200 -2183 -5093 -6635 -8407 -10636
56748a0636j816r55m55l55l84o07j062j451j586j535j265p31l58o41j258j401
$$ -10636 -12452 -13407 -13862 -14217 -14601 -15208 -16270 -17721 -19307 -20842 -22107 -22838 -23196 -23837 -25095 -26496
56732b6496j007p81r78j061p28l46j89o6O2r5n12p51o62n28m26j81L6j09l62j04
$$ -26496 -27503 -28284 -29262 -30323 -31051 -31397 -31586 -31652 -31590 -31685 -32197 -32948 -33610 -34138 -34564 -34745 -34709 -34818 -35180 -35284
56712c5284N87J022J047J163J416J248O78N21J044J377Q26o7l53P3O15R28J123
$$ -35284 -34697 -33675 -32628 -31465 -30049 -28801 -28123 -27602 -26558 -25181 -24355 -24422 -24775 -24702 -24087 -23159 -22036
56695b2036J445J964K461K515K031J492J321J238Q41N34R07J568J565R79b92A355
$$ -22036 -20591 -18627 -16166 -13651 -11620 -10128 -8807 -7569 -6728 -6194 -5287 -3719 -2154 -1175 -292 1355
56678C675K118J477J155J152J032P34N17N21O84Q28P28M12K22K46L0o33j091p70
$$ 3675 5793 7270 8425 9577 10609 11343 11860 12381 13065 13893 14621 15033 15255 15501 15531 14898 13807 13037
56660A3037k23l47r33j138r53j044j422j626j915F34b905k725n69J011Q36l51
$$ 13037 12814 12467 11534 10396 9443 8399 6977 5351 3436 634 -2905 -5630 -6199 -5188 -4352 -4703
56644d703j406k024k150j576o40k9L62J164K038J971J321J747b73E176O017O087
$$ -4703 -6109 -8133 -10283 -11859 -12499 -12528 -12166 -11002 -8964 -6993 -5672 -3925 -273 5176 11193 17280
56628A7280O389O198M888L334K506J957R61n9l70j96k5K65O30L34p45j365o17
$$ 17280 23669 29867 34755 38089 40595 42552 43513 43454 43084 42888 42863 43128 43758 44092 43347 41982 41365
56611D1365O21J085Q89P95P10K46j74rL00J53l8L75J058J333J325J333R09j83
$$ 41365 41986 43071 43960 44755 45465 45711 45537 45528 45828 45981 45943 46318 47376 48709 50034 51367 52276 52093
56593E2093r15k32J156J672J145Q18J398K246K547K232J750J568J858K209J995
$$ 52093 51178 50946 52102 53774 54919 55737 57135 59381 61928 64160 65910 67478 69336 71545 73540
56578G3540J310R28J068J013M67K00O66J125J003J034J898K771K528J627J374
$$ 73540 74850 75778 76846 77859 78326 78526 79192 80317 81320 82354 84252 87023 89551 91178 92552
56563I2552J890K229K137K319L146M137M753M925M972N503O980Q906R999R782
$$ 92552 94442 96671 98808 101127 104273 108410 113163 118088 123060 128563 135543 144449 154448 164230
56549A64230R203R176R362R137Q798Q875R155R271R408R595R219Q161P312P001
$$ 164230 173433 182609 191971 201108 209906 218781 227936 237207 246615 256210 265429 273590 280902 287903
56535B87903O138M120K229J676J463mk235l572l986m845o293o970o388n686n852
$$ 287903 294041 298161 300390 302066 303529 303525 301290 297718 293732 288887 282594 275624 269236 263550 257698
56520B57698o688p766q960r879r994r637r736j0399j0677r975q818q035p860p945
$$ 257698 251010 243244 234284 224405 214411 204774 195038 184639 173962 163987 155169 147134 139274 131329
56506A31329p760p045o136n597n323m665l662l191l405l183j869l83K96N88J131
$$ 131329 123569 116524 110388 104791 99468 94803 91141 87950 84545 81362 79493 79110 79406 79994 81125
56491H1125J418R28M17O66R45L49l82l8Q87J032M87M56J109J526J420J335J411
$$ 81125 82543 83471 83888 84554 85499 85848 85466 85428 86315 87347 87834 88290 89399 90925 92345 93680 95091
56474I5091J434J722K545L146K757K020J994K386K288K019K473L234L191K554
$$ 95091 96525 98247 100792 103938 106695 108715 110709 113095 115383 117402 119875 123109 126300 128854
56460A28854K563L423M206M436M321L800K952K711L597M419L883K731K423K601
$$ 128854 131417 134840 139046 143482 147803 151603 154555 157266 160863 165282 169165 171896 174319 176920
56446A76920K008J174J668L244M186M254M711N587N521M487M205N414O921P728
$$ 176920 178928 180102 181770 185014 189200 193454 198165 203752 209273 213760 217965 223379 230300 238028
56432B38028P994P650O251M454L597L450K564R97M06J061J224R6r62j005r96j734
$$ 238028 246022 253672 259923 264377 267974 271424 273988 274985 275391 276452 277676 277772 276810 275805 274809 273075
56416B73075k360k120j899k736m208n330n878o038n854n639n859o231o027n425
$$ 273075 270715 268595 266696 263960 259752 254422 248544 242506 236652 231013 225154 218923 212896 207471
56402B07471n296n567n343m605m229m220l695k721k360k708k739k293k193k256
$$ 207471 202175 196608 191265 186660 182431 178211 174516 171795 169435 166727 163988 161695 159502 157246
56388A57246j264O61J810J589J313J726J831J045L94N71P01R2m94l62j54n37j025
$$ 157246 155982 156643 158453 160042 161355 163081 164912 165957 166351 166922 167623 167715 167221 166859 166705 166168 165143
56371A65143r59m80J11P70J056M40m56l94M59O97J06M1R70J675J402R54R42P88
$$ 165143 164184 163704 163815 164585 165641 166081 165625 165231 165690 166387 166493 166534 167504 169179 170581 171535 172477 173265
56353A73265K43L9M36P18P36J243K198K563K255K366K966K724J341L20N56J144
$$ 173265 173508 173547 173983 174701 175437 176680 178878 181441 183696 186062 189028 191752 193093 193413 193969 195113
56337A95113J317J526J903J628O75K47P39J168J197J642K463K554K130K877M882
$$ 195113 196430 197956 199859 201487 202162 202409 203148 204316 205513 207155 209618 212172 214302 217179 222061
56322B22061O038N496N062N943O703O043N078N139N513N192M906N525O264O156
$$ 222061 228099 233595 238657 244600 251303 257346 262424 267563 273076 278268 283174 288699 294963 301119
56308C01119N781N977O272O005N474M917L914K804K809L810L954K611J534J877
$$ 301119 306900 312877 319149 325154 330628 335545 339459 342263 345072 348882 352836 355447 356981 358858
56294C58858K337J611N39J80j09j012j681j515j576k637l594l462l021l008k563
$$ 358858 361195 362806 363345 363525 363416 362404 360723 359208 357632 354995 351401 347939 344918 341910 339347
56279C39347j159j15m12p41M17K408L743M316M710M884M968N808P380Q297Q071
$$ 339347 338188 338073 337661 336920 337337 339745 343488 347804 352514 357398 362366 368174 375554 383851 391922
56264C91922Q069R067R912R936J0469J2495J4930J6783J8906K1954K4771K6483
$$ 391922 399991 409058 418970 428906 439375 451870 466800 483583 502489 524443 549214 575697
56252E75697K8166L0747L3323L5203L7423M0508M2918M3489M3351M3559M2944
$$ 575697 603863 634610 667933 703136 740559 781067 823985 867474 910825 954384 997328
56241I97328M0197L6102L1836K7025K1194J5189R573L717k158o354q639j1117
$$ 997328 1037525 1073627 1105463 1132488 1153682 1168871 1178444 1182161 1180003 1173649 1165010 1153893
56229A153893j4578j6766j6173j4695j4360j4280j3075j1666j1225j0965j0334
$$ 1153893 1139315 1122549 1106376 1091681 1077321 1063041 1049966 1038300 1027075 1016110 1005776
56218A005776j0807j3068j5086j5434j5865j8079k0653k1790k2399k3726k4611
$$ 1005776 994969 981901 966815 951381 935516 917437 896784 874994 852595 828869 804258
56207H04258k3911k2919k2703k1755j9057j6592j5841j4867j2003r375r365j0438
$$ 804258 780347 757428 734725 712970 693913 677321 661480 646613 634610 625235 615870 605432
56195F05432j0063q866q304p137m205j893k644m530m376k940k723l089j982m56
$$ 605432 595369 586503 578199 571062 566857 564964 562320 557790 553414 550474 547751 544662 542680 542224
56181E42224q92k431k468j131k60M77K353M184M099L175L452M137L443K375K734
$$ 542224 541332 538901 536433 535302 535042 535519 537872 542056 546155 549330 552782 556919 560362 562737 565471
56166E65471L346K277P43P49R40q80l206l285k101k308l137k112p3L20m17J29
$$ 565471 568817 571094 571837 572586 573526 572646 569440 566155 564054 561746 558609 556497 556424 556744 556327 556456
56150E56456J538J775J574K948M798M766L947N024P218P878P533Q463R879R553
$$ 556456 557994 559769 561343 564291 569089 573855 577802 582826 590044 597922 605455 613918 623797 633350
56136F33350Q744J0218J2905J3796J3803J6293K0944K4555K7006L0968L6496M1348
$$ 633350 642094 652312 665217 679013 692816 709109 730053 754608 781614 812582 849078 890426
56124H90426M5978N3119O3025P4031Q6868J03493J22713J41802J61009J81280
$$ 890426 936404 989523 1052548 1126579 1213447 1316940 1439653 1581455 1742464 1923744
56114A923744J99039K08808K09609K03511J89860J67388J40584J17258J00261
$$ 1923744 2122783 2331591 2541200 2744711 2934571 3101959 3242543 3359801 3460062
56105C460062Q7367P7777P1938O5948N3625L4540J4011m645k1756l6152m5457
$$ 3460062 3547429 3625206 3697144 3763092 3816717 3851257 3865268 3860623 3838867 3802715 3757258
56094C757258n1993o2083p8861j00845j26759j55592j82432k00705k08798k09126
$$ 3757258 3705265 3643182 3564321 3463476 3336717 3181125 2998693 2797988 2589190 2380064
56084B380064k01869j85818j64181j42708j22701j02271q3149o9141n8959m8145
$$ 2380064 2178195 1992377 1828196 1685488 1562787 1460516 1377367 1308226 1249267 1201122
56074A201122l7237l0414k6972k2164j5895j2345j1293q258l257r58j914j891
$$ 1201122 1163885 1133471 1106499 1084335 1068440 1056095 1044802 1036544 1033287 1032329 1030415 1028524
56062A028524j89k77j823n35L445N380M666N486Q329R296Q256R211J2061J2581
$$ 1028524 1028335 1028058 1026235 1025700 1029145 1034525 1039191 1044677 1053006 1062302 1070558 1079769 1091830 1104411
56048A104411J0975J1772J4912J5834J4573J5614J8598J8744J6624J7655K1586
$$ 1104411 1115386 1127158 1142070 1157904 1172477 1188091 1206689 1225433 1242057 1259712 1281298
56037A281298K2694K0668K0881K3549K3478K1136K2560K7488K9134K6826K7075
$$ 1281298 1303992 1324660 1345541 1369090 1392568 1413704 1436264 1463752 1492886 1519712 1546787
56026A546787L0966L2555L1167L2788L7680L9278L7237L8581M3954M6064M3939
$$ 1546787 1577753 1610308 1641475 1674263 1711943 1751221 1788458 1827039 1870993 1917057 1960996
56015A960996M4924N0094N1843M8937M9488N5685N9980O0046O2757O9643P3375
$$ 1960996 2005920 2056014 2107857 2156794 2206282 2261967 2321947 2381993 2444750 2514393 2587768
56004B587768P2668P5494Q3453Q8444Q8826R2824J01849J07027J06828J10849
$$ 2587768 2660436 2735930 2819383 2907827 2996653 3089477 3191326 3298353 3405181 3516030
55994C516030J21455J29348J32232J39451J52988J63003J67718J77967J96305
$$ 3516030 3637485 3766833 3899065 4038516 4191504 4354507 4522225 4700192 4896497
55985D896497K12119K23228K40664K66016K86895L01497L23386L55004L82300
$$ 4896497 5108616 5331844 5572508 5838524 6125419 6426916 6750302 7105306 7487606
55976G487606M03461M35395M82864N30355N74571O34159P15970Q04356Q96752
$$ 7487606 7891067 8326462 8809326 9339681 9914252 10548411 11264381 12068737 12965489
55967A2965489J015573J171565J353424J569910J860985K245551K697804L196838
$$ 12965489 13981062 15152627 16506051 18075961 19936946 22182497 24880301 28077139
55959B8077139L758475M398989N119416N956631P003483Q352135J0070137J2255333
$$ 28077139 31835614 36234603 41354019 47310650 54314133 62666268 72736405 84991738
55951H4991738J5048061J8566942K2914935K8235210L4514896M1083693M6324771
$$ 84991738 100039799 118606741 141521676 169756886 204271782 245355475 291680246
55944B91680246M8069552M4427293L4473444J8678052p95095k0282090l5833353
$$ 291680246 339749798 384177091 418650535 437328587 436533492 416251402 380418049
55937C80418049m4986425m7690857m5643526m0884233l4958898k8903507k3406463
$$ 380418049 335431624 287740767 242097241 201213008 166254110 137350603 113944140
55930A13944140j8793479j5059959j2077525r743289p947789o541421n407755
$$ 113944140 95150661 80090702 68013177 58269888 50322099 43780678 38372923
55923C8372923m506501l807874l247157k774040k386339k081918j826185j593841
$$ 38372923 33866422 30058548 26811391 24037351 21651012 19569094 17742909 16149068
55915A6149068j396433j242207j109127r80703q70227p86988p13293o35852n67504
$$ 16149068 14752635 13510428 12401301 11420598 10550371 9763383 9050090 8414238 7846734
55906G846734n17930m72967m21939l77163l48102l22432k90206k61998k46391
$$ 7846734 7328804 6855837 6433898 6056735 5708633 5386201 5095995 4833997 4587606
55897D587606k32716k12189j94243j86494j79196j64244j50020j43435j36223
$$ 4587606 4354890 4142701 3948458 3761964 3582768 3418524 3268504 3125069 2988846
55888B988846j22351j10729j07648j04209r3789q4714q3313q1195p1719o2912
$$ 2988846 2866495 2755766 2648118 2543909 2450120 2365406 2282093 2200898 2129179 2066267
55878B066267o1634o0464n2550m4581m2853m0711l1890k2858j9944j7012p410
$$ 2066267 2004633 1944169 1891619 1847038 1804185 1763474 1731584 1708726 1688782 1671770 1664360
55867A664360M020J1905K1347L7006N2614O1882O8754P6595P8140O6700M7044
$$ 1664360 1668380 1680285 1701632 1738638 1791252 1853134 1921888 1998483 2076623 2143323 2190367
55856B190367K5553K1l0945n9015p6947q8835j00041j06621j04342r8486r4627
$$ 2190367 2215920 2215941 2184996 2125981 2049034 1960199 1860158 1753537 1649195 1550709 1456082
55845A456082q8779p6638o3731n6332n0664m1104l1111k6088k2983j6954j1233
$$ 1456082 1367303 1290665 1226934 1170602 1119938 1078834 1047723 1021635 998652 981698 970465
55834I70465j0696j2306j1269j0245j3265j6848j6204j4128j4886j5252j0468
$$ 970465 959769 947463 936194 925949 912684 895836 879632 865504 850618 835366 824898
55823H24898l500M13L069Q573J4545J6424J5535J4680J0619o95j5723k7951l6643
$$ 824898 821398 821811 824880 833453 847998 864422 879957 894637 905256 904561 888838 860887 824244
55810H24244m3716m6826m3380l7082l2795k8836k1646j3777r718p842m119p7L89
$$ 824244 780528 733702 690322 653240 620445 591609 569963 556186 546468 538626 534507 534430 534819
55797E34819j374j747k061n636j0631j2930j3332j5144j7390j7017j5226j5116
$$ 534819 533445 531698 529637 524001 513370 500440 487108 471964 454574 437557 422331 407215
55785D07215j5518j3378r945q545q521p042m647l598l094j249P17J165K012M997
$$ 407215 391697 378319 368374 359829 351308 344266 339619 336021 332927 331678 332395 333560 335572 340569
55771C40569P177N254J316r72k606o190r960j0583r167q749q494n965k576j245
$$ 340569 347746 353000 354316 353344 350738 344548 334588 324005 314838 306089 297595 291630 289054 287809
55757B87809j008O14K181O43l142o270q858j2287j4838j4188j1967j0931j0023
$$ 287809 286801 287415 289596 290239 287097 280827 271969 259682 244844 230656 218689 207758 197735
55744A97735p077l873l310m034l016j110r61j709j029j33j437l389k920j028p41
$$ 197735 190658 186785 183475 179441 176425 175315 174354 172645 171616 171483 170046 166657 163737 162709 161968
55729A61968j435m50J480J597K34m02r16l180n803o066m906n113o101n287l178
$$ 161968 160533 160083 161563 163160 163394 162992 162076 158896 153093 147027 142121 137008 130907 125620 122442
55714A22442k267k319j331J87M22K48J566L245L173K586L952O219O750O142O488
$$ 122442 120175 117856 116525 116712 117134 117382 118948 122193 125366 127952 131904 138123 144873 151015 157503
55699A57503O731M634J695J081K163K061J170K089M331N132M563M928O026N673
$$ 157503 164234 168868 170563 171644 173807 175868 177038 179127 183458 188590 193153 198081 204107 209780
55685B09780M078L130K349O5k518k945k138k872m735n183m507n085o696p246p131
$$ 209780 213858 216988 219337 219402 216884 213939 211801 208929 204194 199011 194504 189419 182723 175477 168346
55670A68346q286r837r321p382o638o843n784l907l395l599k208l0K91n76K24
$$ 168346 160060 150223 140902 133520 126882 120039 114255 110348 106953 103354 101146 101116 101407 100831 101055
55655A01055K330K867J943K126L146K305j33j190o60j197k981l472k511k613l909
$$ 101055 103385 106252 108195 110321 113467 115772 115639 114449 113789 112592 109611 106139 103628 101015 97106
55640I7106l929k662k835m557m754k642r27p43j34J494K007O80m82o35j201k305
$$ 97106 93177 90515 87680 83123 78369 75727 74800 74057 73923 75417 77424 78104 77622 76987 75786 73481
55624G3481k184r55q93k159k250n20P37M98L74R74Q58m7N7J196J337M19O52K069
$$ 73481 71297 70342 69449 67290 65040 64520 65257 65755 66129 67103 67961 67914 67971 69167 70504 70923 71575 73644
55606G3644K053J68p69L14R51k47j303q49m97j384k010j379r74j727k171j388
$$ 73644 75697 75865 75096 75410 76361 76114 74811 73962 73465 72081 70071 68692 67718 65991 63820 62432
55590F2432q63j657k508k348k097k450k460j667j239j693j876j194n75l38M90
$$ 62432 61569 59912 57404 55056 52959 50509 48049 46382 45143 43450 41574 40380 39805 39467 39957
55575C9957J920K563K136J983K492K594K210K565L576L812L410M113N871O583
$$ 39957 41877 44440 46576 48559 51051 53645 55855 58420 61996 65808 69218 73331 79202 85785
55561H5785N841N720O989P676O460M522K918J013j510l685n309p262r175r427
$$ 85785 91626 97346 104335 112011 118471 122993 125911 126924 125414 121729 116420 109158 99983 90556
55547I0556q124p239p266o667n191m517m932m626l189k456k939k780j353o28j539
$$ 90556 82432 75193 67927 61260 56069 51552 46620 41994 38805 36349 33410 30630 29277 28649 27110
55532B7110k306j703r86j053p73L49P48k81j082n80j10p26j258o48K00L88N00
$$ 27110 24804 23101 22115 21062 20289 20638 21386 21105 20023 19443 19333 18607 17349 16701 16901 17289 17789
55515A7789Q64O58n7J16J232J362j78j548j468j046j266j366r75j254k481l010
$$ 17789 18653 19311 19254 19370 20602 21964 21786 20238 18770 17724 16458 15092 14117 12863 10382 7372
55499G372j977p20l24r9L90L15l47l64K15k19j616H59j34R22J21p08r9O62L87
$$ 7372 5395 4675 4351 4252 4642 4957 4610 4246 4461 4242 2626 859 725 1647 1768 1060 961 1623 2010
55480B010J91Q85J061j80j220p03J86J38n4M29N41m57j312D45c23j132j054l7
$$ 2010 2201 3086 4147 3967 2747 2044 2230 2368 2314 2743 3284 2827 1515 445 -323 -1455 -2509 -2546
55462b546L99m40q69O0O93l9m12P85g21b89j184r63K12L72K8O41B49P98D60d40
$$ -2546 -2147 -2587 -3456 -3396 -2703 -2742 -3154 -2369 -721 -289 -1473 -2436 -2224 -1852 -1824 -1183 249 1047 460 -440
55441f36c18C65J441J786Q71j39K42J238J123O3n40n71r08j424j313o38P1Q78
$$ -636 -318 365 1806 3592 4463 4324 4566 5804 6927 6990 6450 5879 4971 3547 2234 1596 1667 2545
55423B545J726J760P96K50J068K084J895J057P85Q72N59K00M60R65J180J446J931
$$ 2545 4271 6031 6827 7077 8145 10229 12124 13181 13966 14838 15397 15597 16057 17022 18202 19648 21579
55406B1579J923J374J524K771L662L341L124M077M965M406L217K738K490J444
$$ 21579 23502 24876 26400 29171 32833 36174 39298 43375 48340 52746 55963 58701 61191 62635
55392F2635qj099k223l663m331l573k649k731l048k671k402l059l654l155k376
$$ 62635 62627 61528 59305 55642 51311 47738 45089 42358 39310 36639 34237 31178 27524 24369 21993
55377B1993k283k137j227o05j062j289j91Q10N6j512k086j910k084k110j114j6
$$ 21993 19710 17573 16346 15741 14679 13390 13199 14009 14065 12553 10467 8557 6473 4363 3249 3233
55361C233k6l47J46N57k67j152m76P29M31q55I42m1L39l51h0j064j088q49l0N16
$$ 3233 3207 2860 3006 3563 3296 2144 1668 2397 2828 1973 942 901 1240 889 -80 -1144 -2232 -3081 -3111 -2595
55341b595N0l24O16e06G93lj64P31R58L73L75J066J132M03K8K23J11k61J4P10
$$ -2595 -2545 -2869 -2253 -506 793 790 626 1357 2315 2688 3063 4129 5261 5664 5692 5915 6026 5765 5779 6489
55321F489N70m92j218r81l14L76R94J000J6j070j162o30n41q19o94l12k85l24
$$ 6489 7059 6567 5349 4368 4054 4430 5424 6424 6440 5370 4208 3578 3037 2218 1524 1212 927 603
55303F03J37O98Q40J105J852J930M19j388j687q67n40q30p52l76m84a00m19J11
$$ 603 740 1438 2278 3383 5235 7165 7584 6196 4509 3642 3102 2272 1520 1144 660 -100 -519 -408
55285d08Q8a41A103K315J941P68M96J128J421J298J491J567P11k83j28N17J65
$$ -408 -320 -141 1103 3418 5359 6127 6623 7751 9172 10470 11961 13528 14239 13956 13828 14345 14510
55268A4510p23n80L38N02L0L08J144J061J26k31l0o38j939k313j531r80r35k04
$$ 14510 13787 13207 13545 14047 14077 14385 15529 16590 16716 16485 16455 15817 13878 11565 10034 9054 8119 7915
55250G915J233J826J118L62J43l40j196j333n87k22p22j039n43N7K25L03M37L54
$$ 7915 9148 10974 12092 12454 12597 12257 11061 9728 9141 8919 8197 7158 6615 6672 6897 7200 7637 7991
55232G991L70J007J637J187P9l41p7k68q72o73M05J144J234J532J996J520J17
$$ 7991 8361 9368 11005 12192 12271 11930 11853 11585 10713 10040 10445 11589 12823 14355 16351 17871 17988
55215A7988p96o30k34n3M17J075R69k6r02j166j172q74N9R75Q78K26K68Q65Q72
$$ 17988 17192 16562 16328 16275 16692 17767 18736 18710 17808 16642 15470 14596 14655 15630 16508 16734 17002 17867 18739
55196A8739M42O58J192P37l38k68R55J358K46p77o55l56p46j205j118q23m80J96
$$ 18739 19181 19839 21031 21768 21430 21162 22117 23475 23721 22944 22289 21933 21187 19982 18864 18041 17561 17757
55178A7757O84P1j014r25K05M25q29j859j545q21n40j75M69M80k57l80O63J536
$$ 17757 18441 18512 17498 16573 16778 17203 16374 14515 12970 12149 11609 11434 11903 12383 12126 11746 12409 13945
55160A3945J245O33O28O70oj019j685j955j752q01M08Q08L65P9J85m2n03k36O03
$$ 13945 15190 15823 16451 17121 17115 16096 14411 12456 10704 9903 10311 11119 11484 11563 11748 11706 11203 10967 11570
55141A1570P23L7q2O77R85M17K37R12J121K23m89j17L76J44j3N53R37L64l48l31
$$ 11570 12293 12330 12248 12925 13910 14327 14564 15476 16597 16820 16331 16214 16590 16734 16721 17274 18211 18575 18227 17896
55121A7896l5K1K81Q74R44M09O68K310L764L510K213J321R25L39l96q67j066r78
$$ 17896 17861 17882 18163 19037 19981 20390 21058 23368 27132 30642 32855 34176 35101 35440 35044 34177 33111 32133
55103C2133l83K08k30j399j635m12P57P37L18L30J11p92j216j73J333J791J313
$$ 32133 31750 31958 31728 30329 28694 28282 29039 29776 30094 30424 30535 29743 28527 28354 29687 31478 32791
55086C2791Q75O35L17K20N59P73M83J85Q8m98j658k123j120K72P12L92J31q8m86
$$ 32791 33666 34301 34618 34838 35397 36170 36653 36838 36926 36428 34770 32647 31527 31799 32511 32903 33034 32946 32460
55067C2460n59K1N99O22N35O76M42m44j051p31l12o96j339j257n41J92Q78J573
$$ 32460 31901 31922 32521 33143 33678 34354 34796 34352 33301 32570 32258 31562 30223 28966 28425 28617 29495 31068
55049C1068J858J561J150P49p2r89p93O35J705J398O28L87J95m53p66j80L26n9
$$ 31068 32926 34487 35637 36386 36314 35325 34532 35167 36872 38270 38898 39285 39480 39027 38261 38081 38407 38348
55031C8348l59N91K122K877K827K669K296J450Q77J283J988K011J616J520J440
$$ 38348 37989 38580 40702 43579 46406 49075 51371 52821 53698 54981 56969 58980 60596 62116 63556
55016F3556Q23J23P4M32O91J104J811J986J125J99J25J53q42k401l329l609l926
$$ 63556 64379 64502 64576 65008 65699 66803 68614 70600 71725 71924 72049 72202 71360 68959 65630 62021 58095
54999E8095m041l261k023j506j950k522k523j867q88m69j491l389m195k950r94
$$ 58095 54054 50793 48770 47264 45314 42792 40269 38402 37514 37045 35554 32165 27970 25020 24026
54984B4026P4M10Q16J031O80O39J709K869K637J359N38N26N95O28J073J687J877
$$ 24026 24100 24510 25326 26357 27037 27676 29385 32254 34891 36250 36788 37314 37909 38537 39610 41297 43174
54967D3174J916K352K720K301J665J957K959L353K727J885J368Q92K70j63p3P38
$$ 43174 45090 47442 50162 52463 54128 56085 59044 62397 65124 67009 68377 69269 69539 69376 69303 70041
54951G0041K389M443N871O290O657P956R839J1381J2456J3384J4035J4211J4221
$$ 70041 72430 76873 82744 89034 95691 103647 113486 124867 137323 150707 164742 178953 193174
54938A93174J4035J2716R693N818K057j857o361j0571j3245j4483j5091j5028
$$ 193174 207209 219925 229618 235436 237493 235636 229275 218704 205459 190976 175885 160857
54926A60857j3824j1949j0350r159q002o988o319n569m458l609l379k889j486
$$ 160857 147033 135084 124734 115575 107573 100585 94266 88697 84239 80630 77251 74362 72876
54913G2876j82j72p96o21L06Q88J029J547K524L360M148N501P258Q706R782J0855
$$ 72876 72694 72522 71726 71105 71411 72299 73328 74875 77399 80759 84907 90408 97666 106372 116154 127009
54897A27009J1791J2329J2798J3232J2576J0005O258K406j705o283j0016j1615
$$ 127009 138800 151129 163927 177159 189735 199740 205998 208404 206699 200416 190400 178785
54885A78785j1969j2767j3660j3053j1150r755r156p690m728j914p21o03l06K87
$$ 178785 166816 154049 140389 127336 116186 106431 97275 89585 84857 82943 82222 81619 81313 81600
54871H1600M23l50j769l013l223k448j796k007k398k123j644j770k037j526p03
$$ 81600 82023 81673 79904 76891 73668 71220 69424 67417 65019 62896 61252 59482 57445 55919 55216
54856E5216p96j774k522k641k535k040o92Q51J308O32p8l33n11o57n01m09q55
$$ 55216 54420 52646 50124 47483 44948 42908 42216 43067 44375 45007 44929 44596 44085 43428 42927 42518 41663
54839D1663j201o33J27l06j663k403k177j998k129j727p43j46j08K39R95J259
$$ 41663 40462 39829 39956 39650 37987 35584 33407 31409 29280 27553 26810 26664 26556 26795 27790 29049
54823B9049R56J085J766J859R86J97J08L3m11m15N11J570J911J720J421J018O90
$$ 29049 30005 31090 32856 34715 35701 35898 36006 36039 35628 35213 35724 37294 39205 40925 42346 43364 44054
54806D4054R56J707K151K050K021K356K676K941L576M365M533M273M732O158P406
$$ 44054 45010 46717 48868 50918 52939 55295 57971 60912 64488 68853 73386 77659 82391 88549 95955
54791I5955P828Q328R872J2100J4092J5467J6204J6211J5574J4472J2509R084
$$ 95955 103783 112111 121983 134083 148175 163642 179846 196057 211631 226103 238612 247696
54779B47696M630M78k697n362p844r698j0619j0804j0193q437n977m007k975k109
$$ 247696 252326 252804 250107 244745 236901 227203 216584 205780 195587 187150 181173 177166 174191 172082
54765A72082p27J002K901N274Q072J0521J2011J2602J2432J1543J0323R210P794
$$ 172082 171355 172357 175258 180532 188604 199125 211136 223738 236170 247713 258036 267246 275040
54752B75040N275J943r78l023m755o173o218m399j680P57K668M132M869M710L932
$$ 275040 280315 282258 281280 278257 273502 267329 261111 256712 255032 255789 258457 262589 267458 272168 276100
54737B76100K639N76k181n024p627j0102j2285j3648j4064j3780j2675j0491p842
$$ 276100 278739 279315 277134 272110 264483 254381 242096 228448 214384 200604 187929 177438 169596
54724A69596n870m853m158l573l512l853l865l426l161l198l005k578k515k751
$$ 169596 163726 158873 154715 151142 147630 143777 139912 136486 133325 130127 127122 124544 122029 119278
54710A19278k569k017j957k432k428j656j128j479k055k192k166k267k173j800
$$ 119278 116709 114692 112735 110303 107875 106219 105091 103612 101557 99365 97199 94932 92759 90959
54696I0959j671j818j452l05P39R81Q56J034J455J731J765J480Q60M32Q30J722
$$ 90959 89288 87470 86018 85713 86452 87433 88289 89323 90778 92509 94274 95754 96614 97046 97876 99598
54680I9598K075J642J193J191J436J996L200M629N392N534N800O031N386M233
$$ 99598 101673 103315 104508 105699 107135 109131 112331 116960 122352 127886 133686 139717 145103 149336
54666A49336M004M880N484N305N467O452P040O528O166P184Q878J0017J0807J2259
$$ 149336 153340 158220 163704 169009 174476 180928 187968 194496 200662 207846 216724 226741 237548 249807
54652B49807J4607J7437K0453K3242K5238K6571K7851K8509K6675K1549J4548
$$ 249807 264414 281851 302304 325546 350784 377355 405206 433715 460390 481939 496487
54641D96487P281k18q273j5975k2084k6388k9101k9932k8843k6763k4449k1656
$$ 496487 503768 503550 495277 479302 457218 430830 401729 371797 342954 316191 291742 270086
54629B70086j8248j5104j2979j1480j0071q969q125o579m036j864j274j517j145
$$ 270086 251838 236734 223755 212275 202204 193235 185110 178531 174495 172631 171357 169840 168695
54616A68695p5Q76J538K090K080J187L44O28J530J584L82j132k115k539k665k725
$$ 168695 168620 169496 171034 173124 175204 176391 176735 177363 178893 180477 180859 179727 177612 175073 172408 169683
54600A69683k949l352l699l991m447m819m532l753l316l257k674j504j030j861
$$ 169683 166734 163382 159683 155692 151245 146426 141894 138141 134825 131568 128894 127390 126360 124499
54586A24499k797k661j931j484j113m49j56p90j501j309p12p52j272j475j350
$$ 124499 121702 119041 117110 115626 114513 114064 113908 113118 111617 110308 109596 108844 107572 106097 104747
54571A04747j285j047l90P7j73m63j6P12R03P69P98N86j54l88Q07K449K929K424
$$ 104747 103462 102415 102025 102102 101929 101466 101450 102162 103065 103834 104632 105218 105064 104676 105483 107932 110861 113285
54553A13285K314K813L011K859L241M206M909N299O177P531Q385Q529Q939J0122
$$ 113285 115599 118412 121423 124282 127523 131729 136638 141937 148114 155645 164030 172559 181498 191620
54539A91620J1336J1818J1729J1540J1365J1190J0877R813P254L231j371n623
$$ 191620 202956 214774 226503 238043 249408 260598 271475 281288 288542 291773 290402 284779
54527B84779q990j1212j2431j3172j3611j3259j1941j0563j0003r723q523o355
$$ 284779 275789 264577 252146 238974 225363 212104 200163 189600 179597 169874 161351 154996
54515A54996m366l308k893k629k402k190j902j547j053k06Q45J440J327J112J236
$$ 154996 150630 147322 144429 141800 139398 137208 135306 133759 132706 132500 133345 134785 136112 137224 138460
54500A38460J184N28mM56J400J634J101P81J060J341J229J057J178J446J518J134
$$ 138460 139644 140172 140168 140624 142024 143658 144759 145540 146600 147941 149170 150227 151405 152851 154369 155503
54484A55503K70n88p09p2M29L09K66J010K001K245J698J031N70L69O74J376J578
$$ 155503 155773 155185 154476 154404 154833 155142 155408 156418 158419 160664 162362 163393 163963 164332 165006 166382 167960
54467A67960P08m68q86o20m22m71o18j125k055k613k223j662j866k348k079j256
$$ 167960 168668 168200 167314 166694 166272 165801 165183 164058 162003 159390 157167 155505 153639 151291 149212 147956
54451A47956p78n97o7M83K20o05j063j275k086l223l428k489j512j150r36n68
$$ 147956 147178 146581 146514 146997 147217 146612 145549 144274 142188 138965 135537 133048 131536 130386 129450 128882
54435A28882m02n57p39j133k151l196l019j539j09K57j32n79p55m35M16J132R87
$$ 128882 128480 127923 127184 126051 123900 120704 117685 116146 116037 116294 116162 115583 114828 114393 114809 115941 116928
54418A16928M45N70J258J346O91O24J871L306L505K568J698J724K589L714M376
$$ 116928 117373 117943 119201 120547 121238 121862 123733 127039 130544 133112 134810 136534 139123 142837 147213
54403A47213M225L704L611M171M966N650O047N830M852L716L151K897K111P45
$$ 147213 151438 155142 158753 162924 167890 173540 179587 185417 190269 193985 197136 200033 202144 202889
54389B02889l88q81j158j554j876k022k194k441k648k914l288l328k734k112k298
$$ 202889 202501 201620 200462 198908 197032 195010 192816 190375 187727 184813 181525 178197 175463 173351 171053
54374A71053l045l439l305l170l048k489j753j636k018j848q33M3m6p68j399j626
$$ 171053 168008 164569 161264 158094 155046 152557 150804 149168 147150 145302 144469 144512 144466 143698 142299 140673
54358A40673j272j36J518K892L419L132K353J548J358K026K967L488L682L951
$$ 140673 139401 139265 140783 143675 147094 150226 152579 154127 155485 157511 160478 163966 167648 171599
54344A71599M073L709L330L595M083L783K565J100l24j821l095l851m610n806
$$ 171599 175672 179381 182711 186306 190389 194172 196737 197837 197513 195692 192597 188746 184136 178330
54330A78330o518n696m153l675m350m691m248m000m168l789k924l010m325n127
$$ 178330 171812 166116 161963 158288 153938 149247 144999 140999 136831 133042 130118 127108 122783 117656
54316A17656m357l270l240l653l349k657k538k830k774k431k290k150j615j076
$$ 117656 113299 110029 106789 103136 99787 97130 94592 91762 88988 86557 84267 82117 80502 79426
54302G9426j169j674j906j807j810j994k011j648r25j7O48O48J75j52k68p36j651
$$ 79426 78257 76583 74677 72870 71060 69066 67055 65407 64482 64465 65113 65761 65936 65784 65516 64780 63129
54285F3129k306k272j936j659j244o53l45m73n45l19k29m15l14L69J057J227J024
$$ 63129 60823 58551 56615 54956 53712 53059 52714 52241 51696 51377 51148 50733 50419 50788 51845 53072 54096
54268E4096O32j16r06p96M47J734K076J775J579J484J176Q45P01L55m38j023o92
$$ 54096 54728 54612 53706 52910 53357 55091 57167 58942 60521 62005 63181 64026 64727 65082 64644 63621 62929
54251F2929K20R01J300J885K521K453J399L1p35n61J51O74O39M01N30R64J088
$$ 62929 63149 64050 65350 67235 69756 72209 73608 73639 72904 72343 72494 73168 73807 74208 74738 75702 76790
54234G6790N89k16r08j297j209o48j64m05j145j465j001m00l43q06j412j866j908
$$ 76790 77379 77163 76255 74958 73749 73101 72937 72532 71387 69922 68921 68521 68178 67372 65960 64094 62186
54217F2186j482r90q73r29p24m33m75o17m24l48j085k088k132j353j107j672j759
$$ 62186 60704 59714 58841 57912 57188 56755 56280 55663 55239 54891 53806 51718 49586 48233 47126 45454 43695
54200D3695p67K25L55K46N11N14k31p88j95Q92J252R80R95J332J142J02j143j828
$$ 43695 42928 43153 43508 43754 44265 44779 44548 43760 43565 44457 45709 46689 47684 49016 50158 50260 49117 47289
54182D7289j693r85l12k03m85n14j74m4l84p56p92o32l26K05N48J42n01k42P78
$$ 47289 45596 44611 44299 44096 43611 43097 42923 42879 42495 41739 40947 40315 39989 40194 40742 40884 40383 40141 40919
54163D0919J068J50o09k53K04l95j412j526p61k7M19Q15R61O56M26P23J018O89
$$ 40919 41987 42137 41528 41275 41479 41084 39672 38146 37385 37358 37777 38592 39553 40209 40635 41358 42376 43065
54145D3065J24o0j66o74j037n19L21L15m97r32m22M20R01R81Q45N28Q5l05m11
$$ 43065 43189 43129 42963 42289 41252 40733 41054 41369 40872 39940 39518 39938 40839 41820 42665 43193 43278 42973 42562
54126D2562KQ88J565J256J81n60n02l07m10k56N38J308J406J227J336J431J062
$$ 42562 42564 43452 45017 46273 46454 45894 45392 45085 44675 44419 44957 46265 47671 48898 50234 51665 52727
54109E2727N34K45q1o06o56J94J167J400J220J351J572J313Q31O68N23j42r26
$$ 52727 53261 53506 53425 52819 52163 52357 53524 54924 56144 57495 59067 60380 61211 61879 62402 62260 61334
54092F1334j020m84R0O19J231J438P85j86o43p52j111j430r67NM34Ro16r57j088
$$ 61334 60314 59830 59920 60539 61770 63208 63993 63807 63164 62412 61301 59871 58904 58909 59343 59352 58736 57779 56691
54073E6691j032p03m14o15j199j700j948j941j439l72P30J367J671J883J812J494
$$ 56691 55659 54956 54542 53927 52728 51028 49080 47139 45700 45328 46058 47425 49096 50979 52791 54285
54057E4285J587K327K754J965N26k84p8O28J385J847J545O47K90J071J945J708
$$ 54285 55872 58199 60953 62918 63444 63160 63082 63710 65095 66942 68487 69134 69424 70495 72440 74148
54041G4148Q46O52J173J398J008N78M05M15Q70J926K846K828K275K012J915J550
$$ 74148 74994 75646 76819 78217 79225 79803 80208 80623 81493 83419 86265 89093 91368 93380 95295 96845
54025I6845J551K768M485N235N108N469O540P006O242N163M609M294L882L712
$$ 96845 98396 101164 105649 110884 115992 121461 128001 135007 141249 146412 151021 155315 159197 162909
54011A62909L959M106L763L129K396J574R29P80P55K31n79r61j048j684k944l926
$$ 162909 166868 170974 174737 177866 180262 181836 182765 183545 184300 184531 183952 182991 181943 180259 177315 173389
53995A73389m157m102m192m291m231l986l367k438j973k539l317l143k388k378
$$ 173389 169232 165130 160938 156647 152416 148430 145063 142625 140652 138113 134796 131653 129265 126887
53981A26887l111l188k117j032p81q57p62r54j708k356k365k153k140j990j444
$$ 126887 123776 120588 118471 117439 116658 115801 115039 114085 112377 110021 107656 105503 103363 101373 99929
53966I9929r95j023j122q54m81l53k98j28j03l18l32J49P30R31Q34P37O99P30
$$ 99929 98934 97911 96789 95935 95454 95101 94803 94675 94572 94254 93922 94071 94801 95732 96566 97303 98002 98732
53948I8732R83J420J702J614J309J067J145J736K646L241L216L105L469L949L990
$$ 98732 99715 101135 102837 104451 105760 106827 107972 109708 112354 115595 118811 121916 125385 129334 133324
53933A33324L983M706N952O825P143P382P426O758N711N160M917L894K025M66
$$ 133324 137307 142013 147965 154790 161933 169315 176741 183499 189210 194370 199287 203181 205206 205672
53919B05672l54j324k773l563k876j518o33k08K79P62J065J614K742L956M679
$$ 205672 205318 203994 201221 197658 194782 193264 192631 192423 192702 193464 194529 196143 198885 202841 207520
53904B07520N047N380N514N380N538O394P418P823P546O988O279N366M419L566
$$ 207520 212567 217947 223461 228841 234379 240773 248191 256014 263560 270548 276827 282193 286612 290178
53890B90178K624J517N83N1l58r49j597k071k468k950l475l985m528n004n207
$$ 290178 292802 294319 294902 294953 294595 293646 292049 289978 287510 284560 281085 277100 272572 267568 262361
53875B62361n226n368n660n851n900n955n960n858n949o365o399n321l727k976
$$ 262361 257135 251767 246107 240256 234356 228401 222441 216583 210634 204269 197870 192549 188822 185846
53861A85846l346l844l895l923m106l874l171k959l762m738m868m232l478k860
$$ 185846 182500 178656 174761 170838 166732 162858 159687 156728 152966 148228 143360 139128 135650 132790
53847A32790k390k158j982j461p98p16j188j216m59J30j34n14j89L28J48m11l83
$$ 132790 130400 128242 126260 124799 124001 123285 122097 120881 120422 120552 120418 119904 119715 120043 120191 119780 119397
53830A19397K88Q42R86J081J277J354J259J088P27J04m33n90o57r88j297j108
$$ 119397 119685 120527 121513 122594 123871 125225 126484 127572 128299 128403 127970 127380 126723 125735 124438 123330
53814A23330o33m97p51q45n18j18J0n7j18j89l44m89m26j69P0K43O82J654K741
$$ 123330 122697 122200 121449 120604 120086 119968 119978 119921 119803 119614 119270 118781 118355 118186 118256 118499 119181 120835 123576
53795A23576L183L052L381M633N770N563M395L709M086M900N589O100O169N357
$$ 123576 126759 129811 133192 137825 143595 149158 153553 157262 161348 166248 171837 177937 184106 189463
53781A89463M007L075K795K482J775J067O24L21L56J025J729J399J86n68m05m17
$$ 189463 193470 196545 199340 201822 203597 204664 205288 205609 205965 206990 208719 210118 210304 209736 209331 208914
53765B08914j371k476k707k194j666j577k254l780n152m868l032j589j670k158
$$ 208914 207543 205067 202360 200166 198500 196923 194669 190889 185737 180869 177837 176248 174578 172420
53751A72420j776j134j342j929j755j088j153k136l089l485l584l492l109k742
$$ 172420 170644 169510 168168 166239 164484 163396 162243 160107 157018 153533 149949 146457 143348 140606
53737A40606k764k810k245j285p03p08q63r40j055j163j083r21q04n35o5R1m36
$$ 140606 137842 135032 132787 131502 130799 130091 129228 128288 127233 126070 124987 124066 123262 122727 122662 122753 122317
53720A22317j119j169o15p8J96L76M53L42K96N61Q56P93N77P30J268J698J672
$$ 122317 121198 120029 119414 119336 119532 119908 120361 120703 120999 121560 122416 123209 123786 124516 125784 127482 129154
53703A29154J218N61P0Q8N81J129J488J726J791J550J454K232L649M452M034L232
$$ 129154 130372 130933 131003 131091 131672 132801 134289 136015 137806 139356 140810 143042 146691 151143 155177 158409
53687A58409K929K837K400K023K411L338L944L850L263K475J899K016K661K955
$$ 158409 161338 164175 166575 168598 171009 174347 178291 182141 185404 187879 189778 191794 194455 197410
53673A97410K525K113K346K786K907L093L676L892K912J315M11N34J012J386J687
$$ 197410 199935 202048 204394 207180 210087 213180 216856 220748 223660 224975 225386 225920 226932 228318 230005
53658B30005J869J933K199K599K303R49l24k56O82J008L82j74l0L40L30j53j008
$$ 230005 231874 233807 236006 238605 240908 241857 241533 241277 241959 242967 243349 243175 243145 243485 243815 243662 242654
53641B42654k037k695k546j950j664j867k165k245j995j333n95n68j386j975j442
$$ 242654 240617 237922 235376 233426 231762 229895 227730 225485 223490 222157 221562 220994 219608 217633 216191
53626B16191m79l80j171j753j544q51K8R42J380R79L84N22J165J288P64N13R87
$$ 216191 215712 215332 214161 212408 210864 210013 210041 210983 212363 213342 213726 214248 215413 216701 217465 217978 218965
53609B18965J566J693J647K001L032M711O602P784P611O586N813N680N712N507
$$ 218965 220531 222224 223871 225872 228904 233615 240217 248001 255612 262198 268011 273691 279403 284910
53595B84910N162M817M540M490M625M480L869L443L855M774N433N726N967O041
$$ 284910 290072 294889 299429 303919 308544 313024 316893 320336 324191 328965 334398 340124 346091 352132
53581C52132N744N502N724N868N244M293L971M210M172L764L549L514L111K408
$$ 352132 357876 363378 369102 374970 380214 384507 388478 392688 396860 400624 404173 407687 410798 413206
53567D13206J874J203k54j991k704k215j624j476j176m94j63n64j095j333j632
$$ 413206 415080 416283 416029 414038 411334 409119 407495 406019 404843 404349 404186 403622 402527 401194 399562
53552C99562k156k444k346k321k378j873p83o1k07n34n16o45j310j819j424m69
$$ 399562 397406 394962 392616 390295 387917 386044 385261 385200 384993 384459 383943 383298 381988 380169 378745 378276
53536C78276K95P77J091Q25j89r58k44J739L484M021L876M034M620N019N004N258
$$ 378276 378571 379348 380439 381264 381075 380117 379873 381612 385096 389117 392993 397027 401647 406666 411670 416928
53520D16928O492Q321R544R644R442R942J1097J2319J3641J5457J7473J8870J9454
$$ 416928 423420 431741 441285 450929 460371 470313 481410 493729 507370 522827 540300 559170 578624
53507E78624J9788K0225K0677K1308K2606K4585K6679K8533L0223L1725L2917
$$ 578624 598412 618637 639314 660622 683228 707813 734492 763025 793248 824973 857890
53496H57890L4086L5719L7703L9568M1360M3414M5336M6250M6205M6196M6590
$$ 857890 891976 927695 965398 1004966 1046326 1089740 1135076 1181326 1227531 1273727 1320317
53485A320317M6617M5836M5126M5646M7577N0407N3720N7163O0306O3008O5544
$$ 1320317 1366934 1412770 1457896 1503542 1551119 1601526 1655246 1712409 1772715 1835723 1901267
53474A901267O7843O9113O8561O6086O2074N6984N1403M5977M0950L6141L1598
$$ 1901267 1969110 2038223 2106784 2172870 2234944 2291928 2343331 2389308 2430258 2466399 2497997
53463B497997K7801K5095K3399K2667K3195K5158K8190L1561L4478L6244L6434
$$ 2497997 2525798 2550893 2574292 2596959 2620154 2645312 2673502 2705063 2739541 2775785 2812219
53452B812219L4922L1618K6474K0130J4031R042M309j636q814j5785k1593k6771
$$ 2812219 2847141 2878759 2905233 2925363 2939394 2948436 2952745 2951109 2942295 2926510 2904917 2878146
53440B878146l2193l7842m2932m6651m8690m9684n1113n4026n7776o0709o2041
$$ 2878146 2845953 2808111 2765179 2718528 2669838 2620154 2569041 2515015 2457239 2396530 2334489
53429B334489o2299o2141o1659o0890o0057n9141n8078n7431n7846n8803n8796
$$ 2334489 2272190 2210049 2148390 2087500 2027443 1968302 1910224 1852793 1794947 1736144 1677348
53418A677348n6972n3696m9440m4165l8063l1880k6093k0476j4741q938l080K831
$$ 1677348 1620376 1566680 1517240 1473075 1435012 1403132 1377039 1356563 1341822 1332884 1329804 1332635
53406A332635Q418J3321J7989K3143K8506L3120L6802M0183M3325M5648M7338
$$ 1332635 1341053 1354374 1372363 1395506 1424012 1457132 1493934 1534117 1577442 1623090 1670428
53395A670428M9392N1942N3965N5131N6544N9081O2278O5480O8877P2699P6594
$$ 1670428 1719820 1771762 1825727 1880858 1937402 1996483 2058761 2124241 2193118 2265817 2342411
53384B342411Q0592Q5538R1728R8080J03532J08310J13096J17882J22362J26561
$$ 2342411 2423003 2508541 2600269 2698349 2801881 2910191 3023287 3141169 3263531 3390092
53374C390092J30286J32849J34148J35139J36411J37178J36518J34697J32327
$$ 3390092 3520378 3653227 3787375 3922514 4058925 4196103 4332621 4467318 4599645
53365D599645J29027J23982J17268J09716J02035R4872Q9192Q5701Q4237Q4276
$$ 4599645 4728672 4852654 4969922 5079638 5181673 5276545 5365737 5451438 5535675 5619951
53355E619951Q5402Q6814Q7101Q5462Q2402P8415P2605O3428N0181L2926J1544
$$ 5619951 5705353 5792167 5879268 5964730 6047132 6125547 6198152 6261580 6311761 6344687 6356231
53344F356231j3954m2403p1552r9028j22853j41578j54734j62960j67234j68382
$$ 6356231 6342277 6299874 6228322 6129294 6006441 5864863 5710129 5547169 5379935 5211553
53334E211553j67551j66339j65654j64986j63458j61132j58771j56900j55734
$$ 5211553 5044002 4877663 4712009 4547023 4383565 4222433 4063662 3906762 3751028
53325C751028j55431j55686j55546j54195j51619j48044j43377j37614j31135
$$ 3751028 3595597 3439911 3284365 3130170 2978551 2830507 2687130 2549516 2418381
53316B418381j24106j16256j07712r9149r0602q1210p0856o1011n2871m5693l8099
$$ 2418381 2294275 2178019 2070307 1971158 1880556 1799346 1728490 1667479 1614608 1568915 1530816
53305A530816l0213k3203j7369j2104p363l729j119J328M046O630Q634R969J0627
$$ 1530816 1500603 1477400 1460031 1447927 1440564 1436835 1435716 1437044 1441090 1447720 1456354 1466323 1476950
53292A476950J0801J1186J2412J4292J6201J8089K0426K3378K6622K9868L3012
$$ 1476950 1487751 1498937 1511349 1525641 1541842 1559931 1580357 1603735 1630357 1660225 1693237
53281A693237L6068L9384M3459M8055N1944N4233N5441N6686N8214N9494O0262
$$ 1693237 1729305 1768689 1812148 1860203 1912147 1966380 2021821 2078507 2136721 2196215 2256477
53270B256477O0708O0953O1048O1192O1265O0693N9407N8395N8440N8911N8822
$$ 2256477 2317185 2378138 2439186 2500378 2561643 2622336 2681743 2740138 2798578 2857489 2916311
53259B916311N8524N9181O0792O1923O1336N8856N4609M8455M0468L1265K1458
$$ 2916311 2974835 3034016 3094808 3156731 3218067 3276923 3331532 3379987 3420455 3451720 3473178
53248C473178J1235N21j0833k2970l5749m8571o0704p1675q1176q8949r5074r9853
$$ 3473178 3484413 3484934 3474101 3451131 3415382 3366811 3306107 3234432 3153256 3064307 2969233 2869380
53236B869380j03174j04423j03372j00612r6765r1935q6362q0833p5922p1624
$$ 2869380 2766206 2661783 2558411 2457799 2361034 2269099 2182737 2101904 2025982 1954358
53226A954358o8318o7121o8486p1269p4124p7051q0541q4010q6145q6321q4617
$$ 1954358 1886040 1818919 1750433 1679164 1605040 1527989 1447448 1363438 1277293 1190972 1106355
53215A106355q1047p5871p0061o4340n8247n1240m4095l8008l2926k8129k3878
$$ 1106355 1025308 949437 879376 815036 756789 705549 661454 623446 590520 562391 538513
53204E38513k0963j8985j6737j4180j2448j1835j1311j0310r533r555r833r624
$$ 538513 517550 498565 481828 467648 455200 443365 432054 421744 412211 402656 392823 383199
53192C83199r012q530q485q888r390r310q393p459p468q053p921o708n407m878
$$ 383199 374187 365657 357172 348284 338894 329584 321191 313732 306264 298211 290290 283582 278175 273297
53178B73297m922m989m904m679m314m039m096m297m343m394m693m860m349l414
$$ 273297 268375 263386 258482 253803 249489 245450 241354 237057 232714 228320 223627 218767 214418 211004
53164B11004k754k550k594l019l774l908k597o95J35l51r05q73p78q42n60o6l30
$$ 211004 208250 205700 203106 200087 196313 192405 189808 189113 189248 188897 187992 187119 186341 185499 184939 184873 184543
53147A84543j434k104j606q47q49j310j440j174q06l28J19m4q68j464j255r44
$$ 184543 183109 181005 179399 178552 177703 176393 174953 173779 172973 172645 172764 172720 171852 170388 169133 168189
53131A68189j400k270k494j708m19P85J579J784J503J133Q31L63k30l29M47J597
$$ 168189 166789 164519 162025 160317 159898 160683 162262 164046 165549 166682 167513 167876 167646 167317 167764 169361
53115A69361K371K670K922L342L771M033M094M046M063M202M212L892L560L708
$$ 169361 171732 174402 177324 180666 184437 188470 192564 196610 200673 204875 209087 212979 216539 220247
53101B20247M135M010K928J322k55j771l325m690n561n947o065o056n928n625
$$ 220247 224382 228392 231320 232642 232387 230616 227291 222601 217040 211093 205028 198972 193044 187419
53087A87419n159m846n095n698n722m707l476l087l315l130k389j953k220k663
$$ 187419 182260 177414 172319 166621 160899 156192 152716 149629 146314 143184 140795 138842 136622 133959
53073A33959k905l184l388k735r21J129K146J736M71o61q85k18N36Q09J031J695
$$ 133959 131054 127870 124482 121747 120826 121955 124101 125837 126308 125647 124762 124544 125080 125889 126920 128615
53057A28615K132J399L4l78M64J137N82o25j539k043k292k164j843j904k257k067
$$ 128615 130747 132146 132180 131802 132266 133403 133985 133360 131821 129778 127486 125322 123479 121575 119318 117251
53041A17251j249q38j247j442p39j49q10k079k506j952j438j404j356j055r05
$$ 117251 116002 115164 113917 112475 111736 111587 110777 108698 106192 104240 102802 101398 100042 98987 98082
53026I8082j164j622k061k394k457k152j690j322j037q35r18j300j659j878k209
$$ 98082 96918 95296 93235 90841 88384 86232 84542 83220 82183 81348 80430 79130 77471 75593 73384
53011G3384k557k243j035K56P92O99N00J67n08j154j242q94n29j07N49J037Q62
$$ 73384 70827 68584 67549 67805 68597 69296 69796 69963 69455 68301 67059 66165 65636 65529 66078 67115 67977
52994F7977L27J49L30K29l09o69l83K84P92Q73N85J49j40j38J3J73M49R50J472
$$ 67977 68304 68453 68783 69012 68703 68034 67651 67935 68727 69600 70185 70334 70194 70056 70069 70242 70691 71641 73113
52975G3113J694J588J382J293J424J716J892J722J448J553K055K495K830L584
$$ 73113 74807 76395 77777 79070 80494 82210 84102 85824 87272 88825 90880 93375 96205 99789
52961I9789M816N602N195M081L220K684J881Q59M06P37R09Rj565k489k099j152
$$ 99789 104605 110207 115402 119483 122703 125387 127268 128127 128533 129270 130179 130188 128623 126134 124035 122883
52945A22883r25j753k821l327l361l395l433l256l106l404l900l903l290k587
$$ 122883 121958 120205 117384 114057 110696 107301 103868 100612 97506 94102 90202 86299 83009 80422
52931H0422k048j503j094j209j545j273m47j72r14j678j544j036j085j497j461
$$ 80422 78374 76871 75777 74568 73023 71750 71303 71131 70217 68539 66995 65959 64874 63377 61916
52916F1916j007q36j010q65j69M88N81K32k01o72j369k301l046k903j552L87J724
$$ 61916 60909 60073 59063 58198 58029 58517 59098 59330 59129 58457 57088 54787 51741 48838 47286 47673 49397
52899D9397J833J167N80N20Q63J104N93p71k000j880n56N21M55n3kN19Q12P19
$$ 49397 51230 52397 52977 53497 54360 55464 56057 55286 53286 51406 50850 51371 51826 51773 51771 52290 53102 53821
52881E3821N62M25K36J34J88J47p8j03K65O03N22K35k6m96j289j864j726j064
$$ 53821 54383 54808 55044 55178 55366 55513 55435 55332 55597 56200 56722 56957 56931 56435 55146 53282 51556 50492
52863E0492k68N86J212R87N8l00O55J852J907J124Q28J227J356R11O78J091J645
$$ 50492 50224 50810 52022 53009 53067 52767 53422 55274 57181 58305 59133 60360 61716 62627 63305 64396 66041
52846F6041J892K053K279K273J958J781K074K723L551M486N173N164M648M329
$$ 66041 67933 69986 72265 74538 76496 78277 80351 83074 86625 91111 96284 101448 106096 110425
52832A10425M392M207L311K109J293J014R77R30O99N0j140k646m032m965n296
$$ 110425 114817 119024 122335 124444 125737 126751 127728 128658 129357 129407 128267 125621 121589 116624 111328
52817A11328m989m142l039k121j736j848k050j973j694j554j635j707j688j781
$$ 111328 106339 102197 99158 97037 95301 93453 91403 89430 87736 86182 84547 82840 81152 79371
52803G9371k121k523k721k563j983j155n70n33p08o12m25o13r48p85k78k51p39
$$ 79371 77250 74727 72006 69443 67460 66305 65735 65202 64494 63882 63457 62844 61896 61111 60833 60582 59843
52786E9843q17k15P4o07j441j435q08l05P4O17R19M30m55q20l90L82J036J259
$$ 59843 59026 58811 58885 58278 56837 55402 54594 54289 54363 54980 55899 56329 55874 55054 54664 55046 56082 57341
52768E7341Q23K6l28m1M7o43j405j334o72j99K2L00M25J47m4K53L88l29j232j183
$$ 57341 58164 58190 57862 57821 57868 57225 55820 54486 53814 53615 53637 53937 54362 54509 54465 54718 55106 54777 53545 52362
52748E2362l63J45J86M40Q43O09k27p04m74k05k40j61J81L72L91P40J356J410
$$ 52362 51999 52144 52330 52770 53613 54222 53995 53291 52817 52612 52372 52211 52392 52764 53155 53895 55251 56661
52730E6661N54n45j178j270r35k57L15K59j65k05J31P8m61n44L14J314J454P72
$$ 56661 57215 56670 55492 54222 53287 53030 53345 53604 53439 53234 53365 53443 52982 52438 52752 54066 55520 56292
52712E6292m5n78p52n05J67J084K018K675K652J875J005P83J074J151Q35O61R27
$$ 56292 56247 55669 54917 54412 54579 55663 57681 60356 63008 64883 65888 66671 67745 68896 69731 70392 71319
52695G1319J356J660J836J926K125K850L984M427L416J967J714K509K618J357
$$ 71319 72675 74335 76171 78097 80222 83072 87056 91483 94899 96866 98580 101089 103707 105064
52681A05064j5m35m33p19q33k66K02m64j875k750k762k811l519m382m521l756
$$ 105064 105049 104614 104181 103462 102629 102363 102565 102101 100226 97476 94714 91903 88384 84002 79481 75725
52665G5725k722k071j792j438r48q49j344j754j468r99j192j795j826j205p44
$$ 75725 73003 70932 69140 67702 66754 65905 64561 62807 61339 60340 59148 57353 55527 54322 53578
52650E3578o12j07P93J061K79n22l90K94P49R90J191R00j14r18n14N31P16l02
$$ 53578 52966 52859 53652 54713 54992 54470 54080 54374 55123 56113 57304 58204 58090 57172 56658 57189 57905 57603
52632E7603j250j010MN52J58m87n24RL65K21P4L75P25N38O3o2L6l72j256j710
$$ 57603 56353 55343 55347 55899 56057 55570 55046 55055 55420 55641 55715 56090 56815 57353 57416 57354 57390 57018 55762 54052
52612E4052j273m93M6L82N64L08l05n64q4N96Q21O51M58L43K86M21P18R29J012
$$ 54052 52779 52286 52332 52714 53278 53586 53281 52717 52633 53229 54050 54701 55159 55502 55788 56209 56927 57856 58868
52593E8868J153J194P44Rk15L30R43R99O91M62L77M36P00Q34L08o39j027n18J01
$$ 58868 60021 61215 61959 61968 61753 62083 63026 64025 64716 65178 65555 65991 66691 67525 67833 67194 66167 65649 65750
52574F5750J87M4N4l0k68q0P24J319J098O52P02Q81N10j22k42J81O44R95J278
$$ 65750 65937 65981 66035 66005 65737 65657 66381 67700 68798 69450 70152 71033 71543 71421 71179 71360 72004 72999 74277
52555G4277J230Q41Q20J593K353K125J308J064J537J808J422Q65N91N29N37N32
$$ 74277 75507 76348 77168 78761 81114 83239 84547 85611 87148 88956 90378 91243 91834 92363 92900 93432
52539I3432K11n34j039n72M96J011N48k21o39p68q88j009j120j253j255q94k73
$$ 93432 93643 93109 92070 91498 91994 93005 93553 93332 92693 91925 91037 90028 88908 87655 86400 85506 85233
52522H5233L12P65J004O65l36j184r84r2K53l42r69q92n23n14o95n53k08k00n71
$$ 85233 85545 86310 87314 87979 87643 86459 85475 85383 85636 85294 84325 83433 82910 82396 81701 81148 80940 80740 80169
52503H0169p77m67N7J97k74r86j341j127p11n43n12o8J039K318K949K552J459
$$ 80169 79392 78925 78982 79179 78905 77919 76578 75451 74740 74197 73685 73617 74656 76974 79923 82475 83934
52486H3934L74k73n79q09r03n86R5O76Q08N74J57m15r62j055n85j15k04n71m73
$$ 83934 84308 84035 83456 82647 81744 81158 81253 81929 82737 83311 83468 83053 82091 81036 80451 80336 80132 79561 79088
52467G9088K67R93J071N74P5K0L84P98R47Q55Q05R45J143J250J243J136R10O01
$$ 79088 79355 80348 81419 81993 82068 82088 82472 83270 84217 85072 85877 86822 87965 89215 90458 91594 92504 93105
52449I3105K17l86j204j708j286j53P67J019J108J543K023J992J457P22j57j100
$$ 93105 93322 92936 91732 90024 88738 88585 89352 90371 91479 93022 95045 97037 98494 99216 99059 97959
52433I7959j600j286n91k85m59n75l44L1L85P77J131J174Q06K21l33o48n88k81
$$ 97959 96359 95073 94482 94197 93738 93163 92819 92850 93235 94012 95143 96317 97123 97344 97011 96363 95775 95494
52415I5494j13k40l01ML86L97K13L54P89R22N64K97O75J449J892J626Q98J85k60
$$ 95494 95381 95141 94840 94844 95230 95627 95840 96194 96983 97905 98469 98766 99441 100890 102782 104408 105306 105491 105231
52396A05231m62n13m72m48n94p99n83L26J388J681J012J26k80l01l25l35j11K42
$$ 105231 104769 104256 103784 103336 102742 101943 101360 101686 103074 104755 105767 105893 105613 105312 104987 104652 104541 104783
52378A04783M12K90o7n89j021r01j51N52M57l45j007q86j35N75P11L55Q2K84O36
$$ 104783 105195 105485 105418 104829 103808 102907 102756 103308 103765 103420 102413 101527 101392 101967 102678 103033 103115 103399 104035
52359A04035N86K37K36O87Q94M52n0Q7O51R81R85J053J275J377J246R75N10j95
$$ 104035 104621 104858 105094 105781 106675 107127 107077 107164 107815 108796 109781 110834 112109 113486 114732 115707 116217 116022
52341A16022p81p13M2R31J390J263P92M12M81Q93J107P14j22r13j301j190o95
$$ 116022 115241 114528 114570 115501 116891 118154 118946 119358 119839 120732 121839 122553 122431 121518 120217 119027 118332
52324A18332j53J26K05L11K98j81q67r86m08%l95j018r57k76J79k2m74n66OJ131
$$ 118332 118179 118305 118510 118821 119119 118938 118071 117085 116677 116677 116282 115264 114307 114031 114210 114188 113714 113148 113154 114285
52304A14285K318L017L088K789K265J470P19O58J386K230K648K762K748K478K189
$$ 114285 116603 119620 122708 125497 127762 129232 129951 130609 131995 134225 136873 139635 142383 144861 147050
52289A47050K548L546M134L611K661K219K175K022J991K534L248L411L155L095
$$ 147050 149598 153144 157278 160889 163550 165769 167944 169966 171957 174491 177739 181150 184305 187400
52275A87400L222L052K565K095J627J087R29J477K059J770P87L0j30K5L60P75
$$ 187400 190622 193674 196239 198334 199961 201048 201977 203454 205513 207283 208070 208100 207970 207995 208355 209130
52259B09130P88K42j1P03J487J059j01l02P62J590J217L89O0J85N66J529L011
$$ 209130 209918 210160 210149 210852 212339 213398 213297 212995 213757 215347 216564 216953 217013 217198 217764 219293 222304
52242B22304M020L826K951K332K164K078J870J543J174J085J635K553L025K761
$$ 222304 226324 230150 233101 235433 237597 239675 241545 243088 244262 245347 246982 249535 252560 255321
52228B55321K318K201K261K275K353K425K040J206P51J283K262K707K480K307
$$ 255321 257639 259840 262101 264376 266729 269154 271194 272400 273151 274434 276696 279403 281883 284190
52214B84190K644L119L104K532J951J804J918J909J929K449L218L236K259J548
$$ 284190 286834 289953 293057 295589 297540 299344 301262 303171 305100 307549 310767 314003 316262 317810
52200C17810K309L959M901M626M005L686L456L147L078L377L727M018M410M656
$$ 317810 320119 324078 328979 333605 337610 341296 344752 347899 350977 354354 358081 362099 366509 371165
52186C71165M232L299K729K903L334L541L599L524L069K363K001K187K409K286
$$ 371165 375397 378696 381425 384328 387662 391203 394802 398326 401395 403758 405759 407946 410355 412641
52172D12641K075K078K185K190K017J578R17M78N49N93j4p73o33K49N72j52q93
$$ 412641 414716 416794 418979 421169 423186 424764 425681 426159 426708 427301 427287 426514 425881 426130 426702 426550 425657
52155D25657q52n67p71j200j317j270j350j316r45o49q17j113j068q28p32o83
$$ 425657 424805 424238 423467 422267 420950 419680 418330 417014 416069 415420 414603 413490 412422 411594 410862 410179
52139D10179m93l92o62j167j620j934k059j895j652j669j835j756j686k341l580
$$ 410179 409686 409294 408632 407465 405845 403911 401852 399957 398305 396636 394801 393045 391359 389018 385438
52124C85438m196l519k328j637j433j269j258j658k130k193j943j685j362r13
$$ 385438 381242 377723 375395 373758 372325 371056 369798 368140 366010 363817 361874 360189 358827 357914
52110C57914o92r59j439j850k344k912k981k271j428j211j528j859k114k386k407
$$ 357914 357222 356263 354824 352974 350630 347718 344737 342466 341038 339827 338299 336440 334326 331940 329533
52095C29533j957j404j212j251j081n76J97J202K138K424K004J594J671J858J821
$$ 329533 327576 326172 324960 323709 322628 322052 322249 323451 325589 328013 330017 331611 333282 335140 336961
52080C36961K018K872L842M162L935L754L650L304K797K387J907J207P87J203
$$ 336961 338979 341851 345693 349855 353790 357544 361194 364498 367295 369682 371589 372796 373583 374786
52066C74786K106K599K394J926J592J536J861K417K666K328J912J974K304K370
$$ 374786 376892 379491 381885 383811 385403 386939 388800 391217 393883 396211 398123 400097 402401 404771
$$ [...]
##END NTUPLES=NMR SPECTRUM
##END=
