
##TITLE=AC1258_UGARS11075_6534326_NpLlJCYggR
##JCAMPDX= 6.0         $$ Bruker NMR JCAMP-DX V2.0
##DATA TYPE= NMR SPECTRUM
##DATA CLASS= NTUPLES
##ORIGIN= BRUKER
##OWNER= Administrator
$$ 1.72 TOPSPIN		Version 2.1
$$ 2012-07-17 02:52:14.703 -0500  Administrator@TOPSPIN
$$ Compression mode = diff/dup
##.OBSERVE FREQUENCY= 400.02188249412
##.OBSERVE NUCLEUS= ^1H
##.ACQUISITION MODE= SIMULTANEOUS (DQD)
##.ACQUISITION SCHEME= undefined
##.AVERAGES= 8
##.DIGITISER RES= 22
##SPECTROMETER/DATA SYSTEM= spect
##.PULSE SEQUENCE= zg30
##.SOLVENT NAME= COFFEE_meoh
##.SHIFT REFERENCE= INTERNAL, COFFEE_meoh, 1, 14.98509
##AUDIT TRAIL= $$ (NUMBER, WHEN, WHO, WHERE, PROCESS, VERSION, WHAT)
$$ ##TITLE= Audit trail, TOPSPIN		Version 2.1
$$ ##JCAMPDX= 5.01
$$ ##ORIGIN= Bruker BioSpin GmbH
$$ ##OWNER= Administrator
$$ $$ C:\Bruker\TOPSPIN/data/COFFEE/nmr/AC1258_UGARS11075_6534326_NpLlJCYggR/10/pdata/1/auditp.txt
$$ ##AUDIT TRAIL=  $$ (NUMBER, WHEN, WHO, WHERE, PROCESS, VERSION, WHAT)
(   1,<2012-07-17 02:52:07.750 -0500>,<Administrator>,<TOPSPIN>,<go>,<TOPSPIN 2.1>,
      <created by zg
	started at 2012-07-17 02:51:01.218 -0500,
	POWCHK enabled, PULCHK disabled,
       configuration hash MD5:
       6B 1B 68 BB D9 2E 58 E2 7F 35 AD 54 07 DF 0E 41
       data hash MD5: 64K
       D4 25 65 C2 BE 0A 27 94 3B E5 84 FC 0C EC 54 1C>)
(   2,<2012-07-17 02:52:10.421 -0500>,<Administrator>,<TOPSPIN>,<proc1d>,<TOPSPIN 2.1>,
      <Start of raw data processing
       efp LB = 0 FT_mod = 6 PKNL = 1 PHC0 = 0 PHC1 = 0 SI = 32K 
       data hash MD5: 32K
       2E 70 0A E0 57 5B 07 28 D9 05 73 21 A2 A7 E6 17>)
(   3,<2012-07-17 02:52:10.812 -0500>,<Administrator>,<TOPSPIN>,<proc1d>,<TOPSPIN 2.1>,
      <pk PHC0 = 180.1538 PHC1 = 0 
       data hash MD5: 32K
       18 40 94 F5 F7 FC 63 08 4B 82 42 3B 23 FB 51 D8>)
(   4,<2012-07-17 02:52:10.937 -0500>,<Administrator>,<TOPSPIN>,<proc1d>,<TOPSPIN 2.1>,
      <abs ABSG = 1 
       data hash MD5: 32K
       E8 35 C5 92 67 1C 83 34 BC 87 BD A1 7A FE D4 DF>)
(   5,<2012-07-17 02:52:10.968 -0500>,<Administrator>,<TOPSPIN>,<proc1d>,<TOPSPIN 2.1>,
      <abs ABSG = 2 
       data hash MD5: 32K
       9B F3 20 22 30 79 24 6E 7A 74 2D 4E F8 0C 7F BA>)
(   6,<2012-07-17 02:52:10.984 -0500>,<Administrator>,<TOPSPIN>,<proc1d>,<TOPSPIN 2.1>,
      <abs ABSG = 3 
       data hash MD5: 32K
       A6 56 07 4D 22 94 73 9E 11 14 31 7B B3 B6 47 11>)
(   7,<2012-07-17 02:52:11.015 -0500>,<Administrator>,<TOPSPIN>,<proc1d>,<TOPSPIN 2.1>,
      <abs ABSG = 4 
       data hash MD5: 32K
       BD EA 95 A2 50 B3 4E 2A 75 E8 FA 0E 5A 6A 63 08>)
(   8,<2012-07-17 02:52:11.046 -0500>,<Administrator>,<TOPSPIN>,<proc1d>,<TOPSPIN 2.1>,
      <abs ABSG = 5 
       data hash MD5: 32K
       A5 7A 88 92 59 7A B6 5E 63 15 D4 BB 79 0B 34 9E>)
$$ ##END=
$$ 
$$ $$ hash MD5
$$ $$ AA 09 BA 24 8C D3 FC 53 F4 15 B5 39 3D 8D 74 FD
##$RELAX= 
##$RELAX= 
##$RELAX= 
##$RELAX= 
##$RELAX= 
##$RELAX= 
##$RELAX= 
$$ Bruker specific parameters
$$ --------------------------
$$ [...]
##$TP= (0..7)
150 150 150 150 150 150 150 150
##$TP07= 0
##$TPNAME0= <>
##$TPNAME1= <>
##$TPNAME2= <>
##$TPNAME3= <>
##$TPNAME4= <>
##$TPNAME5= <>
##$TPNAME6= <>
##$TPNAME7= <>
##$TPOAL= (0..7)
0.5 0.5 0.5 0.5 0.5 0.5 0.5 0.5
##$TPOFFS= (0..7)
0 0 0 0 0 0 0 0
##$TUNHIN= 0
##$TUNHOUT= 0
##$TUNXOUT= 0
##$USERA1= <user>
##$USERA2= <user>
##$USERA3= <user>
##$USERA4= <user>
##$USERA5= <user>
##$V9= 5
##$VALIST= <valist>
##$VCLIST= <CCCCCCCCCCCCCCC>
##$VD= 0
##$VDLIST= <DDDDDDDDDDDDDDD>
##$VPLIST= <PPPPPPPPPPPPPPP>
##$VTLIST= <TTTTTTTTTTTTTTT>
##$WBST= 2048
##$WBSW= 25
##$XGAIN= (0..3)
0 0 0 0
##$XL= 0
##$YL= 0
##$YMAX_a= 504327
##$YMIN_a= -646343
##$ZGOPTNS= <>
##$ZL1= 120
##$ZL2= 120
##$ZL3= 120
##$ZL4= 120
##$ABSF1= 14.98509
##$ABSF2= -5.573092
##$ABSG= 5
##$ABSL= 3
##$ALPHA= 0
##$AQORDER= 0
##$ASSFAC= 0
##$ASSFACI= 0
##$ASSFACX= 0
##$ASSWID= 0
##$AUNMP= <proc_prof1d_extract_pilot.lims>
##$AXLEFT= 0
##$AXNAME= <>
##$AXNUC= <1H>
##$AXRIGHT= 0
##$AXTYPE= 0
##$AXUNIT= <>
##$AZFE= 0.1
##$AZFW= 0.1
##$BCFW= 0
##$BC_mod= 0
##$BYTORDP= 0
##$COROFFS= 0
##$CY= 15
##$DATMOD= 1
##$DC= 0
##$DFILT= <>
##$DTYPP= 0
##$F1P= 0
##$F2P= 0
##$FCOR= 0.5
##$FTSIZE= 32768
##$FT_mod= 6
##$GAMMA= 0
##$GB= 0
##$INTBC= 1
##$INTSCL= 1
##$ISEN= 128
##$LB= 0
##$LEV0= 0
##$LPBIN= 0
##$MAXI= 10000
##$MC2= 0
##$MEAN= 0
##$ME_mod= 0
##$MI= 0
##$NCOEF= 0
##$NC_proc= -8
##$NLEV= 6
##$NOISF1= 0
##$NOISF2= 0
##$NSP= 0
##$NTH_PI= 0
##$NZP= 0
##$OFFSET= 14.98509
##$PC= 1
##$PHC0= 180.1538
##$PHC1= 0
##$PH_mod= 1
##$PKNL= yes
##$PPARMOD= 0
##$PPDIAG= 0
##$PPIPTYP= 0
##$PPMPNUM= 2147483647
##$PPRESOL= 1
##$PSCAL= 4
##$PSIGN= 0
##$PYNMP= <proc.py>
##$REVERSE= no
##$SF= 400.02
##$SI= 32768
##$SIGF1= 0
##$SIGF2= 0
##$SINO= 400
##$SIOLD= 32768
##$SPECTYP= <>
##$SREGLST= <1H.CDCl3>
##$SSB= 0
##$STSI= 32768
##$STSR= 0
##$SW_p= 8223.68421052631
##$SYMM= 0
##$S_DEV= 0
##$TDeff= 65536
##$TDoff= 0
##$TI= <>
##$TILT= no
##$TM1= 0
##$TM2= 0
##$TOPLEV= 0
##$USERP1= <user>
##$USERP2= <user>
##$USERP3= <user>
##$USERP4= <user>
##$USERP5= <user>
##$WDW= 1
##$XDIM= 32768
##$YMAX_p= 465594430
##$YMIN_p= -667194
##$CURPLOT= <Network HP LaserJet P1505>
##$CURPRIN= <$Network HP LaserJet P1505>
##$DFORMAT= <normdp>
##$LAYOUT= <+/1D_H.xwp>
##$LFORMAT= <normlp>
##$PFORMAT= <normpl>
##$SURQMSG= 1
$$ End of Bruker specific parameters
$$ ---------------------------------
##NTUPLES= NMR SPECTRUM
##VAR_NAME=  FREQUENCY,     SPECTRUM/REAL,   SPECTRUM/IMAG
##SYMBOL=    X,             R,               I
##VAR_TYPE=  INDEPENDENT,   DEPENDENT,       DEPENDENT
##VAR_FORM=  AFFN,          ASDF,            ASDF
##VAR_DIM=   32768,         32768,           32768
##UNITS=     HZ,            ARBITRARY UNITS, ARBITRARY UNITS
##FACTOR=    0.250966925370066, 1,           1
##FIRST=     8223.43324360094, -168765,      1645
##LAST=      0,             218386,          -92768
##MIN=       0,             -667194,         0
##MAX=       8223.43324360094, 465594430,    0
$$ Real data points
##PAGE= N=1
##DATA TABLE= (X++(R..R)), XYDATA
$$ [...]
19547a22930A44120b79996A58130l6165a8227B72293l9019c73011e579j67590
19537a73169E4237b39364q647J5613C34171a13630j12756a00216B0307e3132G3760
19525a77119j15551L6924j38524C8702M6154a57817J228j45395B0779J22868n1493
19514I2154A4985J84346b25800R8379I3475c47992C09512C6294d61147A07399
19503B17887h9160D0342K7565J09676f1666A38650a05283B87366b31494A9883
19492d0371j64995D3165c3723C0156d0257n7284k27450a08892A34826b59133q5256
19481c44389J54042G047h3937b3108l8647A23318d0231n6868j42503D1090L2198
19470G3288M7753a48716A33959b19043f1180j3214k2472A40155E6836e9346l263
$$ plain form
19547 -122930 144120 -279996 158130 121965 -18227 272293 233274 -373011 -5579 -173169
19537 -173169 54237 -239364 -248011 -232398 334171 -113630 -226386 -100216 20307 -53132 73760
19525 -177119 -292670 -255746 -394270 38702 84856 -157817 -156589 -301984 20779 143647 92154
19514 92154 14985 199331 -225800 -127421 93475 -347992 309512 36294 -461147 107399
19503 217887 -89160 40342 67907 177583 -61666 138650 -105283 287366 -231494 19883
19492 -40371 -205366 43165 -33723 30156 -40257 -97541 -324991 -108892 134826 -259133 -344389
19481 -344389 -190347 7047 -83937 -23108 -61755 123318 -40231 -97099 -239602 41090 73288
19470 73288 121041 -148716 133959 -219043 -61180 -74394 -96866 140155 56836 -59346 -62609
19459f2609j93766B4852a95572l5205D0732a7173r5429L4209r588m4751m9220
19448a81952j56631J59787A11940h0702L4509k67919a11735A68631G4662R3296
19438A67958b19212h316l81428r6840a01056J0238E7303b6368o7256b8490A00465
19426I7867e656l10538A72513e06738H9886K01851m4698i5615k78648C04468A26529
19414a09111j80231J33129O7147K066B06763e6439j395k18466F1851d9470l4871
19403h4341k03139J38444A33144J73586q4482b744A97621a28432N3067c1308A24498
19391C28231l9071a68831O6077j3395e2967A26600h8367k54336a9034m24164a29094
19379A2071d5475B60600c4082J0262o9449G0911b75321k0522B364a86520o7127
$$ plain form
19459 -62609 -256375 24852 -195572 -230777 40732 -17173 -112602 -78393 -87981 -132732 -181952
19448 -181952 -338583 -178796 111940 -80702 -46193 -314112 -111735 168631 74662 167958
19438 167958 -219212 -8316 -389744 -486584 -101056 -90818 57303 -26368 -93624 -28490 100465
19426 97867 -5656 -316194 172513 -506738 89886 291737 247039 -95615 -374263 304468 126529
19414 -109111 -289342 -156213 -89066 -87000 206763 -56439 -57834 -276300 61851 -49470 -84341
19403 -84341 -287480 -149036 133144 306730 222248 -2744 197621 -128432 -75365 -31308 124498
19391 328231 289160 -168831 -102754 -116149 -52967 126600 -88367 -342703 -19034 -443198 -129094
19379 12071 -45475 260600 -34082 -23820 -93269 70911 -275321 -295843 2364 -186520 -253647
19368b53647R0285a1080l03069I339g8722A52174l6358a7834j68588a5470C2403
19356a00568D5152J7768a18239D5224L34297f4241B78680a56807r067j5811F537
19344b58637a07443k14409A99855k3845c30702a60615N462I035i4004J6187p3919
19333a51736j20987a17052F4702r371B6384a45865N9472j40827G6082a12494r5921
19322b08415B9112L5863a41930l1603C9548K1839K13551A3053J38186M1611a85944
19310b37341c1248j40997A96608b59306h1324A11051a42210r5008J18095o6372
19300a85495M0223N5475A57580d81549a45058k1509B21957f3862k03814H9152
19289a02187F5335c46950j35956c7821j13283J9705j48244R1315E6132h8030K312
$$ plain form
19368 -253647 -163362 -11080 -314149 9339 -78722 152174 115816 -17834 -186422 -15470 32403
19356 -100568 45152 62920 -118239 45224 379521 -64241 278680 -156807 -165874 -181685 6537
19344 -258637 -107443 -321852 199855 176010 -330702 -160615 -155153 9035 -94004 -77817 -151736
19333 -151736 -272723 -117052 64702 55331 26384 -145865 -86393 -227220 76082 -112494 -208415
19322 -208415 29112 64975 -141930 -173533 39548 61387 274938 13053 151239 192850 -185944
19310 -237341 -31248 -172245 196608 -259306 -81324 111051 -142210 -237218 -119123 -185495
19300 -185495 -145272 -89797 157580 -481549 -145058 -166567 221957 -63862 -267676 89152
19289 -102187 65335 -346950 -482906 -37821 -151104 -131399 -279643 -188328 56132 -88030 -85718
19278h5718c5355B50495A4542J0600a04756A1339c7572k41889B0213a81355j1650
19267a93005A01759b59545K5294A68923c67350a0777E1183b60841A17589b25341
19256a04056o6201A63429B185b640k55489j98823K10294A06051f3766n8655d6745
19244i0676o59j48670Q1773B72312q2586a41234A00863d14118K00120A77497G9016
19232c38934G6845K0352i7140A62795b44927h9447B04258a47530B04907K6350
19222B31257a41218I415h0632B21360d6361j85642O5743E2763A0728i1371o1890
19211a53261P3450A5231i466C0793Q3165g3478J6168j30743r2095B77467A23378
19199A6660L9870f2000B8778a16769A10031a4856H0470O3998b55636P0316B32124
$$ plain form
19278 -85718 -35355 250495 14542 25142 -104756 11339 -37572 -279461 20213 -181355 -193005
19267 -193005 101759 -259545 -234251 168923 -367350 -10777 51183 -260841 117589 -225341
19256 -104056 -170257 163429 2185 -2640 -258129 -456952 -246658 106051 -63766 -122421 -46745
19244 -90676 -91335 -240005 -158232 272312 189726 -141234 100863 -414118 -213998 177497 79016
19232 -338934 76845 97197 -97140 162795 -244927 -89447 204258 -147530 204907 231257
19222 231257 -141218 9415 -80632 221360 -46361 -232003 -166260 52763 10728 -91371 -153261
19211 -153261 -79811 15231 -9466 30793 113958 -73478 -57310 -188053 -280148 277467 123378
19199 16660 56530 -62000 28778 -116769 110031 -14856 80470 144468 -255636 -185320 232124
19187a63848q6609i924p2640j96537i7441A84249b16478r0407L0495C43772b61509
19175a31513H0143B4904c11815k0893G3424M419N5838J48770j17323g3113A0361
19163f0755C58003b85544c7793o9554m363b2559j96041Q292k51988H9777A2270
19151b04001J4754C31252a5380A08580b0964r7348L0454I6633b71386B06624a0450
19139b02776A76664G4058a79724j43622a07539I5117m1785a94397A68044a70710
19128c34218a31194A16253b73535P0937f3503k06713j5196C1722P3986a39833
19117a51871b0040j24020e1038A49384k9038i278H5816b09712C17781a85905g1399
19105c57915I9975j3568c25737c6936c983k61254O522A49760o1564d9460R218
$$ plain form
19187 -163848 -250457 -9924 -82564 -279101 -97441 184249 -216478 -306885 -276390 343772 -261509
19175 -131513 80143 24904 -311815 -332708 73424 77843 133681 282451 165128 -73113 10361
19163 -60755 358003 -285544 -37793 -107347 -111710 -22559 -218600 -210308 -462296 89777 12270
19151 -204001 -189247 331252 -15380 108580 -20964 -118312 -87858 96633 -271386 206624 -10450
19139 -202776 176664 74058 -179724 -323346 -107539 95117 53332 -194397 168044 -170710
19128 -334218 -131194 116253 -273535 -202598 -63503 -270216 -285412 31722 105708 -139833
19117 -151871 -20040 -144060 -51038 149384 120346 -9278 85816 -209712 317781 -185905 -71399
19105 -357915 99975 86407 -325737 -36936 -3983 -265237 -258715 149760 88196 -49460 -40242
19094d0242l55268A28115a41195D6709d0958j77629B71936c7249j40329A70725
19083e5351o9770l69372A47798b3197j17881j9183l4360A46595i3075m6426B63413
19071a06556J8477k03418d9608C6014J57471d4835j921m0259K6534A5991a05787
19059f7733A6590b7495B319b09501O8830D3683K63262F5825c80646H4478b96641
19047D2515b02423E276c08034A57353a08072d3260k22759Q3627e3960k03938N4879
19036b03019A22590g5816A1394b41648A5869e030o878p6193o7984d8264j15834
19025a64098A25558A3323e3713A1746c0281j41944b6512Q326F8316b57119i8271
19013D7118a75136A18332d8668j47792b3493k25821H1423a9940k91952E7196O7561
$$ plain form
19094 -40242 -395510 128115 -141195 46709 -40958 -218587 271936 -37249 -177578 170725
19083 -55351 -125121 -494493 147798 -23197 -141078 -160261 -194621 146595 -93075 -139501 263413
19071 -106556 -88079 -291497 -49608 36014 193485 -44835 -46756 -87015 -60481 15991 -105787
19059 -67733 16590 -27495 2319 -209501 -140671 43683 306945 65825 -380646 84478 -296641
19047 42515 -202423 5276 -308034 157353 -108072 -43260 -266019 -182392 -53960 -257898 -203019
19036 -203019 122590 -75816 11394 -241648 15869 -5030 -11908 -88101 -156085 -48264 -164098
19025 -164098 125558 13323 -53713 11746 -30281 -172225 -26512 -18186 68316 -257119 -98271
19013 47118 -175136 118332 -48668 -196460 -23493 -249314 81423 -19940 -311892 57196 124757
19002A24757A1169Q8274c04282N2277I0899i6863A2495a41378J2597j92399M9449
18991b71731J421E7573E149b33538A85631i4923o6907D23230d8230j89951E0562
18979c33361e2427o4766d4296p4340A88459I828d8882k44059c6558E1682l736
18968D7946O6058m0763d46585a56234G87a12275b0786E4602a37619A19190R8592
18957B17782m3792a46939J9202p6865A32662a39842J8041C3589a54914A53744
18946a34976M4941a8924l9819k08810a26523g363j5940j11361C5343a54894e6791
18934a57367I0297J26909f2129B93298b4936A46675l2846R457f3330K6288A53483
18922e974l16129B9102J02244a16740B8821a87027f6551j82254I5573a03291l3267
$$ plain form
19002 124757 11169 99443 -304282 -252005 90899 -96863 12495 -141378 -128781 -321180 -271731
18991 -271731 -270310 57573 5149 -233538 185631 -94923 -161830 423230 -48230 -238181 50562
18979 -333361 -52427 -117193 -44296 -118636 188459 9828 -48882 -292941 -36558 51682 47946
18968 47946 114004 73241 -446585 -156234 787 -112275 -20786 54602 -137619 119190 217782
18957 217782 173990 -146939 -127737 -204602 132662 -139842 -121801 33589 -154914 153744
18946 -134976 -90035 -18924 -58743 -267553 -126523 -7363 -23303 -134664 35343 -154894 -56791
18934 -157367 90297 217206 -62129 293298 -24936 146675 113829 123286 -63330 -37042 153483
18922 -5974 -322103 29102 131346 -116740 28821 -187027 -66551 -248805 95573 -103291 -136558
18911a36558l60699A33233m9419c48897C97779b83209j17430a11433d5309m6433
18901i1742m3828k09286j91952a00741B14609E3333b20641B55782A5367J92702
18891B08069b05947A1381N5702b28648f031A13488c4455A39791o8793c16443C21135
18879A82083a94550G608d7254o1419k29524A82590a76447r7015E0045J75279b85052
18867I9349a22508a4954j80115j17626J27826K3008f451D8131c04253B648a1430
18855c12849P0096A20810a24537J0104A71515b43644B4498c24537i5430J248B03667
18843b87789j06005B16556g0509I6328j5128h53k13552C44929a27537E4327b71945
18831C1344g910k66925J03514A53619F3735L1265a65158A18572R3610I5171A8903
$$ plain form
18911 -136558 -497257 133233 83814 -348897 397779 -283209 -400639 -111433 -45309 -91742
18901 -91742 -135570 -344856 -536808 -100741 214609 53333 -220641 255782 15367 208069
18891 208069 -205947 11381 67083 -228648 -6031 113488 -34455 139791 70998 -316443 321135
18879 182083 -194550 7608 -47254 -108673 -338197 182590 -176447 -273462 50045 225324 -285052
18867 99349 -122508 -14954 -195069 -312695 -184869 -161861 -6451 48131 -304253 2648 -11430
18855 -312849 -242753 120810 -124537 -114433 171515 -243644 24498 -324537 -95430 -94182 203667
18843 -287789 -393794 216556 -70509 96328 81200 -853 -214405 344929 -127537 54327 -271945
18831 31344 -7910 -274835 -171321 153619 63735 95000 -165158 118572 212182 95171 18903
18819B92630d3627l70173i9136A40570a59413A34567F2564b50287A83036J60547
18809C43583b8580m5749A71413p4044m1759f7922j64394i9045q280G781g4340
18797B06235b23099c0544j89049B38302c74661a45158K8553I1027k7814a51410
18786c20328R9337B0296M6765c8059p9690j27671h5759I6091A0066i001D8147
18774I5964a64785j4779Q8523A59798b58604B6140b75350e4149j68592A13918
18763b43685h0688k1692j91996D8501J9888f4101A84393C3677J28053c70570A47756
18751b20432o1186M9653l6956J23169G3040j1886N9088k2177D0831O3258f4709
18739A01030c2368k47799H8457a10988C15583g9198I6786p623a90573p2640A63746
$$ plain form
18819 292630 -43627 -413800 -99136 140570 -159413 134567 62564 -250287 183036 343583
18809 343583 -28580 -74329 171413 97369 55610 -67922 -232316 -99045 -107325 7781 -74340
18797 206235 -223099 -30544 -219593 238302 -374661 -145158 -116605 91027 63213 -151410
18786 -320328 -220991 20296 67061 -38059 -117749 -245420 -85759 96091 10066 -9001 48147
18774 95964 -164785 -179564 -91041 159798 -258604 26140 -275350 -54149 -222741 113918
18763 -243685 -80688 -102380 -294376 48501 68389 -64101 184393 33677 161730 -370570 147756
18751 -220432 -281618 -231965 -268921 -145752 73040 61154 120242 98065 40831 104089 -64709
18739 101030 -32368 -280167 88457 -110988 315583 -79198 96786 89163 -190573 -263213 163746
18727h1446A02089C4351b95049a05347K3780l14219E9701K65331b43024A832K7842
18716B9674e3886D8268j1649o042a7716j2987C99928i0207b8850j21543c2144
18704B7680c91191C27894a36015A46086J26175a16681M9134j35823G9485a02929
18693a15319j19112A6339J54257C4509b87404G6843h3078j5749j37777A08436
18682B06707I9843A9334J68953i3499k11119I6824g6505q4440A07036C6706b5212
18670c3235n9444A76286c6492A0751a23713o5064B08279a6914l10172i9463j68152
18659b67615g3160o8730l9719C25665a0648C9704m693M1195b45800k02228G4701
18647h3501j13039c2556j75967D1953c75319a81505b382C69093l5573b98007R6750
$$ plain form
18727 -81446 102089 34351 -295049 -105347 -81567 -395786 59701 325032 -243024 1832 29674
18716 29674 -53886 48268 36619 30577 -17716 -30703 399928 -90207 -28850 -150393 -32144
18704 27680 -391191 327894 -136015 146086 272261 -116681 -67547 -203370 79485 -102929
18693 -115319 -234431 16339 170596 34509 -287404 76843 -83078 -98827 -236604 108436
18682 206707 99843 19334 188287 -93499 -304618 96824 -76505 -160945 107036 36706 -25212
18670 -33235 -92679 176286 -36492 10751 -123713 -188777 208279 -16914 -327086 -99463 -267615
18659 -267615 -73160 -141890 -181609 325665 -10648 39704 35011 76206 -245800 -448028 74701
18647 -83501 -196540 -32556 -208523 41953 -375319 -181505 -2382 369093 333520 -298007 -201257
18636b01257C5443P1875e36750G0068g790A11072b05325h3448A94963e4163k7201
18625h1364A56952c4301A56133a16163l1803B0434b84007i4053a6764o7421m8771
18614a32956K715a6134B75683g2218b2527j48141e3378A95357m5618d03061J48177
18603b54884B60517b9181C3852d04254a26372C7485f413j77238P4037l89d7560
18591h8435H2805B2292R8781J5705c16133c7054j86007g20k19954j21640A13771
18579D4289a01440j51306A22269b2073l16144i8119k16221c9416j7258k286j6354
18568g5314C00983A26707J59337a3199j43607A12057c6975j69423B59457c46476
18557a06182J6134k12080a42027B09224a40948A45327d17378h8169g099l6717
$$ plain form
18636 -201257 35443 107318 -536750 70068 -7790 111072 -205325 -83448 194963 -54163 -81364
18625 -81364 156952 -34301 156133 -116163 -147966 20434 -284007 -94053 -16764 -84185 -132956
18614 -132956 -130241 -16134 275683 -72218 -22527 -170668 -53378 195357 149739 -403061 -254884
18603 -254884 260517 -29181 33852 -404254 -126372 37485 -6413 -183651 -109614 -110003 -47560
18591 -88435 82805 22292 121073 136778 -316133 -37054 -223061 -720 -220674 -342314 113771
18579 44289 -101440 -252746 122269 -22073 -338217 -98119 -314340 -39416 -56674 -58960 -75314
18568 -75314 300983 126707 286044 -13199 -156806 112057 -36975 -206398 259457 -346476
18557 -106182 -90048 -302128 -142027 209224 -140948 145327 -417378 -88169 -7099 -43816
18547d3816C3030J48241c98591h1430B0397K12207C3563a00577A72335b11657
18536B54151a74120g1675D46203I2238j9474c492A50259g898q5371B38344b40682
18524f3067A10301a73805Q5887j46431O3055L5329k5669P6896n6448q6452F8336
18512G0323M1305a8695k24648h0111j53724m416a1333m8300j35618b9175p89m9904
18500g9868B8008K8314c4608G0670g8430B00881C548b11771C20835a02811l70092
18489d72903C2417b92445k0462C8603K0251e9143q0897B3279b24511A8724a11936
18477A58167a50023a1441A97148I0660a62122I2860c7579J6451j16397B1793g8936
18465b65196C93086c09315a22599A0433e2218j46342R1588A16762b8199C0542
$$ plain form
18547 -43816 33030 181271 -398591 -81430 20397 232604 33563 -100577 172335 -211657
18536 254151 -174120 -71675 446203 92238 72764 -3492 150259 -7898 -93269 238344 -240682
18524 -63067 110301 -173805 -87918 -234349 -171294 -135965 -161634 -84738 -141186 -227638 68336
18512 70323 111628 -18695 -243343 -80111 -233835 -238251 -11333 -59633 -195251 -29175 -29964 -79868
18500 -79868 28008 56322 -34608 70670 -78430 200881 3548 -211771 320835 -102811 -472903
18489 -472903 32417 -292445 -312907 38603 58854 -59143 -140040 23279 -224511 18724 -111936
18477 158167 -150023 -11441 197148 90660 -162122 92860 -37579 -21128 -137525 21793 -78936
18465 -265196 393086 -309315 -122599 10433 -52218 -198560 -106972 116762 -28199 30542
18454b29999K726O2744m4916B38714J60754a97420e8993j30464F1778b33477f0613
18442A56438b58374A85107d0016C65687a40961e9289A67674c12562B7780e2494
18431A07124k0619Q5712J12989a73730I3127b47129N664J7605Q2915F1153J21795
18420A82948J1554b01012A51817a49560G0589i6677B38759o2215q640q3089b03618
18408g3069l9752M0467j2654B9533c17717J36118c6369l25311j88819C30530a77603
18396B00715b72118A53231m8864J26248D998h2592G8685J3515M6072a727B58072
18384f5134l51502M9644a55020G1019a03072M1602A96940o0835a33764N0386C7093
18372A05821M9515F800L43399j28326b0452o0646a129k79530R746f8295F3009
$$ plain form
18454 -229999 -227273 -164529 -209445 238714 399468 -197420 -58993 -189457 61778 -233477 -60613
18442 156438 -258374 185107 -40016 365687 -140961 -59289 167674 -312562 27780 -52494
18431 107124 86505 172217 285206 -173730 93127 -247129 -241465 -223860 -140945 61153 182948
18420 182948 194502 -201012 151817 -149560 70589 -96677 238759 176544 167904 84815 -203618
18408 -73069 -112821 -72354 -85008 29533 -317717 -181599 -36369 -361680 -550499 330530 -177603
18396 200715 -272118 153231 104367 230615 4998 -82592 78685 92200 138272 -1727 258072
18384 -65134 -416636 -366992 -155020 71019 -103072 -61470 196940 136105 -133764 -83378 37093
18372 105821 155336 6800 350199 221873 -20452 -81098 -1129 -280659 -270913 -68295 63009
18360B077i8769K4259j999k20583J24232E4775l218c1546B8942a22446A38393
18348b56803G4328a13258a6879o5368a7865j74857P6343B35921f4124E8303g1370
18336B41228b8069l8410G0490b01397k07410J76053a13246k26714a26182j65998
18326b92180C7436J63208A7535i4321K8663r909k39333B25695f7250j64495k9519
18315b61264d1818j45877m721Q787f1264b9840B16705E5195b33814h0577B30281
18303f1438l6159A0871b1426n45590c3495a2363p1421B05196M0147K96099F3149
18291a14703c2436k29413I4429e4340j73042B24034H5875q642l4081a43937j67320
18280c11257g0753j03760D03061j77692K5005P1488b35542O6093A25178a34097
$$ plain form
18360 2077 -98769 -74510 -76509 -297092 -172860 54775 51557 -31546 28942 -122446 138393
18348 -256803 74328 -113258 -16879 -82247 -17865 -192722 -116379 235921 -64124 58303 -71370
18336 241228 -28069 -66479 70490 -201397 -408807 -232754 -113246 -339960 -126182 -292180
18326 -292180 37436 200644 17535 -94321 -65658 -75567 -314900 225695 -67250 -231745 -261264
18315 -261264 -41818 -187695 -192416 -183629 -61264 -29840 216705 55195 -233814 -80577 230281
18303 -61438 -97597 10871 -21426 -567016 -33495 -12363 -83784 205196 245343 541442 63149
18291 -114703 -32436 -261849 94429 -54340 -227382 224034 85875 77233 43152 -143937 -311257
18280 -311257 -70753 -174513 403061 225369 250374 321862 -235542 -169449 125178 -134097
18269A2582J95238H2443a21010a8196F4863B3990b07028D6714n646P6501k5345
18258I2224a72884A69699c02202m2506C9947k45h9751p9531d5448A2037Q2801
18247I4838d77236A15344B6940b71482g8166j95915A80496e7697A30814G793a14957
18235h3561d530k04693a00643A58863b2709j17716O5253A2221a22007A1384N167
18224A6551K82805d05654d189j61244j54421n6517c5802O673C86060c60583D79233
18212B01047B0963c97412a73773G0287b19883A99524n5211d15264h1746A79419
18201e0035j35460A5736L2087J06031E0516a58164n2201j42052J55876f3082a4115
18189A23831d5973q5393A47502k0844b67681B961f8382A05713i359D2688a93585
$$ plain form
18269 12582 207820 82443 -121010 -18196 64863 23990 -207028 46714 41068 117569 92224
18258 92224 -172884 169699 -302202 -344708 39947 39702 -89751 -169282 -45448 12037 94838
18247 94838 -477236 115344 26940 -271482 -78166 -274081 180496 -57697 130814 7793 -114957
18235 -83561 -4530 -209223 -100643 158863 -22709 -140425 -75172 12221 -122007 11384 16551
18224 16551 299356 -405654 -4189 -165433 -319854 -376371 -35802 -29129 386060 -360583 479233
18212 201047 20963 -397412 -173773 70287 -219883 199524 144313 -415264 -81746 179419
18201 -50035 -185495 15736 47823 153854 50516 -158164 -210365 -352417 -196541 -63082 -14115
18189 123831 -45973 -131366 147502 126658 -267681 2961 -68382 105713 -9359 42688 -193585
18177G4205A2917a07602G1352b35377I8143K720f04834A07149d5848A2716M04847
18166D17563j93938A09113a07224j19895A15417A0901b25844D9859q120B904b8882
18154a5867n5838m0115L0884p7333A0204b54877a27100A9756J72985B4276e589
18142a92877C04180F9500a94602d9005j89985k3632B0958J24579b58777C30509
18131H3436a78235G181L9485h8186M2251i557A04267A5878a27527E2783a23209
18119B3516a5801j46175k1773A16748a20708k5890O7642J6946j46737e4046H5059
18107A63719a77081I7421a11530i592l5619j49726Q4219k62516A24549k144a2234
18095a03406C1797b56103d2230k70739B6348c5273A25250a88001a564k23209A7078
$$ plain form
18177 74205 12917 -107602 71352 -235377 98143 100863 -604834 107149 -45848 12716 417563
18166 417563 223625 109113 -107224 -227119 115417 10901 -225844 49859 41739 2904 -28882
18154 -15867 -71705 -111820 -80936 -158269 10204 -254877 -127100 19756 192741 24276 -5589
18142 -192877 304180 69500 -194602 -49005 -238990 -262622 20958 145537 -258777 330509
18131 83436 -178235 7181 46666 -88186 -45935 -9557 104267 15878 -127527 52783 -123209
18119 23516 -15801 -161976 -183749 116748 -120708 -146598 -78956 -62010 -208747 -54046 85059
18107 163719 -177081 97421 -111530 -9592 -45211 -194937 -110718 -373234 124549 122405 -12234
18095 -103406 31797 -256103 -42230 -312969 26348 -35273 125250 -188001 -1564 -224773 17078
18083G4983G749a34090H4614J2425g8963A34461a09436G5180K23624k6489b44862
18071B57171h8858l7381M3718C0396A1181L04646A32484a57442A78373j4307h2781
18059C95508f0665D48960d8579G8067i6091o6637A40394K20945j07903r5080e6320
18047b17200B18234j5358q0233E215a57117m3143f7609n3348A12592D8654a12548
18035a79724b3828B3026a50155e1065L111j15922H8415d0341j9862j72958O110
18024b27051g6954a7722j71592j15174A52419m0736c1743q4605k17061B84511
18013B6405J23042e9014J3486o8503C4938b19167a7046k98545J05356C5055h5773
18001A30632Q5435b5354A4155Q4144a42710m6170k639M7768r1656L2729k02835
$$ plain form
18083 74983 7749 -134090 84614 97039 -78963 134461 -109436 75180 298804 272315 -244862
18071 257171 -88858 -126239 -82521 30396 11181 315827 132484 -157442 178373 164066 -82781
18059 395508 -60665 448960 -48579 78067 -96091 -162728 140394 361339 253436 158356 -56320
18047 -217200 218234 202876 122643 5215 -157117 -200260 -67609 -120957 112592 48654 -112548
18035 -179724 -23828 23026 -150155 -51065 -47954 -163876 88415 -40341 -60203 -233161 -227051
18024 -227051 -76954 -17722 -189314 -304488 152419 111683 -31743 -116348 -333409 284511
18013 26405 149447 -59014 -45528 -114031 34938 -219167 -17046 -315591 -210235 35055 -85773
18001 130632 216067 -25354 14155 98299 -142710 -188880 -191519 -143751 -235407 -202678 -405513
17990d05513a61866B11606g5150A08652O6888e0746d516j01630B42125A01939
17979b16373E9975g0189E3027O1012c82555b8658A23494E8806d68939a67108A42685
17967c23008O3328A60352d2278A52216J21499b90513C06482m0116b11415R5802
17957a15613A02398J44914b65575C8396b8274A01923h912n2783B76489B6896k181
17946B4715a84098d8721j61042A88973b11349A0288b29481A48220J19598a55936
17935E0374b21467B17517a27705N2805J1797A13138J3148J16457a78352e9382
17924c744B18918I1939a26760B47749j7720b49660A45581k2202d8822k52892H2336
17912G4408k9812a95398h9367b3316l3259Q952n0714D34523b97924J47768f0075
$$ plain form
17990 -405513 -161866 211606 -75150 108652 175540 -50746 -4516 -106146 242125 101939
17979 -216373 59975 -70189 53027 114039 -382555 -28658 123494 58806 -468939 -167108 142685
17967 -323008 -259680 160352 -42278 152216 273715 -290513 306482 266366 -211415 -115613
17957 -115613 102398 247312 -265575 38396 -28274 101923 -8912 -61695 276489 26896 24715
17946 24715 -184098 -48721 -209763 188973 -211349 10288 -229481 148220 267818 -155936
17935 50374 -221467 217517 -127705 -74900 -63103 113138 126286 242743 -178352 -59382
17924 -3744 218918 91939 -126760 247749 230029 -249660 145581 123379 -48822 -301714 82336
17912 74408 44596 -195398 -89367 -23316 -56575 -47623 -98337 434523 -297924 -150156 -60075
17900b8693b122j93001P996B72158A07081r525j3137E02K46231i748m2650r165
17888f1563A06608L08087a93523i5354k87193B0311b17208A790K12255k3336a43331
17876b54870i787n2492A64664o6610l5381d3194A09045a69800B6450a41240A63554
17864a47166C0092K79960I6036e7802k66768a52279C44686a07298A30499a13007
17853A36150b10060F6141b1990E3778K75980f6113m9037B14023B870b66620a12093
17841B8360J73340d10996h8816A56087c32800B124B62J16664b25168H6371a74837
17829A34665J7281g9124j80870G6780i1192k10974C2979d8089I1860M2931a1695
17817b42016B2247b50698A77431a82724d4604k980j70052B27545g6986A29553
$$ plain form
17900 -28693 -2122 -195123 -187127 272158 107081 97556 84419 502 246733 -9748 -52398 -61563
17888 -61563 106608 414695 -193523 -95354 -382547 20311 -217208 1790 214045 190709 -143331
17876 -254870 -9787 -62279 164664 98054 62673 -43194 109045 -169800 26450 -141240 163554
17864 -147166 30092 310052 96036 -57802 -324570 -152279 344686 -107298 130499 -113007
17853 136150 -210060 66141 -21990 53778 329758 -66113 -115150 214023 2870 -266620 -112093
17841 28360 201700 -410996 -88816 156087 -332800 2124 262 116926 -225168 86371 -174837
17829 134665 151946 -79124 -259994 76780 -91192 -302166 32979 -48089 91860 134791 -11695
17817 -242016 22247 -250698 177431 -182724 -44604 -47584 -217636 227545 -76986 129553
17806B30056P9592A25542a93485j20491i0384B00091h1908p6738j46727J31216
17796a74157A47167D272i5374A47646b30824A5208b16888B32213G2845O1234n6040
17785G8039c01073A11142c7389H7272m3086n053I939J81003c6772d018D3152L1263
17773G4415f9435r6187k3143m8278Q7657p2786J06164B39108b13932H6227J64730
17762B50957A2138K438b49778a5068l7444A32676F010b53463c6202G6979k7302
17751D9677b56134D1383K7645a91995C54742A64450m38p2572J5631J39111a58643
17739g7595C85654n5850A38224C3033I827a35496A80967J62100n1587c22C6986
17727B012K69811o7150i4760A51564a14625k0908L1317A38972o0431b53817E4708
$$ plain form
17806 230056 309648 125542 -193485 -313976 -90384 200091 -81908 -158646 -305373 -174157
17796 -174157 147167 4272 -95374 147646 -230824 15208 -216888 232213 72845 134079 78039
17785 78039 -301073 111142 -37389 87272 44186 39133 9939 190942 -36772 -4018 43152 74415
17773 74415 -69435 -165622 -188765 -237043 -149386 -222172 -116008 239108 -213932 86227 250957
17762 250957 12138 14576 -249778 -15068 -52512 132676 6010 -253463 -36202 76979 49677
17751 49677 -256134 41383 69028 -191995 354742 164450 164012 91440 107071 246182 -158643
17739 -77595 385654 329804 138224 33033 9827 -135496 180967 343067 291480 -322 36986
17727 2012 271823 204673 -94760 151564 -114625 -135533 -104216 138972 78541 -253817 54708
17715A65907j8849F8171a11765j9253k66970D6613A5170c20258J50096R287H4959
17703A19492J15138p6385a32055a3712A35065c022k51557J05763A04112j4930
17693H9182a36685A41828A2296a31486A73707f2048A27100K04258a56266F3152
17682b4643m67610a12564A2784K09854b1654A7682a46765D5979J02379P6118f6927
17670a63204A224J32709L9173a69805B13740i7628M5393J2141f364r1033j8930
17659a16327A50315a233B92768r1747n5565h1528A22205a99395A36003A2757h4830
17647a85279A5412B307a16668E6105e63A48666H60J60468E9614b56383A54918
17635f0191b7842k17962i0088F9520l4154f5290P503F7770M717L02330D4500k1896
$$ plain form
17715 165907 147058 68171 -111765 -131018 -397988 46613 15170 -320258 -170162 -160875 84959
17703 119492 234630 158245 -132055 -13712 135065 -3022 -254579 -148816 104112 89182
17693 89182 -136685 141828 12296 -131486 173707 -62048 127100 331358 -156266 63152
17682 -24643 -492253 -112564 12784 222638 -21654 17682 -146765 45979 148358 224476 -66927
17670 -163204 1224 133933 173106 -169805 213740 -97628 -52235 -40094 -6364 -97397 -116327
17659 -116327 150315 -1233 292768 201021 145456 -81528 122205 -199395 136003 12757 -84830
17647 -185279 15412 2307 -116668 56105 -563 148666 860 161328 59614 -256383 154918
17635 -60191 -27842 -245804 -90088 69520 35366 -65290 -57787 67770 72487 374817 44500 22604
17623B2604a72762F5325K25015f4277A66191G5254c13653A43933K06592b09279
17612a23737B46989a45742f3585A69426G5140J4512J8717h9482B08696d0203C51073
17600I099J58593a9530j51234B44645F3757J73651b19952A49388d7172A74639
17589i2384C6389J04296b67584h9647B58913c55008g606j4148D8261a20411P604
17578a12807E8528a84997Q0889C35406I514c8430A25068J19733d3507B27544b83541
17566E9460a29878A11549C6777J71300E6353J43900a26381N3990E2064J08774
17556A60838e4577b2646j97757A02641b3612F5889a24099B51b74311B66902A8698
17544A05009C6187d03048I5498K6354n115R3290J86280j10235j14986b65671m2570
$$ plain form
17623 22604 -172762 65325 290340 -64277 166191 75254 -313653 143933 350525 -209279
17612 -123737 246989 -145742 -63585 169426 75140 89652 108369 -89482 208696 -40203 351073
17600 9099 167692 -19530 -170764 244645 63757 237408 -219952 149388 -47172 174639
17589 -92384 36389 140685 -267584 -89647 258913 -355008 -7606 -21754 48261 -120411 -112807
17578 -112807 58528 -184997 -104108 335406 9514 -38430 125068 244801 -43507 227544 -283541
17566 59460 -129878 111549 36777 208077 56353 200253 -126381 -72391 52064 160838
17556 160838 -54577 -22646 -220403 102641 -23612 65889 -124099 251 -274311 266902 18698
17544 105009 36187 -403048 95498 121852 116737 210027 396307 286072 171086 -265671 -308241
17533c08241F367K30008A11469b84279A48030j2089b0100D19230b18284D06515
17522B8658b86722D1655J15184J2675D0140P5690a45539A79613a64309B026J03344
17511A05370D7710g3928o5405c7758B18308a5050k99958a31598B74627l9459G2993
17499C61468j16525I1816A9082K43626a20545D1408J17990b7513A53621J06672
17489B60293j01114B8284J5984K48509a35599k65357J54003C3221R8437b84854
17478A41625a45490D89131B00631K0546K4326Q6788b1600B4320K7026R8399E0572
17466B2289a3816H018a76995k3531A66173k2516N7621d0858E7705N8098N463h8661
17453C0756K24154J839K19605H4683M68016j80155n5613J4377A32476L46799C3073
$$ plain form
17533 -308241 6367 236375 111469 -284279 148030 135941 -20100 419230 -218284 406515
17522 28658 -286722 41655 156839 169514 40140 115830 -145539 179613 -164309 2026 105370
17511 105370 47710 -73928 -139333 -37758 218308 -15050 -315008 -131598 274627 235168 72993
17499 361468 244943 91816 19082 262708 -120545 41408 159398 -27513 153621 260293
17489 260293 159179 28284 44268 292777 -135599 -400956 -246953 33221 131658 -284854
17478 141625 -145490 489131 200631 221177 245503 332291 -21600 24320 51346 149745 50572
17466 22289 -13816 8018 -176995 -200526 166173 143657 201278 -40858 57705 115803 121266 -88661
17453 30756 254910 256749 476354 84683 552699 372544 316931 331308 132476 479275 33073
17441B05210Q3142Q924k946K5208e00206h9014E4568a53581C76931J03730a33813
17429E74250B18319M4246b7025B87415I9653K21411d2726B61916I6507K76096
17419C72603q3688A04304a03889C26284L64030C43782K78690k81696A0870R4865
17409A05735a01891B06525H370J67659J25197r1755I2061K06354J06698j88445
17399B16668N0429J1034a0483B78783Q6458r4949b4909F091J23573K12376q2630
17388B59410E996L36123G8581A1496L75239A46006J19530F8618M6422K04412B0176
17376B31055g7390C65598j42059D7799p602K31151g2399g535B63339C971J96687
17365B00658H7483B8952K53109M1444A23107a47806L2344C04113j31980m7289
$$ plain form
17441 205210 288352 297276 294330 319538 -500206 -89014 54568 -153581 376931 480661 -133813
17429 574250 218319 262565 -27025 287415 99653 321064 -42726 261916 96507 372603
17419 372603 288915 104304 -103889 326284 690314 343782 622472 340776 10870 105735
17409 105735 -101891 206525 8370 176029 301226 209471 92061 298415 405113 216668
17399 216668 267097 278131 -10483 278783 365241 270292 -24909 6091 129664 342040 259410
17388 259410 5996 342119 78581 11496 386735 146006 265536 68618 115040 319452 20176
17376 231055 -77390 365598 223539 47799 40197 271348 -72399 -7535 263339 3971 200658
17365 200658 87483 28952 282061 323505 123107 -147806 -115462 304113 172133 124844
17355A24844K19064A01871K45729g8798B5921J75466H5415a76319A34720f8560
17344I7564N4806K11801g3597A06042J0304b23374e3054C36515k8045D3952K04810
17333B48762j19713P2547R4349r3347c9A27826b8763a4279j7439C4262J69201
17322B03463e5073C43729E9911K84340a55334g4123G0576K93795q6916J73622
17312D51077a76395C53023j14446m8509H7619O5358K73159A74955O6344c6597
17301a57607A02994d7292A51585m7359Q1568J26874A46090J5216N3958h5013B69902
17289C84052c4624B00877F3141J18391d6187B23094N0344m3533e8494A49666P1461
17278B21127r7714a87381D24011D8169J15641J94248E2619J17327o4948J00104
$$ plain form
17355 124844 343908 101871 347600 -78798 25921 201387 85415 -176319 134720 -68560
17344 97564 152370 364171 -73597 106042 116346 -223374 -53054 336515 308470 43952 248762
17333 248762 129049 201596 295945 202598 -39 127826 -28763 -14279 -31718 34262 203463
17322 203463 -55073 343729 59911 344251 -155334 -74123 70576 364371 277455 451077
17312 451077 -176395 353023 238577 190068 87619 152977 426136 174955 241299 -36597
17301 -157607 102994 -47292 151585 104226 185794 312668 146090 161306 215264 -85013 269902
17289 384052 -34624 200877 63141 181532 -46187 223094 273438 229905 -58494 149666 221127
17278 221127 123413 -187381 424011 48169 163810 358058 52619 169946 104998 205102
17268B05102M43906j93219M9537G3961d2227C90483I3399R4128f3342A25612P9760
17257B05372r9760J99548b3957C36351B3891L94230L8062p7911A8976d3507D10141
17245A72739D1022J05342L6246l4480K3004Q7757i7541A53291J87249j50672b58314
17233H2894c22757C95734j47969c0966A04887b203B92956j0188K149p9839N3651
17222B58729k0647b0950C6329L44621A26134j2644d6290C9251J99829J35085A08592
17210A41311J83682j55498p4048J40139m091O4499b43589A27019J14690N2463
17200B94172q4311D8211J37156p8715J37405a3895C39472l9579J49729A11120
17189A4961O1639J05440o1022M0326j8196P3535J02114J17626j38160j29186K64785
$$ plain form
17268 205102 649008 455789 505326 73961 -42227 390483 93399 187527 -63342 125612 205372
17257 205372 105612 305160 -23957 336351 23891 418121 456183 378272 18976 -43507 410141
17245 172739 41022 146364 182610 148130 171134 258891 -97541 153291 340540 189868 -258314
17233 82894 -322757 395734 247765 -30966 104887 -2203 292956 282768 284917 205078 258729
17222 258729 238082 -20950 36329 380950 126134 113490 -46290 39251 239080 374165 108592
17210 141311 324993 169495 95447 235586 231495 295994 -243589 127019 241709 294172
17200 294172 209861 48211 185367 106652 244057 -13895 339472 299893 449622 111120
17189 14961 76600 182040 121018 161344 143148 216683 318797 436423 298263 169077 433862
17178D33862A02131J23852N171K5227I4754J3830d9221A15529L26878E9657J45200
17167B04857J40651I0966K7679K4694L6337O2418K23673k05225K99083J28528
17157F88153k78095A96857J59666l6561A1982L09368c7224B93038I1088L94229
17147D85317k19216J85773A83249K74332l7505k3650j90489M32116B02986J72072
17137C75058J33116j43767l3812m6161J72100H088J99098J91010J54680k08008
17127C44868q6236b417C51299m4157J47455j3228J07305q9523j47701L30406J64550
17116H06406B43856J5954k8590J51277A39464J48549J27325A72205L0485J66256
17106C68946J22785J47046A84397K03484J33380l1728A07287L32326o0424A74345
$$ plain form
17178 433862 102131 225983 231154 256381 94754 108584 -49221 115529 442407 59657 204857
17167 204857 345508 90966 118645 143339 179676 242094 465767 260542 559625 688153
17157 688153 410058 196857 356523 319962 11982 321350 -37224 293038 91088 485317
17147 485317 266101 451874 183249 457581 420076 396426 205937 638053 202986 375058
17137 375058 508174 364407 330595 284434 456534 8088 207186 398196 552876 344868
17127 344868 258632 -2417 351299 307142 454597 441369 548674 459151 311450 641856 806406
17116 806406 243856 259810 231220 382497 139464 288013 415338 172205 202690 368946
17106 368946 491731 638777 184397 387881 521261 489533 107287 439613 379189 174345
17095C43222A24303M93694B99048K78467j27195A67255k4612L84994j40023L27001
17085G14615j71955O8185N6547B66906K79824A91025J50082J42755k16231J00584
17075C68215j57710K58439j69732J75039A97596L56536k23987J01504J10032B38232
17064B08164J27927K78809B24563K59067O5146A60668L09127o050p0275J52101
17054E45571B50689J86763P9348p7086L78544J10316C42312J56837L16328l13842
17044E01635r6392J75997L6800j39167J21615Q9245k67606J83715r3402o2627
17034D49813M05223k37446K5616k4883J64570C07177K63865B46496L11999j00579
17024D57916K00303p2903M0463j30164L26613k48999J89047R6949j76623L6890
$$ plain form
17095 343222 124303 617997 299048 577515 450320 167255 142643 527637 387614 714615
17085 714615 542660 610845 667392 266906 546730 191025 341107 483862 267631 368215
17075 368215 210505 468944 299212 474251 197596 554132 330145 431649 541681 238232
17064 208164 336091 614900 224563 483630 548776 160668 469795 463745 393470 545571
17054 545571 250689 437452 516800 439714 818258 928574 342312 499149 815477 501635
17044 501635 405243 581240 618040 478873 600488 689733 422127 605842 512440 449813
17034 449813 855036 617590 643206 618323 782893 307177 571042 246496 558495 457916
17024 457916 658219 585316 625779 495615 822228 573229 762276 859225 682602 719492
17014G19492k91987K99257q8991B67243M96199J19025o506k06846k4304k04424
17004D40387L94372C58644K92579j3531J62116J291K82560m93501J70778K10575
16994I71511m48592K14836k18418R3776M01148j96091j37797J17728N0168J18617
16984I66886j26217J26239R5115k45239N1657N8345j89743L59573j88869J65075
16974A072822l90269L17966l64066K19891J35124p807k31700J18951o4513k4137
16964G82262L43103k00046J75431k24070J15608R2353j48790M7213l5315J1880
16954I59629J7862L35789k80039J7940k86606O38577p1585r5381k92167O1077
16944A005096L15711m07801K58873L40000n39843L36523j14888J5462k08781O73290
$$ plain form
17014 719492 427505 726762 637771 267243 763442 882467 875961 669115 644811 440387
17004 440387 834759 358644 651223 637692 799808 801099 1083659 590158 760936 971511
16994 971511 522919 737755 519337 613113 1014261 818170 680373 798101 848269 966886
16984 966886 840669 966908 1062023 816784 868441 926786 737043 1096616 907747 1072822
16974 1072822 682553 1000519 636453 856344 991468 983661 751961 870912 806399 782262
16964 782262 1125365 925319 1100750 876680 992288 1084641 935851 983064 947749 959629
16954 959629 977491 1313280 1033241 1051181 764575 1403152 1331567 1236186 944019 1005096
16944 1005096 1320807 913006 1171879 1511879 972036 1308559 1193671 1209133 1000352 1673642
16934A673642m95642l03660K07084J82846K19017R3420k14964m73322L09366J09500
16924A307287J48896K0042M7642j01381j61976J80175L0453M4810m2955N7072
16914A530065M4536j59860p5895K32374p3796J26336q4566j11161K10033j2767
16904A625299J80886N5548j1427r9667N32883n72586Q6953o7458m6897J11271
16894A794805Q8521R6510k01067K29000k30054M27494q0944k46374K20113j76398
16884A921606J6915P7464K72572j7889j53363J69782m78398M34929Q8116l89219
16874A942515L58001J05953j6685j92612M04245j42778J64331m1658L49408l94275
16864B536445J78162J19293l5261q671L2153J50345M0388J05951j77838L94517
$$ plain form
16934 1673642 1178000 874340 1081424 1264270 1483287 1576707 1361743 888421 1197787 1307287
16924 1307287 1456183 1476225 1523867 1422486 1260510 1440685 1471138 1515948 1472993 1530065
16914 1530065 1574601 1414741 1338846 1571220 1497424 1623760 1539194 1428033 1638066 1625299
16904 1625299 1806185 1861733 1850306 1750639 2283522 1710936 1797889 1730431 1683534 1794805
16894 1794805 1883326 1979836 1778769 2007769 1777715 2205209 2124265 1877891 2098004 1921606
16884 1921606 1938521 2015985 2288557 2270668 2117305 2287087 1808689 2243618 2331734 1942515
16874 1942515 2300516 2406469 2389784 2197172 2601417 2458639 2622970 2581312 2930720 2536445
16864 2536445 2714607 2833900 2798639 2789968 2822121 2972466 3012854 3118805 2940967 3335484
16854C335484l55084K58523n4336L9087J44845k28520J90300k4121L73473j66818
16844C512833O1522m27513L55869L36132J76303r7317k705J82005J86293m05885
16834C877537J45231K92425K00951l1945m3141J53140m5784K26358q3253J51728
16824D843247J84578m2626R2940R0892J92334r8389K35417L67970j91184L52948
16814F028127L08096J8644o1207l5484M17562P0327J37801J56179L70922k5243
16804G385724j34302K61447M21401L1577R5928L99543K21320P8157k12364L44773
16794H893204O13834L49038k21144P92375p4469K96806L64937L17789J65697N73877
16784A2071944K54589l7258M80079K84068M73064P38645L44864M16358K85509
$$ plain form
16854 3335484 2980400 3238923 3184587 3223674 3368519 3139999 3330299 3306178 3679651 3512833
16844 3512833 3574355 3146842 3502711 3838843 4015146 3917829 3915124 4097129 4283422 3877537
16834 3877537 4022768 4315193 4516144 4484199 4441058 4594198 4548414 4774772 4691519 4843247
16824 4843247 5027825 4985199 5078139 5169031 5361365 5262976 5498393 5866363 5675179 6028127
16814 6028127 6336223 6354867 6293660 6258176 6675738 6746065 6883866 7040045 7410967 7385724
16804 7385724 7251422 7512869 7934270 7965847 8061775 8461318 8682638 8760795 8548431 8893204
16794 8893204 9507038 9856076 9634932 10427307 10352838 10649644 11014581 11332370 11498067 12071944
16784 12071944 12326533 12289275 12769354 13053422 13526486 14265131 14609995 15026353 15311862
16775A5311862O69943N38104J80521O10938P13303L76035J136240L87558Q50683
16766B0775187N84434R46096Q34037O58332R90715Q23912J292505J191108P69271
16757B8865597J009882J417703J807259J124114J699476J528358J857589J636698
16749D0946676J981602K451825J892036K349985K629718K709176L238111L052152
16741F1251281L271807L786029L691388M371031M345011N205814M793971N220891
16733I5937223N982653N657656O383546O710347O892383P171093P182473P393239
16725A49310613P081689P344488O498675O092248N610367M631052L851659K795033
16717A93215824J443077n2443j171594k591061l460207m167888n532252o215779
$$ plain form
16775 15311862 15981805 16519909 16700430 17311368 18024671 18400706 19536946 19924504 20775187
16766 20775187 21359621 22305717 23139754 23798086 24788801 25612713 26905218 28096326 28865597
16757 28865597 29875479 31293182 33100441 34224555 35924031 37452389 39309978 40946676
16749 40946676 42928278 45380103 47272139 49622124 52251842 54961018 58199129 61251281
16741 61251281 64523088 68309117 72000505 76371536 80716547 85922361 90716332 95937223
16733 95937223 101919876 107577532 113961078 120671425 127563808 134734901 141917374 149310613
16725 149310613 156392302 163736790 170235465 176327713 181938080 186569132 190420791 193215824
16717 193215824 194658901 194606458 193434864 190843803 187383596 183215708 177683456 171467677
16709A71467677o801947o950789p466278p223140p354159p159831p067558p019515
16701A14424460o571638o016243n819325n596279m915812n060968m970223l786648
16693G1687324m228315l762464l391321l164174k900503k791513k768350k431469
16685D6249215k614473j810512k203888j738835j671511j767249j455072j496420
16677C1491255j631622j129810r80168j323609r22425j154260p63507j122524
16669B2463330p12381j000941l71203r86649n42837n08622j096636j95346q56958
16660A6191757l70582o81821k21834q60788l19473l22755j09838m74524l96211
16651A2433931o09530l71246l41633J1217q17651J91593n21680k71403l21102
$$ plain form
16709 171467677 164665730 157714941 150248663 143025523 135671364 128511533 121443975 114424460
16701 114424460 107852822 101836579 96017254 90420975 85505163 80444195 75473972 71687324
16693 71687324 67459009 63696545 60305224 57141050 54240547 51449034 48680684 46249215
16685 46249215 43634742 41824230 39620342 37881507 36209996 34442747 32987675 31491255
16677 31491255 29859633 28729823 27749655 26426046 25503621 24349361 23585854 22463330
16669 22463330 21750949 20750008 20378805 19392156 18849319 18340697 17244061 17048715 16191757
16660 16191757 15821175 15139354 14917520 14056732 13737259 13414504 13304666 12830142 12433931
16651 12433931 11824401 11453155 11111522 11122739 10305088 10496681 9975001 9703598 9382496
16642I382496k53256m0517l52736k25525j14709m10755j30573l3193k50602l27962
16632G242668m1845j45757j90751l59662Q2396j34831k33788R545k45167K69341
16622F252149n77355j04080j1086l44527j55596K28342k59140K08928k39619p9447
16612D918569l42967j34974L29778j80559l1689j88835J32093m58056N3580k52071
16602C844869O7735m1410J07803m82816O0184M11565j96633l31836K37890l76278
16592C301073J9288J34470k63681K1026k7782m00065K78138n0079n30326M48206
16582B930268l18898j35226M36227k06427J04663J7460l32962L08881n88924O7270
16572B282332Q1172K2705J18770k17191J02113r4215j75443R4146N7419j25460
$$ plain form
16642 9382496 9129240 9088723 8735987 8510462 8395753 7984998 7854425 7821232 7570630 7242668
16632 7242668 7200823 7055066 6864315 6504653 6587049 6452218 6218430 6227975 5982808 6252149
16622 6252149 5674794 5570714 5559628 5215101 5059505 5287847 5028707 5237635 4998016 4918569
16612 4918569 4575602 4440628 4770406 4589847 4558158 4369323 4501416 4043360 4096940 3844869
16602 3844869 3912604 3871194 3978997 3496181 3556365 3967930 3771297 3439461 3677351 3301073
16592 3301073 3320361 3454831 3191150 3212176 3184394 2784329 3062467 3012388 2482062 2930268
16582 2930268 2611370 2476144 2912371 2705944 2810607 2828067 2495105 2803986 2215062 2282332
16572 2282332 2363504 2386209 2504979 2287788 2389901 2295686 2120243 2214389 2271808 2146348
16562B146348K5772j59041J15436j12679K64034n20229M07229m43231J56949k07966
16552A672622J90467k95847K64284Q7968k88803J9718K23657m42404J35001Q310
16542A574973Q4987j98520q230L7877J6616k44866L08261j36410p4887l479K01375
16531A557697j31844J22897r9143l29554j97931L25194J66904j42588M60106l78708
16521A353030j3860j40486J06223j05408K79609j49011j91545K29603j49453j04044
16511A114658J6271K93627n33183P28425o65427K50592q5388J109n2133j58188
16501I10363J1219K42492j82227k90765L47621K9283K7792P4526j42811r4044
16491I33449k85407J18380J41216J9144L08875l73519k93719K63578K2730R1492
$$ plain form
16562 2146348 2172120 2013079 2128515 2015836 2279870 1759641 2166870 1723639 1880588 1672622
16552 1672622 1863089 1567242 1831526 1919494 1630691 1650409 1874066 1431662 1566663 1574973
16542 1574973 1659960 1461440 1453210 1491087 1507703 1262837 1571098 1434688 1359801 1356322 1557697
16531 1557697 1425853 1548750 1449607 1120053 922122 1247316 1414220 1271632 1731738 1353030
16521 1353030 1339170 1198684 1304907 1199499 1479108 1330097 1138552 1368155 1218702 1114658
16511 1114658 1130929 1424556 891373 1619798 954371 1204963 1119575 1120684 1068551 910363
16501 910363 921582 1164074 981847 691082 1038703 1067986 1095778 1170304 1027493 933449
16491 933449 648042 766422 907638 926782 1235657 862138 568419 831997 854727 946219
16481I46219P4807j09346J20741j49207M7243j95173J06546K3146J53828j68723
16471H50081j68145L6853K04482k17506K74527l80140J14395J86662m12574M15447
16461I04082l67220M63696l15950L4375k4994K95899l05928O5708J35545P6976
16451I62189p5863l25993M8057k5824j33696J70842L2787M06504j71972m28902
16441D58129K50378L28958D15896L00299B91622K76094k58621L05000K27020q8582
16431G52533p8236m7361k27940J30162J95093B32871M47718j28772P8207j00877
16421E29147L50349m00099J81364J73121J24144A06997O46789K6164j44616M1042
16411F76376m9762r4071k26222J15151K42557B51504J67440Q5230J60530k44536
$$ plain form
16481 946219 1021026 911680 1032421 883214 930457 735284 841830 864976 1018804 850081
16471 850081 681936 718789 923271 705765 980292 600152 714547 901209 488635 904082
16461 904082 536862 1000558 684608 718983 693989 989888 683960 749668 885213 962189
16451 962189 886326 560333 608390 582566 448870 619712 652499 1059003 887031 458129
16441 458129 708507 1037465 415896 716195 291622 567716 309095 614095 841115 752533
16431 752533 674297 626936 398996 529158 724251 232871 680589 551817 630024 529147
16421 529147 879496 479397 660761 833882 958026 106997 753786 779950 635334 676376
16411 676376 626614 532543 306321 421472 664029 251504 418944 504174 664704 420168
16401D20168J72747k07320r5232J10178M03887n7086k08177k03254R026p048L20031
16390F57920j92535K82384E5689M55571A91744J67396J06245A67528D2198J86990
16380B29188l805J02701J49144k22357n1473J06345J34398k0673K47690j64650
16370E06508O8850j76396N420k7787O6706j88893L4969J05890q9971L41902J8345
16359F65543l21324j01684J90911N1963k9693j43249J55521B28877O794K09594
16349D45265j77207A01681K08178L6466A53774L71409p5055l342j23513J11322
16339D34595F1420M67215G3766M35234C9316L87852k05014M91144B00896J17434
16329C18330J87903j30064F1271K27179F6470J75940K75493j16268A58796k3646
$$ plain form
16401 420168 592915 385595 290363 400541 804428 747342 539165 335911 344937 337889 657920
16390 657920 465385 747769 55689 511260 191744 359140 465385 167528 42198 229188
16380 229188 225383 328084 477228 254871 203398 309743 444141 423468 671158 506508
16370 506508 575358 398962 404382 376595 443301 254408 289377 395267 305296 647198 665543
16359 665543 344219 242535 433446 485409 455716 312467 467988 228877 235671 445265
16349 445265 268058 101681 309859 346325 153774 525183 450128 446786 323273 434595
16339 434595 61420 528635 73766 509000 39316 427168 222154 713298 200896 318330
16329 318330 506233 376169 61271 288450 66470 242410 517903 401635 158796 135150
16319A35150K58676j12470M382l6582F7709d1761J3285D3464L29042j56300O0787
16308B76993J28511o5939B0848L83525A64982J55580O6804A75660K22589j26827
16298B71422q8391d3419B66458m6485M5977q844K20933A51054J8611J06723O2937
16287C39325F3774J48335q360L483n772O7963K7428A38587M80736k97610p7838
16276B43875J53492I2257L84859j78383q2395c3731A88308N8823a02401A44314
16265B12459G5808L33175r3686A03255k2043L21128Q7125j06475o5174F5473l579
16254F1894R795J96703J68149a1129C81993B6954Q3040C3065b3083D2150K53581
16243B95731j40618K452J15636O8206I6145J75222h9084A56591m3689k4798L63335
$$ plain form
16319 135150 393826 281356 285738 249156 67709 -41761 -28476 43464 372506 216206 276993
16308 276993 405504 339565 20848 404373 164982 320562 387366 175660 398249 271422
16298 271422 183031 -43419 266458 219973 265950 257106 478039 151054 169665 276388 339325
16287 339325 63774 212109 203749 207232 201460 269423 296851 138587 619323 321713 243875
16276 243875 397367 92257 477116 298733 216338 -33731 188308 247131 -102401 144314
16265 212459 75808 408983 315297 103255 81212 402340 489465 382990 317816 65473 61894
16254 61894 71689 268392 436541 -11129 381993 26954 109994 33065 -23083 42150 295731
16243 295731 155113 157565 273201 341407 96145 271367 -89084 156591 112902 88104 451439
16232D51439A86089f3210F3773a45811D44736A80928b3301A19805L6152Q8965
16222B44922Q243d7011A60268m2276a8365D16864j49843D7530R6198R4119J0496
16211B48343G1567L06503j69070J93P0941q0358J91284j51341b4512E6708L63622
16200D20330F2728L34577q2482J70154c8345j88920C09154A08584j9764c2395
16189A12534R5997J1370L0601A01645R9936f4080B6196J85705Q0402B0960J22499
16178A43459K15926c0837E8677K5870R5212K5555l6998D0730b4185A98452q9697
16167A08755l7480d19579a99243f5176A04093K24202A09840n643a58620I3972
16156G5552A7653J54894f943B60388a01038E5306a65561D43661A29755C1725q478
$$ plain form
16232 451439 186089 -63210 63773 -145811 444736 180928 -23301 119805 155957 244922
16222 244922 253165 -47011 160268 117992 -18365 416864 267021 47530 143728 237847 248343
16211 248343 71567 378070 209000 209193 280134 199776 391060 239719 -24512 56708 420330
16200 420330 62728 397305 314823 484977 -38345 -227265 309154 108584 88820 -32395
16189 112534 208531 219901 250502 101645 201581 -64080 26196 211901 292303 20960 143459
16178 143459 359385 -30837 58677 84547 179759 205314 168316 40730 -24185 198452 108755
16167 108755 71275 -419579 -199243 -65176 104093 328295 109840 104197 -158620 93972
16156 75552 17653 172547 -6943 260388 -101038 55306 -165561 443661 129755 31725 23247
16145B3247a24742C14226c6322A18162M3785C0484J0852J91072J51020a3314k3969
16134c7283A90722q8610l8295J36418i8791H4979B1152P974f4895H6053d1301
16122C1184a64900B61824N7657F122J41287O7835N8526A07309P7492a6782l644
16111b0426j94508A52423D8037N4358h4080O876C5541K93361a00354J985B25716
16099C6874J53029e8612K8822j82271c2379C13883E6026M36581j1352j62590B7767
16087A61894h3505o4805H6522e5329j09227P4296A28218n7425Q2586J24597f9054
16075a36522A96793g0392F6958K06509c6406F2404d2141l8651A24251J17441c7068
16063c491I6767L96829E7599J3912a84828Q276E5442I814K9423O486i3736l07887
$$ plain form
16145 23247 -124742 314226 -36322 118162 161947 30484 41336 232408 383428 -13314 -37283
16134 -37283 190722 102112 63817 200235 -98791 84979 21152 29126 -64895 86053 -41301
16122 31184 -164900 261824 319481 6122 147409 215244 273770 107309 184801 -16782 -20426
16111 -20426 -214934 152423 48037 102395 -84080 -77204 35541 328902 -100354 -98369 225716
16099 36874 189903 -58612 -29790 -212061 -32379 313883 56026 492607 481255 318665 27767
16087 161894 -83505 -148310 86522 -55329 -164556 -90260 128218 70793 153379 277976 -69054
16075 -136522 196793 -70392 66958 273467 -36406 62404 -42141 -80792 124251 241692 -37068
16063 -3491 96767 493596 57599 71511 -184828 -176552 55442 9814 39237 45723 -93736 -401623
16051d01623B93672a31682B68721g740A34660h7528B39967e9938j03370B6003
16040H7387b45775a16135C12632b24519H3124b150D8063b0371l50114a67739r763
16029a77502f1215F7011K1407K3302f8464j3577A28324a5117I7899R6186B1622
16017a15567N7763I1351c72984a43698q3159i3008B36123a83102H1336R2422E7980
16005i9788I2384E186J99970I2174c00346A17456a36386k77600c3457k92215h2743
15993A66937a67643G1309B5886h3752j89443D7291f2710B9655J92630n2292l8795
15982A31198J55325r3236D9893M4866g4604A56598b29449Q0299F6956a58428A01782
15970g7351H987b80582d3425G7528m199a86599g0006g718D2163J50400g9800L8294
$$ plain form
16051 -401623 293672 -131682 268721 -7740 134660 -87528 239967 -59938 -163308 26003
16040 87387 -245775 -116135 312632 -224519 83124 -2150 48063 -20371 -370485 -167739 -177502
16029 -177502 -61215 67011 88418 111720 -68464 -82041 128324 -15117 97899 194085 21622
16017 -115567 -57804 91351 -372984 -143698 -226857 -93008 236123 -183102 81336 173758 57980
16005 -99788 92384 5186 205156 92174 -300346 117456 -136386 -413986 -33457 -325672 -82743
15993 166937 -167643 71309 25886 -83752 -273195 47291 -62710 29655 222285 169993 131198
15982 131198 286523 193287 49893 94759 -74604 156598 -229449 -149150 66956 -158428 101782
15970 -77351 8987 -280582 -43425 77528 73329 -186599 -70006 -7718 42163 192563 -79800 -41506
15958d1506k15079A46884C0552a50923a3240j96603i9187j55699c1564q3265l3739
15947a48568d3601k53008B1853K63376H4143m0018J04554P3495a23786a2968j37199
15936a50167B19398d06045I0662L4430D8979e7988l06665a29197j13491F1188
15925a36095C01160A17945b79756B88475c90774a90519A50641b00450C8804J7569
15915E6373j3209O2422a77966j1707E2639c9057A17716a65275c1556l7996k2786
15904i2338K0075j59497i5474C0844b88897J04871B2558K63440a83413P2842d049
15892A56962B9423F535O2151b66118o0767J09334O7312q6760F8895g3793F8226
15880a18491k56974B9001K73161A5291K97598k3583q1337q5990b20544N2660r1074
$$ plain form
15958 -41506 -256585 146884 30552 -150923 -13240 -209843 -99187 -254886 -31564 -114829 -148568
15947 -148568 -43601 -296609 21853 285229 84143 44125 148679 222174 -123786 -12968 -150167
15936 -150167 219398 -406045 90662 125092 48979 -57988 -364653 -129197 -242688 61188
15925 -136095 301160 117945 -279756 288475 -390774 -190519 150641 -200450 38804 56373
15915 56373 43164 105586 -177966 -189673 52639 -39057 117716 -165275 -31556 -69552 -92338
15904 -92338 -72263 -231760 -95474 30844 -288897 -184026 22558 285998 -183413 -110571 -4049
15892 156962 29423 6535 68686 -266118 -326885 -217551 -150239 -236999 68895 -73793 68226
15880 -118491 -375465 29001 302162 15291 312889 289306 207969 121979 -220544 -167884 -258958
15869b58958A80632l5765a04023A13685C2838J44979b12937O1652A12855h3662
15858B30357I0418c82675g615j59792a9825b638B98541E3395R5171K4083A4440
15846G9133d7245B18006g2657K8572j13913F8107b71490A59275a71859A96855
15835b30269L0830A17033c22781J45442d1359A01212i4046r104k5703C6571c4164
15823a29602H6592c52370i8007I4209a41262A72210J00618a4101j15191A9935
15812g9155j79641p1844A11188P7140P101b15733K8164A04750m0164J14252E6650
15800A44552b65313O4578F1016K85161B9785J76648o9434b95234B29240I3252
15789E0433a58557l76236I6644C3829b68872j27585A14380A9302L4094A4711b42625
$$ plain form
15869 -258958 180632 144867 -104023 113685 32838 177817 -212937 -151285 112855 -83662
15858 230357 90418 -382675 -7615 -167407 -19825 -2638 298541 53395 148566 172649 14440
15846 79133 -47245 218006 -72657 -44085 -157998 68107 -271490 159275 -171859 196855
15835 -230269 -199439 117033 -322781 -177339 -41359 101212 -94046 -103150 -128853 36571 -34164
15823 -129602 86592 -352370 -98007 94209 -141262 172210 272828 -14101 -129292 19935
15812 -79155 -258796 -330640 111188 188328 195429 -215733 -187569 104750 64586 178838 56650
15800 144552 -265313 -200735 61016 346177 29785 206433 136999 -295234 229240 93252
15789 50433 -158557 -534793 96644 33829 -268872 -396457 114380 19302 53396 14711 -242625
15777D3294g978G3902K6806d0463F6797J57554h6209j86079J28156A33202b45745
15765h2447b1278j26586B56911a09733j3396b3334H1452A237a69335c8637j02759
15754a41396B24075B512i5792q1583C7953A0727a19719L7470D6535J17675d28385
15742a41881O8888n9974L0327N651k67851A61660e2360C0136A57h0263H9811L4827
15730A24638f7418M272Q140r6627i759l23352a19533j58255b0986Q796L953A56865
15717d8126a6292F8093d54928G7047e644C1149c63773R7349A79147a32807G7549
15705e7047j1676j6927C01145A03694H699K76280k3933g0963K0389k33351c7669
15693B8404b55036G3225a47533j69904Q6796a12003n7350A90147b83623H449J78574
$$ plain form
15777 43294 -7978 73902 100708 -40463 66797 224351 -86209 -272288 -144132 133202 -245745
15765 -82447 -21278 -147864 256911 -109733 -123129 -23334 81452 1237 -169335 -38637 -141396
15754 -141396 224075 2512 -95792 -177375 37953 10727 -119719 -82249 46535 164210 -428385
15742 -141881 -72993 -132967 -102640 -96989 -364840 161660 -52360 30136 157 -80263 89811 124638
15730 124638 -67418 -63146 -55006 -151633 -9759 -333111 -119533 -277788 -20986 -12190 -8237 156865
15717 -48126 -16292 68093 -454928 77047 -5644 31149 -363773 -266424 179147 -132807 77549
15705 -57047 -68723 -85650 301145 103694 8699 284979 261046 -70963 -50574 -283925 -37669
15693 28404 -255036 73225 -147533 -317437 -230641 -112003 -169353 190147 -283623 8449 187023
15682A87023C451d3550j98576a13035d0370a5393o9117K347k2153n6166I1963
15670a97187i018A18652a4255A11100J27278n1238a4202H4222M3172a46097j19577
15659b65674B44399F8680e7028j13195g3902D0827a78024j4400M7004A29517e0784
15647C23851r8956n0988a77734J2210C0392J69145O8436c17503D36028b44362
15636b17316g8976I4308a18698C62242a25652l7330p4160M1730O1200M8738j5557
15625a01031M834j38165C7878i5165A85016E3289c44452a3028r5382j3339g009
15613c09369i7336o6184M1552I6454b32036A88517l9966b14049g7806o6348i172
15601d55373G260f8522B17225d4513A30b10074C0117K09796B4132c0019I5255
$$ plain form
15682 187023 3451 -43550 -242126 -113035 -40370 -15393 -84510 -82163 -104316 -160482 91963
15670 -197187 -9018 118652 -14255 111100 238378 187140 -14202 84222 127394 -146097 -265674
15659 -265674 244399 68680 -57028 -170223 -73902 40827 -178024 -192424 -145420 129517 -50784
15647 323851 224895 173907 -177734 -165524 30392 199537 267973 -317503 436028 -244362
15636 -217316 -78976 94308 -118698 362242 -125652 -162982 -237142 -195412 -134212 -85474 -101031
15625 -101031 -96197 -234362 37878 -95165 185016 53289 -344452 -13028 -108410 -121749 -7009
15613 -309369 -97336 -163520 -121968 96454 -232036 188517 148551 -214049 -77806 -144154 -9172
15601 -455373 7260 -68522 217225 -44513 130 -210074 30117 239913 24132 -30019 95255
15589B91065b58056B9447a3903A29841k5582J4852h6645A05124i5960j60606B78550
15577B40077I7356D0583K71849a79413P8344b8583B05462b87494I0986b97911
15566i4892n3440A4013O5716K54639B2696J16922A7479K2335d09006a3876C4371
15554B26830a70858B54141f7437J4376k7050b6268E6540L720k4244a3644G6321
15542B00439b0106l532k6695J1391d079A45515J47549D9597a40264a442A35172
15530B8303b4685j89945q0688q7473I3797l0566a73927D6687c0314B5278h8189
15518C9947e0801A10164J84025a81739g8109B5822J32168F2911g7764A23990k643
15507A21347F223c21330a10536A50241m0113C6664P5520a51287A2326b5616A67013
$$ plain form
15589 291065 -258056 29447 -13903 129841 104259 119111 -86645 105124 -95960 -256566 278550
15577 240077 97356 40583 312432 -179413 -101069 -28583 205462 -287494 90986 -297911
15566 -94892 -148332 14013 79729 334368 22696 139618 17479 39814 -409006 -13876 34371
15554 226830 -170858 254141 -67437 -53061 -80111 -26268 56540 60260 36016 -13644 76321
15542 200439 -20106 -23638 -50333 -38942 -4079 145515 293064 49597 -140264 -1442 135172
15530 28303 -24685 -214630 -295318 -382791 93797 63231 -173927 46687 -30314 25278 -88189
15518 39947 -50801 110164 294189 -181739 -78109 25822 157990 62911 -77764 123990 121347
15507 121347 6223 -321330 -110536 150241 110128 36664 112184 -151287 12326 -25616 167013
15495A6314J9678b26164h1691G5989a83086b76j37770c7032B9858a47328A51573
15483D00296G9728J2761f0731A46482a22000g131j18287q4716e8315A79468p1531
15472A07937b50789i9739p3828k0532l7884g8903D0656b6961A2599e3648j96153
15461b49801k56215I9450j8940O064a86759M7435B05779D2652f6155m1976A05599
15449I5424R2854D4748b62797B7552d4671A5420L22078A61655a94241f1727A66851
15437d9384A9639a65970M293G7386a24110j8997A57990c6026B900J77449K5211
15426B05560b13275E5427b31750B5449b57438A22363f6451K9948A23453a12750
15415B3514J77979d41003c7911C8438h0696A94142G2792f518j97040A36151H577
$$ plain form
15495 16314 35992 -226164 -81691 75989 -183086 -276 -138046 -37032 29858 -147328 151573
15483 400296 79728 92489 -60731 146482 -122000 -7131 -125418 -210134 -58315 179468 107937
15472 107937 -250789 -99739 -173567 -194099 -231983 -78903 40656 -26961 12599 -53648 -249801
15461 -249801 -506016 99450 80510 86574 -186759 -139324 205779 42652 -66155 -108131 105599
15449 95424 188278 44748 -262797 27552 -44671 15420 337498 161655 -194241 -61727 166851
15437 -49384 19639 -165970 -161677 77386 -124110 -143107 157990 -36026 2900 180349 205560
15426 205560 -213275 55427 -231750 25449 -257438 122363 -66451 -36503 123453 -112750
15415 23514 201493 -441003 -37911 38438 -80696 194142 72792 -6518 -203558 136151 8577
15403B93271C1363h8357B08355M8300E9913K8122B8985J74548g4224j54960A75664
15391c66622J73653h583B53837E8710B4389p750n822h3303a5970A35453e4556
15379A39046j5335n1114h5545m0329A31341K1494EL52801A47235L41886D9606
15367a12940C29664p6419d44562E457f6018p1730A42582a1991D7774a22095P483
15356a14612B28796a890j20988j24573R6726B5827Q0142K0461b30601F9434J89757
15345B59191j23068F401e449I0238a40690E2262O7985a49138B5383b82967A41229
15333a64809c9100j66197A36472j2665L38612a18105F0453a41782A1180a1220
15322e1802k4996I4083K72328b64530A72624C3443L20699I9128A1613a61532M9075
$$ plain form
15403 293271 31363 -88357 208355 256655 59913 88035 28985 203533 -74224 -229184 175664
15391 -366622 -192969 -8583 253837 58710 24389 16639 10817 -83303 -15970 135453 -54556
15379 139046 123711 72597 -85545 -125874 131341 152835 5 352806 147235 489121 49606
15367 -112940 329664 253245 -444562 5457 -66018 -137748 142582 -11991 47774 -122095 -114612
15356 -114612 228796 -1890 -122878 -247451 -150725 25827 105969 126430 -230601 69434 259191
15345 259191 136123 6401 -5449 90238 -140690 52262 120247 -149138 25383 -282967 141229
15333 -164809 -39100 -205297 136472 123807 462419 -118105 60453 -141782 11180 -11220
15322 -51802 -76798 94083 366411 -264530 172624 33443 354142 99128 11613 -161532 -112457
15311a12457D8593a35297A651K05318k6237c5562k48308A12243D6943L34504g9645
15299A68809a17261b8645B22302B1090K7644H941L785K35358J57310b09765B04434
15287a08415G4208Q7300b26296C79694b02415A2770J70521Q7674a07268H9762
15276A1958g2058o9085B6205J26575F7139B4709b25903I7724e7440A05359b38257
15264b27746A42807g4486C82480a72579k708B91446I6614a6869j97538A96531
15253H3531b01421I6890j9730a74453B81679l5389L33261O38498J106719n82549
15243A742219J24028k12155n32903A63133k9676k8220P0444F7103Q0693h6031
15232A11599K84428j96578B9142J86194J8404j11818R2015A04454J70103J09089
$$ plain form
15311 -112457 48593 -135297 1651 206969 180732 -35562 -283870 112243 46943 381447 -79645
15299 168809 -117261 -28645 222302 21090 48734 8941 12726 248084 405394 -209765 204434
15287 -108415 74208 161508 -226296 379694 -202415 12770 183291 270965 -107268 89762
15276 11958 -72058 -141143 26205 152780 67139 24709 -225903 97724 -57440 105359 -238257
15264 -227746 142807 -74486 382480 -172579 -175287 291446 96614 -16869 -214407 196531
15253 83531 -201421 96890 77160 -174453 281679 246290 579551 1218049 2324768 1742219
15243 1742219 1866247 1654092 1121189 163133 133457 105237 175681 67103 147796 -86031
15232 111599 396027 199449 29142 215336 233740 121922 213937 104454 274557 383646
15222C83646j68606q6792i1458k59980J37424d8989A1648b7720C7571G760L3116
15211D0876J35908J66222A55014N1466a92716B84644f7400A07096a00528B0794
15200A61373J58124M3089B6594K7858M8217O9675C7737a8835B3995N9608O0563
15189A44166C9076g5531F0937D256J91021J58387j05860k2978B707K40402k9587
15178B13522b0197C35303r2612A06286d7675k10703i0477K5547E29918d1985B3796
15166F2408J49163D3233J90765N73K9089a3408j15039j8572A62965D8770J90655
15155B39425p2846A8075J63647L0477a68367M0036B39286q0808N2716b7153A06694
15143D16240O7427A51812J46398c53587a0043l234A16008J16992D6194N10783
$$ plain form
15222 383646 215040 128248 -91458 -351438 -214014 -48989 11648 -27720 37571 7760 40876
15211 40876 176784 343006 155014 206480 -192716 284644 -67400 107096 -100528 20794
15200 161373 319497 362586 26594 54452 102669 172344 37737 -18835 23995 83603 144166
15189 144166 39076 -75531 60937 4256 195277 353664 247804 224826 2707 243109 213522
15178 213522 -20197 335303 242691 106286 -47675 -258378 -90477 -64930 529918 -41985 23796
15166 62408 211571 43233 233998 234571 263660 -13408 -128447 -147019 162965 48770 239425
15155 239425 166579 18075 181722 212199 -168367 -128331 239286 158478 211194 -27153 106694
15143 416240 483667 151812 298210 -353587 -10043 -13277 116008 233000 46194 556977
15133E56977A13490J20701E7581a28721A95489N5794Q037L3299A11658C4118L08831
15122C42949r7619O8728J17027D0894j8393K38538D1483O419a0533k105A46042
15110B83168i6874D01265C7921j2286a83683e6446A26319K53409K7325r5088p1445
15099B40520a05408J0871D72430A90483C8647M9419J86721b2084D0026J02657
15089A42683O2720b6379O255E71711G8039L73976e4783B88297b5345B49947c0389
15077C88720A12605K37479j72495D8379L54742i56A43206i699C47737o0625A04752
15065H5216J28276O8030j26341c01793g8780k14779A97183K49502A37091b3780
15054b16665C57331r81H1847L31148j44264p8243M58845k34183L2985n6425A86500
$$ plain form
15133 556977 113490 234191 57581 -128721 195489 251283 259320 292619 111658 34118 342949
15122 342949 245330 314058 431085 40894 22501 261039 41483 47902 -10533 -12638 146042
15110 283168 -96874 401265 37921 25635 -183683 -56446 126319 379728 407053 311965 240520
15099 240520 -105408 -94537 472430 190483 38647 88066 274787 -22084 40026 142683
15089 142683 205403 -26379 -20124 571711 78039 452015 -54783 288297 -25345 249947 -30389
15077 388720 112605 350084 177589 48379 403121 -956 143206 -9699 347737 287112 104752
15065 85216 213492 281522 155181 -301793 -78780 -293559 197183 446685 137091 -23780
15054 -216665 357331 356350 81847 412995 268731 190488 649333 415150 448135 391710 186500
15042B22180N6444K19980d0508B81257j09735h3966C5286J65401o3145f2411A06393
15030A19148B4303M0915J20894J38896F2355J2328J28601e2527C0900M44243k23250
15019B51893K3404j30691e7648A22034J35020L22889k34668B8797L7630R684J14016
15008A90127L5217i8910B04941K3098J34036j59817L73424g2817B96436E7966
14997A76726J39999K66463B88961b966A41526L7259J41046F6088K6069Q5408m8110
14986A29455E948a043B3718N6731A6734K2267L24778n4875G9228N49070a55814
14974C03660l6441k2738Q2224C5906L45756K2550j82735J01144a2206E6205N9001
14963A15206J23649j03874M0885j1651L00076k2789q2334A27532M24172j12781
$$ plain form
15042 222180 278624 498604 -40508 281257 171522 -83966 35286 200687 137542 -62411 106393
15030 119148 24303 65218 186112 325008 62355 74683 203284 -52527 30900 475143 251893
15019 251893 275297 144606 -57648 122034 257054 579943 345275 28797 66427 76111 190127
15008 190127 225344 -98910 204941 228039 362075 202258 575682 -72817 296436 57966
14997 176726 316725 583188 288961 -2966 141526 178785 319831 66088 92157 177565 129455
14986 129455 5948 -1043 23718 80449 16734 39001 363779 308904 79228 628298 -155814
14974 303660 267219 244481 326705 35906 381662 404212 221477 322621 -12206 56205 115206
14963 115206 238855 134981 175866 164215 464291 441502 359168 127532 551704 438923
14953D38923A99448J3871J18752l6560b7913C41791J4520j05246E419L28296q7633
14942B46082J43505k0835m9972I1937K53035p3202J29791J89510B91703F9655
14931I9987b47573G4168L60222j67925q7739K9411P1417j11917k4872K54795k8664
14920C68896I8785N12716B73434k6485r7395J49772R3428q8723p4507J94142K27316
14909F50982k91294n8637K41647C2363L06822j25163J80857J3183q6416E0426
14898A7867J12709K83574j34810J55632j89278L52850E6183L23805A15614K18121
14888C33735B6742J53139M05514j16979k24084K38861P3892B28988K4661L57370
14878F11019k08561I9797Q0060p55J459M74742j65558Q8672A01375L95439j12569
$$ plain form
14953 438923 199448 213319 332071 295511 -27913 341791 356311 251065 5419 333715 246082
14942 246082 389587 368752 318780 91937 344972 271770 401561 591071 291703 69655
14931 99987 -247573 74168 434390 266465 178726 208137 279554 167637 142765 397560 368896
14920 368896 98785 611501 273434 246949 149554 299326 392754 304031 229524 423666 650982
14909 650982 359688 301051 542698 32363 339185 214022 394879 408062 321646 50426
14898 17867 130576 414150 279340 434972 245694 598544 56183 379988 115614 333735
14888 333735 26742 179881 585395 468416 244332 483193 557085 228988 253649 611019
14878 611019 402458 99797 179857 179102 180561 655303 489745 578417 101375 496814 384245
14867C84245A79253m6849J66122D2797O04630N5557j07064A95349J34531L3623
14857C63503K5592j50229R7948J65146K60187k50232j1760k43618l2216J60138
14847C84459j17356K06294o7707j7400j5163j20520J34601K9695K93552C18779
14836D16904K39580C10775n8993j312K6224N7030J67068J61187B02365L37518
14826E39883j53817J62070o7936o8631J70655j00283K27209C28239K47077o544
14816E68772K17432k72172J6166L29354k90651k20659P704k3353H9144O93787
14806G82931k96835J46213J45305C55620M77886j77629J5993K3572m3115n0715
14796F01612B97956L60176k25372K37227o5361N9258m1020k23809K56057J71289
$$ plain form
14867 384245 179253 132404 298526 42797 647427 702984 595920 195349 329880 363503
14857 363503 389095 238866 336814 501960 762147 511915 500155 256537 224321 384459
14847 384459 267103 473397 405690 388290 373127 252607 387208 416903 710455 318779
14836 416904 656484 310775 251782 250470 276694 333724 500792 661979 202365 539883
14826 539883 386066 548136 480200 411569 582224 481941 709150 328239 575316 568772
14816 568772 786204 514032 530198 859552 568901 348242 355946 332593 89144 782931
14806 782931 486096 632309 777614 355620 833506 655877 671870 695442 652327 601612
14796 601612 297956 658132 432760 669987 604626 663884 622864 399055 655112 826401
14786H26401J9161j91442p6462n0428o6620M86376l20679k23886K94138j94529
14776E02030J15519m7953M0231M7247M53644m32776r626n0850L3572n9274O9315
14765F61079R8969k82636K56543M6367L3505J2243B93620L57842K82691l16715
14755F17438J92685o7045B92366N34170m01258J38849k03180j22749N04908J32007
14745H75113l31209N1186L19438j00133o5788M90105E27416R8292K97132J10931
14735A033771E04673j81252K91973J07281C11596O29112j47387K20250k43367
14726G70204Q1636O6318k40482L27008o9197o7944k1568k45397K77264l02737
14716E75105K59546L2063j767k6449K33341j59457l59712J02068K77653k20227
$$ plain form
14786 826401 845562 654120 577658 527230 460610 946986 626307 402421 696559 502030
14776 502030 617549 569596 609827 657074 1110718 677942 668316 617466 651038 591764 661079
14765 661079 760048 477412 733955 780322 813827 826070 293620 651462 934153 617438
14755 617438 810123 743078 292366 826536 425278 564127 360947 238198 743106 875113
14745 875113 543904 595090 914528 814395 748607 1238712 527416 625708 922840 1033771
14735 1033771 504673 323421 615394 722675 311596 940708 793321 1013571 770204
14726 770204 851840 918158 677676 1004684 935487 867543 845975 600578 877842 575105
14716 575105 834651 866714 864947 838498 1071839 912382 552670 654738 932391 712164
14706G12164M27124l19696L38799m07865J30744k38750K51333j40126M06596m70279
14696F90044L87021l75814j96337M39955r1549L8597J16495k79206L70401j33231
14686I66376j24449k679k1421J37841m8429K77864l94364K63618k53909J29596
14676I30044J77469J10206k48910J10507l24959K95223j12024Q170L94719m24155
14666I16290J68081l27802K89199J0434J36180m4767J2718j17737N4898K81203
14656A378697k44415K71149j692m0964l15367n3382L12826j49109o0689L05169
14646A402223K134j31997J39734O3905P1206j96377k31297j32998K77335P4723
14636A338591k26357L27338J31871k20984l1461L26077j70195P3329j85145Q5750
$$ plain form
14706 712164 1139288 819592 1158391 750526 881270 642520 893853 753727 1160323 690044
14696 690044 1077065 701251 504914 944869 853320 891917 1008412 729206 1099607 966376
14686 966376 841927 839248 817827 955668 907239 1185103 790739 1054357 800448 930044
14676 930044 1107513 1217719 968809 1079316 754357 1049580 937556 945726 1340445 916290
14666 916290 1084371 756569 1045768 1056202 1192382 1147615 1160333 1042596 1097494 1378697
14656 1378697 1134282 1405431 1403739 1362775 1047408 994026 1306852 1157743 1097054 1402223
14646 1402223 1404357 1272360 1412094 1475999 1547205 1350828 1119531 986533 1263868 1338591
14636 1338591 1112234 1439572 1571443 1350459 1318998 1645075 1474880 1548209 1363064 1448814
14626A448814r0989L46551k22359K5741L23106m50451Q8795j65103k0032L88867
14616A672940J04002j59193J2044j05162l69223Q04607o31814K09800j17841K36375
14606A656535j50582j39120L4729J91564J55634J28298k83363L77590l2696j35345
14596A803244J42224j62501J22305N6541k40902j67354J70736P3071J38416l09051
14586A626729J77065L54848j72578k01348J81753O2623j35179J44797j0827k22817
14576A805066K43222J24718J47724r3321N4113O1413n715k03384P6126N6526L89639
14565B656127M4684l08703L00794j89508J07946J70427J87008k4230J32580M2456
14555C119581L65932L13013Q4391L98222Q30984P11382K762091N079981R112582
$$ plain form
14626 1448814 1357825 1704376 1482017 1507758 1830864 1380413 1469208 1304105 1284073 1672940
14616 1672940 1776942 1617749 1629793 1524631 1155408 1960015 1328201 1538001 1420160 1656535
14606 1656535 1505953 1366833 1401562 1593126 1748760 1877058 1593695 1971285 1938589 1803244
14596 1803244 1945468 1782967 1905272 1961813 1720911 1553557 1724293 1797364 1935780 1626729
14586 1626729 1803794 2158642 1986064 1784716 1966469 2029092 1893913 2038710 2027883 1805066
14576 1805066 2048288 2173006 2320730 2227409 2281522 2342935 2337220 2133836 2209962 2266488 2656127
14565 2656127 2700811 2392108 2692902 2503394 2611340 2781767 2968775 2944545 3077125 3119581
14555 3119581 3485513 3798526 3882917 4281139 5112123 5823505 8585596 13665577 22778159
14546B2778159J3966381K751994j7418948j0826548l887409L44698k156275k072610
14538C479442j027901l74536j56903J94022L32715l78015L96737m76223K47424
14529B236762k9983L86374m30428J95861k68088L41309K22199l82107M51531J73139
14519B896569o81608L62477m1301j53190K32247p8228Q5868J04157K28633K82089
14509C237713l01976j96658J40650K57848k62350K94081r7607J92862J83684l03281
14499C144966j8093J52422K39690J35028j47939q7516l03012N70476j85395q2212
14489C418415L00669k93404j4687M8407J84442J41859j44240M21225r9103J90412
14479D153995q6172j09498m7507L94879O4106k25129J62145Q9369o9696M7473
$$ plain form
14546 22778159 36744540 39496534 22077586 11251038 7363629 7708327 5552052 3479442
14538 3479442 2451541 2077005 1920102 2114124 2446839 2068824 2465561 1989338 2236762
14529 2236762 2206779 2593153 2162725 2358586 2090498 2431807 2654006 2271899 2723430 2896569
14519 2896569 2214961 2577438 2536137 2382947 2615194 2536966 2622834 2726991 2955624 3237713
14509 3237713 2935737 2739079 2879729 3137577 2875227 3169308 3071701 3264563 3448247 3144966
14499 3144966 3126873 3279295 3518985 3654013 3506074 3418558 3115546 3686022 3500627 3418415
14489 3418415 3719084 3425680 3410993 3459400 3643842 3785701 3641461 4062686 3963583 4153995
14479 4153995 4067823 3958325 3910818 4305697 4369803 4144674 4306819 4396188 4326492 4373965
14469D373965M53102l9779j78933j77115K64228O2831K18645k774j54231J12771
14459D932710M21125k65653p6630l59162P32642j26514J61486k0347K82630k33035
14449E449252L60140P9043P0353l42944K30820K5060K9058L21482M4826J20998
14439F388088N1379P1677j12913J94706r34N90115j51183L22292n70339M99753
14429G282641r0741K4114J41654K21115R8884K20146j61965N52314k14684R3281
14419H166759J73630K64323Q6433J78812j36201L18849N5376k11525M08061K72646
14409I577163L53663M737k44446L59218K2347K68574J87200J12436L33738j42311
14399A0832319N29898j57966P00063k6279J6079p443M88302J33680J60632K55353
$$ plain form
14469 4373965 4827067 4787288 4608355 4431240 4695468 4758299 4976944 4974170 4819939 4932710
14459 4932710 5353835 5088182 5011552 4652390 5385032 5258518 5420004 5399657 5682287 5449252
14449 5449252 5809392 5888435 5958788 5615844 5846664 5871724 5900782 6222264 6267090 6388088
14439 6388088 6439467 6511144 6398231 6592937 6592003 7182118 7030935 7353227 6782888 7282641
14429 7282641 7191900 7216014 7357668 7578783 7677667 7897813 7735848 8288162 8073478 8166759
14419 8166759 8340389 8604712 8691145 8869957 8733756 9052605 9107981 8896456 9304517 9577163
14409 9577163 9930826 9935563 9691117 10050335 10072682 10341256 10528456 10640892 10974630 10832319
14399 10832319 11362217 11204251 11904314 11878035 11894114 11886671 12374973 12508653 12669285 12924638
14389A2924638R9770K27904N09980J74539K38874L70206O1411M82070j31669N34642
14379A5492365J90658L92913J93258M05708K98197J96764N65226J22179N70956
14370A8428224m0756N31017Q76640J97804M70156M27216L00542M01078L45221
14361B1937142K29606M66603P57261P20823M17677O82916O67342L90475L22300
14352B6592145P30205P08458O70345P96363J006632O68178P76530N62323Q90810
14343C3401989P84118Q89890Q43064J168089J263789R02298P49693J515533J238932
14334D2757395J199114J010713J739436Q71027J662042J667353J253652J873014
14326E4033746J667589J759423J954988K408014J845721K077395K352337K682603
$$ plain form
14389 12924638 13024408 13252312 13762292 13936831 14175705 14545911 14607322 15089392 14957723 15492365
14379 15492365 15683023 16075936 16269194 16674902 16973099 17169863 17735089 17857268 18428224
14370 18428224 18387468 18918485 19795125 19992929 20463085 20890301 21190843 21591921 21937142
14361 21937142 22166748 22633351 23390612 24111435 24529112 25212028 25879370 26269845 26592145
14352 26592145 27322350 28030808 28701153 29497516 30504148 31172326 31948856 32511179 33401989
14343 33401989 34186107 35075997 35919061 37087150 38350939 39253237 40002930 41518463 42757395
14334 42757395 43956509 44967222 46706658 47577685 49239727 50907080 52160732 54033746
14326 54033746 55701335 57460758 59415746 61823760 63669481 65746876 68099213 70781816
14318G0781816K360000K852344K513000K962284L260520L141934L359507M115442
14310I5346847L762331M244010L940938M834600M774050M960324N491145N653465
14302A33007710N890451O422445P016038P022555P850937P908471Q518317R374930
14294A93011854R436150R937980J0840818J1375991J1935689J2198463J2591099
14287B71328044J3394073J4201412J4106201J4619677J4860028J5271868J5177405
14280C72958708J4898679J4776763J3951998J3377104J2275405J0961889Q304298
14273D61504844M089586n88318j478186M99772o09164n292492j290495m421690
14265D52413857q621035j0839502j1983771j3335920j4390833j4958286j5034862
$$ plain form
14318 70781816 73141816 75994160 78507160 81469444 84729964 87871898 91231405 95346847
14310 95346847 99109178 103353188 107294126 112128726 116902776 121863100 127354245 133007710
14302 133007710 138898161 145320606 152336644 159359199 167210136 175118607 183636924 193011854
14294 193011854 202448004 212385984 223226802 234602793 246538482 258736945 271328044
14287 271328044 284722117 298923529 313029730 327649407 342509435 357781303 372958708
14280 372958708 387857387 402634150 416586148 429963252 442238657 453200546 461504844
14273 461504844 465594430 465006112 463527926 464027698 463418534 458126042 456835547 452413857
14265 452413857 443792822 432953320 420969549 407633629 393242796 378284510 363249648
14258C63249648j5536585j5095104j5369856j5212944j4796702j4437315j2724035
14251B60077107j1778860j2314479j1542584j1399628j0229205r983145r193949
14244A83635257q472314q147533p909247p309019o838048o736488o105967n481386
14236A26635255n489138n248660m753971m915605m051276l733176l874710l852760
14228I0715959l483367l268911l500334k800223l095695k301160k657289k603093
14220F7005887k333129k013886j779905j820593k334369j910956j287219j709437
14212E1816393j343237j626166j681940j044064j351140q13831j829125r52853
14204D1174037j245990j472682q60505q53018n45778j420370p15679j284242n48851
$$ plain form
14258 363249648 347713063 332617959 317248103 302035159 287238457 272801142 260077107
14251 260077107 248298247 235983768 224441184 213041556 202812351 192829206 183635257
14244 183635257 175162943 167015410 159106163 151797144 144959096 138222608 132116641 126635255
14236 126635255 121146117 115897457 111143486 106227881 102176605 98443429 94568719 90715959
14228 90715959 87232592 83963681 80463347 77663124 74567429 72266269 69608980 67005887
14220 67005887 64672758 62658872 60878967 59058374 56724005 54813049 53525830 51816393
14212 51816393 50473156 48846990 47165050 46120986 44769846 43956015 42126890 41174037
14204 41174037 39928047 38455365 37594860 36741842 36196064 34775694 34060015 32775773 32226922
14195C2226922q63444n26076o95377o42911q12233q68512n71916o22265o80380
14186B5943808o11808n68755k88897j162434p5410j7923j222759L8440p34397
14177B1299865r83529N8695k74894m96299o39179l20542j00271m13997o44889
14168A7484960n3094m56169l09623k66123l172l56803n46056j01136n11512j14478
14158A4766794k44815k77413n5258l11672o39705K31196l94001l73678P6304k12804
14148A2564948k27331k55383o07829J41731l6276j47805j67889m69881J49581
14139A0943866k28180j63935l57072K02530j82669n16595O5004J10982l04681
14130I569250l71618k4486o7957J46621p18413K22737p2653k03325k74663p8617
$$ plain form
14195 32226922 31363478 30837402 30142025 29499114 28686881 27818369 27246453 26624188 25943808
14186 25943808 25332000 24763245 24474348 23311914 23236504 23218581 21995822 22034262 21299865
14177 21299865 20316336 20375031 20100137 19603838 18964659 18644117 18543846 18129849 17484960
14168 17484960 17431866 16975697 16666074 16399951 16396779 16039976 15493920 15392784 14881272 14766794
14158 14766794 14521979 14244566 14189308 13877636 13237931 13469127 13075126 12701448 12777752 12564948
14148 12564948 12337617 12082234 11474405 11616136 11579860 11432055 11264166 10794285 10943866
14139 10943866 10715686 10551751 10194679 10397209 10214540 9697945 9762949 9873931 9569250
14130 9569250 9197632 9173146 9105189 9251810 8533397 8756134 8683481 8480156 8205493 8126876
14120H126876j86251M57404m60932J26215o6573m64221L42783n51000j56008J70623
14110G338916m38129K30875k51901J44171j83181j00893J4473r8131m58581N46026
14100F743645k97200k46053J13578J19422n77733J46510j40339J5878j07122R9676
14090E870262j91535o33970O33429j83064j77917L18826k72859j66486M6953j67056
14080E076583l9766K52902p3370k69109l2091J8757k37581M75948p55333J86041
14070D602981M04579m00966j94825K40535m32619L34015k28657l06206L2295J52065
14060D203197J02150m7743N114k10241Q0718l17761K64613j26761l29606P8869
14050C702549K02402r4810m15171L8001M01303n9534j88609j24880K12803l85155
$$ plain form
14120 8126876 7940625 8398029 7937097 8063312 7996739 7532518 7875301 7324301 7168293 7338916
14110 7338916 6900787 7131662 6879761 7023932 6840751 6739858 6754331 6656200 6197619 6743645
14100 6743645 6446445 6200392 6313970 6433392 5855659 6002169 5861830 5877708 5770586 5870262
14090 5870262 5678727 5044757 5678186 5495122 5317205 5636031 5363172 5196686 5243639 5076583
14080 5076583 5036817 5289719 5216349 4947240 4915149 4933906 4696325 5172273 4416940 4602981
14070 4602981 5007560 4606594 4411769 4652304 4219685 4553700 4325043 4018837 4051132 4203197
14060 4203197 4305347 4257604 4262718 4052477 4133195 3815434 4080047 3953286 3623680 3702549
14050 3702549 3904951 3810141 3394970 3432971 3834274 3774740 3586131 3461251 3674054 3288899
14040C288899k20590K21513K5541J4982R9318k2641Q6761k45027p1915K25161
14030C402002l39045N61j50153K56758j62909O3170j51625j81182P2289K19525
14020C029391j2661k83572q2588O9624O9722O4578J92999o73477J88763k6869
14010B535910J52487r1014j71894n350J01321q4200k44036L69644l50323r7067
14000B115478K13464r9204r6643j02061L64381k20492L26000m15413J70613L78848
13990B634971K99688J319969M273900P759481J4631793J0164498j3698402j1936581
13982A5449317n995137k804385j661668o53918l27235n80781R186l6723n58389
13973B840267J32163m1110l25467P1504n8402j50177Q0054j57760m5865M4920
$$ plain form
14040 3288899 3068309 3289822 3315363 3330345 3429663 3407022 3493783 3248756 3176841 3402002
14030 3402002 3062957 3063518 2913365 3170123 3007214 3070384 2918759 2737577 2809866 3029391
14020 3029391 3016730 2733158 2650570 2720194 2789916 2854494 3047493 2374016 2562779 2535910
14010 2535910 2688397 2597383 2425489 2420139 2521460 2437260 2193224 2562868 2212545 2115478
14000 2115478 2328942 2229738 2133095 2031034 2395415 2174923 2500923 2085510 2256123 2634971
13990 2634971 2934659 4254628 8528528 16288009 30919802 41084300 27385898 15449317
13982 15449317 9454180 6649795 4988127 4334209 4006974 3426193 3435379 3398656 2840267
13973 2840267 2972430 2931320 2605853 2677357 2618955 2468778 2548832 2391072 2345207 2390127
13963B390127l6651p8898L1581N6890l01130J00840k68317L44284j71780l20347
13953A746599M56454j23185J00178k8789m1632l59233J78598k08876M33418j13692
13943B039840k46072J37937J04699k46661k93504N52924j65628L30397m40412
13934A773520k81061K31730Q9778J62445R0395n56461K79296j94409K00101l24119
13924A471215J71113j39378M18574q0612l75558m1448j19690m9250M62304Q935
13914A726205j74693L72376p5544J66033l94133o2672J8210m8315j19788J01670
13904A509349k54516J90692r7896k00633N24839l02329J76037l09202R0211L7445
13894A363997j51366L81699m4364m6610P8834j95302O2050k14094J67977j98706
$$ plain form
13963 2390127 2353476 2274578 2306159 2363049 2061919 2162759 1894442 2238726 2066946 1746599
13953 1746599 2203053 2079868 2180046 2151257 2109625 1750392 1928990 1720114 2153532 2039840
13943 2039840 1793768 1931705 2036404 1789743 1496239 2049163 1883535 2213932 1773520
13934 1773520 1492459 1724189 1813967 1976412 2066807 1510346 1789642 1595233 1795334 1471215
13924 1471215 1642328 1502950 1921524 1840912 1465354 1423906 1304216 1254966 1717270 1726205
13914 1726205 1551512 1923888 1848344 2014377 1620244 1557572 1575782 1527467 1407679 1509349
13904 1509349 1254833 1445525 1347629 1146996 1671835 1369506 1545543 1236341 1326552 1363997
13894 1363997 1212631 1594330 1549966 1503356 1582190 1386888 1448938 1234844 1402821 1204115
13884A204115J38142m0358M28857p22386R7384P3159N551L4556k68994R254J63594
13873A122874l94191M03620k01042L80542j63552M53495n65314n4518L68662M1821
13863A392397n2102j54184j07450J80561j84966L6758j64225K34627p3505O2368
13853A170279q1643K63961k38737j7628m3972J11428j6503Q8229k09223k65259
13843G60932K58533j05980L57874m8278l47108j23541K84303J07541k40446K32287
13833A136117Q5678l63725L05354L32431l53846j30610o4197Q1320k80342o5514
13823F82666K46988J99458K8252k47508k1810J44206n9841k15593l3768K4930
13813G47980J09503Q5291M1367j20539l5911n1090K25117l36424J20379J26737
$$ plain form
13884 1204115 1342257 1301899 1730756 1008370 1105754 1178913 1184464 1219020 950026 959280 1122874
13873 1122874 728683 1132303 931261 1311803 1148251 1601746 1036432 981914 1350576 1392397
13863 1392397 1340295 1186111 1078661 1259222 1074256 1111014 946789 1181416 1107911 1170279
13853 1170279 1088636 1352597 1113860 1096232 1052260 1163688 1147185 1235414 1026191 760932
13843 760932 1019465 913485 1271359 1223081 875973 752432 1036735 1144276 903830 1136117
13833 1136117 1221795 858070 1163424 1495855 1142009 1011399 947202 1028522 748180 682666
13823 682666 929654 1129112 1157364 909856 888046 1032252 972411 756818 723050 747980
13813 747980 857483 942774 984141 863602 827691 776601 1001718 665294 785673 912410
13803I12410k92826K24955k60751l3304N35237m60397O45734F33497M19963l29360
13793G24100l9866M3234j19760K7618K4204l5566J41367N9756k26247m0709J52949
13782G11080Q497l46798N94776j52138k07052K13828k78503L62117r2228K05177
13772A018756m97747J36111J6824q1261P1068o0503K75399j41180q8269K07270
13762H56468k2442k6023J6709B96744M92971K28004j83043m3719K16447l43123
13752F64281k3373J29486j53812j25364R6786O4482O68893D57597R8268P4209
13742F30074j19876K66539j83900K67358j60724j99808j30017J23320K04972j66801
13732E31137p9849j93592N56208j79012n7085J67970j97740K48615j44171B45977
$$ plain form
13803 912410 619584 844539 583788 550484 1085721 625324 1271058 633497 1053460 724100
13793 724100 684234 727468 607708 635326 659530 623964 765331 825087 598840 558131 711080
13782 711080 719577 372779 967555 815417 608365 822193 543690 905807 813579 1018756
13772 1018756 521009 657120 673944 592683 663751 603248 878647 737467 649198 856468
13762 856468 834026 808003 824712 296744 789715 1017719 834676 790957 1007404 664281
13752 664281 640908 770394 616582 491218 588004 652486 1321379 457597 555865 630074
13742 630074 510198 776737 592837 860195 699471 499663 369646 492966 697938 531137
13732 531137 451288 257696 813904 634892 577807 745777 548037 796652 652481 245977
13721G11705q2121P5319o6374B50608K48784M15516D27366q060p3113K34889j68346
13710D12736q5689N2982K48552P7126l6304J03580k84793J92589j63148L68973
13700H86604k14977O8785m0950C32664L76491j1460j08119L3443q1059M3627q1943
13689E03644j21762J73981j67562K14249r815Q7706B87154K27066K20091k04998
13679E29313j78033J25758A76584L00991J06018j72450K36221j40891Q0095j98569
13669C87999n4537K39880L10929k72910P9994r7844B29861L20937K60393k73705
13659E37486p7901j62964M18097H9784N21073j40617Q2641j72695L6552K9064
13649D45802l2690l7243O0967J32471k00029N3466M6208N8869j42585j08472m8713
$$ plain form
13721 711705 629584 704903 638529 250608 499392 914908 427366 419306 346193 581082 412736
13710 412736 327047 380029 628581 705707 669403 772983 488190 680779 517631 886604
13700 886604 671627 740412 699462 332664 709155 697695 589576 623019 541960 585587 503644
13689 503644 381882 555863 388301 602550 592735 680441 287154 514220 734311 529313
13679 529313 351280 477038 176584 477575 583593 411143 647364 506473 586568 387999
13669 387999 333462 573342 884271 611361 691355 593511 229861 550798 811191 537486
13659 537486 459585 296621 714718 89784 610857 470240 552881 380186 416738 445802
13649 445802 413112 375869 436836 569307 369278 422744 468952 527821 385236 276764 228051
13638B28051K63855B00415M38162R110j71164a6227F03290p7642j49294o9146
13628C07208R0039O6974K0094A08568M48484j53996N4106q281j71247J8269j06387
13617A89516N3236J10120j3340A60873K37057C2582M73948N6118M3284p4195B31777
13605B89068M33260B59370J33811o6469M1822K96923B72169F8927K52571L47283
13595F68781j28532k31321A848J95216o6168Q0665L80370r4589j89542J47187
13585D54987j20124r1868B3964K03493m9532Q2676L9862P8377j0692j25027J49572
13574C92693Q9126k15189R5863j31440J81684p7906N3431K34424j48710L7875
13564E11851A95995M72424k69702j53558J89480l4274J23138B0768J04618C6499
$$ plain form
13638 228051 491906 200415 638577 647687 476523 -16227 603290 525648 376354 307208
13628 307208 397247 464221 484315 108568 557052 403056 457162 448881 277634 295903 189516
13617 189516 242752 352872 339532 160873 397930 32582 506530 562648 605932 531737 231777
13605 289068 722328 259370 393181 326712 368534 665457 272169 68927 321498 668781
13595 668781 540249 308928 1848 197064 130896 211561 591931 497342 307800 454987
13585 454987 334863 242995 23964 227457 177925 260601 300463 378840 368148 243121 392693
13574 392693 481819 266630 362493 231053 412737 334831 388262 622686 473976 511851
13564 511851 195995 668419 398717 245159 434639 400365 523503 20768 125386 36499
13553B17049L43179L9452o2627A78054L00312A87550M14781A77771L8060k0162
13543A95669L90805H9712K30502J26488A79755M22482A13779M7711a53041E09148
13532B27081q4650P7681k62j8746j5084I2836K92638b2915B11964M47674l15199
13521C44439L9353A87296J84955J38160J44365C21594j59030K18951J0254J5327
13511D07096q9744j25014q2517K7590J8740J18113I0120F381L09776m6993n0644
13500B18520K55636F0999N39306k72279K43361B47686l6956G6341L31120j79412
13490B28049e1497C93412n2533H7737K40516A53039J63700J15414j73565K3244
13480B81832J86445A21051p521J06770b5001C83145m6875K03563j76705A55975
$$ plain form
13553 217049 560228 599680 537053 178054 478366 187550 602331 177771 215831 195669
13543 195669 586474 89712 320214 446702 179755 602237 113779 161490 -153041 509148
13532 227081 142431 220112 219850 201104 186020 92836 385474 -22915 211964 659638 344439
13521 344439 383792 187296 372251 510411 654776 321594 162564 381515 391769 407096
13511 407096 317352 192338 109821 137411 156151 274264 90120 6381 316157 269164 218520
13500 218520 474156 60999 600305 328026 571387 247686 210730 76341 407461 228049
13490 228049 -51497 393412 340879 87737 328253 153039 316739 432153 258588 281832
13480 281832 468277 121051 113530 220300 -25001 383145 336270 539833 363128 155975
13469B87580j19660k1886J41104K04817J9398j32782D0256J85742k9161p6736
13459A20101J88536j33804K61971E6417J97987Q8092j4004J17279F9146L8585
13449A07731L29843A34525L29664n9698j46085F5217j1152K55841J40190o7080
13439C83016G0108K52487A3350J89676q8093J2846J20350K57137j24196A56657
13428B12102J42949A15457K55982l6014p1850J19892A2355K62563M928m28A35490
13416B03442J11782a369B57448R0884C5129N96780j71005J139A66953a20380D7055
13404D11902A66505L24947j47857k1290A56373J87299c742A46265J91773A45686
13393A4157A750J19372L9927j171i1593B30330P6900A05167A8540L04324b00832
$$ plain form
13469 287580 167920 146034 287138 491955 511353 378571 40256 225998 196837 120101
13459 120101 308637 174833 436804 56417 254404 342496 328492 445771 69146 107731
13449 107731 437574 134525 464189 404491 258406 65217 54065 309906 450096 383016
13439 383016 70108 322595 13350 203026 114933 127779 248129 505266 381070 156657
13428 212102 355051 115457 371439 335425 263575 383467 12355 274918 279846 279418 135490
13416 203442 315224 -1369 257448 348332 35129 631909 460904 462043 166953 -120380 47055
13404 411902 166505 491452 343595 322305 156373 343672 -3742 146265 338038 145686
13393 14157 1750 121122 161049 159878 -91593 230330 307230 105167 18540 322864 -200832
13381A85772J92604j76323k0949K53431h1650F40672A72588R0141N5970J20464
13371D39163N1210o4890A32747J1909K8915c2780F3691J69424J584D7485L01974
13360C49459J28655E7155J97612n8744F713M573f1725B72185a50074D93392d9730
13348A17755K28571r8955R1866j58195K59016g7209E25256B09537n3780A2332
13337D568M81950p6861b1968h938A24784J18119m5968b57135A50617k6500q416
13326A15701K22683G5201J03113J59120b29352B99771a26182b2625C08375H7223
13315B55187c2766B69328G4292J4118a23836B11316C8211L16550b13780H6757
13304B81950K89220a53070A75390n8610c8342F1440J51996n3336l4959J71112
$$ plain form
13381 185772 378376 202053 181104 434535 -81650 640672 172588 262729 318699 439163
13371 439163 490373 425483 132747 144656 173571 -32780 63691 233115 234699 47485 349459
13360 349459 478114 57155 254767 196023 6713 11286 -61725 272185 -150074 493392 -49730
13348 117755 346326 247371 339237 181042 440058 -77209 525256 209537 155757 12332
13337 4568 486518 409657 -21968 -8938 124784 242903 196935 -257135 150617 124117 115701
13326 115701 338384 75201 178314 337434 -229352 299771 -126182 -22625 308375 87223
13315 255187 -32766 269328 74292 88410 -123836 211316 38211 354761 -213780 86757
13304 281950 571170 -153070 175390 116780 -38342 61440 213436 160100 125141 296253
13294B96253R5155E1747J96143A11067L23013p4536a85994c9751A87524a80784
13283B96629K05211i0813B23885J06773j57197R7089j26745J53119A38929l3317
13273A05612P3060R9187r514E5984L52662j13175f1587e459B58713J8J4240j15565
13261A57406d474k25011A08464K18163g9797a7274B76341r2145p0415j8876A2163
13249A76269K27741a60817G4558b1C30366b5959A68616g417A96691r4933b4636
13237C68636r4285J06666j31331b2696A74774R9888b15C85190a65600F9893K63595
13226C33488A05728B8006J6347J5644j9752i5629Q610c4481B03155k0858J03626
13215B85923n5076q8183K89059A24392b84674A35047P1693Q1852a91086A92188
$$ plain form
13294 296253 391408 51747 247890 111067 434080 359544 -185994 -39751 187524 -180784
13283 296629 501840 -90813 223885 330658 173461 270550 143805 296924 138929 105612
13273 105612 178672 277859 268345 55984 408646 295471 -61587 -5459 258713 258731 272971 157406
13261 157406 -4474 -229485 108464 326627 -79797 -17274 276341 184196 113781 94905 12163
13249 176269 404010 -160817 74558 -21 330366 -25959 168616 -7417 196691 101758 -24636
13237 368636 274351 381017 249686 -22696 174774 274662 -215 385190 -165600 69893 333488
13226 333488 105728 28006 44353 59997 40245 -95629 -87019 -34481 203155 182297 285923
13215 285923 230847 142664 431723 124392 -284674 135047 206740 288592 -191086 192188
13204C5883f2955B34590b99702h3990k2167L4154c2781B34400J3885d5233j9378
13193f4611G156h2684C60129b5777o7430B05241E4236J78693D2316K00475n4869
13182A87922q5807J4343K80942p5844H4140M29878A06831P7320E2101h2606A20325
13170A07157J17339L9783K7058l3689a27223E0580O706a52851C36684A49164J12432
13159B61596m9174c34488I7971k1546j3813k2114J60088r2565h3807h580H2261
13147h7029A26422e3413A09079K62762J56826a69420A80550e3188A96556G4665
13136F4614d0560G9494M283j4352L84783a01914c7845I3700b31959i0986B31226
13124B48680I3474P2588L9176I2697a38991C9889b7544j09363K6669G1915h222
$$ plain form
13204 35883 -62955 234590 -299702 -83990 -106157 -72003 -32781 234400 248285 -45233 -64611
13193 -64611 7156 -82684 360129 -25777 -93207 205241 54236 232929 42316 242791 187922
13182 187922 102115 116458 397400 321556 84140 514018 106831 184151 52101 -82606 120325
13170 107157 224496 264279 291337 257648 -127223 50580 57286 -152851 336684 149164 261596
13159 261596 212422 -334488 97971 76425 62612 40498 200586 108021 -83807 -8580 82261
13147 -87029 126422 -53413 109079 371841 528667 -169420 180550 -53188 196556 74665
13136 64614 -40560 79494 83777 69425 454208 -101914 -37845 93700 -231959 -90986 231226
13124 248680 93474 166062 205238 92697 -138991 39889 -27544 -136907 -110238 71915 -8222
13112A95872h42B87523A27346Q2749P1455b25128f178p9091B15418q2660J42630
13101B75388j05952d01701G3148b76279C25251j29029k9483N0555A3246K81995
13091B95241m818E3831g4721B50382f4369A3997R4262M22017B17821D6279K7777
13080G4056e8911B02742n8727a61070C10873j47057K7342b77624j043H4863K666
13069H7529J33289Q9841j40818J29674b12681B72654a1105A34398K02705j51852
13059A85251L39530B57883B786b437D80113k17494D2705O6420l9476a96762G4767
13047B60210n3840K8055I4630a5627o6069c3084B13364b33366A01881d8390A23195
13035A82480a05133D52324A59344l9716M8878J7191n2946Q5272E891P2113J84530
$$ plain form
13112 195872 -842 287523 127346 210095 281550 -225128 -6178 -85269 215418 132758 275388
13101 275388 169436 -401701 73148 -276279 325251 196222 166739 217294 13246 295241
13091 295241 290423 53831 -74721 250382 -64369 13997 108259 530276 217821 46279 74056
13080 74056 -58911 202742 144015 -161070 310873 163816 191158 -277624 -278667 84863 87529
13069 87529 220818 310659 169841 299515 -212681 272654 -11105 134398 337103 185251
13059 185251 524781 257883 2786 -2437 480113 262619 42705 109125 69649 -196762 74767
13047 260210 206370 234425 94630 -15627 -81696 -33084 213364 -233366 101881 -48390 123195
13035 182480 -105133 452324 159344 119628 168506 185697 132751 218023 5891 78004 262534
13024B62534A22971F0772J11242k9O5235a12831b4259A87669a87923A35403i8118
13012B07114m0827j5532k6995c1461G7836f0649C31891d0298j9504A06984K8921
13001A35905B2194L5296a78463H8225b01548B82228g6531A11138A1009J15921
12991A26930g8855C67642d9610n0074a7622r7770b7555A92639K27388a99092I8062
12979a98865D24121o8517o9037A02695d1883B13306e3947J5478B52142i4673E16847
12967i021m8773a12m5641m11185B53743A6782c07446m3945C62306A39266a25207
12955a64596B92683a01578C03114j05409H9145b26181c4017K35I0736k7394Q8228
12944A51570c24277a45251N5898A57190p7528J0487e2894B08542O3872D8929c6433
$$ plain form
13024 262534 122971 60772 172014 171985 237220 -112831 -24259 187669 -187923 135403 -98118
13012 207114 166287 150755 123760 -31461 77836 -60649 331891 -40298 -59802 106984 135905
13001 135905 22194 57490 -178463 88225 -201548 282228 -76531 111138 11009 126930
12991 126930 -78855 367642 -49610 -99684 -17622 -115392 -27555 192639 420027 -199092 98062
12979 -198865 424121 355604 286567 102695 -41883 213306 -53947 -38469 252142 -94673 516847
12967 -9021 -57794 -112 -45753 -456938 253743 16782 -307446 -351391 362306 139266 -125207
12955 -164596 292683 -101578 303114 197705 89145 -226181 -34017 -33782 90736 63342 151570
12944 151570 -324277 -145251 -89353 157190 79662 90149 -52894 208542 272414 48929 -36433
12932A54854a36079D49312f6800H1099a16377F0723j7444D238L44618j03552b5940
12920c2952m3399E00759D6033d41107a08345J2549n2331I8377A9601M4208c5833
12908E5455a41090b590p9691j50842p2758a28245E9614B2086r222g58B54361H0708
12895F8095N1486a09915B6643N0745h0090c3768C12985j21868O360M8588j17330
12884A28735c9849I9763J13118q0201C0200A2327L9976K69819a72850A23034L4439
12873A57473g9191F8135L42633a3760l982B07703a51164j30668I4868a7511p3273
12862i0784k4785K9623E19433A91284P0876D2437j246o791J1457c46906a2513
12850a30992j38857D2962a76901Q5162c1048a2624I276K1497L93781H7112a04849
$$ plain form
12932 154854 -136079 449312 -66800 81099 -116377 60723 43279 4238 348856 245304 -25940
12920 -32952 -76351 500759 46033 -441107 -108345 -95796 -148127 98377 19601 63809 -35833
12908 55455 -141090 -2590 -82281 -233123 -305881 -128245 59614 22086 12864 -758 254361 80708
12895 68095 119581 -109915 26643 77388 -80090 -33768 312985 191117 197477 246065 128735
12884 128735 -39849 99763 212881 132680 30200 12327 52303 322122 -172850 123034 157473
12873 157473 -79191 68135 410768 -13760 -17742 207703 -151164 -281832 94868 -17511 -90784
12862 -90784 -115569 -85946 519433 191284 262160 42437 41191 34400 45857 -346906 -12513
12850 -130992 -269849 42962 -176901 -91739 -31048 -12624 9276 30773 424554 87112 -104849
12838A89692a84846B20942d04612A62522R098a91899C93945H3540i578G4754P8067
12827A52821B0009P291J64979D1717g2500B70332c32271D2449F487J24509P233
12816A38229a36465B36912F9316c2705j47761A61560K37799b37360A27935E0564
12805B16054A02798J88697A41417A760K95107j31104l8536d68327f9894j1917
12795h1811n5360b588j76124a8842l16895A24344J65131b93773I0947a87092h9656
12783H1895g2619B10685b40765F1684J7227g462j11227C55435q8657K9048J54437
12772D50263a45999d2381l01431G4772a24620C9751K50298n5494a44581G2302
12761a31940a6701A1018e5720d095n5253d097n353D7011J71296C7814K21751A12709
$$ plain form
12838 189692 -184846 220942 -404612 162522 171620 -191899 393945 83540 -9578 74754 152821
12827 152821 20009 27300 192279 41717 -72500 270332 -332271 42449 6487 130996 138229
12816 138229 -136465 236912 69316 -32705 -180466 161560 399359 -237360 127935 50564
12805 216054 102798 291495 141417 1760 296867 165763 127227 -468327 -69894 -81811
12795 -81811 -137171 -2588 -178712 -18842 -335737 124344 289475 -293773 90947 -187092 -89656
12783 81895 -72619 210685 -240765 61684 78911 -7462 -118689 355435 266778 295826 450263
12772 450263 -145999 -42381 -343812 74772 -124620 39751 290049 234555 -144581 72302
12761 -131940 -16701 11018 -55720 -4095 -59348 -4097 -9450 47011 218307 37814 259565 112709
12748A3700b35535A13786J2142B5475a80239A82171i748j5014B0235e3035B4668
12736H0457J07174M0287F6690k3240a33786C20281o79b93651J9045a33128A38326
12724C4466d6612C18992F3631h8279o1820C29352a96776B1767O0627a93950B03841
12712A09540O6871f4291A08667D1390b65062I6030J11359m8078K1655k2972m0692
12701A17302K361D9110J37687n0931i6189C397c53732C13157G3474J43102Q7253
12690C03829f0787A52293a75616C05524I9714P4244h4979A8218P7383a579k71604
12679b73183G9297a79711F2511h8598k38030A35544j1317m856d3636m3963c5074
12667A84304G1701K00288d4838G922d7206B50688d2346k10186A93146D44L55895
$$ plain form
12748 13700 -235535 113786 125928 25475 -180239 182171 -9748 -24762 20235 -53035 24668
12736 80457 187631 227918 66690 43450 -133786 320281 319602 -293651 -274606 -133128 138326
12724 34466 -46612 318992 63631 -88279 -150099 329352 -196776 21767 82394 -193950 203841
12712 109540 176411 -64291 108667 41390 -265062 96030 207389 159311 180966 157994 117302
12701 117302 119663 49110 186797 135866 -96189 3397 -353732 313157 73474 216576 303829
12690 303829 -60787 152293 -175616 305524 99714 173958 -84979 18218 95601 -1579 -273183
12679 -273183 79297 -179711 62511 -88598 -326628 135544 124227 119371 -43636 -87599 -35074
12667 184304 71701 271989 -44838 7922 -47206 250688 -42346 -252532 193146 444 356339
12656C56339H5787Q330B6194c213B66930r5899G5097K34860i5760j78462B32352
12644a57300n7726i8066c9482B04643b70573A08874C9066c79462A0881f1744B36587
12632H8013g6233a51B90496G8505e1415C46809J61266j51313G7862j6511M2449
12621A03800m5368L30713j23938p176H0437e1227B39223j01179l8412a06275f344
12609H8480b00102A31212c0325l2463i23B76694A18571E2517J43904f5969C24305
12597B47981J96716G1064J30420l1605A9747R3070P2012J75699e0348l943A14988
12585F1036b24460E70Q3444k9998J3123D128O6178K23215b01223D3047d8923q6660
12573a35583E7203J88291c4558j32104f0777J8943A16004K10408b67352A6537
$$ plain form
12656 356339 85787 94117 26194 -3213 266930 171031 75097 309957 -95760 -274222 232352
12644 -157300 -215026 -98066 -39482 204643 -270573 108874 39066 -379462 10881 -61744 236587
12632 88013 -76233 -151 290496 78505 -51415 346809 508075 356762 77862 61351 103800
12621 103800 58432 389145 265207 258031 80437 -51227 239223 138044 99632 -106275 -6344
12609 88480 -200102 131212 -30325 -62788 -923 276694 118571 52517 196421 -65969 324305
12597 247981 444697 71064 201484 169879 19747 112817 184829 360528 -50348 -54291 114988
12585 61036 -224460 570 84014 54016 67139 4128 70306 293521 -201223 43047 -48923 -135583
12573 -135583 57203 245494 -34558 -166662 -60777 -41834 116004 326412 -267352 16537
12562B41877I4008f3621A72203H1561a91559j1105A88483B7598g4408B02479C8505
12550b59722I9569R7431H1194b5718j56433A20168j3802n1887c7692E1101Q3911
12539A35012o0451J19505a01405A05160J10856b31337C95621i7771D9738b1939
12528h6366o0184C9182J69464k6856b40840d2386m9596A63699a70606B62006P3258
12517C35264A47347D404K917a19135b3070C59768a67698R671A06475J89447a80449
12505g9472J6105m6008a3044A32439b93655G3667b05909a7400A5422g3188k11046
12494b84234B91549a09042C01341a24356A4872Q2785O2520i2796k3014a5719a747
12482f7353A58185m9290D1614O6547D8641J30983F0154J0817a02260r1567B04741
$$ plain form
12562 241877 94008 -63621 172203 81561 -191559 -202664 188483 27598 -74408 202479 38505
12550 -259722 99569 197000 81194 -25718 -182151 120168 106366 54479 -37692 51101 135012
12539 135012 74561 194066 -101405 105160 216016 -231337 395621 -97771 49738 -21939
12528 -86366 -146550 39182 208646 181790 -240840 -42386 -91982 163699 -170606 262006 335264
12517 335264 147347 4404 7321 -119135 -23070 359768 -167698 -158027 106475 295922 -180449
12505 -79472 -63367 -109375 -13044 132439 -293655 73667 -205909 -17400 15422 -73188 -284234
12494 -284234 291549 -109042 301341 -124356 14872 97657 160177 -92796 -115810 -15719 -1747
12482 -67353 158185 108895 41614 108161 48641 179624 60154 70971 -102260 -193827 204741
12470e9069I1385h5390c3331B23949i5293j7769C01594c42711e8166A48311D682
12458B9606d95790A9741K1212J43977a24953C19435g2972A9091h1893m1979A83851
12446b77785I2646d9157A03094a28566K9471j28682o0599i9731J8346D26985A2619
12434b05647A54189i2254A85180O9842H5074B4750a05055j9340b0750I141a70981
12422a56996c6559B25247B1135b9553B76094d8161g593E0899a73843C80440a95405
12410B17449i8886H1399K3595h8871a5331E7413a64075b7750j96367J04325A47797
12398A47768C4022M6388b8569C18411a403r4772j77646b154C35897c14641h6969
12386B62614b64522A2734K06967A01424J86974a8971G8037k6135e0982A2628a99726
$$ plain form
12470 -59069 91385 -85390 -33331 223949 -95293 -113062 301594 -342711 -58166 148311 4682
12458 29606 -495790 19741 40953 184930 -124953 319435 -72972 19091 -81893 -123872 183851
12446 -277785 92646 -49157 103094 -128566 -99095 -227777 -288376 -99731 -81385 426985 12619
12434 -205647 154189 -92254 185180 255022 85074 24750 -105055 -124395 -20750 9141 -170981
12422 -156996 -36559 225247 21135 -29553 276094 -48161 -7593 50899 -173843 380440 -195405
12410 217449 -98886 81399 104994 -88871 -15331 57413 -164075 -27750 -224117 -119792 147797
12398 147768 34022 80410 -28569 318411 -1403 -96175 -273821 -2154 335897 -314641 -86969
12386 262614 -264522 12734 219701 101424 288398 -18971 78037 51902 -50982 12628 -199726
12374A55854L4684c751j91930j08498d6443o5881N4834r0458C2951M0685d7494
12362H0360R2196f6895j60676L3235a713k76668A76542P5298C3136i5917l176
12351i9093l88A37855L1754b4071B32548M7427a48222g2911A12003b80021a08339
12339d5514B64006a62742B8756e6066A56963N1406E7225j9393J52589r0663h692
12327C1646j5366J85681b11973b6349A50380G97P2364a61087A37066a25439C00411
12315C60378a44221d9950A16439b1639j21473m3095A03493I265J8929M2413b55977
12303a56B0643g9738r1405C1297a83158j20438B2565J23625p1608A7751K09443
12292B27194R553a24677B29190m6476D5252b88348A96537f7722A43559i9994l4011
$$ plain form
12374 155854 190538 -3751 -195681 -304179 -46443 -112324 -57490 -147948 32951 73636 -47494
12362 80360 172556 -66895 -227571 -194336 -1713 -278381 176542 251840 33136 -95917 -99093
12351 -99093 -99481 137855 169609 -24071 232548 279975 -148222 -72911 112003 -280021 -108339
12339 -45514 264006 -162742 28756 -56066 156963 208369 57225 37832 190421 99758 -8692
12327 31646 16280 201961 -211973 -26349 150380 797 73161 -161087 137066 -125439 300411
12315 360378 -144221 -49950 116439 -21639 -143112 -186207 103493 9265 28194 70607 -255977
12303 -156 20643 -79738 -171143 31297 -183158 -303596 22565 146190 74582 17751 227194
12292 227194 236747 -124677 229190 182714 45252 -288348 196537 -67722 143559 -99994 -134005
12281a34005G4386i3689Q878B31792K2896c3798E0634J38932f1781B22365B4879
12269B08406L3727q3054d8323k5416j10578G3988c4172D74717A62459e5424I8101
12257E9602a55157e3330A00037a76499q2059C65921j49828M4887I3177b8631l03874
12246c32505d847k68187c1457D1119L7588A2083K74941a68052A54011A5100b92075
12234B59495I0091K07380g9350j807M0255H3164J51170B5288a05724B48551A05041
12222h0721B76717D5530N0254J21287D8327A71L20418B1213p348e5059B06609
12210b5113B02483G4458K88777A77751n1714a32285E7738e5103B70052b1984A10520
12198H3443N25663h1632a8436B8547L23975o7484o9024P3616a45247N2211A40794
$$ plain form
12281 -134005 74386 -93689 -84811 231792 254688 -33798 50634 189566 -61781 222365 24879
12269 208406 242133 159079 -48323 -73739 -184317 73988 -34172 474717 162459 -55424 98101
12257 59602 -155157 -53330 100037 -176499 -258558 365921 216093 260980 93177 -28631 -332505
12246 -332505 -4847 -273034 -31457 41119 78707 12083 287024 -168052 154011 15100 -292075
12234 259495 90091 297471 -79350 -81157 -40902 83164 234334 25288 -105724 248551 105041
12222 -80721 276717 45530 95784 217071 48327 171 320589 21213 13865 -55059 206609
12210 -25113 202483 74458 363235 177751 126037 -132285 57738 -55103 270052 -21984 110520
12198 83443 609106 -81632 -18436 28547 352522 285038 216014 289630 -145247 -93036 140794
12186A08742K87490f4969E33120b17884B23913c08646A28638K40254E5669P1435
12176A27104O2321b77984A84674J58561b7767o74B89949a37142D64873B19382
12165A40526Q1419d6829l1860C21289g052A02115N0477J43783a12254A17612J69529
12154B87141A22845f4852L1141C7857K92226b72220B71754a42538G6969a42591
12143A86199o3833J0522B6947R9204K41103d65079B93953D3629d0082B92491D5415
12131c00219c0787l1799A52211J23837b19776n5746A99501k3459J59579c3039
12120E0806r339a16565j07805A54549g1490r3021A6088R5207e0627H9511a5919
12108A76307a77817A13809A3197a57279E5986d3473k02794A08711a42009A45559
$$ plain form
12186 108742 396232 -64969 533120 -217884 223913 -308646 128638 368892 55669 127104
12176 127104 189425 -277984 184674 343235 -27767 -28441 289949 -137142 464873 219382
12165 140526 221945 -46829 -78689 321289 -7052 102115 152592 296375 -112254 117612 287141
12154 287141 122845 -64852 -33711 37857 330083 -272220 271754 -142538 76969 -142591
12143 186199 122366 132888 26947 126151 367254 -465079 293953 43629 -40082 292491 45415
12131 -300219 -30787 -62586 152211 276048 -219776 -275522 199501 176042 335621 -33039
12120 50806 41467 -116565 -224370 154549 -71490 -164511 16088 111295 -50627 89511 -15919
12108 176307 -177817 113809 13197 -157279 55986 -43473 -246267 108711 -142009 145559
12097G66c2509A79147b18091D1930P0304a07183J1021A26046R3169q5153K1130
12086A55192H566a60048G2329f9501k68076a52100M789D1259a26836b0147o9886
12075i0033A90919b3706G632L17364i1770l7027G2771b6964k0507F435a8887n4191
12063g3078m1842j38778A26848j1790J41015l6824O87616o4609k52065G5249P0481
12052A45730J42656a72826A58448c15633A01912P8786a46864B07702c7041p3933
12042a10974b2141B77261h810H9389k0374A2430c47527B742c8482r9219l19960
12031d57661C14144g7036B15815a9794j98701P7505f1463C19239j01795B4783
12020a84379A96392c24452A404a17982j39055A16018a2139C88159a29946G2936
$$ plain form
12097 766 -32509 179147 -218091 41930 112234 -107183 -96162 126046 219215 134062 155192
12086 155192 8566 -160048 72329 -69501 -337577 -152100 -147311 41259 -126836 -20147 -90033
12075 -90033 190919 -23706 7632 324996 -91770 -128797 72771 -26964 -47471 6435 -18887 -73078
12063 -73078 -114920 -253698 126848 115058 256073 219249 906865 842256 590191 75249 145730
12052 145730 288386 -172826 158448 -315633 101912 180698 -146864 207702 -37041 -110974
12042 -110974 -22141 277261 -8810 89389 69015 12430 -347527 2742 -38482 -137701 -457661
12031 -457661 314144 -77036 215815 -19794 -218495 -140990 -61463 319239 217444 24783
12020 -184379 196392 -324452 1404 -117982 -257037 116018 -12139 388159 -129946 72936
12009h5682j63093e7764q5734I6861h3216D08352I9159A9114P9940J05453d4298
11997A76063a42134A01209Q9727a35442e8099H1173K7055a66692P0543b5327k5443
11986e0770e953F842R0613l0448J88356D892i7864C31957H6911k8988a0984C02530
11973b2887k03305B38566d1366K069j08184e8994k78734P7920A66527c4730k72622
11962c07352H8004L2943a98673E4694K2255j0466d04880a15734B8625J43419j4201
11951A57843D1881J31550L4368C1330J60227b66851f154H1332k7511b65892F730
11939a08736p0825A1374J09256J59911A2998J89207q9913j3849i5482H2263A8555
11927h4444k8704e2365k5934o4618a3896A22192C043e11816d4011k48859h7762
$$ plain form
12009 -85682 -248775 -57764 -143498 96861 -83216 408352 99159 19114 99054 204507 -44298
11997 176063 -142134 101209 190936 -135442 -58099 81173 108228 -166692 -96149 -25327 -50770
11986 -50770 -5953 6842 97455 67007 255363 4892 -97864 331957 86911 57923 -10984 302530
11973 -22887 -226192 238566 -41366 -39297 -147481 -58994 -337728 -259808 166527 -34730 -307352
11962 -307352 88004 120947 -198673 54694 76949 66483 -404880 -115734 28625 172044 157843
11951 157843 41881 173431 207799 31330 191557 -266851 -6154 81332 53821 -265892 6730
11939 -108736 -179561 11374 120630 280541 12998 202205 112292 98443 -95482 82263 18555
11927 -84444 -113148 -52365 -78299 -142917 -13896 122192 3043 -511816 -44011 -292870 -87762
11915B1771L1618j7140O0990j2009b6635l2136H5409a70260h3214C4105a22641
11903G9596b40016B59879F953J17221P1615d60290a35802f844B59894a15535G3165
11891i900A6847e649l8307j72308Q3475a1483n0166j54811N2466A0840a96942
11879a68627N3889E1570b1410l7462k88499G6200a33321k67209J8612a59455O0202
11868i9253k79741d7416A95518e251k92831N5285C14028d13757i9582J7393B5172
11856a20088B96708n266F8967k9698a23054C01239d0953I4227A7905K7567K76610
11845C22082D752a36518D0915O8837b41728c2198k33855q429G0107Q1648a94315
11833A37358j0068E8050K67809F0718A1898i1441I9406f7599j01639B13265D2412
$$ plain form
11915 21771 53389 36249 97239 85230 -26635 -58771 85409 -170260 -83214 34105 -122641
11903 79596 -240016 259879 6953 124174 195789 -460290 -135802 -6844 259894 -115535 73165
11891 -9900 16847 -5649 -43956 -216264 -132789 -11483 -61649 -216460 -163994 10840 -196942
11879 -168627 -114738 51570 -21410 -58872 -347371 76200 -133321 -400530 -381918 -159455 -99253
11868 -99253 -378994 -47416 195518 -5251 -298082 -242797 314028 -413757 -99582 -82189 25172
11856 -120088 296708 291442 68967 39269 -123054 301239 -40953 94227 17905 45472 322082
11845 322082 4752 -136518 40915 109752 -241728 -32198 -266053 -274482 70107 151755 -194315
11833 137358 127290 58050 325859 60718 11898 -91441 99406 -67599 -169238 213265 42412
11821h149j1370k84500r8117a41587g299q488A3263M6468b66326E7802b27313
11809b88077g7941e44j00968Q080k21067a7795j59488P0967i605j33041A11574
11797b71170p3153G8646A8589Q8629D6166c4360B53343a67723K3606G2755c22755
11785DJ82323H9018a70921O7846E4698J92283c657B17554a81674D18562a72103
11773d6529A0962a6615A5072d9572C2549c3589G7009Q9880o6255P97J2274d3201
11760b5868B44K95774n7068b31387a14285m7520K885f6867l49300A1464a61636
11748a14200p5884A77685a11102I0130K8679h4423a9511F5323h9749b0505B88913
11736A3829a46177A65113c2932r0128G1614a96057h8322k2660j56354A80505n6262
$$ plain form
11821 -8149 -19519 -304019 -402136 -141587 -7299 -15787 13263 59731 -266326 57802 -227313
11809 -288077 -77941 -544 -101512 -93432 -314499 -17795 -177283 -106316 -9605 -142646 111574
11797 -271170 -344323 78646 18589 107218 46166 -34360 253343 -167723 -144117 72755 -322755
11785 4 182327 89018 -170921 -103075 54698 246981 -3657 217554 -181674 418562 -172103
11773 -46529 10962 -16615 15072 -49572 32549 -33589 77009 166889 100634 101431 113705 -43201
11760 -25868 244 296018 238950 -231387 -114285 -161805 -158920 -66867 -416167 11464 -161636
11748 -114200 -190084 177685 -111102 90130 118809 -84423 -19511 65323 -89749 -20505 288913
11736 13829 -146177 165113 -32932 -123060 71614 -196057 -88322 -110982 -267336 180505 124243
11725A24243a11525r3050P3762c2785k15118E2713p149K77954A28633L9547b81952
11713E5070K43438a06271A7692d3397A23880f6019A54094i6878l9146A52174g8228
11701b11340d2961J5913A08127c3299k78631g5350l1372C19261g470l4885O756
11690c5599A68202l0466k4149B0851c01260A25995O2559n2136Q7931O3133d15615
11678a2851m3369q052G3532a7476B49574a66835A99051D5289d8019j45651j20260
11667c13930J23863H5911a05934K7736n7147p023K4534G7376R8287l0937d8888
11655c9504a4677k96743D47175A59932a6291B6781b55640a2859k14758M7302l8327
11644b18642I1286J0412J9326f7259b899m459E5205K164h3373A62656G301J86798
$$ plain form
11725 124243 -111525 -204575 -130813 -32785 -247903 52713 45564 323518 128633 168180 -281952
11713 55070 298508 -106271 17692 -43397 123880 -66019 154094 -96878 -136024 152174 -78228
11701 -211340 -42961 -27048 108127 -33299 -311930 -75350 -106722 319261 -7470 -42355 -35599
11690 -35599 168202 137736 113587 20851 -301260 125995 188554 136418 224349 287482 -415615
11678 -12851 -56220 -64272 73532 -17476 249574 -166835 199051 45289 -48019 -193670 -313930
11667 -313930 -190067 85911 -105934 -78198 -135345 -142368 -117834 77376 175663 144726 -48888
11655 -39504 -14677 -311420 447175 159932 -16291 26781 -255640 -12859 -227617 -180315 -218642
11644 -218642 91286 101698 121024 -67259 -2899 -7358 55205 57369 -83373 162656 7301 194099
11632A94099E3681a05265c0761k84497g6690K8250G0783a94816d1812F014a78049
11620A59654b3188B66799h7536A44541c7586j06037D5954b13581A73321a317A48511
11608A56998a04614A50822e9699k56979D5539a57830j46506p1796J42744C08225
11597I8146L6026N6555c8242G5675B6603d4045j27004H4732R786i1259C4164J13743
11585A47907b10675m216j14902a56688B51151b36231C0501e2246k59456O9031
11575b42671A8165a20264E5453d31739A81936b39150A58431b51714c549H1860
11564C155h1272A33385E5867g9446l94294D65660A1689R8615N2302d41153H4782
11552A97030p7007d5371A66406A718a94714a8848k3946A17277j1934b27459A5942
$$ plain form
11632 194099 53681 -105265 -30761 -315258 -76690 -48440 70783 -194816 -41812 6014 -178049
11620 159654 -23188 266799 -87536 144541 -37586 -143623 45954 -213581 173321 -1317 148511
11608 156998 -104614 150822 -59699 -316678 45539 -157830 -304336 -376132 -233388 308225
11597 98146 134172 190727 -38242 75675 26603 -44045 -171049 84732 94518 -91259 34164 147907
11585 147907 -210675 -214891 -329793 -156688 251151 -236231 30501 -52246 -311702 -242671
11575 -242671 18165 -120264 55453 -431739 181936 -239150 158431 -251714 -3549 81860
11564 3155 -81272 133385 55867 -79446 -473740 465660 11689 110304 162606 -441153 84782
11552 197030 120023 -45371 166406 1718 -194714 -18848 -42794 117277 105343 -227459 15942
11540c25979B52119g438k5882B2496c00635A04036a02560a7360l28682A90180
11529B7466Q8159E3811R4888B729a06479j39978a01458A4925h079K715m56564
11518d61928G0190L8735D3300a29063A80a92845G4138Q322R2219b0874k03472
11507b24346B62118I9489N6451d7943B50159N0537C327a24307G5873K62788j41987
11496A96674C5543O8041a56320a9837A93123J5798R2090g7429a0494H6711K52102
11485C38813c1587A54676a49953A83173n4681a8189B34197i2668D5951K22174
11475B68125a00128k9870A49726N7643K56658A53684n5742C3717K03573n5609
11465A81681p7193a48926B47056j7777C2387J16071J50515K51990i2599A85715
$$ plain form
11540 -325979 252119 -7438 -33320 22496 -300635 104036 -102560 -17360 -346042 190180
11529 27466 115625 53811 148699 2729 -106479 -246457 -101458 14925 -8079 -5364 -461928
11518 -461928 70190 108925 43300 -129063 180 -192845 74138 82460 174679 -20874 -224346
11507 -224346 262118 99489 155940 -47943 250159 300696 3327 -124307 75873 338661 196674
11496 196674 35543 103584 -156320 -19837 193123 208921 301011 -77429 -10494 86711 338813
11485 338813 -31587 154676 -149953 183173 128492 -18189 234197 -92668 45951 268125
11475 268125 -100128 -129998 149726 207369 464027 153684 97942 33717 237290 181681
11465 181681 104488 -148926 247056 229279 32387 148458 298973 550963 -92599 185715
11454A2974P8770e1551B58871E0606b6411E6921J66076b84820C677L13349f3434
11442D0419k82b27909a04457G7569L12831A49337C5083K46109a63248D4793d14661
11430A53751a78139f1075B86345a63798C0486R9511b70400o3102C3285a86766
11419F7038a39544a2919D42630A50021f3732A37915a28067A18504H61P6368L7810
11408A15039D1220a63036g1914K3431j5077l06512H6894a08502D18331B07756
11397b46919M3921B59373d476l10690a14772b7825A36702E0958h9800j09439B18084
11385A45029o56K3618B568K82660g1858j03669j64016I75b0006C0816Q457g0810
11372a82472A94012d9853j36232Q6498A60837B183a53396A13427a16675D0917
$$ plain form
11454 12974 91744 -51551 258871 50606 -26411 56921 222997 -284820 3677 317026 -63434
11442 40419 40137 -227909 -104457 77569 390400 149337 35083 281192 -163248 44793 -414661
11430 153751 -178139 -61075 286345 -163798 30486 129997 -270400 -333502 33285 -186766
11419 67038 -139544 -12919 442630 150021 -63732 137915 -128067 118504 861 77229 115039
11408 115039 41220 -163036 -71914 -48483 -63560 -370072 86894 -108502 418331 207756
11397 -246919 -202998 259373 -4476 -315166 -114772 -27825 136702 50958 -89800 -199239 218084
11385 145029 144373 167991 2568 285228 -71858 -175527 -339543 975 -20006 30816 39273 -70810
11372 -182472 194012 -49853 -186085 -99587 160837 2183 -153396 113427 -116675 40917
11361F6024C49i7558B18898E2233H776a03218H9000a70002A60438p4268a02571
11349a74608g4671B60036h6073A02902J47104H9455N0213o5062c12408g8245B1939
11337E1418b69114H2690K991o407B5126J04638M4879h8983E9460J754J14236a34295
11324B27938r3662k2759C3972b18082g1863k8291F8652L458c23718c272H0258
11312B9026f7459m322k79635A21524n3903a91526K032M7325N3979L8573B02715
11300g8216j35063M4599c5426a6744j49768a5573j20856J5559r233e3260k48718
11289c01978O6951e5651C1491J89732l9461b43824A93169i6362K0077A38297D83
11277d60639J80042A05036a32075c3118r6909c0286j58723h4227B31507c08119
$$ plain form
11361 66024 349 -97558 218898 52233 8776 -103218 89000 -170002 160438 86170 -102571
11349 -174608 -74671 260036 -86073 102902 250006 89455 139668 74606 -312408 -78245 21939
11337 51418 -269114 82690 85681 79274 25126 129764 174643 -88983 59460 61214 175450 -134295
11324 227938 134276 111517 33972 -218082 -71863 -100154 68652 72110 -323718 -3272 80258
11312 29026 -67459 -71781 -351416 121524 67621 -191526 -189494 -142169 -88190 -49617 202715
11300 -78216 -213279 -168680 -35426 -16744 -166512 -15573 -136429 -120870 -130103 -53260 -301978
11289 -301978 -235027 -55651 31491 221223 181762 -243824 193169 -96362 -76285 138297 483
11277 -460639 -280597 105036 -132075 -33118 -130027 -30286 -189009 -84227 231507 -308119
11266D1190a22222j6751j45098J06359f5160D2310b07244j28950J32780E19024
11255G0406q896Q9887d43528f1891b9591A70310c6300H6397a58418A34716O083
11244A40799l9914m4921I548L05437D9831A4502L04470B5443b29768e5228R557
11233d5671a8281j30355q6303H7143g1637j4896j17402P8903n9664i1951d1178
11221c21j07989C6427b99899r6122d9167m5630q5276Q2292j2577G3938k8949a81655
11208b16417j6922B47370j09964c4668k10298A19831A3406a55708b0636A33771
11197a31137M0340D5475J09947f8262C0265d5401k96141L6254r394M4514C03940
11185F2555J73919a15116j08020j376K8475J8823G1413e8547A28890K4518c7820
$$ plain form
11266 41190 -122222 -138973 -284071 -177712 -65160 42310 -207244 -336194 -203414 519024
11255 70406 61510 151397 -443528 -61891 -29591 170310 -36300 86397 -158418 134716 140799
11244 140799 100885 55964 9548 314985 49831 14502 318972 25443 -229768 -55228 -45671
11233 -45671 -18281 -148636 -234939 87143 -71637 -86533 -203935 -125032 -184696 -91951 -41178
11221 -321 -108310 36427 -299899 -396021 -49167 -94797 -180073 -97781 -110358 73938 44989 -181655
11208 -216417 -233339 247370 137406 -34668 -244966 119831 13406 -155708 -20636 133771
11197 -131137 -90797 45475 155422 -68262 30265 -45401 -341542 -305288 -314682 -270168 303940
11185 62555 236474 -115116 -223136 -224512 -196037 -177214 71413 -58547 128890 153408 -37820
11173A70623G3608B5984a81082P8685a3023j56179a7028o0435a3270B01968a50407
11161E0198a48898j9625n6442E5976a70912A5078E035b71884e276A2993b40841
11149f535k7077B06122K52564C39b28581A02915E920K082L1171a24329M6947D6607
11136B01331o6199a78933A80598a64253D221b776C81058A56245e0839k78556a41269
11124a01780d4683j38374C24256b98175C9993e6250a1279B32586D0694Q9300b87966
11112f3435j24285a7464j43024F0602J72302j04493E7867K28275A12104c2417
11101C71053j08180B7465g1937G3770L3431A305L03004o2641j06044l7083d1289
11089b4883A59234J22312j11591j5598J78845J58385B4272N1518b9123D3702d545
$$ plain form
11173 170623 73608 25984 -181082 -102397 -13023 -169202 -17028 -77463 -13270 201968 -150407
11161 50198 -148898 -168523 -224965 55976 -170912 15078 5035 -271884 -5276 12993 -240841
11149 -6535 -33612 206122 458686 339 -228581 102915 5920 8002 39173 -124329 -77382 46607
11136 201331 135132 -178933 180598 -164253 4221 -2776 381058 156245 -50839 -329395 -141269
11124 -101780 -44683 -183057 324256 -298175 39993 -56250 -11279 232586 40694 129994 -287966
11112 -63435 -187720 -17464 -160488 60602 232904 128411 57867 286142 112104 -32417
11101 371053 262873 27465 -71937 73770 107201 1305 304309 241668 135624 98541 -41289
11089 -24883 159234 281546 169955 154357 333202 491587 24272 75790 -29123 43702 -4545
11077c3334A54515J25289M5921j5845A11006J03549R5510L4189b337F26374D9252
11065C69870A52820L85449j8166k4854G8051L68767K61412K05788C69480Q230
11055C77710J74925m7619K20642K00275D44140K61193k15437n5718J52876j09706
11045D77348K07539K7632l08637p1983K08975m9737j68237J57116M38654l85428
11035E33242j46698L04086p1020j4947j20407K47571k625k42322J1617J24831
11025F23328J47240k63903j73349J93452q9365q5063j6919L01653k48431Q7589
11015D76232k15883K68559J30264k25278K54735M056k96277K19631j80831j55791
11005B79417J42525R2999L68511l24237Q70j13117L56097E6063M85570J71766
$$ plain form
11077 -33334 154515 279804 325725 309880 111006 214555 310065 344254 -2337 626374 49252
11065 369870 152820 538269 520103 495249 78051 446818 708230 914018 369480 377710
11055 377710 552635 505016 725658 925933 444140 705333 489896 434178 587054 477348
11045 477348 684887 712519 403882 331899 540874 491137 322900 480016 918670 533242
11035 533242 386544 690630 619610 604663 484256 731827 729202 486880 498497 623328
11025 623328 770568 506665 333316 526768 437403 352340 335421 637074 388643 476232
11015 476232 260349 528908 659172 433894 688629 692685 396408 616039 435208 279417
11005 279417 421942 514941 883452 559215 560085 446968 803065 56063 541633 713399
10995G13399o9887B74849N5717K8107M47503L52246k48800k14712K63471l29584
10985F28797R3349M8288N4033K58454j63826Q9468J11360q8759N8019J43947O37113
10974A870243J77409J71355p048K54270J24396j30821p70860K79126J78177o64870
10964A481377k56969P7191m82457L57215J2670m25504Q9729l1801L39834j4228
10954A147057j52312j74879B10937M43783j97448j5990q8082P269I9297J66402
10944B65699L4158R3682A73202l263H3662B5279J09144o2761K57258n2879I7046
10932H9828a55770E2575P019Q0112J15705e3688k07003e893A8699K09722d618
10920b9002F8193a75587j9208a0302A0387c6540A92905H8938P2037o6781L08272
$$ plain form
10995 713399 643512 274849 330566 358673 806176 1158422 909622 694910 958381 628797
10985 628797 722146 770434 824467 1082921 919095 1008563 1119923 1031164 1089183 1233130 1870243
10974 1870243 2047652 2219007 2211959 2466229 2590625 2459804 1688944 1968070 2146247 1481377
10964 1481377 1224408 1301599 819142 1176357 1189027 763523 853252 821451 1161285 1147057
10954 1147057 994745 819866 210937 654720 457272 441282 353200 360469 99297 265699
10944 265699 299857 393539 173202 169939 83662 25279 134423 71662 328920 276041 97046
10932 89828 -155770 52575 59594 139706 255411 -53688 -260691 -5893 18699 228421 -4618
10920 -29002 68193 -175587 -194795 -10302 10387 -36540 192905 88938 160975 94194 402466
10909D02466B3768b07967A25130d45647a50491A90949b23362B9528b36045G0823
10898a06662C39707I2035O5120p8169J3348l0992b4561o5708l9710N2286n1314
10887a29007I6945k4959a43237k7957d2738C58802A54024n2984B7508b36428C81376
10875a17379H689d85735I9430D0099K13010b32788h8978j90434C4458J7537b80999
10863a15645B58084h5016j20983A42935j8005C6520K2476c21251E1345j1551i9410
10851C40701j66720E2826J71743k7258G5275k9667a47501r7183R0422B14293c0553
10839g6337C7493a64575A22785a88644P3573A5540a32138b4351F9301a89260D2735
10827a01926c9321k02382D2746b82876h8962A94364d62245a21603e6566l13388
$$ plain form
10909 402466 23768 -207967 125130 -445647 -150491 190949 -223362 29528 -236045 70823
10898 -106662 339707 92035 157155 78986 92334 61342 -24561 -90269 -129979 -77693 -129007
10887 -129007 96945 71986 -143237 -171194 -42738 358802 154024 101040 27508 -236428 381376
10875 -117379 8689 -485735 99430 40099 253109 -232788 -88978 -279412 34458 51995 -280999
10863 -115645 258084 -85016 -205999 142935 124930 36520 58996 -321251 51345 39794 -99410
10851 340701 173981 52826 224569 197311 75275 45608 -147501 -244684 -154262 214293 -30553
10839 -76337 37493 -164575 122785 -188644 -115071 15540 -132138 -24351 69301 -189260 42735
10827 -101926 -39321 -241703 42746 -282876 -88962 194364 -462245 -121603 -56566 -369954
10817c69954J19962l1202j22242c7504A54424a46716A95445b05620o0866F2973
10806D26483c33601J39164j5136O45A20410J45082b10061a539j83772A53554E9412
10794i251j93229R9969o1973A50298a95116F5029I425M1912d17169a15578b0401
10782a76254D5748N9412C8660c47084a65836B50834f214j26888A60962b75975
10771d5241I7721L16749A09295c39602k1582a03377f303C9884a43386C26781c0178
10759b02279j34229p4640J37920A76403o1687N8353c7546k22387b3381A57051
10748i0551j2215C6095a28906o3007h9607j78635J31972n8555c8616C68829a61584
10736a56163C9954a0967A87236n5880a050E0393a74539c6922A48855h3033F8724
$$ plain form
10817 -369954 -249992 -281194 -403436 -37504 154424 -146716 195445 -205620 -266486 62973
10806 426483 -333601 -194437 -209573 -208928 120410 265492 -210061 -1539 -185311 153554 59412
10794 -9251 -202480 -102511 -164484 150298 -195116 65029 9425 51337 -417169 -115578 -20401
10782 -176254 45748 105160 38660 -347084 -165836 250834 -6214 -133102 160962 -275975
10771 -45241 97721 414470 109295 -339602 -361184 -103377 -6303 39884 -143386 326781 -30178
10759 -202279 -336508 -411148 -273228 176403 114716 173069 -37546 -259933 -23381 157051
10748 -90551 -102766 36095 -128906 -191913 -89607 -268242 -136270 -194825 -38616 368829 -161584
10736 -156163 39954 -10967 187236 131356 -1050 50393 -174539 -36922 148855 -83033 68724
10724B6298N4622g3593A08990c03674b8598j24687M5988A24138D863R0595L4625
10713A30083d41954J4732g6817o7188A88757F426d56892i3630c4050j81660A42468
10701A40353h254o107j93420c1573j56069A69575a53631N4089K7415k4794k6888
10690a23809d1169j05334C7026d0414D0931O2135B7532J37486A3864O2949c07441
10678a1946l43378E9415k8233K34981i4940K5238H9694L5495d72986B38909B5070
10666a4950r095l6422j9126I4675g9624A01127k170b78786A61649d7211F2249
10654c4606o6395j5636E8693J57256o6805a31808A56110i7280l39795a13202a9838
10642A99685H4434J29294j7415A4146g4735c5553q8552e6621c787B78581j34092
$$ plain form
10724 26298 80920 -73593 108990 -303674 -28598 -153285 -107297 124138 4863 95458 130083
10713 130083 -441954 -427222 -76817 -144005 188757 6426 -456892 -93630 -34050 -215710 142468
10701 140353 -8254 -14361 -207781 -31573 -187642 169575 -153631 -99542 -72127 -96921 -123809
10690 -123809 -41169 -146503 37026 -40414 40931 103066 27532 165018 13864 76813 -307441
10678 -11946 -355324 59415 31182 266163 -94940 -69702 89694 125189 -472986 238909 25070
10666 -14950 -24045 -60467 -79593 94675 -79624 101127 98957 -278786 161649 -47211 62249
10654 -34606 -101001 -116637 58693 215949 149144 -131808 156110 -97280 -437075 -113202 -19838
10642 199685 84434 213728 196313 14146 -74735 -35553 -124105 -56621 -3787 278581 144489
10631A44489b37573a09717A91383F4116b9650k54390J40291A1641O2488g6703
10620b7534r4723d7128j79878j831h1144j21684m2636A82482c04440d4065j48226
10609a92291A24229b46431O1303D1941K60778C9603J90098b08153i1219b3012
10598c22773a2321D05617b68760m1011d0151G3683a68814B25605E3205a99300
10587i7195d3296A67956a64325O8643o5921d9193p4629k5056j40561G958K09202
10576B17160a44662C46963a10577O102M7436l52370B44250b36176p2312l0938
10566c39426C6256b55494g8563k3366j50373b7057G708f625l56133D06232d4131
10554a71758C49058j50317a37465j74893b6554I8437J12306a61433A4415a28297
$$ plain form
10631 144489 -237573 -109717 191383 64116 -29650 -284040 -143749 11641 74129 -76703
10620 -27534 -122257 -47128 -227006 -228837 -81144 -202828 -245464 182482 -304440 -44065 -192291
10609 -192291 124229 -246431 -185128 41941 302719 39603 229701 -208153 -91219 -23012
10598 -322773 -12321 405617 -268760 -309771 -40151 73683 -168814 225605 53205 -199300
10587 -97195 -43296 167956 -164325 -95682 -161603 -49193 -123822 -148878 -289439 7958 217160
10576 217160 -144662 346963 -110577 -104475 -57039 -409409 244250 -236176 -308488 -339426
10566 -339426 36256 -255494 -78563 -101929 -252302 -27057 7708 -6625 -362758 406232 -44131
10554 -171758 349058 198741 -137465 -312358 -26554 98437 210743 -161433 14415 -128297
10543c3970j88406L9976k9521p6687a03379m2962m6746A39738J47635b5409D7238
10531d7924k32374J3468r904c5782M708C9882K14979K6920a01412m7149B11043
10519e35311c7034G8496a69947h4296j50374C0488L0222K8242L56099c26449Q0049
10508b46400e8375k36344F5520c12551D57264H9365i3202l33457B35378h8287
10497a3254j43690G5346K9169b0394A06372a78709K8745q6094C7214a05586A64395
10485B69222j11286c0441A26781M0690G4007K25568c17090B23836i6523L5125
10475f1398q286A09903a17678j3588O0549j73447H0142a65467C6941M5941J75368
10464B58250b29088N546j43212h7577j97480O3263A78811a00704j49510h4279
$$ plain form
10543 -33970 -222376 -182400 -211921 -288608 -103379 -146341 -193087 139738 287373 -25409 47238
10531 -47924 -280298 -266830 -276734 -35782 -31074 39882 254861 281781 -101412 -148561 211043
10519 -535311 -37034 78496 -169947 -84296 -234670 30488 60710 88952 445051 -326449 -246400
10508 -246400 -58375 -294719 65520 -312551 457264 89365 -93202 -426659 235378 -88287
10497 -13254 -156944 75346 104515 -20394 106372 -178709 -149964 -236058 37214 -105586 164395
10485 269222 157936 -30441 126781 167471 74007 299575 -317090 223836 -96523 -61398
10475 -61398 -69684 109903 -117678 -131266 -70717 -244164 80142 -165467 36941 82882 258250
10464 258250 -229088 -223542 -366754 -87577 -285057 -221794 178811 -100704 -250214 -84279
10453d05394J76541B22104g7575F7474a17299A42631a59066C1488b67403A23195
10442E8005b64341B5588r174k327J04939m8322Q904B3087c7694A22288E0627Q7156
10430A37783a3751d936k17897J00151J9589L2556n0029j6407l6138b716B5734
10418A30420f6487n6169B687e6549D4519O2724h7874n4824A63900c7550I3346
10406a19992j59075d1436f102k90282A87733J7745a04987A21575D3766J57057
10396B00823q8858J5314a82829J4792I7347m8479J46433a5344A09880m9644J66112
10385B26348q9369J70373r1649F8197J55245A08355P6916P6034k4511D2240O1572
10374A03812K79967a67360A1095L47598J11256A75773L47453q8817j17627N0183
$$ plain form
10453 -405394 -228853 222104 -77575 67474 -117299 142631 -159066 31488 -267403 123195
10442 58005 -264341 25588 16414 14087 119026 70704 79608 23087 -37694 122288 50627 137783
10430 137783 -13751 -4936 -222833 -122682 -103093 -70537 -120566 -136973 -173111 -2716 25734
10418 130420 -66487 -122656 2687 -56549 44519 107243 -87874 -142698 163900 -37550 93346
10406 -119992 -279067 -41436 -6102 -296384 187733 205478 -104987 121575 43766 200823
10396 200823 111965 127279 -182829 -168037 97347 48868 195301 -15344 109880 60236 226348
10385 226348 136979 307352 215703 68197 223442 108355 185271 261305 236794 42240 103812
10374 103812 383779 -167360 11095 358693 469949 175773 523226 434409 316782 366965
10364C66965m0564K8621E8710M19963k18012r8127m5286D0987j2321d806j51962
10353a56768D06459E7117L68883j30723Q0212o238O107A10947K93457D3064K16769
10342B59833G1760A532K20403H4834l2459Q04J60092i0781B6416L66119B5912
10330c10360I0175P2347l0012F4557J58194A53N77676k47126b848r0701C15582
10318d3712A28205C2433E143N2811L95483a38374M7246A23762a11502C6263J53725
10307A89988H9075a03712f980n8017B81836g8020A2635b3564k9666j06449K6938
10296a32741J3203I1409R6052h6205C37748C4258K67592A02820b6605m1743l4646
10285a02994n64200g3852C16702I591J10861f6801j41691e8776j45911B54305
$$ plain form
10364 366965 326401 355022 58710 478673 260661 162534 117248 40987 28666 -4806 -156768
10353 -156768 406459 57117 426000 295277 375489 369251 375358 110947 404404 43064 259833
10342 259833 71760 1532 221935 84834 52375 53179 213271 -90781 26416 392535 25912
10330 -310360 90175 162522 132510 64557 222751 153 577829 330703 -2848 -93549 315582
10318 -43712 128205 32433 5143 57954 453437 -138374 -91128 123762 -111502 36263 189988
10307 189988 89075 -103712 -6980 -64997 281836 -78020 12635 -23564 -53230 -159679 -132741
10296 -132741 -119538 91409 187461 -86205 337748 34258 301850 102820 -26605 -68348 -102994
10285 -102994 -667194 -73852 316702 9591 120452 -66801 -208492 -58776 -204687 254305
10274E1344h6605E0164K26770q7630b36334d5001j23658C38252a14714A91661
10263B91845N5720E4524Q7238J21792g8511C51095a57129B19197J50734a17326
10252B62267j01065J53322b4686m5081m7175j11379E75794B37341b76616g479
10241H2205O2099E7387j5266h6607m8749d7243k11342g8280A02696a2900A06459
10229A97291e20056c5464k28630M4283Q8213n8228C7879j456b38891O7462p2757
10218b44186F3445b65607M2777G9107K01247c32556a7554r1408o4861o3645j5732
10207b53200a23875c3296N726j75944j17929J44705B12853c79007J45118I5538
10196G6168g1707l71004h1641m011B63454i4496A82513r1250a06563c7533j4160
$$ plain form
10274 51344 -86605 50164 276934 189304 -236334 -45001 -168659 338252 -114714 191661
10263 291845 347565 54524 141762 263554 -78511 351095 -157129 219197 369931 -117326
10252 262267 161202 314524 -24686 -69767 -116942 -228321 575794 237341 -276616 -7479
10241 82205 144304 57387 42121 -86607 -135356 -47243 -258585 -78280 102696 -12900 106459
10229 197291 -520056 -35464 -264094 -219811 -131598 -189826 37879 36423 -238891 -171429 -244186
10218 -244186 63445 -265607 -222830 79107 280354 -332556 -17554 -108962 -173823 -237468 -253200
10207 -253200 -123875 -33296 -27570 -203514 -321443 -176738 212853 -379007 -233889 95538
10196 76168 -71707 -442711 -81641 -85652 263454 -94496 182513 91263 -106563 -37533 -51693
10185e1693k24255e5527b1163n8671F6194a37080b7643A12519a04848j75286L7852
10174b42282j81039o1484M8974a25253l4405A86325a84025G1665P617J64223c4475
10162a04136D2919M2406j7615b43444A32786e9050n8503Q516B51891a31244M9357
10151h1887G2291L17240i5700b3306C3153e0316E397a50847g3841D6231p261Q4916
10139A23886n7946R6147e26883b01146L5951B04757b39243A23063a07766E6570
10128d15393g8611G2959a16780A05514i1483L5918H661M07334c11652a3085l02320
10117c15405e9390m2372A21024b25451C20513c38713A9528a63244d6216k11951
10107b58167F4171K48219J4295h9359B0528f7850G8559N2260g1718R216A15274
$$ plain form
10185 -51693 -275948 -55527 -21163 -79834 66194 -137080 -27643 112519 -104848 -280134 -242282
10174 -242282 -423321 -484805 -435831 -125253 -159658 186325 -184025 71665 79282 243505 -34475
10162 -104136 42919 85325 67710 -243444 132786 -59050 -117553 -109037 251891 -131244 -81887
10151 -81887 72291 389531 -95700 -23306 33153 -50316 5397 -150847 -73841 46231 38970 123886
10139 123886 65940 162087 -526883 -201146 -165195 204757 -239243 123063 -107766 56570
10128 -415393 -78611 72959 -116780 105514 -91483 -55565 8661 415995 -311652 -13085 -315405
10117 -315405 -59390 -101762 121024 -225451 320513 -338713 19528 -163244 -46216 -258167
10107 -258167 64171 312390 326685 -89359 20528 -67850 78559 130819 -71718 -62502 115274
10095b31044a8864A12718b28176B0993P6103J68758a46551k39316C6753a53591
10084f1566A32248b47722P3000B83516e8842j49583P6253M1109D4271b35876a17421
10072a13290o9551M9024A43027i6498k17009N0835q6546c3612q7594i226k83937
10061b93163i3816m8797j52228c1932j934l14579J10263e6250a9257o714o8125
10050i4096J6396A60231c87349C6153J22426D664a06356a2822O194k07802l076
10039b17506A61120a9581B0742e6861j99366b5945r0115b1855k84237L3422A45883
10027b03718q8750f6235k45661a1281q7324B70490e6449K8131E7977g0236A34470
10015i9288D2080a81288b5382j9777I4118P1447p0046J5591D124L57833a38780
$$ plain form
10095 -231044 -18864 112718 -228176 20993 97096 265854 -146551 -385867 36753 -153591
10084 -61566 132248 -247722 -174722 283516 -58842 -208425 -132172 -91063 44271 -235876 -117421
10072 -113290 -182841 -133817 143027 -96498 -313507 -262672 -349218 -33612 -121206 -9226 -293163
10061 -293163 -93816 -142613 -294841 -31932 -33866 -348445 -238182 -56250 -19257 -25971 -94096
10050 -94096 -77700 160231 -387349 36153 158579 4664 -106356 -12822 -6628 -214430 -217506
10039 -217506 161120 -19581 20742 -56861 -256227 -25945 -116060 -21855 -306092 -272670 145883
10027 -203718 -292468 -66235 -311896 -11281 -98605 270490 -56449 -28318 57977 -70236 134470
10015 -99288 42080 -181288 -25382 -45159 94118 165565 95519 111110 4124 361957 -138780
10003h9316j29784K0542C28042a89729j37943J57015B04437j7115C8999a6506
9992d25780a21758A7437N3341c1785A01283d9402j38849C4627b55409J13573a6851
9980d7656j26999h5595C2245K4780J28890a74407j4296J4786P1898p7808I3398
9968C69707j10369a81731d501C1919b3947j87110k32332D6860i9685j89824j9890
9957c09399a210F9570b70488F9319h5955A45789K02003B4057Q9385b09057J02006
9946a07051E4542J34721q8850b04049A13142a31645j84805a32163R312M0313F1526
9934a99632H8283g8372G6057b54790a8933m03061A08630d3120A33930c32394i2294
9922a40694m4042h5058j81774A64744b69810C7136a03187j41167J2699A01776
$$ plain form
10003 -89316 -219100 -198558 328042 -189729 -327672 -170657 204437 187322 38999 -16506
9992 -425780 -121758 17437 70778 -31785 101283 -49402 -188251 34627 -255409 -141836 -16851
9980 -47656 -174655 -85595 32245 57025 185915 -174407 -188703 -173917 -102019 -179827 93398
9968 369707 259338 -181731 -4501 31919 -23947 -211057 -443389 46860 -99685 -289509 -309399
9957 -309399 -1210 69570 -270488 69319 -85955 145789 347792 24057 113442 -209057 -107051
9946 -107051 54542 189263 100413 -204049 113142 -131645 -316450 -132163 -122851 -82538 61526
9934 -199632 88283 -78372 76057 -254790 -18933 -421994 108630 -43120 133930 -332394 -92294
9922 -140694 -184736 -85058 -266832 164744 -269810 37136 -103187 -244354 -231655 101776
9911D7850o046b55917F3829J00321a09897k25956a04802M5854j06313o844C278
9899a38751c2241r1091e2117A37343b7378A36631F864b44058A91786J14529c01443
9887b90713B56302c25208J15062j19526f3328p7669j95423J28470O6400j14733
9877b56283A69038h1846C35284F2414K69604b15449j57102J54671j64783a54796
9866b10169a01036J6419k28567B1055J45183d54870B10353g9827j07399m1261
9856b28487H6870g7508j11806F3603B3435a57504D2071J52298f5311A88748b6410
9844a67423D7697p596d44671g4078A1028c7853n8193L6080n04626g2939K7596
9833d5343B4453c16058g520G1c08155h130B52837E3423G28a12012m762l292D33718
$$ plain form
9911 47850 41804 -255917 63829 164150 -109897 -335853 -104802 -58948 -165261 -172105 3278
9899 -138751 -32241 -123332 -52117 137343 -27378 136631 6864 -244058 191786 306315 -301443
9887 -290713 256302 -325208 -210146 -329672 -63328 -140997 -336420 -207950 -141550 -256283
9877 -256283 169038 -81846 335284 62414 332018 -215449 -372551 -217880 -382663 -154796
9866 -210169 -101036 -84617 -313184 21055 166238 -454870 210353 -79827 -187226 -228487
9856 -228487 86870 -77508 -189314 63603 23435 -157504 42071 194369 -65311 188748 -26410
9844 -167423 47697 40101 -444671 -74078 11028 -37853 -96046 -59966 -564592 -72939 -45343
9833 -45343 24453 -316058 -7520 71 -308155 -8130 252837 53423 728 -112012 -116774 -120066 433718
9819A40580c6661i052j72617J345E970a22496n6945A14590M3633m3879j3333a26242
9806b59751f3436D7908b36273b0147j37893j35972k20811d7842A8704K72890a72711
9794a04356A93504a15737A45049d01594o980A1496h5511r6318B21469j6671l7252
9783A67546a08137n9179l3305k69157h9412j6429m47M5416j22294f5699k52368
9772c18067a37839L3969E9261i3222a8040n2390R240k22793B5115a7991n4419
9761g2410r9977g140A82848a94012J0937K3186A89043l8443a46863C35407a52302
9749b61377J9007a11533j23524H9850B627b36514G5559i816j93260f8680A8364
9737b47480k36222A2612b37895N8286j80045g9172A96693H6287J6617a04730J9304
$$ plain form
9819 140580 -36661 -9052 -181669 -180324 5970 -122496 -179441 114590 158223 114344 101011 -126242
9806 -259751 -63436 47908 -236273 -20147 -158040 -294012 -514823 -47842 18704 291594 -172711
9794 -104356 193504 -115737 145049 -401594 -408574 11496 -85511 -181829 221469 204798 167546
9783 167546 -108137 -167316 -200621 -469778 -89412 -105841 -106288 -60872 -183166 -65699 -318067
9772 -318067 -137839 -103870 59261 -93222 -18040 -70430 -61190 -283983 25115 -17991 -72410
9761 -72410 -172387 -7140 182848 -194012 -183075 -159889 189043 150600 -146863 335407 -152302
9749 -261377 -242370 -111533 -235057 89850 2627 -236514 75559 -9816 -203076 -68680 18364
9737 -247480 -483702 12612 -237895 -179609 -359654 -79172 196693 86287 102904 -104730 -85426
9726h5426l31593A23306a85985g6730B95879c724k94045M672G9476a44630F9203
9714B23062a22963P625k28035i3118A34369c181A27376c64126i306k05618O5695
9703a49229N6149A51023c0537A80319M0925i4322k9233E0478c4228A2144M91478
9692E03622c64126g7454j36384F5572c9483A8245q716a66192J4732n9518A71962
9680B05233k1923b32961j15367J03811d7315m5339I2651g5157G6976b74452J29172
9669a45280A08270f7773B63107b1124H0157c3169q795q6115j87457c4197j46634
9658a80831e5140F9185g7326k99956I2097D0749c83481J60633B24041a656j27596
9647a29252A09908E3947b06701m9725F4810a63647j69041D7189b06260j27001
$$ plain form
9726 -85426 -417019 123306 -185985 -76730 295879 -3724 -297769 -293097 79476 -144630 69203
9714 223062 -122963 -115338 -343373 -93118 134369 -3181 127376 -364126 -9306 -214924 -149229
9703 -149229 -93080 151023 -30537 180319 221244 -94322 -123555 50478 -34228 12144 503622
9692 503622 -364126 -77454 -213838 65572 -39483 18245 9529 -166192 -151460 -210978 171962
9680 205233 183310 -232961 -348328 -244517 -47315 -92654 92651 -75157 76976 -274452 -145280
9669 -145280 108270 -67773 263107 -21124 80157 -33169 -41964 -128079 -315536 -34197 -180831
9658 -180831 -55140 69185 -77326 -377282 92097 40749 -383481 -222848 224041 -1656 -129252
9647 -129252 109908 53947 -206701 -256426 64810 -163647 -332688 47189 -206260 -333261
9637c33261a6687j10663o9511K4074A34316c08387J24785B17303h7213j9423k3126
9626a29762j19749C34035b54742f2211G636J95174a17033M3914B83765d59060
9615B67530a83773f3450B37210h0828H2685a6329A99417a58709M6259L2720O317
9604g3413o4756d014C93458g2638K1896k76297I4048a72454M2448r6950j22141
9593c49097A69817A9857a84292F3220M4575a22123C0205a16828A61479J74675
9583C36154j48763a51057k8985A17701b4294l49013i0286A57390i2710A21860
9572b95622j4174j21834G7422b0553j88800M4968l071A78270a35227B07298b22109
9560b13665A78089d3959j930G8160N7571a16528L7983K8508p4808j61660a16164
$$ plain form
9637 -333261 -16687 -127350 -196861 -172787 134316 -308387 -183602 217303 -87213 -106636 -129762
9626 -129762 -249511 334035 -254742 -62211 7636 202810 -117033 -73119 283765 -459060
9615 267530 -183773 -63450 237210 -80828 82685 -16329 199417 -158709 -112450 -79730 -73413
9604 -73413 -138169 -4014 393458 -72638 -50742 -327039 94048 -172454 -130006 -226956 -349097
9593 -349097 169817 19857 -184292 63220 107795 -122123 30205 -116828 161479 336154
9583 336154 187391 -151057 -180042 117701 -24294 -373307 -90286 157390 -92710 121860
9572 -295622 -309796 -431630 77422 -20553 -209353 -164385 -167456 178270 -135227 207298 -222109
9560 -213665 178089 -43959 -45889 78160 135731 -116528 -78545 -50037 -124845 -286505 -116164
9548i4731l30079B95543b85369F4215l0305J63436a37675A02501b1300L409n2492
9537g0383G5391J2755A7360a07234b1666l0385J2755D8257h5509A19096b122j0939
9525a3061k24378a01551r4892D7448a84477h2365j21977h158j27957B22398a42008
9513b43238Q0889j27314a06790j43090A40628c79194e0964J5043n0491F6123h8068
9501c8460B18634N8124K520b86430A77702A4788J7285Q6075a6526A10122a73778
9489F529J22330E8644b17143j09889e7400K5691j6403k99781a12804n7038p5009
9478b44851B76907c79526K9728J66898c8780D9860M3107e4738k93263H2587c43975
9466a83067m0829H375a68165L2482D32904d13169K02408A4546d12864A67468b18130
$$ plain form
9548 -94731 -424810 295543 -285369 64215 33910 197346 -137675 102501 -21300 -17891 -70383
9537 -70383 75391 88146 17360 -107234 -21666 -52051 -39296 48257 -85509 119096 -2122 -13061
9525 -13061 -237439 -101551 -196443 47448 -184477 -82365 -204342 -8158 -136115 222398 -142008
9513 -243238 -162349 -289663 -106790 -249880 140628 -379194 -50964 -35921 -86412 66123 -88068
9501 -38460 218634 276758 279278 -286430 177702 14788 32073 118148 -16526 110122 -173778
9489 6529 128859 58644 -217143 -327032 -57400 -31709 -48112 -347893 -112804 -169842 -244851
9478 -244851 276907 -379526 -349798 -182900 -38780 49860 92967 -54738 -348001 82587 -343975
9466 -183067 -223896 8375 -168165 -135683 432904 -413169 -210761 14546 -412864 167468 -218130
9454e5686o8436a1205j31179B2845a3165D1957J5760B074d94832a63461n3807
9443b17268C18144A28352m0916a40319L3496q6037e5890j06036l7432m3260b053
9431A95832c02362E5094a46806K7107c9284A6953P0214b71664B33597J5387c09037
9419C02907C8766a2552k01699N7956j03304D518c27899A88085b43717a16752j31657
9408b48409B31749b12878Q6074C6712P5100j5872a63803f5103G0264J50257G0000
9396d0856I5652O098G144J79695J06360q5140a81486A04927A7340a7099A72833
9384a06807j50935C3160a99147j1792A17776a25114e390E9499a35048d8326I4277
9372b97180I6361J6400K3331c25825a31018k18546B22838f8847C191b2645q2070
$$ plain form
9454 -55686 -124122 -11205 -142384 22845 -13165 41957 57717 2074 -494832 -163461 -217268
9443 -217268 318144 128352 87436 -140319 -106823 -192860 -55890 -161926 -199358 -242618 -2053
9431 195832 -302362 55094 -146806 -119699 -39284 16953 87167 -271664 233597 248984 -309037
9419 302907 38766 -12552 -214251 -156295 -259599 4518 -327899 188085 -243717 -116752 -248409
9408 -248409 231749 -212878 -126804 36712 111812 95940 -163803 -65103 70264 220521 70000
9396 -40856 95652 101750 7144 186839 293199 208059 -181486 104927 17340 -17099 172833
9384 -106807 -257742 33160 -199147 -210939 117776 -125114 -5390 59499 -135048 -48326 94277
9372 -297180 96361 112761 136092 -325825 -131018 -349564 222838 -68847 3191 -22645 -104715
9361a04715F2904N9743i1304k17153j6969a45811L015k93162h6124k52999i1211
9349d15814J5659B04003b14942f7666j85847M4390g783p3708B18756G2671b19509
9337b2043I0315b1501n5485A75162G0674a99585G7070I327a89305A59904k7079
9326A32825I99a90697A40470E3921M1617d4828B83909C9766Q0721a55887k04767
9315c60654K3368A78462a90989R2094A76425j1398C5981D103a62880b7627E8270
9303A32411a25959c3499k33683B11885K5279N7411b73865A81431D201i1924A5933
9291a29120l508A36409A6964e0026C50263a0873I9900G358R6443m9407d03059
9279b32299A43318E6395d73132J76377D6530N5862b91891a21989j21079D4650
$$ plain form
9361 -104715 62904 122647 -91304 -308457 -325426 -145811 -142796 -435958 -86124 -339123 -91211
9349 -415814 -400155 204003 -214942 -67666 -253513 -209123 -7783 -81491 218756 72671 -219509
9337 -22043 90315 -21501 -76986 175162 70674 -199585 77070 9327 -189305 159904 132825
9326 132825 999 -190697 140470 53921 95538 -44828 283909 39766 120487 -155887 -360654
9315 -360654 -337286 178462 -190989 -98895 176425 165027 35981 4103 -162880 -27627 58270
9303 132411 -125959 -33499 -267182 211885 237164 294575 -273865 181431 4201 -91924 15933
9291 -129120 -132628 136409 16964 -50026 350263 -10873 99900 7358 103801 54394 -403059
9279 -232299 143318 56395 -473132 -296755 46530 102392 -291891 -121989 -243068 44650
9268A49281a817B02514a18136k5777j16546a14031l4264D8016f8417r9257a5091
9256a97136e9340H2444b647A12381C8483f1376I3762C9761b04007a01709F6091
9244a74910P9085k55679a46892k6703g5596j63570a06242B4709b26813a00142
9233c40177a04335H3339h6603B51712d5112A69954a34651k3191a170j96410B39994
9221a81383B675c7074l21414j6023a67175f624k53119D878g9924A16359a87223
9209H3830J45063d1328j69278A33784e6723A45614c7482A65836b73947B40485
9198A93024H7271e7864j55915I6272a5299J49k42557p3862F222a9782D0874d18144
9185e870j2325k14476A41649g3812j35317F4804a923A75595b29910B2175a51136
$$ plain form
9268 149281 -1817 202514 -118136 -143913 -260459 -114031 -148295 48016 -68417 -167674 -15091
9256 -197136 -59340 82444 -2647 112381 38483 -61376 93762 39761 -204007 -101709 66091
9244 -174910 -95825 -351504 -146892 -173595 -75596 -239166 -106242 24709 -226813 -100142
9233 -340177 -104335 83339 -86603 251712 -45112 169954 -134651 -157842 -1170 -197580 239994
9221 -181383 2675 -37074 -358488 -374511 -167175 -6624 -259743 4878 -79924 116359 -187223
9209 83830 228893 -41328 -210606 133784 -56723 145614 -37482 165836 -273947 240485
9198 193024 87271 -57864 -213779 96272 -15299 -15150 -257707 -331569 6222 -19782 40874 -418144
9185 -5870 -18195 -232671 141649 -73812 -209129 64804 -1923 175595 -229910 22175 -151136
9173B08555P2083a5970j04147M5741A33923g233B25712c64264a15868B75156A16272
9161c01751a5100l7439F1797a77787Q8062m5210A91589E65c97194A25118f5877
9149d10449A35239d76255B068d30271a49484j0643m0316f2433k86525d3433k22767
9138b66200B10714N5331h7993l44287A56657R5622f3793j05871b4358j54200H6033
9126b86418I6884i1183k05302A22640f4051j24383q9908A333c10848J40418M2678
9115a27752d1275k1949B478a44435A58330f8864l19155B06594b52495G2274a51041
9103a69476o8207b5653k48750j7433g8668L4611B44051b48828k4337e2459k22251
9092b74710a19533K080a9786B85405f7137l6178A53968j7022b14844j36487E110
$$ plain form
9173 208555 280638 -15970 -120117 -74376 133923 -7233 225712 -364264 -115868 275156 116272
9161 -301751 -15100 -52539 61797 -177787 -89725 -134935 191589 565 -397194 125118 -65877
9149 -410449 135239 -476255 2068 -430271 -149484 -160127 -200443 -62433 -348958 -43433 -266200
9138 -266200 210714 266045 -87993 -432280 156657 252279 -63793 -169664 -24358 -178558 86033
9126 -286418 96884 -91183 -296485 122640 -64051 -188434 -278342 1333 -310848 -170430 -127752
9115 -127752 -41275 -63224 2478 -144435 158330 -68864 -388019 206594 -252495 72274 -151041
9103 -169476 -237683 -25653 -274403 -291836 -78668 -44057 244051 -248828 -273165 -52459 -274710
9092 -274710 -119533 -117453 -19786 285405 -67137 -103315 153968 136946 -214844 -351331 5110
9080F7964L1202d1136j44582O049g0916F6490a44550c8254F0281h1865a54B31374
9067B75624H0652c27934k8058J64412g1661L4472B5985e2228A43244e9213B63460
9055b37411C23556r5179c36204C3838M7042K76654H8110d3142A80267b9957m48208
9044d78165A53010b12863c1727A52022c1278j89108j04593A08354c44473A87219
9033c5194A32056q455h2720r5743Q2935a4093k53938d7945k84411H9133J34428
9022B23561a96569j508A41381a41358a729j55624b3896o1693j10810r8782a43797
9010A2544a49640m24744a12890j83545E4624g8067A0197b42129j31192J19284
9000b54037A68314a11294F5182b1755j99061A6100J01576l4463b67024D3500a15116
$$ plain form
9080 67964 99166 -41136 -185718 -179669 -70916 66490 -144550 -38254 60281 -81865 -154 231374
9067 275624 80652 -327934 -355992 -191580 -71661 -37189 25985 -52228 143244 -59213 263460
9055 -237411 323556 228377 -336204 33838 80880 357534 88110 -43142 180267 -29957 -478165
9044 -478165 153010 -212863 -31727 152022 -31278 -220386 -324979 108354 -344473 187219
9033 -35194 132056 123601 -82720 -178463 -95528 -14093 -268031 -47945 -332356 89133 223561
9022 223561 -196569 -198077 141381 -141358 -1729 -157353 -23896 -85589 -196399 -295181 -143797
9010 12544 -149640 -574384 -112890 -296435 54624 -78067 10197 -242129 -373321 -254037
9000 -254037 168314 -111294 65182 -21755 -220816 16100 117676 83213 -267024 43500 -115116
8988a45064a7976A97322g695D2937M7779f1643n7407B15036A05251D3072a01509
8976A03326L0649B8679Q5g6706l17306J83852Q6565A08212l8408c9972C8929L4778
8964G3707a24066B42522a42605B13517b19894r4878b9949k50847A19212a01220
8953b0163m9966c2365j0923A67093d48089h7924m8501I8240D3069d1860l4848
8942g6708B76213c0963o9166H0417K088R114J1749D4071O2550a27959D0683M76012
8930E16695b08557F6210b4478I1216f7225A73454L27730P98437K208111L027800
8920F535532B783580A069444B89143a6380H5788J95996C8901N5794a63476p2601
8910b36077Q5282c5022F06380D4955l544A1839a55957E2582N0791a80479m542
$$ plain form
8988 -145064 -17976 197322 -7695 42937 90716 -61643 -119050 215036 105251 43072 -101509
8976 103326 133975 28679 28764 -76706 -394012 -210160 -123595 108212 69804 -39972 38929 73707
8964 73707 -124066 242522 -142605 213517 -219894 -314772 -29949 -280796 119212 -101220
8953 -20163 -70129 -32365 -43288 167093 -448089 -87924 -136425 98240 43069 -41860 -76708
8942 -76708 276213 -30963 -100129 80417 82505 91619 103368 44071 106621 -127959 40683 516695
8930 516695 -208557 66210 -24478 91216 -67225 173454 501184 1299621 3507732 6535532
8920 6535532 2783580 1069444 289143 -16380 85788 281784 38901 94695 -163476 -236077
8910 -236077 -150795 -35022 606380 44955 41411 11839 -155957 52582 103373 -180479 -185021
8899a85021O1A55172d2223A08682j9848M6340b32398A15555c52405e5261q6072
8888a41333H5515a11506e1769k61770J30090J6464h3359B81869b14080J00056
8878a14024A1561O4970h629F9237L4594J1869c09107E7913c05055f1891A81250
8866B53548a17449A55143a0539n971i22G9812d3227C13660c2767r8917p0490i2225
8853b98247g1485m903l14928J21372p8092a40176I0324f5254l8701A74311b00115
$$ plain form
8899 -185021 -184960 155172 -42223 108682 88834 135174 -232398 115555 -352405 -55261 -141333
8888 -141333 85515 -111506 -51769 -313539 -183449 -166985 -83359 281869 -214080 -114024
8878 -114024 11561 76531 -8629 69237 103831 115700 -309107 57913 -305055 -61891 181250
8866 253548 -117449 155143 -10539 -16510 -922 79812 -43227 313660 -32767 -131684 -202174 -92225
8853 -298247 -71485 -76388 -391316 -269944 -348036 -140176 90324 -65254 -103955 174311 -200115
$$ [...]
##END NTUPLES=NMR SPECTRUM
##END=
