
##TITLE=AC1260_SUMRS11077_6534932_hEmxJmlG4X
##JCAMPDX= 6.0         $$ Bruker NMR JCAMP-DX V2.0
##DATA TYPE= NMR SPECTRUM
##DATA CLASS= NTUPLES
##ORIGIN= BRUKER
##OWNER= Administrator
$$ 1.72 TOPSPIN		Version 2.1
$$ 2012-07-16 19:37:51.593 -0500  Administrator@TOPSPIN
$$ Compression mode = diff/dup
##.OBSERVE FREQUENCY= 400.02188249412
##.OBSERVE NUCLEUS= ^1H
##.ACQUISITION MODE= SIMULTANEOUS (DQD)
##.ACQUISITION SCHEME= undefined
##.AVERAGES= 8
##.DIGITISER RES= 22
##SPECTROMETER/DATA SYSTEM= spect
##.PULSE SEQUENCE= zg30
##.SOLVENT NAME= COFFEE_meoh
##.SHIFT REFERENCE= INTERNAL, COFFEE_meoh, 1, 14.98509
##AUDIT TRAIL= $$ (NUMBER, WHEN, WHO, WHERE, PROCESS, VERSION, WHAT)
$$ ##TITLE= Audit trail, TOPSPIN		Version 2.1
$$ ##JCAMPDX= 5.01
$$ ##ORIGIN= Bruker BioSpin GmbH
$$ ##OWNER= Administrator
$$ $$ C:\Bruker\TOPSPIN/data/COFFEE/nmr/AC1260_SUMRS11077_6534932_hEmxJmlG4X/20/pdata/1/auditp.txt
$$ ##AUDIT TRAIL=  $$ (NUMBER, WHEN, WHO, WHERE, PROCESS, VERSION, WHAT)
(   1,<2012-07-16 19:37:43.953 -0500>,<Administrator>,<TOPSPIN>,<go>,<TOPSPIN 2.1>,
      <created by zg
	started at 2012-07-16 19:36:37.015 -0500,
	POWCHK enabled, PULCHK disabled,
       configuration hash MD5:
       6B 1B 68 BB D9 2E 58 E2 7F 35 AD 54 07 DF 0E 41
       data hash MD5: 64K
       7E 5C 63 4E A9 0D 4D 6D 92 14 97 5E 29 84 D0 E2>)
(   2,<2012-07-16 19:37:46.968 -0500>,<Administrator>,<TOPSPIN>,<proc1d>,<TOPSPIN 2.1>,
      <Start of raw data processing
       efp LB = 0 FT_mod = 6 PKNL = 1 PHC0 = 0 PHC1 = 0 SI = 32K 
       data hash MD5: 32K
       EA 84 66 F1 37 BA FE 9E 1D A2 A6 33 70 D5 35 DE>)
(   3,<2012-07-16 19:37:47.265 -0500>,<Administrator>,<TOPSPIN>,<proc1d>,<TOPSPIN 2.1>,
      <pk PHC0 = 181.0547 PHC1 = 0 
       data hash MD5: 32K
       3C 8C 3D 11 9F ED C1 C4 48 3C 7B 96 A8 B3 EE 80>)
(   4,<2012-07-16 19:37:47.328 -0500>,<Administrator>,<TOPSPIN>,<proc1d>,<TOPSPIN 2.1>,
      <abs ABSG = 1 
       data hash MD5: 32K
       98 2A 14 62 BF 4B B6 DC 99 C6 A0 79 FD 4E D8 6C>)
(   5,<2012-07-16 19:37:47.359 -0500>,<Administrator>,<TOPSPIN>,<proc1d>,<TOPSPIN 2.1>,
      <abs ABSG = 2 
       data hash MD5: 32K
       1E 62 C0 74 8F 42 BC 89 A9 88 2F CE 25 85 16 25>)
(   6,<2012-07-16 19:37:47.421 -0500>,<Administrator>,<TOPSPIN>,<proc1d>,<TOPSPIN 2.1>,
      <abs ABSG = 3 
       data hash MD5: 32K
       A8 3E 39 6F BE C6 79 1D E0 63 B2 93 E6 BF 07 43>)
(   7,<2012-07-16 19:37:47.453 -0500>,<Administrator>,<TOPSPIN>,<proc1d>,<TOPSPIN 2.1>,
      <abs ABSG = 4 
       data hash MD5: 32K
       38 DB 98 50 33 26 96 AC A2 A2 A1 7D 91 27 37 26>)
(   8,<2012-07-16 19:37:47.484 -0500>,<Administrator>,<TOPSPIN>,<proc1d>,<TOPSPIN 2.1>,
      <abs ABSG = 5 
       data hash MD5: 32K
       8B 34 5F 80 41 2D 30 B2 CC 70 C1 FD 74 DB AA 3F>)
$$ ##END=
$$ 
$$ $$ hash MD5
$$ $$ 5E 39 59 2C E8 5F 3C 39 7A F3 1F 9C D6 D7 AB 26
##$RELAX= 
##$RELAX= 
##$RELAX= 
##$RELAX= 
##$RELAX= 
##$RELAX= 
##$RELAX= 
$$ Bruker specific parameters
$$ --------------------------
$$ [...]
150 150 150 150 150 150 150 150
##$TP07= 0
##$TPNAME0= <>
##$TPNAME1= <>
##$TPNAME2= <>
##$TPNAME3= <>
##$TPNAME4= <>
##$TPNAME5= <>
##$TPNAME6= <>
##$TPNAME7= <>
##$TPOAL= (0..7)
0.5 0.5 0.5 0.5 0.5 0.5 0.5 0.5
##$TPOFFS= (0..7)
0 0 0 0 0 0 0 0
##$TUNHIN= 0
##$TUNHOUT= 0
##$TUNXOUT= 0
##$USERA1= <user>
##$USERA2= <user>
##$USERA3= <user>
##$USERA4= <user>
##$USERA5= <user>
##$V9= 5
##$VALIST= <valist>
##$VCLIST= <CCCCCCCCCCCCCCC>
##$VD= 0
##$VDLIST= <DDDDDDDDDDDDDDD>
##$VPLIST= <PPPPPPPPPPPPPPP>
##$VTLIST= <TTTTTTTTTTTTTTT>
##$WBST= 2048
##$WBSW= 25
##$XGAIN= (0..3)
0 0 0 0
##$XL= 0
##$YL= 0
##$YMAX_a= 479032
##$YMIN_a= -614731
##$ZGOPTNS= <>
##$ZL1= 120
##$ZL2= 120
##$ZL3= 120
##$ZL4= 120
##$ABSF1= 14.98509
##$ABSF2= -5.573092
##$ABSG= 5
##$ABSL= 3
##$ALPHA= 0
##$AQORDER= 0
##$ASSFAC= 0
##$ASSFACI= 0
##$ASSFACX= 0
##$ASSWID= 0
##$AUNMP= <proc_prof1d_extract_pilot.lims>
##$AXLEFT= 0
##$AXNAME= <>
##$AXNUC= <1H>
##$AXRIGHT= 0
##$AXTYPE= 0
##$AXUNIT= <>
##$AZFE= 0.1
##$AZFW= 0.1
##$BCFW= 0
##$BC_mod= 0
##$BYTORDP= 0
##$COROFFS= 0
##$CY= 15
##$DATMOD= 1
##$DC= 0
##$DFILT= <>
##$DTYPP= 0
##$F1P= 0
##$F2P= 0
##$FCOR= 0.5
##$FTSIZE= 32768
##$FT_mod= 6
##$GAMMA= 0
##$GB= 0
##$INTBC= 1
##$INTSCL= 1
##$ISEN= 128
##$LB= 0
##$LEV0= 0
##$LPBIN= 0
##$MAXI= 10000
##$MC2= 0
##$MEAN= 0
##$ME_mod= 0
##$MI= 0
##$NCOEF= 0
##$NC_proc= -8
##$NLEV= 6
##$NOISF1= 0
##$NOISF2= 0
##$NSP= 0
##$NTH_PI= 0
##$NZP= 0
##$OFFSET= 14.98509
##$PC= 1
##$PHC0= 181.0547
##$PHC1= 0
##$PH_mod= 1
##$PKNL= yes
##$PPARMOD= 0
##$PPDIAG= 0
##$PPIPTYP= 0
##$PPMPNUM= 2147483647
##$PPRESOL= 1
##$PSCAL= 4
##$PSIGN= 0
##$PYNMP= <proc.py>
##$REVERSE= no
##$SF= 400.02
##$SI= 32768
##$SIGF1= 0
##$SIGF2= 0
##$SINO= 400
##$SIOLD= 32768
##$SPECTYP= <>
##$SREGLST= <1H.CDCl3>
##$SSB= 0
##$STSI= 32768
##$STSR= 0
##$SW_p= 8223.68421052631
##$SYMM= 0
##$S_DEV= 0
##$TDeff= 65536
##$TDoff= 0
##$TI= <>
##$TILT= no
##$TM1= 0
##$TM2= 0
##$TOPLEV= 0
##$USERP1= <user>
##$USERP2= <user>
##$USERP3= <user>
##$USERP4= <user>
##$USERP5= <user>
##$WDW= 1
##$XDIM= 32768
##$YMAX_p= 442833750
##$YMIN_p= -671465
##$CURPLOT= <Network HP LaserJet P1505>
##$CURPRIN= <$Network HP LaserJet P1505>
##$DFORMAT= <normdp>
##$LAYOUT= <+/1D_H.xwp>
##$LFORMAT= <normlp>
##$PFORMAT= <normpl>
##$SURQMSG= 1
$$ End of Bruker specific parameters
$$ ---------------------------------
##NTUPLES= NMR SPECTRUM
##VAR_NAME=  FREQUENCY,     SPECTRUM/REAL,   SPECTRUM/IMAG
##SYMBOL=    X,             R,               I
##VAR_TYPE=  INDEPENDENT,   DEPENDENT,       DEPENDENT
##VAR_FORM=  AFFN,          ASDF,            ASDF
##VAR_DIM=   32768,         32768,           32768
##UNITS=     HZ,            ARBITRARY UNITS, ARBITRARY UNITS
##FACTOR=    0.250966925370066, 1,           1
##FIRST=     8223.43324360094, 167405,       -192329
##LAST=      0,             -16014,          -274864
##MIN=       0,             -671465,         0
##MAX=       8223.43324360094, 442833750,    0
$$ Real data points
##PAGE= N=1
##DATA TABLE= (X++(R..R)), XYDATA
$$ [...]
19543D4672a41049q335I7507Q5084M8423I9389c24626C2702J74873o8241a66902
19531a40305l3687P3274k1651J2368k5606n7663j08071f7453A23466C5384c09194
19519A71933a01472q7351o4417E9388J07060a29929C87218a62655A10548c29993
19508c3579A88713a93031j63993A80826a11633l06543A5993L41042D1266a02425
19497B05377i114j50741C07061q8446B6634a12794A80195g6637j43837H3772a77991
19485I7144J56305c6186l8299f612F665e0822D1849b82726c8113k53532i5481
19473A08471P8219m3072B4375a15257B6070a9466j53562j43988l0277J23468J01734
19462a22091j24659b2057C0835R7424i7582M332q9972D6908a66812I8594q508
$$ plain form
19543 44672 -141049 -149384 97507 182591 231014 99389 -324626 32702 207575 139334 -166902
19531 -140305 -173992 -100718 -122369 -110001 -135607 -193270 -301341 -67453 123466 35384 -309194
19519 171933 -101472 -188823 -253240 59388 166448 -129929 387218 -162655 110548 -329993
19508 -33579 188713 -193031 -357024 180826 -111633 -418176 15993 357035 41266 -102425
19497 205377 -9114 -159855 307061 218615 26634 -112794 180195 -76637 -220474 83772 -177991
19485 97144 253449 -36186 -74485 -6612 6665 -50822 41849 -282726 -38113 -291645 -95481
19473 108471 186690 143618 24375 -115257 26070 -19466 -173028 -317016 -347293 -223825 -122091
19462 -122091 -246750 -22057 30835 128259 -97582 -93250 -183222 46908 -166812 98594 90086
19451I0086f8014m5001C0277J51381a32453p1041L164B1664c6427j49892b9736
19439h0748A35496c0150G1195a37838b3620A25827b1322A80430a52666I9151O8064
19428A67215a31070I9263a21996a0138F5664R5114b49912a07772n5028A51951
19417b95278r7591A0788a28868E6546c3682k90339g4415C2003h9138a1641C2768
19405e2473H3899a05161q3150D2732b58384O1223A01781b84263A4417a23823A28323
19393b24910r8331J29685A34659J081j9203c42055b5867j56607H2090L4247J16776
19382B33113E0217a16544D88729a98879Q7965j0478A30368a49468O1171D0107
19371E3114K17406a5788A40382a00368A03664a24521R752E6711K60858e6253B49090
$$ plain form
19451 90086 -68014 -113015 30277 181658 -132453 -203494 -200330 21664 -36427 -186319 -29736
19439 -80748 135496 -30150 71195 -137838 -23620 125827 -21322 180430 -152666 99151 167215
19428 167215 -131070 99263 -121996 -10138 65664 160778 -249912 -107772 -162800 151951
19417 -295278 -392869 10788 -128868 56546 -33682 -324021 -74415 32003 -89138 -11641 32768
19405 -52473 83899 -105161 -188311 42732 -258384 -197161 101781 -284263 14417 -123823 128323
19393 -224910 -323241 -193556 134659 135740 116537 -342055 -25867 -182474 82090 116337 233113
19382 233113 50217 -116544 488729 -198879 -110914 -121392 130368 -149468 -88297 40107
19371 53114 270520 -15788 140382 -100368 103664 -124521 -114769 56711 317569 -56253 249090
19359A77831q2331b02335C4354c30505j245a42072k24223a34549d6684m2994E8703
19347i0349r9687B33492f7875A49758G2810C0278N3585a45431p9230A34543a1038
19335c1789F2001j6520e2482A09443i3559k45535A57908b75894c7181A95262k1643
19324A73619a98568P3015A31009n7419B1404A297g8096l8574m6692g438C059O9893
19312G2952B7214b21481I7595J35464c62467C48668B5907i5371C05220f8327q5420
19301a53747H9787M1549A874K97542d65924F148b61560A057h5839D8842a22044
19289c58529A03990A6234a02150B46722g4906L2696B999c27782A87736b09143
19278D018J44176f1505j00724A43871k6908c9629A2314a54498E2229j5622b13867
$$ plain form
19359 177831 95500 -202335 34354 -330505 -331750 -142072 -366295 -134549 -46684 -89678 58703
19347 -90349 -190036 233492 -67875 149758 72810 30278 83863 -145431 -224661 134543 -11038
19335 -31789 62001 45481 -52482 109443 -93559 -339094 157908 -275894 -37181 195262 173619
19324 173619 -198568 -125553 131009 73590 21404 1297 -78096 -116670 -163362 -7438 3059 72952
19312 72952 27214 -221481 97595 233059 -362467 348668 25907 -95371 305220 -68327 -153747
19301 -153747 89787 131336 1874 299416 -465924 6148 -261560 1057 -85839 48842 -122044
19289 -358529 103990 16234 -102150 246722 -74906 -42210 2999 -327782 187736 -209143
19278 4018 148194 -61505 -162229 143871 116963 -39629 12314 -154498 52229 36607 -213867
19266C36534a01699o6229b8243F1982b49991f4367A45865b45635J08018f8195
19255a72372d9339r0019F7439k6692a98981k07411a86724d9940p9791j55475b6030
19243e59417A21055f7003F5423K92414c13254J03159e0087O256A35604b86152
19232B5171L3007J23640M5106g3145f109p0645k45866e6675B6493a40951j4550
19221a55501F6142a02365j19167A51264Q0728a92779j00186b0626k3418A31662
19210F3970R6888D754b02599j48162c8570l561k7215l18913Q6656I3513d303j48744
19198a53047A23146f3585C30549f0215l3290k6680B33437c30785E02502b81925
19187E3982c00062H1080g2083m3187B88274f7037A80575a7684l6601A6077d2724
$$ plain form
19266 336534 -101699 -167928 -28243 61982 -249991 -64367 145865 -245635 -137617 -68195
19255 -172372 -49339 -139358 67439 40747 -198981 -406392 -186724 -49940 -129731 -285206 -26030
19243 -559417 121055 -67003 65423 357837 -313254 -210095 -50087 -43831 135604 -286152
19232 25171 58178 181818 226924 -73145 -6109 -76754 -322620 -56675 26493 -140951 -155501
19221 -155501 66142 -102365 -221532 151264 231992 -192779 -292965 -20626 -44044 131662
19210 63970 160858 4754 -202599 -350761 -38570 -42131 -69346 -388259 -301603 93513 -4303 -153047
19198 -153047 123146 -63585 330549 -60215 -93505 -120185 233437 -330785 502502 -281925
19187 53982 -300062 81080 -72083 -115270 288274 -67037 180575 -17684 -54285 16077 -42724
19175B57179F0807c06912F5789b11424e9169q2136O4226j42288C3894M2636a06779
19163a470p3900I0183h6218d364k33103L3910j12509J56085N1213a0418H0436
19151B65954p5404E0935O0325n4403c91616a7353E6974k6843J03128A076b71875
19139b86764B52249a04879j39545o6428a00490o8830A96650b59650A35316b61181
19128f1236E8891a47837k11285e1713k7929A57202O1022c50853i4800C4548b73592
19116g6907j15755C0406b23565d506k93286B8644a48864H5584C4459J66665L5557
19105B36681k0874b65000j6601g7885k2783o9037q148K2609j28893H6411A3779
19093C2157b64863G857K13892L082E0278k3073a83302p6639I1639a32802H6559
$$ plain form
19175 257179 60807 -306912 65789 -211424 -59169 -141305 -77079 -219367 33894 76530 -106779
19163 -1470 -75370 90183 -86218 -4364 -237467 -203557 -316066 -159981 -108768 -10418 80436
19151 265954 190550 50935 111260 56857 -391616 -17353 56974 30131 133259 1076 -271875
19139 -286764 252249 -104879 -244424 -310852 -100490 -169320 196650 -259650 135316 -261181
19128 -61236 58891 -147837 -359122 -51713 -79642 157202 218224 -350853 -94800 34548 -273592
19116 -76907 -192662 30406 -223565 -4506 -297792 28644 -148864 85584 34459 201124 236681
19105 236681 215807 -265000 -281601 -77885 -100668 -169705 -177853 -155244 -284137 86411 13779
19093 32157 -264863 7857 221749 224831 50278 27205 -183302 -259941 91639 -132802 86559
19081G9572a37780j2263N8460A7915b37731F1538b05280i7009j49042J16367j84177
19070c13861a27440e5877j40488B8944K15751c06165B46629E1486b15144A8212
19059a19139M2281m1668B88106E7523a01107j35957D6345a84484A47564a26503
19048f6019H2222R2211c4031A32078j4009d6947a308j38146l39723e3206l7326
19037i0532j4434E7187K5696J72350r1713a53759P4630q222j73291A26195E5214
19025a33587M2509k1170c979k37812C3409J6835D256J2559c22528A81146f4872
19013B1390K14356a00121a1488j62806d8507l53976B01959a32388C7741a29535
19002A33504a1155o5094k00698a0668o9084B32812l904h193k65375E2099K7664
$$ plain form
19081 79572 -137780 -150043 -91583 17915 -237731 61538 -205280 -97009 -246051 -129684 -313861
19070 -313861 -127440 -55877 -196365 28944 244695 -306165 246629 51486 -215144 18212
19059 -119139 -76858 -118526 288106 57523 -101107 -237064 46345 -184484 147564 -126503
19048 -66019 82222 174433 -34031 132078 118069 -46947 -1308 -139454 -479177 -53206 -90532
19037 -90532 -104966 57187 82883 255233 163520 -153759 -79129 -87351 -260642 126195 55214
19025 -133587 -91078 -112248 -3979 -241791 33409 50244 4256 16815 -322528 181146 -64872
19013 21390 235746 -100121 -11488 -174294 -48507 -402483 201959 -132388 37741 -129535
19002 133504 -11155 -76249 -276947 -10668 -79752 232812 228908 -8193 -273568 52099 79763
18991G9763g3162j35409j23736g7925B52284o3582A8020J67472a24644k03801
18981c28445B698R67h3770j02080b7797A37223K1386i7084j73739A46811P8134
18970B24945c67930c1576G7M16913h4084A46071b90649a3218l71654a66513l1375
18959a97888G8102f5675I4010B8451a53084A73575d0723j09480O5788l7381A30417
18947a29476a0499j7104j65087m9900a489j31050A35950c44361a49592K4724O1835
18936f3033D7597a93058f1088A67088E5322a21246k7920B59648b338J140n8606
18925e9804j17315I8308b92j25915r214E8082e375p4130j68014D9239K36072F5098
18912B04716L6784C7057O3162h7167c111j14089d8708q2083C05100a14697J3615
$$ plain form
18991 79763 -73162 -208571 -332307 -77925 252284 188702 18020 185492 -124644 -328445
18981 -328445 2698 3665 -83770 -185850 -27797 137223 158609 -97084 -270823 146811 224945
18970 224945 -367930 -31576 77 416990 -84084 146071 -290649 -13218 -384872 -166513 -197888
18959 -197888 78102 -65675 94010 28451 -153084 173575 -40723 -150203 -84415 -121796 130417
18947 -129476 -10499 -27603 -192690 -242590 -1489 -132539 135950 -344361 -149592 -124868 -63033
18936 -63033 47597 -193058 -61088 167088 55322 -121246 -149166 259648 -2338 -1198 -59804
18925 -59804 -177119 98308 -292 -126207 -135421 58082 -5375 -79505 -247519 49239 285311 65098
18912 204716 241500 37057 100219 -87167 -3111 -117200 -48708 -130791 305100 -114697 -101082
18901a01082J8694G4448a79286q5768N6130N7500B44478a0570k83316B56803a70039
18889h2053I6946C201L5983O0837a37061A35242a99639B16508d50142a74028H134
18877a69986P0228r282A20810m3625J57800b0141j13965B08507c34578G4099b08136
18865b16416j68496C91782I4887j335a45663E2267B1065a0600K701k23012i8420
18853b03326L0913B79696g6922k8420j08840O1056b9842l2693A07359D2393b96319
18841a13132K7885o2178A05679k7088b87441O9104H5355N5183L2579a93694E5344
18829b05899C7197Q5263i5948l97C4823a94004A18856C2757k472J87411o7516
18818A50180f2304J6384D486a46739c7708A19867l5156K55440a40208k7075G0532
$$ plain form
18901 -101082 -82388 74448 -179286 -265054 -208924 -151424 244478 -10570 -293886 256803 -170039
18889 -82053 96946 3201 39184 100021 -137061 135242 -199639 216508 -450142 -174028 8134
18877 -169986 -99758 -109040 120810 77185 234985 -20141 -134106 208507 -334578 74099 -208136
18865 -216416 -384912 391782 94887 93552 -145663 52267 21065 -10600 -7899 -230911 -98420
18853 -203326 -172413 279696 -76922 -105342 -214182 -153126 -29842 -62535 107359 42393 -296319
18841 -113132 -85247 -147425 105679 78591 -287441 -218337 85355 140538 173117 -193694 55344
18829 -205899 37197 122460 -95948 -96345 34823 -194004 118856 32757 30285 217696 150180
18818 150180 -62304 -45920 4486 -146739 -37708 119867 84711 340151 -140208 -167283 70532
18806a21379e9939G1716g4100j210k3701n2006f1458j19902j41471a53971k28118
18795c82089e3048A06922a94001K7258q5447B37165c41206A36338a55304b8637
18784B5969c08484A83166a5467k4143J2239F2828a29799H0521M8457J46948b77097
18772A86377D64c71479I9029a84445J4255b6818j35708j28202A06140D2482c4923
18760B41401a79263M3123d997l14719Q7544P0692I8495a34892A82110q7848A3576
18748A44185M1580b16488h2193r3739O0914m4880A27036a38721p0323o5507A5946
18736F8050a59639j49347A83845b05916B2979i6103r7207k73587J37647a25647
18725b04024N0499j268N0980A14564O8302N0213H896d04885f0599B71997E955
$$ plain form
18806 -121379 -59939 71716 -74100 -75310 -99011 -151017 -61458 -181360 -322831 -153971 -382089
18795 -382089 -53048 106922 -194001 -166743 -252190 237165 -341206 136338 -155304 -28637
18784 25969 -308484 183166 -15467 -39610 -27371 62828 -129799 80521 128978 275926 -277097
18772 186377 464 -371479 99029 -184445 -170190 -26818 -162526 -290728 106140 42482 -34923
18760 241401 -179263 -136140 -4997 -319716 -232172 -161480 98495 -134892 182110 94262 13576
18748 144185 185765 -216488 -82193 -175932 -115018 -159898 127036 -138721 -209044 -274551 15946
18736 68050 -159639 -308986 183845 -205916 22979 -96103 -193310 -466897 -329250 -125647
18725 -204024 -153525 -154793 -103813 114564 182866 233079 8896 -404885 -60599 271997 5955
18713A13548D4979g37j53849k19901O0926J02877A49138D0365d7533k32954h3952
18701i7403B5564P6752a08642C93544A13293i0120b3475E9280c2119m0561D0981
18689a40870q9357A56467b90808e5390j16040I5827k0277c04529E6527L0838j6393
18678G0972b34088F5144a48505N7205j86536g8365A45984d2809j80894B35309
18667e0179m1546A28867K57701A08657K6188g7100j16991D9993B4541h1876j26550
18656b08426O4510G451a19409d5536p1541A47523a35396D32818A1639P5433a03165
18644a41204A04570J91236F3200f2457H7953a41138k32308B03308g5256r43k25869
18633c02068P8992I4554b95853I0773l6041h0825c5805B29319j08389L5304c54260
$$ plain form
18713 113548 44979 -737 -154586 -374487 -313561 -210684 149138 40365 -47533 -280487 -83952
18701 -97403 25564 102316 -108642 393544 113293 -90120 -23475 59280 -32119 -72680 40981
18689 -140870 -230227 156467 -290808 -55390 -171430 95827 75550 -304529 56527 87365 70972
18678 70972 -234088 65144 -148505 -91300 -277836 -78365 145984 -42809 -223703 235309
18667 -50179 -91725 128867 386568 108657 134845 -77100 -194091 49993 24541 -81876 -208426
18656 -208426 -143916 7451 -119409 -45536 -117077 147523 -135396 432818 11639 87072 -103165
18644 -141204 104570 295806 63200 -62457 87953 -141138 -373446 203308 -75256 -76199 -302068
18633 -302068 -223076 94554 -295853 90773 54732 -80825 -35805 229319 120930 156234 -354260
18621A03945a18800j52230k26788A19046b88040A10157J64982e7324J3468A19567
18610b07877j01205J43929A23428a34248G4459f8449I8679k821e2952G9266f1934
18598a17705b7764k48559A46770n893a70113P9973A36162b03982N5581N3825G2446
18586h2790F1735a08432l6172C24146a45916A5940a71801j1639k64393a3809l45748
18575c59557A12601J98680b19302g466r1710D8071a46638d8221c894k20j49411
18564a53525C4240b49226O6466O9052A48498g5833C2693d05859A37125C9332M1371
18553H0703b8986A65679h8925d552k54133e6575j89741a14535H788a79787O7191
18542a12596E5993f3533K4086E8585O2558a40711d2282B8755K21224C9356a92818
$$ plain form
18621 103945 -118800 -271030 -497818 119046 -288040 110157 275139 -57324 -43856 119567
18610 -207877 -309082 -165153 123428 -134248 74459 -68449 98679 95858 -52952 79266 -61934
18598 -117705 -27764 -276323 146770 140877 -170113 -90140 136162 -203982 -148401 -94576 72446
18586 -82790 61735 -108432 -144604 324146 -145916 15940 -171801 -183440 -447833 -13809 -359557
18575 -359557 112601 311281 -219302 -7466 -99176 48071 -146638 -48221 -3894 -4114 -153525
18564 -153525 34240 -249226 -182760 -113708 148498 -75833 32693 -405859 137125 39332 80703
18553 80703 -28986 165679 -88925 -4552 -258685 -56575 -246316 -114535 8788 -179787 -112596
18542 -112596 55993 -63533 -39447 58585 121143 -140711 -42282 28755 249979 39356 -192818
18530f4663A44785d30068f5452I1233a79870p3343G3172g2285l18218k6147B2495
18518e978B18452c10944B51375f7570B03418b11225A73216a62138O3513q0932
18508a79557B49736d23363j2243C6930H136i0111k61843B72339h9014k10126A89926
18496e14849a35180l0246B05410c639D91780b2366A45732J22038c33754J30093
18486b03661P9810b3620A20069a37132j90048E3097O6054j2714b52450c7209j11021
18475a48230F0805J22854M71821b89695A15988a5796A53377b14622d9695l6519
18465h6214F651Q6799a98348k01077A73240o4337c42657a68658A27629a9384j24508
18454a43892A8602K0680a71036q280I4829g180j3636j15751k1624d1090l47608
$$ plain form
18530 -64663 144785 -430068 -65452 91233 -179870 -253213 73172 -72285 -390503 -416650 22495
18518 -5978 218452 -310944 251375 -67570 203418 -211225 173216 -162138 -98625 -179557
18508 -179557 249736 -423363 -435606 36930 8136 -90111 -351954 272339 -89014 -299140 189926
18496 -514849 -135180 -165426 205410 -3639 491780 -22366 145732 267770 -333754 -203661
18486 -203661 -123851 -23620 120069 -137132 -327180 53097 119151 106437 -252450 -37209 -148230
18475 -148230 60805 183659 655480 -289695 115988 -15796 153377 -214622 -49695 -86214
18465 -86214 6651 93450 -198348 -399425 173240 108903 -342657 -168658 127629 -19384 -143892
18454 -143892 18602 39282 -171036 -179316 94829 -7180 -20816 -136567 -158191 -41090 -388698
18443c88698a29280A12501k409n009a01292j00796a5951H9789K3371a99524D4385
18431G6097l729a3688A68367A0097L1409h6421A25799a92083b8331j56921B15
18419C1970K36008a6267A74799c39549R5921k73925e8900m5938K5475L5937j12857
18408a56283A33754n0852J57815c15806C2602a52168f3522j83838F5621a51236
18397B33146a30477B8108J49309E3018J23910b7621k8275r5461p9938M4094Q8782
18386i8419q5715C2573J77149D3036O6545f8479m4380A16537B3582J37902b49384
18374b56392a20528m8199m6855A67166a51829n3051c7907H7439a28045M844A37730
18362g6243F8714b27895C2535J41779a18285q7734l05542J99005B02988H2093
$$ plain form
18443 -388698 -129280 112501 110092 105083 -101292 -202088 -15951 89789 113160 -199524 44385
18431 76097 72368 -13688 168367 10097 41506 -86421 125799 -192083 -28331 -185252 215
18419 31970 267978 -16267 174799 -339549 -243628 -517553 -58900 -104838 -79363 -43426 -156283
18408 -156283 133754 82902 240717 -315806 32602 -152168 -63522 -247360 65621 -151236
18397 233146 -130477 28108 177417 53018 176928 -27621 -55896 -151357 -231295 -187201 -98419
18386 -98419 -184134 32573 209722 43036 109581 -68479 -112859 116537 23582 161484 -249384
18374 -256392 -120528 -168727 -215582 167166 -151829 -204880 -37907 87439 -128045 -123201 137730
18362 -76243 68714 -227895 32535 174314 -118285 -206019 -511561 -312556 202988 82093
18351g0015r3564A29023i1185k34278a24785O719j02420G9027J18955b24415f821
18339a6044l00696B2881j0333a60673C41456d5775j08650j41856A86985c96672
18328A74418E8472M8023P8817a21173l2627j14347a6451I06d13093m6569C23316
18316i9057K9982j1034b6062l9012D0058Q342m803J21413b52428A23107K3318
18305A46425J6028a08289m6339L3882l3162k92580H0392b76224M8165A10211L1841
18294A42052b06615A11556b84899e9426m73098C808N0708M33565b48711a13024
18283F9757a04538j01405D7050b46350j3746K3663A69095m5549k6074c91937e1215
18271C6289R7585g4363A34670F0426c65232E9728J9688h1138B3669c01364a06181
$$ plain form
18351 -70015 -163579 129023 -91185 -325463 -124785 -118066 -220486 79027 197982 -224415 -6821
18339 -16044 -316740 22881 12548 -160673 341456 -45775 -154425 -296281 186985 -396672
18328 174418 58472 106495 185312 -121173 -153800 -268147 -16451 906 -413093 -459662 323316
18316 -99057 -69075 -80109 -26062 -65074 40058 48400 43597 165010 -252428 123107 146425
18305 146425 162453 -108289 -154628 -120746 -153908 -446488 80392 -276224 -228059 110211 142052
18294 142052 -206615 111556 -284899 -59426 -532524 3808 54516 488081 -248711 -113024
18283 69757 -104538 -205943 47050 -246350 -260096 -236433 169095 123546 97472 -391937 -51215
18271 36289 133874 -74363 134670 60426 -365232 59728 79416 -81138 23669 -301364 -106181
18259a58010A7561a82130B16486b84843d242qr3619L108a1993n6734j30266B35505
18246H7127D1079O548J92893q0629a58684H077b7923A71733a85526A63692b24929
18234A95249p3076d4603n3293G0574f8796l67115b04600k6484c4126C8624k759
18223C5865H646a68387C0322b47533f1826j40234A23788c8373K665h758E6565
18211b01900j05366A34979F3425c5141C4826J32691O8199N1395b07289P7660A86595
18199A50819a4667A3847J29701b00512O7952j41881h4112A48059h1983L1182k80105
18188c30906B16950h7798o1894j41449A19209a65426k52374i5241o6514B32956
18177B57793a38634A0972b32092j59023B39596C574b43814A49663b45743B97074
$$ plain form
18259 -158010 17561 -182130 216486 -284843 -4242 -4250 -97869 -94761 -11993 -68727 -198993 235505
18246 87127 41079 47627 240520 159891 -158684 8077 -27923 171733 -185526 163692 -224929
18234 195249 122173 -44603 -97896 70574 -68796 -435911 -204600 -231084 -34126 38624 35865
18223 35865 8646 -168387 30322 -247533 -61826 -202060 123788 -38373 -35708 -8758 56565
18211 -201900 -307266 134979 63425 -35141 34826 167517 235716 287111 -207289 -129629 186595
18199 150819 -14667 13847 143548 -200512 -132560 -274441 -84112 148059 -81983 -50801 -330906
18188 -330906 216950 -87798 -149692 -291141 119209 -165426 -417800 -95241 -161755 232956
18177 257793 -138634 10972 -232092 -391115 239596 3574 -243814 149663 -245743 297074
18166G4241c08821i0339c80m7689e283B18494f2587H4665l528c1839k59602A63223
18153A30164a14778n7953F6376J81190d9780F9445b6043l5718k62051b2234l73164
18142c95398F3245f36600J67239A97768r0882c15455A04674e207j27273B35633
18131e4646l57770H6929J15710a1024A62726i1768E2552K47096C2694d01168a74951
18119i4074j8756n6964P2573A6286a13653j68308e3519A25928a36462k47815a6480
18107E1063c54682a6572k39850K6810A43526b21504B25502d5809k24429A03534
18096b13502B51752F1478b3012K197A54293J5120A1930a62761D1677d11321e4673
18084A9591a53525J4230A16780L3278O6333b318i64j33010H2445K61804A44443
$$ plain form
18166 74241 -308821 -90339 -380 -48069 -5283 218494 -62587 84665 81137 -31839 -291441 163223
18153 130164 -114778 -172731 66376 247566 -49780 69445 -26043 -61761 -323812 -22234 -395398
18142 -395398 63245 -636600 -469361 197768 106886 -315455 104674 -5207 -132480 235633
18131 -54646 -412416 86929 202639 -11024 162726 -91768 52552 299648 32694 -401168 -174951
18119 -94074 -112830 -169794 -97221 16286 -113653 -281961 -53519 125928 -136462 -384277 -16480
18107 51063 -354682 -16572 -256422 -229612 143526 -221504 225502 -45809 -270238 103534
18096 -213502 251752 61478 -23012 -20815 154293 169413 11930 -162761 41677 -411321 -54673
18084 19591 -153525 -139295 116780 150058 216391 -2318 -964 -133974 82445 344249 144443
18072a35259A48643h2956j6289I4682J53927A1772b91578H6612b65186A24960
18061A9983b7579j95072A02062C0117a7392I4279f5839A16483a32601A89446G251
18049A49284o6580O49b24607h129j26102j62845a05447B6051N5258f5576A14420
18037C8151j1102e581A22048i7231B7849c23575A22603C5684J9158b5756C94987
18025G6216K89296j20099h9555o7216m618B31076i9172B56244B1655d63458a22280
18013B16001a32597a9335n584j10159e52C7867J2626A7599b32209G4002a94416
18001a30772I2119P414a42811N7520H9813b11018A7235J552d5321A34167L20875
17990D55042A70250B1985Q5307a67647j3784e3415K3133k83561H2507a08414M8996
$$ plain form
18072 -135259 148643 -82956 -99245 94682 248609 11772 -291578 86612 -265186 124960
18061 19983 -27579 -222651 102062 30117 -17392 94279 -65839 116483 -132601 189446 7251
18049 149284 82704 83353 -224607 -8129 -134231 -297076 -105447 26051 81309 -65576 114420
18037 38151 27049 -5581 122048 -97231 27849 -323575 122603 35684 54842 -25756 394987
18025 76216 365512 245413 -89555 -156771 -161389 231076 -99172 256244 21655 -463458 -122280
18013 216001 -132597 -19335 -24919 -135078 -552 37867 50493 17599 -232209 74002 -194416
18001 -130772 92119 99533 -142811 -85291 89813 -211018 17235 18787 -45321 134167 455042
17990 455042 170250 21985 107292 -167647 -181431 -53415 -30282 -313843 82507 -108414 -59418
17979e9418A07820K48642a57056A51714O682o7650C0860f6596m06272I3478a11270
17967a26309r0195I3918B2574b33124g4484m8968B60716L2480E5643O0192a40310
17955C10667A1353O2548P7026b16512K6341K3742e7534k32064B09139a88284o1875
17944b50159A23366R7896a61702C6748Q0373Q2469a73326o9007A87742H9629b62680
17932d5667j28522C80276j27482j16786c28061k6225I9683L1354a08862B27261
17921d51499B09984b45975R2310J7559M9597B63681d23615B8694J78895j5246
17911A92343P2720b6192L703k5002J9670q5704A39613F7533i1082n6128G4789
17899c36143F36M0095J17462C7210a17537N6846C793a57625k3180d1423B52393
$$ plain form
17979 -59418 107820 356462 -157056 151714 158396 90746 30860 -66596 -472868 93478 -111270
17967 -126309 -216504 93918 22574 -233124 -74484 -123452 260716 293196 55643 115835 -140310
17955 310667 11353 73901 150927 -216512 -190171 -166429 -57534 -289598 209139 -188284 -250159
17944 -250159 123366 221262 -161702 36748 117121 199590 -173326 -242333 187742 89629 -262680
17932 -45667 -174189 380276 252794 136008 -328061 -354286 99683 131037 -108862 227261
17921 -451499 209984 -245975 -153665 -136106 -86509 263681 -423615 28694 207589 192343
17911 192343 265063 -26192 -22489 -47491 -27821 -113525 139613 67533 -91082 -147210 74789
17899 -336143 636 40731 158193 37210 -117537 -60691 3793 -157625 -180805 -41423 252393
17887a08941M8371A08654J82064f9003A88129B7409f4710F606a09460I4458a97584
17875a16536I6811a89835d3562A50766a79572A68265m4149e057j46910N4366A34321
17863C24456a33201A00180i4692k05859B08172r7125h0065C23607I4189j9271
17853G4918N0630a2318B5279c8568m4781q0308L7431B32642j9151a54455g0880
17841b16988B12799J55284D385a39574d0073J335k22908f4398k84269B05389A01191
17829a4589j7563A85829p3928J11063m39b1226A61588l2634J39326d6713H0717
17817b09918D6730c04339L8180C9078a41287A01443R1996n5959m0781b80562b6799
17805A37424N3082a52897A20132C2723f2824A85815J0920J73239a12343k656H6606
$$ plain form
17887 -108941 -60570 108654 290718 -69003 188129 27409 -64710 6606 -109460 94458 -197584
17875 -116536 96811 -189835 -43562 150766 -179572 168265 124116 -5057 -151967 -97601 134321
17863 324456 -133201 100180 -94692 -300551 208172 111047 -80065 323607 94189 74918
17853 74918 125548 -12318 25279 -38568 -83349 -163657 -126226 232642 213491 -154455 -70880
17841 -216988 212799 368083 4385 -139574 -40073 -38738 -261646 -64398 -348667 205389 101191
17829 -14589 -32152 185829 111901 222964 222525 -21226 161588 128954 268280 -46713 80717
17817 -209918 46730 -304339 -266159 39078 -141287 101443 193439 137480 96699 -280562 -26799
17805 137424 190506 -152897 120132 32723 -62824 185815 196735 369974 -112343 -114999 86606
17793D4869J62548a5378l6875C67906a01304A72253a11180L468K6893q890f515
17781A81133l8431J16331C8635J05151F0964a75000j3483c4988l7676j16828B2138
17769i2112m2805D2099a43605l2229A00568K66715a64610H6382P2944a44876j29394
17758b74270F07a18981A80772H0630J2008O4942C8294a50941i764l51389f6564
17746B72016a94537B7787f0714B4362h7487B88968h557B28449A09686a34178k73865
17735d08043a05079k63159J80328L8027j24148C1180J03907L3902i1725J3560
17725g8165j23057k582m941H2907d7395k59213b9666A26445b74785B6066i5752
17713B82937b37099q1133i5994k35381A28165n0137k8365A9130c54104a32441
$$ plain form
17793 44869 207417 -15378 -52253 367906 -101304 172253 -111180 -107712 -80819 -89709 -6515
17781 181133 142702 259033 38635 143786 60964 -175000 -188483 -34988 -72664 -189492 22138
17769 -92112 -134917 42099 -143605 -175834 100568 367283 -164610 86382 159326 -144876 -274270
17758 -274270 607 -118981 180772 80630 92638 157580 38294 -150941 -9764 -361153 -66564
17746 272016 -194537 27787 -60714 24362 -87487 288968 -8557 228449 109686 -134178 -408043
17735 -408043 -105079 -368238 -187910 -149883 -274031 31180 135087 168989 -91725 -78165
17725 -78165 -201222 -203804 -208745 82907 -47395 -306608 -29666 126445 -274785 26066 -95752
17713 282937 -237099 -318232 -95994 -331375 128165 78028 49663 19130 -354104 -132441
17702B86507a39984A39540a7044l9611B52393C037b57324A7983R3015D3675E743
17690B17578A05255a35683D0832J96063J36589A72459C4030d0619A48055a9009
17679I1165H046d0789I8230j0121f4526j4709j58267A4055a39764B0197L2580
17668E2777N7693c0824p3743j94415A32131c5675j02285j37417B38074E1778e3406
17656a0372A87874q5355C8981j6549O5890B8302J7691d5982e594K660A16161P6932
17644A93093H8548b04912A03649b94935D8885Q4579J6655D1618a93878G8124A0126
17632a90528A8390c2158B74468q1320N097a88954I9392a15750j10704a3297K577
17621a0720A0574N25501a79857A19376J92802j29742c8125o1292M7071A115N9074
$$ plain form
17702 286507 -139984 139540 -17044 -56655 252393 3037 -257324 17983 110998 43675 5743
17690 217578 105255 -135683 40832 236895 373484 172459 34030 -40619 148055 -19009
17679 91165 8046 -40789 98230 88109 -64526 -79235 -237502 14055 -139764 20197 52777
17668 52777 110470 -30824 -104567 -298982 132131 -35675 -137960 -275377 238074 51778 -53406
17656 -10372 187874 102519 38981 22432 88322 28302 45993 -45982 -5594 -2934 116161 193093
17644 193093 88548 -204912 103649 -294935 48885 133464 150119 41618 -193878 78124 10126
17632 -190528 18390 -32158 274468 193148 198245 -188954 99392 -115750 -226454 -13297 -10720
17621 -10720 10574 536075 -179857 119376 312178 182436 -38125 -99417 -52346 1115 60189
17610F0189K95772j58783a41982G5205R2753n0042J300a87364A79805G627e409
17598c5802D1132K91757I5038o272b75999I2037l4375J70593I4755N2239a17063
17586a72953e1810F1005N3412A4389K64810a79349G1007c2866m1315I889J26838
17575A36727a25969n482A05656J43143G1618O7673d125A09258o898A2638O9933
17564H2571a2908A03901K54226h9759G1157f1609A42836Q5479J07380a70400A44140
17552b85685A4921b51769A73997a10984C93452G4775b00746J4397h6992A54717
17541A7038i4887A13755h5793a0867B6048M9279h2612p4400B62628a39226C38802
17529I1822C7536K91838a92559f3708C54055F3233b17643D61464g6710A25197
$$ plain form
17610 60189 355961 197178 -141982 75205 167958 117916 119216 -187364 179805 7627 -5409
17598 -35802 41132 332889 95038 88766 -275999 92037 57662 228255 94755 146994 -117063
17586 -172953 -51810 61005 114417 14389 279199 -179349 71007 -32866 -74181 9889 136727
17575 136727 -125969 -131451 105656 248799 71618 139291 -4125 109258 102360 12638 82571
17564 82571 -12908 103901 358127 -89759 71157 -61609 142836 228315 335695 -170400 144140
17552 -285685 14921 -251769 173997 -110984 393452 74775 -200746 -186349 -86992 154717
17541 17038 -94887 113755 -85793 -10867 26048 75327 -82612 -157012 262628 -139226 338802
17529 91822 37536 329374 -192559 -63708 354055 63233 -217643 461464 -76710 125197
17518B47275H8140r637a61069a968j77756A15268j6422e7568N458A88770K2052
17507B10822E6988a81840C09184b19512C17076a1171l1512C1749A983O1721J82208
17496B45912Q6459a23862B06456k6470N2961d8779C56674d8672I6049O2141J30511
17485B88701E9276A6319h386p1469A91909a83347H799d1544E06097A06994L3457
17474A40451A9575K06846N8177p429C6876J75559a41800H3845C5738a60240B8389
17462B64120M8047i16k18041A462J4577J41259k0311P3433c0701D97550A30928
17450C45285J75149A5482J44314G5027J09133b16059C42277p3942A33574B2877
17439E47631k61368J49627j64322q9305c9791C73791q839J3041D1638d3771j26396
$$ plain form
17518 247275 88140 78503 -161069 -1968 -179724 115268 98846 -57568 -52110 188770 210822
17507 210822 56988 -181840 309184 -219512 317076 -11171 -42683 31749 1983 63704 245912
17496 245912 332371 -123862 206456 179986 232947 -48779 356674 -48672 96049 158190 288701
17485 288701 59276 16319 -8386 -79855 191909 -183347 8799 -41544 506097 106994 140451
17474 140451 19575 226421 284598 277169 36876 212435 -141800 83845 35738 -160240 28389
17462 264120 312167 -916 -218957 1462 16039 157298 136987 210420 -30701 497550 130928
17450 345285 520434 15482 159796 75027 184160 -216059 342277 268335 133574 22877
17439 547631 286263 435890 271568 182263 -39791 373791 364952 377993 41638 -43771 -170167
17428a70167A19813A2299f4222C40757j6730j53306J47704A23780n1276Q0497
17418A53001K6815J62846o1793c2736B57792l3208R0614j09653l8142K3008o3579
17407A26832A9213e6464B31758b3610o2135l437H4211a00903A0926L60221a48162
17395D1088d3331B98693L6602k5264r5002K8489B728J92800e85B21457b0620l9522
17383f0142o1825A11625J07975C0089J54854K28563a42192A81931P2700j5665
17373B38966K04989B00565a41782A183K80875L0566M3221g3922G7281l3077a24614
17361A5730a24035A02880a19372A22657j6959J83529g0433F7290e1873A01821
17350C70281c2848B72996J02572a87103C1878a08053B7609J91767a18874c2833
$$ plain form
17428 -170167 119813 12299 -64222 340757 324027 170721 318425 123780 72504 153001
17418 153001 179816 342662 280869 -32736 257792 224584 315198 205545 167403 190411 126832
17407 126832 19213 -56464 231758 -23610 -85745 -89182 84211 -100903 10926 371147 -148162
17395 41088 -43331 298693 335295 310031 215029 243518 2728 195528 -585 221457 -20620 -60142
17383 -60142 -121967 111625 219600 30089 184943 413506 -142192 181931 254631 238966
17373 238966 443955 200565 -141782 1183 282058 312624 355845 -73922 77281 44204 -124614
17361 15730 -124035 102880 -119372 122657 105698 289227 -70433 67290 -51873 101821
17350 370281 -32848 272996 375568 -187103 31878 -108053 27609 219376 -118874 -32833
17339D13470L6634A41271J23500l8940I9156K2635C1746R6037K55316j27897F2921
17327a55342B12114P9248j07986H9844B7023L90820A21388e9352B68177n0958
17317B17219M4609i4815F7235K88804a65196E3978K1548M8112j052a20589c2150
17305I2079K98654E4648i247B49838k272E2340K13558f2226j58469A30351K23476
17294C53827A73699J9800J72658o0015O0327j06666I8082L43506j0856A52817
17283A45248A0429K22876A05889J48514K53531k48629E0222K10460c9136j1846
17273e0982F7103a30250B19133D2700M32585A38662c046E73760k03727a4914B5037
17261G7616J70080n640K46067a56998C7148c1421A12900R3800K47296j10418f314
$$ plain form
17339 413470 450104 141271 264771 225831 99156 121791 31746 127783 383099 255202 62921
17327 -155342 212114 291362 183376 89844 27023 417843 121388 -59352 268177 217219
17317 217219 261828 -94815 67235 356039 -165196 53978 75526 123638 122586 -120589 -32150
17305 92079 390733 54648 -9247 249838 247566 52340 265898 -62226 -220695 130351 353827
17294 353827 173699 193499 366157 306142 366469 259803 98082 441588 430732 152817
17283 145248 10429 233305 105889 254403 507934 259305 50222 260682 -39136 -50982
17273 -50982 67103 -130250 219133 42700 475285 138662 -3046 573760 370033 -14914 25037
17261 77616 247696 242056 488123 -156998 37148 -31421 112900 206700 453996 343578 -6314
17249C47479b30242c6643D4251b15517C73250a989D4401J02804b02660A75937
17238D9896N6995e0039B85888r4758J21235A51281R3914J35357a15664K2477B99200
17226h9401A88854P4684Q3557j04218m0110e6789B29580K54223A01140M0873K2616
17215A64629g1335B84960J1129P6738j81951p8102Q8269q7663N3919a5798C44643
17203B09301J08753m9598L61623C13438K58623A50528J53094J13544C3931N8067
17193I1998L58769n8480G4841J51621J7253J38974A38927N1603M8472G4439L16007
17182C90446A58339R2247J04196m9910b5535A54170m1427L50777d2100F5641J22450
17171A88091K2715L58345I1974J87015j03297Q6711C9127n919P24994B41280A7588
$$ plain form
17249 347479 -230242 -36643 44251 -215517 373250 -1989 44401 147205 -202660 175937
17238 49896 106891 -50039 285888 191130 312365 151281 245195 380552 -115664 -93187 299200
17226 -89401 188854 263538 347095 242877 202767 -56789 229580 483803 101140 142013 164629
17215 164629 -71335 284960 296089 372827 190876 112774 201043 113380 167299 -15798 344643
17203 209301 318054 268456 630079 313438 572061 150528 303622 417166 33931 91998
17193 91998 450767 392287 74841 226462 243715 382689 138927 190530 239002 74439 390446
17182 390446 158339 250586 354782 304872 -25535 154170 112743 463520 -42100 65641 188091
17171 188091 210806 569151 91974 278989 175692 262403 39127 33208 758202 241280 17588
17159D16139a88195D28912A39674J48055A22179l3667L29706j56169A20245J63921
17149B84166q7368b9651A52514J65329p7887J22899N0211k2850j81642Q1221P2084
17138C61879m7269J87972F1284J04162M6712J59888M0542A28925o880L56915P0775
17127E49735E6473c5110C60255l3464A59319J11184K54394A74570p1984J93412
17117B95998J829L12563A87081K00956K08972k05219A42415K35916k5016J12810
17107D66125A59286J69386j45703K12350Q9317Q7485A00138M48243A50791M31981
17097E82772J22532A7099N73021j43646J13109n9117L27672B73795j7934G1938
17086B60885K02703m9989j35213J40222K9126m2318A31286M75483J32447k12545
$$ plain form
17159 416139 -188195 428912 139674 287729 122179 88512 418218 262049 120245 284166
17149 284166 196798 -29651 152514 317843 239956 362855 413066 390216 208574 289795 361879
17138 361879 314610 502582 61284 165446 212158 372046 412588 128925 122045 478960 549735
17127 549735 56473 -35110 360255 326791 159319 270503 524897 174570 102586 295998
17117 295998 297827 610390 187081 388037 597009 391790 142415 378331 353315 466125
17107 466125 159286 328672 182969 395319 484636 572121 100138 548381 150791 582772
17097 582772 705304 17099 590120 446474 559583 500466 828138 273795 255861 71938
17086 260885 463588 413599 278386 418608 447734 405416 131286 606769 739216 526671
17076E26671j18134A39150L83710q801A51292L37767L73909B90300J38200N7497
17066D85997J92929k04960J56030k84185j00925K63381M1090j25122o7828R5962
17056D52369N20584m75579j75555I4369K63337N2743A43734N16463k34754r2488
17046C32955K51364j68352K40803l9578k652K55593C83335q3345P0992j26270
17036B44712K15778J0011K73175B08428M37859j99096j34822L22278A54629M42225
17026E96854j20582O4325L7135q190k65641L37646K6018C15470P5554R7639J61906
17015F50569J31858j35562j90779K56346r4160j09066j05537L32374K7922l7366
17005G26599j60526O1449L34185D52298M24639k79664K83749j21645k73169N4974
$$ plain form
17076 526671 408537 139150 522860 514059 151292 489059 862968 290300 428500 485997
17066 485997 678926 473966 629996 345811 244886 508267 549357 424235 356407 452369
17056 452369 972953 497374 321819 94369 357706 410449 143734 660197 425443 332955
17046 332955 584319 415967 656770 617192 614540 870133 383335 299990 370982 244712
17036 244712 460490 470501 743676 208428 646287 447191 312369 634647 154629 596854
17026 596854 476272 540597 577732 569542 303901 641547 667565 315470 391024 488663 650569
17015 650569 782427 646865 456086 712432 618272 509206 403669 736043 763965 726599
17005 726599 566073 627522 961707 452298 876937 597273 881022 759377 486208 541182
16995E41182j05095K21772k43643K15462L55185j1526C43164L11556K07455p6029
16985G86146o755m854l2449l7422l5657j12331N44153l32647J63449j50892Q6204
16974H66945J82675k41680j5681O4684j01743B12751N07149L26890Q1661l24999
16964H03452J88186j78036P7744q0883L87395l51611K6007K49037l41744K11142
16954I90689n4571J41788j53070L76621m68478j94813M34890k43911J58862k63994
16944G24013K06758K12090J13309p7871p6895j77775j18112N00756m74670N24895
16934A356498k25413J02513o0670M4845m6554P2862L15665n94623M71370j73984
16924A262509k28836M37736j10937j88263L41876j83211N1083J3868L9864j74394
$$ plain form
16995 541182 436087 657859 414216 629678 984863 973337 343164 654720 862175 786146
16985 786146 779391 774537 742088 704666 669009 556678 1100831 768184 931633 780741 866945
16974 866945 1049620 807940 792259 856943 755200 212751 719900 1046790 1128451 803452
16964 803452 991638 813602 891346 810463 1197858 846247 872254 1121291 779547 990689
16954 990689 936118 1077906 924836 1301457 832979 638166 1073056 829145 988007 724013
16944 724013 930771 1142861 1256170 1178299 1101404 923629 805517 1306273 831603 1356498
16934 1356498 1131085 1233598 1172928 1217773 1171219 1244081 1559746 965123 1436493 1262509
16924 1262509 1033673 1471409 1360472 1172209 1514085 1330874 1381957 1395825 1435689 1261295
16914A261295j82993M44332K10044m31384J84233K07043k44590J17482k72753
16905A292709N46829j48639n5256M27741n74202L28494l60263K16071J8413l63530
16895A328367N93973K2721K4582l87544K99498q6757K59377l35230J58944p7996
16885A799935K94972m13357M49914J37022l00454M30964k24897N8267l08689M4202
16875A967879J38906K33942J10330k60057K04737o7704J40230k34845l32769K41511
16865B142160K80750j62117M62754J06167m8380l46757p842m5857N71026J31215
16855C083119j87727P6961k30169M40352j49102J38001j85566K98889j92278K12561
16845C305041J61274p2772o6249K48563k20635Q7884J25864n3221K20024L62693
$$ plain form
16914 1261295 1078302 1522634 1732678 1301294 1485527 1692570 1447980 1565462 1292709
16905 1292709 1839538 1690899 1635643 2063384 1489182 1817676 1457413 1673484 1691897 1328367
16895 1328367 1922340 1945061 1969643 1582099 1881597 1794840 2054217 1718987 1877931 1799935
16885 1799935 2094907 1681550 2131464 2268486 1968032 2398996 2174099 2232366 1923677 1967879
16875 1967879 2106785 2340727 2451057 2191000 2395737 2328033 2468263 2233418 1900649 2142160
16865 2142160 2422910 2260793 2723547 2829714 2781334 2434577 2426735 2380878 2951904 3083119
16855 3083119 2895392 2972353 2742184 3182536 3033434 3171435 2985869 3284758 3092480 3305041
16845 3305041 3466315 3393543 3327294 3575857 3355222 3443106 3568970 3515749 3735773 4098466
16835D098466l03003Q7669J07023M5044m3238N6858K25330m3226J64083K2992
16825D417998k92944N39948P9233K77388n1534J04147m2808L79183n2679m6279
16815E311653L05086K36345j58540M17934k05199J51397L39786q4116K67698K26322
16805F808366R4520P3260J89665m772P91746r5981l15165N63696J30359K9847
16795H265541L59860J12922M34815M81016j88998K91624N13473J97731K70568
16786A0738552J92304M10099R2316Q09546J83877r8141O64986L12715L46659L09650
16776A3962563N03719O12590N53101L12231O23070O55580K28959O24769R28296
16767A9004878K37469R08698Q04204M81667J206093P89891P81475R15064J291047
$$ plain form
16835 4098466 3795463 3883132 3990155 4035199 3991961 4048819 4274149 4230923 4395006 4417998
16825 4417998 4125054 4665002 4744235 5021623 4970089 5074236 5031428 5410611 5357932 5311653
16815 5311653 5616739 5853084 5694544 6112478 5907279 6058676 6398462 6314346 6582044 6808366
16805 6808366 6902886 6976146 7165811 7161039 7952785 7856804 7541639 8105335 8235694 8265541
16795 8265541 8625401 8738323 9173138 9654154 9465156 9756780 10270253 10467984 10738552
16786 10738552 10930856 11340955 11433271 12242817 12426694 12328553 12993539 13306254 13652913 13962563
16776 13962563 14466282 15078872 15631973 15944204 16567274 17222854 17451813 18076582 19004878
16767 19004878 19242347 20151045 20955249 21436916 22643009 23432900 24214375 25129439 26420486
16758B6420486J130625J326776P36172J785256J158452J000731J934104J381583
16750C6874185J833906J922601K061837K010891K332433K441764K482763K861628
16742E4822008L095420K809820L289075L574475L929761M069424M237597M835711
16734H4663291N376142N243351N051874O348415O211303O390006O773914P144265
16726A33202561O909847O676511O661424O901724O018675N783537M455892M091562
16718A80701733K328756J878958L55658q93679j753994l207771m399201n180724
16710A69829736n428303o503713o369314p171770p004692p455593o935161o804386
16702A16156804o310849o447822n964510n702318n246557n238375m786483m585718
$$ plain form
16758 26420486 27551111 28877887 29614059 31399315 32557767 33558498 35492602 36874185
16750 36874185 38708091 40630692 42692529 44703420 47035853 49477617 51960380 54822008
16742 54822008 57917428 60727248 64016323 67590798 71520559 75589983 79827580 84663291
16734 84663291 90039433 95282784 100334658 106683073 112894376 119284382 126058296 133202561
16726 133202561 140112408 146788919 153450343 160352067 166370742 172154279 176610171 180701733
16718 180701733 183030489 184909447 185265105 184371426 182617432 179409661 175010460 169829736
16710 169829736 164401433 157897720 151528406 144356636 137351944 129896351 122961190 116156804
16702 116156804 109845955 103398133 97433623 91731305 86484748 81246373 76459890 71874172
16694G1874172m030297l842875l129689l524385l264077k933042k699591k414752
16686D6035464k157455k428152j897094j966816j667889j861410j354109j910578
16678C0791961j255775j123663j093471j056484j330415q28488j165769q98200
16670B2039696q82204o04400r72843o15164n22488r46714o85220j93187q17420
16661A5800056q79739K57481q59426p39531k73665k56019o1095m02391p23384
16652A1862287m00237k47039n16664j20720l11568j72653l24791j38076n59010
16643I071529p1079k77312q0644l33677j47165k66597j21885j70617l80284l9639
16633G182630l77378n72357L38033M8266k84047k50416j39587k09836m8782l23635
$$ plain form
16694 71874172 67843875 64001000 60871311 57346926 54082849 51149807 48450216 46035464
16686 46035464 43878009 41449857 39552763 37585947 35918058 34056648 32702539 30791961
16678 30791961 29536186 28412523 27319052 26262568 24932153 24103665 22937896 22039696
16670 22039696 21157492 20553092 19580249 18965085 18442597 17495883 16810663 16617476 15800056
16661 15800056 14920317 15177798 14318372 13578841 13305176 13049157 12988062 12585671 11862287
16652 11862287 11462050 11215011 10698347 10577627 10266059 10093406 9768615 9630539 9071529
16643 9071529 9000450 8723138 8642494 8308817 8161652 7895055 7773170 7602553 7222269 7182630
16633 7182630 6805252 6232895 6570928 6619194 6335147 6084731 5945144 5735308 5686526 5362891
16623E362891J45952m1082k4821k08385k74399J87553m22682l9711K5554j9675
16613D691195p7760j17314L1074l13153n751k36766P6169j02708J05892q3889
16603C966989j73826k34075K18166j76352n01099M62901m2536k84189n6162J57311
16593C337128k90141k97013L56686J99771l69336J6896m9320J3651J47897L0845
16583C097064l25720r1765M745J6921j04319n8383j95530K22442m7258k96867
16573B221330J1042J48164l24980J11642j01098P4515k25254M50529l95843k40342
16563A729705L39897J95253k20620j46984l886j36594l7535j38210L8090p8790
16553A540326J62493J78216m00221K61776m47860K25215N7020l41601L85378J08427
$$ plain form
16623 5362891 5508843 5467761 5442940 5234555 4960156 5147709 4725027 4685316 4710870 4691195
16613 4691195 4613435 4496121 4527195 4214042 4208291 3971525 4047694 3944986 4050878 3966989
16603 3966989 3793163 3559088 3777254 3600902 3099803 3562704 3520168 3235979 3179817 3337128
16593 3337128 3046987 2749974 3106660 3306431 2937095 2953991 2904671 2918322 3066219 3097064
16583 3097064 2771344 2679579 2684324 2701245 2596926 2538543 2343013 2565455 2518197 2221330
16573 2221330 2232372 2380536 2055556 2167198 2066100 2140615 1915361 2365890 1970047 1729705
16563 1729705 2069602 2264855 2044235 1897251 1893365 1756771 1719236 1581026 1619116 1540326
16553 1540326 1702819 1881035 1480814 1742590 1294730 1519945 1576965 1235364 1620742 1729169
16543A729169l29034j83654K83575j14929J17196k11298J46531j1205l3200K32378
16533A625529l10427k59110J71589P4797J14745l97641L38625l95174N07723k81452
16523A189204L5717L66307l95766J10249m97475P55811n59414J31374K8243m9360
16513A114890n5854J72188q9341j45381L97107l45658N8600j26180K53043k72494
16503I60920J91811k24861j193j33850M139K27071j49383L38037l56371K12983
16493A069303M8959m42913L21850k23345q1681N80980l52452J33623l26425M8217
16483G76116L04612j05263R1951j87915Q1487r7343J98215K39115F43939N64659
16473A208598l14198R4924j13878J17863k5769l03322J66508k92321M2231R1578
$$ plain form
16543 1729169 1400135 1216481 1500056 1385127 1502323 1291025 1437556 1426351 1393151 1625529
16533 1625529 1315102 1055992 1227581 1302378 1417123 1019482 1358107 962933 1470656 1189204
16523 1189204 1224921 1591228 1195462 1305711 808236 1564047 1004633 1136007 1164250 1114890
16513 1114890 1059036 1231224 1141883 996502 1393609 1047951 1106551 980371 1233414 960920
16503 960920 1152731 927870 926677 792827 796966 1024037 874654 1212691 856320 1069303
16493 1069303 1118262 675349 997199 773854 692173 1273153 920701 1054324 727899 776116
16483 776116 1080728 975465 1067416 879501 960988 863645 1061860 1300975 643939 1208598
16473 1208598 894400 989324 875446 993309 967540 664218 830726 538405 580636 672214
16463F72214k91158M77790j81188o2489K0446L15932D07348K16980J73628k21706
16453E76250L11037k7920n1664k55186L9745n2686k26511L03272O2327k42595
16443D36069K05873j2944j82655M14478j13478K38919l90359p834k64521J42561
16433D66109M13274J30305l06547m4669j9323A67707K72330R1761M6297K02258
16423G80353C63662K94778j33564L5917n6486J27493j2212M51230n07836n5556
16413E07426M0002A95327K94604j45651q8992O35668m05017L31535B71012J63249
16403D34261L2543J85355B91804l9828L38746j90039R4375J46286m2582l457o9468
16392E25837j46811J06654K27549j60430j12362P9454L5802k26376L1707J37768
$$ plain form
16463 672214 381056 858846 677658 615169 635615 951547 407348 624328 797956 576250
16453 576250 887287 859367 807703 552517 592262 539576 313065 616337 678664 436069
16443 436069 641942 628998 446343 860821 747343 986262 595903 588069 323548 466109
16433 466109 879383 1009688 703141 658472 639149 167707 440037 531798 578095 780353
16423 780353 363662 658440 524876 560793 504307 631800 619588 1070818 562982 507426
16413 507426 547428 195327 489931 344280 255288 890956 485939 817474 271012 434261
16403 434261 466804 652159 291804 251976 590722 400683 495058 641344 598762 595305 525837
16392 525837 379026 485680 713229 552799 440437 519891 555693 329317 361024 498792
16382D98792j11367J76917n8660m5805j42316J21863J94441k05432j13211q501
16372C06721J38474K6038o8434K43666a5855D19084m8023J28360k9297o7490j11182
16361B91452j30403K96034j68464N1778j17914p5781O35299C00472P369j30984
16351A76857P6590J19267l2395J59288J15753k21593j11073k4850l3082J09454
16341C34216k355b01657C70809q3447J13036J28390d1959D13250B02000q9769
16331A12231K82247j56516K13146A10794K80163L8165B01607G2694J56545J95591
16321D24830p8866F7260M90021A38152L31201n6622A88646K47071J50547j96350
16311C89914j84587J36998K436K8455j69824R5711G111J98053J52168f7856E2655
$$ plain form
16382 498792 387425 564342 505682 459877 317561 439424 633865 428433 315222 306721
16372 306721 445195 471233 402799 646465 -15855 419084 371061 499421 470124 402634 291452
16361 291452 161049 457083 288619 340397 222483 146702 782001 300472 307841 176857
16351 176857 253447 372714 340319 499607 615360 393767 282694 257844 224762 334216
16341 334216 331861 -201657 370809 287362 400398 528788 -41959 413250 202000 112231
16331 112231 394478 237962 451108 110794 390957 429122 201607 72694 229239 424830
16321 424830 345964 67260 557281 138152 469353 412731 188646 435717 586264 389914
16311 389914 205327 342325 344761 373216 203392 299103 7111 205164 357332 -67856 52655
16299G4795K98547J94550r3314k30994o8319h4469E14124B15267J2448J25102
16289C52817Q9720J1234F0057K0793l9834L54699f1357B37367o4641O2253Q4750
16278C19729A33397j2851J62115n3379b4849A98402K41919H0536j495O2320n2532
16267H8829K42875a25768A43121J93886a9542A16218a23531M5602B31211K71988
16257E03199B36726j3554J99905B00489P3173L3898j1777J71633A35821g0009
16246C36189j28785f5323A23632a335m2995B70458I2786D4952M11325m207k11388
16235B40682E6699L04j5133B125L35770j68007E9005Q33j2595K76339K7973a53864
16222A12533L21266A07163J53008A15046P0917K31419A44607a8967E9892L1767
$$ plain form
16299 74795 373342 567892 474578 243584 175265 -84469 514124 215267 227715 352817
16289 352817 442537 453771 60057 80850 41016 395715 -61357 237367 172726 234979 319729
16278 319729 133397 120546 282661 229282 -24849 198402 440321 80536 79041 141361 88829
16267 88829 331704 -125768 143121 337007 -19542 116218 -123531 -77929 231211 503199
16257 503199 236726 223172 423077 200489 273662 307560 295783 467416 135821 -70009
16246 336189 207404 -65323 123632 -1335 -44330 270458 92786 44952 456277 452070 240682
16235 240682 56699 57003 41870 2125 337895 169888 59005 59838 47243 323582 351555 -153864
16222 112533 433799 107163 260171 115046 185963 417382 144607 -18967 59892 91659
16212I1659J59849p5617L32253j96572M070j07322F5763a19204A08797K89740
16202C98537E5765R2537F3387R5196c9311G3180R7146P4902b06294E5573a82298
16190C28939q9683J78154a17593d6994k1419A36789C2099a15775D43845i1008
16179e8909B83012b0432B61712C3851b40438B8112K13596N5359H7515C2652a66858
16167H1213a98330B17465m034H0145a39189B51813H9305m0574K13741A01312c01288
16155F3806b35381A1296K44740J30195k1132b89737A36613L0627b24426A02118
16144B36801b10805J01237D02206A45198B7375J92049n408A03692A4765K85727
16134C00492m9514h2866A1071a87558O4041B11268b7403A31907O1673a2258J32
$$ plain form
16212 91659 251508 175891 508144 311572 315642 208320 65763 -119204 108797 398537
16202 398537 55765 148302 63387 158583 -39311 73180 170326 245228 -206294 55573 -182298
16190 328939 239256 417410 -117593 -46994 -68413 136789 32099 -115775 443845 -91008
16179 -58909 283012 -20432 261712 33851 -240438 28112 241708 297067 87515 32652 -166858
16167 81213 -198330 217465 213431 80145 -139189 251813 89305 48731 262472 101312 -301288
16155 63806 -235381 11296 256036 386231 365099 -289737 136613 167240 -224426 102118
16144 236801 -210805 -109568 402206 145198 27375 219424 214016 103692 14765 300492
16134 300492 250978 -82866 11071 -187558 -123517 211268 -27403 131907 193580 -12258 -12126
16123a2126f99C82764j39658E1871g0775l9444A52298d9764M509j22289H5838
16111A12519m6308f397B3535J00627R2379C8725a81788j8481A26447C474J88614
16100A92088J33265A49213b59279F5822K28870D3888L23292a34980C2758b60282
16089A66909h667B98382h010B7162d1453J8589A4451f5306R782a0477A13939K95836
16077D09775B9970J87193N0550c80613b5117C59876j73144q7415a89036i0261
16066A68459E0705b06469P0371k5149A70190a65314H7372P608l3853b3031B79994
16054A29596K4225B9026g9839r1853b1021k42454I4423a91544D1486c12143f567
16042b86293b8883r5304b3655A15676a91644L9469d6498A92997o1769J25869a5733
$$ plain form
16123 -12126 -699 382764 243106 51871 -70775 -110219 152298 -49764 -45255 -167544 85838
16111 112519 66211 -6397 23535 124162 216541 38725 -181788 -200269 126447 3474 192088
16100 192088 325353 149213 -259279 65822 294692 43888 367180 -134980 32758 -260282
16089 166909 -8667 298382 -8010 27162 -41453 -22864 14451 -65306 -55524 -10477 113939 409775
16077 409775 29970 217163 267713 -380613 -25117 359876 186732 99317 -189036 -90261
16066 168459 50705 -206469 -136098 -161247 170190 -165314 87372 94980 61127 -23031 279994
16054 129596 153821 29026 -79839 -171692 -21021 -263475 94423 -191544 41486 -312143 -6567
16042 -286293 -28883 -124187 -23655 115676 -191644 -152175 -46498 192997 131228 257097 -15733
16030b19304A42284e5761C1901J76784i0669A8578M1651O3605c6535A13965a0335
16018a16017K2456H0551Q1554c80598B44090a39506n4585F1963a77299e8173F6108
16006a30156G6523a73218B95468g7831j21189m5323E9818b93695H7336K86036
15996C73372b22064D9578b48610I9932C0978J03305a13722j32540C0707c46269
15985A8508J97346B7961a45367E9485j4372h5084E6091e6720B5221g1087A63382
15973a5828l53545b5587k81784j678P6730d9618A51134R7200A6397K6706J42100
15962A85203o5443a33931G7009p236N3227K7831K4318g9563A01043a38063d8012
15950A70375J38R2578h591j01721A4084a64041c722o5783k40351o0399a83222
$$ plain form
16030 -219304 142284 -55761 31901 208685 -90669 18578 60229 123834 -36535 113965 -10335
16018 -116017 -93561 80551 162105 -380598 244090 -139506 -194091 61963 -177299 -58173 66108
16006 -130156 76523 -173218 295468 -77831 -199020 -244343 59818 -293695 87336 373372
15996 373372 -222064 49578 -248610 99932 30978 134283 -113722 -246262 30707 -346269
15985 18508 215854 27961 -145367 59485 45113 -85084 56091 -56720 25221 -71087 163382
15973 -15828 -369373 -25587 -307371 -309049 -232319 -49618 151134 248334 16397 43103 185203
15962 185203 119760 -133931 77009 69773 123000 150831 175149 -79563 101043 -138063 -48012
15950 170375 170513 263091 -8591 -110312 14084 -164041 -3722 -69505 -309856 -370255 -183222
15938c3455B8538K1565J58515G9064g6276l24094J77698B09524i3817D408d7473
15926B35823b13533i0605B40858D4338b21129i9267G9325k0591J65181F4133A3939
15914a16960j4512m4288M2698j90462A22379M7897c2259k44496F1880O7452g0859
15902a51403L7978A16106a39422K7360J6508A43591E7651a72228I4076b50340
15891b95779A27281a96558F6465a0544G1375b33259A1141D965O44c12078a33375
15879d2653p0484l2499r0102A50219i5986k40007A45126R577a15114g095m55505
15868d62600a19934A23410h8467q676l24086R3593C26680I9678b25125j57105
15858c82230H5032k9860a1305n1276F1783d2185B92251a16054j05117A8731P8758
$$ plain form
15938 -33455 28538 50103 208618 79064 -76276 -400370 -222672 209524 -93817 4408 -47473
15926 235823 -213533 -90605 240858 44338 -221129 -99267 79325 58734 223915 64133 13939
15914 -116960 -131472 -175760 -133062 -323524 122379 170276 -32259 -276755 61880 129332 -70859
15902 -151403 -113425 116106 -139422 -112062 -95554 143591 57651 -172228 94076 -250340
15891 -295779 127281 -196558 66465 -10544 71375 -233259 11141 4965 5609 -312078 -133375
15879 -42653 -113137 -145636 -235738 150219 -95986 -335993 145126 154703 -115114 -7095 -462600
15868 -462600 -119934 123410 -88467 -97143 -421229 -327636 326680 99678 -225125 -382230
15858 -382230 85032 55172 -11305 -62581 61783 -42185 292251 -116054 -221171 18731 97489
15847I7489a08853j12898K3710f7945B59649j08165a36469j24670e1740j46351
15837a98091B12952c2761I1344J75282h5844A35360a51911B9503P706g1788q480
15826h0268j81296C631J5385K85292C3211K65061i4897L6739m946j88266i1866
15814B27383a9484o8916C1072a01393A11091d61716A81587b71208Q3351j56483
15804c44340A9071H323c32644b0009A42960B293d2261k96040N6114a11226b6601
15792i573A27147a69986h1793p663F4085L4595D3084c64040a51516c3069q8552
15781a21621D8920M2507k5304a8093j35671I7922J22900j09115c56281a06067
15770H2070Q1794l8255b14132A41514N4089a94710C09090a83850d9996n2416B7139
$$ plain form
15847 97489 -108853 -221751 -198041 -67945 259649 151484 -136469 -261139 -51740 -198091
15837 -198091 212952 -32761 91344 266626 -85844 135360 -151911 29503 37209 -71788 -80268
15826 -80268 -261564 3631 19016 304308 33211 298272 -94897 -58158 -63104 -251370 -91866
15814 227383 -19484 -88400 31072 -101393 111091 -461716 181587 -271208 -187857 -344340
15804 -344340 19071 8323 -332644 -20009 142960 2293 -42261 -338301 -282187 -111226 -26601
15792 -9573 127147 -169986 -81793 -89456 64085 98680 43084 -364040 -151516 -33069 -121621
15781 -121621 48920 91427 66123 -18093 -153764 97922 220822 111707 -356281 -106067
15770 82070 163864 125609 -214132 141514 195603 -194710 309090 -183850 -49996 -102412 27139
15758f9143I3840b7245n9580j22556A19017a88833A80043H101c13249A46838a9559
15746A69949c58934H1435K69527b57547e3109G187c10410a47275j6169E5467f6251
15734e2071A2304Q548M7283c8430l91930a26894c4880C10085A33635F4403c06540
15722i1131l1877A94819c40067i5342d1575A12318e6230g118n0606k11247C6311
15710a40183a3995k45786F99J51239a49230A49022b69877o5803o3702c7599H9961
15698a8618j50429A83229a01087p2831N3981j51246C1666a84775C1680c51973
15687h1994B5321b95624A97199b22813A20792i2364k11967A65173a09752A24555
15676A45734a48163e1839D81272f9582G4151i4547l4886A20931b07039A28223
$$ plain form
15758 -69143 93840 -27245 -86825 -209381 119017 -188833 180043 8101 -313249 146838 -19559
15746 169949 -358934 81435 350962 -257547 -53109 7187 -310410 -147275 -163444 55467 -66251
15734 -52071 12304 20852 68135 -38430 -430360 -126894 -34880 310085 133635 64403 -306540
15722 -91131 -123008 194819 -340067 -95342 -41575 112318 -56230 -7118 -57724 -268971 36311
15710 -140183 -13995 -259781 699 151938 -149230 149022 -269877 -335680 -399382 -37599 89961
15698 -18618 -169047 183229 -101087 -173918 -119937 -271183 31666 -184775 31680 -351973
15687 -81994 25321 -295624 197199 -222813 120792 -92364 -304331 165173 -109752 124555
15676 145734 -148163 -51839 481272 -69582 74151 -94547 -129433 120931 -207039 128223
15665e4321l77992h5605B4344c03591A67565F0476J32598f0950D3721O162a16729
15653a21659j77570A5865J96518E9386R7961p1462c78441h8104B34358a64341
15642e0179I3862J4098a18150e6433j56938A5654a88446B42521d8359l46608F2883
15630d90279H0022b124k73412i2069A80662g5927c0928D1408d3615G4061O368
15619H0429J87054b44883R8775L6262J1719p6073h4568k60803A50756A4607g1202
15607f7059q0816A05122l8090a37453I2211g7142B8481A0752a13279d7599l09847
15596c57446j4703j09583a71125l8640Q3876a2792A08265J22533O783G268P9819
15585H7087a06369L3640k94382A36914a3825k49037A64104F8324J7125a06726
$$ plain form
15665 -54321 -432313 -85605 24344 -303591 167565 60476 193074 -60950 43721 49883 -116729
15653 -121659 -299229 15865 212383 59386 157347 85885 -378441 -88104 234358 -164341
15642 -50179 93862 107960 -118150 -56433 -213371 15654 -188446 242521 -48359 -394967 62883
15630 -490279 80022 -2124 -275536 -92069 180662 -75927 -30928 41408 -43615 74061 80429
15619 80429 267483 -244883 -146108 -109846 -98127 -174200 -84568 -345371 150756 14607 -71202
15607 -67059 -147875 105122 67032 -137453 92211 -77142 28481 10752 -113279 -47599 -357446
15596 -357446 -372149 -481732 -171125 -209765 -125889 -12792 108265 230798 237581 7268 87087
15585 87087 -106369 -72729 -367111 136914 -13825 -262862 164104 68324 85449 -106726
15574A68070e117j58501q6539C8609g7113o4257r5394P4362F1002c9326j69935
15563b09261Q8498C40642g9318K9873C21550b51732G6319b98306f1015c0310A6632
15551b05729i4037A35488b1758j18741B07276e9825I9687D6023M9090a74719N9305
15540a15414A9690d49542A54208a82244A02320M1430a87799O6707D8005c13552
15529d4241h215C3755M41K33265c6259j07629C8871J52770H7293b4613A14161
15517a51074A56089f5474A29134b13538b6699l86387A25395J12655e7207B11875
15506a46234D4345J8676c27792C39268B6358a77067c6064j20567o2555a07314
15495B08201o1895b65786Q5713G2191R84J36587c84288A77222H1510k6080a8168
$$ plain form
15574 168070 -5117 -163618 -250157 38609 -77113 -141370 -236764 -162402 61002 -39326 -209261
15563 -209261 -120763 340642 -79318 -49445 321550 -251732 76319 -298306 -61015 -30310 16632
15551 -205729 -94037 135488 -21758 -140499 207276 -59825 99687 46023 95113 -174719 -115414
15540 -115414 19690 -449542 154208 -182244 102320 143750 -187799 -121092 48005 -313552
15529 -44241 -8215 33755 34196 267461 -36259 -143888 38871 191641 87293 -24613 114161
15517 -151074 156089 -65474 129134 -213538 -26699 -413086 125395 238050 -57207 211875
15506 -146234 44345 63021 -327792 339268 26358 -177067 -36064 -156631 -219186 -107314
15495 208201 146306 -265786 -180073 72191 73175 209762 -384288 177222 81510 55430 -18168
15483A27716c5766G9593l4315j7632b9347G2475h829a465C3195a48235I6944J22173
15471B19117j06495A4010a48069B58052B0082e18348a2547A94654a58632E6002
15460C23311d01358B52393C9418K19533R59a57877G3911b37257j60269e7639D575
15448B43533D7381b5508k07183B9359c3110k1218F8775a54756e6044A22213B9453
15436a54067F3195J61996j04488d581F4985b9482M745j2385n5065j19915g6666
15424c23572G3337a38099C11218b89793Q7131R0519j18885d1757k02103L6009
15414b07851B96696a11725r7452A02845j9828j3535a54273F8954a00699K5581
15404g5118H4308L25332A8248e2856j59301E6456A1215J95742a23314A02827l7191
$$ plain form
15483 127716 -35766 79593 45278 27646 -29347 72475 -8829 -1465 33195 -148235 96944 219117
15471 219117 112622 14010 -148069 258052 20082 -518348 -12547 194654 -158632 56002
15460 323311 -401358 252393 39418 258951 259910 -157877 73911 -237257 -397526 -57639 4575
15448 243533 47381 -25508 -232691 29359 -33110 -54328 68775 -154756 -56044 122213 29453
15436 -154067 63195 225191 120703 -4581 64985 -29482 -24737 -37122 -92187 -212102 -76666
15424 -323572 73337 -138099 311218 -289793 -202662 -112143 -231028 -41757 -243860 -207851
15414 -207851 296696 -111725 -209177 102845 83017 69482 -154273 68954 -100699 -75118
15404 -75118 84308 409640 18248 -52856 -212157 56456 11215 206957 -123314 102827 65636
15393F5636a24097a1028k54607H8314K04326E5592e3927A4487a64608r5779J03025
15382a57362c6435j16068A25689M5850l6684n7805J09428e2998A5672c0547j05399
15371a35946C94859b0560l9374E7863f2436e922l28515A54447k5977b6063A13524
15359b52755D3054J00758J5862a62095A34829b57345B78264A03002J23760a13826
15348a0099r7846A32517f3584I9008L52900A98410h7818j82601a01984J53E5956
15336g3867o5608j75425C55068l4419E3848b29889i7665M4009A15771d39480F4181
15324B01243G6289b18871B21922a69261f2802B2370c8857A45102c3158A4976c0580
15312B40077J06580E5448b36234A52370J86750A64992a00953M4217k1580F3186
$$ plain form
15393 65636 -124097 -11028 -265635 88314 292640 55592 -53927 14487 -164608 -260387 -157362
15382 -157362 -36435 -152503 125689 171539 134855 77050 186478 -52998 15672 -30547 -135946
15371 -135946 394859 -20560 -59934 57863 -62436 -5922 -334437 154447 128470 -26063 113524
15359 -252755 43054 143812 159674 -162095 134829 -257345 278264 103002 226762 -113826
15348 -10099 -107945 132517 -63584 99008 451908 198410 -87818 -270419 -101984 -101831 55956
15336 -73867 -139475 -314900 355068 320649 53848 -229889 -97665 -53656 115771 -439480 64181
15324 201243 76289 -218871 221922 -169261 -62802 22370 -38857 145102 -33158 14976 -30580
15312 240077 346657 55448 -236234 152370 339120 164992 -100953 -56736 -78316 63186
15301b15664A09523d8623C06489C3050i0587a156j97636B3127K50936g6914c1225
15289b55146b3771A9814J62371k0297L1729J6117a06317A0811J19806J29710b85067
15277B45641A2440J95453A348c296D0022i7395E5857J72781r9476F452f0882J0369
15265e0513o799A76728f4275j40872N3723K5329F3497J01273a30088B73582l7106
15254B36476F2479g4380K8209B02568J23721j35850J024065O19027j70877L23038
15244A985692l87420E94919k80260n9771m8668E9986M6538C4173d1369j46889
15234a88258B31509i0507F7797j4504a93832B10183H6205j5033K14637j04080
15224A81729E0085J31144N3798b09159C3158J86983K1300j17812f2039E39015
$$ plain form
15301 -215664 109523 -48623 306489 33050 -90587 -1156 -198792 23127 274063 -76914 -31225
15289 -255146 -23771 19814 182185 161888 193617 209734 -106317 10811 130617 260327 -285067
15277 245641 12440 207893 1348 -3296 40022 -97395 55857 228638 129162 6452 -60882 -50513
15265 -50513 -57312 176728 -64275 -205147 -151424 -126095 63497 164770 -130088 273582 236476
15254 236476 62479 -74380 -46171 202568 326289 190439 1214504 1833531 1662654 1985692
15244 1985692 1598272 594919 314659 254888 206220 59986 106524 34173 -41369 -188258
15234 -188258 231509 -90507 67797 53293 -193832 210183 86205 71172 285809 181729
15224 181729 50085 181229 235027 -209159 33158 220141 241441 123629 -62039 539015
15213g8453D4705K93374j17284K5966Q6279q4649A08110a20755a4434A77255F9448
15201d08960A83036I0619B9709J85361b44609B92012f9193B19717a23800C885
15190F9071h1520b9077A64947f808I3047c62219e7023p8923A90278D8119A8457
15178B39714E6550J6332b46545H7714k9245J05529c3152C00666F3259A3225J08461
15167A21686J4041A0245a28501G9989O9632N70005B42792A14435J22188n3389
15157A83234g14o5244A12585R6739G8910a20628B61853h2220B58594b4613B45756
15145H2841J52678B4887K04716c31419C64432j32419j15124n1700e3063C03491
15134A4032b6877A66211b44186g844j23327c4253C63308A54288a07151I6903J14327
$$ plain form
15213 -78453 44705 338079 220795 246761 333040 248391 108110 -120755 -14434 177255 69448
15201 -408960 183036 90619 29709 215070 -244609 292012 -69193 219717 -123800 3885
15190 69071 -81520 -29077 164947 -6808 93047 -362219 -57023 -135946 190278 48119 18457
15178 239714 56550 72882 -246545 87714 58469 163998 -33152 300666 63259 13225 121686
15167 121686 135727 10245 -128501 79989 149621 719626 242792 114435 236623 183234
15157 183234 -714 -65958 112585 209324 78910 -120628 261853 -82220 258594 -24613 245756
15145 82841 235519 24887 229603 -331419 364432 232013 116889 65189 -53063 303491
15134 14032 -26877 166211 -244186 -7844 -131171 -34253 363308 154288 -107151 96903 211230
15123B11230g2772D04614n5228j38455b2912E47096B64233A2927c29755A39274
15112I2427J05293E2092M40006A0770a5958C27549a73371A84158b5284A36284
15101h3059B09882d6658A96710L7407b37692B20493g6048F4641J09168K26115
15091C99924e198B26204j0153D6652K38325H9014R258J43093L3191O4456A19024
15079A28972o3018a18869D64835A89554i0966G3122B7889a05269a3362j19634
15069a32996I87a47529A53290e5173A11592A6494K53108H0262a51094B0093a9982
15057B60391a42748E0607M1977B8526P2077J62843e9548i38k24735C43000m2537
15046C00463Q3261a7464B95539C0949M4039f7190j31007B30764K43474e380A05307
$$ plain form
15123 211230 -72772 404614 349386 210931 -22912 547096 264233 12927 -329755 139274
15112 92427 197720 52092 492098 10770 -15958 327549 -173371 184158 -25284 136284
15101 -83059 209882 -46658 196710 234117 -237692 220493 -76048 64641 173809 399924
15091 399924 -5198 226204 216051 46652 284977 89014 98272 241365 274556 339012 119024
15079 128972 65954 -118869 464835 189554 -90966 73122 27889 -105269 -13362 -132996
15069 -132996 987 -147529 153290 -55173 111592 16494 269602 80262 -151094 20093 -19982
15057 260391 -142748 50607 92584 28526 100603 263446 -59548 -938 -225673 343000 300463
15046 300463 383724 -17464 295539 30949 74988 -67190 -198197 230764 474238 -5380 105307
15034A39500J9049B2721K76894j12930J85920a05469I5556k9744k7228D279K77770
15023B82049A1677O00581B14477j2009R4659A27045F1181K95021R827m7453A43146
15011I233K12720J65700b7472H314K7509J71110c731A42728l8779R7328g5949
14999B38331o3206D8737j5669a71356G4915M49122A85165m6487J45260L86158
14989F70096k02536k17240H7276M33814A32352h3213C53136A04011R1209L00804
14979D96024m5841m403A05459J47038m6276K2940a04846D3144K90228q5600L8358
14968B86130P705A19079k9106L2304R094K06724J36782k21385A04153J44520L9146
14957B87819k3604N1471n4791O0806M8897q3278q3760K12076o5744p4822J77020
$$ plain form
15034 139500 158549 22721 299615 186685 372605 -105469 95556 65812 38584 4279 282049
15023 282049 11677 612258 214477 202468 297127 127045 61181 356202 366029 318576 143146
15011 9233 221953 387653 -27472 8314 35823 206933 -3731 142728 103949 201277 -75949
14999 238331 175125 48737 33068 -171356 74915 524037 185165 138678 283938 670096
14989 670096 467560 250320 87276 521090 132352 -83213 353136 104011 195220 496024
14979 496024 450183 445780 105459 252497 206221 229161 -104846 43144 333372 247772 286130
14968 286130 293835 119079 89973 122277 131371 338095 474877 253492 104153 248673 287819
14957 287819 264215 315686 260895 321701 370598 287320 203560 415636 349892 275070 452090
14946D52090k05370J25489G3064J44623L3464L6731M9735O1888K13777G565J34884
14935A42449j967m4926K68001j02820j15191L22679A79313J83660O9591j67583
14925B64981L5756H6109L26080a19D31361j81550l3679K42073D4158K66652j52895
14914A57915D858L21379A57086K72976A76215K81521B09856J71255J36593A95085
14903D10611l9442L700J26784a9546A26576N3681K8471J26146K80994A56924J78519
14892C35443J64719l8520A33130M63562B52183J35787P2413F4848K87806J49737
14882E02391B16799J08022l9081L9264A20173L05571D9164P4787L40542o4469
14872D00024p2029c8719E31526j66259L02361B24630P8082K59930B19494A03018
$$ plain form
14946 452090 246720 372209 73064 217687 251151 287882 337617 399505 613282 7565 142449
14935 142449 140482 95556 363557 260737 145546 468225 179313 362973 432564 264981
14925 264981 300737 86109 412189 -119 431361 249811 216132 458205 44158 310810 157915
14914 157915 4858 326237 157086 430062 176215 457736 209856 381111 517704 195085
14903 410611 371169 374869 501653 -19546 126576 180257 208728 334874 615868 156924 335443
14892 335443 500162 461642 133130 596692 252183 387970 460383 64848 352654 502391
14882 502391 216799 324821 285740 325004 120173 425744 49164 123951 464493 400024
14872 400024 327995 -38719 531526 365267 667628 224630 302712 562642 219494 103018
14861D11394J69227f9396B39319M08625L0551k95462A87017M36266B43488J07924
14851C51412A70174N07004l33836k2892L74332l12623J25521N7620j8800k7124
14841E19376B50108k6573K42962j47109K12248k50108K09211O0011A84111J66149
14831C50260K16596k06170J30497J26151A87968J79986j42248N1776L25784j52357
14821D50909q5075k5805o3435K60465r8811J82242k94937Q4695K96728q4943j26988
14810D95045R1788k50678M92772B51083J70568L53463n3385B83135J63164J21571
14800E67870N1027p3118A47929J85959M4139K01631k8653K61274k51336J35073
14790F96016l26345K41153k8837j41981K14418k84390J42312M1500J40386k5362
$$ plain form
14861 411394 580621 -69396 239319 647944 678495 383033 187017 623283 243488 351412
14851 351412 170174 677178 343342 320450 694782 382159 507680 565300 546500 519376
14841 519376 250108 223535 466497 319388 531636 281528 490739 550750 184111 350260
14831 350260 566856 360686 491183 617334 187968 367954 225706 277482 603266 450909
14821 450909 365834 340029 276594 537059 438248 620490 325553 410248 706976 622033 495045
14810 495045 586833 336155 828927 251083 421651 775114 721729 283135 446299 567870
14800 567870 618897 545779 147929 333888 378027 579658 551005 812279 560943 696016
14790 696016 369671 610824 581987 440006 654424 370034 512346 553846 694232 668870
14780F68870j05049J32191l02324O20661n00941j7811m1644K25994N5933j22158
14770F13722J53119k50397J49789p994K7743J06911l39035J44736J8141P1720
14760F88455J21391m5251k21476r2025K96536j71559j93709Q41362E37659j8903
14750E18756m3449K37239k06683k9464M69432k87779j68800K95242J24355j31792
14740G77057Q1427r6210C64307K77103P2374l4121j03701J73959k2298R0398l2667
14729G85354j56397J01354q6381K28511k7209J52620k24415l23067K69169j19445
14719F00094P2531k01089K97818J19864k96568K08508N7391J46594k85419K52827
14709I72551L0883m55305N14L5070p2834M70341r2795j3295J6881j78300m549
$$ plain form
14780 668870 563821 696012 393688 1014349 513408 495597 453953 679947 735880 613722
14770 613722 766841 516444 666233 658239 685982 792893 453858 598594 616735 688455
14760 688455 809846 764595 543119 451094 747630 576071 382362 1223724 537659 518756
14750 518756 475307 712546 505863 476399 945831 658052 489252 784494 908849 777057
14740 777057 858484 762274 364307 641410 713784 679663 575962 749921 727623 818021 785354
14729 785354 628957 730311 643930 872441 845232 997852 773437 450370 719539 600094
14719 600094 672625 471536 769354 889218 592650 801158 858549 1005143 719724 972551
14709 972551 1003434 548129 548643 583713 510879 981220 888425 875130 892011 713711 709162
14698G09162J71941J63098j35797N1278J62113n6355j87477R9233L47277n58140
14688G66333k672L7743K10580J26402m91996K04247J08314K61571k52787O3205
14678A030940J07671l73263J87394K14020o3245K2150K12029l36706K25103k76193
14668I49900R0422K79974j96748n6200j04860J40496P2543J72300k64047j26522
14658I57258J99078m3077j61714k4158L37661k61088J57133Q0915k4056J98191
14648A416143j26559k14179j53538L17758j42016P3126P9854J32609L5360q9868
14638A328690J35303m37598M29092j90109m5017J24786L4230n6783m9704N8574
14628A331464k7287K36937m7650r3746J41855j99080L06149k41086m17233N80454
$$ plain form
14698 709162 881103 1044201 908404 959682 1121795 1065440 877963 977196 1324473 766333
14688 766333 763661 801404 1011984 1138386 646390 850637 958951 1220522 967735 1030940
14678 1030940 1138611 765348 952742 1166762 1103517 1125667 1337696 1000990 1226093 949900
14668 949900 1040322 1320296 1123548 1067348 962488 1102984 1175527 1347827 1083780 957258
14658 957258 1156336 1113259 951545 927387 1265048 1003960 1161093 1242008 1217952 1416143
14648 1416143 1289584 1075405 921867 1239625 1097609 1170735 1250589 1383198 1418558 1328690
14638 1328690 1463993 1026395 1455487 1265378 1220361 1345147 1379377 1322594 1272890 1331464
14628 1331464 1304177 1541114 1493464 1399718 1541573 1342493 1648642 1407556 990323 1570777
14618A570777l08357j08943M73639K68332l77730j74509L45525k60195k70742
14609A157797M07895J49127j65839j48639K92310l00K11069p33600P0191K86102
14599A526113r8501L77124J7689N7136j54617l82713M26568k13409L04329j91762
14589A667957K20006k35560k58242O41968k56912L76216J52429j81433n89754
14580A536675M86728l14164K11259r3652J43531M86554k91742j71281J97714k20408
14570A971214M66529j55316j48338J14161J06862J0779J44149K80246m53336K72929
14560B609879M99858j30396l52508M67639r6120o1712P45387J38898J76212Q15840
14550D812977R35782J293115L632448Q623262J7924948J390057j6708527r087721
$$ plain form
14618 1570777 1262420 1153477 1627116 1895448 1517718 1343209 1688734 1428539 1157797
14609 1157797 1565692 1714819 1548980 1400341 1692651 1692351 1903420 1169820 1240011 1526113
14599 1526113 1427612 1804736 1822425 1879561 1724944 1342231 1768799 1555390 1859719 1667957
14589 1667957 1887963 1652403 1394161 2036129 1779217 2155433 2307862 2126429 1536675
14580 1536675 2023403 1709239 1920498 1826846 1970377 2456931 2165189 1993908 2191622 1971214
14570 1971214 2437743 2282427 2134089 2248250 2355112 2365891 2510040 2790286 2336950 2609879
14560 2609879 3109737 2979341 2626833 3094472 2998352 2936640 3682027 3820925 3997137 4812977
14550 4812977 5748759 7041874 10674322 19297584 37222532 38612589 21904062 12816341
14542A2816341o107439k538038r55502p28747q7493j29100q1113L1176M227k73763
14532A950549k4231N85410j1682l67297j62574L59525k47029L02496J85893m2296
14522B528764l40726N9893j90387N43395p4356J49723j39718K31053m48645N39694
14512B858690J59240K4505k97678n0830K81103L1481J47217K16943n30819K38012
14502C077864n2296k11206M5374N7237L00943N2663J1733m12786M98617P0371
14492C438514l72702R1716J51429L81615j18891o556L66230k86008K21768j81758
14482C685357J36042K82540m06767M9805J54009J69299O7809R2657r9676L78960
14472D510035n37725J48579M79700j60523j83556k1900Q2705R6321J24377K71189
$$ plain form
14542 12816341 6708902 4170864 3215362 2486615 2399122 2270022 2188909 2220085 2224312 1950549
14532 1950549 1926318 2511728 2500046 2132749 1970175 2329700 2082671 2385167 2571060 2528764
14522 2528764 2188038 2247931 2057544 2600939 2526583 2676306 2536588 2767641 2318996 2858690
14512 2858690 3017930 3042435 2744757 2693927 2975030 3006511 3153728 3370671 2839852 3077864
14502 3077864 3025568 2814362 2859736 2916973 3217916 3270579 3282312 2869526 3368143 3438514
14492 3438514 3065812 3157528 3308957 3690572 3571681 3565125 3931355 3645347 3867115 3685357
14482 3685357 3821399 4103939 3697172 3746977 3900986 4070285 4138094 4230751 4131075 4510035
14472 4510035 3972310 4120889 4600589 4440066 4256510 4234610 4317315 4413636 4538013 4809202
14462D809202j46133p6830O09232j9430k12933k488L0410K02586K08574l02328
14452E099862J41395K92003L473j31118l6941M66625j13298K16564K5855K28672
14442F193092l352k07380r6236M61543R1991j86779M69039L4000k66414K77265
14432F766769p7996O9819J98587J38303K13564P7125K0671J38386K25352m4998
14422G725582K475m094N45177j99090M01038o4740j33083M99489K1604K25818
14412I020176J62301k57904q9938L27321K71462L14946L50447l08716L14809J51490
14402A0256394L29112J97712k75798M89641J55567M03916n20357N80805R5918
14393A1712910K03859K11478M52341K83349k68560O00767j27622J05108N12231
$$ plain form
14462 4809202 4663069 4586239 5195471 5176041 4963108 4960620 4991030 5193616 5402190 5099862
14452 5099862 5241257 5533260 5536733 5405615 5368674 5835299 5722001 5938565 5964420 6193092
14442 6193092 6189740 5982360 5886124 6347667 6439658 6252879 6721918 6755918 6489504 6766769
14432 6766769 6688773 6758592 6957179 7095482 7309046 7386171 7406842 7545228 7770580 7725582
14422 7725582 7728057 7723963 8269140 8070050 8471088 8406348 8273265 8772754 8794358 9020176
14412 9020176 9182477 8924573 8834635 9161956 9433418 9748364 10098811 9790095 10104904 10256394
14402 10256394 10585506 10783218 10507420 10997061 11152628 11556544 11036187 11616992 11712910
14393 11712910 11916769 12128247 12580588 12863937 12595377 13196144 13068522 13173630 13685861
14384A3685861K29417L99216J41449K42862K32860L15739L93368Q1898Q09023
14375A6531693N7100K42634L62500J15111M83466J37538L03455N77813L79905
14366A9191215P46882j9989N08869N62390O76545J84751L74282P61228J95738
14357B3181911Q53266J12497P55089P32755P54578N09710K95899Q36518L97882
14348B8430105J028924M47944Q87599P39889R10040Q29807N27127J309697R82393
14339C6093525O15447J484569Q85207Q15659J756047J072948P43493J601802J347303
14330D6416000J476042J533657J395818J694855J770506J485409J847590K182486
14322E9802363J750947K307910J825717K682566K329616K203050K348369L782887
$$ plain form
14384 13685861 13915278 14314494 14455943 14698805 14931665 15247404 15640772 15722670 16531693
14375 16531693 16588793 16831427 17193927 17309038 17792504 17930042 18233497 18811310 19191215
14366 19191215 19938097 19918108 20426977 20989367 21665912 21850663 22224945 22986173 23181911
14357 23181911 24035177 24147674 24902763 25635518 26390096 26899806 27195705 28032223 28430105
14348 28430105 29459029 29906973 30794572 31534461 32444501 33274308 33801435 35111132 36093525
14339 36093525 36708972 38193541 39078748 39894407 41650454 42723402 43466895 45068697 46416000
14330 46416000 47892042 49425699 50821517 52516372 54286878 55772287 57619877 59802363
14322 59802363 61553310 63861220 65686937 68369503 70699119 72902169 75250538 79033425
14314G9033425K528564L305187L089899L583190L400694L959226M157530M289364
14306A07347079M829435M722562N173555M946199O284269N801804O193941O416520
14298A51715364P236138P384527P992749Q419031Q946448R135603R659658J0359087
14290B20848605J0329009J1762424J1464333J2753862J2406501J3088046J3784185
14283C06436965J3611537J4101220J4057476J3813277J3646403J3228071J2499709
14276D01394658J1347207J0243856Q680182O862919L609123O95805j987031k754671
14268D38092048l424913m209346p296398p909541q607433j0080509j1868336j2876446
14260C71819126j3578072j3740175j4649937j4492235j4607578j4376777j2814053
$$ plain form
14314 79033425 81561989 84867176 87957075 91540265 94940959 98900185 103057715 107347079
14306 107347079 112176514 116899076 122072631 127018830 133303099 139104903 145298844 151715364
14298 151715364 158951502 166336029 174328778 182747809 191694257 200829860 210489518 220848605
14290 220848605 231177614 242940038 254404371 267158233 279564734 292652780 306436965
14283 306436965 320048502 334149722 348207198 362020475 375666878 388894949 401394658
14276 401394658 412741865 422985721 431665903 438528822 442137945 442833750 440846719 438092048
14268 438092048 434667135 430457789 423161391 415251850 406644417 396563908 384695572 371819126
14260 371819126 358241054 344500879 329850942 315358707 300751129 286374352 273560299
14253B73560299j2753221j2893277j2449007j1589401j1032204j0615743r628629
14246A92598817r384047q924392q009508q055820p366313o952160o876334n966856
14238A31063387n548103n472384n240178m910393m790232m346680l841818l502792
14230I3410807l738513l649972l614501l147612l252931k402255k791497k576168
14222F8237358k257730j926879k229390k442042j857432k155339j632727j882935
14214E1852884j185649j530430j428474j514875j441026j449866j063702p71345
14206D1467517r21698j681072j124667q19837j271687o14725p46042j153095n86993
14197C2547701r99147p57474p30456p36154n94295o86612r25638n55216j077812
$$ plain form
14253 273560299 260807078 247913801 235464794 223875393 212843189 202227446 192598817
14246 192598817 183214770 174290378 166280870 158225050 150858737 143906577 137030243 131063387
14238 131063387 125515284 120042900 114802722 109892329 105102097 100755417 96913599 93410807
14230 93410807 89672294 86022322 82407821 79260209 76007278 73605023 70813526 68237358
14222 68237358 65979628 64052749 61823359 59381317 57523885 55368546 53735819 51852884
14214 51852884 50667235 49136805 47708331 46193456 44752430 43302564 42238862 41467517
14206 41467517 40545819 38864747 37740080 36920243 35648556 35033831 34287789 33134694 32547701
14197 32547701 31548554 30791080 30060624 29324470 28730175 28043563 27117925 26562709 25484897
14188B5484897j77726n83274o71427n92974o67408k72316n84398n16499k01603
14179B1217272m71506m09182m45405n05664n38323m55487k71380l14488l33173
14170A7472664j4749l34925l33317l61429l97248K6149n34378m00079n76247l955
14160A4542486l49418q3149k70078k99443k88764p808l78334l26735j25140m5840
14150A2367777n88346j43171J26483k32275j83395o0720r6948k92743k09519k01040
14140A0486103j14030j75044l36061k16620k4915j30455K27069n02796j51997
14131I061254R4436p04265J67058P4565l0659l57280j56219j5549Q8741j93919
14121H028163k89592m0342l80285J35888n6410m43J22571l26943l70359K32154
$$ plain form
14188 25484897 25307171 24723897 24052470 23459496 22792088 22519772 21935374 21418875 21217272
14179 21217272 20745766 20336584 19891179 19385515 18847192 18391705 18120325 17805837 17472664
14170 17472664 17457915 17122990 16789673 16428244 16030996 16057145 15522767 15122688 14546441 14542486
14160 14542486 14193068 14109919 13839841 13540398 13251634 13243826 12865492 12538757 12413617 12367777
14150 12367777 11779431 11636260 11762743 11530468 11347073 11286353 11189405 10896662 10687143 10486103
14140 10486103 10372073 10197029 9860968 9644348 9619433 9488978 9716047 9213251 9061254
14131 9061254 9155690 8451425 8618483 8693048 8662389 8305109 8148890 8133341 8222082 8028163
14121 8028163 7738571 7698229 7317944 7453832 7397422 7396979 7519550 7192607 6822248 7054402
14111G054402m09167M02754l34621j81866j25596j61932N3421J4675K23927m79745
14101F056252k258j7367k93479J95042j38877j84095K86295l24183m1381n212
14091E530737M1984m99618K41894j44897K50678r6004k27716K7459l08767N8253
14081D874003j75698L71279l05073P447k37373J53954m0439j23791J29388n3894
14071D599803l95968K44399J15636j59768m38131M1663L039R1829K87927k66482
14061D123947L44874q57137O13193Q4688n62230m7246J87963j68594J06877k03880
14051C622455o4779L32803j43074n0932k70680m2129o8130n558j7289J1314J64363
14040C468364j13217r4063j08713n2127M00403m75632m47788L85210p4732Q686
$$ plain form
14111 7054402 6645235 7047989 6713368 6531502 6405906 6243974 6297395 6312070 6535997 6056252
14101 6056252 6053994 6036627 5743148 5938190 5799313 5615218 5901513 5577330 5535949 5530737
14091 5530737 5572721 5073103 5314997 5170100 5420778 5324774 5097058 5124517 4815750 4874003
14081 4874003 4698305 5069584 4764511 4771958 4534585 4688539 4648100 4524309 4653697 4599803
14071 4599803 4203835 4448234 4563870 4404102 3965971 4007634 4010673 4102502 4390429 4123947
14061 4123947 4468821 3611684 4224877 4309565 3747335 3700089 3888052 3719458 3826335 3622455
14051 3622455 3557676 3890479 3747405 3696473 3425793 3383664 3315534 3309976 3292687 3304001 3468364
14040 3468364 3355147 3261084 3152371 3100244 3500647 3025015 2577227 2962437 2887705 2896391
14030B896391M30006n82818K49976L6411j3574r0824j10777l846k4162L27491
14020C114274l18724j24160J21075j28847J87204m6715k64321l3199K11427q4594
14010B633420j86206j02250J23197M057K0026J57109l96715j87848j9383L57484
14000B402891m09566L7992J87312l04525J42576N7898j67866j9191J38270N38677
13990B604468L01669P31650K135466P132458J7809799R428518j5296788j0714587
13982A4132653n120710k418339j083963o92704p27944n04315k88920J75542l36056
13973C135244p5732m99060J55006R8153m40126K77444k06383j50949L391R6161
13963B393149j92642j84536J87292k28114K20249j06686j80372l6558L35938l89078
$$ plain form
14030 2896391 3326397 2743579 2993555 3029966 3016392 2925568 2814791 2810945 2786783 3114274
14020 3114274 2795550 2671390 2792465 2663618 2850822 2804107 2539786 2506587 2718014 2633420
14010 2633420 2447214 2344964 2468161 2472218 2492244 2649353 2252638 2064790 2045407 2402891
14000 2402891 1993325 2031317 2218629 1914104 2056680 2114578 1946712 1927521 2065791 2604468
13990 2604468 2906137 3637787 5773253 12905711 30715510 40144028 24847240 14132653
13982 14132653 9011943 6593604 5509641 4816937 4088993 3584678 3295758 3471300 3135244
13973 3135244 3059512 2560452 2715458 2813611 2373485 2650929 2444546 2293597 2296988 2393149
13963 2393149 2200507 2015971 2203263 1975149 2195398 2088712 1908340 1871782 2207720 1818642
13953A818642J1377K58342k55054K89629l34785J42514l9470k15755L26945k27345
13943A775040J04677m49128M51084m48685M95928j43059N6641K91258m67134j71060
13933A495562N30147l32425o4437O1411M74910o42939P4335m07935K25577L5400
13923A449606j68245N05646l84734K76348l55705L7184K94494l44974o4951O53680
13913A898349j33609n34388J45377K02263n5634j11733q4819k3042K16573m9363
13903A469974R482l44891K31585K22671l84232K17815j0105N3319l70089J84332
13893A279861J13538R5161l33972R0931Q6244j27667k34692K16064K64449m77077
13883I72840M19553j98543R6737r6655k083J64229l4455j2084P914j83567K18092
$$ plain form
13953 1818642 1830019 2088361 1833307 2122936 1788151 1930665 1891195 1675440 2002385 1775040
13943 1775040 1879717 1430589 1881673 1432988 1928916 1785857 1842498 2133756 1666622 1495562
13933 1495562 2025709 1693284 1628847 1690258 2165168 1522229 1596564 1188629 1414206 1449606
13923 1449606 1281361 1787007 1402273 1678621 1322916 1360100 1654594 1309620 1244669 1898349
13913 1898349 1764740 1230352 1375729 1577992 1522358 1410625 1325806 1302764 1519337 1469974
13903 1469974 1479456 1134565 1366150 1588821 1204589 1422404 1412299 1465618 1095529 1279861
13893 1279861 1393399 1488560 1154588 1245519 1331763 1204096 969404 1185468 1449917 972840
13883 972840 1392393 1193850 1290587 1193932 1191849 1356078 1321623 1309539 1317453 1133886 1351978
13872A351978M192k37409j28883l27762M36597k84361K70419l36030J34259M60088
13862A343088k53423n828J04900m12255L33831j21035M24269m00007l3146N14864
13852A495258k81936j98293P4347k42080J06636l88124N11796j75285j90123M01938
13842A114134k10508K7459j42045K75466n9308K2579j02985J17443j81432m8724
13832H12079J5897n8518K52447j92213O5196j59419L07549J42731k61536J49352
13822A073565l03419m7860J62863j41101J45209l16129L34475J48782l14319l65532
13812C76534O11454k41993K8300L6471j0571M8082J56351l65583Q4051J52059
13802H75155k173j75400m1867J69774K4069j23105O28Q8247N5291Q8655l80717
$$ plain form
13872 1351978 1356170 1118761 989878 662116 1098713 814352 1084771 748741 883000 1343088
13862 1343088 1089665 1083837 1188737 776482 1110313 989278 1413547 1013540 980394 1495258
13852 1495258 1213322 1015029 1089376 847296 953932 565808 1077604 902319 712196 1114134
13842 1114134 903626 931085 789040 1064506 1005198 1027777 924792 1042235 860803 812079
13832 812079 827976 769458 1021905 829692 894888 735469 1043018 1185749 924213 1073565
13822 1073565 770146 722286 885149 744048 889257 573128 907603 1056385 742066 376534
13812 376534 987988 745995 774295 810766 800195 848277 1004628 639045 723096 875155
13802 875155 872982 697582 655715 825489 849558 726453 727081 815328 870619 959274 578557
13791E78557q7101M08530l13544O2517J27934C72494M19216k12037J08334J66793
13781H54800J16130j93941j06055q6398j00783J69779J4447J33075J38352j7970
13771I21436R0723m13801m6072K67405B78987K60036K12131k53244J46344J81806
13761H26060j39132k08048L90436l24421L54388m02037Q8056L4722J95858l10373
13751E05509J74027Q3404J3788k06866l5605m4306N74804D58162L21447l54020
13741D25589B05446Q35320m54791J3693k5289K5739K05438k75218K67155l42506
13731D54987L40496N8279k71801k18339P9330J2331K49880J3737P3342B47939
13720D89075K08063j82890R3815r4322l6286K78259k23812O7982l3334K5685K73745
$$ plain form
13791 578557 491456 899986 586442 648959 776893 372494 791710 579673 688007 854800
13781 854800 970930 776989 670934 584536 483753 653532 667979 801054 939406 921436
13771 921436 1012159 598358 552286 819691 278987 539023 751154 497910 644254 826060
13761 826060 686928 478880 869316 544895 899283 497246 585302 620024 815882 505509
13751 505509 679536 762940 776728 569862 534257 489951 1064755 458162 779609 425589
13741 425589 205446 1040766 585975 599668 574379 600118 805556 530338 797493 454987
13731 454987 795483 853762 581961 363622 442952 455283 705163 718900 792242 247939
13720 489075 697138 514248 608063 513741 477455 755714 531902 599884 566550 592235 865980
13709H65980l36575j5977O6925n0611j15805m3894P0899K19731n5328j7567l3024
13698E54754B28481M96534l10601K06610m3041l5790p3671J52814A28079M67252
13688E95331j14274K1816B26789M55870C18896L659L37079P284j07520j99469
13678C59929n9586J58411A30352L07455Q9801o6581j89313K79675K4114j68422
13668D07081L6772J12888m3448K64808C46597K1458R7324P6584B14521K16239
13658D30760J18620R5630K7572O0794O911B78688K32697A95518L34541q0201J5494
13647D65352J117q046j73769L3961j10409J49433j60234J30866L45601k0617p3646
13636E79609l0437J13692l10673J34376K57708l24925r6886q309J00026J9637
$$ plain form
13709 865980 529405 513428 580353 529742 413937 370043 440942 660673 605345 587778 554754
13698 554754 228481 725015 414414 621024 577983 542193 468522 621336 128079 595331
13688 595331 481057 502873 226789 682659 318896 322555 659634 666918 559398 359929
13678 359929 300343 458754 130352 437807 527608 461027 271714 551389 575503 407081
13668 407081 443853 556741 513293 778101 346597 368055 465379 541963 214521 430760
13658 430760 549380 645010 672582 733376 740287 278688 511385 195518 530059 449858 465352
13647 465352 466469 458423 284654 318615 208206 357639 197405 328271 673872 653255 579609
13636 579609 549172 662864 352191 486567 744275 419350 322464 314155 414181 433818
13626D33818o2682J13087j26037J46728J36477p0368l2740k32680n8578J6148
13616B63173j7030K26070m7557A58859J60985J49189j32363J62751J7156p0167
13606D46410A27508K77582p391K86046k49571j20823K83439p5098J83642k53125
13596D52209k25509r4001K65412j24817c1661A72577q1583K48060p7632a29756
13585F55780q5159j41814k05795L9514J05065q6235J97869k20697J47296D0441
13574B31913K42855j7236B11394Q3490J4936L7185G2332M68536j91402j06285
13564B43181M52260l31750m2368B2695P8033a69728D94496n9656J2630j89897
13554B57573L96488C26289c3544H3626j6753J59326F9616L28016J17433j56578
$$ plain form
13626 433818 371136 484223 358186 504914 641391 571023 538283 305603 247025 263173
13616 263173 246143 472213 424656 158859 319844 469033 336670 499421 516577 446410
13606 446410 127508 405090 397699 683745 434174 313351 596790 521692 705334 452209
13596 452209 226700 132699 398111 273294 -31661 172577 90994 339054 261422 -129756
13585 655780 570621 428807 223012 262526 367591 281356 479225 258528 405824 40441
13574 231913 474768 457532 211394 294884 309820 347005 72332 540868 349466 243181
13564 243181 695441 363691 321323 22695 100728 -169728 494496 434840 447470 257573
13554 257573 654061 326289 -33544 83626 66873 226199 69616 397632 515065 358487
13544C58487A20970L12329k01510M08002A1186M85723k5268j35972p6547p051
13534B52071I1224K72655j5955q4050j09445J29690b5508E25915A11568J88404
13524B99972P3395j6263A8409c2885C9325L32161J37553B53757P1493j5973F3227
13512E61798A94902N1242J03369j5781A63755m1205N20958k17793G6749L66002
13502D42751E2289M60408N0474k22610r9090n092d2860E1526K08084m5647G1324
13490A73695e261E66912k30284A54223K84931B09095F942M12683o6819Q0831k15284
13479B18353N6905j15113m9708l3607J20478b8638p744p875A84894M1411L32355
13468E58660F6344a41529B13619o2027K81542J52911e4347J4216C96810o8689
$$ plain form
13544 358487 120970 433299 231789 639791 11186 496909 471641 335669 259122 252071
13534 252071 91224 363879 347924 263874 154429 284119 -25508 525915 111568 299972
13524 299972 373367 357104 18409 -32885 39325 371486 509039 253757 325250 309277 63227
13512 561798 194902 246144 349513 333732 163755 122550 643508 425715 76749 442751
13502 442751 52289 512697 563171 340561 241471 236379 -42860 51526 259610 213963 71324
13490 173695 -5261 566912 336628 154223 439154 209095 6942 419625 352806 433637 218353
13479 218353 275258 160145 110437 76830 197308 -28638 -36382 -44257 184894 226305 558660
13468 558660 66344 -141529 213619 151592 433134 586045 -54347 -40131 396810 328121
13458C28121H6061K62185F8054L73584B00281b34331B06649n7392K61867j1700
13448C99424m7980j21030a10327C91729j64637g8193B18137b1204A42319o6421
13438G5898J29150L0173K01115A53734g3583A97222L9496p650b2538q1586C73914
13426C33149k2161K06798b978B48709A01057K50861I3900M04370a95606B34018
13415E1402K05650H7774i3127b5430B64510L7725j14322J94173F4987M8255K54726
13404C67968D9384O6962J60636L4487j33881a41604L8545B92664J14623j01440
13394C05847k6675l7473K18808A71339J50050l6174p5406L30795o8630o4015r952
13383C98007A42390q335l9467L99783A43757L8666n0397N1840L6380o2142J51780
$$ plain form
13458 328121 86061 348246 68054 441638 200281 -234331 206649 149257 411124 399424
13448 399424 351444 230414 -110327 391729 227092 -78193 218137 -21204 142319 75898
13438 75898 205048 235221 436336 153734 -73583 197222 236718 229068 -22538 -104124 373914
13426 333149 310988 517786 -2978 248709 101057 351918 93900 498270 -195606 234018
13415 51402 257052 87774 -93127 -25430 264510 302235 187913 382086 64987 113242 367968
13404 367968 49384 116346 276982 311469 177588 -141604 -103059 292664 407287 305847
13394 305847 279172 241699 460507 171339 321389 285215 209809 540604 471974 407959 398007
13383 398007 142390 134055 94588 494371 143757 182423 132026 183866 220246 158104 309884
13372C09884K8766J16821A74115M05068A09739k4021L059M6774g502B80729R5064
13361C75793I5813c2691B73135D5342K51607l2755j32094J62779a20265A60784
13350B04495B893O8228L65668k11568J10767A00053L7485J33985l5180j1443o7070
13339A57830K88196A36347J2069N6891R5768e4098A27555J93349A29142d1616
13328B70550J45983e1128B41629j14464J53125J701p4569p4889F1752J44366r9129
13317A06989L21031F6510J81013A3333J61160p6651K65167J51486A24368n2033
13307G2335J6436J78661A18420J51551C7113a48233C73086H2703L04312B7792
13296a99997F3809L24606E0428M21058a89029E8265K2451i023C47151j51937K32725
$$ plain form
13372 309884 338650 455471 174115 579183 109739 85718 88777 135551 -7502 280729 375793
13361 375793 95813 -32691 273135 45342 296949 264194 132100 294879 -120265 160784
13350 204495 2893 71121 436789 225221 335988 100053 137538 271523 236343 224900 157830
13339 157830 446026 136347 148416 205307 301075 -54098 127555 320904 129142 -41616
13328 270550 416533 -51128 241629 127165 280290 281991 207422 132533 61752 206118 106989
13317 106989 428020 66510 247523 13333 174493 97842 363009 514495 124368 72335
13307 72335 88771 267432 118420 269971 37113 -148233 373086 82703 387015 27792
13296 -199997 63809 388415 50428 471486 -189029 58265 80716 -9023 347151 195214 427939
13285D27939A83991a23033D8376d6632I3024a4065B38487j11337a52086q033G5980
13273D160M5367J59417l6047L23784F4949P2436C4612M32156B26324b6318E15262
13261a47879B41258a73720B57775r044o6112Q6786F5553a73712B23142J1979Q2499
13250C17620A50937l9527j0622J01592Q369q5165n6678B917O9412K62622b2572
13238C36446b6037l0960A12560K99084F0712J26301n3211a32625B03580n4919
13228A48661J55565a33534A84186H2917J11608K4045Q0727a95853a2109H9422
13217B19003A0714K45377k611a0731j83711D47161A65198b27085B60946c7292
13206i5628A90106r2606J8306n3646M7683c4762R827R028d233C48405b1522H0761
$$ plain form
13285 427939 183991 -123033 48376 -46632 93024 -14065 238487 127150 -152086 -160119 75980
13273 4160 49527 208944 172897 496681 64949 137385 34612 466768 226324 -26318 515262
13261 -147879 241258 -173720 257775 248731 182619 269405 65553 -173712 223142 235121 317620
13250 317620 150937 111410 100788 202380 210749 125584 68906 2917 72329 334951 -22572
13238 336446 -26037 -56997 112560 411644 60712 187013 133802 -132625 203580 148661
13228 148661 304226 -133534 184186 82917 194525 218570 299297 -195853 -12109 89422
13217 219003 10714 256091 253480 -10731 -194442 447161 165198 -227085 260946 -37292
13206 -95628 190106 97500 115806 62160 109843 -34762 -24935 -15907 -4233 348405 -21522 80761
13193i1276B3206i7109A50174d9813A00715J5467O5712K4078a47197H864J93443
13182B02307F5732l0266a02252p1993B17480a07265A80105K18902F8022b4943
13171f4402B84962A20127a3185C45205A00816f7827j00283B44380M696a4325j21669
13160a35994A77186a33958D4623R32g5920a5999A60540g0797B60623P6510b41843
13148d42475A07193a3337A71331j0499C6154L7380P3780h0139j1593h922n3476
13137f2398a1811B97737m9921a112F7943N3824l7226a11886B35919o8834i909
13125i3813b274o7818j62075B67319j12023a28120k7622C67560d3112A69598A114
13113a41888f0324j6058k4931I2833J36751j09200M9681E8984J80178I7775j488
$$ plain form
13193 -91276 23206 -97109 150174 -49813 100715 116182 181894 205972 -147197 8864 202307
13182 202307 65732 35466 -102252 -174245 217480 -107265 180105 399007 68022 -24943
13171 -64402 284962 120127 -13185 345205 100816 -67827 -168110 244380 249076 -14325 -135994
13160 -135994 177186 -133958 44623 45555 -75920 -15999 160540 -70797 260623 337133 -241843
13148 -442475 107193 -13337 171331 160832 36154 73534 147314 -80139 -91732 -8922 -62398
13137 -62398 -11811 297737 247816 -1112 67943 121767 84541 -111886 235919 167085 -9909
13125 -93813 -2274 -70092 -232167 267319 155296 -128120 -155742 367560 -43112 169598 1114
13113 -141888 -60324 -76382 -101313 92833 229584 120384 170065 58984 239162 97775 96287
13102I6287K11150a52342C51309C1979f1157A67228D856M5908b30478G700l531
13091D169L51567a40246C82319r6959C0470O4550a13811B5825d7675B39198e9458
13079A34971M3232J71770A59545m8218r301e6998G6904J31131G028h3312c7511
13067B71428n3369M3365c20211A28575a970B35307o3764a3735A69541o7304f0756
13055D35990j85485i6711F6043J90192r1729p872J39900b26652c7372A67904a75510
13043c9504F8677c3539C68728j37781D4514L6573d0735C90439A59302a25635c5689
13031A4213L35201C5326d7880o2141B37629a47457D2416J26632F2240a0772I6285
13019B6062R6771q850J28761A15971O0771k7823a31249e782l852C57226e8282
$$ plain form
13102 96287 307437 -152342 351309 31979 -61157 167228 4856 50764 -230478 7700 4169
13091 4169 355736 -140246 382319 285360 30470 95020 -113811 25825 -47675 239198 -59458
13079 134971 178203 349973 159545 111327 102026 -56998 76904 208035 7028 -83312 -37511
13067 271428 218059 261424 -320211 128575 -1970 235307 171543 -13735 169541 102237 -60756
13055 435990 250505 -96711 66043 256235 164506 156634 296534 -226652 -37372 167904 -175510
13043 -39504 68677 -33539 368728 230947 44514 81087 -40735 390439 159302 -125635 -35689
13031 14213 349414 35326 -47880 -110021 237629 -147457 42416 169048 62240 -10772 96285
13019 26062 122833 113983 242744 115971 176742 148919 -131249 -5782 -9634 357226 -58282
13007E05420a7650I3775b20024i0008M3561j53601D7034a32138K0751A58235k7182
12996A31053j0826a88670M2806M0475H0284b6998C49300E1178O1839D2095a22630
12984g1788B42567H9233J423J72466a18665e8789G7831e3081o8527A1921J4235
12973B6156K32099q4825E8089a01764C97256a21341N1419A51954J42508A15995
12962e6858j36007a6423l43639A47821d192r4839B17156C2230J50749b6764A10582
12950G7859J60191j01031B4319j0541b54304B44016b13262F8049a0898l0113A14073
12938b00772a4572m7913B97626l5214a3378A27877C1742j4681J61382C9546K17993
12927B57539A04820b9779f570j66631B7612a95630E4682J77191a42714e7808k66964
$$ plain form
13007 505420 -17650 93775 -220024 -90008 -46447 -200048 47034 -132138 -111387 158235 131053
12996 131053 120227 -188670 -145864 -105389 80284 -26998 349300 51178 113017 42095 -122630
12984 -71788 242567 89233 90656 263122 -118665 -58789 77831 -53081 -121608 11921 26156
12973 26156 258255 173430 58089 -101764 397256 -121341 -69922 151954 294462 115995
12962 -56858 -192865 -16423 -360062 147821 -4192 -99031 217156 32230 182979 -26764 110582
12950 77859 238050 137019 24319 13778 -254304 244016 -213262 68049 -10898 -41011 114073
12938 -200772 -14572 -62485 297626 262412 -13378 127877 31742 17061 178443 39546 257539
12927 257539 104820 -29779 -6570 -173201 27612 -195630 54682 231873 -142714 -57808 -324772
12916c24772b6170j31305j21815g7142b5625e413A36381a88604p7833A98185a41298
12904F1471b13042C14255B3247a05530l7954F2576k1852a17535j7980J3373C89445
12892F6258b67788A50543C3038e3287A51512D453J53338R2381p6401H5712j043
12881H4669d4772m7168d14D7240a81836C2284J05453b63054R4774b5135k22835
12870b47970e1859k5350l0558k212I2634b89848H6353d7644l11377A46116b31707
12858A51204f7605I0473M8859K3945c5613k6979A33696j216d1540j4864q0094
12847a36498N4956B00691i2786J0478D38606j67489E8537h2956B29316a51157
12836A65975Q0070b2643l3356B70298F28O8781c48189E1340k703M179P3923K09848
$$ plain form
12916 -324772 -26170 -157475 -279290 -77142 -25625 -5413 136381 -188604 -266437 198185 -141298
12904 61471 -213042 314255 23247 -105530 -143484 62576 40724 -117535 -135515 -122142 389445
12892 66258 -267788 150543 33038 -53287 151512 4453 157791 250172 173771 85712 84669
12881 84669 -44772 -91940 -414 47240 -181836 32284 137737 -263054 -168280 -25135 -247970
12870 -247970 -51859 -77209 -107767 -109979 92634 -289848 86353 -47644 -359021 146116 -231707
12858 151204 -67605 90473 139332 163277 -35613 -62592 133696 132480 -41540 -56404 -136498
12847 -136498 -81542 200691 -92786 -82308 438606 271117 58537 -82956 229316 -151157
12836 165975 246045 -22643 -55999 270298 628 69409 -348189 51340 48637 52816 126739 336587
12824C36587A26618a34568N6598c7003a2298q8140A00856A1369J61109n864a32254
12812b41691r547C46750l0732h6444B38307m461c20167L4819i2663B48445a354
12800G5863i3682B14401K1890k6394l1968b6889A40780C3986J99320A136e3697
12788I964a09091B91925l5960d4931k54281H9824P9203b0602B48935H0642L4145
12777A14787i9018E9895d59494I9354K10708a333A2698a081B15752r435o6326
12766A39991A1814J68956a03830D7244L046a85222c3279q4658j29259F5774J14729
12755A80503l1333B5374L36910G1749J75230c94932B50888b6219B46000G7307
12744B17730A7960g3442A78459c7670k30552A48332c02901g5923m31291E6230
$$ plain form
12824 336587 126618 -134568 -77970 -37003 -12298 -100438 100856 11369 172478 166614 -132254
12812 -241691 -251238 346750 316018 -86444 238307 233846 -320167 -285348 -92663 248445 -1354
12800 75863 -93682 214401 236291 209897 177929 -26889 140780 33986 233306 1136 -53697
12788 9964 -109091 291925 255965 -44931 -299212 89824 169027 -20602 248935 80642 114787
12777 114787 -99018 59895 -459494 99354 310062 -1333 12698 -1081 215752 206317 139991
12766 139991 11814 180770 -103830 47244 50290 -185222 -33279 -117937 -247196 65774 180503
12755 180503 149170 25374 362284 71749 246979 -394932 250888 -26219 246000 77307
12744 217730 17960 -73442 178459 -37670 -268222 148332 -302901 -75923 -507214 56230
12733E0886a74578H3003J31421J9205A08912B1758b09455d752j15022C14407I0772
12721A87732H4269K3843i2500B82805b32710B62866A13613a4533b250A28563h2122
12709c93137n4153J69899C25557a0469B25271J65313j08878m662m732j15193R3289
12698B50408j3270b68082a16273A46112O9030h165m44314A57707C0893J45744
12688A76637l6642b84006C21060g0564B6337a27930k0453d7350j39992b3660j38039
12677a61699H6081K38057r0276F9299O09983H9155J69067n377a65725E7166d2964
12665A90993l5268G5119L4402c2428D2401K28670o7807Q2853r1975d48953H4023
12653h1738B3320P0025k6247g8372o2417B19358j05771n0361d1597a3854B46157
$$ plain form
12733 50886 -174578 83003 214424 233629 108912 21758 -209455 -4752 -119774 314407 90772
12721 187732 84269 108112 -92500 282805 -232710 262866 113613 -14533 -2250 128563 -82122
12709 -393137 -447290 -277391 325557 -10469 225271 390584 281706 277044 272312 157119 250408
12698 250408 237138 -268082 -116273 146112 215142 -8165 -452479 157707 30893 176637
12688 176637 139995 -284006 321060 -70564 26337 -127930 -148383 -47350 -187342 -23660 -161699
12677 -161699 86081 324138 233862 69299 679282 89155 258222 252845 -165725 57166 -42964
12665 190993 155725 75119 109521 -32428 42401 271071 203264 286117 194142 -448953 84023
12653 -81738 23320 93345 67098 -78372 -140789 219358 113587 63226 -41597 -13854 246157
12641c18094A7577c976A78437L5001a25334o7625f3473A25722k1375C6396L1913
12630F8309r131K07127b74018A31906P8531I6956L3495J20453q7508a9213C95953
12618h743C28016A35642a96401O4114A40443m5883c37354D46598h9103D158J73978
12607A78136G2830f7420B44944h2700B57717h1015L5811C26094Q373J39987b4858
12595I4657J30693l3541r2071K57693f1828F1016J9149g5174C23057A40430i6798
12583D3936N093a40494B43365a54071N2553h656B07053e9369B82430p3046Q4652
12572B94036b22492H413J68067a58892k78865B05838m1554o5684k7013B0877Q4128
12561A05005J3279a92402r1079a16885D9343N6240I634c5599B01319a42898O7737
$$ plain form
12641 -318094 17577 -3976 178437 213438 -125334 -192959 -63473 125722 104347 36396 68309
12630 68309 59178 266305 -274018 131906 210437 96956 130451 250904 163396 -19213 395953
12618 -8743 328016 135642 -196401 -132287 140443 94560 -337354 446598 -89103 4158 178136
12607 178136 72830 -67420 244944 -82700 257717 -81015 -45204 326094 334467 474454 -24858
12595 94657 225350 191809 99738 357431 -61828 61016 80165 -75174 323057 140430 -96798
12583 43936 49029 -140494 243365 -154071 -101518 -8656 207053 -59369 282430 209384 294036
12572 294036 -222492 8413 176480 -158892 -437757 205838 164284 98600 71587 20877 105005
12561 105005 118284 -192402 -283481 -116885 49343 105583 9634 -35599 201319 -142898 -75161
12550g5161r3072A79960F0185a96826C84934l2920B5718Q9038K0472o1837R6183
12539A69574a76411G2508k0246P460c3027n2452B82116i9083L5443a6445k16493
12528b32938J12620r9645A43464f9560B8391J54343J10953a46953e2073j4051
12518f6124p404B29652C4268d6604D24895G6160J0011h1802A97602b4238H336
12506A4242N0203K10320a10658P51B93223c28104L4720D03910a60430B5278K46042
12495B71320f9138q4520J6979A32630b82423A33534j7229c14145b7390A31657
12484I8361d9646a5760j56844c6645l46462J79766O2765D3841M06267b40015I0602
12472A33685N8838h9231l23643A31214D4027a00506I6809A9765a88872A57472
$$ plain form
12550 -75161 -168233 179960 60185 -196826 384934 352014 25718 114756 135228 73391 169574
12539 169574 -176411 72508 52262 59722 -33027 -85479 282116 -99083 -63640 -16445 -232938
12528 -232938 -120318 -219963 143464 -69560 28391 182734 293687 -146953 -52073 -66124
12518 -66124 -73528 229652 34268 -46604 424895 76160 86171 -81802 197602 -24238 8336
12506 14242 64445 274765 -110658 -109907 293223 -328104 -293384 403910 -160430 25278 271320
12495 271320 -69138 -153658 -136679 132630 -282423 133534 116305 -314145 -27390 131657
12484 98361 -49646 -15760 -172604 -36645 -383107 -203341 -140576 43841 450108 -240015 90602
12472 133685 192523 -89231 -412874 131214 44027 -100506 96809 19765 -188872 157472
12461a06737C26747C4224h6438G5709a72778B87121A42843A5218J4311K47062
12451B76591C3081J75120E2339a06112G7982b10746P1645A04288J7587a13424
12440B10546e0962C01740a61790E4131B0068O5366P2104J22855j13313l2717a98761
12428c03146C3659J09237a00905j36464i9753A25339c57242A73931D2031J274
12418D3305i1025C33958a05912A23898L80697a05658A43076c2847j6148n1996
12408a00991d0675D9415M18733R8979a86848C27907a18236c5262E8914R4992n2800
12397A01106M6268g1370j22686B64880b9234A50688a63751C8158c56930a23083
12386a05753B12736a39088o8053B17337q3320G229O5826a01398j89870B43227
$$ plain form
12461 -106737 326747 34224 -86438 75709 -172778 287121 142843 15218 29529 276591
12451 276591 33081 208201 52339 -106112 77982 -210746 -139101 104288 121875 -113424
12440 210546 -50962 301740 -161790 54131 20068 85434 157538 280393 167080 134363 -198761
12428 -303146 33659 142896 -100905 -237369 -99753 125339 -357242 173931 42031 43305
12418 43305 -91025 333958 -105912 123898 504595 -105658 143076 -32847 -48995 -100991
12408 -100991 -40675 49415 468148 567127 -186848 327907 -118236 -35262 58914 153906 101106
12397 101106 147374 -71370 -194056 264880 -29234 150688 -163751 38158 -356930 -123083
12386 -105753 212736 -139088 -207141 217337 134017 7229 73055 -101398 -291268 243227
12375c8822B30292A03633c4869m30384C8599e5010I2924C0205c12974J30730q8610
12364b70854a10723B65372H0999J2584a99024e0660k02673C15516A23587o067
12354A17520i9133F1976c24021J15288h3109b0963j53707F4642a78325P1952B9999
12342B23498e9174l80325G4531o325B2263i3666D6658j831a87494B49002b19921
12330E5059i5089j20145C54441q3985j01549H1807a21566C01433A39558R1072
12320B30630G7480a51007f8993M524k4840d237A11095g5320B17776K44904d3700
12308E1152J76376H4136J97392c4767m9001B62632f1482B26215b98518A70560
12297b30390J10470F8257a84647A45679d840j07779e4737B09803a6440B84514
$$ plain form
12375 -38822 230292 103633 -34869 -465253 38599 -55010 92924 30205 -312974 -182244 -270854
12364 -270854 -110723 265372 80999 93583 -199024 -50660 -253333 315516 123587 117520
12354 117520 -99133 61976 -324021 -208733 -83109 -20963 -174670 64642 -178325 -106373 29999
12342 223498 -59174 -439499 74531 68206 22263 -93666 46658 44827 -187494 249002 -219921
12330 55059 -95089 -215234 354441 270456 168907 81807 -121566 301433 139558 230630
12320 230630 77480 -151007 -68993 -64469 -89309 -4237 111095 -75320 217776 462680 -43700
12308 51152 227528 84136 281528 -34767 -83768 262632 -61482 226215 -298518 170560
12297 -230390 -119920 68257 -184647 145679 -4840 -112619 -54737 209803 -16440 284514
12286A23909b75529e8095B39468A09989C2712J01081H299d9857A05595C1682R5624
12275A27306i2357j0047b7625j79031g6511A28079p251A7688J08199D6650a15236
12263A70556K81562a50662A44116d2929A20113A4716a15745B46229p7162n9068
12253A09999a21665N0673k38320A38819h2904A54471b0293r6403H9000C7172a80697
12241A55638e2098R540D34199a47840B27424j12140C6284R7464K9525L3827b5651
12229D6187j2116P9000L1823K09649A19643P5830K13074A52204b70970B18369
12218B55310m6014I1561a9339n2079H9827L58330h5119C9524J13445B0649a45313
12206G5342R0538h3132A82836f0454C03823a06046l14920B59923k2587d3995B68616
$$ plain form
12286 123909 -275529 -58095 239468 109989 32712 133793 8299 -49857 105595 31682 127306
12275 127306 -92357 -102404 -27625 -206656 -76511 128079 120828 17688 125887 46650 -115236
12263 170556 452118 -150662 144116 -42929 120113 14716 -115745 246229 169067 109999
12253 109999 -121665 -70992 -309312 138819 -82904 154471 -20293 -116696 89000 37172 -180697
12241 155638 -52098 -42558 434199 -147840 227424 115284 36284 133748 163273 197100 -25651
12229 46187 34071 113071 144894 354543 119643 195473 408547 152204 -270970 218369
12218 255310 209296 91561 -19339 -71418 89827 448157 -85119 39524 152969 20649 -145313
12206 75342 165880 -83132 182836 -60454 303823 -106046 -420966 259923 237336 -43995 268616
12194D81160A61373l9876l5378j6316K1381Q5507L8064l2226L0317I4780A7397
12182i9171G3257N3949h7387F5983J88668C0642J58351I0478b0331A79083b14279
12170C02061J90847C5985Q6924J01293L4420j19241J56277A42221M25J14512h8726
12158d8519j2961B88156A3737a38188A9073b78018A48550p3060a05440c7628k04482
12147b42110i8992B7172a9308A32790A9482b8897B60083c17747A39174R9550a28646
12135A81931j494D7641e4461A35476J35748A26889i709F785O3127J16761H815
12123a14388k38291Q3929g9058B40906A17635a29962B14041l8659q7468b46388
12112a71495n9934c0101A83563j2914p6837I636Q4370L22711H1594M6951n3583
$$ plain form
12194 481160 161373 121497 86119 69803 91184 176691 214755 182529 212846 94780 17397
12182 -99171 73257 127206 -87387 65983 254651 30642 188993 90478 -20331 179083 -214279
12170 302061 492908 35985 122909 224202 258622 139381 295658 142221 142646 257158 -88726
12158 -48519 -61480 288156 13737 -138188 19073 -278018 148550 75490 -105440 -37628 -242110
12147 -242110 -98992 27172 -19308 132790 19482 -28897 260083 -317747 139174 238724 -128646
12135 181931 180437 47641 -54461 135476 271224 126889 -9709 6785 69912 186673 8815
12123 -114388 -352679 -268750 -79058 240906 117635 -129962 214041 175382 87914 -246388
12112 -171495 -231429 -30101 183563 170649 93812 9636 94006 416717 81594 128545 74962
12101G4962h9499q9116a4290n2173A44643n5377a37354B97633a2164A17461a05420
12089C32354f8335A85561C9600P0755c7742A5605L10170c108A54873J01239c00362
12077A96752h3998I1535b89465A17541A0744f2332m4358I3495a43515L0830K7033
12066h5652D2267b42757e799C31121A08165a54720b143j76703B0397q082Q8756
12055A01071b7729E44051P83202C90435a26707c9326B4898f5047A79513F0408
12044a39420a0932j24132A10743J8338a73995L6306K603B12645G6938a69302q2423
12033b51725f3353A4448J21487g1399b018k33847A25778d0090A1202K0592J55975
12022A87769a44536A22837D7915b88643J33508J2771A00825L1462b75851f1348
$$ plain form
12101 74962 -89499 -178615 -14290 -66463 144643 89266 -137354 297633 -12164 117461 -105420
12089 332354 -68335 185561 39600 110355 -37742 15605 325775 -3108 154873 256112 -300362
12077 196752 -83998 91535 -289465 117541 10744 -62332 -106690 93495 -143515 -112685 -85652
12066 -85652 42267 -242757 -5799 331121 108165 -154720 -2143 -178846 20397 12315 101071
12055 101071 -27729 544051 1327253 390435 -126707 -39326 24898 -65047 179513 60408
12044 -139420 -10932 -135064 110743 129081 -173995 -137689 -135086 212645 76938 -169302 -251725
12033 -251725 -63353 14448 135935 -71399 -2018 -235865 125778 -40090 11202 31794 187769
12022 187769 -144536 122837 47915 -288643 -155135 -142364 100825 132287 -275851 -61348
12011B50381j16393P5952a19135a4822j96999H0985J4432b58386J07113j53028
12001c04301g1636n8433A2119a89724A56149A6857a30141N0217r7410B99492A32653
11989C16008b18584h8267F9654J63160a60087p3664A53261J32153b68436R5108
11979a73328j80110a7120A69728g2410A57019a76243B18689c1238A17245c4377
11968A1085a5689H065l533b13199B01313C8993a51608B12278N4860b89436F5058
11956B8241P4008D5375d97093i59l65072a77887m0762A79483e0617k43508B07029
11944A45305K1709i3394B5644J52668M4008a80055L2661A77699a00056A54037
11933C04747I480K25988I371O3014a20857L6565A13067a73673j75896h4864M1286
$$ plain form
12011 250381 133988 209940 -119135 -14822 -211821 80985 95417 -258386 -151273 -304301
12001 -304301 -71636 -130069 12119 -189724 156149 16857 -130141 -79924 -177334 299492 132653
11989 316008 -218584 -88267 69654 232814 -160087 -233751 153261 285414 -268436 -173328
11979 -173328 -353438 -17120 169728 -72410 157019 -176243 218689 -31238 117245 -34377
11968 11085 -15689 8065 4532 -213199 201313 38993 -151608 212278 267138 -289436 65058
11956 28241 102249 45375 -497093 -959 -366031 -177887 -218649 179483 -50617 -294125 207029
11944 145305 167014 -93394 25644 178312 222320 -180055 -147394 177699 -100056 154037
11933 304747 9480 235468 9371 72385 -120857 -84292 113067 -173673 -349569 -84864 -43578
11922d3578j70805A01357b74279g4808q6554d2259A01605a93560B26166D6293
11911a3940A86643f2844k38907A92689M3111b74215g7998B89625a51501A7326
11900D6409b47331R8639G8901b76339A50101p0980b90626d9664I9838J58787a9277
11888B20718d7892a5926k38098c5437m4423B60374b56490A9623d6711I8184D3742
11876b18326A38076k3535K87463b56313C2965h8499a8589j78334d1257k15699
11866b56956B8719a85980l0094d5642D5854a02505L1071C37230b87443J29860
11856a57583B27492c0744A02601g1214A32566a12985p9196A18518e1599D47180
11845I7876e6542k35894g306m947n5045A8570b52992A61886C5756g0666l8769
$$ plain form
11922 -43578 -214383 101357 -274279 -74808 -161362 -42259 101605 -193560 226166 46293
11911 -13940 186643 -62844 -301751 192689 235800 -274215 -77998 289625 -151501 17326
11900 46409 -247331 -148692 78901 -276339 150101 79121 -290626 -49664 99838 258625 -19277
11888 220718 -47892 -15926 -254024 -35437 -79860 260374 -256490 19623 -46711 98184 43742
11876 -218326 138076 114541 402004 -256313 32965 -88499 -18589 -196923 -41257 -256956
11866 -256956 28719 -185980 -216074 -45642 45854 -102505 -71434 337230 -287443 -157583
11856 -157583 227492 -30744 102601 -71214 132566 -112985 -192181 118518 -51599 447180
11845 97876 -56542 -292436 -7306 -12253 -67298 18570 -252992 161886 35756 -70666 -109435
11834a09435j49611j75198F7599b5142D39710i2228A05814J04611a87390Q8236
11824i9154L0234p0775M0222m55428F6911f9794p5660C168A363b54255a4577A8908
11811a80308e4315j84269a10340R821A08938J35437a93617B95852b9214D6567
11800E2617B3489J96138b76829f0542F4835b72676f8178B49848I3910b08700b8006
11788c04239g1823r2253a2023B18766a11230j68258E5992c1403l0196j69512B59751
11776b2766q6235A70010D0248P6657e8428E0306b11869o6061O786D8085J42304
11765A90389E2463J17777a35652G6909K3062J76102H8500a70446k71725D20071
11754g5834E8731B6849d15259i0963l6019B17272M6735a88947g5754q1097L753
$$ plain form
11834 -109435 -259046 -434244 67599 -25142 439710 -92228 105814 210425 -187390 -99154
11824 -99154 -68920 -139695 -99473 -554901 66911 -69794 -145454 3168 1363 -254255 -14577 18908
11811 -180308 -54315 -238584 -110340 -100519 108938 244375 -193617 295852 -29214 46567
11800 52617 23489 219627 -276829 -60542 64835 -272676 -68178 249848 93910 -208700 -28006
11788 -304239 -71823 -164076 -12023 218766 -111230 -279488 55992 -31403 -61599 -231111 259751
11776 -22766 -109001 170010 40248 116905 -58428 50306 -211869 -277930 -271144 48085 190389
11765 190389 52463 170240 -135652 76909 99971 276073 88500 -170446 -442171 420071
11754 -75834 58731 26849 -415259 -90963 -126982 217272 264007 -188947 -75754 -156851 -153098
11743a53098G9297a01701b1450j54165B6761a58181K9748E6266a20814j00088
11733b20902M3954O9177j43438A82489b12330c2708A11801M3036a6078k06118
11723b22196O909a9010q9779l8531k43968B6936J66445K9336a65082A58311B8963
11711b69231J23450A7627L52681A1528h7777H6417J06042a84756j62273J38409
11701b08620H5108c05010d9885r8964A16302b95712H9775J03709a11142A0187
11690A335R8985M1575n9761P0609j4571c75752J78293c9244k7361j90902g6917
11678B1462J96469b47599n0048i7957c6710n7379D1892a59250D3725f8062k58565
11667c26627C48327a18619I7381B6477c5984a6881j6881j02511A93232k3538a89360
$$ plain form
11743 -153098 79297 -101701 -21450 -175615 26761 -158181 -128433 56266 -120814 -220902
11733 -220902 -176948 -107771 -251209 182489 -212330 -32708 111801 154837 -16078 -222196
11723 -222196 -215287 -19010 -108789 -147320 -391288 26936 193381 222717 -165082 158311 28963
11711 -269231 -145781 17627 370308 11528 -87777 86417 192459 -184756 -347029 -208620
11701 -208620 85108 -305010 -49885 -148849 116302 -295712 89775 193484 -111142 10187
11690 1335 100320 141895 82134 152743 138172 -375752 -197459 -39244 -66605 -257507 -76917
11678 21462 217931 -247599 -297647 -97957 -36710 -94089 41892 -159250 43725 -68062 -326627
11667 -326627 348327 -118619 97381 26477 -35984 -16881 -33762 -136273 193232 169694 -189360
11655A58946b89333l7861e8288j50700A20059g7929o777k50442A36837a9517C2661
11643C5686h2035H5883L5397a70215a8256A03576N9707c96161J83604C9256J08470
11632A47726a52076A28027g5002j99604A39646e435k62034F2658k7358d3253k0475
11621f3728G5986a1506q0619k7876e6985a9770k3193A11433L1763p0621b07597
11609i5731I6602c04243A57542b7178q4488A83857i5725C7011o004A1559a8997
11597a81638j31249C66166D5435K88523h5692B8045d21680A51362a87480A85004
11586b17721E3635O282a91410C47555A47819b16105r5469C39874j34690G1042
11575b32357j6302f7361a704E1496a71303A81666d7226j24702d0360A20551J03748
$$ plain form
11655 158946 -289333 -327194 -58288 -208988 120059 -77929 -84706 -335148 136837 -19517 32661
11643 35686 -82035 85883 121280 -170215 -18256 103576 163283 -396161 -212557 39256 147726
11632 147726 -152076 128027 -75002 -274606 139646 -5435 -267469 62658 35300 -43253 -63728
11621 -63728 75986 -11506 -92125 -120001 -56985 -19770 -42963 111433 143196 72575 -207597
11609 -95731 96602 -304243 157542 -27178 -111666 183857 -95725 37011 31007 11559 -18997
11597 -181638 -312887 366166 45435 333958 -85692 28045 -421680 151362 -187480 185004
11586 -217721 53635 59917 -191410 347555 147819 -216105 -311574 339874 205184 71042
11575 -232357 -248659 -67361 -1704 51496 -171303 181666 -47226 -171928 -40360 120551 224299
11564B24299a62821I4154J74076a95633A77921j7254E0253a9984C5878K31287
11554B67165A7424M7728J65933a02388A50012P9291C6803K4381a86412J618A0350
11542B15943J0750j04687J4667c15793B21080b84924a28375p3389f3062j32103
11532a95165A92633a42600D02267i3900A10437b82356i4037B53533J09405i1907
11521B85568f3967K9995A02014d1793A22689a4922j35100C52935a18101J2512
11511a05589o2071d765j4049j75218e154E0504L70971j61881D9798M30275b04250
11499b88030A56658h5140A241g8527j539B41839I5354R4251J52569A13559M4345
11488A57904O2063o6854L3916H2052h791B39495j03074H190K00730K6776d1291
$$ plain form
11564 224299 -162821 94154 268230 -195633 177921 160667 50253 -19984 35878 267165
11554 267165 17424 65152 231085 -102388 150012 229303 36803 61184 -186412 -184794 10350
11542 215943 226693 122006 136673 -315793 221080 -284924 -128375 -201764 -63062 -195165
11532 -195165 192633 -142600 402267 -93900 110437 -282356 -94037 253533 362938 -91907
11521 285568 -63967 -33972 102014 -41793 122689 -14922 -150022 352935 -118101 -105589
11511 -105589 -167660 -4765 -18814 -194032 -5154 50504 421475 259594 49798 480073 -204250
11499 -288030 156658 -85140 1241 -78527 -80066 241839 95354 189605 342174 113559 157904
11488 157904 219967 153113 187029 82052 -8791 239495 136421 8190 208920 235696 -41291
11476b17654B21749r1970n5287K63079i7227L3246B58655A16252J78815A2583
11465A55650k8079p171b50111A05127n0909J36488L7971B1922J4542c25928G7081
11453A39153l1105R9272C5806i7204M6463j63753F9057K96055A18473e69719h222
11441A78631K0699E3070C499K44266a2203B27189f8116E9047a90978N927A7209
11429G5130B3363L591L28001c4650A40291J05925A03654a21892j15809A96299
11418E9999b98789e7780A92197H5605i6804A01414P847c00844j08361A55229b03436
11406B2993K939h7144D4721J16437a69168C3974a17756k423J8954B20397N5895
11395B76292r2412f7162E3085J23992D5035c52827E5717h2916r2452a5375A39100
$$ plain form
11476 -217654 221749 129779 74492 337571 -97227 -63981 258655 116252 295067 12583
11465 155650 127571 120400 -250111 105127 54218 190706 228677 21922 36464 -325928 77081
11453 139153 108048 207320 35806 -97204 -50741 -214494 69057 365112 118473 -569719 -8222
11441 178631 199330 53070 3499 247765 -12203 227189 -68116 59047 -190978 -185051 17209
11429 75130 23363 26954 354955 -34650 140291 246216 103654 -121892 -237701 196299
11418 59999 -298789 -57780 192197 85605 -96804 101414 109261 -300844 -409205 155229 -203436
11406 22993 25932 -87144 44721 161158 -169168 33974 -117756 -120179 -101225 220397 276292
11395 276292 183880 -67162 53085 177077 45035 -352827 55717 -82916 -175368 -15375 139100
11383A00017J11941a40192L4618j6055F9547J81054i9776G984J13971a02427j49516
11372b51943I2949c4783r0543l8699M0703o3544I1637M1982A2662a80356N5854
11361a24502A06641L0512f0874E2428Q1223c966E2591J81173b6092j75738B88964
11349c5196A1769J48217K24690f7652A38645b97813a10752A20461d8243j76306
11339b24549G4238a58502B23616b10372J04702L3205C6943N6661J87649B7595
11328a509o5156c1549A16266j3601b54590I4175K49763b54662g0310E8361k3234
11317C5127J393a18599L9032j77436J28192B01766b79769a32372b0732j90440
11307b11172B11438O05E4127a96879M2979A27024f7791j49675i5427M148A29091
$$ plain form
11383 100017 211958 -140192 -105574 -121629 69547 250601 -99776 7984 121955 -102427 -251943
11372 -251943 92949 -34783 -125326 -164025 -123322 -186866 91637 133619 12662 -180356 -124502
11361 -124502 106641 137153 -60874 52428 133651 -3966 52591 233764 -26092 -201830 288964
11349 -35196 11769 159986 384676 -67652 138645 -297813 -110752 120461 -48243 -224549
11339 -224549 74238 -158502 223616 -210372 -105670 -72465 36943 93604 281253 27595
11328 -1509 -66665 -31549 116266 102665 -254590 94175 343938 -254662 -70310 58361 35127
11317 35127 36520 -118599 -79567 -257003 -128811 201766 -279769 -132372 -20732 -211172
11307 -211172 211438 212043 54127 -196879 -153900 127024 -67791 -217466 -95427 -91279 129091
11295d5530j16565C9221j4301b1595p3449j03962n8547D3382g9683F6807A9151
11283d72809A20462O7965F2602b0985k74337c5071j27818d2286j49582B3130O7078
11272I0208a96462K2231A66640d60233A0319h0551m7301c3198r933r1613N9879
11261g4865B43286b37449C86371d53348d4041B6257p343a21998A47956a68435
11250b31645e5907K210n65827a14174k35301O3032b0692A14475D985c3299l37438
11239c70737e8686C04763a12917H1433d44985h9563C48767d6787A62523b04779
11228b9431G5329P2299b00740O0730I2442a26082B97491j48075c0177B47091a55105
11216A17757f4410j24101g9622C09897a73840l5499B2454a92414i1558k7064p9784
$$ plain form
11295 -45530 -162095 39221 24920 -21595 -95044 -199006 -257553 43382 -79683 66807 19151
11283 -472809 120462 188427 62602 -20985 -295322 -35071 -162889 -42286 -191868 23130 90208
11272 90208 -196462 -174231 166640 -460233 10319 -80551 -127852 -33198 -43131 -134744 -74865
11261 -74865 243286 -237449 386371 -453348 -44041 26257 18914 -121998 147956 -168435
11250 -231645 -55907 -53697 -619524 -114174 -349475 -286443 -20692 114475 4985 -33299 -370737
11239 -370737 -58686 304763 -112917 81433 -444985 -89563 348767 -46787 162523 -204779
11228 -29431 75329 147628 -200740 -140010 92442 -126082 297491 149416 -30177 247091 -155105
11216 117757 -64410 -188511 -79622 309897 -173840 -209339 22454 -192414 -91558 -118622 -198406
11205a98406d1594k66195J46337j90365A34985i3413F366Q9175b09434A94703
11194I1956R1451E412J79780b07892B05001b95792B11536b62269g8361A17221
11183d22348a32841D3247b35665A19301e1071a1066A05780a8065F7388c21217
11172B98729A4084J83242A9689c5649A06189J18312o9511J25428i2160j39979
11162b32139A51336c4078B31670E5469b465j60525A65775i470H9077l7186a06552
11150A00886b76120a24409C8912K19139i6043D58760c13255A4726a19085C09075
11139H4895J0443K5367d2524k36730H4847b5304l50644B99868c52530B53238b01569
11127A48633M1299b2627q1765j57446A99822G0555a71706j55389d3323j54423
$$ plain form
11205 -198406 -41594 -307789 -161452 -351817 134985 -93413 6366 95541 -209434 194703
11194 91956 183407 5412 185192 -207892 205001 -295792 211536 -262269 -78361 117221
11183 -422348 -132841 43247 -235665 119301 -51071 -11066 105780 -18065 67388 -321217
11172 298729 14084 197326 19689 -35649 106189 224501 154990 280418 -92160 -232139
11162 -232139 151336 -34078 231670 55469 -2465 -162990 165775 -9470 89077 51891 -106552
11150 100886 -276120 -124409 38912 258051 -96043 458760 -313255 14726 -119085 309075
11139 84895 95338 120705 -42524 -279254 84847 -25304 -375948 299868 -352530 253238 -201569
11127 148633 189932 -22627 -104392 -261838 199822 70555 -171706 -327095 -43323 -197746
11117a97746E10503a19642F8924h9268A98903g8657m0525A30644O5186q7863J71358
11106B79325j16731D2446J25853C9414J31276q320K23593b83279B95320I2027
11095E7717a18655I8290a12661d5839G272f0254A39510M63358B86617P1692I4041
11083C20960A37715b6643B12639c3246A29104A8762j769K37192J04554j06606
11073B52133K87296H7175K34354j53359J89429J6423m2590o7717J04269A50517
11062D27409k03174J16550j26114L07805j80550k6856K22526A70073M17869j91784
11052C96158K68679j39781L1052j89212L27416k53436P9581J52055k79081J08949
11042E02380j50416L86160o0287n5413k44410J25682j64595M52333r0627k46142
$$ plain form
11117 -197746 510503 -119642 68924 -89268 198903 -78657 -119182 130644 195830 107967 279325
11106 279325 162594 42446 168299 39414 170690 162370 385963 -283279 295320 92027
11095 57717 -118655 98290 -112661 -45839 7272 -60254 139510 602868 286617 358309 94041
11083 320960 137715 -26643 212639 -33246 129104 18762 16993 254185 358739 252133
11073 252133 539429 87175 321529 168170 357599 374022 331432 263715 367984 150517
11062 427409 224235 340785 214671 522476 341926 315070 537596 170073 587942 396158
11052 396158 664837 525056 556108 366896 694312 440876 520457 672512 393431 502380
11042 502380 351964 738124 677837 622424 378014 503696 339101 791434 700807 454665
11032D54665o0091J20941Q2901K86344k84328n0331J27389k0752j85093J12466
11022E84111j01437E6703O56051A70369L40320A300N47245J73017k7791k18478
11012D75293l193j77098J13701A35410K25546J42416k25414J75013A99187L11224
11002E10411J53372L8366j34159K03105k26020k62373L27518q0509J60832O6908
10992G57451l5246k74094P0712J48877L58468D69154M29272N8941m07899M43433
10982I92901Q5770j35889R6246J79411L43308k36576K65136O5220Q10092m21585
10972B044034L51852j06856J401J04133k3764n52344o33526K48871m63282K64707
10962A235226p8702k44716K21487l45136K7292J73643D48973R2991R6324j69118
$$ plain form
11032 454665 394574 515515 598416 884760 600432 550101 677490 656738 471645 584111
11022 584111 482674 56703 712754 170369 510689 1300 548545 721562 693771 475293
11012 475293 472100 295002 408703 135410 360956 503372 277958 452971 199187 510411
11002 510411 663783 702149 567990 771095 545075 282702 610220 529711 690543 757451
10992 757451 722205 448111 518823 667700 1026168 469154 898426 957367 549468 992901
10982 992901 1078671 942782 1039028 1218439 1561747 1325171 1590307 1655527 2465619 2044034
10972 2044034 2395886 2289030 2290431 2394564 2370800 1818456 1184930 1433801 970519 1235226
10962 1235226 1156524 911808 1133295 788159 815451 989094 448973 541964 638288 469170
10952D69170k13891J20287j8260c3012A59663G9423b3016D1217J21121M4379J08943
10941C15660A45254k4906L6385P4583j07134f8993a3933k8966K0173C09514j18704
10930A90810J11578L2232m7712j29227b00913L5820j20418C0591j4216h0950A53054
10918c6343G7020M295a6634B78772q1363B0928b30086A20714P0428b84067B37150
10906A6604J19585F7458a37268A21842C0193J61264a26721j80090J19591A52039
10895B1029J34862L4488l0586D9109j6845a08991J530c525F0118a40937c288m2113
10883d5401j62189b2458H4124f3773j0647k27948Q7321B2675L96567C0674a03094
10871H1442a19820h058j09639j7301E4983I477a1246k86440a27640A16348b86541
$$ plain form
10952 469170 255279 375566 357306 -33012 159663 79423 -23016 41217 162338 206717 315660
10941 315660 145254 120348 156733 231316 124182 -68993 -13933 -42899 -22726 309514 190810
10930 190810 302388 334620 286908 157681 -200913 -165093 -285511 30591 16375 -80950 153054
10918 -36343 77020 81315 -16634 278772 197409 20928 -230086 120714 191142 -284067 237150
10906 16604 136189 67458 -137268 121842 30193 191457 -126721 -306811 -187220 152039
10895 21029 155891 190379 159793 49109 32264 -108991 -107461 -3525 60118 -140937 -3288 -45401
10883 -45401 -207590 -22458 84124 -63773 -74420 -302368 -215047 22675 419242 30674 -103094
10871 81442 -119820 -8058 -117697 -134998 54983 9477 -11246 -297686 -127640 116348 -286541
10859A29361f4616C572Q3140a60090c1885l17732a21299J3933B1289a50168c0254
10847b06119a066D0456R2227m2404a72550j27278C2124f0944p6636l08854d8401
10835A13198a88738D1513a36983p3588B41105b16223d0052B0340K026K84158H0055
10823d6641H059l275J30532F1966K37233a6906B8100i8221O370c8607F0742f4932
10810a80298J4787A22117b12986R1345j30154b8797k96776e6859E4878b85916
10799G8999J10141b9628A3086R8008a29091M3162j90079Q1638D4324b70033a7803
10787a22456i111j31195N2487I5191b37064B3265a35804d1538k47512f5968b3062
10775f0888A65247e2149p7760G5896a88241e3867n3963a1636m84127B1355a16214
$$ plain form
10859 129361 -64616 3572 86712 -160090 -31885 -349617 -121299 -107366 21289 -150168 -30254
10847 -206119 -1066 40456 132683 90279 -172550 -299828 32124 -60944 -137580 -446434 -48401
10835 113198 -188738 41513 -136983 -210571 241105 -216223 -40052 20340 22366 306524 80055
10823 -46641 8059 4784 135316 61966 299199 -16906 28100 -98221 -91851 -38607 60742 -64932
10810 -180298 -165511 122117 -212986 -121641 -251795 -28797 -325573 -56859 54878 -285916
10799 78999 189140 -29628 13086 111094 -129091 -85929 -276008 -194370 44324 -270033 -17803
10787 -122456 -9111 -140306 -87819 95191 -237064 23265 -135804 -41538 -289050 -65968 -23062
10775 -60888 165247 -52149 -129909 75896 -188241 -53867 -107830 -11636 -495763 21355 -116214
10763a45080M5123a814l3232B31900b1744j47873A2951K1522K16057b6062A73312
10751h9141l6848H2496L9503K0782l6634h8063A5862N3099b9510d093I1436b86362
10738F2909A6457f6653o3714b849j75949J374N0206j58389I7518m981r138h2530
10725I6339f0300j13488A75710a58608D5694a66034J3963C64279A76129n4427
10715A21702a15990q9093d9l28886G4565E656a8878B46833c0686A47039M4993
10704A92032D9402c8468j6765A52876a20431A37039a34683L2175c1319j19675
10694a50994F461K60267e1356F9347b34898A69908h1509n6201j8930C17431h527
10682A61380b4249A80514C5702N954P7200J24194i2416k3044A56898b33365J14726
$$ plain form
10763 -145080 -99957 -1814 -35046 231900 -21744 -169617 12951 34473 250530 -26062 173312
10751 -89141 -125989 82496 121999 142781 106147 -88063 15862 68961 -29510 -4093 91436 -286362
10738 62909 16457 -66653 -130367 -2849 -178798 -177424 -127218 -285607 97518 92537 83399 -82530
10725 96339 -60300 -173788 175710 -158608 45694 -166034 -152071 364279 176129 121702
10715 121702 -115990 -205083 -49 -328935 74565 5656 -18878 246833 -30686 147039 192032
10704 192032 49402 -38468 -55233 152876 -120431 137039 -134683 -102508 -31319 -150994
10694 -150994 6461 266728 -51356 69347 -234898 169908 -81509 -137710 -156640 317431 -8527
10682 161380 -24249 180514 35702 41656 118856 243050 -92416 -115460 156898 -233365 -118639
10671a18639C0799J33516c99368h7007c8131J7762A74444i8533M4002j6365I8269
10659B29744F5928i446B1696b4389k6271k96172a59926c9824A1985f8675E1988
10647b93671B27350a9701k07619D16947f2275a8557A40896c4244k21474c8853
10636e7569n5859B36815a91512A33511n8555K43262A07135a86990A01209J399
10626A02608D3931g8605j723A88653e5290r9349A75376f377j20524A13890J754
10615A15644b2449l08161A7797a66780B3123J18310J45763d8750F0326a59958
10604a17078F7674A2065e5570j10844k18927J24689A47363b62897G0984a08880
10593A20695A1057c06281a33067j11127A25332d4635j15386N5208A75987J48848
$$ plain form
10671 -118639 30799 164315 -399368 -87007 -38131 -20369 174444 -98533 -54531 -70896 98269
10659 229744 65928 -9446 21696 -24389 -50660 -346832 -159926 -39824 11985 -68675 51988
10647 -293671 227350 -19701 -227320 416947 -62275 -18557 140896 -34244 -255718 -38853
10636 -57569 -113428 236815 -191512 133511 74956 318218 107135 -186990 101209 102608
10626 102608 43931 -78605 -80328 188653 -55290 -154639 175376 -6377 -126901 113890 115644
10615 115644 -22449 -330610 17797 -166780 23123 141433 287196 -48750 60326 -159958
10604 -117078 67674 12065 -55570 -166414 -385341 -260652 147363 -262897 70984 -108880
10593 120695 11057 -306281 -133067 -244194 125332 -44635 -160021 -104813 175987 324835
10583C24835D4439B960a31022j02913K0514R2989B8539Q0483e6639C33211i4981
10571B22124H6683e1915B3068L33220i4577j1523M3089j28540b8818j97827A93305
10559c34006j7473g4559A09409b69368R0586A23023j0451e1930j7572I5742d3177
10547A86072F8619J3101b55608J07593f9767H6953a27784b3674j88661f9913L4087
10536c5826D27518a38926j89739i8799D9130b9477D3712L28962g2408A48753a33412
10524A17167c64912E561c18886l5796G8191c23626E9116k0995K7804a1862A3762
10512A3174J21023l1837K22441f0911j41737C2753R962J9910b87521B04481k5890
10501A78591j7704a16982H1037f3641A72755c1448k2676B05777i6449p2785e5722
$$ plain form
10583 324835 44439 2960 -131022 -233935 -213421 -120432 28539 109022 -56639 333211 -94981
10571 222124 86683 -51915 23068 356288 -94577 -106100 -63011 -191551 -28818 -226645 193305
10559 -334006 -351479 -74559 109409 -269368 -178782 123023 112572 -51930 -69502 95742 -43177
10547 186072 68619 81720 -255608 -148015 -69767 86953 -127784 -23674 -212335 -69913 -35826
10536 -35826 427518 -138926 -328665 -98799 49130 -29477 43712 372674 -72408 148753 -133412
10524 117167 -364912 5561 -318886 -354682 78191 -323626 59116 38121 65925 -11862 13762
10512 13174 134197 102360 324801 -60911 -202648 32753 42715 62625 -287521 204481 178591
10501 178591 160887 -116982 81037 -63641 172755 -31448 -54124 205777 -96449 -169234 -55722
10489c1129I3082J79128e11794K16341a2940D8930J6338a46655B71591A31614
10478b9194C01141d35908a89261j3168A35409a3058m9488h474D6407f9783b0289
10466a03843b6474k34391f2385B55959L7279j23417b4044B29993a46420A34662
10455B15736f3948o2979I6688c98614A5747c3899A44348d2347j75990N4703j4952
10444a78586J6062R095k43797A30871e5844k86168B81681F6026J40645h5686A09079
10432c10532a24269b4832d402A55985F2958k6509f8240n9150M7856l35434b05632
10420B02782A2534J75119R0951b68763M0738D7839J290M0544B5993N3886M8584
10409A28463K31973f8066c3150D8562a6353A5587d3091A54662e2542a9835i810
$$ plain form
10489 -31129 93082 272210 -511794 -295453 -12940 48930 65268 -146655 271591 131614
10478 -29194 301141 -435908 -189261 -202429 135409 -13058 -62546 -8474 46407 -69783 -20289
10466 -103843 -26474 -260865 -62385 255959 293238 169821 -24044 229993 -146420 134662
10455 215736 -63948 -126927 96688 -398614 15747 -33899 144348 -42347 -218337 -163634 -178586
10444 -178586 -162524 -153429 -397226 130871 -55844 -342012 281681 66026 206671 -85686 109079
10432 -310532 -124269 -24832 -4402 155985 62958 36449 -68240 -127390 -79534 -414968 -205632
10420 202782 12534 187653 278604 -268763 -228025 47839 49129 89673 25993 79879 128463
10409 128463 360436 -68066 -33150 48562 -16353 15587 -43091 154662 -52542 -19835 -9810
10397A4220b21306A97827F354N9166J16258J7074B3748c32327A56065R9860j14935
10386A40990O7262C8889J00997e8334j16809A02841K66015A02075K44642n9915
10376B86802C0750J88646j2368L5354J24580j62106N575N4994n306J86392E9092
10364A60043M79955B54268l6053d6536o2452C93915c0716C10323j18889D048L04782
10353C08830q5148M4031L08353k54893A44704K52232c0292C27904f0617D01378
10342B24076r5841L91589A98632Q7267k5304q7201D8016J63123L1168K69838C941
10330B31426d29149b981E53573k34769b1773A61600C3381J08453J35002l1116
10320B45720o3527B6977L35671l2054f4000A96223i1057I3237D3968Q7781J88778
$$ plain form
10397 14220 -221306 197827 6354 65520 181778 198852 23748 -332327 156065 255925 140990
10386 140990 208252 38889 139886 -58334 -175143 102841 368856 102075 346717 286802
10376 286802 30750 219396 207028 242382 366962 204856 210431 265425 260119 446511 59092
10364 160043 639998 254268 218215 -46536 -108988 393915 -30716 310323 191434 4048 308830
10353 308830 223682 267713 576066 321173 144704 396936 -30292 327904 -60617 401378
10342 224076 128235 519824 198632 285899 260595 173394 48016 211139 242307 512145 3941
10330 231426 -429149 -2981 553573 318804 -21773 161600 33381 141834 276836 245720
10320 245720 182193 26977 362648 330594 -64000 196223 -91057 93237 43968 131749 320527
10309C20527A5993a70093A67818h8556k07521g4352B8358J63287j1173b54470
10298b43351B10870a32079A08059e9819b7995B17803k2926C026i2609C775J895
10287E670a68642B01155C2206a33686c2221r0913r7237C504g9198A37034a44469
10275a66988p8621c2618C01651a70625A17242i7090A28970A9286J81933e387B33313
10263E8472e1569B62797q6010A0902F08J03842d1176B37176J2503A21557J50659
10252B72216o6659J39519F0519a32904E9148g0494r4244Q1173A68898G4144a16644
10240d2731F8645C1677b64430C34050b12447G4614a0602k43726F2639b29759K3551
10229b06208l8827j9609P5680d2106j00836j73400j2727J59786d6387o8632L1421
$$ plain form
10309 320527 15993 -170093 167818 -88556 -296077 -74352 28358 191645 180472 -254470
10298 -243351 210870 -132079 108059 -59819 -27995 217803 194877 3026 -92609 3775 5670
10287 5670 -168642 201155 32206 -133686 -32221 -123134 -220371 3504 -79198 137034 -144469
10275 -166988 -245609 -32618 301651 -170625 117242 -97090 128970 19286 201219 -5387 233313
10263 58472 -51569 262797 176787 10902 608 104450 -41176 237176 249679 121557 272216
10252 272216 205557 345076 60519 -132904 59148 -70494 -164738 -83565 168898 74144 -116644
10240 -42731 68645 31677 -264430 334050 -212447 74614 -10602 -254328 62639 -229759 -206208
10229 -206208 -245035 -264644 -188964 -42106 -142942 -316342 -329069 -169283 -46387 -115019 -83598
10218h3598l4898A42379R0760a79255h4449L2314D16009c57044a39278f1511l97644
10207d59155B86670a82977j23123J25166Q9107p5463G6661C7554a75869L3658
10197a42211B28517a8118l6432e983l6864I9877a87412d4439k5432B9664J435
10186C1099b43310A43168A5594c3647B7257M9385a34380k51865c0491j38292L4329
10175a34454B01172B3141J19949K34575A1888a69790m5014H3536b46897C17253
10164g2197H8435P1447B3606a27594H9687J2265J94977d19514I8255N5423c15017
10152A6077R772a97462D0971i582j99451L6095D0619a92826m937A69143c702k54696
10140b58398A6140e1684A83164B755b32415Q2504P3389k90578J71064i003G0653
$$ plain form
10218 -83598 -118496 142379 233139 -179255 -84449 -52135 416009 -357044 -139278 -61511 -459155
10207 -459155 286670 -182977 -306100 -180934 -91827 -167290 76661 37554 -175869 -142211
10197 -142211 228517 -18118 -54550 -5983 -42847 99877 -187412 -44439 -69871 29664 31099
10186 31099 -243310 143168 15594 -33647 27257 76642 -134380 -386245 -30491 -168783 -134454
10175 -134454 201172 23141 143090 377665 11888 -169790 -214804 83536 -246897 317253
10164 -72197 88435 159882 23606 -127594 89687 101952 296929 -419514 98255 153678 -315017
10152 16077 25849 -197462 40971 -9582 -209033 -172938 40619 -192826 -197763 169143 -3702 -258398
10140 -258398 16140 -51684 183164 2755 -232415 -149911 -76522 -367100 -196036 -9003 70653
10128c36556B54557a40780j81240g5419r2972k59J4052C69591a9515A50172c33100
10116b33964r515A97950c5946a4019m1705q9806p9300A68391C2175J47868a42579
10104c9773A44818a1286l05899P8469N2360B55173D3057a20250q7905a6979A7925
10092A27832b74335A88147o7835K03300C0714a18566k02780f7821j98577A51860
10081A03534l912a59075F6471R8955a48401M7147B45935g9927E1138e5832l0193
10070h6025k16464a37541N1223H1679J38372d6856j39947c8689I2593k8035a67488
10058a67213G4073B9819a63724J9546l5586e0272F7297a19156c1381E6188J93366
10047B49554d0643l8152j80486d9083r7683f1915E7639b70104A7973a11216d4844
$$ plain form
10128 -336556 254557 -140780 -322020 -75419 -168391 -168650 -154598 369591 -19515 150172 -333100
10116 -233964 -243479 197950 -35946 -14019 -55724 -145530 -224830 168391 32175 180043 -142579
10104 -39773 144818 -11286 -317185 -238716 -186356 255173 43057 -120250 -208155 -16979 17925
10092 127832 -274335 188147 120312 323612 30714 -118566 -321346 -67821 -266398 151860
10081 103534 99622 -159075 66471 165426 -148401 -101254 245935 -79927 51138 -55832 -86025
10070 -86025 -302489 -137541 -86318 81679 220051 -46856 -186803 -38689 92593 64558 -167488
10058 -167213 74073 29819 -163724 -144178 -179764 -50272 67297 -119156 -31381 56188 249554
10047 249554 -40643 -78795 -259281 -49083 -146766 -61915 57639 -270104 17973 -111216 -44844
10035b03316g5995k229C5175b7065k5939l7890n1658j83962m6040j18081E2737
10023b5265j29519l0335Q5474B02408i6911G9809a01097j34686a04021l8245j22487
10012b64753B14875B0546b59135c1384q7183k80330J40515c3348N781o1317j5357
10001a04241E5441d045k28271H8338c17374a22198d1632A30339b1363k44903c5863
9989c52972E3902J95734d15233A39986a65242b7589B13863C647a26315l9900F1229
9977a40626j22426c83k0476n5247m3360k1156J7526r5506K6528j76039b9020A65229
9964b18445k11867R4375i8494l9877b0929j9650a0719D5052a52204R667C9552
9952I3816f9330C77910c1927j53555P1449K2303A17641B9656f3797e512D1573
$$ plain form
10035 -203316 -75995 -78224 35175 -27065 -53004 -90894 -142552 -326514 -372554 -490635 52737
10023 -25265 -154784 -185119 -99645 202408 -96911 79809 -101097 -235783 -104021 -142266 -264753
10012 -264753 214875 20546 -259135 -31384 -118567 -398897 -258382 -33348 -27567 -88884 -104241
10001 -104241 55441 -4045 -232316 88338 -317374 -122198 -41632 130339 -21363 -266266 -35863
9989 -352972 53902 249636 -415233 139986 -165242 -27589 213863 3647 -126315 -166215 61229
9977 -140626 -263052 -383 -20859 -76106 -119466 -140622 -123096 -218602 -192074 -368113 -29020 165229
9964 -218445 -430312 -335937 -98494 -138371 -20929 -40579 -10719 45052 -152204 -142537 39552
9952 93816 -69330 377910 -31927 -185482 -114033 -91730 117641 29656 -63797 -5512 41573
9940A11867h7D2001J17991j2469h6180k64214J4746g8729D4485j4760N1428B1840
9927C94431a03594M5938L615A05057e16513a20232C62118b70442A70192l7287
9917A32905D5894i3827o5277A19884a68403D3956J10708b25393f8855p8556j74602
9906c22013h8878o3921c8153B5639a88068b6564j80063B35816F9185e1261A68714
9894D7891P3313e0485m912n6019A92701c42902P7795B29995b54892n4347o0340
9883c69579H1888o053g3144j2298c5465q7403e6387A10157D2708N8764C5551b40979
9870A47990e6326a7575k17343D0974c10701E8382e16670A84306o1299b57393P6879
9859a80514j20243a16756q2811n2722a17573A15064P1730a56333r0714B54072
$$ plain form
9940 111867 -87 42001 159992 147523 -86180 -350394 -335648 -78729 44485 29725 81153 21840
9927 394431 -103594 -57656 -54041 105057 -516513 -120232 362118 -270442 170192 132905
9917 132905 45894 -93827 -159104 119884 -168403 43956 154664 -225393 -68855 -147411 -322013
9906 -322013 -88878 -152799 -38153 25639 -188068 -26564 -206627 235816 69185 -51261 168714
9894 47891 121204 -50485 -55397 -111416 192701 -342902 -265107 229995 -254892 -309239 -369579
9883 -369579 81888 75835 -73144 -85442 -35465 -122868 -56387 110157 42708 101472 35551 -240979
9870 147990 -56326 -17575 -234918 40974 -310701 58382 -516670 184306 123007 -257393 -180514
9859 -180514 -300757 -116756 -199567 -252289 -117573 115064 186794 -156333 -247047 254072
9848f652j48354M2538j33269o1331h0330a2372k0260m75452a9007F6921k9232
9837C7689f5016B82613j40916e8010k2261D6934h4925o0968g1342k00402a31923
9825c5574D6247i0902B54300b7914r3468o1258B98477a63793N3622A70074a54667
9813a32117d2480j30884g3195G1291K6528b7656A28729a34685C3597c0584k55374
9802b85958A1439a23255K4572l2185B00496j4385E8436K53503a54960B51165E1315
9790A30784i3725D3136K6609b18301A01228a54841g1947O168H736L3738b15629
9778b26603K848A24520A5155i8896r3045j8976R2022d8676C7465a31581N1626
9767g9955j43369A9479b52450l3196C95456D9580h1568C32068I9829a82136h6504
$$ plain form
9848 -6652 -155006 -112468 -245737 -307068 -80330 -12372 -32632 -508084 -19007 66921 37689
9837 37689 -65016 282613 141697 -58010 -80271 46934 -84925 -145893 -71342 -271744 -131923
9825 -35574 46247 -90902 254300 -27914 -121382 -182640 298477 -163793 -110171 170074 -154667
9813 -132117 -42480 -173364 -73195 71291 97819 -27656 128729 -134685 33597 -30584 -285958
9802 -285958 11439 -123255 -98683 -130868 200496 186111 58436 311939 -154960 251165 51315
9790 130784 -93725 43136 69745 -218301 101228 -154841 -71947 -65779 8736 42474 -215629
9778 -226603 -223755 124520 15155 -98896 -191941 -210917 -118895 -48676 37465 -131581 -79955
9767 -79955 -223324 19479 -252450 -285646 395456 49580 -81568 332068 99829 -182136 -86504
9755A29929K0228a16486j32988c9771B9391a33687n6780p9322i6327j68570i2113
9743a15364e0582n275K1919n44265I871b46421a07110D930c18567B908P0178j2208
9731F0878k9032b14839a06381A95850m2334a1620j159j16306d2897C7176h2973
9719a51062E5061e0976A03091a57009B6332b16426c2459I1613C3426a67252d4719
9707b73345d1003n0323j19168A94782c17490a09398k6921k4499A04550a4834j8869
9696c3703A70579M7567o4355j0365b31383Q2826p0887h390j38397O6156J4169
9685f6462j17368j5568f8430D37508a11794d3407B19544a70002c4942A47807a21209
9673G1426a3726I6161C3181J12015a76307j69732b8995c472k1824j04138k1866
$$ plain form
9755 129929 150157 -116486 -249474 -39771 29391 -133687 -190467 -269789 -96327 -264897 -92113
9743 -115364 -50582 -55857 -33938 -578203 9871 -246421 -107110 4930 -318567 2908 73086 60878
9731 60878 31846 -214839 -106381 195850 153516 -11620 -12779 -129085 -42897 37176 -82973
9719 -151062 55061 -50976 103091 -157009 26332 -216426 -32459 91613 33426 -167252 -44719
9707 -273345 -41003 -91326 -210494 194782 -317490 -109398 -136319 -160818 104550 -14834 -33703
9696 -33703 170579 218146 153791 143426 -231383 -148557 -219444 -8390 -146787 -80631 -66462
9685 -66462 -183830 -199398 -68430 437508 -111794 -43407 219544 -170002 -34942 147807 -121209
9673 71426 -13726 96161 33181 145196 -176307 -346039 -28995 -3472 -25296 -129434 -151300
9662a51300c7735J8035j96416d3875A25796a03737m7838j2426e1085j18465j34380
9651c03930J19240g7032c060j43386J7926j80305A70744m7188B2474d2510k50166
9640b92676J28004j52439J23496n7377g9040l11A08866e4808f729l28644Q1907
9629b53466g4381B31607a94894b0356o9554j77872B57266c37867A38194d57956
9618a86171h7136n6689d7282F192J70695E8971N0700L6053b70400g4043k7361
9607a01404d097k5636j20607N9960F7447k7700Q8409O3017a64700A2778c56706
9595e5468I3561H700M6754a5351A83678c6973j49665d181A11156a22831E4617
9583i3181n0535C2764h4463j29713B29533a85054k30402c4726B2119o076J16319
$$ plain form
9662 -151300 -37735 -19700 -216116 -43875 125796 -103737 -151575 -164001 -51085 -169550 -303930
9651 -303930 -184690 -77032 -3060 -146446 -128520 -308825 170744 123556 22474 -42510 -292676
9640 -292676 -164672 -317111 -193615 -250992 -79040 -79351 108866 -54808 -6729 -335373 -253466
9629 -253466 -74381 231607 -194894 -20356 -89910 -267782 257266 -337867 138194 -457956
9618 -186171 -87136 -143825 -47282 6192 176887 58971 109671 145724 -270400 -74043 -101404
9607 -101404 -4097 -29733 -150340 -90380 67447 39747 128156 191173 -164700 12778 -356706
9595 -55468 93561 8700 55454 -15351 183678 -36973 -186638 -4181 111156 -122831 54617
9583 -93181 -143716 32764 -84463 -214176 229533 -185054 -415456 -34726 22119 16043 132362
9572A32362J0945N826E8741a06786r1699e3329K0887l25073B3386a08661B77371
9560b27152J02440J3900l8043n6694G9735c7323B1322J56415a08030b1655L805
9549a7850k39781C4285c80859a23803k81492h5323f76r9911n0919A3506a01726
9537E0146a71985e7683B30271b00337J0337G1592Q2878j703a84677A56285a74642
9525A5151d726G3391a61602g2331A4307J44282G8109Q612B2236Q5650a12838c8127
9512a94120I206J0762a09572k25300B85940a9435J252a01k96299a36805M456k10384
9500c42733b5913k2875q1039j23393H8674D40h9800m07656J35499E00225k41242
9489B58983B816c4751k06216e5242m3190k08757A01100Q6278a76557A19057c45986
$$ plain form
9572 132362 143307 149133 58741 -106786 -198485 -53329 -32442 -357515 23386 -108661 277371
9560 -227152 -124712 -110812 -148855 -205549 79735 -37323 21322 177737 -108030 -21655 -17850
9549 -17850 -257631 34285 -380859 -123803 -405295 -85323 -676 -100587 -151506 13506 -101726
9537 50146 -171985 -57683 230271 -200337 -190000 71592 154470 152767 -184677 156285 -174642
9525 15151 -4726 73391 -161602 -72331 14307 158589 78109 86721 22236 107886 -112838 -38127
9512 -194120 9206 19968 -109572 -334872 285940 -19435 -18183 -101 -296400 -136805 -132349 -342733
9500 -342733 -25913 -48788 -129827 -253220 88674 440 -89800 -497456 -361957 500225 258983
9489 258983 2816 -34751 -240967 -55242 -98432 -307189 101100 187378 -176557 119057 -345986
9477D8988i8888k7247K8793l6739B9022h2783A3511b5868C98408a97526i1006
9465d30779a22380j35038E9929O1677k8293f4385q9573j13456J21933o9278j36839
9454c51598i1415A71525b74137G2189d5827q1522J9679K7910I4981b3739A79784
9442b97413H2039a01260K8681K9797A1087Q5340a37627A86974a20845o926b9299
9430C8867e7978j00115j49910n3988f3821r2710j20073J28022A02976a88118e2644
9418A10390h9669k5882A34458N9208R6667C1957b4224F5919i8473A04380o394
9407I7986b14973d4733k4222F8111c8627G8397a30861o6476g6031q9379I7278
9395c3128l1951A0311a50869A81051d20014A25149O7205c01167b8013A388d6332
$$ plain form
9477 48988 -98888 -126135 -97342 -134081 29022 -82783 13511 -25868 398408 -197526 -91006
9465 -430779 -122380 -257418 59929 121606 93313 -64385 -153958 -267414 -145481 -214759 -351598
9454 -351598 -91415 171525 -274137 72189 -45827 -127349 -107670 -79760 94981 -23739 179784
9442 -297413 82039 -101260 -72579 -42782 11087 96427 -137627 186974 -120845 -127771 -29299
9430 38867 -57978 -158093 -308003 -361991 -63821 -156531 -276604 -148582 102976 -188118 -52644
9418 110390 -89669 -115551 134458 193666 290333 31957 -24224 65919 -98473 104380 97986
9407 97986 -214973 -44733 -68955 68111 -38627 78397 -130861 -197337 -76031 -165410 97278
9395 -33128 -65079 10311 -150869 181051 -420014 125149 192354 -301167 -28013 1388 -46332
9383a52434H0962b03848A5105i0579A23892a22404j13533A0427c6883n2132j76803
9372b65818l0354F201h0898k5581H769b51712a21105q9330A68813l2579c0351
9360a96448A58196a25176F3611a09048F4338a44567B3374Q0290a10990B39412
9349b62961a5918k4851H270J68963G6513b06533p6083I2580J0376a39756B95186
9337a2058r0246A27843a48453j62843a11083M2710K4632j3419A0774K14638b82777
9325C14491p7465b8826D23503D1788a22649M5097B30109a05502A71479a01253
9314a72800Q4758J6826q8978M2510C72859c59779D5910c69301Q2247c0868j98421
9303b29289r8029e8072m118G4801C1770a43032A45193F7609k5835L5970b31255
$$ plain form
9383 -152434 80962 -203848 15105 -90579 123892 -122404 -235937 10427 -36883 -89015 -265818
9372 -265818 -296172 6201 -80898 -106479 8769 -251712 -121105 -210435 168813 136234 -30351
9360 -196448 158196 -125176 63611 -109048 64338 -144567 23374 103664 -110990 239412
9349 -262961 -15918 -40769 8270 177233 76513 -206533 -282616 92580 102956 -139756 295186
9337 -12058 -102304 127843 -148453 -311296 -111083 -68373 -43741 -57160 10774 225412 -282777
9325 314491 237026 -28826 423503 41788 -122649 -77552 230109 -105502 171479 -101253
9314 -172800 -88042 -71216 -160194 -117684 372859 -359779 45910 -369301 -287054 -30868 -229289
9303 -229289 -327318 -58072 -62190 74801 31770 -143032 145193 67609 41774 77744 -231255
9291a90417R1105E9042A476e7017h624m6778E7081K71553c68911P9707B7024N9725
9279H6749a6517B45677a36542k14016a56194b1946j55862G2728a36139d2667k1798
9268f4465C17486A2055c11864h1638A43277a46560C06364I1676g4584I5355J69916
9257B65271a57705H5711b01075k25451i6010G3236d2729l96857K17375K5774A9948
9245b9642j01655j5841I5707a2679G6599a79217a6733H8333e2667p4986k05857
9234c33510F3339L113J74895c5602q6833k21273J53377e3442j37345f6214j04995
9223a71209G5690M4290b32112A546a24549M565k88543B01927a78880q5446I8862
9211I015J12155H811R9228D9172h0690B4317J79733E1689e4841E1801e94B5445
$$ plain form
9291 -190417 -99312 59042 1476 -57017 -8624 -55402 57081 328634 -368911 -289204 27024 86749
9279 86749 -16517 245677 -136542 -350558 -156194 -21946 -177808 72728 -136139 -42667 -64465
9268 -64465 317486 12055 -311864 -81638 143277 -146560 306364 91676 -74584 95355 265271
9257 265271 -157705 85711 -201075 -426526 -96010 73236 -42729 -439586 -222211 -196437 19948
9245 -29642 -131297 -147138 95707 -12679 76599 -179217 -16733 88333 -52667 -127653 -333510
9234 -333510 63339 66452 241347 -35602 -122435 -343708 -190331 -53442 -190787 -66214 -171209
9223 -171209 75690 119980 -232112 1546 -124549 -119984 -408527 201927 -178880 -264326 98862
9211 9015 121170 8811 108039 49172 -80690 24317 204050 51689 -54841 51801 -594 25445
9198G6872N90a34218j2153F2403b03171A97023J8593J18647m6521a07995D0945
9186c2617a2847j39799l1591B05452A6701a28956N2704A0451J62311h2431j68952
9175b51383a7617j23696o758L0680N6828K7429A99656d51536a95960B64814b19807
9163b40704q758c0811k77445B04777C8119f2178j08641j4934L6772q5831e2888
9151g4351A92385D7457b0773k15874Q7894C39242A51927J2950a52744B61153I8459
9139A12294a51466n3900D7329q067a56603o3911G8246J37254D8183J00895d94284
9127h330k7995q3327B8367b36117B20230a84167H7030b80010i1292m48120e3308
9115a11106j31632j65903i4633k3850e7060k26364R6511I8798M8718a28352D5015
$$ plain form
9198 76872 77462 -134218 -146371 62403 -203171 197023 215616 334263 287742 -107995 40945
9186 -32617 -12847 -152646 -184237 205452 16701 -128956 -76252 10451 172762 -82431 -251383
9175 -251383 -17617 -141313 -148071 -117391 -60563 -33134 199656 -451536 -195960 264814 -219807
9163 -240704 -249462 -30811 -308256 204777 38119 -62178 -170819 -185753 -148981 -234812 -52888
9151 -74351 192385 47457 -20773 -236647 -148753 339242 151927 164877 -152744 261153 98459
9139 112294 -151466 -205366 47329 39262 -156603 -220514 78246 215500 48183 149078 -494284
9127 -8330 -36325 -119652 28367 -236117 220230 -184167 87030 -280010 -91292 -539412 -53308
9115 -111106 -242738 -408641 -94633 -118483 -57060 -283424 -186913 98798 147516 -128352 45015
9103d11753g0920b9442B18357b80597B9837J35007L9166b57764k75711d5473A32870
9091b06156p3807A1825J30819a27352A96512e2991j5449K6046A06316a04116j1671
9080a15787H9368i9169p9537k18324B04440c30592C26572i9149K9366q3991k10898
9069c64672e3529j46195i9163c4285j50388D4970M9089m3106c49536B34310a8670
9057a6586j60009j15405A26700C3597M0258J75907a07687D7008a94128J363i2568
9045B64846a83857b6526a1713o9647k7963K323B71968D993J0105b08305c2764
9033d11631D7633M4725b07989A02263d071G7105b67857A31781m6490h3384j23160
9022b06544R9463j48059J20473H9120r727L6764r219A0972a41197M7774r6119
$$ plain form
9103 -411753 -70920 -29442 218357 -280597 29837 164844 204010 -257764 -533475 -45473 132870
9091 -206156 -279963 11825 142644 -127352 196512 -52991 -68440 -42394 106316 -104116 -115787
9080 -115787 89368 -99169 -178706 -397030 204440 -330592 326572 -99149 -69783 -153774 -364672
9069 -364672 -53529 -199724 -99163 -34285 -184673 44970 94059 50953 -349536 234310 -18670
9057 -16586 -176595 -292000 126700 33597 73855 249762 -107687 47008 -194128 -192765 -92568
9045 264846 -183857 -26526 -11713 -81360 -109323 -107000 271968 4993 15098 -208305 -32764
9033 -411631 47633 92358 -207989 102263 -4071 77105 -267857 131781 85291 -83384 -206544
9022 -206544 -107081 -255140 -134667 89120 79393 116157 106938 10972 -141197 -93423 -189542
9011a89542A13253b09795j09232D991P2030A8153N97c02894a23380F4532C1389
8999B02375R9257q0196E3989b59439e5814J0622C2134d15169A24135f6486A79613
8987a33778H9152b45350k0327B02484f3163j38338j15708A4995c1299H1032b4583
8975B83124i1654A86874h996k08414B24572E1323J712a84065H4532a30622a7373
8963b33329N1103p078C78593j08813f3146j42718A94323d4276A25293E5028d2665
8951f7177q4343f9811k80737a74160F7783L161j7786K2080a53447l61187A557
8939F6223L06972a86247J9540k7321A53565B138c0876k28031D3136J27528J5440
8928A86104O9302C3074J16235g5441A91921J543062M545253q71373A356110o43487
$$ plain form
9011 -189542 113253 -209795 -319027 4991 77021 18153 18750 -302894 -123380 64532 31389
8999 202375 301632 221436 53989 -259439 -55814 -45192 32134 -415169 124135 -66486 179613
8987 -133778 89152 -245350 -265677 202484 -63163 -201501 -317209 14995 -31299 81032 -24583
8975 283124 -91654 186874 -8996 -217410 224572 51323 53035 -184065 84532 -130622 -17373
8963 -233329 -182226 -189304 378593 269780 -63146 -205864 194323 -44276 125293 55028 -42665
8951 -67177 -151520 -69811 -350548 -174160 67783 70944 53158 75238 -153447 -514634 1557
8939 66223 373195 -186247 -166707 -194028 153565 2138 -30876 -258907 43136 170664 186104
8928 186104 255406 33074 149309 -75441 191921 1734983 6280236 5408863 1356110 712623
8918G12623o2958B88511h7671B45471G7718a58602c5727E6334h2927C548K53310
8907B56858j06449J3433b85701E8772c69295A25241f5648h869l9693l4271B70018
8895f9801j64828k52177K31316P6835D12848D9440a6554G2856L5987f9994j24593
8884a94587Q5457m3635p4303f4848k02798C9184b18487A389b6529l79837B29230
8872A29960h4327D49353E0103L4473c13516M8726B54863A4927c48071C88757j58876
8861B29881c20293g5204J2396H14786c3460l21099R6956n9467i6025A3402O0957
$$ plain form
8918 712623 649665 288511 -87671 245471 77718 -158602 -35727 56334 -82927 3548 256858
8907 256858 150409 163842 -285701 58772 -369295 125241 -65648 -8869 -48562 -82833 270018
8895 -69801 -234629 -486806 -255490 -178655 412848 49440 -16554 72856 108843 -69994 -194587
8884 -194587 -109130 -152765 -227068 -64848 -267646 39184 -218487 1389 -26529 -406366 229230
8872 129960 -84327 449353 50103 84576 -313516 -264790 254863 14927 -348071 388757 229881
8861 229881 -320293 -75204 -62808 814786 -33460 -354559 -257603 -317070 -96025 13402 74359
$$ [...]
##END NTUPLES=NMR SPECTRUM
##END=
