
##TITLE=AC1261_BRARS10079_6641703_r9cxuoHe3Q
##JCAMPDX= 6.0         $$ Bruker NMR JCAMP-DX V2.0
##DATA TYPE= NMR SPECTRUM
##DATA CLASS= NTUPLES
##ORIGIN= BRUKER
##OWNER= Administrator
$$ 1.72 TOPSPIN		Version 2.1
$$ 2012-08-08 21:25:27.015 -0500  Administrator@TOPSPIN
$$ Compression mode = diff/dup
##.OBSERVE FREQUENCY= 400.02188249412
##.OBSERVE NUCLEUS= ^1H
##.ACQUISITION MODE= SIMULTANEOUS (DQD)
##.ACQUISITION SCHEME= undefined
##.AVERAGES= 64
##.DIGITISER RES= 22
##SPECTROMETER/DATA SYSTEM= spect
##.PULSE SEQUENCE= noesygpps1d.comp
##.SOLVENT NAME= COFFEE_meoh
##.SHIFT REFERENCE= INTERNAL, COFFEE_meoh, 1, 14.96237
##AUDIT TRAIL= $$ (NUMBER, WHEN, WHO, WHERE, PROCESS, VERSION, WHAT)
$$ ##TITLE= Audit trail, TOPSPIN		Version 2.1
$$ ##JCAMPDX= 5.01
$$ ##ORIGIN= Bruker BioSpin GmbH
$$ ##OWNER= Administrator
$$ $$ C:\Bruker\TOPSPIN/data/COFFEE/nmr/AC1261_BRARS10079_6641703_r9cxuoHe3Q/12/pdata/1/auditp.txt
$$ ##AUDIT TRAIL=  $$ (NUMBER, WHEN, WHO, WHERE, PROCESS, VERSION, WHAT)
(   1,<2012-08-08 21:25:22.046 -0500>,<Administrator>,<TOPSPIN>,<go>,<TOPSPIN 2.1>,
      <created by zg
	started at 2012-08-08 21:13:51.828 -0500,
	POWCHK enabled, PULCHK disabled,
       configuration hash MD5:
       6B 1B 68 BB D9 2E 58 E2 7F 35 AD 54 07 DF 0E 41
       data hash MD5: 64K
       B1 04 65 E0 2C C8 7E 37 7B 1F 90 62 2C 72 82 F1>)
(   2,<2012-08-08 21:25:24.984 -0500>,<Administrator>,<TOPSPIN>,<proc1d>,<TOPSPIN 2.1>,
      <Start of raw data processing
       efp LB = 0.3 FT_mod = 6 PKNL = 1 PHC0 = 0 PHC1 = 0 SI = 128K 
       data hash MD5: 128K
       DE 2D EA 30 FB D6 6A 9C D1 F7 FF 52 55 4A 01 9A>)
(   3,<2012-08-08 21:25:26.031 -0500>,<Administrator>,<TOPSPIN>,<proc1d>,<TOPSPIN 2.1>,
      <pk PHC0 = -0.9118652 PHC1 = 0 
       data hash MD5: 128K
       3F 47 D6 4C D7 82 E9 FB AC 4A 7A 07 72 BA 14 B9>)
(   4,<2012-08-08 21:25:26.656 -0500>,<Administrator>,<TOPSPIN>,<proc1d>,<TOPSPIN 2.1>,
      <abs ABSG = 1 
       data hash MD5: 128K
       A1 90 4F CC C9 86 22 52 62 D0 07 15 C4 30 42 7A>)
(   5,<2012-08-08 21:25:26.750 -0500>,<Administrator>,<TOPSPIN>,<proc1d>,<TOPSPIN 2.1>,
      <abs ABSG = 2 
       data hash MD5: 128K
       C6 2B 20 BB A6 BE A6 64 B4 11 40 2B FD 9F 30 55>)
(   6,<2012-08-08 21:25:26.796 -0500>,<Administrator>,<TOPSPIN>,<proc1d>,<TOPSPIN 2.1>,
      <abs ABSG = 3 
       data hash MD5: 128K
       1D BA B7 44 D0 84 79 26 D0 64 53 25 6C 88 D8 62>)
(   7,<2012-08-08 21:25:26.859 -0500>,<Administrator>,<TOPSPIN>,<proc1d>,<TOPSPIN 2.1>,
      <abs ABSG = 4 
       data hash MD5: 128K
       C7 44 87 81 CC 25 4A FB D2 2B 43 D9 63 A7 A0 56>)
(   8,<2012-08-08 21:25:26.921 -0500>,<Administrator>,<TOPSPIN>,<proc1d>,<TOPSPIN 2.1>,
      <abs ABSG = 5 
       data hash MD5: 128K
       92 AE 12 95 70 44 F9 5E 3D C7 A6 98 F3 12 E2 A9>)
$$ ##END=
$$ 
$$ $$ hash MD5
$$ $$ 34 FF C2 8A 8D 44 51 40 EA AD D8 B0 50 67 7D 5C
##$RELAX= 
##$RELAX= 
##$RELAX= 
##$RELAX= 
##$RELAX= 
##$RELAX= 
##$RELAX= 
##$RELAX= 
$$ Bruker specific parameters
$$ [...]
##$TP07= 0
##$TPNAME0= <>
##$TPNAME1= <>
##$TPNAME2= <>
##$TPNAME3= <>
##$TPNAME4= <>
##$TPNAME5= <>
##$TPNAME6= <>
##$TPNAME7= <>
##$TPOAL= (0..7)
0.5 0.5 0.5 0.5 0.5 0.5 0.5 0.5
##$TPOFFS= (0..7)
0 0 0 0 0 0 0 0
##$TUNHIN= 0
##$TUNHOUT= 0
##$TUNXOUT= 0
##$USERA1= <user>
##$USERA2= <user>
##$USERA3= <user>
##$USERA4= <user>
##$USERA5= <user>
##$V9= 5
##$VALIST= <valist>
##$VCLIST= <CCCCCCCCCCCCCCC>
##$VD= 0
##$VDLIST= <DDDDDDDDDDDDDDD>
##$VPLIST= <PPPPPPPPPPPPPPP>
##$VTLIST= <TTTTTTTTTTTTTTT>
##$WBST= 1024
##$WBSW= 4
##$XGAIN= (0..3)
0 0 0 0
##$XL= 0
##$YL= 0
##$YMAX_a= 17240176
##$YMIN_a= -10164812
##$ZGOPTNS= <>
##$ZL1= 120
##$ZL2= 120
##$ZL3= 120
##$ZL4= 120
##$ABSF1= 14.96237
##$ABSF2= -5.595812
##$ABSG= 5
##$ABSL= 3
##$ALPHA= 0
##$AQORDER= 0
##$ASSFAC= 0
##$ASSFACI= 0
##$ASSFACX= 0
##$ASSWID= 0
##$AUNMP= <proc_prof1d_extract.lims>
##$AXLEFT= 0
##$AXNAME= <>
##$AXNUC= <1H>
##$AXRIGHT= 0
##$AXTYPE= 0
##$AXUNIT= <>
##$AZFE= 0.1
##$AZFW= 0.1
##$BCFW= 0
##$BC_mod= 0
##$BYTORDP= 0
##$COROFFS= 0
##$CY= 15
##$DATMOD= 1
##$DC= 0
##$DFILT= <>
##$DTYPP= 0
##$F1P= 0
##$F2P= 0
##$FCOR= 0.5
##$FTSIZE= 131072
##$FT_mod= 6
##$GAMMA= 0
##$GB= 0
##$INTBC= 1
##$INTSCL= 1
##$ISEN= 128
##$LB= 0.3
##$LEV0= 0
##$LPBIN= 0
##$MAXI= 10000
##$MC2= 0
##$MEAN= 0
##$ME_mod= 0
##$MI= 0
##$NCOEF= 0
##$NC_proc= -2
##$NLEV= 6
##$NOISF1= 0
##$NOISF2= 0
##$NSP= 0
##$NTH_PI= 0
##$NZP= 0
##$OFFSET= 14.96237
##$PC= 1
##$PHC0= -0.9118652
##$PHC1= 0
##$PH_mod= 1
##$PKNL= yes
##$PPARMOD= 0
##$PPDIAG= 0
##$PPIPTYP= 0
##$PPMPNUM= 2147483647
##$PPRESOL= 1
##$PSCAL= 4
##$PSIGN= 0
##$PYNMP= <proc.py>
##$REVERSE= no
##$SF= 400.020009089704
##$SI= 131072
##$SIGF1= 0
##$SIGF2= 0
##$SINO= 400
##$SIOLD= 131072
##$SPECTYP= <>
##$SREGLST= <1H.CDCl3>
##$SSB= 0
##$STSI= 131072
##$STSR= 0
##$SW_p= 8223.68421052631
##$SYMM= 0
##$S_DEV= 0
##$TDeff= 65536
##$TDoff= 0
##$TI= <>
##$TILT= no
##$TM1= 0
##$TM2= 0
##$TOPLEV= 0
##$USERP1= <user>
##$USERP2= <user>
##$USERP3= <user>
##$USERP4= <user>
##$USERP5= <user>
##$WDW= 1
##$XDIM= 131072
##$YMAX_p= 298644104
##$YMIN_p= -10419
##$CURPLOT= <Network HP LaserJet P1505>
##$CURPRIN= <$Network HP LaserJet P1505>
##$DFORMAT= <normdp>
##$LAYOUT= <+/1D_H.xwp>
##$LFORMAT= <normlp>
##$PFORMAT= <normpl>
##$SURQMSG= 1
$$ End of Bruker specific parameters
$$ ---------------------------------
##NTUPLES= NMR SPECTRUM
##VAR_NAME=  FREQUENCY,     SPECTRUM/REAL,   SPECTRUM/IMAG
##SYMBOL=    X,             R,               I
##VAR_TYPE=  INDEPENDENT,   DEPENDENT,       DEPENDENT
##VAR_FORM=  AFFN,          ASDF,            ASDF
##VAR_DIM=   131072,        131072,          131072
##UNITS=     HZ,            ARBITRARY UNITS, ARBITRARY UNITS
##FACTOR=    0.0627417313425164, 1,          1
##FIRST=     8223.62146879497, -1260,        -56259
##LAST=      0,             1188,            -57725
##MIN=       0,             -10419,          0
##MAX=       8223.62146879497, 298644104,    0
$$ Real data points
##PAGE= N=1
##DATA TABLE= (X++(R..R)), XYDATA
$$ [...]
63211A026622J7926J6175J3237Q941M203K01k969o276j0344j4536j7764j9783
63199A015633k1195k2480k3520k4133k4470k4655k4434k3523k2053k0325j8362
63188G66483j5976j3252j0563q225o290m634l015j181Q07K535L821N091O723Q237
63174G30561Q787Q509Q637R953J1675J2328J1466J0030R111Q795Q275O882M807
63161H49816K731R65p65k649m398n832p395r478j1541j2736j3210j3853j4765
63148G56890j4961j3958j2586j1719j1109j0276r613r672r865r135p576o319n780
63135F24321n140l754k129j124q02o27k71J98P08J307J965K501K686K438J997
63120F24274J896K552L769M820N075M490L509K648K198K194K555L165L755L884
$$ plain form
63211 1026622 1044548 1060723 1073960 1082901 1087104 1087305 1084336 1078060 1067716 1053180 1035416 1015633
63199 1015633 994438 971958 948438 924305 899835 875180 850746 827223 805170 784845 766483
63188 766483 750507 737255 726692 718467 712177 707543 704528 703347 704154 706689 710510 715601 722324 730561
63174 730561 739348 747857 756494 766447 778122 790450 801916 811946 821057 829852 838127 845009 849816
63161 849816 852547 853512 852747 850098 845700 839868 832473 822995 811454 798718 785508 771655 756890
63148 756890 741929 727971 715385 703666 692557 682281 672668 662996 653131 643996 636420 630101 624321
63135 624321 619181 615427 613298 612174 611372 610745 610474 610672 611380 612687 614652 617153 619839 622277 624274
63120 624274 626170 628722 632491 637311 642386 646876 650385 653033 655231 657425 659980 663145 666900 670784
63106F70784L294K297J546J343J432J458J343J106Q29Q29J416K272K687K594K688
63091F97918L171L164K036N98J85J028K337L534M517N086N177N445O578Q082Q800
63076G57656Q615Q600R407J0560J1525J2410J3267J3718J3785J4189J5246J6223
63064I05201J6436J6334J6820J8089J9815K1960K4581K7150K8910K9880L0943
63053A156119L2843L5472L8086L9989M1038M1672M2476M3661M5103M6695M8249
63042A611403M9178M8950M7982M7327M7282M6969M5808M4580M4375M5024M5466
63031B124344M5166M4317M2752L9707L4843K8757K2087J4680O088l405j2741k1046
63019B365549k8349l5256m1993m7999n2421n4880n5652n5325n4555n3918n3573
$$ plain form
63106 670784 674078 676375 677921 679264 680696 682154 683497 684603 685432 686261 687677 689949 692636 695230 697918
63091 697918 701089 704253 706289 706887 707072 708100 710437 713971 718488 723574 728751 734196 740774 748856 757656
63076 757656 766271 774871 784278 794838 806363 818773 832040 845758 859543 873732 888978 905201
63064 905201 921637 937971 954791 972880 992695 1014655 1039236 1066386 1095296 1125176 1156119
63053 1156119 1188962 1224434 1262520 1302509 1343547 1385219 1427695 1471356 1516459 1563154 1611403
63042 1611403 1660581 1709531 1757513 1804840 1852122 1899091 1944899 1989479 2033854 2078878 2124344
63031 2124344 2169510 2213827 2256579 2296286 2331129 2359886 2381973 2396653 2402741 2399336 2386595 2365549
63019 2365549 2337200 2301944 2259951 2211952 2159531 2104651 2048999 1993674 1939119 1885201 1831628
63008A831628n2973n1349m8463m4705m0450l5825l1085k6660k2682j8886j5147
62997A443403j1644q409n299k491l61J317L268N459O855O956O786P510Q720R035
62983A471105P920N920L508P80j890l977n817q534j2586j7125k0975k3753k5796
62970A368780k7623k9694l2119l4295l5327l5084l4394l3950l3450l2224l0270
62959A010350k8238k6620k5384k4247k2892k1041j8723j6511j5152j4771j4580
62948G82191j3663j1978j0434r889j0227j0597j0415r847r346r124r119r081q545
62935F49926p172n421m477n020o363p206p022o261n473m856m584m815n288n379
62921E70589m773l739k680j821j390j602k241k652k403j677q40MP96J201R33K54
$$ plain form
63008 1831628 1778655 1727306 1678843 1634138 1593688 1557863 1526778 1500118 1477436 1458550 1443403
62997 1443403 1431759 1423350 1418051 1415560 1415199 1416516 1419784 1425243 1432098 1439054 1445840 1453350 1462070 1471105
62983 1471105 1479025 1484945 1488453 1489233 1487343 1483366 1477549 1469015 1456429 1439304 1418329 1394576 1368780
62970 1368780 1341157 1311463 1279344 1245049 1209722 1174638 1140244 1106294 1072844 1040620 1010350
62959 1010350 982112 955492 930108 905861 882969 861928 843205 826694 811542 796771 782191
62948 782191 768528 756550 746116 736227 726000 715403 704988 695141 685795 676671 667552 658471 649926
62935 649926 642754 637333 632856 627836 621473 614267 607245 600984 595511 590655 586071 581256 575968 570589
62921 570589 565816 562077 559397 557576 556186 554584 552343 549691 547288 545611 544771 544775 545571 546772 547705 547959
62905E47959k18k13m1q6l12m20l69m58p86r18l78N20P97m5j347k079k044j876
62887E37686k012k166j892j218n84l89p39j405j884j721r63k39k15q87j559j578
62871E18235j102q84j210j380o55N40J008L46o25j142j394j754j942j658j322
62856E05061j338j181k56P73O85m07j080o30O3M8m66q66j193j701k042j653n82
62839D93235N72J244J097J56q33p93L69J356J071J22n8P84J526J382P97N10N74
62822E03111P30J040J546J781J258L92K28J177K416K902K662K632L296M053M193
62807E33417L994M273N150N933O294O753P769Q922R584R914J0569J1677J2754
62794F37003J3615J4672J6145J7544J8406J9127K0586K2993K5599K7623K9148
$$ plain form
62905 547959 547741 547528 547487 547401 547089 546669 546300 545842 545056 544138 543760 544280 545077 545032 543685 541606 539562 537686
62887 537686 535674 533508 531616 530398 529814 529425 528686 527281 525397 523676 522713 522474 522259 521372 519813 518235
62871 518235 517133 516249 515039 513659 513004 513544 514552 514898 514273 513131 511737 509983 508041 506383 505061
62856 505061 503723 502542 502286 503059 503744 503337 502257 501627 501690 501738 501272 500406 499213 497512 495470 493817 493235
62839 493235 493807 495051 496148 496304 495471 494678 495047 496403 497474 497596 497538 498322 499848 501230 502027 502537 503111
62822 503111 503841 504881 506427 508208 509466 509858 510086 511263 513679 516581 519243 521875 525171 529224 533417
62807 533417 537411 541684 546834 552767 559061 565814 573583 582505 592089 602003 612572 624249 637003
62794 637003 650618 665290 681435 698979 717385 736512 757098 780091 805690 833313 862461
62783H62461L0921L3471L6684M0131M3577M7099N0924N5151N9509O3445O6697
62772A390070O9624P2648P5408P6934P6774P5380P3123O9551O4072N6837M8338
62761B148759L8561K7373J5402L677p517j8528k9142l8467m6258n3312o0116o5974
62749A914458p0008p2343p3633p4073p3549p2330p0798o8793o5970o2596n9372
62738A150993n6500n3625n0567m7566m4716m1702l8280l4611l1064k7924k5323
62727F99115k3162k1098j8855j6564j4565j2948j1556j0311r191p992o487m846
62715E41540l521k663j937r55L57J824L218M335N178O079P411R154J0936J2577
62701E93533J4243J6074J7922J9541K0863K1959K2985K4235K5972K8122L0216
$$ plain form
62783 862461 893382 926853 963537 1003668 1047245 1094344 1145268 1200419 1259928 1323373 1390070
62772 1390070 1459694 1532342 1607750 1684684 1761458 1836838 1909961 1979512 2043584 2100421 2148759
62761 2148759 2187320 2214693 2230095 2233772 2226255 2207727 2178585 2140118 2093860 2040548 1980432 1914458
62749 1914458 1844450 1772107 1698474 1624401 1550852 1478522 1407724 1338931 1272961 1210365 1150993
62738 1150993 1094493 1040868 990301 942735 898019 856317 818037 783426 752362 724438 699115
62727 699115 675953 654855 636000 619436 604871 591923 580367 570056 560865 552873 546386 541540
62715 541540 538019 535356 533419 532464 532821 534645 537863 542198 547376 553455 560866 570020 580956 593533
62701 593533 607776 623850 641772 661313 682176 704135 727120 751355 777327 805449 835665
62690H35665L1851L2989L3796L4226L4005L2901L0938K8292K5053K1085J6198
62679A156999J0500M493j239o438j1147j5382j8991k1881k4262k6543k8988l1421
62667I85700l3324l4291l4406l4088l3594l2843l1716l0287k8621k6674k4609
62656F41247k2941k2037k1542k0755j9410j7790j6102j4247j2326j0894j0347
62645D52856j0323j0076r348q578q202q046p604o697n673m963m648m557m524m390
62631C55227l871k774j384m14l90j226k327k969k624j329J15P23L66k5M40J582
62615C39120K521K805K735K731K965L541M520N640O399O659O861P503Q655J0106
62601D12761J1684J3249J4670J5961J7298J8740K0183K1763K3943K6878K9973
$$ plain form
62690 835665 867516 900505 934301 968527 1002532 1035433 1066371 1094663 1119716 1140801 1156999
62679 1156999 1167499 1171992 1170753 1164315 1153168 1137786 1118795 1096914 1072652 1046109 1017121 985700
62667 985700 952376 918085 883679 849591 815997 783154 751438 721151 692530 665856 641247
62656 641247 618306 596269 574727 553972 534562 516772 500670 486423 474097 463203 452856
62645 452856 442533 432457 423109 414531 406329 398283 390679 383982 378309 373346 368698 364141 359617 355227
62631 355227 351356 348582 347198 346784 346394 345168 342841 339872 337248 335919 336034 336757 337123 337098 337538 339120
62615 339120 341641 344446 347181 349912 352877 356418 360938 366578 372977 379636 386497 394000 402655 412761
62601 412761 424445 437694 452364 468325 485623 504363 524546 546309 570252 597130 627103
62590F27103L2465L4309L6064L7941L9387L9793L9185L8012L6456L4331L1439
62579A026485K7769K3329J8119J2325O357N77m842r761j4032j7678k0990k4224
62567A023434k7287k9830l1590l2492l2579l1995l0996k9804k8578k7535k6953
62556F93795k6759k6359k5178k3336k1441j9849j8497j7383j6666j6149j5268
62545D66910j3825j2385j1479j0789r554p712o091n439n455n070l648j819r05
62532C72739j414k294k062n21J130J902K097K522L248L740L880M106M685N372
62518C99130N934O540P455Q653R859J0910J1949J3270J4946J6618J7802J8455
62506E41521J8974J9569J9911J9690J9103J8511J7807J6533J4473J1768Q556M952
$$ plain form
62590 627103 659568 693877 729941 767882 807269 847062 886247 924259 960715 995046 1026485
62579 1026485 1054254 1077583 1095702 1108027 1114384 1114961 1110119 1100358 1086326 1068648 1047658 1023434
62567 1023434 996147 966317 934727 902235 869656 837661 806665 776861 748283 720748 693795
62556 693795 667036 640677 615499 592163 570722 550873 532376 514993 498327 482178 466910
62545 466910 453085 440700 429221 418432 408878 401166 395075 389636 384181 379111 375463 373644 372739
62532 372739 371325 369031 366969 366448 367578 369480 371577 374099 377347 381087 384967 389073 393758 399130
62518 399130 405064 411604 419059 427712 437571 448481 460430 473700 488646 505264 523066 541521
62506 541521 560495 580064 599975 619665 638768 657279 675086 691619 706092 717860 726416 731368
62494G31368J278k020m761p039q931j0431j1638j2709j3677j4446j4942j5068
62482F16984j4726j4097j3619j3452j3173j2389j1361j0571r920q942p643o485
62470D80606n577m495l012j450j76Q16J651K355K945L322L136K286J599K273M320
62455D90599O239O644N771M894M785N236N745N972N683M818L726K921K510K078
62441E57621J168l50k331m501o474p803q236p962p622p917q996j0211j0640j0001
62427D65745q856p913p328o808o111n202m095k865j739r85n86k08M62J429K383
62412D17323K920K800K148J531J711L066N107O724P166O659N869M931L572K124
62398D73651J639K568L893M276L529K347R70q22k512k855j516J57O14j28p68l31
$$ plain form
62494 731368 732646 730626 725865 718826 709895 699464 687826 675117 661440 646994 632052 616984
62482 616984 602258 588161 574542 561090 547917 535528 524167 513596 503676 494734 487091 480606
62470 480606 475029 470534 467522 466072 465896 466712 468363 470718 473663 476985 480121 482407 484006 486279 490599
62455 490599 496838 503482 509253 514147 518932 524168 529913 535885 541568 546386 550112 553033 555543 557621
62441 557621 558789 558439 556108 551607 545133 537330 529094 521132 513510 505593 496597 486386 475746 465745
62427 465745 456889 448976 441648 434840 428729 423527 419432 416567 414828 413843 413257 413049 413511 414940 417323
62412 417323 420243 423043 425191 426722 428433 431499 436606 443330 450496 457155 463024 467955 471527 473651
62398 473651 475290 477858 481751 486027 489556 491903 492873 492051 489539 486684 485168 485325 485939 485811 485043 484712
62382D84712R86K338L055L097L111M025O215R076J1516J2895J3468J4102J5652
62369E84248J8283K1260K3645K5305K7015K9377L2069L4372L6097L7529L8696
62358I07896L9149L8496L6790L4231L0813K6492K1632J6988J3042R465N514R20
62346A181428l873q392j2627j6571j9856k2278k4233k5993k6976k6538k5258k4468
62334I44365k4523k4477k3632k2453k1675k1354k1095k0549j9387j7554j5836
62323G11830j5190j5251j4478j2264r822q330p391o238n323n406n928n740m907
62310E95562m331m026l276k262k003k599k998k695k384k507k472j845j185j068
62296E59911j239j258j247j322j105l99L12P07J261K400L599M100M070M309N081
$$ plain form
62382 484712 485698 488036 491091 494188 497299 501324 507539 516615 528131 541026 554494 568596 584248
62369 584248 602531 623791 647436 672741 699756 729133 761202 795574 831671 869200 907896
62358 907896 947045 985541 1022331 1056562 1087375 1113867 1135499 1152487 1165529 1174994 1180508 1181428
62346 1181428 1177555 1169163 1156536 1139965 1120109 1097831 1073598 1047605 1020629 994091 968833 944365
62334 944365 919842 895365 871733 849280 827605 806251 785156 764607 745220 727666 711830
62323 711830 696640 681389 666911 654647 644825 636495 629104 622866 617543 612137 606209 600469 595562
62310 595562 591231 587205 583929 581667 579664 577065 574067 571372 568988 566481 564009 562164 560979 559911
62296 559911 558672 557414 556167 554845 553740 553341 553653 554360 555621 558021 561620 565720 569790 574099 579180
62281E79180N974O682P238P624P816Q177R223J0902J2559J3653J4243J4703J5328
62268G13302J6284J7691J9530K1594K3563K5241K6719K8288L0114L2009L3660
62257I87995L4971L5828L5787L4322L1528K8064K4396K0466J6225J1885P510K877
62245A271854j923o279r867j3169j6682k0047k2567k4240k5584k6633k6798k5849
62233A052216k4347k2877k1341j9320j6911j4800j3536j2939j2281j1003r195
62222H73666p335n726m366l302k767k784k901k550j598m07N69J140J480J955K704
62207H47778L413L710L704L870M380N012N697O704Q048R323J0334J1399J2673
62194I36045J3714J4224J4732J5902J7518J8833J9660K0374K0947K0819J9840
$$ plain form
62281 579180 585154 591836 599074 606698 614514 622691 631914 642816 655375 669028 683271 697974 713302
62268 713302 729586 747277 766807 788401 811964 837205 863924 892212 922326 954335 987995
62257 987995 1022966 1058794 1094581 1128903 1160431 1188495 1212891 1233357 1249582 1261467 1268977 1271854
62245 1271854 1269931 1263652 1253785 1240616 1223934 1203887 1181320 1157080 1131496 1104863 1078065 1052216
62233 1052216 1027869 1004992 983651 964331 947420 932620 919084 906145 893864 882861 873666
62222 873666 866331 860605 856239 852937 850170 847386 844485 841935 840337 839930 840499 841639 843119 845074 847778
62207 847778 851191 854901 858605 862475 866855 871867 877564 884268 892316 901639 911973 923372 936045
62194 936045 949759 963983 978715 994617 1012135 1030968 1050628 1071002 1091949 1112768 1132608
62183A132608J8657J7919J7539J6999J6119J5261J4966J5492J6683J8216J9895
62172A320354K1536K2703K3091K3323K4611K7105K9235K9440K8082K6707K5825
62161A602012K4486K1998J8936J6215J4115J2413J0780Q859O665N047M758N004
62149A751288M054J662l24m19O37J368J828L056N002O453O821O778P081P789Q704
62134A811778R703J0496J0767J0753J1101J2094J3533J5195J6837J7907J8057
62123A958221J7895J8433J9751K0975K1628K2189K3153K4317K5239K5722K5637
62112B203160K5000K4391K4617K5669K6749K7563K8673L0254L1465L1697L1606
62101B510844L2174L3451L4951L6551L8225L9460L9975M0493M1818M3554M4721
$$ plain form
62183 1132608 1151265 1169184 1186723 1203722 1219841 1235102 1250068 1265560 1282243 1300459 1320354
62172 1320354 1341890 1364593 1387684 1411007 1435618 1462723 1491958 1521398 1549480 1576187 1602012
62161 1602012 1626498 1648496 1667432 1683647 1697762 1710175 1720955 1729814 1736479 1741526 1746284 1751288
62149 1751288 1755342 1757004 1756680 1756261 1756898 1758266 1760094 1763150 1768152 1774605 1781426 1788204 1795285 1803074 1811778
62134 1811778 1821481 1831977 1842744 1853497 1864598 1876692 1890225 1905420 1922257 1940164 1958221
62123 1958221 1976116 1994549 2014300 2035275 2056903 2079092 2102245 2126562 2151801 2177523 2203160
62112 2203160 2228160 2252551 2277168 2302837 2329586 2357149 2385822 2416076 2447541 2479238 2510844
62101 2510844 2543018 2576469 2611420 2647971 2686196 2725656 2765631 2806124 2847942 2891496 2936217
62090B936217M5284M5966M6701M6562M5338M4027M3497M3620M4017M4704M5475
62079C431408M5507M4173M1757L8925L6003L3220L1043K9782K9169K8786K8498
62068C818271K8165K7462K6406K5490K4703K2966J9400J4766J0789Q115N743K611
62056D034887j117m625p635j0457j3208j5583j7392j8922k0593k2448k4128k5249
62044C853530k5673k5456k4715k3701k2768k2051k1254k0061j8692j7678j7091
62033C614390j6410j5296j4058j3129j2426j1653j0887j0471j0455j0620j0927
62022C478058j1569j2589j3732j4696j5309j5553j5644j6009j6936j8281j9730
62011C308010k1188k2628k3743k4153k3944k3641k3623k3802k3920k3872k3671
$$ plain form
62090 2936217 2981501 3027467 3074168 3120730 3166068 3210095 3253592 3297212 3341229 3385933 3431408
62079 3431408 3476915 3521088 3562845 3601770 3637773 3670993 3702036 3731818 3760987 3789773 3818271
62068 3818271 3846436 3873898 3900304 3925794 3950497 3973463 3992863 4007629 4018418 4026533 4032276 4034887
62056 4034887 4033770 4029145 4021510 4011053 3997845 3982262 3964870 3945948 3925355 3902907 3878779 3853530
62044 3853530 3827857 3802401 3777686 3753985 3731217 3709166 3687912 3667851 3649159 3631481 3614390
62033 3614390 3597980 3582684 3568626 3555497 3543071 3531418 3520531 3510060 3499605 3488985 3478058
62022 3478058 3466489 3453900 3440168 3425472 3410163 3394610 3378966 3362957 3346021 3327740 3308010
62011 3308010 3286822 3264194 3240451 3216298 3192354 3168713 3145090 3121288 3097368 3073496 3049825
62000C049825k3437k3414k3807k4563k5468k6374k7079k7263k6977k7016k8179
61989B766248l0079l1317l1048k9843k8766k8160k7761k7423k7161k6729k5835
61978B452126k4623k3469k2399k1177j9975j9355j9480j9783j9634j9007j8256
61967B224968j7562j6840j6038j5280j4741j4476j4279j3772j2813j1827j1408
61956B065932j1506j1363j0484r297q501q053p330o084m660l302j815j18J466
61943A984885K790M252O202Q427J0625J3042J6043J9343K2336K4969K7737L0850
61931B171501L4214L8130M3179M9174N5076O0424O6066P2936Q0748Q8709R6994
61920B857151J06607J17956J30445J43444J56987J71377J86935K04354K24655
$$ plain form
62000 3049825 3026388 3002974 2979167 2954604 2929136 2902762 2875683 2848420 2821443 2794427 2766248
61989 2766248 2736169 2704852 2673804 2643961 2615195 2587035 2559274 2531851 2504690 2477961 2452126
61978 2452126 2427503 2404034 2381635 2360458 2340483 2321128 2301648 2281865 2262231 2243224 2224968
61967 2224968 2207406 2190566 2174528 2159248 2144507 2130031 2115752 2101980 2089167 2077340 2065932
61956 2065932 2054426 2043063 2032579 2023282 2014781 2006728 1999398 1993314 1988654 1985352 1983537 1983419 1984885
61943 1984885 1987675 1991927 1998129 2006556 2017181 2030223 2046266 2065609 2087945 2112914 2140651 2171501
61931 2171501 2205715 2243845 2287024 2336198 2391274 2451698 2517764 2590700 2671448 2760157 2857151
61920 2857151 2963758 3081714 3212159 3355603 3512590 3683967 3870902 4075256 4299911
61911D299911K48376K75166L04423L35973L69925M06144M44048M82378N18756
61902G685100N49664N71111N79201N70030N39910M86591M10644L15629K07251
61893A1915131R2518k0964j26235k18371k95027l55974m02453m36632m60809m76541
61883I214643m84644m86041m82163m74228m62512m46729m27002m04112l79004
61874E168208l52501l25455k98713k72784k47846k24184k02263j82309j64162
61865B897991j47671j32841j19404j06723r4536q3411p3970o5926n8508n1580
61855A963421m5669m0888l6579l2177k7785k3723k0010j6597j3642j1236r228
61844A685887p570o361n380m098k452j073l50J90J156K446L681M974O582Q217
$$ plain form
61911 4299911 4548287 4823453 5127876 5463849 5833774 6239918 6683966 7166344 7685100
61902 7685100 8234764 8805875 9385076 9955106 10495016 10981607 11392251 11707880 11915131
61893 11915131 12007649 11986685 11860450 11642079 11347052 10991078 10588625 10151993 9691184 9214643
61883 9214643 8729999 8243958 7761795 7287567 6825055 6378326 5951324 5547212 5168208
61874 5168208 4815707 4490252 4191539 3918755 3670909 3446725 3244462 3062153 2897991
61865 2897991 2750320 2617479 2498075 2391352 2296816 2213405 2139435 2073509 2015001 1963421
61855 1963421 1917752 1876864 1840285 1808108 1780323 1756600 1736590 1719993 1706351 1695115 1685887
61844 1685887 1678317 1671956 1666576 1662478 1660026 1658953 1658603 1658793 1659949 1662395 1666076 1671050 1677632 1685849
61830A685849R306R786J0011J0229J0662J1697J3266J4468J4636J4469J5233J7002
61818A836614J8755K0055K1498K3489K5624K7664L0055L3086L6429L9904M3935
61807B157108M8687N3592N8192O2808O7888P3351P9143Q5701R3314J01575J10167
61796B991526J19576J30342J42101J54249J67122J81725J98388K16419K35089
61787D536537K54440K75211K98334L24417L53476L85389M20743M60707N05829
61778G815083N55650O09846O68926P32880P99704Q65906R27641R80171J016678
61769A4972485J029101J010347R55319Q60853P26912N58637L66209J62126m1090
61760B0600899k31493l98883n37396o46727p30004p90742q31942q56780q68599
$$ plain form
61830 1685849 1695155 1704941 1714952 1725181 1735843 1747540 1760806 1775274 1789910 1804379 1819612 1836614
61818 1836614 1855369 1875424 1896922 1920411 1946035 1973699 2003754 2036840 2073269 2113173 2157108
61807 2157108 2205795 2259387 2317579 2380387 2448275 2521626 2600769 2686470 2779784 2881359 2991526
61796 2991526 3111102 3241444 3383545 3537794 3704916 3886641 4085029 4301448 4536537
61787 4536537 4790977 5066188 5364522 5688939 6042415 6427804 6848547 7309254 7815083
61778 7815083 8370733 8980579 9649505 10382385 11182089 12047995 12975636 13955807 14972485
61769 14972485 16001586 17011933 17967252 18828105 19555017 20113654 20479863 20641989 20600899
61760 20600899 20369406 19970523 19433127 18786400 18056396 17265654 16433712 15576932 14708333
61751A4708333q70064q62856q48034q26161p97392p62159p21764o77926o31953
61742G710024n84772n37595m91910m48673m07884l69093l32277k98162k67722
61733C971936k41257k17949j96586j76759j59054j44050j31520j20751j11089
61724B472921j01969r2917q4058p6194o9941o4966o0516n6287n2349m8538m4611
61713A720575m0813l7659l5161l2836l0416k8054k5952k4221k3072k2469k1752
61702A398170k0284j8517j7603j7801j8028j7374j6271j5619j5439j5114j4488
61691A211632j3904j3458j2979j2690j3028j3845j4392j4242j3681j3054j2327
61680A064032j1505j0915j0751j0735j0561j0290j0025r581q824q006p406o904
$$ plain form
61751 14708333 13838269 12975413 12127379 11301218 10503826 9741667 9019903 8341977 7710024
61742 7710024 7125252 6587657 6095747 5647074 5239190 4870097 4537820 4239658 3971936
61733 3971936 3730679 3512730 3316144 3139385 2980331 2836281 2704761 2584010 2472921
61724 2472921 2370952 2278035 2193977 2117783 2047842 1982876 1922360 1866073 1813724 1765186 1720575
61713 1720575 1679762 1642103 1606942 1574106 1543690 1515636 1489684 1465463 1442391 1419922 1398170
61702 1398170 1377886 1359369 1341766 1323965 1305937 1288563 1272292 1256673 1241234 1226120 1211632
61691 1211632 1197728 1184270 1171291 1158601 1145573 1131728 1117336 1103094 1089413 1076359 1064032
61680 1064032 1052527 1041612 1030861 1020126 1009565 999275 989250 979669 970845 962839 955433 948529
61668I48529o310n775n483n194m618m014l845l950l687k891k108j796j820j853
61654H95185j805j677j468j360j551j745j403o58l35o92q35m7R59Q84l75j630
61638H81447j946j497q66l42o9k15o36r07r46j178j783k237j992j293r13j272
61622H63355k138l044l655l801l486k918k339j889j651j709j966k090j913j698
61608H29058j809k103k067j487p18j57K31O52R74Q31J88m50m85J90J183K030K563
61591H28624K917L307L830M406M941N581O592P904Q912R124Q970R524J1288J3539
61577I29459J5235J6204J7080J8297J9730K1242K2946K4740K6086K6662K6872
61566A164553K7292K7867K8077K7763K7308K6956K6513K5827K5242K5147K5352
$$ plain form
61668 948529 942219 936444 930961 925767 921149 917135 913290 909340 905653 902762 900654 898858 897038 895185
61654 895185 893380 891703 890235 888875 887324 885579 884176 883518 883183 882491 881656 881609 882568 883452 883077 881447
61638 881447 879501 878004 877138 876796 876727 876512 875876 874969 874023 872845 871062 868825 866833 865540 864627 863355
61622 863355 861217 858173 854518 850717 847231 844313 841974 840085 838434 836725 834759 832669 830756 829058
61608 829058 827249 825146 823079 821592 820874 820717 820948 821600 822574 823405 823593 823143 822658 822848 824031 826061 828624
61591 828624 831541 834848 838678 843084 848025 853606 860198 868102 877014 886138 895108 904632 915920 929459
61577 929459 944694 960898 977978 996275 1016005 1037247 1060193 1084933 1111019 1137681 1164553
61566 1164553 1191845 1219712 1247789 1275552 1302860 1329816 1356329 1382156 1407398 1432545 1457897
61555A457897K5285K4691K3831K2961K1937K0427J8256J5498J2397R383O931N225
61543A664719M016K888J511l41k667m951o393o741o606o609o566n971m891l731
61529A617667k345k52K297M481O347R116J3517J8637K3126K6916L0963L5821M1317
61516A827608M7331N3938O0870O7700P4606Q2274R0929J00160J09846J20575J32888
61505B768725J46461J60290J73337J84977J95226K04462K12442K17421K16908
61496D480249K09455J95324J75421J50369J21001Q9057N6625K5180m370l1099
61486E467212n4209p3655q9946j03305j13383j19964j23538j25025j25056j23663
61476D415468j20523j15370j08251r9538q9795p9631o9464n9256m8582l7167k5490
$$ plain form
61555 1457897 1483182 1507873 1531704 1554665 1576602 1597029 1615285 1630783 1643180 1652563 1659494 1664719
61543 1664719 1668735 1671623 1673134 1672793 1670126 1665175 1658782 1652041 1645435 1638826 1632260 1626289 1621398 1617667
61529 1617667 1615322 1615070 1617367 1621848 1628195 1637311 1650828 1669465 1692591 1719507 1750470 1786291 1827608
61516 1827608 1874939 1928877 1989747 2057447 2132053 2214327 2305256 2405416 2515262 2635837 2768725
61505 2768725 2915186 3075476 3248813 3433790 3629016 3833478 4045920 4263341 4480249
61496 4480249 4689704 4885028 5060449 5210818 5331819 5420876 5477501 5502681 5498311 5467212
61486 5467212 5413003 5339348 5249402 5146097 5032714 4912750 4789212 4664187 4539131 4415468
61476 4415468 4294945 4179575 4071324 3971786 3881991 3802360 3732896 3673640 3625058 3587891 3562401
61465C562401j4663n616J627P898J4225K1004K7650L3037L6524L8495L9800M0805
61453C803187M1288M1151M0745M0498M0584M1079M2095M3616M5433M7256M8713
61442D275645M9356M9050M8292M7660M6939M5288M2309L8381L3844K8575K2612
61431D727951J6497J0544M319k499r282j5028j9472k3027k5988k8400l0484l2443
61419D572688l3926l4299l3529l2197l0595k8334k4980k0734j6350j2682j0236
61408D294826q770p367n382l343k391k830l732m123l923l399k394o27J708M402
61394D252655Q076J3710K1232K9321L6981M4872N4543O6680Q0598R5324J10529
61383D814521J26253J42322J58386J74239J89604K03697K15268K22947K25442
$$ plain form
61465 3562401 3547738 3542122 3543749 3551647 3565872 3586876 3614526 3647563 3684087 3722582 3762382 3803187
61453 3803187 3844475 3885626 3926371 3966869 4007453 4048532 4090627 4134243 4179676 4226932 4275645
61442 4275645 4325001 4374051 4422343 4470003 4516942 4562230 4604539 4642920 4676764 4705339 4727951
61431 4727951 4744448 4754992 4759311 4756812 4747530 4732502 4713030 4690003 4664015 4635615 4605131 4572688
61419 4572688 4538762 4504463 4470934 4438737 4408142 4379808 4354828 4334094 4317744 4305062 4294826
61408 4294826 4286056 4278689 4273307 4269964 4267573 4264743 4261011 4256888 4252965 4249566 4247172 4246545 4248253 4252655
61394 4252655 4260731 4274441 4295673 4324994 4361975 4406847 4461390 4528070 4608668 4703992 4814521
61383 4814521 4940774 5083096 5241482 5415721 5605325 5809022 6024290 6247237 6472679
61374F472679K21712K11437J95189J73715J47229J16017Q1689M7012J4116j6727
61364G664068m6294p4856j01848j26576j48686j68026j84564j98397k09543k17622
61354F187656k22058k22682k20058k15222k09102k02065j93912j84388j73645
61345D344524j62111j50022j37415j24529j11743r9104q6325p3439o0960m9243
61335C289633l8164k7627j7876q986o47P167J3902J9339K4217K9254L3890L6849
61323C360951L7705L7284L6650L6294L6163L5850L4797L2883L0728K8974K7464
61312C735743K5672K3581K1393J8729J5073J0835O951L409p25n662j0468j4581
61300C829950j8688k3404k8245l2564l6696m1161m5475m8777n1064n2694n3165
$$ plain form
61374 6472679 6694391 6905828 7101017 7274732 7421961 7537978 7619667 7666679 7680795 7664068
61364 7664068 7617774 7542918 7441070 7314494 7165808 6997782 6813218 6614821 6405278 6187656
61354 6187656 5965598 5742916 5522858 5307636 5098534 4896469 4702557 4518169 4344524
61345 4344524 4182413 4032391 3894976 3770447 3658704 3559600 3473275 3399836 3338876 3289633
61335 3289633 3251469 3223842 3205966 3196980 3196333 3203500 3217402 3236741 3260958 3290212 3324102 3360951
61323 3360951 3398656 3435940 3472590 3508884 3545047 3580897 3615694 3648577 3679305 3708279 3735743
61312 3735743 3761415 3784996 3806389 3825118 3840191 3851026 3857977 3861386 3860661 3854999 3844531 3829950
61300 3829950 3811262 3787858 3759613 3727049 3690353 3649192 3603717 3554940 3503876 3451182 3398017
61289C398017n1701m8998m6923m6111m5008m1972l7434l3146k9910k7077k4029
61278B965708k1119j8883j7204j5713j4535j4014j3940j3650j2860j1874j0886
61267B801030r637p953o220m821l447j424J465M898Q695J3071J8216K4041L0455
61254B868369L7599M5648N4534O3952P3399Q2207Q9774R5736R9690J00836R8295
61243C710039R1833Q1860O8635N1894L1583Q715j4805l7095n6971p3894q7648
61232C774146r8169j05739j11069j14877j17233j17632j16020j13305j10504j07610
61222B661988j03900r9119r3645q7671q1026p3940o7168o1125n5503n0019m4849
61211A844023l9999l4977k9610k4496k0047j5707j0825n873j940P01K748M656
$$ plain form
61289 3398017 3346316 3297318 3250395 3204284 3159276 3117304 3079870 3046724 3016814 2989737 2965708
61278 2965708 2944589 2925706 2908502 2892789 2878254 2864240 2850300 2836650 2823790 2811916 2801030
61267 2801030 2791393 2783440 2777220 2772399 2768952 2767528 2768993 2773891 2782586 2795657 2813873 2837914 2868369
61254 2868369 2905968 2951616 3006150 3070102 3143501 3225708 3315482 3411218 3510908 3611744 3710039
61243 3710039 3801872 3883732 3952367 4004261 4035844 4044559 4029754 3992659 3935688 3861794 3774146
61232 3774146 3675977 3570238 3459169 3344292 3227059 3109427 2993407 2880102 2769598 2661988
61222 2661988 2558088 2458969 2365324 2277653 2196627 2122687 2055519 1994394 1938891 1888872 1844023
61211 1844023 1804024 1769047 1739437 1714941 1694894 1679187 1668362 1662489 1660549 1661250 1663998 1668654
61199A668654O059O484O025N113M102L216K492J654L14j491l229m487n435o633
61185A682838q410j0554j2519j4010j5226j6505j7804j8862j9801k1053k2542
61174A505552k3514k3607k3534k4179k5344k5996k5609k4581k3564k2960k3071
61163A239593k4085k5598k6617k6356k4858k2840k1052j9776j8781j7785j7004
61152I94841j6943j7507j7846j7455j6982j7282j8037j8132j7166j5733j4241
61141H07517j2546j0829r815r610r183p629n381l480k218j154m2R38J742K526
61127G40836L289L932M598N475O328O748O875P328Q316R296R719R728R790R965
61113H42223R921R618R485R765J0023R591Q404O992N649M106K223N11m55q96j504
$$ plain form
61199 1668654 1674713 1681197 1687222 1692335 1696437 1699653 1702145 1703799 1704113 1702622 1699393 1694906 1689471 1682838
61185 1682838 1674428 1663874 1651355 1637345 1622119 1605614 1587810 1568948 1549147 1528094 1505552
61174 1505552 1482038 1458431 1434897 1410718 1385374 1359378 1333769 1309188 1285624 1262664 1239593
61163 1239593 1215508 1189910 1163293 1136937 1112079 1089239 1068187 1048411 1029630 1011845 994841
61152 994841 977898 960391 942545 925090 908108 890826 872789 854657 837491 821758 807517
61141 807517 794971 784142 774327 764717 755534 747905 742524 739044 736826 735672 735630 736568 738310 740836
61127 740836 744125 748057 752655 758130 764458 771206 778081 785409 793725 803021 812740 822468 832258 842223
61113 842223 852144 861762 871247 881012 891035 900626 909030 916022 921671 925777 928000 928511 928056 927160 925656
61098I25656k469l432m317n488o960q181q817r192r554r553q938q205p926p881
61084H24743p450o614n852n341m963m960n716o805p065n970m340l303k931k370
61070G51063j109L47J127J082R87J570K503K702J796Q30J077K429L565L666L221
61055G76856L112L456L762L721L407K982K633K676L330M442N649O774P863Q880
61041H39543R609R945J0165J0752J1891J3164J3928J4024J3895J3943J4098J4214
61029I89171J4524J5225J5934J6118J5924J6019J6665J7548J8383J9038J9161
61018A173710J8566J8078J8951K1158K3209K4207K5017K6758K9118L1167L3035
61007A442974L5548L8828M2403M6387N1242N6560O1359O5626P0453P6486Q3462
$$ plain form
61098 925656 923187 919755 915438 909950 902990 894809 885992 876800 867246 857693 848755 840550 832624 824743
61084 824743 817293 810679 804827 799486 794523 789563 783847 777042 769977 764007 759667 756364 753433 751063
61070 751063 749954 750301 751428 752510 753497 755067 757570 760272 762068 762898 763975 766404 769969 773635 776856
61055 776856 779968 783424 787186 790907 794314 797296 799929 802605 805935 810377 816026 822800 830663 839543
61041 839543 849152 859097 869262 880014 891905 905069 918997 933021 946916 960859 974957 989171
61029 989171 1003695 1018920 1034854 1050972 1066896 1082915 1099580 1117128 1135511 1154549 1173710
61018 1173710 1192276 1210354 1229305 1250463 1273672 1297879 1322896 1349654 1378772 1409939 1442974
61007 1442974 1478522 1517350 1559753 1606140 1657382 1713942 1775301 1840927 1911380 1987866 2071328
60996B071328R1523J01743J14766J29761J45327J60705J75792J90697K05857K21991
60986C609490K39716K59946K84727L16495L56053M02542M56181N19812N97083
60977G042045O90986Q05532R46083J113468J296815J474465J621620J713531J721889
60968A8426434J618831J398298J098161P93935N60110M31604L97880M24195M67650
60959B5617098M75086L85533J57734j95921o07795r93324j293527j487027j575975
60950B0481882j573622j504159j401574j297771j209553j137384j074515j015281
60942A0268023r56954q97954q36417p70389o99329o25546n53471m86868m26875
60933D014220l72914l24590k81977k44784k12307j84095j59993j39773j23158
$$ plain form
60996 2071328 2162851 2264594 2379360 2509121 2654448 2815153 2990945 3181642 3387499 3609490
60986 3609490 3849206 4109152 4393879 4710374 5066427 5468969 5925150 6444962 7042045
60977 7042045 7733031 8538563 9484646 10598114 11894929 13369394 14991014 16704545 18426434
60968 18426434 20045265 21443563 22541724 23335659 23895769 24327373 24725253 25149448 25617098
60959 25617098 26092184 26477717 26635451 26439530 25831735 24838411 23544884 22057857 20481882
60950 20481882 18908260 17404101 16002527 14704756 13495203 12357819 11283304 10268023
60942 10268023 9311069 8413115 7576698 6806309 6106980 5481434 4927963 4441095 4014220
60933 4014220 3641306 3316716 3034739 2789955 2577648 2393553 2233560 2093787 1970629
60924A970629j09965r9698r1331q3991p7634p2465o8053o3524n8514n3383m8607
60913A143464m4353m0513l6799l2997k9415k6726k5041k3531k1480j9256j7570
60902H25783j6192j4266j1736r581q528q240p885o918n203l066j310o23p51p97
60888G30687m85l96p50p83P0J032Q01p81k619l758m187m250m118m139m984o814
60872F94526q545q671o923m686l574l879m568m591l821k850k211j873j392l72
60858F36570J158K817M236N260N797N857N856O583Q335J0398J1786J2436J3039
60845G30128J3812J4240J4114J4055J4485J4719J3749J1584R210P421O246N365
60833H69128M529L608K637J910J658J629J300M38p58k011l163m126m848n377n764
$$ plain form
60924 1970629 1860664 1760966 1669635 1585644 1508010 1435545 1367492 1303968 1245454 1192071 1143464
60913 1143464 1099111 1058598 1021799 988802 959387 932661 907620 884089 862609 843353 825783
60902 825783 809591 795325 783589 774008 765480 757240 749355 742437 737234 734168 732858 732235 731484 730687
60888 730687 730202 729806 729056 728273 728343 729375 730176 729395 726776 723018 718831 714581 710463 706324 701340 694526
60872 694526 685981 677310 670387 665701 662127 658248 653680 649089 645268 642418 640207 638334 636942 636570
60858 636570 637728 640545 644781 650041 655838 661695 667551 674134 682469 692867 704653 717089 730128
60845 730128 743940 758180 772294 786349 800834 815553 829302 840886 850096 857517 863763 869128
60833 869128 873657 877265 879902 881812 883470 885099 886399 886837 886079 884068 880905 876779 871931 866554 860790
60818H60790o066o500p331q422r187r330r229r279r259q827q256q020p938p445
60804G45701o566n856n428m849m045l504l360l008j974n99N58J411K123K634K938
60789G16176L353M138N081N962P085Q790J0620J1569J1259J0519J0535J1560J2579
60776H29226J2347J0843R498R687J1005J1623J0460Q500P460P602P587O366M491
60763I46695L251L065L137K571J347J70l96m65o69j554l089m610n270m819l876
60748I35488l290l223l152k840k799l539m735n670o230o859p619p967p558o753
60734H63254o052n555n173m970m903m618l837k776j792q56K92J556K402K490K089
60719H31551J826K082K659L010K729J876Q66J60j8J63J28o52j954k860k831k444
$$ plain form
60818 860790 854724 848224 840893 832471 823284 813954 804725 795446 786187 777360 769104 761084 753146 745701
60804 745701 739135 733279 727851 723002 718957 715453 712093 709085 707111 706512 707070 708481 710604 713238 716176
60789 716176 719529 723667 728748 734710 741795 750585 761205 772774 784033 794552 805087 816647 829226
60776 829226 841573 852416 861914 871601 882606 894229 904689 913189 920649 928251 935838 942204 946695
60763 946695 949946 953011 956148 958719 960066 960236 959840 959375 958706 957152 954063 949453 944183 939364 935488
60748 935488 932198 928975 925823 922983 920184 916645 911910 906240 900010 893151 885532 877565 870007 863254
60734 863254 857202 851647 846474 841504 836601 831983 828146 825370 823578 822722 823014 824570 826972 829462 831551
60719 831551 833377 835459 838118 841128 843857 845733 846599 846759 846741 846904 847032 846380 844426 841566 838735 836291
60703H36291k622l347l859l963m281n031n466n063m569n096o590p869q096p622
60689G62817p404q027r276j0339j0468r668q674q079p712p108o235n357m442l350
60675F56678k405k131k301j985p58N96J138J039J307K300L165L008K229K123L231
60660F67234M558M769L817K882K846L365L651L543L488L779M317M924N455N669
60646G24297N391M846M525M626M866M915M829M983N661O791P921Q463Q134P227
60632H07475O503O655P700Q870R262Q751Q117Q032Q189P809O780N700M804L619
60618I08266J955M88j50l03p55j617k425k990l431l526k821j478l57l4k10k25
60602H90387J49O04N90l06j976l629m384m133l584l391l543l673l555l111k277
$$ plain form
60703 836291 833669 830322 826463 822500 818219 813188 807722 802659 798090 792994 786404 778535 770439 762817
60689 762817 755413 747386 738110 727771 717303 707635 698961 690882 683170 676062 669827 664470 660028 656678
60675 656678 654273 652142 649841 647856 647098 647694 648832 649871 651178 653478 656643 659651 661880 664003 667234
60660 667234 671792 676561 680378 683260 686106 689471 693122 696665 700153 703932 708249 713173 718628 724297
60646 724297 729688 734534 739059 743685 748551 753466 758295 763278 768939 775730 783651 792114 800248 807475
60632 807475 813978 820633 828333 837203 846465 855216 863333 871365 879554 887363 894143 899843 904647 908266
60618 908266 910221 910709 910559 910256 909501 907884 905459 902469 899038 895512 892691 891213 890856 890822 890612 890387
60602 890387 890536 891140 891730 891424 889448 885819 881435 877302 873718 870327 866784 863111 859556 856445 854168
60587H54168j176k67n6n87j366j777j554r22l29nJ66L59N28N14K77m0j63K41J225
60568H49236K184K326J784J720K779L924L609J831J00n73o69r40j224j007m27
60553H64653pJ87N47J304K387L616M653N095N035N292O563Q536J0332J1725J3400
60538I43318J6086J9848K4242K8629L2261L4470L5117L4650L3534L1695K8588
60527A262438K3689J7017R377K151l358o734q601r889j0893j1105j0052q170o551
60514A239319n780n300m197k357m54J059K371L756N195O804R001J1892J4915J7619
60500A293843K0432K4200K9125L4690M0431M6291N2251N8148O3849O9301P4444
60489A807005P9372Q4457Q9982R5877J02316J10378J21438J35951J53479J73774
$$ plain form
60587 854168 852992 852725 852669 852082 850716 848939 847385 846463 846134 846129 846295 846654 847182 847696 847973 847933 847770 848011 849236
60568 849236 851420 853746 855530 857250 860029 863953 867562 869393 869493 868920 868251 867311 866087 865080 864653
60553 864653 864646 864833 865380 866684 869071 872687 877340 882435 887470 892762 899325 907861 918193 929918 943318
60538 943318 959404 979252 1003494 1032123 1064384 1098854 1133971 1168621 1202155 1233850 1262438
60527 1262438 1286127 1303144 1312521 1314672 1311314 1304580 1295979 1286090 1275197 1264092 1254040 1245870 1239319
60514 1239319 1233539 1228239 1224042 1221685 1221231 1222290 1224661 1228417 1233612 1240416 1249417 1261309 1276224 1293843
60500 1293843 1314275 1338475 1367600 1402290 1442721 1489012 1541263 1599411 1663260 1732561 1807005
60489 1807005 1886377 1970834 2060816 2156693 2259009 2369387 2490825 2626776 2780255 2954029
60479B954029J96828K21576K45296K64810K77412K80254K69924K44163K03864
60470E158156J52432R3427K9955l3825r2331j40930j78097k04677k21873k30907
60460D331330k33916k33560k31343k27220k21108k13866k06241j97740j87411
60451B378925j75315j62417j49236j35507j21303j07584r5305q4471p4540o5356
60441A207891n7208n0292m4464l9489l5194l1432k8143k5435k3321k1488j9525
60430H31900j7383j5353j3654j2248j1048j0068r328q703q016p145o152n307m874
60417G02621m699m226l189k096j682j902j935j192OR47J369J549J797K128K401
60402F91897K587K907L619M605N291N238M711M328M182L804L107K736L175L954
$$ plain form
60479 2954029 3150857 3372433 3617729 3882539 4159951 4440205 4710129 4954292 5158156
60470 5158156 5310588 5404015 5433970 5400145 5307814 5166884 4988787 4784110 4562237 4331330
60460 4331330 4097414 3863854 3632511 3405291 3184183 2970317 2764076 2566336 2378925
60451 2378925 2203610 2041193 1891957 1756450 1635147 1527563 1432258 1347787 1273247 1207891
60441 1207891 1150683 1100391 1055927 1016438 981244 949812 921669 896234 872913 851425 831900
60430 831900 814517 799164 785510 773262 762214 752146 742818 734115 726099 718954 712802 707495 702621
60417 702621 697922 693696 690507 688411 686729 684827 682892 681700 681706 682653 684022 685571 687368 689496 691897
60402 691897 694484 697391 701010 705615 710906 716144 720855 725183 729365 733169 736276 739012 742187 746141
60388G46141M253L887L219K419J409L96k15m67p98j306j581j436j275j500j946
60373G51200k195k102j782j349r17o10l99j05K30L30J51O1L18P60J220J830K615
60356G49256L176L274L326L784M328M410M337M962O290P279P346P231P846Q903
60342H25748R354Q851Q049P584P408P219O945O667O386O120O004O163O578P176
60328I26252P856Q399Q568Q407Q198P952P230N730L902K511J621M56j484l619
60314I91979m932n176n050n205n641o049o222n906m755k928j401j129j894k478
60300I33213k020q31K73J012J729K670L562L993L997M022M307M452L895K795K048
60285I69117K292L226M194N041N950O715O882O577O508O986P518P633P613Q044
$$ plain form
60388 746141 750394 754281 757500 759919 761328 761724 761509 761042 760244 758938 757357 755921 754646 753146 751200
60373 751200 749005 746903 745121 743772 742855 742245 741846 741741 741971 742301 742452 742513 742831 743591 744811 746641 749256
60356 749256 752432 755706 759032 762816 767144 771554 775891 780853 787143 794422 801768 808999 816845 825748
60342 825748 835102 843953 852002 859586 866994 874213 881158 887825 894211 900331 906335 912498 919076 926252
60328 926252 934108 942507 951075 959482 967680 975632 982862 988592 992494 995005 996626 997082 995598 991979
60314 991979 987047 981871 976821 971616 965975 959926 953704 947798 943043 940115 938714 937585 935691 933213
60300 933213 931193 930362 930635 931647 933376 936046 939608 943601 947598 951620 955927 960379 964274 967069 969117
60285 969117 971409 974635 978829 983870 989820 996535 1003417 1009994 1016502 1023488 1031006 1038639 1046252 1054296
60271A054296R037J0273J1548J2839J4046J5067J6041J7213J8640K0202K1883
60260A221085K3803K6059K8673L1544L4361L6810L9102M2031M6171N1134N5964
60249A636737O0148O4047O8381P3658P9968Q7029R4198J00654J05770J09439J12048
60238B592077J14111J15693J16211J14937J11730J07013J00982R3284Q3692P2776
60228C622506O1593N0843M0580L0481K0152R519p49r432j5758j9993k2736k4004
60216C743002k3492k1432j8469j4712r557k581N836J5009K4613L4713M5378N6381
60204C834689O7090P6709Q4869R1851R7857J02265J04071J02995R9579R4192Q6611
60193D842778P6719O5059N2398L9134K5388J1267l088j7325l0628m2081n1484
$$ plain form
60271 1054296 1063333 1073606 1085154 1097993 1112039 1127106 1143147 1160360 1179000 1199202 1221085
60260 1221085 1244888 1270947 1299620 1331164 1365525 1402335 1441437 1483468 1529639 1580773 1636737
60249 1636737 1696885 1760932 1829313 1902971 1982939 2069968 2164166 2264820 2370590 2480029 2592077
60238 2592077 2706188 2821881 2938092 3053029 3164759 3271772 3372754 3466038 3549730 3622506
60228 3622506 3684099 3734942 3775522 3806003 3826155 3835674 3834925 3825493 3809735 3789742 3767006 3743002
60216 3743002 3719510 3698078 3679609 3664897 3655340 3652759 3658595 3673604 3698217 3732930 3778308 3834689
60204 3834689 3901779 3978488 4063357 4155208 4253065 4355330 4459401 4562396 4661975 4756167 4842778
60193 4842778 4919497 4984556 5036954 5076088 5101476 5112743 5109655 5092330 5061702 5019621 4968137
60182D968137n9238o5301o8915o9746o8541o6014o1705n4783m5689l5969k6468
60171D345768j6540n358O699J8387K8853L8061M6099N2616N6990N8829N8196N5432
60159D744032N0987M5334L8929L2110K5121J8310J2176P052K921j90j720q70K546
60146D976738P985J4931K3360L3247M4147N5719O8296Q2421R8001J14419J31398
60135E650662J49317J68584J89093K10328K31632K52323K71819K89774L05845
60126G719377L19279L28970L34065L34277L29575L19884L05267K86121K62804
60117A0539619K35214K03072J66754J27532Q6919M5807M396l7139p8031j16937
60107A1177206j52487j83733k10197k31523k47248k56925k60462k58262k50928
$$ plain form
60182 4968137 4908899 4843598 4774683 4704937 4636396 4570382 4508677 4453894 4408205 4372236 4345768
60171 4345768 4329228 4323870 4330569 4348956 4377809 4415870 4461969 4514585 4571575 4630404 4688600 4744032
60159 4744032 4795019 4840353 4879282 4911392 4936513 4954823 4966999 4974051 4976972 4976782 4975062 4974192 4976738
60146 4976738 4984723 4999654 5023014 5056261 5100408 5156127 5224423 5306844 5404845 5519264 5650662
60135 5650662 5799979 5968563 6157656 6367984 6599616 6851939 7123758 7413532 7719377
60126 7719377 8038656 8367626 8701691 9035968 9365543 9685427 9990694 10276815 10539619
60117 10539619 10774833 10977905 11144659 11272191 11359110 11404917 11409313 11372174 11294143 11177206
60107 11177206 11024719 10840986 10630789 10399266 10152018 9895093 9634631 9376369 9125441
60098I125441k38987k22981k03698j82068j58689j33717j07311q0077n2976k7024
60088G717913l171J7729L5139M8920N8983O4954O6382O3259N6032M5181L1098
60077H202419J4419l790k2312m0324n7680p4722r1609j07755j22187j34510j45153
60066G416796j54315j61178j64738j65116j63351j59970j54520j46501j36125
60057F010982j23925j10302r5650q0389o4552m7784l0016j1756O442K4302M1437
60046E518789N7128P0752Q1975R0389R5508R7277R6018R1609Q3502P1860N7923
60035F412730M2697K6038P686j1549l0366m8177o4844p9769r2270j02431j10597
60024E949148j16216j18316j16994j13472j08599j02187r3879q3779p2120n9049
$$ plain form
60098 9125441 8886454 8663473 8459775 8277707 8119018 7985301 7877990 7797913 7744937 7717913
60088 7717913 7714742 7732471 7767610 7816530 7875513 7940467 8006849 8070108 8126140 8171321 8202419
60077 8202419 8216838 8213048 8190736 8150412 8092732 8018010 7926401 7818646 7696459 7561949 7416796
60066 7416796 7262481 7101303 6936565 6771449 6608098 6448128 6293608 6147107 6010982
60057 6010982 5887057 5776755 5681105 5600716 5536164 5488380 5458364 5446608 5453050 5477352 5518789
60046 5518789 5575917 5646669 5728644 5819033 5914541 6011818 6107836 6199445 6282947 6354807 6412730
60035 6412730 6455427 6481465 6489151 6477602 6447236 6399059 6334215 6254446 6162176 6059745 5949148
60024 5949148 5832932 5714616 5597622 5484150 5375551 5273364 5179485 5095706 5023586 4964537
60014D964537m5018l0545j5462Q80J8464L6403N4131P1938R0020J07634J23595
60003E376577J37068J47458J54179J56924J55780J50767J41809J29333J14256
59994F664151R7022P7325N5245L2021R128j2841l3845n3438p0874q5718r7707
59983F580469j06274j10913j11826j09682j04865r7523q8074p7066o4689n0909
59973E658648l6070k0814n559R523K4110L7759N0257O1487P1110P8852Q4903Q9502
59961F103708R2229R2346Q9754Q5104P9026P1878O4252N6945N0293M4041L8171
59950F867747L3271K9981K8550K9201L2368L8334M7034N8468P2797Q9830J08984
59939G436565J30053J53476J79379K06927K35136K63724K92371L19440L42333
$$ plain form
60014 4964537 4919519 4888974 4873512 4874392 4892856 4929259 4983390 5055328 5145348 5252982 5376577
60003 5376577 5513645 5661103 5815282 5972206 6127986 6278753 6420562 6549895 6664151
59994 6664151 6761173 6838498 6893743 6925764 6934892 6922051 6888206 6834768 6763894 6678176 6580469
59983 6580469 6474195 6363282 6251456 6141774 6036909 5939386 5851312 5774246 5709557 5658648
59973 5658648 5622578 5601764 5596205 5605728 5629838 5667597 5717854 5779341 5850451 5929303 6014206 6103708
59961 6103708 6195937 6288283 6378037 6463141 6542167 6614045 6678297 6735242 6785535 6829576 6867747
59950 6867747 6901018 6930999 6959549 6988750 7021118 7059452 7106486 7164954 7237751 7327581 7436565
59939 7436565 7566618 7720094 7899473 8106400 8341536 8605260 8897631 9217071 9559404
59930I559404L59140L69151L71705L65258L47997L19057K78896K28991J71493
59921A2371092J09068M4669j8701p8272j31938j78583k17893k49832k74404k91801
59911A1083405l02462l06860l05451k98826k87648k72370k53272k30830k05805
59902H619881j78821j50115j19837q8410n6495k4847N697L4339O0507Q3758J03303
59891H288960J17914J26417J28047J22264J08723Q7822O0979K9899m232m0526
59881I026267p7567j13384j46241j75150j99628k19382k34308k44477k50108k51690
59871G114332k50036k45791k39014k29639k18243k05857j92933j79239j64950
59862E188630j51199j39045j28371j18403j09009j00768r3846q7404q0474p2945
$$ plain form
59930 9559404 9918544 10287695 10659400 11024658 11372655 11691712 11970608 12199599 12371092
59921 12371092 12480160 12524829 12506128 12427856 12295918 12117335 11899442 11649610 11375206 11083405
59911 11083405 10780943 10474083 10168632 9869806 9582158 9309788 9056516 8825686 8619881
59902 8619881 8441060 8290945 8171108 8082698 8026203 8001356 8007053 8041392 8101899 8185657 8288960
59891 8288960 8406874 8533291 8661338 8783602 8892325 8980147 9041126 9071025 9066793 9026267
59881 9026267 8948700 8835316 8689075 8513925 8314297 8094915 7860607 7616130 7366022 7114332
59871 7114332 6864296 6618505 6379491 6149852 5931609 5725752 5532819 5353580 5188630
59862 5188630 5037431 4898386 4770015 4651612 4542603 4441835 4347989 4260585 4180111 4107166
59852D107166o5440n8328n1231m3565l5425k7737k1506j7054j4187j2889j3472
59841C746332j5999j9865k4220k8498l2416l5626l7724l8532l8242l7313l6237
59830C401660l5166l3677l1116k7326k2823j8115j3130p532j286N374J2267J9175
59818C248305K5611L1139L5932M0640M5673N0856N5648N9473O1870O2612O1709
59807C779468N9163N4918M9215M2874L6845L1652K7467K4547K3118K3071K4212
59796D176550K6754L1013L6677M2976M9744N7742O7651P9274R2118J06395J22941
59785D889835J42309J64340J88611K14942K43198K72529L00786L24677L40568
59776G081795L45212L35924L10799K69510K14211J49490Q1325J5877m1557q7586
$$ plain form
59852 4107166 4041726 3983398 3932167 3888602 3853177 3825440 3803934 3786880 3772693 3759804 3746332
59841 3746332 3730333 3710468 3686248 3657750 3625334 3589708 3551984 3513452 3475210 3437897 3401660
59830 3401660 3366494 3332817 3301701 3274375 3251552 3233437 3220307 3212775 3211489 3216863 3229130 3248305
59818 3248305 3273916 3305055 3340987 3381627 3427300 3478156 3533804 3593277 3655147 3717759 3779468
59807 3779468 3838631 3893549 3942764 3985638 4022483 4054135 4081602 4106149 4129267 4152338 4176550
59796 4176550 4203304 4234317 4270994 4313970 4363714 4421456 4489107 4568381 4660499 4766894 4889835
59785 4889835 5032144 5196484 5385095 5600037 5843235 6115764 6416550 6741227 7081795
59776 7081795 7427007 7762931 8073730 8343240 8557451 8706941 8788266 8804143 8762586 8675000
59766H675000j21384j44171j57958j64899j67353j67505j66390j63694j58733
59757G262913j51288j41341j28733j13595r6597p8303n8622l7443j5399O605K8260
59746F476457M9644P0488R0458J10047J30296J51521J73087J94672K16954K40722
59736G904346K65907K92063L19293L48110L78678M10740M44134M78686N13501
59727A1355458N46775N76621O01845O21854O35962O42996O41752O31972O15073
59718A6870308N93851N71374N50072N31703N17847N09988N09002N14641N25549
59709B1694335N39731N55073N69538N80881N86404N83404N70122N46003N10925
59700B6736416M64711M08071L43778K76134K08983J44778Q5587L3973p839l9140
$$ plain form
59766 8675000 8553616 8409445 8251487 8086588 7919235 7751730 7585340 7421646 7262913
59757 7262913 7111625 6970284 6841551 6727956 6631359 6553056 6494434 6456991 6441592 6448197 6476457
59746 6476457 6526101 6596589 6687047 6797094 6927390 7078911 7251998 7446670 7663624 7904346
59736 7904346 8170253 8462316 8781609 9129719 9508397 9919137 10363271 10841957 11355458
59727 11355458 11902233 12478854 13080699 13702553 14338515 14981511 15623263 16255235 16870308
59718 16870308 17464159 18035533 18585605 19117308 19635155 20145143 20654145 21168786 21694335
59709 21694335 22234066 22789139 23358677 23939558 24525962 25109366 25679488 26225491 26736416
59700 26736416 27201127 27609198 27952976 28229110 28438093 28582871 28668458 28702431 28694592 28655452
59690B8655452o0217p0957p0774n9854l9418j0418K7346P4361J30222J93734K63765
59679B9033242L39304M18774M99768N79234O53416P17466P65516P91493P90086
59670C4588299P57355O91033N90822M58890L00533J24367n8868k38612m06256
59661C6807563n55266o80627p79238q50908q98435r26313r39369r42377r40145
59652B9294885r37314r37829r44426r58156r77911j000348j020549j033421j035198
59643B0449733j024411j001779r69326r29590q85435q39794p94811p51132p08337
59634A2545118o66104o24689n84357n44872n05804m67082m29055l92260l57202
59625G973693l24233k93345k64205k36513k10273j85785j63498j43935j27462
$$ plain form
59690 28655452 28595235 28524278 28453504 28393650 28354232 28343814 28371160 28445521 28575743 28769477 29033242
59679 29033242 29372546 29791320 30291088 30870322 31523738 32241204 33006720 33798213 34588299
59670 34588299 35345654 36036687 36627509 37086399 37386932 37511299 37452431 37213819 36807563
59661 36807563 36252297 35571670 34792432 33941524 33043089 32116776 31177407 30235030 29294885
59652 29294885 28357571 27419742 26475316 25517160 24539249 23538901 22518352 21484931 20449733
59643 20449733 19425322 18423543 17454217 16524627 15639192 14799398 14004587 13253455 12545118
59634 12545118 11879014 11254325 10669968 10125096 9619292 9152210 8723155 8330895 7973693
59625 7973693 7649460 7356115 7091910 6855397 6645124 6459339 6295841 6151906 6024444
59616F024444j13980j02985r4017q6921q1698p8226p6374p6153p7556q0220q3317
59605E072997q5912q7459q8051q8181q8127q7554q5785q2508p8124p3392o8730
59594D159174o3962n8698n2886m6859m0774l4275k7047j9597j3016p787l217J655
59582C792711O929J1970J6313K0001K3198K6019K8649L1240L3730L6100L8785
59571D065645M2414M7126N2542N8354O4621P1469P8964Q7248R6373J06029J15794
59560D886579J25807J36770J49132J62665J76919J91674K06791K21917K36589
59551F494843K50405K62996K74010K83201K90319K94949K96675K95363K91131
59542I033892K84149K74818K63930K52166K39477K25291K09281J91590J72631
$$ plain form
59616 6024444 5910464 5807479 5713462 5626541 5544843 5466617 5390243 5314090 5236534 5156314 5072997
59605 5072997 4987085 4899626 4811575 4723394 4635267 4547713 4461928 4379420 4301296 4227904 4159174
59594 4159174 4095212 4036514 3983628 3936769 3895995 3861720 3834673 3815076 3802060 3794273 3791056 3792711
59582 3792711 3799640 3811610 3827923 3847924 3871122 3897141 3925790 3957030 3990760 4026860 4065645
59571 4065645 4108059 4155185 4207727 4266081 4330702 4402171 4481135 4568383 4664756 4770785 4886579
59560 4886579 5012386 5149156 5298288 5460953 5637872 5829546 6036337 6258254 6494843
59551 6494843 6745248 7008244 7282254 7565455 7855774 8150723 8447398 8742761 9033892
59542 9033892 9318041 9592859 9856789 10108955 10348432 10573723 10783004 10974594 11147225
59533A1147225J53347J35472J20747J09783J02217R7845R6749R8284J00877J03060
59523A2265606J03843J01790R4743Q1109O0760L4285K063l5237p6073j18649j61752
59512A2352488k04292k44506k80365l10641l35085l53871l67318l75848l79706
59503I500856l78907l73747l64988l53245l38694l21703l03148k83612k62886
59494F519926k40808k18033j95282j72455j49299j26480j05017q4919o5263m5525
59484E116845k6068p313J0854K8795M6700O4465Q1747R8281J14415J30875J47744
59473E807340J64191J79508J93657K06204K15601K20479K20915K17345K08872
59464G634112J93931J72201J44584J11792P4550L4966m148m1617p8043j13296
$$ plain form
59533 11147225 11300572 11436044 11556791 11666574 11768791 11866636 11963385 12061669 12162546 12265606
59523 12265606 12369449 12471239 12565982 12647091 12707851 12742136 12744199 12708962 12632889 12514240 12352488
59512 12352488 12148196 11903690 11623325 11312684 10977599 10623728 10256410 9880562 9500856
59503 9500856 9121949 8748202 8383214 8029969 7691275 7369572 7066424 6782812 6519926
59494 6519926 6279118 6061085 5865803 5693348 5544049 5417569 5312552 5227633 5162370 5116845
59484 5116845 5090777 5083464 5094318 5123113 5169813 5234278 5316025 5414306 5528721 5659596 5807340
59473 5807340 5971531 6151039 6344696 6550900 6766501 6986980 7207895 7425240 7634112
59464 7634112 7828043 8000244 8144828 8256620 8331170 8366136 8361988 8320371 8242328 8129032
59454H129032j45414j72611j94974k13282k27411k36911k42275k44575k44418
59445F207161k42058k37853k31851k23483k12559k00062j87250j74437j61360
59436D336248j48201j35318j22420j09054r5768q3833p3686o4520n5470m6573
59426C401405l8260l0529k3000j5475q143j433M176Q447J1792J5317K0069K6023
59414C370389L1890L6202L8677M0276M1864M3279M4050M4670M6560N0843N7664
59403C846364O6584P6955Q7862R8429J08521J18721J29426J40427J51610J63566
59393D988465J77276J93541K12897K35552K61100K88775L18194L49412L82052
59384G407264M14946M46908M77219N04910N28156N45044N54552N56359N50216
$$ plain form
59454 8129032 7983618 7811007 7616033 7402751 7175340 6938429 6696154 6451579 6207161
59445 6207161 5965103 5727250 5495399 5271916 5059357 4859295 4672045 4497608 4336248
59436 4336248 4188047 4052729 3930309 3821255 3725487 3641654 3567968 3503448 3447978 3401405
59426 3401405 3363145 3332616 3309616 3294141 3285998 3284565 3288741 3297188 3308980 3324297 3344366 3370389
59414 3370389 3402279 3438481 3477158 3517434 3559298 3602577 3646627 3691297 3737857 3788700 3846364
59403 3846364 3912948 3989903 4077765 4176194 4284715 4403436 4532862 4673289 4824899 4988465
59393 4988465 5165741 5359282 5572179 5807731 6068831 6357606 6675800 7025212 7407264
59384 7407264 7822210 8269118 8746337 9251247 9779403 10324447 10878999 11435358 11985574
59375A1985574N36214N15412M89432M59549M26633L91797L56353L21040K85726
59366A5767730K49807K12655J73712J32546Q8916M2651o168n6598j06604j53895
59356A6344752j96922k34768k66524k91488l10000l23488l33492l41051l47070
59347A3699949l52701l58923l65946l73202l79876l85202l88423l88781l85842
59338A0321053l79758l71121l60299l47168l31677l14552k96959k79466k61732
59329G378321k43328k24381k05226j86039j67086j48910j31762j15238r8977q3452
59319E773922o9561n7681m7655l9438l3096k8287k4486k1753k0667k1323k2937
59308E387038k4642k6264k8053l0097l2301l4609l6793l8204l8153l6515l3742
$$ plain form
59375 11985574 12521788 13037200 13526632 13986181 14412814 14804611 15160964 15482004 15767730
59366 15767730 16017537 16230192 16403904 16536450 16625366 16668017 16661849 16605251 16498647 16344752
59356 16344752 16147830 15913062 15646538 15355050 15045050 14721562 14388070 14047019 13699949
59347 13699949 13347248 12988325 12622379 12249177 11869301 11484099 11095676 10706895 10321053
59338 10321053 9941295 9570174 9209875 8862707 8531030 8216478 7919519 7640053 7378321
59329 7378321 7134993 6910612 6705386 6519347 6352261 6203351 6071589 5956351 5857374 5773922
59319 5773922 5704361 5646680 5599025 5559587 5526491 5498204 5473718 5451965 5431298 5409975 5387038
59308 5387038 5362396 5336132 5308079 5277982 5245681 5211072 5174279 5136075 5097922 5061407 5027665
59297E027665l0186k5773k0378j4329q080j428O549J6457K7753L9317N0689O2263
59285E130519P4290Q6359R8060J09551J21030J32004J41725J49975J56895J62106
59275F362514J64656J63945J60205J53824J44521J31480J14237R3258O9724M4861
59265G603225J9541n483k9243n0753o9568q5831r9742j11228j20299j27303j32585
59254F790731j36086j37540j36820j33925j28968j22373j14775j06371r6698q5259
59244E591916p2100n7491m1555k4666p607R383K7362M7619P0036R3347J16961
59233E753205J41553J67704J94893K22258K49571K76661L02320L24352L40634
59224G973151L49712L50544L42145L23554K94118K53958K04329J47366Q5400K0626
$$ plain form
59297 5027665 4997479 4971706 4951328 4936999 4928919 4927491 4934040 4950497 4978250 5017567 5068256 5130519
59285 5130519 5204809 5291168 5389228 5498779 5619809 5751813 5893538 6043513 6200408 6362514
59275 6362514 6527170 6691115 6851320 7005144 7149665 7281145 7395382 7488640 7558364 7603225
59265 7603225 7622766 7617283 7588040 7537287 7467719 7381888 7282146 7170918 7050619 6923316 6790731
59254 6790731 6654645 6517105 6380285 6246360 6117392 5995019 5880244 5773873 5677175 5591916
59244 5591916 5519816 5462325 5420770 5396104 5388497 5397880 5425242 5472861 5542897 5636244 5753205
59233 5753205 5894758 6062462 6257355 6479613 6729184 7005845 7308165 7632517 7973151
59224 7973151 8322863 8673407 9015552 9339106 9633224 9887182 10091511 10238877 10324277 10344903
59214A0344903m4510j07205j64958k16287k60511k97051l25277l45091l57251
59205H226762l62979l63378l59267l51364l40397l26959l11412k94124k75755
59196E241127k57100k38545k19874k00850j81775j63349j46013j29841j14938
59187C588842j01537q9575p8491o7768n7451m7980l9649l2390k5991k0246j4937
59176C012827r785m554Q58O342J1640J6559K1151K5667L0182L4401L7929M0760
59164C223977M3404M6407M9721N2597N4224N4407N3532N1920M9440M5867M1328
59153C766824L6128L0319K3799J6805R967L717k042p486j2378j6340j9438k2067
59141C807808k4270k5542k5510k4447k2790k0396j6753j1885o483r96M881J1480
$$ plain form
59214 10344903 10300393 10193188 10028230 9811943 9551432 9254381 8929104 8584013 8226762
59205 8226762 7863783 7500405 7141138 6789774 6449377 6122418 5811006 5516882 5241127
59196 5241127 4984027 4745482 4525608 4324758 4142983 3979634 3833621 3703780 3588842
59187 3588842 3487305 3397730 3319239 3251471 3194020 3146040 3106391 3074001 3048010 3027764 3012827
59176 3012827 3003042 2998488 2999346 3005688 3017328 3033887 3055038 3080705 3110887 3145288 3183217 3223977
59164 3223977 3267381 3313788 3363509 3416106 3470330 3524737 3578269 3630189 3679629 3725496 3766824
59153 3766824 3802952 3833271 3857070 3873875 3883842 3887559 3885517 3878031 3865653 3849313 3829875 3807808
59141 3807808 3783538 3757996 3732486 3708039 3685249 3664853 3648100 3636215 3629732 3628736 3633617 3645097
59129C645097J8480K5436L2650M0831N0044N9668O9366P9344Q9633R9833J09912
59118D320294J20475J31800J43198J53943J64322J75075J86072J96271K04879
59109E796329K11764K16693K18729K16654K09566J96932J78394J53850J23581
59100G522492Q8301M9256Q277l2593p1746j08241j41448j70658j95228k14897
59090F733515k29850k40495k47289k50785k51694k50645k47743k42607k35092
59081D537315k25902k16037k05712j94348j81786j68948j56903j45634j34317
59072B907728j22584j11119j00978r2585q5403p8405p1007o3595n6945n1173m5658
59061B028276m0091l4937l0534k6431k2154j8134j5177j3398j2359j1930j2282
$$ plain form
59129 3645097 3663577 3689013 3721663 3762494 3812538 3872206 3941572 4020916 4110549 4210382 4320294
59118 4320294 4440769 4572569 4715767 4869710 5034032 5209107 5395179 5591450 5796329
59109 5796329 6008093 6224786 6443515 6660169 6869735 7066667 7245061 7398911 7522492
59100 7522492 7610793 7660049 7668326 7635733 7563987 7455746 7314298 7143640 6948412 6733515
59090 6733515 6503665 6263170 6015881 5765096 5513402 5262757 5015014 4772407 4537315
59081 4537315 4311413 4095376 3889664 3695316 3513530 3344582 3187679 3042045 2907728
59072 2907728 2785144 2674025 2573047 2480462 2395059 2316654 2245647 2182052 2125107 2073934 2028276
59061 2028276 1988185 1953248 1922714 1896283 1874129 1855995 1840818 1827420 1815061 1803131 1790849
59050A790849j3273j4609j6418j8867k1342k2880k3385k3525k3468k2651k0944
59039A569487j9034j7357j5554j3465j1715j0674r609p638m978k445j57K382N139
59026A464382P390Q711R440R996J0318J0172R580Q689P516O082M626L469K755
59013A563126K435K508L072M085N209O007O383O701P339Q268R126R628R722R472
58999A653081Q952Q264P481O701O226O462P339Q167Q486Q779R752J1111J1797
58986A762598J1504J1151J1511J2188J2484J2599J3292J4664J6074J7194J8436
58975A913695K0156K1970K3214K3877K4753K6648K9522L2577L5145L7277L9316
58964B228150M1144M2389M3241M4379M5916M7010M7074M6834M7481M9126N0821
$$ plain form
59050 1790849 1777576 1762967 1746549 1727682 1706340 1683460 1660075 1636550 1613082 1590431 1569487
59039 1569487 1550453 1533096 1517542 1504077 1492362 1481688 1472079 1464441 1459463 1457018 1456861 1459243 1464382
59026 1464382 1471772 1480483 1489923 1499919 1510237 1520409 1529989 1538678 1546194 1552276 1556902 1560371 1563126
59013 1563126 1565561 1568069 1571141 1575226 1580435 1586442 1592825 1599526 1606865 1615133 1624259 1633887 1643609 1653081
58999 1653081 1662033 1670297 1677778 1684479 1690705 1697167 1704506 1712673 1721159 1729938 1739690 1750801 1762598
58986 1762598 1774102 1785253 1796764 1808952 1821436 1834035 1847327 1861991 1878065 1895259 1913695
58975 1913695 1933851 1955821 1979035 2002912 2027665 2054313 2083835 2116412 2151557 2188834 2228150
58964 2228150 2269294 2311683 2354924 2399303 2445219 2492229 2539303 2586137 2633618 2682744 2733565
58953B733565N2047N3349N5424N8229O1436O5130O9562P4568P9860Q5628R2329
58942C481127R9910J07845J15974J24734J34406J44677J55289J66646J79209J92721
58932D902538K06593K20983K36780K54512K73846K94303L15802L38337L61761
58923G405455L86289M12653M41256M71519N02648N34538N67238N99707O29867
58914A1951170O55883O76676O90983O96580O90723O71015O35706N83780N15440
58905A7767956M32475L37817K34708J26428J6615r0662j91537k83182l64025m33334
58895A7553259m90862n36888n72257n97978o14777o23231o24166o18459o06671
58886A2267970n89371n67836n43712n17888m90451m61969m33885m07158l81410
$$ plain form
58953 2733565 2785612 2838961 2894385 2952614 3014050 3079180 3148742 3223310 3303170 3388798 3481127
58942 3481127 3581037 3688882 3804856 3929590 4063996 4208673 4363962 4530608 4709817 4902538
58932 4902538 5109131 5330114 5566894 5821406 6095252 6389555 6705357 7043694 7405455
58923 7405455 7791744 8204397 8645653 9117172 9619820 10154358 10721596 11321303 11951170
58914 11951170 12607053 13283729 13974712 14671292 15362015 16033030 16668736 17252516 17767956
58905 17767956 18200431 18538248 18772956 18899384 18915999 18825337 18633800 18350618 17986593 17553259
58895 17553259 17062397 16525509 15953252 15355274 14740497 14117266 13493100 12874641 12267970
58886 12267970 11678599 11110763 10567051 10049163 9558712 9096743 8662858 8255700 7874290
58877G874290l56192l32292l10700k90851k71229k51558k33043k16357k00677
58868E411391j85131j70194j56825j44958j33618j22270j11294j01203r1853q2682
58858D111363p3536o4947n7390n0327m2552l3674k4749j6983j0252l509L736J1147
58846C748327J8430K5647L2745L9626M6679N4445O2748P0935P9011Q7735R7425
58835D363753J07551J17699J28154J39307J51206J63995J78033J93254K09056
58826E752008K25273K42518K61328K81488L02679L25169L49421L75490M03187
58817H518561M32440M63157M95000N27472N59830N90736O18433O41280O57600
58808A3504509O65032O60790O42765O09853N61358M97010M17807L26094K24730
$$ plain form
58877 7874290 7518098 7185806 6875106 6584255 6313026 6061468 5828425 5612068 5411391
58868 5411391 5226260 5056066 4899241 4754283 4620665 4498395 4387101 4285898 4194045 4111363
58858 4111363 4037827 3972880 3915490 3865163 3822611 3788937 3764188 3747205 3736953 3733444 3737180 3748327
58846 3748327 3766757 3792404 3825149 3864775 3911454 3965899 4028647 4099582 4178593 4266328 4363753
58835 4363753 4471304 4589003 4717157 4856464 5007670 5171665 5349698 5542952 5752008
58826 5752008 5977281 6219799 6481127 6762615 7065294 7390463 7739884 8115374 8518561
58817 8518561 8951001 9414158 9909158 10436630 10996460 11587196 12205629 12846909 13504509
58808 13504509 14169541 14830331 15473096 16082949 16644307 17141317 17559124 17885218 18109948
58799A8109948J17073P784r7870j96222k85988l66455m36184m94160n40974n77776
58789A5239176o04827o22184o31085o33514o30679o22794o10016n92746n71384
58780I719947n46590n19600m91610m63136m34472m06340l79474l53950l29570
58771E795205l06545k85178k65362k46921k29989k14436j99415j84363j69912
58762C693084j57088j45918j35535j25331j15306j05681r6853q9366q3182p7323
58752B561501p0929o4330n8457n3620m9553m6060m2872l9309l5068l0950k7971
58741B042382k6143k4846k3879k3214k2342k0997k0028k0288k1087k1022k0083
58730A798453j9498j9654j9723j9430j9735k1257k3278k4818k5764k6455k7005
$$ plain form
58799 18109948 18227021 18234805 18136935 17940713 17654725 17288270 16852086 16357926 15816952 15239176
58789 15239176 14634349 14012165 13381080 12747566 12116887 11494093 10884077 10291331 9719947
58780 9719947 9173357 8653757 8162147 7699011 7264539 6858199 6478725 6124775 5795205
58771 5795205 5488660 5203482 4938120 4691199 4461210 4246774 4047359 3862996 3693084
58762 3693084 3535996 3390078 3254543 3129212 3013906 2908225 2811372 2722006 2638824 2561501
58752 2561501 2490572 2426242 2367785 2314165 2264612 2218552 2175680 2136371 2101303 2070353 2042382
58741 2042382 2016239 1991393 1967514 1944300 1921958 1900961 1880933 1860645 1839558 1818536 1798453
58730 1798453 1778955 1759301 1739578 1720148 1700413 1679156 1655878 1631060 1605296 1578841 1551836
58719A551836k7451k7836k7857k7098k5797k4640k3786k2834k1836k1306k1146
58708A280249k0621j9600j8771j8325j7517j6080j4876j4510j4243j3129j1420
58697A101157j0055r305q736q043p176o071m941m504n197o437p274p575p987q858
58683I98998r760j0092r714q876p809o551n093l654k659k231j898j120n5O38P50
58668I30874P65J035J295J206R65J060J685K656L640M311M511M439M417M554M847
58653I72260N488O620P876Q656Q984R471J0389J1428J2512J4161J6612J9210K1143
58640A124810K2447K3784K5593K7920L0767L4145L7861M1633M5427M9377N3519
58629A517283N7801O2388O7650P3814Q0729Q7996R5409J03293J12325J22820J34227
$$ plain form
58719 1551836 1524385 1496549 1468692 1441594 1415797 1391157 1367371 1344537 1322701 1301395 1280249
58708 1280249 1259628 1240028 1221257 1202932 1185415 1169335 1154459 1139949 1125706 1112577 1101157
58697 1101157 1091102 1081797 1073061 1065018 1057842 1051771 1046830 1042326 1037129 1030692 1023418 1015843 1007856 998998
58683 998998 989238 979146 969432 960556 952747 946196 941103 937449 934790 932559 930661 929541 929486 930124 930874
58668 930874 931639 932674 933969 935175 936140 937200 938885 941541 945181 949492 954003 958442 962859 967413 972260
58653 972260 977748 984368 992244 1000900 1009884 1019355 1029744 1041172 1053684 1067845 1084457 1103667 1124810
58640 1124810 1147257 1171041 1196634 1224554 1255321 1289466 1327327 1368960 1414387 1463764 1517283
58629 1517283 1575084 1637472 1705122 1778936 1859665 1947661 2043070 2146363 2258688 2381508 2515735
58618B515735J45562J56352J66908J77585J87890J96432K01705K02794J99353
58609D150316J90895J76437J55209J27683R5614O1058K5719q797m0880o9461r4200
58598D769593j14844j30990j42837j51509j57986j62257j64084j63959j62547
58589C418580j59756j55186j49076j41848j33224j22909j11864j01694r2824q4458
58579B165741p6238o8858o2818n7768n3329m9601m6564m3863m1547m0058l9184
58568A585913l7900l5762l3543l2000l0794k9238k7433k5912k4667k3261k1720
58557A263683k0547j9937j9374j8239j6546j4919j3782j2783j1308r539q379q097
58545A090233p742o531n126m702n243n779n944o240o890p575q233r098r886r970
$$ plain form
58618 2515735 2661297 2817649 2984557 3162142 3350032 3546464 3748169 3950963 4150316
58609 4150316 4341211 4517648 4672857 4800540 4896154 4957212 4982931 4974134 4933254 4863793 4769593
58598 4769593 4654749 4523759 4380922 4229413 4071427 3909170 3745086 3581127 3418580
58589 3418580 3258824 3103638 2954562 2812714 2679490 2556581 2444717 2343023 2250199 2165741
58579 2165741 2089503 2020645 1957827 1900059 1846730 1797129 1750565 1706702 1665155 1625097 1585913
58568 1585913 1548013 1512251 1478708 1446708 1415914 1386676 1359243 1333331 1308664 1285403 1263683
58557 1263683 1243136 1223199 1203825 1185586 1169040 1154121 1140339 1127556 1116248 1106709 1098330 1090233
58545 1090233 1082491 1075960 1070834 1066132 1060889 1055110 1049166 1042926 1036036 1028461 1020228 1011130 1001244 991274
58531I91274r454r097r096q950q613q707r329r771r717r723j0090j0267r782q986
58517H59692q385p956p477o844n882m535l430l346l983m184l500k602j853p55
58503G94960P86J759J382K74l95k78J64N09O06M79L36L22J71l76q53n03O02J706
58485H01651K492L146L487L212K924L513M528M600L661L124L552L791K992J882
58471H48555J253P43j23j000j686k650l783m036l154k436k767l335l253l099l593
58456H15636m109l835l233l072l076k812k793l371l570k449p02M16R25J524K086
58441G87565K147K065K330K518K225K222L286M650N150N079N430O027O046N746
58427H42486N950O304N812M798M677N810P132P854Q179Q340Q190P805P469P059
$$ plain form
58531 991274 981820 972723 963627 954677 946064 937357 928028 918257 908540 898817 888727 878460 868678 859692
58517 859692 851307 843351 835874 829030 823148 818613 815183 811837 807854 803670 800170 797568 795715 794960
58503 794960 795746 797505 798887 799161 798766 798488 798652 799161 799767 800246 800582 800904 801075 800699 799846 799343 799945 801651
58485 801651 804143 807289 810776 813988 816912 820425 824953 829553 833214 836338 839890 843681 846673 848555
58471 848555 849808 850551 850428 849428 847742 845092 841309 837273 834119 831683 828916 825581 822328 819229 815636
58456 815636 811527 807692 804459 801387 798311 795499 792706 789335 785765 783316 782614 783030 783955 785479 787565
58441 787565 789712 791777 794107 796625 798850 801072 804358 809008 814158 819237 824667 830694 836740 842486
58427 842486 848436 854740 860552 865350 870027 875837 882969 890823 899002 907342 915532 923337 930806 937865
58413I37865O344N618N207M757L988L582M215N266N594N161M677M208L518L192
58399A003192L953N169N542N016M633M702M623M363M624N441N996N951N822N897
58385A074924N903N798N926O275O498O630O847O781N999N011M834N620O665P582
58371A161293Q486R185R262Q909Q845R361J0091J0553J0379R391Q051P396P842
58358A279044Q617Q972R267J0038J0838J0955J0538J0130R745R398R611J0475
58346A397628J1064J0865J0730J1368J1987J1754J1374J1829J2650J3021J3475
58335A527745J4750J6050J6285J6101J6765J7925J8409J8502J9299K0533K1043
58324A723407K0823K0695K0537J9871J9500K0453K1939K2421K2199K2777K4172
$$ plain form
58413 937865 944209 949827 955034 959791 963779 967361 971576 976842 982436 987597 992274 996482 1000000 1003192
58399 1003192 1007145 1012314 1017856 1022872 1027505 1032207 1036830 1041193 1045817 1051258 1057254 1063205 1069027 1074924
58385 1074924 1080827 1086625 1092551 1098826 1105324 1111954 1118801 1125582 1131581 1136592 1141426 1147046 1153711 1161293
58371 1161293 1169779 1178964 1188226 1197135 1205980 1215341 1225432 1235985 1246364 1255755 1263806 1271202 1279044
58358 1279044 1287661 1296633 1305900 1315938 1326776 1337731 1348269 1358399 1368144 1377542 1387153 1397628
58346 1397628 1408692 1419557 1430287 1441655 1453642 1465396 1476770 1488599 1501249 1514270 1527745
58335 1527745 1542495 1558545 1574830 1590931 1607696 1625621 1644030 1662532 1681831 1702364 1723407
58324 1723407 1744230 1764925 1785462 1805333 1824833 1845286 1867225 1889646 1911845 1934622 1958794
58313A958794K5101K5348K5786K6391K6351K5819K5586K5443K4869K4734K6157
58302B240379K8312K9538K9963L0778L1734L1872L1928L3327L5438L6513L6776
58291B596558L7765L9240L9743L9736M1014M3403M5169M6369M8494N1081N2181
58280C080753N2098N3190N5759N7638N8164N9046O0869O2224O2935O4770O8144
58269C735590P1190P2912P4363P6190P7843P9687Q2928Q7032R0174R2370R5215
58258D635494R8662J01323J03751J07797J12724J15911J17472J20204J24773J29064
58248E767175J32602J37330J43578J49455J54779J61385J69228J76391J83200
58239G175123J91891K02205K11980K21883K34348K48026K59167K68586K81051
$$ plain form
58313 1958794 1983895 2009243 2035029 2061420 2087771 2113590 2139176 2164619 2189488 2214222 2240379
58302 2240379 2268691 2298229 2328192 2358970 2390704 2422576 2454504 2487831 2523269 2559782 2596558
58291 2596558 2634323 2673563 2713306 2753042 2794056 2837459 2882628 2928997 2977491 3028572 3080753
58280 3080753 3132851 3186041 3241800 3299438 3357602 3416648 3477517 3539741 3602676 3667446 3735590
58269 3735590 3806780 3879692 3954055 4030245 4108088 4187775 4270703 4357735 4447909 4540279 4635494
58258 4635494 4734156 4835479 4939230 5047027 5159751 5275662 5393134 5513338 5638111 5767175
58248 5767175 5899777 6037107 6180685 6330140 6484919 6646304 6815532 6991923 7175123
58239 7175123 7367014 7569219 7781199 8003082 8237430 8485456 8744623 9013209 9294260
58230I294260K97550L14561L31490L51821L76115M01042M26553M56776M92639
58221A2742807N31006N72345O21382O79206P43046Q15127R02912J009598J133744
58212A9751173J278416J448799J639050J834125K027565K225382K431197K643074
58204C5278781K868309L124899L424279L770465M180531M685471N305977O052308
58196F8691020O956086Q075574R462622J1158605J3223510J5692914J8441572
58189A51701903K1117089K3251028K4391920K4085105K1844861J7391708J1046895
58182B94830509L813595l059403q646779j2562412j4814877j5641005j5463841
58175B28455787j4820929j4171500j3731352j3485920j3324541j3147121j2890405
$$ plain form
58230 9294260 9591810 9906371 10237861 10589682 10965797 11366839 11793392 12250168 12742807
58221 12742807 13273813 13846158 14467540 15146746 15889792 16704919 17607831 18617429 19751173
58212 19751173 21029589 22478388 24117438 25951563 27979128 30204510 32635707 35278781
58204 35278781 38147090 41271989 44696268 48466733 52647264 57332735 62638712 68691020
58196 68691020 75647106 83722680 93185302 104343907 117567417 133260331 151701903
58189 151701903 172818992 196070020 220461940 244547045 266391906 283783614 294830509
58182 294830509 298644104 295584701 286937922 274375510 259560633 243919628 228455787
58175 228455787 213634858 199463358 185732006 172246086 158921545 145774424 132884019
58168A32884019j2513136j1978782j1255685j0342549r291412q185909p089459
58161F2227087o025837n005119m040018l129045k253175j410484o38310J3153
58153C9738252N08327Q06872Q41161N57896n626p07219j373857j886617k203223
58144C6275966k330355k299304k162341j987241j834733j733438j675438j635846
58136B0617270j596343j551540j499130j432194j343863j235037j114094r91053
58128I854016q73884p67494o73016n89100n15403m53220m02060l58475l19794
58119D901570k86314k58183k33137k09357j87906j70024j54473j39804j27024
58110C135348j17667j11072j05666j01160r7661r4281r0425q6693q3064p8169
$$ plain form
58168 132884019 120370883 108392101 97136416 86793867 77502455 69316546 62227087
58161 62227087 56201250 51196131 47156113 44027068 41773893 40363409 39725099 39738252
58153 39738252 40246579 41053451 41894612 42452508 42446882 41739663 40365806 38479189 36275966
58144 36275966 33945611 31646307 29483966 27496725 25661992 23928554 22253116 20617270
58136 20617270 19020927 17469387 15970257 14538063 13194200 11959163 10845069 9854016
58128 9854016 8980132 8212638 7539622 6950522 6435119 5981899 5579839 5221364 4901570
58119 4901570 4615256 4357073 4123936 3914579 3726673 3556649 3402176 3262372 3135348
58110 3135348 3017681 2906609 2800943 2699783 2602122 2507841 2417416 2330723 2247659 2169490
58100B169490p1881o6496o3484o1246n7844n3907n0835m8225m5224m2627m1309
58089A566412m0154l7740l4716l2520l1022k9421k8169k8017k8143k7218k5430
58078A223862k3807k2415k0820j9453j8915j8678j7906j6762j5791j4795j3502
58067A021018j2405j1828j1176j0089r315r418r698r378q728q144p377o651p048
58054H99763q709j0073j0049r545r563r438q393p327p353p776p279o027m999m162
58040G89070l043k174k286k773k470j426m81K43J041J509J005j69j254k066k641
58025G72085k538j691j129j670k583k717k274k283k933l548l749l574l103k724
58011G35569l175m416n310n210m910n112n105m119k841k279k114j567j011j296
$$ plain form
58100 2169490 2097609 2031113 1967629 1906383 1848539 1794632 1743797 1695572 1650348 1607721 1566412
58089 1566412 1526258 1488518 1453802 1421282 1390260 1360839 1332670 1304653 1276510 1249292 1223862
58078 1223862 1200055 1177640 1156820 1137367 1118452 1099774 1081868 1065106 1049315 1034520 1021018
58067 1021018 1008613 996785 985609 975520 966205 956787 947089 937711 928983 920839 913462 906811 899763
58054 899763 891054 880981 870932 861387 851824 842386 833993 826666 819313 811537 804258 798231 793232 789070
58040 789070 786027 783853 781567 778794 776324 774898 774417 774660 775701 777210 778215 778046 776792 774726 772085
58025 772085 769547 767856 766727 765057 762474 759757 757483 755200 752267 748719 744970 741396 738293 735569
58011 735569 732394 727978 722668 717458 712548 707436 702331 698212 695371 693092 690978 689411 688400 687104
57997F87104k177k872l446m296m954m811m339m242m038k918j373m79j44M62J236
57982F48713J430J145J065J160J084J386K694M057L880K395J485K007K863K953
57968F78317K484J962J298M93J14M32Q60P42J56l51m03q9J17l15j335k265k696
57951F79521l000l488l645k874j491k74N67J250J783K164K710L431L645K958K027
57936F85284J509R62k96j940l243m288n457o374o572o560o998p406o973o093n636
57921F19919n269m113k603j971k127j795p53r0n5N99K512M547N389N126M647M422
57905F28385M509M837N029M629L860L407L293K823J847J130J120J298J087O00
57891F67854R7n47j393k106k476k729l009l017k500j665r19n54o60j009j056n00
$$ plain form
57997 687104 684927 682055 678609 674313 669359 664548 660209 655967 651929 649011 647638 647159 647015 647477 648713
57982 648713 650143 651288 652353 653513 654597 655983 658677 662734 666614 669009 670494 672501 675364 678317
57968 678317 680801 682763 684061 684554 684668 685100 685960 686702 686858 686507 686104 686015 686132 685817 684482 682217 679521
57951 679521 676521 673033 669388 666514 665023 664749 665316 666566 668349 670513 673223 676654 680299 683257 685284
57936 685284 686793 687755 687459 685519 682276 677988 672531 666157 659585 653025 646027 638621 631648 625555 619919
57921 619919 614650 610537 607934 605963 603836 602041 601288 601198 601143 601742 604254 608801 614190 619316 623963 628385
57905 628385 632894 637731 642760 647389 651249 654656 657949 660772 662619 663749 664869 666167 667254 667854
57891 667854 667951 667404 666011 663905 661429 658700 655691 652674 650174 648509 647590 647036 646376 645367 644311 643811
57875F43811K41N52M79N23R06J525K431L648M788N483N944O443O657O293N906
57860F95630O174O701O542N634M589L408J602n82k222l043l516l691l106j930
57846G12190j058r14j158j567k186k624k372j859k011k700k867k252j732j817
57832F85073k138k627l672m799m675l093j550j243j720k170k713l577m231m330
57818F42535m465n003n134m121k653j868j713j388q47p19r90q09L57J960K977
57803F18119K930K392K498L746N324O156O400P128Q593R836J0229J0286J0583
57790G04220J0906J0962J0976J1017J0662R864R254R006Q437P283O335N971N159
57777H20052K999L86j093j235j106j361j779k092k257k098j553j060r74r39n35
$$ plain form
57875 643811 644052 644604 645083 645606 646512 648037 650468 654116 658904 664387 670331 676774 683431 689724 695630
57860 695630 701804 708505 715047 720681 725270 728678 730280 729698 727476 724433 720917 717226 714120 712190
57846 712190 711132 710218 709060 707493 705307 702683 700311 698452 696441 693741 690874 688622 686890 685073
57832 685073 682935 680308 676636 671837 667162 664069 662519 661276 659556 657386 654673 651096 646865 642535
57818 642535 638070 633067 627933 623812 621159 619291 617578 616190 615343 614624 613634 612825 613182 615142 618119
57803 618119 621049 623441 625939 629685 635009 641165 647565 654693 663286 673122 683351 693637 704220
57790 704220 715126 726088 737064 748081 758743 768607 777861 786867 795304 802587 808922 814893 820052
57777 820052 823051 823437 822344 821109 820003 818642 816863 814771 812514 810416 808863 807803 806829 805890 805355
57762H05355j39k84n84j79R43K001K625L247M261N487O467O878O744O585P133
57747H56540Q511J0025J1111J1905J2536J2455J1284R726Q855Q808Q964R036R254
57734I89010R714J0320J1109J1981J2399J2051J1539J1663J2348J3031J3746J4927
57722A133838J6431J7661J8585J9728K1184K2433K3222K3860K4605K5410K6367
57711A373324K7731K9522L1631L4199L7294M0441M3193M6014M9747N4297N8777
57700A826170O2969O7642P3192P8958Q4471R0600R8708J09053J20472J31606J42131
57689B885972J52988J65351J79109J92383K02779K09067K11215K09043K01678
57680D609585J88411J69452J45550J17631Q7201N6716K9001O182j0986k3309l2764
$$ plain form
57762 805355 805216 804932 804348 804169 805112 807113 809738 812985 817246 822733 829200 836078 842822 849407 856540
57747 856540 865051 875076 886187 898092 910628 923083 934367 944093 952948 961756 970720 979756 989010
57734 989010 998724 1009044 1020153 1032134 1044533 1056584 1068123 1079786 1092134 1105165 1118911 1133838
57722 1133838 1150269 1167930 1186515 1206243 1227427 1249860 1273082 1296942 1321547 1346957 1373324
57711 1373324 1401055 1430577 1462208 1496407 1533701 1574142 1617335 1663349 1713096 1767393 1826170
57700 1826170 1889139 1956781 2029973 2108931 2193402 2284002 2382710 2491763 2612235 2743841 2885972
57689 2885972 3038960 3204311 3383420 3575803 3778582 3987649 4198864 4407907 4609585
57680 4609585 4797996 4967448 5112998 5230629 5317830 5374546 5403547 5409729 5398743 5375434 5342670
57669E342670m1461n0756o1517p4959r2166j12435j32750j49632j61204j67229
57659D298561j67813j63051j53831j42124j30037j18738j08347r8506q8888p9348
57649C047878o9845o0264n0413m0219k9907j9811j0067o56Q336J6803K4977L3408
57637B850220M2274N1075N9331O7483P6531Q6760R7483J08151J19137J30824J42505
57626C831774J52903J61464J68224J72525J72771J67687J57097J41215J19999
57617E245659R3796O4092L3052K490k6455n2981p6416r6199j11841j23251j31112
57606D820834j36546j40172j41877j41579j39702j36657j32510j27384j21621
57597C602786j15211j07724r9296r0931q3322p6006o8357o0749n3999m8140m2666
$$ plain form
57669 5342670 5301209 5250453 5188936 5113977 5021811 4909376 4776626 4626994 4465790 4298561
57659 4298561 4130748 3967697 3813866 3671742 3541705 3422967 3314620 3216114 3127226 3047878
57649 3047878 2978033 2917769 2867356 2827137 2797230 2777419 2767352 2766696 2775032 2791835 2816812 2850220
57637 2850220 2892494 2943569 3002900 3070383 3146914 3233674 3331157 3439308 3558445 3689269 3831774
57626 3831774 3984677 4146141 4314365 4486890 4659661 4827348 4984445 5125660 5245659
57617 5245659 5339455 5403547 5436599 5439089 5412634 5359653 5283237 5187038 5075197 4951946 4820834
57606 4820834 4684288 4544116 4402239 4260660 4120958 3984301 3851791 3724407 3602786
57597 3602786 3487575 3379851 3280555 3189624 3106302 3030296 2961939 2901190 2847191 2799051 2756385
57586B756385l7495l2852k8483k3942j9447j5641j2632j0031p716n791l900j523
57574B556932J055K988M132N308P101R166J1010J2656J4295J5768J6868J7744
57562B675023J8715J9953K1506K3381K5488K7682K9925L2195L4330L6230L8058
57551B982486M0003M2056M4343M7335N1221N5432N9381O3364O8039P3267P8328
57540C605255Q3221Q8710R5103J01876J08781J16441J25283J34528J42871J49695
57530D751764J55075J58870J60346J58669J53320J43885J29791J10660Q7242O1722
57520F071344L6580J2986r280l0193m8507o2854p3221q0604q5634q8394q9262
57509E552961q8991q7918q5789q2362p7646p1743o5056n8341n1907m5013l7012
$$ plain form
57586 2756385 2718890 2686038 2657555 2633613 2614166 2598525 2585893 2575862 2568146 2562355 2558455 2556932
57574 2556932 2557987 2560975 2565107 2570415 2577516 2586682 2597692 2610348 2624643 2640411 2657279 2675023
57562 2675023 2693738 2713691 2735197 2758578 2784066 2811748 2841673 2873868 2908198 2944428 2982486
57551 2982486 3022489 3064545 3108888 3156223 3207444 3262876 3322257 3385621 3453660 3526927 3605255
57540 3605255 3688476 3777186 3872289 3974165 4082946 4199387 4324670 4459198 4602069 4751764
57530 4751764 4906839 5065709 5226055 5384724 5538044 5681929 5811720 5922380 6009622 6071344
57520 6071344 6107924 6120910 6111630 6081437 6032930 5970076 5896855 5816251 5730617 5642223 5552961
57509 5552961 5463970 5376052 5290263 5207901 5130255 5058512 4993456 4935115 4883208 4838195 4801183
57498D801183k8750k1722j5929r827k567M929J1530J7384K3183K8878L3942L8354
57486D880588M2604M7065N1846N6996O2494O8247P4290Q0661Q7077R3210R9274
57475E644352J05828J12963J20337J28033J36487J45311J52976J57996J59760
57466F864043J58031J52339J42321J28016J09520Q7161O2330L7337J3893p604
57456G747387k6917m2997n4917o3050o8516p1936p3453p3584p3060p1997o9861
57445G057099o6271o1411n5752m9738m3598l7219l0365k3295j6778j1272o423
57434F654977j579L497Q683J3779J8454K2322K5395K8156L0873L3320L5335L7256
57422F910468L9407M1616M3488M4856M5768M6471M7518M9302N1350N2702N3213
$$ plain form
57498 4801183 4772433 4750711 4734782 4724955 4722388 4727317 4738847 4756231 4779414 4808292 4842234 4880588
57486 4880588 4923192 4970257 5022103 5079099 5141593 5209840 5284130 5364791 5451868 5545078 5644352
57475 5644352 5750180 5863143 5983480 6111513 6248000 6393311 6546287 6704283 6864043
57466 6864043 7022074 7174413 7316734 7444750 7554270 7641431 7703761 7741098 7754991 7747387
57456 7747387 7720470 7677473 7622556 7559506 7490990 7419054 7345601 7272017 7198957 7126960 7057099
57445 7057099 6990828 6929417 6873665 6823927 6780329 6743110 6712745 6689450 6672672 6661400 6654977
57434 6654977 6653398 6656895 6665578 6679357 6697811 6720133 6745528 6773684 6804557 6837877 6873212 6910468
57422 6910468 6949875 6991491 7034979 7079835 7125603 7172074 7219592 7268894 7320244 7372946 7426159
57411G426159N3714N4678N5623N6187N6853N7980N9008N9477N9996O1343O3182
57400H064200O4618O5453O6019O6222O5807O5244O5322O5962O6253O5666O4567
57389H785333O3619O3258O3578O4281O4851O5314O6448O8695P1278P3081P4016
57378I523752P4775P5588P6180P6714P7802P9479Q1003Q1793Q1954Q1773Q1348
57367A0392161Q0784Q0257P9795P9382P9289P9844Q0928Q2099Q3128Q4140Q5282
57356A1287089Q6655Q8305Q9975R1128R1568R1726R1929R1909R1497R1190R1257
57345A2284228R0845Q8955Q5990Q3331Q1628Q0471P9569P9107P8871P8146P6739
57334A3187880P5297P4297P3520P2779P2449P2964P4412P6762P9905Q3248Q5990
$$ plain form
57411 7426159 7479873 7534551 7590174 7646361 7703214 7761194 7820202 7879679 7939675 8001018 8064200
57400 8064200 8128818 8194271 8260290 8326512 8392319 8457563 8522885 8588847 8655100 8720766 8785333
57389 8785333 8848952 8912210 8975788 9040069 9104920 9170234 9236682 9305377 9376655 9449736 9523752
57378 9523752 9598527 9674115 9750295 9827009 9904811 9984290 10065293 10147086 10229040 10310813 10392161
57367 10392161 10472945 10553202 10632997 10712379 10791668 10871512 10952440 11034539 11117667 11201807 11287089
57356 11287089 11373744 11462049 11552024 11643152 11734720 11826446 11918375 12010284 12101781 12192971 12284228
57345 12284228 12375073 12464028 12550018 12633349 12714977 12795448 12875017 12954124 13032995 13111141 13187880
57334 13187880 13263177 13337474 13410994 13483773 13556222 13629186 13703598 13780360 13860265 13943513 14029503
57323A4029503Q8005Q9873R1794R3180R3559R3248R2738R1963R0595Q8597Q6034
57312A5029089Q2774P8800P4604P0920O8213O6612O6083O6513O7703O9506P1867
57301A5812684P4790P8328Q2599Q7496R2602R7566J02402J07041J10886J13268
57291A6759662J14147J13847J12274J09020J04114R8000R0850Q2662P4054O6114
57281A7724744N9221N2707M6007L9503L3874K9220K5264K1990J9615J8228J7832
57270A8088205J8473J9966K1738K3250K4418K5419K6246K6758K7032K7365K7876
57259A8356746K8271K8191K7705K7265K6923K5837K3079J8982J5017J2037R352
57248A8599405O043K580K39o73j067j667k400l173m333o039q041j0409j3781j8380
$$ plain form
57323 14029503 14117508 14207381 14299175 14392355 14485914 14579162 14671900 14763863 14854458 14943055 15029089
57312 15029089 15111863 15190663 15265267 15336187 15404400 15471012 15537095 15603608 15671311 15740817 15812684
57301 15812684 15887474 15965802 16048401 16135897 16228499 16326065 16428467 16535508 16646394 16759662
57291 16759662 16873809 16987656 17099930 17208950 17313064 17411064 17501914 17584576 17658630 17724744
57281 17724744 17783965 17836672 17882679 17922182 17956056 17985276 18010540 18032530 18052145 18070373 18088205
57270 18088205 18106678 18126644 18148382 18171632 18196050 18221469 18247715 18274473 18301505 18328870 18356746
57259 18356746 18385017 18413208 18440913 18468178 18495101 18520938 18544017 18562999 18578016 18590053 18599405
57248 18599405 18605448 18608028 18608267 18607594 18606527 18604860 18602460 18599287 18594954 18588915 18580874 18570465 18556684 18538304
57234A8538304k3398k7907l1977l6231m0499m3562m4550m4183m4193m5443m6965
57223A8109396m7184m5763m3612m1272l8193l3840k8685k3544j8674j4216j0665
57212A7763748q123n739k927n89J7p52j278q82m19p46j804l353n533q298j1239
57197A7712083j4301j7933k2290k6972l1692l6495m1163m5225m8827n2843n7820
57186A7316522o3440o9294p5630q3023r1736j01574j11988j22294j32101j41456
57176A6323986j50338j58318j65105j70869j75347j77240j75326j69730j61213
57167A4820500j49884j35672j19611j03266q7340p2170n9154n0086m5361m4352
57157A3953604m7345n5269o7635q2701r9827j19699j41809j63605j82751j98456
$$ plain form
57234 18538304 18514906 18486999 18455022 18418791 18378292 18334730 18290180 18245997 18201804 18156361 18109396
57223 18109396 18062212 18016449 17972837 17931565 17893372 17859532 17830847 17807303 17788629 17774413 17763748
57212 17763748 17755625 17749886 17746959 17746370 17746387 17745635 17744357 17743475 17743056 17742310 17740506 17737153 17731620 17723322 17712083
57197 17712083 17697782 17679849 17657559 17630587 17598895 17562400 17521237 17476012 17427185 17374342 17316522
57186 17316522 17253082 17183788 17108158 17025135 16933399 16831825 16719837 16597543 16465442 16323986
57176 16323986 16173648 16015330 15850225 15679356 15504009 15326769 15151443 14981713 14820500
57167 14820500 14670616 14534944 14415333 14312067 14224727 14152557 14093403 14043317 13997956 13953604
57157 13953604 13906259 13850990 13783355 13700654 13600827 13481128 13339319 13175714 12992963 12794507
57147A2794507k09903k15276k13361k04745j90540j71408j48765j25617j05128
57138A1209764q9262p9292p6320q0512r0920j06535j26365j48126j68349j84349
57128A0059734j94829j98475j93955j81995j65669j48014j31058j17488j10682
57119H617569j11782j18447j27303j35739j40757j38856j28610j11408q8728o0992
57109G454947l0073LK6371M8811O6833P8668Q5131R1347J02445J20384J46596
57098H191463J84175K35553L02198L88519N00743O39248P97826R72774J163530
57089A3376029J361034J552461J753480K020344K394797K823842L154191L227635
57081C1663813K985769K486494J840086J144670M66433j52972o88493j126480
$$ plain form
57147 12794507 12584604 12369328 12155967 11951222 11760682 11589274 11440509 11314892 11209764
57138 11209764 11120502 11041210 10964890 10884378 10793458 10686923 10560558 10412432 10244083 10059734
57128 10059734 9864905 9666430 9472475 9290480 9124811 8976797 8845739 8728251 8617569
57119 8617569 8505787 8387340 8260037 8124298 7983541 7844685 7716075 7604667 7515939 7454947
57109 7454947 7424874 7424877 7451248 7500059 7566892 7645560 7730691 7822038 7924483 8044867 8191463
57098 8191463 8375638 8611191 8913389 9301908 9802651 10441899 11239725 12212499 13376029
57089 13376029 14737063 16289524 18043004 20063348 22458145 25281987 28436178 31663813
57081 31663813 34649582 37136076 38976162 40120832 40587265 40434293 39745800 38619320
57073C8619320j460191j690008j825404j880141j865130j791604j680919j563074
57065B4862849j461044j379933j313274j255552j206210j166068j134712j110118
57057A4835938j087749j060688j022802r71719r08436q35657p57536o79260o04969
57048F907122n36495m74622m20305l73753l33613k98308k67556k41659k20128
57039C740683k01887j86262j73101j62326j53849j47402j42150j37087j32012
57030B304607j27393j23097j18167j12145j05664r9290r2684q5456p8060p1171
57020A291480o4759n8456n2346m6806m1836l7080l2339k7691k3209j8779j4198
57009H73981r382m530J41M953J0765J8190K7231L7958N0736O4979P8342Q8098
$$ plain form
57073 38619320 37159129 35469121 33643717 31763576 29898446 28106842 26425923 24862849
57065 24862849 23401805 22021872 20708598 19453046 18246836 17080768 15946056 14835938
57057 14835938 13748189 12687501 11664699 10692980 9784544 8948887 8191351 7512091 6907122
57048 6907122 6370627 5896005 5475700 5101947 4768334 4470026 4202470 3960811 3740683
57039 3740683 3538796 3352534 3179433 3017107 2863258 2715856 2573706 2436619 2304607
57030 2304607 2177214 2054117 1935950 1823805 1718141 1618851 1526167 1440711 1362651 1291480
57020 1291480 1226721 1168265 1115919 1069113 1027277 990197 957858 930167 906958 888179 873981
57009 873981 864599 860069 860210 865163 875928 894118 921349 959307 1010043 1075022 1153364 1241462
56997A241462R2793R1417Q1774O1804L3056J410k6561m7264o0229o6325o6965
56986A336372o4152o0045n6377n4375n4569n6269n8048n9212o0161o0838n9846
56975F92480n5953m9861m3431l7619l2118k6735k2018j8343j5234j1979q479n154
56963C65556k288K72K852N495P876R677J0886J1499J1072R056N694K040j159m071
56949D34457o929r181j0089r814r200q589p618o204m959m282l594j966P51L839
56935C56622O657R191J1622J3773J5154J5316J3862J0438N168q80o181r917j2366
56922D28459j4007j4716j4221j2957j1879j1476j1469j1473j1466j1496j1394
56911B91905j1014j0486j0060r888r984j0084r536p795n257l178k455k691k756
$$ plain form
56997 1241462 1334255 1425672 1507446 1569250 1602306 1603716 1577155 1529891 1469662 1403337 1336372
56986 1336372 1272220 1212175 1155798 1101423 1046854 990585 932537 873325 813164 752326 692480
56975 692480 636527 586666 543235 505616 473498 446763 424745 406402 391168 379189 370710 365556
56963 365556 363268 363540 366392 371887 379763 389440 400326 411825 422897 431953 437647 439687 438528 434457
56949 434457 427528 418347 408258 398444 389244 380655 373037 366833 361874 357592 353998 352032 352783 356622
56935 356622 363279 372470 384092 397865 413019 428335 442197 452635 457803 456923 450742 440825 428459
56922 428459 414452 399736 385515 372558 360679 349203 337734 326261 314795 303299 291905
56911 291905 280891 270405 260345 250457 240473 230389 220853 213058 207801 204623 202168 199477 196721
56898A96721k042q42L41J364K371L531M997O819Q808J0671J2401J4323J6454J7989
56884B93906J7804J5562J2087Q567N601L213J485P11Q87J544K250L052M128N303
56870C76100O222O972Q182J0405J3612J7340K1211K5137K9103L2885L5990L7686
56858F20845L7001L2965K5437J5799O433r41o267j0247j2909j3727j2885j1464
56846F70040j0175q653o384l639r17K012N969J1535J8793K7485L6852M5575N2363
56833H40856N6349N6575N1664M0989K6086J0039m536j6509k5407l0758l2667l2316
56821I40365l1249l0328k9579k8643k7095k4683k1626j8359j4708r619k197P073
56809G09352J6490K4429L0042L2782L1801K6364J6892N268o112j5685k3118k8529
$$ plain form
56898 196721 194679 193837 194178 195542 197913 201444 206441 213260 222068 232739 245140 259463 275917 293906
56884 293906 311710 327272 339359 347926 353527 356740 358225 358936 359823 361367 363617 366669 370797 376100
56870 376100 382322 389294 397476 407881 421493 438833 460044 485181 514284 547169 583159 620845
56858 620845 657846 690811 716248 732047 738480 737539 731272 721025 708116 694389 681504 670040
56846 670040 659865 651212 644828 641189 640272 642284 648253 659788 678581 706066 742918 788493 840856
56833 840856 897205 953780 1005444 1046433 1072519 1082558 1078022 1061513 1036106 1005348 972681 940365
56821 940365 909116 878788 849209 820566 793471 768788 747162 728803 714095 704476 702279 709352
56809 709352 725842 750271 780313 813095 844896 871260 888152 893420 887308 871623 848505 819976
56797H19976l1723l2409l1084k9130k7752k6945k5763k3643k1109j8930j6895
56786E34593j3867r133l275K524P569J1663J4345J4761J2402P558J098n782j1720
56773E62736j5773j8109j9690k1032k1747k1408k0375j9388j8800j8548j8495
56762C49371j8420j7994j7101j5943j4635j3009j1058r163p654o523n780n513
56750B06578n352m528l018j880j829k110j598m60K03Mm48p20r66j236j251j052
56734A80337j075j447j807j929j896j641j061n14n62j058j315j218j409k108k567
56719A58730k116j132m53l48m92o29p65q74p54k11O55J265R11m09j670j845j085
56702A48778l99k54k51r3n5k32j35N44J363J696J478J043O53M32M37M71K32j26
$$ plain form
56797 819976 788253 755844 724760 695630 667878 640933 615170 591527 570418 551488 534593
56786 534593 520726 511593 508318 510842 518411 530074 544419 559180 571582 579140 580238 574456 562736
56773 562736 546963 528854 509164 488132 466385 444977 424602 405214 386414 367866 349371
56762 349371 330951 312957 295856 279913 265278 252269 241211 232048 224394 217871 212091 206578
56750 206578 201226 196698 193680 191800 189971 187861 186263 185803 186006 186010 185562 184842 183876 182640 181389 180337
56734 180337 179262 177815 176008 174079 172183 170542 169481 168967 168405 167347 166032 164814 163405 161297 158730
56719 158730 156614 155482 155029 154681 154189 153560 152795 151921 151167 150956 151611 152876 153787 153378 151708 149863 148778
56702 148778 148379 148125 147874 147781 147726 147494 147359 147903 149266 150962 152440 153483 154136 154568 155005 155476 155708 155582
56684A55582J8R97K363L359L587L130K399J928J900J823J165K56m8L38N38J6p24
56667A78627j110j344j768k063j738r44k30J69K89J58n5RL08K11o04j546j913
56650A66456j760j450q35L14J531K103K015J712J233M15k63n8Q70J470J163M05
56634A75321j75m64n78n51n36o75o66p4P28P42k02r85o74J55K90m63j218j352
56616A68623j080p76m64j28K3j78o11j035j229r71k33N09N94o9q72j223j084o42
56598A59154M4P86J110Q41N03O50J054J140R71J045J261R98K87j1M67R76Q82O44
56580A72802R45J516J682J463J290J040M13j17K40J318K222K760L474M270M290
56565A99608L479L004L493M065L848L493M054N114N270M103K618J766J586J734
$$ plain form
56684 155582 155600 156597 158960 162319 165906 169036 171435 173363 175263 177086 178251 178507 178459 178797 179335 179351 178627
56667 178627 177517 176173 174405 172342 170604 169660 169430 169599 169888 170046 169991 170000 170308 170519 169915 168369 166456
56650 166456 164696 163246 162411 162725 164256 166359 168374 170086 171319 171734 171471 171413 172283 173753 174916 175321
56634 175321 175146 174682 174104 173553 173017 172342 171676 171602 172330 173072 172870 171885 171211 171366 171656 171193 169975 168623
56616 168623 167543 166767 166303 166175 166198 166020 165409 164374 163145 162174 161941 162450 163044 162975 162103 160880 159796 159154
56598 159154 159198 159984 161094 161935 162438 163088 164142 165282 166253 167298 168559 169557 169844 169833 170300 171276 172158 172802
56580 172802 173747 175263 176945 178408 179698 180738 181151 181034 181274 182592 184814 187574 191048 195318 199608
56565 199608 203087 206091 209584 213649 217497 220990 225044 230158 235428 239531 242149 243915 245501 247235
56551B47235K005K179K082J911J940J849J023l86j442j646j507j535j499j165
56537B51044j090j879l054l585l386l369l920m260l680k692k329k786l382l570
56523B08062l339k824k198j853k067k449k343j814j534j704j793j594j634k157
56509A78759k577k454k217k254j999r26K32L68k82m65J92Q05P49M33K87O2m25
56492A68288o90k52O75J581K201K366J931J254J169K046L187L637L244K670K574
56477A95881L044L576L503K759K169K551L529L966L602L486M321N263N067L871
56463B46588L019L270L926L861K940K120K352L505M488M382L238J721L34o43q83
56448B84218l51L28N19M84Q72J424J147p7j120j176p60o22o20l73k45q15j818
$$ plain form
56551 247235 249240 251419 253501 255412 257352 259201 260224 259838 258396 256750 255243 253708 252209 251044
56537 251044 249954 248075 245021 241436 238050 234681 230761 226501 222821 220129 217800 215014 211632 208062
56523 208062 204723 201899 199701 197848 195781 193332 190989 189175 187641 185937 184144 182550 180916 178759
56509 178759 176182 173728 171511 169257 167258 166332 166564 166932 166650 166185 166377 167182 167931 168364 168651 168713 168288
56492 168288 167598 167346 168021 169602 171803 174169 176100 177354 178523 180569 183756 187393 190637 193307 195881
56477 195881 198925 202501 206004 208763 210932 213483 217012 220978 224580 228066 232387 237650 242717 246588
56463 246588 249607 252877 256803 260664 263604 265724 268076 271581 276069 280451 283689 285410 285744 285101 284218
56448 284218 283867 284195 284714 285198 286070 287494 288641 288564 287444 286268 285508 284886 284266 283893 283648 282833 281015
56431B81015k430k322j862j498j499k003k762l119k750k235k310k847l047k557
56417B47774j807j341j235j257j241j135q55k80N14J057Q00j44q63p00j34n0l13
56400B38790J3J107J955J759R69N14O80J156J628J921K030K269K932L651L783
56385B65157L467L469L841L725K915K501L323M663N279M946M154L031J543L00
56371C12314J20R72J943K169J440K44n11l04K33j9j036j533q53R6M33O11J264
56354C17583J832J517Q27P79J169J011L57K94J206K290K882L234L794M501N052
56339C48328N300N260N115N127N298N333N191N280N746O181O405O855P721Q412
56325D31552Q552Q702R355R955R769R037Q382P801P128O695O562N899M287K838
$$ plain form
56431 281015 278585 276263 274401 272903 271404 269401 266639 263520 260770 258535 256225 253378 250331 247774
56417 247774 245967 244626 243391 242134 240893 239758 238903 238623 239137 240194 240994 240850 239987 239287 239153 239103 238790
56400 238790 238803 239910 241865 243624 244593 245107 245787 246943 248571 250492 252522 254791 257723 261374 265157
56385 265157 268624 272093 275934 279659 282574 285075 288398 293061 298340 303286 307440 310471 312014 312314
56371 312314 312434 313406 315349 317518 318958 319202 318691 318387 318620 318601 317565 316032 315179 315275 315708 316319 317583
56354 317583 319415 320932 321759 322538 323707 324718 325075 325369 326575 328865 331747 334981 338775 343276 348328
56339 348328 353628 358888 364003 369130 374428 379761 384952 390232 395978 402159 408564 415419 423140 431552
56325 431552 440104 448806 458161 468116 477885 486922 495304 503105 510233 516928 523490 529389 533676 536514
56311E36514K743L407L350K383J424P71J24j06P43K085K596K256K278L098L919
56296E67585M280M588M976N095N258O316Q084R304R513R726J0902J2841J4880
56283F73348J6593J7667J8243J9421K2139K5406K7210K7391K8070L0760L4631
56272I40879L8307M1805M5748M9973N4123N8575O3763O9279P4655Q0309Q6859
56261A604275R4081J01370J08696J16318J23922J30759J36302J40296J42470J42630
56251B841119J40667J36177J28619J18098J05532R1724P6781O0736M4085K7451
56241C770989J1341l530j6374k7172l6787m5849n4063o0919o6443p0896p4457
56230C325840p7625q1237q5493q9494r2309r4065r5476r6715r7342r7169r6549
$$ plain form
56311 536514 539257 542664 546014 548397 549821 550592 550716 550610 551353 553438 556034 558290 560568 563666 567585
56296 567585 571865 576453 581429 586524 591782 598098 606182 615486 624999 634725 645627 658468 673348
56283 673348 689941 707608 725851 745272 767411 792817 820027 847418 875488 906248 940879
56272 940879 979186 1020991 1066739 1116712 1170835 1229410 1293173 1362452 1437107 1517416 1604275
56261 1604275 1698356 1799726 1908422 2024740 2148662 2279421 2415723 2556019 2698489 2841119
56251 2841119 2981786 3117963 3246582 3364680 3470212 3561936 3638717 3699453 3743538 3770989
56241 3770989 3782330 3778800 3762426 3735254 3698467 3652618 3598555 3537636 3471193 3400297 3325840
56230 3325840 3248215 3166978 3081485 2991991 2899682 2805617 2710141 2613426 2516084 2418915 2322366
56219B322366r5774r4589r2394q8993q5034q1521p8756p6000p2428o8082o3556
56208A425239n9175n5007n1261m7929m4415m0280l6089l2702l0028k7387k4815
56197I76151k2867k1260j8898j5491j2135r965r020q610q007o664m562k441j052
56184H35179r4J313L307N208O729Q171R450R992R804R631R872J0152J0102R784
56170I38600R276Q679Q418Q652Q526P140N121M016M141M359M076M015M766N884
56156A025669O874P956R332J0726J2015J3435J4976J6504J8507K1540K4897K7258
56144A209689K8822L1403L5921M1272M6271N1371N7675O5320P3555Q1519Q8234
56133A811052R2660R4416R3977R1932Q8628Q4530Q0108P5374P0350O5698O1730
$$ plain form
56219 2322366 2226592 2132003 2039609 1950616 1865582 1784061 1705305 1629305 1556877 1488795 1425239
56208 1425239 1366064 1311057 1259796 1211867 1167452 1127172 1091083 1058381 1028353 1000966 976151
56197 976151 953284 932024 913126 897635 885500 875535 866515 857905 849898 843234 838672 836231 835179
56184 835179 835085 836398 839705 844913 851642 859813 869263 879255 889059 898690 908562 918714 928816 938600
56170 938600 947876 956555 964973 973625 982151 989291 994412 998428 1002569 1006928 1011004 1015019 1019785 1025669
56156 1025669 1032543 1040499 1049831 1060557 1072572 1086007 1100983 1117487 1135994 1157534 1182431 1209689
56144 1209689 1238511 1269914 1305835 1347107 1393378 1444749 1502424 1567744 1641299 1722818 1811052
56133 1811052 1903712 1998128 2092105 2184037 2272665 2357195 2437303 2512677 2583027 2648725 2710455
56122B710455N7115N0081M0821L1204K2220J3354M612k940r182j5705k3802l3069
56110B845164m2596n2031o0855o8015p2993p6077p7162p5622p1873o7584o3735
56099B116621n9826n5447n1171m7354m3452l9159l5038l1405k7818k4044k0336
56088A681571j6584j2460q558n915m259k275L81K896N019P140Q800R235R333J0802
56074A685126J3381J5225J6112J7588J9813K1159K1380K2165K3858K4712K4322
56063A904841K4585K6186K7239K6832K6828K8452L0078L0188K9848L0419L1297
56052B216793L1756L2559L4117L5368L6075L7657M0316M2063M2163M2619M4619
56041B636105M6578M7543M9225N2472N4996N5158N4939N6462N8538N9466O0409
$$ plain form
56122 2710455 2767570 2817651 2858472 2889676 2911896 2925250 2929862 2926922 2917740 2902035 2878233 2845164
56110 2845164 2802568 2750537 2689682 2621667 2548674 2472597 2395435 2319813 2247940 2180356 2116621
56099 2116621 2056795 2001348 1950177 1902823 1859371 1820212 1785174 1753769 1725951 1701907 1681571
56088 1681571 1664987 1652527 1643969 1638054 1633795 1631520 1631901 1634797 1639816 1646956 1655756 1664991 1674324 1685126
56074 1685126 1698507 1713732 1729844 1747432 1767245 1788404 1809784 1831949 1855807 1880519 1904841
56063 1904841 1929426 1955612 1982851 2009683 2036511 2064963 2095041 2125229 2155077 2185496 2216793
56052 2216793 2248549 2281108 2315225 2350593 2386668 2424325 2464641 2506704 2548867 2591486 2636105
56041 2636105 2682683 2730226 2779451 2831923 2886919 2942077 2997016 3053478 3112016 3171482 3231891
56030C231891O3019O6214O8337P0135P2813P5420P6903P8418Q1041Q3531Q4932
56019D052654Q6805R0343R3870R5831R7561J00487J03440J05392J07956J12405
56009E046744J17192J21092J25598J31585J37095J41271J46684J54724J62649
56000F284634J68504J74818J83830J93401K01505K10346K21918K33820K43896
55991H116672K54507K67900K82035K95594L12031L33792L57742L81379M07974
55982A1009626M40198M74874N09939N50126N99434O55013P15588P88286Q79447
55973A6622531R86694J108522J252062J420402J601250J780595J959787K147428
55965B8879271K344351K551273K781901L052763L369569L740139M189825M745658
$$ plain form
56030 3231891 3294910 3361124 3429461 3499596 3572409 3647829 3724732 3803150 3884191 3967722 4052654
56019 4052654 4139459 4229802 4323672 4419503 4517064 4617551 4720991 4826383 4934339 5046744
56009 5046744 5163936 5285028 5410626 5542211 5679306 5820577 5967261 6121985 6284634
56000 6284634 6453138 6627956 6811786 7005187 7206692 7417038 7638956 7872776 8116672
55991 8116672 8371179 8639079 8921114 9216708 9528739 9862531 10220273 10601652 11009626
55982 11009626 11449824 11924698 12434637 12984763 13584197 14239210 14954798 15743084 16622531
55973 16622531 17609225 18717747 19969809 21390211 22991461 24772056 26731843 28879271
55965 28879271 31223622 33774895 36556796 39609559 42979128 46719267 50909092 55654750
55957E5654750N419014O226936P216782Q444892R950248J1778008J3985792J6539862
55949A35216284J9189221K1500421K3024431K3365387K2108108J8872663J3640857
55942B76917372P040929J85952n851783j0443997j3419525j4890393j5163327
55935B24375228j4710264j4039055j3495285j3174114j3001498j2867418j2693850
55928A30393744j2432048j2040882j1482012j0738987r841228q859856p870121
55921E7128610o918911o027964n212992m486495l850096l298186k827294k433432
55913B2073240k104875j827077j592188j396451j232199j090452r68171q65428
55905A0996399p78078p00192o30883n71989n21489m75576m34568m00482l71045
$$ plain form
55957 55654750 61073764 67300700 74517482 82962374 92912622 104690630 118676422 135216284
55949 135216284 154405505 175905926 198930357 222295744 244403852 263276515 276917372
55942 276917372 283958301 284144253 278292470 267848473 254428948 239538555 224375228
55935 224375228 209664964 195625909 182130624 168956510 155955012 143087594 130393744
55928 130393744 117961696 105920814 94438802 83699815 73858587 64998731 57128610
55921 57128610 50209699 44181735 38968743 34482248 30632152 27333966 24506672 22073240
55913 22073240 19968365 18141288 16549100 15152649 13920450 12829998 11861827 10996399
55905 10996399 10218321 9518129 8887246 8315257 7793768 7318192 6883624 6483142 6112097
55896F112097l42225l14580k91145k71002k50763k30675k13531j98998j84334
55887C814844j69636j57305j47370j37928j29114j22210j16073j08732j01299
55878B625177r6091r2089q6507p9669p4096o9849o4941n9513n5503n2853m9917
55867A844149m6980m5583m4941m2728l9079l6233l4508l2026k8277k4810k2348
55856A446636k0041j7624j5786j4561j3543j3384j4899j7277j9150k0610k2207
55845A257554k2991k1872j9938j9018j8996j8825j9047k0713k2876k3794k3706
55834A025778k3958k4277k3630k2731k2941k3430k2270j9717j7707j6711j5780
55823G92626j5066j5517j6462j6273j5150j4588j4386j2938j0321q418p866p396
$$ plain form
55896 6112097 5769872 5455292 5164147 4893145 4642382 4411707 4198176 3999178 3814844
55887 3814844 3645208 3487903 3340533 3202605 3073491 2951281 2835208 2726476 2625177
55878 2625177 2529086 2436997 2350490 2270821 2196725 2126876 2061935 2002422 1946919 1894066 1844149
55867 1844149 1797169 1751586 1706645 1663917 1624838 1588605 1554097 1522071 1493794 1468984 1446636
55856 1446636 1426595 1408971 1393185 1378624 1365081 1351697 1336798 1319521 1300371 1279761 1257554
55845 1257554 1234563 1212691 1192753 1173735 1154739 1135914 1116867 1096154 1073278 1049484 1025778
55834 1025778 1001820 977543 953913 931182 908241 884811 862541 842824 825117 808406 792626
55823 792626 777560 762043 745581 729308 714158 699570 685184 672246 661925 653507 645641 638245
55811F38245o323n345m721l895l086l122l595l231k196j933k722l364l439l798
55797E87475m726n495n982o837p894q232p907p903q274q098p409p320p975q129
55783D85294p131n762m790m168l894m291n141n783o242p074q115q569q328p981
55769C98025p619o862n956n546n556n430n320n685o079n754n232n730p100p834
55755C12322p244o275n993o434p092p541p513p092o724o467n796m744m357n052
55741B23998n628m993l791k945j925j75J027L43j026r11M48J001L35j56j98j026
55725B04378k662l459k883k375k830l329l033k468k198j915j472j289j236o28
55711A72601K80M32q6Q8J375K605L068L475M288M734M255L417K708J837Q85O66
$$ plain form
55811 638245 631922 626577 621856 617961 614875 611753 608158 604927 602731 600798 598076 594712 591273 587475
55797 587475 582749 577254 571272 564435 556541 548309 540402 532499 524225 516127 508718 501398 493423 485294
55783 485294 478163 472401 467611 463443 459549 455258 450117 444334 438092 431018 422903 414334 406006 398025
55769 398025 390406 383544 377588 372042 366486 361056 355736 350051 343972 338218 332986 327256 320156 312322
55755 312322 305078 298803 292810 286376 279284 271743 264230 257138 250414 243947 238151 233407 229050 223998
55741 223998 218370 213377 209586 206641 204716 204541 205568 205911 204885 203974 204422 205423 205758 205602 205404 204378
55725 204378 201716 198257 195374 192999 190169 186840 183807 181339 179141 177226 175754 174465 173229 172601
55711 172601 172881 173313 173227 173315 174690 177295 180363 183838 188126 192860 197115 200532 203240 205077 205962 206628
55695B06628J303J773J569J384J544J182j60j536k064k206k574k669j848o25L3
55680B01734P8J02L13M86N38M81J79m20j076j533j608j138k66L39K39n3J77O49
55662A99221O46L82O49J341J576J185P78M49k47j052j143n59j27L4L91M83p95
55645B03212l116m692m725m273m232m166l709l519l981m436m541m991o068o713
55631A40050n981m381k986k245k318l315m559m723l531k272j983k226k286k374
55617I4870k788l044k744k294k002j455n46o0l58n54O2P55M82n05j191j234j005
55600G6389p82o75q29j088j018o55n58p88p28k45kj95j70K86M61J21N6N30N50
55581G0660l59j066o36O8j81j016j277q97o08n26l00j20l60o92o15l77m09m59
$$ plain form
55695 206628 207931 209704 211273 212657 214201 215383 215223 213687 211623 209417 206843 204174 202326 201701 201734
55680 201734 201812 201914 202227 202713 203251 203732 203911 203491 202415 200882 199274 198136 197870 198209 198448 198395 198572 199221
55662 199221 199867 200249 200898 202239 203815 205000 205778 206227 205980 204928 203785 203226 203099 203133 203524 204007 203212
55645 203212 200096 195404 190679 186406 182174 178008 174299 170780 166799 162363 157822 152831 146763 140050
55631 140050 134069 129688 126702 124457 122139 118824 114265 109542 106011 103739 101756 99530 97244 94870
55617 94870 92082 89038 86294 84000 81998 80543 79997 79937 79579 79025 79087 79842 80324 79819 78628 77394 76389
55600 76389 75607 74932 74103 73015 71997 71342 70784 69996 69268 69023 69021 68826 68656 68942 69403 69524 69580 70110 70660
55581 70660 70301 69235 68599 68667 68486 67470 66193 65296 64688 64162 63862 63742 63382 62690 62075 61698 61289 60830
55563F0830j56J24k2j48K54P15N41j5l31n55j101j634j583j132p24j84O44J123
55545E6646Q08M95R96J529Q47o00j200o04M1J91N31J277J481O08l99l52O32J447
55527F4374J262J40j120j443l62J317K073J149q04k545l351l335l083l022l018
55512D8232k689k156k023k382k429j631o42l91p10p64m53m31p65o80J92J119J154
55495C2551K54q57j569j860k054k328k519k403k032j594j045k87L59M13L5m8L91
55478A5407P60O04K58J94L78O38R62J060M72m82p00J78J106J206J050J457J917
55461B6465J392O6r72j317j420j388q48M8N56L66q9l69m24k76L0K40J80O4N6q3
55441B2277l85k15Q05J838J726N55m81o02KQ85J704K014J558O90k0m71p51o49
$$ plain form
55563 60830 60674 60798 60776 60628 60882 61597 62138 62123 61792 61237 60136 58502 56919 55787 55063 54879 55523 56646
55545 56646 57454 57949 58945 60474 61321 60721 59521 58917 58958 59149 59680 60957 62438 63046 62647 62295 62927 64374
55527 64374 65636 65776 64656 63213 62851 64168 66241 67390 66586 64041 60690 57355 54272 51250 48232
55512 48232 45543 43387 41364 38982 36553 34922 34280 33889 33179 32415 31962 31531 30766 30086 30278 31397 32551
55495 32551 32805 31948 30379 28519 26465 24137 21618 19215 17183 15589 14544 14257 14616 15029 15064 15016 15407
55478 15407 16167 16771 17029 17223 17601 18239 19201 20261 20733 20251 19551 19729 20835 22041 23091 24548 26465
55461 26465 27857 27923 26951 25634 24214 22826 21978 22026 22582 22948 22859 22490 22066 21790 21820 22060 22240 22304 22360 22277
55441 22277 21892 21677 22482 24320 26046 26601 26120 25518 25520 26405 28109 30123 31681 32371 32351 31880 31129 30480
55423C0480j60Mo22j292j114n93p78j306q26O70J532Q71k26m72k5L35N53Q78J005
55404B8914O26K69O31J374J406L19j090j701j175j09N72M50n8k34Q9M36L71J7
55386C1107k04j09O9p1o68j371j643j332p50j09O91J569K039J881J518J295Q85
55369C4797N3n86l57L03M03j02l79j27N1k25n73p17r63j489j857j658j102o26
55351B4846l43j50rR5J70J22l8P7P52J472J306J35j081j461j125p41o39o78o69
55332B2041o19p01j045j437j323m15Q20J612J726J510J202P21M8o74j365j887
55316B0214j861j080k4O61J003J400J638J042k26r59l95P74J264O69l58r65p75
55299B2022k0P44J073J021Q65O38J55n10r98j083q09k05O27J204R50o8j076j385
$$ plain form
55423 30480 30320 30324 29702 28410 27296 26703 25925 24619 23793 24463 25995 26866 26640 26168 26143 26478 27031 27909 28914
55404 28914 29540 29809 30440 31814 33220 33539 32449 30748 29573 29464 30036 30486 30428 30194 30283 30719 31090 31107
55386 31107 30903 30794 30863 30792 30124 28753 27110 25778 25028 24919 25610 27179 29218 31099 32617 33912 34797
55369 34797 34850 34264 33907 34210 34613 34511 34132 34005 34056 33831 33258 32541 31578 30089 28232 26574 25472 24846
55351 24846 24503 24353 24344 24439 24609 24731 24693 24770 25522 26994 28300 28435 27354 25893 24768 24027 23388 22710 22041
55332 22041 21422 20721 19676 18239 16916 16501 17321 18933 20659 22169 23371 24092 24140 23466 22101 20214
55316 20214 18353 17273 17249 17910 18913 20313 21951 22993 22767 21808 21413 22187 23451 24120 23762 22797 22022
55299 22022 22002 22746 23819 24840 25705 26343 26498 25988 24990 23907 23098 22893 23520 24724 25674 25606 24530 23145
55281B3145r38j29N34O44K39j22qK58O9m89q10p43o79n96N7J299K181J933R23
55262B6768L7l88n63n55k58J66L02M3k29j12K63L31k35r97j123l63O32J115R70
55243B5804M97j45q01j048o67j28J4p4P6K87J9n62o83k15R9j42l02L14J409K066
55223B5818J760P33l18p10k17P11J339J313P67Rn99o39q5M27L08j11l9O21J217
55204C2305J409J404J218M93o29j302j029l53j40n29r37p83k1Q37J177R15N37
55187C4572L14r6q27j195o48J65K28l02n12m01p67j557j800j345j213j728j837
55170B1051q81K71P26Q84J327J482O64m66p47k82j11n00p15k91M88J283J962K211
55152B8356J677O05l46r05j252j351q62J46R99J123O15j9m06m57k12K68Q59J330
$$ plain form
55281 23145 22207 22078 22612 23256 23495 23373 23365 23623 23692 23203 22393 21650 20971 20375 20432 21731 23912 25845 26768
55262 26768 26805 26417 25854 25299 25041 25207 25509 25552 25323 25211 25474 25805 25570 24573 23450 23087 23719 24834 25804
55243 25804 26301 26156 25355 24307 23640 23512 23526 23452 23528 23815 23834 23272 22589 22374 22473 22331 22029 22343 23752 25818
55223 25818 27578 28311 27993 27283 27066 27777 29116 30429 31196 31205 30606 29967 29882 30309 30617 30506 30467 31088 32305
55204 32305 33714 35118 36336 36829 36200 34898 33869 33516 33376 32847 31910 31127 31106 31943 33120 34035 34572
55187 34572 34886 34790 33963 32768 32120 32285 32513 32211 31699 31298 30531 28974 27174 25829 24616 22888 21051
55170 21051 20170 20441 21167 22051 23378 24860 25524 25058 24311 24029 23918 23418 22703 22412 22900 24183 26145 28356
55152 28356 30033 30638 30292 29387 28135 26784 25922 26068 27067 28190 28805 28786 28380 27923 27711 27979 28838 30168
55134C0168J458J294J134J110R85O35M55P93J240J129O19N08R97J397J243Q50
55118D6015N41J27m68p91n48p3K63N35P76P10L43J95M69N89J05n51p43n02k51
55099D6741p9J33L28M65O73Q57P41N63J021K067K596J921Q16L40L40op65j303
55081E7449j339j068n75O3M06J92n0K45O87M88k18n02j1O34P82M34k3j76K97J277
55061E8992J995J696M94p70j387j175l43N82R58N50k46r99j665k138k035j354
55045E3155p74o94n59J50Q78P83M5m87n23l05K08J046J485P56o43j410j148n77
55027E1386j44M26J075J113K92o65j052r16o00j82K30L75K10M5R4L24P50J344
55009E4105J730J539J012O38L49k00p38o53q9K12J65L98Q89P63k35j156j248r62
$$ plain form
55134 30168 31626 32920 34054 35164 36149 36784 37239 38032 39272 40401 41020 41528 42525 43922 45165 46015
55118 46015 46556 46683 46215 45424 44876 44803 45066 45601 46377 47087 47430 47625 48094 48683 48788 48237 47494 46992 46741
55099 46741 46662 46795 47123 47588 48261 49118 49859 50422 51443 53510 56106 58027 58843 59183 59523 59517 58752 57449
55081 57449 56110 55042 54467 54530 54936 55128 55078 55323 56010 56498 56280 55778 55767 56401 57183 57617 57594 57418 57715 58992
55061 58992 60987 62683 63177 62407 61020 59845 59502 60084 61042 61592 61346 60347 58682 56544 54509 53155
55045 53155 52381 51687 51128 51278 52156 52939 52984 52497 51974 51669 51877 52923 54408 55164 54521 53111 51963 51386
55027 51386 51242 51668 52743 53856 54148 53483 52431 51515 50915 50733 50963 51338 51548 51593 51687 52011 52761 54105
55009 54105 55835 57374 58386 59024 59373 59173 58435 57782 57693 57905 58070 58468 59357 60120 59885 58729 57481 56519
54991E6519q96p18L7Q94J059O52M24N97P84Q04Q65R69Q17K90l83r18j108q15j51
54972E9722M47P18R50J560K427L063L306L388L373K984K184J522J598K323L002
54957I2567L190L238L865N247O757P648P782P571P417P337P034O163M602K601
54943A73019N96j166k609l556l857l912m467n558o250n912n237n244n736n612
54929A14499m583l570l347l591l611l303k967k733k499k191j774j237o45J1R55
54914G9414K332L798M799N249N549O028O639P177P334O793N697M765M376L833
54900A53783K301K19j241j921k758m064m958m978n002n824o844p060o555o049
54886I9049n590m775l836l424l447l093k091j062n30l37k66n39j293k045k212
$$ plain form
54991 56519 55623 54905 54942 55836 56895 57547 57971 58568 59352 60156 61021 61990 62807 63097 62714 61796 60688 59873 59722
54972 59722 60169 60887 61837 63397 65824 68887 72193 75581 78954 81938 84122 85644 87242 89565 92567
54957 92567 95757 98995 102860 108107 114864 122512 130294 137865 145282 152619 159653 165816 170418 173019
54943 173019 173615 172449 169840 166284 162427 158515 154048 148490 142240 136328 131091 125847 120111 114499
54929 114499 109916 106346 102999 99408 95797 92494 89527 86794 84295 82104 80330 79093 78448 78459 79414
54914 79414 81746 85544 90343 95592 101141 107169 113808 120985 128319 135112 140809 145574 149950 153783
54900 153783 156084 156303 155062 153141 150383 146319 141361 136383 131381 125557 118713 111653 105098 99049
54886 99049 93459 88684 84848 81424 77977 74884 72793 71731 71201 70864 70598 70059 68766 66721 64509
54871F4509j881j628j615j352m55O08R09J52r28j396j074m94j03N1Rk46o38r84
54853E3444j244j458j461j049l39L34Q79J359J480Q16l52j076q85l71l00o72j009
54836D8096j081q77k95O64J558J914J740J352Q59K39l24n25l29J07P02J354J763
54819E6917J745J615J814K241K309J758J026P01Q93J305J740K271K990L704M040
54804H7069L805L279L065L615M829O122O899P156P511Q420R333R087P309N009
54790A72508L446K707J984Q31m61j558k419k933k979k885l202l877m285m153l786
54775A48938l287k364j249r12j739k753k778j910j146r09o93K6J222K579L851
54760A36876M914N781O554P222P681Q103Q887R995J0774J0830J0714J1167J1968
$$ plain form
54871 64509 62628 61000 59385 58033 57578 58186 59095 59247 58319 56923 55849 55355 55252 55303 55312 55066 54428 53444
54853 53444 52200 50742 49281 48232 47893 48227 49106 50465 51945 52761 52409 51333 50448 50077 49777 49105 48096
54836 48096 47015 46138 45843 46507 48065 49979 51719 53071 53930 54169 53845 53320 52991 53098 53800 55154 56917
54819 56917 58662 60277 62091 64332 66641 68399 69425 70126 71019 72324 74064 76335 79325 83029 87069
54804 87069 90874 94153 97218 100833 105662 111784 118683 125839 133350 141770 151103 160190 167499 172508
54790 172508 175954 178661 180645 181476 181015 179457 177038 174105 171126 168241 165039 161162 156877 152724 148938
54775 148938 145651 143287 142038 141126 139387 136634 133856 131946 130800 129891 129198 129224 130446 133025 136876
54760 136876 141790 147571 154125 161347 169028 177131 186018 196013 206787 217617 228331 239498 251466
54747B51466J2026J0571P789M438J238j410l450m983o006o549p048q075r410j0000
54733B30597r353q430q496r434r961r372q200p212o512n839n133m483l927l510
54719A30735l253k970k439j809j531j787k240k456k292j836j223o05j09J89J63
54704A06537l24j065j405q49K67J099J241R75O47K58j86l73j4P55J439J595J113
54687A11710L28j94j52J72K89J69K09O24J145J434J456J424J536J833K108K030
54671A26121J642J561K305L476M143M151M309N068N599M879L230K042K072K712
54657A73310L039K924K829K983L276L603L873L827L379L079L736N399P183Q331
54643B30771R015R771J0587J1110J1508J2294J3236J3203J1480Q691N901L293
$$ plain form
54747 251466 263492 274063 281852 286290 287528 286118 282668 277685 271679 265130 258082 250007 240597 230597
54733 230597 221244 212814 204318 194884 184923 175551 167351 160139 153627 147788 142655 138172 134245 130735
54719 130735 127482 124512 122073 120264 118733 116946 114706 112250 109958 108122 106899 106294 106185 106374 106537
54704 106537 106213 105148 103743 102894 103161 104260 105501 106476 107123 107381 107195 106822 106808 107563 109002 110597 111710
54687 111710 112038 111844 111692 111864 112153 112322 112531 113155 114300 115734 117190 118614 120150 121983 124091 126121
54671 126121 127763 129324 131629 135105 139248 143399 147708 152776 158375 163254 166484 168526 170598 173310
54657 173310 176349 179273 182102 185085 188361 191964 195837 199664 203043 206122 209858 215257 222440 230771
54643 230771 239786 249557 260144 271254 282762 295056 308292 321495 332975 341666 347567 350860
54631C50860K81l208o390q592r989j1049j1670j1397j0413r686r939j0741j1069
54618B36998j0632j0112r936r433p751n303l531l194l586l612l068k456k086j884
54604A60414j779j788j824j853k135k910l923m591m615m191l643l194k981l070
54590A17917l316l417l114k360j424r19j390k609l536l357k445j878k116k583
54576H3453k548j996j426j144r91p24l78k10k72k07K82Q45P62Pm59J25J172J433
54558G7724O00m11q01p22n99l28L26J071J440J578J998K688L025K672K013J549
54542I3823J348J350J742K608L501L938M154M762N681O107N737N301N486N892
54528A51430N713N010M543M479M099K846J022p29k070k944l442l904m671n516
$$ plain form
54631 350860 351141 347933 341543 332951 322962 311913 300243 288846 278433 268747 258808 248067 236998
54618 236998 226366 216254 206318 196885 189134 183831 180300 177106 173520 169908 166840 164384 162298 160414
54604 160414 158635 156847 155023 153170 151035 148125 144202 139611 134996 130805 127162 123968 120987 117917
54590 117917 114601 111184 108070 105710 104286 103367 101977 99368 95832 92475 90030 88152 86036 83453
54576 83453 80905 78909 77483 76339 75348 74624 74246 74036 73764 73557 73839 74684 75446 75453 74994 75119 76291 77724
54558 77724 78324 77913 77112 76390 75791 75463 75789 76860 78300 79878 81876 84564 87589 90261 92274 93823
54542 93823 95171 96521 98263 100871 104372 108310 112464 117226 122907 129014 134751 140052 145538 151430
54528 151430 157143 162153 166696 171175 175274 178120 179142 178413 176343 173399 169957 166053 161382 155866
54514A55866n742n105m205l745l793m065m499n147n815o116n754m664l206k203
54500I1807k276k955l080k246j258q42o83k52K50M21M29N02K17p36j619j476o28
54483G5575j72k89j06O98J371J378J145J126J122R29Q66J025P83k29j280j350
54467H2592m80L54M91J35k32l87l33j49Mnj43l20n59r23j291j438j298j014p23
54448G4281m09k5L26M39L07K27M37O93N08j17o07o03m92p35j131j151p89m44j89
54429G0526J68M31J55m85o71j7R23J471J598J578J415J044O57M95N55Q08J372
54412H2023K153K685K663K356K149J995J681J370J421J878K484L022L319L132
54398A14331K504K083K515L548M232M050L446L035K733J964N73q27j475j281r28
$$ plain form
54514 155866 150124 145019 140814 137069 133276 129211 124712 119565 113750 107634 101880 97216 94010 91807
54500 91807 89531 86576 83496 81250 79992 79150 78467 78215 78465 78886 79315 79817 80034 79298 77679 76203 75575
54483 75575 75403 75114 75008 75706 77077 78455 79600 80726 81848 82777 83643 84668 85451 85222 83942 82592
54467 82592 82112 82466 82957 83092 82860 82473 82140 81991 81995 81990 81847 81527 80968 80045 78754 77316 76018 75004 74281
54448 74281 73872 73847 74173 74612 74919 75146 75583 76276 76784 76667 76060 75457 74965 74230 73099 71948 71159 70715 70526
54429 70526 70694 71125 71280 70795 70124 70107 71030 72501 74099 75677 77092 78136 78793 79288 79843 80651 82023
54412 82023 84176 86861 89524 91880 94029 96024 97705 99075 100496 102374 104858 107880 111199 114331
54398 114331 116835 118918 121433 124981 129213 133263 136709 139744 142477 144441 145014 144187 142712 141431 140503
54383A40503j122j796k254k107j797j986k640l077k862k235j616j131q06q91j563
54368A12620k496l091l168l044k891k376j224J24Q40O68K40K77P96J225J150P07
54352A00357L11K60O34J313J988K302K185K024K275K857L168K851K354K358K795
54337A30032K895K321J692J614J676R96m28j606j736j002j91n0r77k707m189m395
54321A23945l536k835k983l424l494l424l704m111m101l716l310k806j965j144
54307G9392j040j737k648l245l318k712j512l64R1P7K57O12N60P9j31J20J14n73
54289F4022j258j176o84p23j419j939j662q84k76q1p1m3n2j91l23k18J61O50J109
54270E4942J430J371P62o1l83J1N57O45L92K85M89Q16J039R57M88L5K42R64J115
$$ plain form
54383 140503 139381 137585 135331 133224 131427 129441 126801 123724 120862 118627 117011 115880 115074 114183 112620
54368 112620 110124 107033 103865 100821 97930 95554 94330 94454 95294 95962 96202 96479 97275 98500 99650 100357
54352 100357 100668 100928 101562 102875 104863 107165 109350 111374 113649 116506 119674 122525 124879 127237 130032
54337 130032 132927 135248 136940 138554 140230 141226 140798 139192 137456 136454 136263 136213 135236 132529 128340 123945
54321 123945 120409 117574 114591 111167 107673 104249 100545 96434 92333 88617 85307 82501 80536 79392
54307 79392 78352 76615 73967 70722 67404 64692 63180 62816 62907 62984 63241 63853 64413 64492 64361 64481 64595 64022
54289 64022 62764 61588 60904 60181 58762 56823 55161 54277 54001 53920 53849 53806 53754 53563 53240 53022 53183 53833 54942
54270 54942 56372 57743 58505 58444 58061 58072 58629 59274 59666 59951 60440 61256 62295 63252 63740 63775 64017 64981 66096
54251F6096J54r10q30P3M29k05r16q80k02O19J160R81K3r41j082o87o31q62n57
54232F0832K75O48K75P9N36Q30K11q00j300j117n15L77J158J146L66k10m5K21
54214F2967pl06k29k27o41p24K02J375J601R91N32M44K35k8J84O46N03l49j025
54195F6144r74n93l94l20q1M59J281K080K237J514O03L27M83K34n28j049r44o98
54177F9781p62r16p30j76M43P56M92k12p71p66m42j79K19R95J633J396M92k07
54159G1046n28j036j743j875j182m47l04l93k06J24L82P88J355J442O71k56m52
54142F7386j44k14p83j075o51J0L14K65J30p8m17o56n03j20j6l56p13o91m89n62
54122F0637q64r08n67k97l84n03l44k15m96q81p61j71K85L58L78N87P65O85M29
$$ plain form
54251 66096 66250 65340 64510 64583 65012 64807 63891 63011 62809 63428 64588 65569 65592 64651 63569 62882 62251 61389 60832
54232 60832 61107 61755 62030 62109 62645 63475 63686 62886 61586 60469 59954 60331 61489 62635 63001 62791 62746 62967
54214 62967 62960 62654 62425 62198 61557 60833 61035 62410 64011 65002 65534 65978 66213 66185 66369 67015 67518 67169 66144
54195 66144 65170 64577 64183 63863 63782 64241 65522 67602 69839 71353 71956 72283 72766 73000 72472 71423 70479 69781
54177 69781 69019 68103 67373 67197 67640 68396 68888 68676 67905 67139 66697 66518 66737 67732 69365 70761 71253 71046
54159 71046 70518 69482 67739 65864 64682 64235 63931 63538 63332 63456 63838 64626 65981 67423 68094 67838 67386
54142 67386 67242 67028 66245 65170 64519 64529 64843 65108 65238 65160 64743 64087 63584 63464 63448 63092 62379 61688 61199 60637
54122 60637 59773 58865 58298 58001 57617 57114 56770 56555 56059 55178 54417 54246 54531 54889 55267 55854 56619 57304 57733
54103E7733J46j41l58l84k51q4J97P03J128R56J87n22o33k21L04O10M97o4p55
54084E9048j109j017o84k01M81J086J124O30L15O68J338J618J240M26m35q92n36
54067F3100N46J600J809J073J8o02m61K22R28J266J271J144Q95M55J08K87R27
54050G4586J417J408J254J448J963K451K719K674K119J031k7k76M68J580K319
54035I7134K565K757L200L672L712L275K821K754K997L244L401L519L583L635
54021A42269L916M508M979M791L993L060K255J537J028R91J251J283Q96M15O0
54006A77232l85j095j887k500k817k719k214j716j718k035k017j646j660k353
53992A50470k928k594j701j172j295j659j956k155k095j605r39o03p09q69p72
$$ plain form
54103 57733 57879 57738 57380 56996 56745 56661 56858 57561 58689 59645 59832 59310 58677 58456 58760 59370 59867 59803 59048
54084 59048 57939 56922 56238 56037 56518 57604 58728 59358 59673 60341 61679 63297 64537 64963 64528 63636 63100
54067 63100 63646 65246 67055 68128 68146 67544 67083 67305 68233 69499 70770 71914 72809 73264 73372 73659 74586
54050 74586 76003 77411 78665 80113 82076 84527 87246 89920 92039 93070 93043 92767 93235 94815 97134
54035 97134 99699 102456 105656 109328 113040 116315 119136 121890 124887 128131 131532 135051 138634 142269
54021 142269 146185 150693 155672 160463 164456 167516 169771 171308 172336 173327 174578 175861 176757 177172 177232
54006 177232 176847 175752 173865 171365 168548 165829 163615 161899 160181 158146 156129 154483 152823 150470
53992 150470 147542 144948 143247 142075 140780 139121 137165 135010 132915 131310 130371 129768 129059 128190 127418
53977A27418n41m99p57j085j142r42r30j303j431n71Q15J308M06o50n59L25P24
53960A20586K81k92n12m66p6Q74J911K108J416Q98J277K040K379K279K146J981
53944A38830J568J116J083J514K111K737L453M089M276L922L364K922K549J941
53930A75475R79J5k83L86J369J540N65n53o37K23Q89P78N90J280K730L942M277
53913A93565L959L524L182K927K829K933L098L219L499M186N008N242M451K965
53899B44587J588Q85Q12Q38L75o95j796k137j580q62p84j363k051k565l123l883
53883B28246m619n025n083m970m827m798n021n379n474n091m553m370m562m604
53869A59870m051l038k125j771k009k480k758k695k450k172j824j454j407j875
$$ plain form
53977 127418 126877 126378 125621 124536 123394 122452 121522 120219 118788 118217 119032 120340 120746 120096 119537 119862 120586
53960 120586 120867 120575 120063 119597 119521 120395 122306 124414 125830 126728 128005 130045 132424 134703 136849 138830
53944 138830 140398 141514 142597 144111 146222 148959 152412 156501 160777 164699 168063 170985 173534 175475
53930 175475 176454 176469 176186 176572 177941 179481 180046 179493 178856 179079 179968 180746 181336 182616 185346 189288 193565
53913 193565 197524 201048 204230 207157 209986 212919 216017 219236 222735 226921 231929 237171 241622 244587
53899 244587 246175 247060 247872 248710 249085 248390 246594 244457 242877 242015 241231 239868 237817 235252 232129 228246
53883 228246 223627 218602 213519 208549 203722 198924 193903 188524 183050 177959 173406 169036 164474 159870
53869 159870 155819 152781 150656 148885 146876 144396 141638 138943 136493 134321 132497 131043 129636 127761
53855A27761k438k489k209k446l412m135l706k602k017k142k002j050n1J5o94
53840I6383j196r42j99N86J215J570J433P34k60j088j377j064m29J25M49O68Q35
53823I7443P28K24k98l07J79N04J74m62n23L13J228J097p5r53m00J119K174K123
53805A04288J520J005O68O91J557L103M239M293L961M148M490M038K975K471K907
53790A46354L377L138K584K457K745K892K579J932J263Q39P14O29L14j54n21p50
53774A70392q86p26j18M76L15o75j796k408k417j966j300r31j309k113k531k305
53758A49702k000k052k229k212k067j839j402r23r22j443j778j421p65m19l76
53743A27854l38m12q68j510j827j677j371j239j307j303q05L04J462J875J434
$$ plain form
53855 127761 125323 122834 120625 118179 114767 110632 106926 104324 102307 100165 98163 97113 97062 97077 96383
53840 96383 95187 94245 94046 94632 95847 97417 98850 99584 99324 98236 96859 95795 95366 95491 95940 96608 97443
53823 97443 98171 98395 98097 97790 97969 98473 98647 98185 97662 97975 99203 100300 100225 99272 98872 99991 102165 104288
53805 104288 105808 106813 107481 108172 109729 112832 117071 121364 125325 129473 133963 138001 140976 143447 146354
53790 146354 149731 152869 155453 157910 160655 163547 166126 168058 169321 170160 170874 171503 171817 171663 171142 170392
53774 170392 169506 168780 168662 169138 169453 168778 166982 164574 162157 160191 158891 157960 156651 154538 152007 149702
53758 149702 147702 145650 143421 141209 139142 137303 135901 134978 134056 132613 130835 129414 128649 128230 127854
53743 127854 127516 127104 126236 124726 122899 121222 119851 118612 117305 116002 115197 115501 116963 118838 120272
53728A20272P89M34K47O1j1l0l39p59n04O15J560J282P5r72j335j142m18Q30K039
53709A22694K454K037J361Q03M35N10J264K240K579K061J307Q37N87L92L95O64
53693A42620R34R66R77J408K392L527M125L788K870K171K040K008J527P43K22
53678A72318J66L59O81J144J583J742J705J765J959K006J762J332Q18K56k35n12
53662A88849o23p23q19q32p90p88q28q58q46p33n26m55o95q83m96J48N5r69j771
53643A75417j455p13o79j147r92l0Q13J071J289J859K323K188J629J069O82N60
53627A83884P67J037R86P45Q00J135J187Q56P72J272J831J940J885K163K676L034
53611B06970L219L412L505L318L020K902K880K732K600K843L382L700L521L203
$$ plain form
53728 120272 121061 121495 121742 121803 121792 121762 121423 120664 120160 120775 122335 123617 123692 122720 121385 120243 119825 120655 122694
53709 122694 125148 127185 128546 129349 129784 130294 131558 133798 136377 138438 139745 140582 141169 141561 141956 142620
53693 142620 143554 144520 145497 146905 149297 152824 156949 160737 163607 165778 167818 169826 171353 172096 172318
53678 172318 172484 172843 173524 174668 176251 177993 179698 181463 183422 185428 187190 188522 189340 189596 189361 188849
53662 188849 188226 187503 186684 185852 185062 184274 183446 182588 181742 181009 180483 180028 179333 178450 177954 178102 178157 177188 175417
53643 175417 173962 173249 172570 171423 170431 170401 171214 172285 173574 175433 177756 179944 181573 182642 183324 183884
53627 183884 184651 185688 186674 187419 188219 189354 190541 191397 192169 193441 195272 197212 199097 201260 203936 206970
53611 206970 210189 213601 217106 220424 223444 226346 229226 231958 234558 237401 240783 244483 248004 251207
53597B51207L231L584L835L780L640L580L329K629J883J838K550L228L330L240
53583B94884L503L870L730L055K295J609R24N04P06J264J518J335J165J221J321
53568C22904J430J621J485M99r06j523r06O5M79M72N95Q42R17R31J170J553J773
53551C33401J680J249N24p9O1R01J535J343Q79J068J923K701L067L326L621L647
53535C60847L357L335M046N022N268M479L417K947L016L017K969L657N305O881
53521D17563P353P096P272Q072Q568Q284P873Q046Q654R251R814J0461J1029J1436
53507E40772J1990J2944J4060J4968J5587J5972J6139J6326J6887J7731J8317
53496G11693J8454J8555J8874J9096J9042J9148J9717K0345K0576K0591K0692
$$ plain form
53597 251207 254438 258022 261857 265637 269277 272857 276186 278815 280698 282536 285086 288314 291644 294884
53583 294884 298387 302257 305987 309042 311337 312946 313870 314374 315080 316344 317862 319197 320362 321583 322904
53568 322904 324334 325955 327440 327939 327033 325510 324604 324669 325148 325620 326215 327057 327974 328905 330075 331628 333401
53551 333401 335081 336330 336854 336775 336836 337737 339272 340615 341494 342562 344485 347186 350253 353579 357200 360847
53535 360847 364204 367539 371585 376607 381875 386354 389771 392718 395734 398751 401720 405377 410682 417563
53521 417563 424916 432012 439284 447356 455924 464208 472081 480127 488781 498032 507846 518307 529336 540772
53507 540772 552762 565706 579766 594734 610321 626293 642432 658758 675645 693376 711693
53496 711693 730147 748702 767576 786672 805714 824862 844579 864924 885500 906091 926783
53485I26783K0626K0111J9571J9600J9991J9979J9280J8326J7587J7194J7103
53474A136151J7151J7068J6739J6344J6009J5571J4952J4332J3715J2748J1389
53463A302169J0162R250P983N953M036L341L449K763O00k053l934m828n269n656
53449A327966o117o832q029r766j1744j3322j3927j3696j3475j3865j4556j5024
53437A187613j5494j6513j7804j8343j7630j6291j5238j4739j4486j4090j3402
53426A013583j2586j1954j1483j0597q864o756n282m824m751m242l035j432J45
53413I27922J456K602L870N197O070O279O405P136Q327R390J0338J1709J3518
53400A020219J5107J6070J6698J7397J8380J9921K2148K4349K5385K5155K5011
$$ plain form
53485 926783 947409 967520 987091 1006691 1026682 1046661 1065941 1084267 1101854 1119048 1136151
53474 1136151 1153302 1170370 1187109 1203453 1219462 1235033 1249985 1264317 1278032 1290780 1302169
53463 1302169 1312331 1321581 1329564 1335517 1339553 1342894 1346343 1349106 1349706 1347653 1343719 1338891 1333622 1327966
53449 1327966 1321849 1315017 1306988 1297222 1285478 1272156 1258229 1244533 1231058 1217193 1202637 1187613
53437 1187613 1172119 1155606 1137802 1119459 1101829 1085538 1070300 1055561 1041075 1026985 1013583
53426 1013583 1000997 989043 977560 966963 958099 951343 946061 941237 936486 932244 929209 927777 927922
53413 927922 929378 931980 935850 941047 947117 953396 959801 966937 975264 984654 994992 1006701 1020219
53400 1020219 1035326 1051396 1068094 1085491 1103871 1123792 1145940 1170289 1195674 1220829 1245840
53389A245840K6244K8638L0972L2437L3141L3598L4294L5454L6864L8008L8568
53378A614058L8661L8478L8110L7798L7855L8030L7501L5945L4157L3024L2234
53367B015851L0684K8012K5036K2502K0109J7147J3750J0899R164P801N489J792
53355B208236k453o178r211j2034j4871j7493j9788k2009k4402k6958k9517l1808
53343A991514l3415l4109l4251l4427l4722l4815l4741l4921l5290l5117l4021
53332A611685l2595l1578l0910l0100k9065k8039k6937k5454k3672k2011k0620
53321A310704j9304j8001j6915j6081j5215j4107j2899j1911j1287j0908j0501
53310A153575r848r034q441q330q481q362p707o785o132n977n952n371l894j986
$$ plain form
53389 1245840 1272084 1300722 1331694 1364131 1397272 1430870 1465164 1500618 1537482 1575490 1614058
53378 1614058 1652719 1691197 1729307 1767105 1804960 1842990 1880491 1916436 1950593 1983617 2015851
53367 2015851 2046535 2074547 2099583 2122085 2142194 2159341 2173091 2183990 2193154 2200955 2206444 2208236
53355 2208236 2205783 2199605 2190394 2178360 2163489 2145996 2126208 2104199 2079797 2052839 2023322 1991514
53343 1991514 1958099 1923990 1889739 1855312 1820590 1785775 1751034 1716113 1680823 1645706 1611685
53332 1611685 1579090 1547512 1516602 1486502 1457437 1429398 1402461 1377007 1353335 1331324 1310704
53321 1310704 1291400 1273399 1256484 1240403 1225188 1211081 1198182 1186271 1174984 1164076 1153575
53310 1153575 1143727 1134693 1126252 1117922 1109441 1101079 1093372 1086587 1080455 1074478 1068526 1063155 1059261 1057275
53296A057275n03J89N08J034J820K504K873L158L839N261P273R208J0413J0960
53282A115812J1586J2769J4147J5010J5160J5002J5007J5382J6010J6432J6046
53271A278363J4699J3041J1929J1534J1269J0576R428Q059O615N177L852K652
53259A387194J392j31j955l932n849p536q960j0217j1421j2613j3816j5087j6357
53246A280712j7398j8045j8371j8477j8320j7962j7820j8228j8825j8816j7941
53235A080509j6827j6185j6039j5967j5776j5569j5336j4880j4148j3304j2439
53224I14039j1467j0416r562r143r057q968q659q171p663p223o813o328n805n522
53210G99242n799o599p394p647p286o685o230o131o529p428q485r162r314r359
$$ plain form
53296 1057275 1056772 1056961 1057469 1058503 1060323 1062827 1065700 1068858 1072697 1077958 1085231 1094439 1104852 1115812
53282 1115812 1127398 1140167 1154314 1169324 1184484 1199486 1214493 1229875 1245885 1262317 1278363
53271 1278363 1293062 1306103 1318032 1329566 1340835 1351411 1360839 1368898 1375513 1380690 1384542 1387194
53259 1387194 1388586 1388455 1386500 1382568 1376719 1369183 1360223 1350006 1338585 1325972 1312156 1297069 1280712
53246 1280712 1263314 1245269 1226898 1208421 1190101 1172139 1154319 1136091 1117266 1098450 1080509
53235 1080509 1063682 1047497 1031458 1015491 999715 984146 968810 953930 939782 926478 914039
53224 914039 902572 892156 882594 873451 864394 855426 846767 838596 830933 823710 816897 810569 804764 799242
53210 799242 793443 786844 779450 771803 764517 757832 751602 745471 738942 731514 723029 713867 704553 695194
53196F95194r645r885r534q672q086q432r527j0589j1003j0739j0264j0155j0737
53183E67926j1821j2760j2929j2253j1316j0812j0870j0967j0594r903r486r567
53171D34648r756r635r207q588p692o628o003o279p034p421p271p117p095o695
53157C28227n812n300n846o813o951n974m822m373m509m565m214l613l008k432
53143B59995j758r72l80m49j288k312k765k472j929j638j596j522j249p95k47
53128B38623K50N44P17J108J893K701K874K205J281Q89J179J561J484J091Q76
53113B59276Q86O43p9q36j157j233j565k154k622k945l521m327m748m520m272
53098B26826m664n328n299m289k989k167k005k252k572k628k308j942j964k310
$$ plain form
53196 695194 685549 675664 666130 657458 649372 640940 631413 620824 609821 599082 588818 578663 567926
53183 567926 556105 543345 530416 518163 506847 496035 485165 474198 463604 453701 444215 434648
53171 434648 424892 415257 406050 397462 389770 383142 377139 370860 363826 356405 349134 342017 334922 328227
53157 328227 322415 317115 311269 304456 297505 291531 286709 282336 277827 273262 269048 265435 262427 259995
53143 259995 258237 257265 256885 256436 255148 252836 250071 247599 245670 244032 242436 240914 239665 238870 238623
53128 238623 238873 239417 240134 241242 243135 245836 248710 250915 252196 253085 254264 255825 257309 258400 259276
53113 259276 260162 260805 260726 259890 258733 257500 255935 253781 251159 248214 244693 240366 235618 231098 226826
53098 226826 222162 216834 211535 207246 204257 202090 200085 197833 195261 192633 190325 188383 186419 184109
53084A84109k567k687l036l629l939l687l199k709j980j099q25j479k074j563
53070A49636m87k86j168j855j575j073j179j505j222m10J96L32L03K88J28k77
53054A39846q17j266j290o77K12N96J85m62q69j267j880k202j774j118r80j065
53038A25172n14N47R81K92p01j033o86k25q0m09j079j570j443j007r43j177r58
53021A15167j44M32K72k4K14O99Q46P07N70K01o48j466j506q60j86L06Q66J428
53003A16874J594J393J253J240J013N28J80J03J9k06l42l14k87k21P0L46J21l05
52985A23059R7J587K956L035K306K155K864L326K785J835J501J955K651L209L677
52970A58998M072M164L729K805J707Q74O03P94J055J117J020Q49M86j64r09j475
$$ plain form
53084 184109 181542 178855 175819 172190 168251 164564 161365 158656 156676 155577 154752 153273 151199 149636
53070 149636 149149 148863 147695 145840 144265 143192 142013 140508 139286 138876 139072 139404 139707 139995 140123 139846
53054 139846 139029 137763 136473 135796 136008 136604 136789 136327 135458 134191 132311 130109 128335 127217 126237 125172
53038 125172 124658 125205 126186 126478 125777 124744 124058 123833 123753 123344 122265 120695 119252 118245 117302 116125 115167
53021 115167 115023 115455 115727 115703 115917 116616 117462 118169 118739 118940 118292 116826 115320 114460 114274 114580 115446 116874
53003 116874 118468 119861 121114 122354 123367 123895 124075 124178 124197 123991 123649 123335 123048 122827 122897 123243 123364 123059
52985 123059 123156 124743 127699 130734 133040 135195 138059 141385 144170 146005 147506 149461 152112 155321 158998
52970 158998 163070 167234 170963 173768 175475 176349 176952 177746 178801 179918 180938 181787 182273 182109 181200 179725
52954A79725j878k269k571k586k349k050j625r04k12k39j083j881j819j188r37
52939A56134j436k164k535k458k085j511r13n52m79m41k34O8L52O42Q91Q72N08
52922A44659J89L89J106J761J756J034J00m19l10R8L42L12K63L75M67K49k18m21
52904A51732J16J176J871J556O92L61R01J482J286N69P4o2j48n8N26J125P63n57
52886A63405j549j245j45O84J037J490K327L208L656L433K645J740J242J157J051
52871A84136Q50J033J660J903J223M15N91J515J990J703J565K067K429J822O66
52856B05568L6L07J030J776K494L182L733M112M320M270L898L383K988K682K179
52841B45958J393O35K64K02j3o86j511j857j578j291j656k518l101l003k639k576
$$ plain form
52954 179725 177847 175578 173007 170421 168072 166022 164397 163493 163281 163042 161959 160078 158259 157071 156134
52939 156134 154698 152534 149999 147541 145456 143945 143032 142480 142001 141560 141326 141394 141746 142388 143279 144151 144659
52922 144659 144848 145237 146343 148104 149860 150894 150994 150575 150265 150363 150705 151017 151280 151655 152122 152371 152153 151732
52904 151732 151848 153024 154895 156451 157143 157504 158405 159887 161173 161742 161816 161754 161606 161548 162074 163199 163962 163405
52886 163405 161856 160611 160466 161150 162187 163677 166004 169212 172868 176301 178946 180686 181928 183085 184136
52871 184136 184986 186019 187679 189582 190805 191220 191811 193326 195316 197019 198584 200651 203080 204902 205568
52856 205568 205604 205911 206941 208717 211211 214393 218126 222238 226558 230828 234726 238109 241097 243779 245958
52841 245958 247351 247986 248250 248452 248439 247753 246242 244385 242807 241516 239860 237342 234241 231238 228599 226023
52825B26023k845l100l150k994k626k131j853k061k480k545k147j834k122k865
52811A91270l425l275k364j112j94j34q67j767k242k241k064j891j707j505j301
52796A65181j009o17l84n78r88j061o02m9M6l91j011j369j142l16O52J126Q88
52779A58376K87k97q42j351j594j421j049p57n29l24k79m07l92j42j10o10j160
52762A47399j149q08q56j338j609j430j275j468j716j710j573j454j220q25n19
52747A28449n21p26r99j365j845k350k765k854k289j184l32k72l96J83J095J083
52731A12912l5r74q21j58J50J67K36J29l62p62p20p20j200j608j276n61j94n6
52713A04147L64P74N60Q7L49J417K333K588K573K572K317J833J734K291K914K983
$$ plain form
52825 226023 223178 220078 216928 213934 211308 209177 207324 205263 202783 200238 198091 196257 194135 191270
52811 191270 187845 184570 182206 181094 180900 180766 179899 178132 175890 173649 171585 169694 167987 166482 165181
52796 165181 164172 163555 163171 162593 161605 160544 159942 159893 159939 159548 158537 157168 156026 155710 156362 157488 158376
52779 158376 158663 158366 157524 156173 154579 153158 152109 151352 150823 150499 150220 149813 149421 149279 149169 148559 147399
52762 147399 146250 145442 144586 143248 141639 140209 138934 137466 135750 134040 132467 131013 129793 128968 128449
52747 128449 127928 127202 126203 124838 122993 120643 117878 115024 112735 111551 111219 110947 110551 110734 111829 112912
52731 112912 112877 111903 111082 110924 111074 111241 111477 111606 111244 110482 109762 109042 107842 106234 104958 104397 104203 104147
52713 104147 104511 105285 105845 105932 106281 107698 110031 112619 115192 117764 120081 121914 123648 125939 128853 131836
52697A31836K556J973J262L67m85r67j020q15n79n13o72r21j180j572k102k464
52681A24704k498k524k750k727k018j148j042j637j953j549j138j489k431l215
52667I6585l365k900k153j550j257r67m27L3m3l90l49P0K46O2J12N50P18K21l57
52648H4839l29J37M61M59L28J83J15K64N14M96J27k07k66k17p0M81J264J425N84
52629I0588l80m95j43m35j420j910j235k38j24p85r56J27J733K431J669K28p75
52612H7880r48n53J32Q79J227Q25J0n30p25j067j572j465l26J085J699J404R90
52595H8945J055J444J619J266N90J54K75O19O56M74N61Q31N53m28j109n92O74
52578I7587J509J504J213J114J076Q62O05O06R55J395J410P05k27l42P43K129
$$ plain form
52697 131836 134392 136365 137627 137994 137509 136542 135522 134707 134128 133615 132943 132022 130842 129270 127168 124704
52681 124704 122206 119682 116932 114205 112187 111039 109997 108360 106407 104858 103720 102231 99800 96585
52667 96585 93220 90320 88167 86617 85360 84393 83966 83999 83956 83566 83217 83287 83533 83595 83707 84257 84975 85196 84839
52648 84839 84510 84647 85108 85567 85895 86078 86193 86457 86971 87467 87594 87387 87121 86904 86834 87315 88579 90004 90588
52629 90588 90208 89713 89570 89135 87715 85805 84570 84332 84208 83423 82467 82594 84327 86758 88427 88655 87880
52612 87880 86932 86379 86511 87390 88617 89442 89452 88922 88197 87130 85558 84093 83767 84852 86551 87955 88945
52595 88945 90000 91444 93063 94329 94919 95073 95348 95967 96623 97097 97658 98489 99042 98614 97505 96913 97587
52578 97587 99096 100600 101813 102927 104003 104865 105470 106076 107031 108426 109836 110541 110314 109972 110715 112844
52562A12844K612K090J516J608K145K443K071J079j6m78l0O83P50J21k95J60J058
52545A30361J492J221P79O64Q21J028J288J646J780J323M98nN9J75m8j50M40J251
52527A44623J216K29n93m51Q0k4p82j269q57J50R90J197R06O31P17R37Q00K83
52509A48783r0K5L79N63N04L16N8j32MM32O71L86j82o02p65q05p97p71p32m62
52489A46783K81J172J494J157R73J455J948J663R82R40J676K338K337J910J354
52474A68463O25j39m31j14K31Q6k11L6Q86J648J760J397J054Q20L27n19j165r45
52456A73809J07J314K094K326K114J639J299J462J906J922J221L35q1N1M81J050
52440A93049J574J678J133J43r28j745j901j166q1L23j93p17m70K05O36Q43J041
$$ plain form
52562 112844 115456 117546 119062 120670 122815 125258 127329 128408 128392 127914 127884 128567 129317 129438 129143 129303 130361
52545 130361 131853 133074 133853 134517 135338 136366 137654 139300 141080 142403 142901 142896 142955 143130 143082 142932 143372 144623
52527 144623 145839 146068 145475 145024 145104 145080 144298 143029 142172 142322 143312 144509 145415 146046 146763 147700 148500 148783
52509 148783 148693 148718 149097 149660 150164 150480 150538 150406 150410 150842 151513 151899 151717 151115 150350 149545 148748 147977 147245 146783
52489 146783 147064 148236 149730 150887 151860 153315 155263 156926 157908 158848 160524 162862 165199 167109 168463
52474 168463 169088 168949 168518 168404 168635 168721 168510 168546 169432 171080 172840 174237 175291 176111 176438 175919 174754 173809
52456 173809 173916 175230 177324 179650 181764 183403 184702 186164 188070 189992 191213 191548 191467 191518 191999 193049
52440 193049 194623 196301 197434 197577 196649 194904 193003 191837 191756 192079 191886 191169 190699 190904 191540 192383 193424
52423A93424Q18k30j517k129k161k394k838k670j616m50J30K90M54N92M60J26
52407A80289o7J16N69Q21M38l63q01n41k42n21r42p40r3K44L16Q41J815K288J744
52388A85171Q02K54J70K41K57M9m09o53j13R27J525J398J277J659K027J769J161
52371A97512Q75J068J496J982K300J996R10l74j021p33K00J236J808J624J079
52356B11958J006J686K509K793K528K013J286M58J19P76K064K967K842J909R09
52341B37823M82O75Q79M63k99l55Q31K465L281K949K150J571J338J319J462J727
52325B58761K058K489L024L367L093K182J232R90J637K660L370L575L661M051
52311B96150M733N398N886O224O433O489O481O544O740P173Q005R102R889R995
$$ plain form
52423 193424 194242 194012 192495 190366 188205 185811 182973 180303 178687 178237 178367 178657 179111 179703 180163 180289
52407 180289 180222 180338 180907 181728 182166 181803 181002 180461 180219 179698 178756 178016 177923 178167 178483 179324 181139 183427 185171
52388 185171 185973 186227 186397 186638 186895 186944 186535 185882 185769 186696 188221 189619 190896 192555 194582 196351 197512
52371 197512 198387 199455 200951 202933 205233 207229 208139 207765 206744 206011 206211 207447 209255 210879 211958
52356 211958 212964 214650 217159 219952 222480 224493 225779 226237 226356 227132 229196 232163 235005 236914 237823
52341 237823 238305 238980 239859 240322 240023 239668 240499 242964 246245 249194 251344 252915 254253 255572 257034 258761
52325 258761 260819 263308 266332 269699 272792 274974 276206 277196 278833 281493 284863 288438 292099 296150
52311 296150 300883 306281 312167 318391 324824 331313 337794 344338 351078 358251 366256 375358 385247 395242
52297C95242R821J0079J0849J1603J1999J2121J2049J1850J1992J3031J4768J6248
52285E41652J6776J6486J5855J5302J5244J5894J6751J6960J6381J5673J5181
52274G18155J4588J3790J3241J2948J2126J0457Q921Q505Q757Q467P265N741M319
52261H47280K975J804R77K47p87j911k439k182j642j265j024q21p88j084j715
52246H37625k539l162k952j647J39J467K139K825M094N720P024P580P497P295
52232H73105P525Q352R420J0238J0629J0681J0500J0209R973R741R108P823O287
52219I93591N156M543L858K528O17j256k446k808k901l538m985o718q123r187
52205I68331j0276j1482j2494j3023j3035j2692j2309j2217j2426j2579j2487
$$ plain form
52297 395242 405063 415142 425991 437594 449593 461714 473763 485613 497605 510636 525404 541652
52285 541652 558428 574914 590769 606071 621315 637209 653960 670920 687301 702974 718155
52274 718155 732743 746533 759774 772722 784848 795305 804226 812731 821488 829955 837220 842961 847280
52261 847280 850255 852059 853036 853283 852496 850585 848146 845964 844322 843057 842033 841212 840424 839340 837625
52246 837625 835086 831924 828972 827325 827464 828931 831070 833895 837989 843709 850733 858313 865810 873105
52232 873105 880630 888982 898402 908640 919269 929950 940450 950659 960632 970373 979481 987304 993591
52219 993591 998747 1003290 1007148 1009676 1010293 1009037 1006591 1003783 1000882 997344 992359 985641 977518 968331
52205 968331 958055 946573 934079 921056 908021 895329 883020 870803 858377 845798 833311
52194H33311j2431j2634j2681j1948j0493r073q260p915p563o998o408o065n975
52181G14867n839n443n012m853m774m288l516l245l793m416m306l662l179k984
52167F55557k768k626k849l151k985k561k674l407l872l439k571k071k155k550
52153F15878k910k812j932o48nn39j563k145k327k736l275l154k281j709k235
52138E85607l154l133k034j107j360k398l184l305l001k425j576q14o83j147j616
52123E54670j784j915k162k213j868j353p87Q1J213J987K022J834K103K755L323
$$ plain form
52194 833311 820880 808246 795565 783617 773124 764051 755791 747876 740313 733315 726907 720842 714867
52181 714867 709028 703585 698573 693720 688946 684658 681142 677897 674104 669688 665382 661720 658541 655557
52167 655557 652789 650163 647314 644163 641178 638617 635943 632536 628664 625225 622654 620583 618428 615878
52153 615878 612968 610156 608224 607576 607571 607032 605469 603324 600997 598261 594986 591832 589551 587842 585607
52138 585607 582453 579320 577286 576179 574819 572421 569237 565932 562931 560506 558930 558116 557433 556286 554670
52123 554670 552886 550971 548809 546596 544728 543375 542588 542669 543882 545869 547891 549725 551828 554583 557906
$$ [...]
##END NTUPLES=NMR SPECTRUM
##END=
