
##TITLE=AC1261_BRARS10079_6528385_2QOHSo1Me2
##JCAMPDX= 6.0         $$ Bruker NMR JCAMP-DX V2.0
##DATA TYPE= NMR SPECTRUM
##DATA CLASS= NTUPLES
##ORIGIN= BRUKER
##OWNER= Administrator
$$ 1.72 TOPSPIN		Version 2.1
$$ 2012-07-15 13:49:33.625 -0500  Administrator@TOPSPIN
$$ Compression mode = diff/dup
##.OBSERVE FREQUENCY= 400.02188249412
##.OBSERVE NUCLEUS= ^1H
##.ACQUISITION MODE= SIMULTANEOUS (DQD)
##.ACQUISITION SCHEME= undefined
##.AVERAGES= 64
##.DIGITISER RES= 22
##SPECTROMETER/DATA SYSTEM= spect
##.PULSE SEQUENCE= noesygpps1d.comp
##.SOLVENT NAME= COFFEE_meoh
##.SHIFT REFERENCE= INTERNAL, COFFEE_meoh, 1, 14.96096
##AUDIT TRAIL= $$ (NUMBER, WHEN, WHO, WHERE, PROCESS, VERSION, WHAT)
$$ ##TITLE= Audit trail, TOPSPIN		Version 2.1
$$ ##JCAMPDX= 5.01
$$ ##ORIGIN= Bruker BioSpin GmbH
$$ ##OWNER= Administrator
$$ $$ C:\Bruker\TOPSPIN/data/COFFEE/nmr/AC1261_BRARS10079_6528385_2QOHSo1Me2/12/pdata/1/auditp.txt
$$ ##AUDIT TRAIL=  $$ (NUMBER, WHEN, WHO, WHERE, PROCESS, VERSION, WHAT)
(   1,<2012-07-15 13:49:28.546 -0500>,<Administrator>,<TOPSPIN>,<go>,<TOPSPIN 2.1>,
      <created by zg
	started at 2012-07-15 13:37:58.406 -0500,
	POWCHK enabled, PULCHK disabled,
       configuration hash MD5:
       6B 1B 68 BB D9 2E 58 E2 7F 35 AD 54 07 DF 0E 41
       data hash MD5: 64K
       07 E6 65 7C 91 F7 20 3F 0F F6 08 29 B3 9F E5 4A>)
(   2,<2012-07-15 13:49:31.609 -0500>,<Administrator>,<TOPSPIN>,<proc1d>,<TOPSPIN 2.1>,
      <Start of raw data processing
       efp LB = 0.3 FT_mod = 6 PKNL = 1 PHC0 = 0 PHC1 = 0 SI = 128K 
       data hash MD5: 128K
       B9 45 76 55 5D 98 18 7E 0D B7 48 07 DD B1 72 83>)
(   3,<2012-07-15 13:49:32.718 -0500>,<Administrator>,<TOPSPIN>,<proc1d>,<TOPSPIN 2.1>,
      <pk PHC0 = 0.1647949 PHC1 = 0 
       data hash MD5: 128K
       F7 C2 7F 59 52 F4 A2 9C 6E 0A 4D 6D 86 11 DE 4A>)
(   4,<2012-07-15 13:49:33.312 -0500>,<Administrator>,<TOPSPIN>,<proc1d>,<TOPSPIN 2.1>,
      <abs ABSG = 1 
       data hash MD5: 128K
       BE F0 7D 33 F3 EC 3C 78 F0 47 62 D0 74 6F 34 70>)
(   5,<2012-07-15 13:49:33.375 -0500>,<Administrator>,<TOPSPIN>,<proc1d>,<TOPSPIN 2.1>,
      <abs ABSG = 2 
       data hash MD5: 128K
       74 74 23 B9 5A BC 7F B9 DF F7 F3 B3 AD C4 3A 21>)
(   6,<2012-07-15 13:49:33.421 -0500>,<Administrator>,<TOPSPIN>,<proc1d>,<TOPSPIN 2.1>,
      <abs ABSG = 3 
       data hash MD5: 128K
       D3 19 89 72 5C 2D 55 8D 0D A3 64 83 60 EE BA 40>)
(   7,<2012-07-15 13:49:33.500 -0500>,<Administrator>,<TOPSPIN>,<proc1d>,<TOPSPIN 2.1>,
      <abs ABSG = 4 
       data hash MD5: 128K
       23 FD 08 59 1F 7E C0 D3 71 1D AA B8 46 D8 BD F6>)
(   8,<2012-07-15 13:49:33.546 -0500>,<Administrator>,<TOPSPIN>,<proc1d>,<TOPSPIN 2.1>,
      <abs ABSG = 5 
       data hash MD5: 128K
       46 17 7F 7B D9 BB 91 E2 EC 95 38 61 BF DB D9 3B>)
$$ ##END=
$$ 
$$ $$ hash MD5
$$ $$ 74 AC 83 C1 44 8A B7 6C E9 D3 CF 26 15 23 F9 4F
##$RELAX= 
##$RELAX= 
##$RELAX= 
##$RELAX= 
##$RELAX= 
##$RELAX= 
##$RELAX= 
##$RELAX= 
$$ Bruker specific parameters
$$ [...]
##$TP07= 0
##$TPNAME0= <>
##$TPNAME1= <>
##$TPNAME2= <>
##$TPNAME3= <>
##$TPNAME4= <>
##$TPNAME5= <>
##$TPNAME6= <>
##$TPNAME7= <>
##$TPOAL= (0..7)
0.5 0.5 0.5 0.5 0.5 0.5 0.5 0.5
##$TPOFFS= (0..7)
0 0 0 0 0 0 0 0
##$TUNHIN= 0
##$TUNHOUT= 0
##$TUNXOUT= 0
##$USERA1= <user>
##$USERA2= <user>
##$USERA3= <user>
##$USERA4= <user>
##$USERA5= <user>
##$V9= 5
##$VALIST= <valist>
##$VCLIST= <CCCCCCCCCCCCCCC>
##$VD= 0
##$VDLIST= <DDDDDDDDDDDDDDD>
##$VPLIST= <PPPPPPPPPPPPPPP>
##$VTLIST= <TTTTTTTTTTTTTTT>
##$WBST= 2048
##$WBSW= 25
##$XGAIN= (0..3)
0 0 0 0
##$XL= 0
##$YL= 0
##$YMAX_a= 11264862
##$YMIN_a= -8320738
##$ZGOPTNS= <>
##$ZL1= 120
##$ZL2= 120
##$ZL3= 120
##$ZL4= 120
##$ABSF1= 14.96096
##$ABSF2= -5.597221
##$ABSG= 5
##$ABSL= 3
##$ALPHA= 0
##$AQORDER= 0
##$ASSFAC= 0
##$ASSFACI= 0
##$ASSFACX= 0
##$ASSWID= 0
##$AUNMP= <proc_prof1d_extract.lims>
##$AXLEFT= 0
##$AXNAME= <>
##$AXNUC= <1H>
##$AXRIGHT= 0
##$AXTYPE= 0
##$AXUNIT= <>
##$AZFE= 0.1
##$AZFW= 0.1
##$BCFW= 0
##$BC_mod= 0
##$BYTORDP= 0
##$COROFFS= 0
##$CY= 15
##$DATMOD= 1
##$DC= 0
##$DFILT= <>
##$DTYPP= 0
##$F1P= 0
##$F2P= 0
##$FCOR= 0.5
##$FTSIZE= 131072
##$FT_mod= 6
##$GAMMA= 0
##$GB= 0
##$INTBC= 1
##$INTSCL= 1
##$ISEN= 128
##$LB= 0.3
##$LEV0= 0
##$LPBIN= 0
##$MAXI= 10000
##$MC2= 0
##$MEAN= 0
##$ME_mod= 0
##$MI= 0
##$NCOEF= 0
##$NC_proc= -2
##$NLEV= 6
##$NOISF1= 0
##$NOISF2= 0
##$NSP= 0
##$NTH_PI= 0
##$NZP= 0
##$OFFSET= 14.96096
##$PC= 1
##$PHC0= 0.1647949
##$PHC1= 0
##$PH_mod= 1
##$PKNL= yes
##$PPARMOD= 0
##$PPDIAG= 0
##$PPIPTYP= 0
##$PPMPNUM= 2147483647
##$PPRESOL= 1
##$PSCAL= 4
##$PSIGN= 0
##$PYNMP= <proc.py>
##$REVERSE= no
##$SF= 400.020009651929
##$SI= 131072
##$SIGF1= 0
##$SIGF2= 0
##$SINO= 400
##$SIOLD= 131072
##$SPECTYP= <>
##$SREGLST= <1H.CDCl3>
##$SSB= 0
##$STSI= 131072
##$STSR= 0
##$SW_p= 8223.68421052631
##$SYMM= 0
##$S_DEV= 0
##$TDeff= 65536
##$TDoff= 0
##$TI= <>
##$TILT= no
##$TM1= 0
##$TM2= 0
##$TOPLEV= 0
##$USERP1= <user>
##$USERP2= <user>
##$USERP3= <user>
##$USERP4= <user>
##$USERP5= <user>
##$WDW= 1
##$XDIM= 131072
##$YMAX_p= 388224888
##$YMIN_p= -13124
##$CURPLOT= <Network HP LaserJet P1505>
##$CURPRIN= <$Network HP LaserJet P1505>
##$DFORMAT= <normdp>
##$LAYOUT= <+/1D_H.xwp>
##$LFORMAT= <normlp>
##$PFORMAT= <normpl>
##$SURQMSG= 1
$$ End of Bruker specific parameters
$$ ---------------------------------
##NTUPLES= NMR SPECTRUM
##VAR_NAME=  FREQUENCY,     SPECTRUM/REAL,   SPECTRUM/IMAG
##SYMBOL=    X,             R,               I
##VAR_TYPE=  INDEPENDENT,   DEPENDENT,       DEPENDENT
##VAR_FORM=  AFFN,          ASDF,            ASDF
##VAR_DIM=   131072,        131072,          131072
##UNITS=     HZ,            ARBITRARY UNITS, ARBITRARY UNITS
##FACTOR=    0.0627417313425164, 1,          1
##FIRST=     8223.62146879497, 2918,         -52034
##LAST=      0,             3364,            -52033
##MIN=       0,             -13124,          0
##MAX=       8223.62146879497, 388224888,    0
$$ Real data points
##PAGE= N=1
##DATA TABLE= (X++(R..R)), XYDATA
$$ [...]
$$ plain form
63904 1751187 1610180 1477679 1354316 1240420 1136515 1043399 961680 891217 830953 779364
63894 779364 735216 697827 666428 639512 615335 593070 572936 555081 538894 523780 510097
63883 510097 498684 489609 481830 474129 466044 457934 450483 444248 439476 436161 434213 433526 433887 434992
63869 434992 436707 439247 442951 447910 453937 460915 469124 479166 491567 506411 523450 542551 563885
63856 563885 587613 613676 642079 673111 706817 742484 779108 816284 854119 892359 930256
63845 930256 967377 1003786 1039161 1072364 1102295 1128580 1151033 1169037 1182017 1190003 1193038 1190439
63833 1190439 1181382 1166002 1145266 1119980 1090640 1058023 1023065 986111 947075 906479 865588
63822 865588 825234 785234 745351 706329 669482 635577 604466 575511 548003 521475 496052
$$ packed form
63904A751187j41007j32501j23363j13896j03905r3116q1719p0463o0264n1589
63894G79364m4148l7389l1399k6916k4177k2265k0134j7855j6187j5114j3683
63883E10097j1413r075p779p701q085q110p451o235m772l315j948o87L61J105
63869D34992J715K540L704M959O027O978Q209J0042J2401J4844J7039J9101K1334
63856E63885K3728K6063K8403L1032L3706L5667L6624L7176L7835L8240L7897
63845I30256L7121L6409L5375L3203K9931K6285K2453J8004J2980P986L035k599
63833A190439r057j5380k0736k5286k9340l2617l4958l6954l9036m0596m0891
63822H65588m0354m0000l9883l9022l6847l3905l1111k8955k7508k6528k5423
$$ plain form
63811 496052 472473 451413 432822 416102 400824 387062 374988 364403 354746 345545 336862 329208
63799 329208 322965 317888 313289 308673 304019 299491 295143 290967 287003 283228 279521 275923 272852 270838
63785 270838 270055 270236 271010 272210 273803 275606 277241 278379 278934 278845 277698 274830 269980 263795 257599 252605
63769 252605 249220 246871 244496 241525 238500 236479 235697 235180 233984 232442 231675 232039 232668 232569 231634 230377
63753 230377 229142 227877 226480 225045 223802 222972 222620 222625 222845 223325 224225 225497 226773 227648 228022 228198 228691
63736 228691 229904 231841 234121 236299 238128 239568 240797 242329 244804 248372 252443 256321 259926 263622
63722 263622 267593 271757 276148 280902 285924 291002 296191 301578 306687 310607 312881 313849 313988 313349 311783
63707 311783 309305 305971 301762 296877 291901 287396 283466 279913 276699 274135 272692 272622 273609 274868 275876
$$ packed form
63811D96052k3579k1060j8591j6720j5278j3762j2074j0585r657r201q683p654
63799C29208o243n077m599m616m654m528m348m176l964l775l707l598l071k014
63785B70838p83J81P74J200J593J803J635J138N55q9j147k868m850o185o196m994
63769B52605l385k349k375k971l025k021p82n17j196j542p67L64O29r9r35j257
63753B30377j235j265j397j435j243q30l52NK20M80R00J272J276Q75L74J76M93
63736B28691J213J937K280K178J829J440J229J532K475L568M071L878L605L696
63722B63622L971M164M391M754N022N078N189N387N109L920K274R68J39o39j566
63707C11783k478l334m209m885m976m505l930l553l214k564j443p0R87J259J008
$$ plain form
63692 275876 276969 278883 281728 284895 288019 291483 295652 300039 303648 305982 307428 308765 310466 312354
63678 312354 313834 314554 314831 315198 315740 316261 317024 318546 320555 321944 322296 322770 324778 328175 331495 333708
63662 333708 335045 336179 337339 338360 338973 338742 337117 333859 329303 324125 318960 314229 310029 306152 302433
63647 302433 299153 296859 295676 295044 294347 293648 293555 294416 295941 297743 300011 303332 307905 313273 318932 324730
63631 324730 330379 335055 338105 340010 342022 344866 348436 352745 358347 365399 372958 379809 385738 391591
63617 391591 398418 406895 417237 429108 441793 454925 469017 484974 503164 523171 544267 565908
63605 565908 587975 610839 635020 660459 686224 711049 733948 754190 771087 784172 793322 798465
63593 798465 799591 797378 793366 788997 784691 780137 774953 768517 759703 747627 732547 715403 696703
$$ packed form
63692B75876J093J914K845L167L124L464M169M387L609K334J446J337J701J888
63678C12354J480P20K77L67N42N21P63J522K009J389L52M74K008L397L320K213
63662C33708J337J134J160J021O13k31j625l258m556n178n165m731m200l877l719
63647C02433l280k294j183o32o97o99r3Q61J525J802K268L321M573N368N659N798
63631C24730N649M676L050J905K012K844L570M309N602P052P559O851N929N853
63617C91591O827Q477J0342J1871J2685J3132J4092J5957J8190K0007K1096K1641
63605E65908K2067K2864K4181K5439K5765K4825K2899K0242J6897J3085R150N143
63593G98465J126k213m012m369m306m554n184o436q814j2076j5080j7144j8700
$$ plain form
63580 696703 676519 655365 634253 613915 594674 577067 561831 549169 538680 530120 523582 518872
63568 518872 515415 512984 511893 512247 513667 515990 519596 524737 531086 538278 546305 555024 563838 572365
63554 572365 580978 590227 600123 610482 621703 634678 650098 668231 689214 713203 740307 770660
63542 770660 804434 841499 880991 921010 958328 988488 1007191 1012676 1006924 994287 978943 963580
63530 963580 949734 938330 929660 923233 917954 912406 905050 894513 879852 860626 836876 809206
63518 809206 778787 747050 715295 684539 655499 628577 603950 581771 562133 544807 529290
63507 529290 515284 502947 492508 483811 476375 469651 463096 456292 449286 442594 436605 431119 425647
63494 425647 419985 414239 408544 403089 398279 394482 391651 389454 387687 386279 385026 383682 382381 381646
$$ packed form
63580F96703k0184k1154k1112k0338j9241j7607j5236j2662j0489q560o538m710
63568E18872l457k431j091L54J420K323L606N141O349P192Q027Q719Q814Q527
63554E72365Q613R249R896J0359J1221J2975J5420J8133K0983K3989K7104L0353
63542G70660L3774L7065L9492M0019L7318L0160J8703N485n752j2637j5344j5363
63530I63580j3846j1404q670o427n279n548p356j0537j4661j9226k3750k7670
63518H09206l0419l1737l1755l0756k9040k6922k4627k2179j9638j7326j5517
63507E29290j4006j2337j0439q697p436o724o555o804p006o692n989n486n472
63494D25647n662n746n695n455m810l797k831k197j767j408j253j344j301p35
$$ plain form
63480 381646 381930 383247 385294 387736 390365 393194 396424 400200 404375 408538 412233 415120 417129 418606
63466 418606 420104 421761 422925 422636 420477 416830 412520 408484 405669 404725 405473 406820 407432 406631 404762
63451 404762 402783 401422 400625 399804 398640 397508 397061 397659 399411 402535 407288 413519 420670 428349 436818
63436 436818 446924 459756 476256 496818 521156 548800 579776 614409 652070 690191 724805
63425 724805 752263 770630 779939 781680 778207 772254 766399 762610 762138 765767 773999 786917 804013
63412 804013 824381 847209 871976 898088 924376 949068 970247 986342 996365 1000059 998142 992366
63400 992366 984952 977534 970519 963440 955762 947041 936401 922410 903835 880388 852626 821538 788613
63387 788613 755879 725099 696766 670296 645279 622170 601794 584623 570668 559550 550526 542910
$$ packed form
63480C81646K84J317K047K442K629K829L230L776M175M163L695K887K009J477
63466D18606J498J657J164k89k159l647m310m036k815r44P48J347O12q01j869
63451D04762j979j361p97q21j164j132m47N98J752L124M753O231P151P679Q469
63436D36818J0106J2832J6500K0562K4338K7644L0976L4633L7661L8121L4614
63425G24805K7458J8367R309J741l473n953n855l789m72L629Q232J2918J7096
63412H04013K0368K2828K4767K6112K6288K4692K1179J6095J0023L694j917n776
63400I92366p414p418p015p079p678q721j0640j3991j8575k3447k7762l1088l2925
63387G88613l2734l0780k8333k6470k5017k3109k0376j7171j3955j1118r024p616
$$ plain form
63375 542910 536778 532845 531397 531733 532932 534802 537769 542249 548552 556976 567404 579014 590937 603252
63361 603252 616924 632866 651360 672248 695232 719977 746291 774192 803602 834045 864925
63350 864925 895890 926550 955943 982695 1005639 1023991 1037173 1045010 1048103 1047397 1043379 1036222 1026783
63337 1026783 1016764 1007470 998751 989400 978232 964459 947475 926849 902572 875028 844812 812835
63325 812835 780563 749766 721784 697061 675473 657071 642369 631864 625469 622691 623077 625765
63313 625765 628298 626685 617594 600621 578126 553127 527925 504246 483379 465587 450151 436554
63301 436554 425130 416125 408713 401636 394514 387861 382018 376740 371780 367213 363068 359147 355393 352038
63287 352038 349120 346172 342684 338767 335160 332547 330942 329697 328172 326400 325016 324356 323764 322107 319056
$$ packed form
63375E42910o132l933j448L36J199J870K967M480O303Q424J0428J1610J1923J2315
63361F03252J3672J5942J8494K0888K2984K4745K6314K7901K9410L0443L0880
63350H64925L0965L0660K9393K6752K2944J8352J3182P837L093p06m018p157r439
63337A026783j0019r294q719r351j1168j3773j6984k0626k4277k7544l0216l1977
63325H12835l2272l0797k7982k4723k1588j8402j4702j0505o395k778L86K688
63313F25765K533j613r091j6973k2495k4999k5202k3679k0867j7792j5436j3597
63301D36554j1424r005p412p077p122o653n843n278m960m567m145l921l754l355
63287C52038k918k948l488l917l607k613j605j245j525j772j384o60n92j657l051
$$ plain form
63272 319056 315604 313145 312159 311981 311718 311152 310711 310790 311297 311855 312244 312571 313083 313905 314891 315664 315854 315459
63254 315459 314952 314904 315493 316423 317275 317838 318163 318517 319250 320480 321852 322751 322831 322202 321181 320108 319380 319296
63236 319296 319725 320198 320446 320588 320678 320448 319773 319015 318500 317941 316890 315610 314933 315240 316120 317159 318601 320952
63218 320952 324271 328136 332045 335574 338369 340378 342067 344044 346360 348391 349573 350218 351492 354477
63204 354477 359168 364407 368903 372354 375477 379074 383355 388241 393927 400782 408880 418008 428071 439063
63190 439063 450625 462101 473323 485074 498456 513942 531313 550300 570879 592950 616143
63179 616143 640080 664564 689383 714174 738664 762841 786678 809831 831819 852424 871746
63168 871746 889904 906813 922163 935436 946063 953664 958022 958642 954603 945246 930940 912724 891143
$$ packed form
63272C19056l452k459r86j78k63n66m41P9N07N58L89L27N12Q22R86P73J90l95
63254C15459n07m8N89R30Q52N63L25L54P33J230J372Q99Q0o29j021j073p28q4
63236C19296M29M73K48J42R0k30o75p58n15n59j051j280o77L07Q80J039J442K351
63218C20952L319L865L909L529K795K009J689J977K316K031J182O45J274K985
63204C54477M691N239M496L451L123L597M281M886N686O855Q098R128J0063J0992
63190D39063J1562J1476J1222J1751J3382J5486J7371J8987K0579K2071K3193
63179F16143K3937K4484K4819K4791K4490K4177K3837K3153K1988K0605J9322
63168H71746J8158J6909J5350J3273J0627P601M358O20m039r357j4306j8216k1581
$$ plain form
63155 891143 865882 836756 804681 771350 738165 705798 674609 645027 617440 591953 568408
63144 568408 546564 526301 507784 491446 477671 466428 457267 449683 443363 438074 433485 429293 425488
63131 425488 422352 420066 418375 416786 415163 414001 413974 415261 417409 419784 422023 424124 426369 429172 432807
63116 432807 437162 441882 446746 451742 456777 461643 466381 471383 476942 482893 488892 494837 500814 506908
63102 506908 513342 520559 528725 537291 545464 553039 560411 567834 575241 582838 591303 601041 611567 621904
63088 621904 631343 639595 646516 651970 655715 657074 655026 649077 640021 629472 618676 608038 597603
63075 597603 587450 577476 567349 557036 547160 538496 531213 524799 518654 512571 506740 501509 497164
63062 497164 493774 491183 489221 487875 487137 486746 486328 485917 486133 487596 490224 493338 496504 499992 504252
$$ packed form
63155H91143k5261k9126l2075l3331l3185l2367l1189k9582k7587k5487k3545
63144E68408k1844k0263j8517j6338j3775j1243r161p584o320n289m589m192l805
63131D25488l136k286j691j589j623j162k7J287K148K375K239K101K245K803L635
63116D32807M355M720M864M996N035M866M738N002N559N951N999N945N977O094
63102E06908O434P217Q166Q566Q173P575P372P423P407P597Q465R738J0526J0337
63088F21904R439Q252O921N454L745J359k048n949r056j0549j0796j0638j0435
63075E97603j0153r974j0127j0313r876q664p283o414o145o083n831n231m345
63062D97164l390k591j962j346p38l91m18m11K16J463K628L114L166L488M260
$$ plain form
63047 504252 509213 514403 519648 525256 531475 538115 544814 551391 557814 564166 570864 578520 587198 596050
63033 596050 604151 611573 619214 627659 636625 645435 653513 660426 665997 670597 674892 679069 682678 685405
63019 685405 687622 690031 693117 697052 701665 706347 710609 715046 721162 729814 740464 752503 766591
63006 766591 783841 804208 826805 851585 879554 911275 946156 983459 1023038 1064731 1107814
62995 1107814 1151526 1195357 1238459 1279536 1318014 1354807 1391260 1427728 1463699 1498778 1532814
62984 1532814 1565328 1595544 1622795 1646247 1664335 1675224 1677937 1672569 1659341 1637946 1608018 1569836
62972 1569836 1524356 1472801 1416406 1356455 1294458 1232301 1172019 1115178 1062463 1013953 969656
62961 969656 929634 893733 861463 832136 805119 780172 757602 737717 719921 702772 685318
$$ packed form
63047E04252M961N190N245N608O219O640O699O577O423O352O698P656Q678Q852
63033E96050Q101P422P641Q445Q966Q810Q078O913N571M600M295M177L609K727
63019F85405K217K409L086L935M613M682M262M437O116Q652J0650J2039J4088
63006G66591J7250K0367K2597K4780K7969L1721L4881L7303L9579M1693M3083
62995A107814M3712M3831M3102M1077L8478L6793L6453L6468L5971L5079L4036
62984A532814L2514L0216K7251K3452J8088J0889K713n368j3228k1395k9928l8182
62972A569836m5480n1555n6395n9951o1997o2157o0282n6841n2715m8510m4297
62961I69656m0022l5901l2270k9327k7017k4947k2570j9885j7796j7149j7454
$$ plain form
62950 685318 668027 651938 637153 622701 607704 592149 576594 561643 547716 534877 522917
62939 522917 511924 502540 495106 488723 481885 474102 466247 459232 453105 447673 443184 439837 437102 434177
62925 434177 430947 428050 426072 424975 424148 422813 420607 418032 416202 415833 416586 417612 418630 420153 422634
62910 422634 425638 428027 428969 428722 428348 428656 429534 430305 430508 430191 429748 429742 430604 432126 433522 434433 435719 438693
62892 438693 443687 449954 456812 464094 471387 477682 482183 484944 486340 486483 485509 483917 482150 480159 477717
62877 477717 474794 471339 467136 462252 457270 452658 448252 443732 439250 435192 431619 428306 425016 421436
62863 421436 417276 412827 408954 406065 403478 400369 396924 393924 391528 389189 386548 383718 380915 378474
62849 378474 377011 376779 376940 376357 375108 374365 374680 375310 375524 375662 376335 377256 377627 377326 377032 377316 378087 378937
$$ packed form
62950F85318j7291j6089j4785j4452j4997j5555j5555j4951j3927j2839j1960
62939E22917j0993r384p434o383o838p783p855p015o127n432m489l347k735k925
62925D34177l230k897j978j097q27j335k206k575j830l69P53J026J018J523K481
62910D22634L004K389R42k47l74L08Q78P71K03l17m43oQ62J522J396R11J286K974
62892D38693M994O267O858P282P293O295M501K761J396J43r74j592j767j991k442
62877D77717k923l455m203m884m982m612m406m520m482m058l573l313l290l580
62863D21436m160m449l873k889k587l109l445l000k396k339k641k830k803k441
62849C78474j463k32J61n83j249p43L15O30K14J38O73R21L71l01k94K84P71Q50
$$ plain form
62831 378937 379656 380369 381389 382898 384636 385966 386416 386131 385735 385775 386371 387247 388039 388636 389239 390047 390919 391451
62813 391451 391329 390443 388791 386540 384165 382171 380566 378858 376699 374367 372500 371491 371262 371526 372141
62798 372141 373224 374898 376932 378758 379960 380604 380954 381014 380620 379780 378579 376850 374427 371742 369725 368874
62782 368874 368768 368728 368716 369349 371181 374172 377748 381240 384341 387324 390837 395361 400774 406301 410871 413705
62766 413705 414746 414533 413643 412376 410982 409843 409146 408619 407956 407288 406883 406549 405839 404747 403663 402615
62750 402615 401037 398483 395212 391933 389276 387514 386376 385026 382666 379307 375685 372356 369330 366653
62736 366653 364788 364089 364334 365102 366318 368072 370167 372185 373913 375576 377823 381460 386779 393020 398954
62721 398954 404214 409620 415971 423042 430183 437382 445179 453855 463304 473554 484863 497461 511593
$$ packed form
62831C78937P19P13J020J509J738J330M50k85l96M0N96Q76P92N97O03Q08Q72N32
62813C91451j22q86j652k251k375j994j605j708k159k332j867j009k29K64O15
62798C72141J083J674K034J826J202O44L50O0l94q40j201j729k423k685k017q51
62782C68874j06m0j2O33J832K991L576L492L101K983L513M524N413N527M570K834
62766D13705J041k13q90j267j394j139o97n27o63o68m05l34p10j092j084j048
62750D02615j578k554l271l279k657j762j138j350k360l359l622l329l026k677
62736C66653j865o99K45P68J216J754K095K018J728J663K247L637N319O241N934
62721C98954N260N406O351P071P141P199P797Q676R449J0250J1309J2598J4132
$$ plain form
62708 511593 527656 545795 565561 586503 609009 634080 662386 694111 729600 769393 813396
62697 813396 860660 910372 962718 1018469 1078018 1141076 1207010 1275131 1344660 1414503 1482949
62686 1482949 1547629 1606092 1656576 1697956 1728932 1747724 1752877 1744104 1722057 1687561 1641540 1585581
62674 1585581 1522067 1453551 1382178 1309693 1237676 1167480 1100040 1035855 975208 918358 865598
62663 865598 817146 772990 732896 696678 664423 636256 611796 590027 569938 551209 534109
62652 534109 518823 505159 492917 482127 472711 464145 455828 447642 439841 432476 425326 418403 412073
62639 412073 406501 401357 396386 391987 388906 387428 387208 387756 388712 389685 390239 390237 389953 389548 388651 386729 383868
62622 383868 380861 378428 376529 374657 372611 370692 369121 367642 365901 363979 362256 360943 360079 359907 360778
$$ packed form
62708E11593J6063J8139J9766K0942K2506K5071K8306L1725L5489L9793M4003
62697H13396M7264M9712N2346N5751N9549O3058O5934O8121O9529O9843O8446
62686A482949O4680N8463N0484M1380L0976J8792N153q773k2047l4496m6021n5959
62674A585581o3514o8516p1373p2485p2017p0196o7440o4185o0647n6850n2760
62663H65598m8452m4156m0094l6218l2255k8167k4460k1769k0089j8729j7100
62652E34109j5286j3664j2242j0790r416q566q317q186p801p365p150o923o330
62639D12073n572n144m971m399l081j478k20N48R56R73N54kk84m05q97j922k861
62622C83868l007k433j899j872k046j919j571j479j741j922j723j313q64j72Q71
$$ plain form
62607 360778 362514 364220 364974 364557 363403 362077 361018 360518 360584 360820 360740 360233 359566 358954 358381 357891 357832 358535
62589 358535 359810 360998 361657 362066 362809 363922 364794 365057 365192 365904 367094 367964 368071 367772 367518 367237 366679
62572 366679 365946 365241 364332 362659 359969 356649 353510 351298 350208 349684 348919 347714 346629 346153 346084 345995 345915
62555 345915 346134 346628 347245 348286 350302 353252 356323 358715 360280 361331 362175 362974 363798 364699 365861 367589
62539 367589 369909 372347 374450 376491 379140 382443 385665 388390 391200 394830 398992 402652 405480 408541
62525 408541 413341 420409 429076 438586 449092 461318 475378 490418 505722 521889 540515 562769
62513 562769 588535 616863 646912 678513 712135 748374 787136 827334 867603 907138 945458
62502 945458 981519 1013764 1041118 1063284 1079865 1089885 1092598 1088226 1077463 1060857 1039262 1014407
$$ packed form
62607C60778J736J706P54m17j154j326j059n00O6K36q0n07o67o12n73m90n9P03
62589C58535J275J188O59M09P43J113Q72K63J35P12J190Q70J07k99k54k81n58
62572C66679p33p05r09j673k690l320l139k212j090n24p65j205j085m76o9q9q0
62555C45915K19M94O17J041K016K950L071K392J565J051Q44P99Q24R01J162J728
62539C67589K320K438K103K041K649L303L222K725K810L630M162L660K828L061
62525D08541M800P068Q667R510J0506J2226J4060J5040J5304J6167J8626K2254
62513E62769K5766K8328L0049L1601L3622L6239L8762M0198M0269L9535L8320
62502I45458L6061L2245K7354K2166J6581J0020K713m372j0763j6606k1595k4855
$$ plain form
62490 1014407 988192 961612 935065 909559 886864 868365 854376 844574 838485 835463 834938 837045
62478 837045 842501 851466 862863 875103 887107 898250 907627 913877 915759 912783 905402 894685 881484
62465 881484 865653 846281 822866 795984 766644 735453 702879 670009 638374 609026 582161
62454 582161 557590 535083 514358 495347 478594 464842 454022 445144 437475 431303 427087 424296
62442 424296 421738 418933 416520 415235 414924 414836 414554 414339 414646 415561 416814 418252 420052 422244 424163 424740
62426 424740 423477 420885 417778 414484 411020 407659 404818 402449 400069 397402 394634 392035 389780 388188
62412 388188 387640 388013 388555 388577 388042 387332 386746 386390 386239 386032 385410 384478 383970 384540 386029 387727 389157 390293
62394 390293 391224 392039 393016 394517 396674 399414 402780 406932 411814 417027 422068 426541 430316 433810 437986
$$ packed form
62490A014407k6215k6580k6547k5506k2695j8499j3989r802o089l022n25K107
62478H37045N456Q965J1397J2240J2004J1143R377O250J882k976p381j0717j3201
62465H81484j5831j9372k3415k6882k9340l1191l2574l2870l1635k9348k6865
62454E82161k4571k2507k0725j9011j6753j3752j0820q878p669o172m216k791
62442D24296k558k805k413j285l11q8k82k15L07R15J253J438J800K192J919N77
62426D24740j263k592l107l294l464l361k841k369k380k667k768k599k255j592
62412C88188n48L73N42K2n35p10n86l56j51k07o22r32n08N70J489J698J430J136
62394C90293R31Q15R77J501K157K740L366M152M882N213N041M473L775L494M176
$$ plain form
62379 437986 443619 450460 457448 463955 470525 478264 487711 498511 509934 521451 532869 544217 555671
62366 555671 567521 580077 593538 608015 623824 641711 662459 686166 712204 740148 770504
62355 770504 804189 841525 882246 926262 973699 1023938 1075209 1125389 1172826 1216122 1253713
62344 1253713 1284333 1307753 1324536 1334990 1338711 1335248 1324965 1309086 1288893 1264811 1236277 1202708
62332 1202708 1164724 1124293 1083616 1044121 1006581 971649 939731 910631 883920 859594 837782
62321 837782 817827 798329 778374 758214 738439 719009 699563 680235 661532 643519 625721
62310 625721 607898 590446 574012 559057 545913 534804 525553 517586 510484 504320 499257 495071 491390
62297 491390 488236 485975 484752 484298 484330 484876 486100 487971 490221 492529 494721 496908 499500 502922 507202
$$ packed form
62379D37986N633O841O988O507O570P739R447J0800J1423J1517J1418J1348J1454
62366E55671J1850J2556J3461J4477J5809J7887K0748K3707K6038K7944L0356
62355G70504L3685L7336M0721M4016M7437N0239N1271N0180M7437M3296L7591
62344A253713L0620K3420J6783J0454L721l463j0283j5879k0193k4082k8534l3569
62332A202708l7984m0431m0677l9495l7540l4932l1918k9100k6711k4326k1812
62321H37782j9955j9498j9955k0160j9775j9430j9446j9328j8703j8013j7798
62310F25721j7823j7452j6434j4955j3144j1109r251p967p102o164n063m186l681
62297D91390l154k261j223m54L2N46J224J871K250K308K192K187K592L422M280
$$ plain form
62282 507202 511875 516337 520317 523950 527444 530722 533456 535468 537030 538664 540744 543446 546999 551552
62268 551552 556739 561918 567208 573828 582865 594008 606257 619724 635899 656003 679874 706830
62256 706830 736904 770701 808527 850215 895455 943770 994388 1046497 1099277 1151194 1199615
62245 1199615 1241822 1276361 1303002 1321684 1332118 1334278 1328583 1315496 1295359 1268593 1235578 1196455
62233 1196455 1151628 1102462 1050903 998421 945969 894915 847141 803817 764741 729255 697282
62222 697282 669062 644455 623026 604465 588471 574548 562336 551796 542676 534174 525630 517276
62210 517276 509775 503245 497262 491625 486564 482308 478921 476502 475009 473900 472422 470405 468411 467141
62196 467141 467038 468337 471031 474684 478724 483057 488094 494156 501174 508993 517578 526880 536878 547771
$$ packed form
62282E07202M673M462L980L633L494L278K734K012J562J634K080K702L553M553
62268E51552N187N179N290O620R037J1143J2249J3467J6175K0104K3871K6956
62256G06830L0074L3797L7826M1688M5240M8315N0618N2109N2780N1917M8421
62245A199615M2207L4539K6641J8682J0434K160n695j3087k0137k6766l3015l9123
62233A196455m4827m9166n1559n2482n2452n1054m7774m3324l9076l5486l1973
62222F97282k8220k4607k1429j8561j5994j3923j2212j0540r120q502q544q354
62210E17276p501o530n983n637n061m256l387k419j493j109j478k017j994j270
62196D67141j03J299K694L653M040M333N037O062P018P819Q585R302R998J0893
$$ plain form
62182 547771 559638 571841 583347 593936 604513 615857 627464 638068 646977 654435 661015 667251
62170 667251 673799 681345 690219 700510 712642 727520 746049 768691 795478 826044 859559 894948
62158 894948 931336 968053 1004073 1037699 1067014 1090564 1107657 1118314 1123123 1122825 1117742 1107635
62146 1107635 1092335 1072321 1048410 1020993 989942 955385 918362 880603 843784 809036 776986
62135 776986 748053 722609 700851 682592 667298 654415 643604 634606 626975 620100 613493 606966
62123 606966 600595 594650 589498 585446 582615 581087 581115 583099 587350 593981 602888 613730 625992 639304
62109 639304 653517 668114 681582 691872 697815 700031 700418 700972 703035 706983 712060 716597 718885 718059
62095 718059 714251 708168 700807 693402 687214 683246 682172 684459 690374 699904 712810 728765 747390
$$ packed form
62182E47771J1867J2203J1506J0589J0577J1344J1607J0604Q909P458O580O236
62170F67251O548P546Q874J0291J2132J4878J8529K2642K6787L0566L3515L5389
62158H94948L6388L6717L6020L3626K9315K3550J7093J0657M809k98n083j0107
62146A107635j5300k0014k3911k7417l1051l4557l7023l7759l6819l4748l2050
62135G76986k8933k5444k1758j8259j5294j2883j0811q998p631o875o607o527
62123F06966o371n945n152m052k831j528K8J984M251O631Q907J0842J2262J3312
62109F39304J4213J4597J3468J0290N943K216L87N54K063L948N077M537K288q26
62095G18059l808o083p361p405o188l968j074K287N915R530J2906J5955J8625
$$ plain form
62082 747390 768346 791608 817489 846250 877775 911798 948280 987264 1028423 1071021 1114276
62071 1114276 1157609 1200527 1242516 1282987 1321227 1356484 1388308 1416691 1441756 1463543 1482375
62060 1482375 1499165 1514846 1529541 1542707 1554053 1563824 1572099 1578313 1581715 1582000 1579364 1574171 1566716
62047 1566716 1556916 1544012 1526815 1504498 1477002 1444620 1407598 1366472 1322504 1277294 1231880
62036 1231880 1186424 1140772 1095166 1050423 1007541 967208 929592 894597 862240 832723 806139
62025 806139 782239 760550 740673 722489 706103 691540 678437 666150 654335 643202 632947
62014 632947 623089 612827 602092 591833 583066 575944 569937 564614 559927 555948 552734 550546 549960 551477
62000 551477 554981 559711 564921 570528 576872 583814 590393 595542 598885 600638 601092 600533 599307 597468 594582
$$ packed form
62082G47390K0956K3262K5881K8761L1525L4023L6482L8984M1159M2598M3255
62071A114276M3333M2918M1989M0471L8240L5257L1824K8383K5065K1787J8832
62060A482375J6790J5681J4695J3166J1346R771Q275O214L402K85k636n193p455
62047A566716r800j2904j7197k2317k7496l2382l7022m1126m3968m5210m5414
62036A231880m5456m5652m5606m4743m2882m0333l7616l4995l2357k9517k6584
62025H06139k3900k1689j9877j8184j6386j4563j3103j2287j1815j1133j0255
62014F32947r858j0262j0735j0259q767p122o007n323m687l979l214k188n86J517
62000E51477L504M730N210N607O344O942O579N149L343J753M54n59j226j839k886
$$ plain form
61985 594582 590352 585198 579652 573421 565797 556935 547930 539590 531823 524341 517192 510412 503929 498130
61971 498130 493729 490680 487878 484462 480869 478130 476693 476315 476518 476571 475681 473877 472284 471910 472517 473290
61955 473290 474067 475172 476454 477441 478304 479825 482414 485766 489504 493556 497933 502754 508505 515747 524517
61940 524517 534480 545635 558425 573167 589775 607971 627334 647200 667011 686730 706499 725969
61928 725969 744396 761306 776656 790469 802744 813528 822565 829058 832392 832905 831300 827460 820685
61915 820685 811149 800337 789821 780340 772328 766565 763804 764184 767461 773569 782657 794774 809639
61902 809639 826463 843928 860614 875536 888034 897330 902662 903853 901247 895038 885131 871720 855554
61889 855554 837567 818633 799643 781219 763285 745448 727829 711073 695583 681329 668364
$$ packed form
61985E94582m230n154n546o231p624q862r005q340p767p482p149o780o483n799
61971D98130m401l049k802l416l593k739j437l78K03N3q90j804j593l74O07P73
61955D73290P77J105J282R87Q63J521K589L352L738M052M377M821N751P242Q770
61940E24517R963J1155J2790J4742J6608J8196J9363J9866J9811J9719J9769J9470
61928G25969J8427J6910J5350J3813J2275J0784R037O493L334N13j605l840o775
61915H20685r536j0812j0516r481q012n763k761L80L277O108R088J2117J4865
61902H09639J6824J7465J6686J4922J2498R296N332J191k606o209r907j3411j6166
61889H55554j7987j8934j8990j8424j7934j7837j7619j6756j5490j4254j2965
$$ plain form
61878 668364 656788 646199 635957 626070 617004 608564 599981 591405 584192 579138 575419 572024 569358
61865 569358 568504 569528 571529 573979 577146 581459 587203 594645 603811 614363 626278 640328 657213
61852 657213 676525 697300 719331 743150 768926 796252 825110 856165 889771 925135 960686
61841 960686 994975 1027114 1056588 1082674 1104005 1119024 1127132 1129011 1125543 1116961 1103676 1087310
61829 1087310 1070018 1053123 1037357 1024145 1015399 1011905 1012972 1017854 1026479 1038405 1052164 1066280
61817 1066280 1080092 1092863 1102790 1107773 1106753 1099600 1086128 1066090 1039925 1008804 974019 936979
61805 936979 899590 863779 830418 799249 769993 742998 718743 697312 678645 662744 649223
61794 649223 637112 625661 615153 606428 599769 594698 590748 587794 585543 583361 581003 579078 578223 578100
$$ packed form
61878F68364j1576j0589j0242r887r066q440q583q576p213n054l719l395k666
61865E69358q54J024K001K450L167M313N744P442R166J0552J1915J4050J6885
61852F57213J9312K0775K2031K3819K5776K7326K8858L1055L3606L5364L5551
61841I60686L4289L2139K9474K6086K1331J5019Q108J879l468q582j3285j6366
61829A087310j7292j6895j5766j3212q746l494J067M882Q625J1926J3759J4116
61817A066280J3812J2771R927M983j020p153j3472k0038k6165l1121l4785l7040
61805I36979l7389l5811l3361l1169k9256k6995k4255k1431j8667j5901j3521
61794F49223j2111j1451j0508q725o659n071l950k954k251k182k358j925q55j23
$$ plain form
61780 578100 577746 576866 576142 576207 576860 577539 578060 578406 578212 577057 575239 573704 573090 573176 573381 573413 573216 572615 571457
61761 571457 570043 569024 568689 568589 568094 567245 566738 567053 567917 568774 569512 570389 571427 572359 573184 574360 576236
61744 576236 578575 580791 582450 583411 583763 583842 584099 584807 585995 587756 590346 593828 597919 602331 606926 611319
61728 611319 614734 616702 617719 618828 620644 623075 625790 628560 631251 633826 636345 638760 640866 642689
61714 642689 644651 646954 649021 649985 649613 648306 646401 643990 641338 638773 636095 632662 628243 623331 618454
61699 618454 613746 609327 605560 602538 599754 596694 593482 590621 588313 586313 584239 581743 578635 575097
61685 575097 571586 568356 565307 562550 560731 560359 561022 561722 561874 561537 560792 559483 557702 556004 554818 553900
61669 553900 552712 551228 550089 549904 550574 551390 551702 551458 551054 550783 550593 550457 550791 552184 554639 557356 559548
$$ packed form
61780E78100l54q80p24O5O53O79N21L46j94j155j818j535o14Q6K05L2j97o01j158
61761E71457j414j019l35j00m95q49n07L15Q64Q57P38Q77J038R32Q25J176J876
61744E76236K339K216J659R61L52P9K57P08J188J761K590L482M091M412M595M393
61728F11319L415J968J017J109J816K431K715K770K691K575K519K415K106J823
61714F42689J962K303K067R64l72j307j905k411k652k565k678l433m419m912m877
61699F18454m708m419l767l022k784l060l212k861k308k000k074k496l108l538
61685E75097l511l230l049k757j819l72O63P00J52l37p45j309j781j698j186r18
61669E53900j188j484j139j85O70Q16L12k44m04k71j90j36L34J393K455K717K192
$$ plain form
61652 559548 561380 563781 567306 571495 575551 579363 583473 588249 593574 599457 606312 614249 622442 629723
61638 629723 635714 640985 646082 650824 654595 656953 657795 657220 655464 652792 649312 645000 640017 634854 629990
61623 629990 625488 621063 616546 612180 608449 605644 603565 601672 599585 597413 595519 594025 592668 591127
61609 591127 589299 587184 584608 581207 576670 570979 564400 557276 549898 542586 535745 529565 523722 517718
61595 517718 511695 506577 503114 500980 499135 496920 494473 492157 490001 487695 484807 480992 476328 471483
61581 471483 467261 463878 460949 458192 455829 454152 452930 451449 449129 446112 443210 441123 439601 437697
61567 437697 434962 431995 429456 427083 424358 421752 420308 420084 419961 419202 418305 418001 418278 418821 419629 420557
61551 420557 420910 420159 418637 417033 415662 414764 414870 416106 417553 418159 417984 417856 418099 418433 418875 419809 421208
$$ packed form
61652E59548J832K401L525M189M056L812M110M776N325N883O855P937Q193P281
61638F29723N991N271N097M742L771K358Q42n75j756k672l480m312m983n163m864
61623F29990m502m425m517m366l731k805k079j893k087k172j894j494j357j541
61609E91127j828k115k576l401m537n691o579p124p378p312o841o180n843o004
61595E17718o023n118l463k134j845k215k447k316k156k306k888l815m664m845
61581D71483m222l383k929k757k363j677j222j481k320l017k902k087j522j904
61567D37697k735k967k539k373k725k606j444k24j23p59q97l04K77N43Q08R28
61551D20557L53p51j522j604j371q98J06J236J447O06j75j28K43L34M42R34J399
$$ plain form
61534 421208 422677 424317 426694 429791 432773 435036 436790 438323 439402 439737 439421 438458 436446 433230 429536
61519 429536 426436 424429 423328 422754 422300 421506 420136 418475 417037 416038 415323 414689 414059 413478 413130 413244 413786
61502 413786 414327 414387 413842 412883 411663 410100 408022 405528 403274 402183 402562 403605 404158 403920 403472 403224 402999
61485 402999 402820 403385 405254 407996 410588 412307 412920 412477 411466 410814 411119 412061 412970 413703 414477 415175 415488
61468 415488 415582 415952 416669 417333 417670 417560 416640 414664 412345 411016 411183 412024 412537 412609 412701 413120 413955 415121
61450 415121 416102 416194 415465 414883 415048 415363 415053 414485 414674 415857 417351 418679 419998 421481 423041 424776 427082
61433 427082 430152 433802 437787 441747 444899 446585 447273 448293 450211 452150 453063 453061 452927 452953 452986 453226 454085
61416 454085 455355 456292 456677 457183 458518 460694 463275 465839 467929 468969 468703 467543 466127 464677 462992
$$ packed form
61534D21208J469J640K377L097K982K263J754J533J079L35l16r63k012l216l694
61519D29536l100k007j101n74m54p94j370j661j438r99p15o34o30n81l48J14N42
61502D13786N41O0n45r59j220j563k078k494k254j091L79J043N53k38m48k48k25
61485D02999j79N65J869K742K592J719O13m43j011o52L05R42R09P33P74O98L13
61468D15488R4L70P17O64L37j10r20j976k319j329J67Q41N13P2R2M19Q35J166
61450D15121R81R2p29n82J65L15l10n68J89J183J494J328J319J483J560J735K306
61433D27082L070L650L985L960L152J686O88J020J918J939R13kj34K6L3K40Q59
61416D54085J270R37L85N06J335K176K581K564K090J040k66j160j416j450j685
$$ plain form
61401 462992 460897 458360 455307 451717 447950 444600 441883 439469 437073 434959 433523 432562 431349 429493
61387 429493 427404 425787 424965 424894 425565 427032 429025 430852 431845 431839 431204 430476 430015 429949 430361 431389 433023 434850
61369 434850 436266 437076 437718 438708 440036 441319 442389 443368 444295 445096 445962 447361 449533 452209 455006 457868
61353 457868 461041 464808 469346 474547 479888 484786 489278 494101 499943 506921 514945 524166 534678 546068
61339 546068 557688 569146 580113 589832 597431 602799 606718 609983 612699 614452 614839 613673 611030 607318
61325 607318 603103 598705 594068 589120 584123 579563 575828 573039 570982 569182 567204 565060 563207 562070
61311 562070 561726 562115 563316 565376 567971 570530 572798 575174 578389 582871 588503 594987 602315 610724 620198
61296 620198 630236 640264 650117 659877 669220 677136 682351 684081 682443 678294 672606 665910 658340 650219
$$ packed form
61401D62992k095k537l053l590l767l350k717k414k396k114j436r61j213j856
61387D29493k089j617q22p1O71J467J993J827R93oo35p28m61o6M12J028J634J827
61369D34850J416Q10O42R90J328J283J070R79R27Q01Q66J399K172K676K797K862
61353D57868L173L767M538N201N341M898M492M823N842O978Q024R221J0512J1390
61339E46068J1620J1458J0967R719P599N368L919L265K716J753L87j166k643l712
61325F07318m215m398m637m948m997m560l735k789k057j800j978k144j853j137
61311E62070l44L89J201K060K595K559K268K376L215M482N632O484P328Q409R474
61296F20198J0038J0028R853R760R343P916N215J730j638m149n688o696p570q121
$$ plain form
61282 650219 642284 635132 628631 622308 616289 611486 608749 608031 608492 609224 609865 610746 612538 615551 619290
61267 619290 622857 625845 628676 632084 636505 642027 648589 656004 663920 671964 679848 687406 694740 702384
61253 702384 710987 720708 731216 742406 754700 768219 781884 793740 802171 806577 807201 804786 800339
61240 800339 794631 787708 779146 768992 758144 747666 737980 728983 720740 713679 708122 703896 700507
61227 700507 697636 695412 694253 694426 695673 697329 698967 700951 704183 709208 715680 722764 729858 736775
61213 736775 743412 749634 755501 761212 766625 771066 774004 775867 777915 781232 785902 791107 795842 799588
61199 799588 802583 805617 809420 814135 819409 825069 831651 840219 851630 865963 882584 900776 920290
61186 920290 941260 963584 986616 1009631 1032378 1054811 1076308 1095569 1111493 1123960 1133620 1141101
$$ packed form
61282F50219p935p152o501o323o019m803k737p18M61P32O41Q81J792L013L739
61267F19290L567K988K831L408M421N522O562P415P916Q044P884P558P334P644
61253G02384Q603R721J0508J1190J2294J3519J3665J1856Q431M406O24k415m447
61240H00339n708o923q562j0154j0848j0478r686q997q243p061n557m226l389
61227G00507k871k224j159J73J247J656J638J984L232N025O472P084P094O917
61213G36775O637O222N867N711N413M441K938J863K048L317M670N205M735L746
61199G99588K995L034L803M715N274N660O582Q568J1411J4333J6621J8192J9514
61186I20290K0970K2324K3032K3015K2747K2433K1497J9261J5924J2467R660P481
$$ plain form
61174 1141101 1146619 1150210 1152049 1152501 1151929 1150465 1147871 1143667 1137427 1128940 1118088 1104791 1089223 1071965
61160 1071965 1053684 1034633 1014595 993396 971360 949198 927505 906484 886149 866712 848700
61149 848700 832745 819334 808675 800618 794622 789970 786211 783394 781818 781640 782858 785477 789283 793364
61135 793364 796243 796799 795001 791616 787415 782971 779010 776380 775480 776132 778317 782746 790252 800816 813722
61120 813722 828682 846238 866813 889882 914511 940346 967620 996363 1026222 1056995 1088822
61109 1088822 1121720 1155349 1189246 1222900 1255544 1286391 1315234 1342387 1367851 1390970 1411126
61098 1411126 1428309 1442627 1453745 1461301 1465594 1467338 1466694 1462881 1454639 1440938 1421469 1396805 1368071
61085 1368071 1336343 1302446 1267307 1232054 1197570 1164200 1132011 1100948 1070719 1041172 1013107
$$ packed form
61174A141101N518L591J839M52n72j464k594m204o240q487j0852j3297j5568j7258
61160A071965j8281j9051k0038k1199k2036k2162k1693k1021k0335j9437j8012
61149H48700j5955j3411j0659q057n996m652l759k817j576j78J218K619L806M081
61135G93364K879N56j798l385m201m444l961k630r00O52K185M429P506J0564J2906
61120H13722J4960J7556K0575K3069K4629K5835K7274K8743K9859L0773L1827
61109A088822L2898L3629L3897L3654L2644L0847K8843K7153K5464K3119K0156
61098A411126J7183J4318J1118P556M293J744o44l813q242j3701j9469k4664k8734
61085A368071l1728l3897l5139l5253l4484l3370l2189l1063l0229k9547k8065
$$ plain form
61074 1013107 988023 966557 947734 930301 914167 899943 887772 877543 869722 864785 862005 859920
61062 859920 857993 856900 857123 858208 859622 861537 864533 869161 875922 884994 895808 907498 919862 933348
61048 933348 948097 963738 980175 997839 1017003 1037586 1059862 1084657 1112620 1143791 1177966
61037 1177966 1214759 1253228 1292218 1331448 1371711 1413805 1457826 1503544 1550827 1599567 1649803
61026 1649803 1702032 1756819 1814145 1873829 1936375 2002478 2071662 2142293 2212961 2283129 2352878
61015 2352878 2423476 2498154 2580869 2674088 2778960 2897441 3032461 3185903 3358545 3552804
61005 3552804 3774252 4030720 4332467 4693743 5131361 5660525 6294252 7047441 7938609
60996 7938609 8988083 10220986 11674800 13395816 15417864 17741902 20330512 23096178
$$ packed form
61074A013107k5084k1466j8823j7433j6134j4224j2171j0229p821m937k780k085
61062H59920j927j093K23J085J414J915K996M628O761R072J0814J1690J2364J3486
61048I33348J4749J5641J6437J7664J9164K0583K2276K4795K7963L1171L4175
61037A177966L6793L8469L8990L9230M0263M2094M4021M5718M7283M8740N0236
61026A649803N2229N4787N7326N9684O2546O6103O9184P0631P0668P0168O9749
61015B352878P0598P4678Q2715R3219J04872J18481J35020J53442J72642J94259
61005C552804K21448K56468L01747L61276M37618N29164O33727P53189Q91168
60996G938609J049474J232903J453814J721016K022048K324038K588610K765666
$$ plain form
60988 23096178 25861421 28330145 30150713 31081803 31145791 30630279 29930584 29369770 29121105
60979 29121105 29218799 29562787 29896122 29839144 29038482 27351594 24918028 22063364 19129996
60970 19129996 16364233 13899239 11785485 10019579 8565261 7374457 6402526 5610960
60962 5610960 4964892 4434539 3997606 3636875 3336398 3081965 2863397 2673676 2506660
60953 2506660 2357456 2223776 2104703 1998576 1903538 1819275 1746425 1684646 1632356 1587624
60943 1587624 1547988 1510138 1471337 1430885 1389274 1346609 1302990 1259638 1218080 1178518 1140164
60932 1140164 1102838 1067067 1032926 1000055 968581 938920 910801 883512 857079 832260 809386
60921 809386 788094 768092 749477 732271 716341 701688 688322 676012 664685 654744 646506 639593
$$ packed form
60988B3096178K765243K468724J820568R31090O3988n15512o99695n60814k48665
60979B9121105R7694L43988L33335n6978q00662j686888k433566k854664k933368
60970A9129996k765763k464994k113754j765906j454318j190804r71931p91566
60962E610960o46068n30353m36933l60731l00477k54433k18568j89721j67016
60953B506660j49204j33680j19073j06127r5038q4263p2850o1779n2290m4732
60943A587624l9636l7850l8801m0452m1611m2665m3619m3352m1558l9562l8354
60932A140164l7326l5771l4141l2871l1474k9661k8119k7289k6433k4819k2874
60921H09386k1292k0002j8615j7206j5930j4653j3366j2310j1327r941q238o913
$$ plain form
60909 639593 633387 627682 622411 617298 612424 608580 606299 605039 604024 603298 603130 603007 602250 601127 600300
60894 600300 599540 598042 595687 592927 589741 585850 581759 578342 575462 572155 568184 564357 561200 558383
60880 558383 555595 552959 550434 547746 545051 542811 540840 538467 535805 533904 533368 533745 534550 535918 537886
60865 537886 539977 541975 544293 547050 549609 551567 553416 555571 557437 558214 558088 557752 557106 555321 552121
60850 552121 548264 544551 540930 536838 532188 527716 524300 522089 520465 518826 517104 515354 513212 510243
60836 510243 506669 503236 500429 498243 496632 495584 494774 493692 492264 490965 490294 490661 492690 496876 502720
60821 502720 508862 514428 519754 525449 531354 536854 541794 546463 550873 554646 557610 560116 562634 565226
60807 565226 567482 568929 569440 569272 568714 567820 566605 565365 564524 564184 563939 563111 561085 557625 553024 547771
$$ packed form
60909F39593o206n705n271n113m874l844k281j260j015p26j68j23p57j123q27
60894F00300p60j498k355k760l186l891m091l417k880l307l971l827l157k817
60880E58383k788k636k525k688k695k240j971k373k662j901n36L77Q05J368J968
60865E37886K091J998K318K757K559J958J849K155J866P77j26l36o46j785l200
60850E52121l857l713l621m092m650m472l416k211j624j639j722j750k142k969
60836E10243l574l433k807k186j611j048q10j082j428j299o71L67K029M186N844
60821E02720O142N566N326N695N905N500M940M669M410L773K964K506K518K592
60807E65226K256J447N11j68n58q94j215j240q41l40k45q28k026l460m601n253
$$ plain form
60791 547771 541903 535023 527193 519423 512710 506888 500997 494609 488184 482261 477015 472572 469063 466134
60777 466134 462983 459146 454931 450989 447785 445421 443510 441282 438357 435486 433969 434274 435726 437597
60763 437597 439832 442533 445392 448014 450373 452674 455088 457781 460930 464586 468794 473749 479380 484965
60749 484965 489800 494275 499576 506181 513363 520315 527040 533885 540924 548169 555700 563142 569532 574064
60735 574064 576568 577105 575811 573432 571207 569668 568119 565731 562561 559099 555492 551776 548178 544557
60721 544557 540221 535029 530026 526113 522591 517958 511805 504960 498057 490985 483721 476721 470326 464501
60707 464501 459340 455138 451804 448768 445665 442689 440196 438364 437268 436821 436658 436534 436887 438449 441211
60692 441211 444266 446844 449088 451673 455039 459105 463427 467565 471634 476503 482950 490537 497874 504231
$$ packed form
60791E47771n868o880p830p770o713n822n891o388o425n923n246m443l509k929
60777D66134l151l837m215l942l204k364j911k228k925k871j517L05J452J871
60763D37597K235K701K859K622K359K301K414K693L149L656M208M955N631N585
60749D84965M835M475N301O605P182O952O725O845P039P245P531P442O390M532
60735E74064K504N37j294k379k225j539j549k388l170l462l607l716l598l621
60721E44557m336n192n003l913l522m633o153o845o903p072p264p000o395n825
60707D64501n161m202l334l036l103k976k493j832j096m47j63j24L53J562K762
60692D41211L055K578K244K585L366M066M322M138M069M869O447P587P337O357
$$ plain form
60678 504231 510363 517363 525103 532274 537693 541056 542520 542171 540153 536955 533119 528672 523141 516325
60664 516325 508893 501983 496260 491568 487485 483845 480555 477309 473931 470810 468540 467078 465629 463517
60650 463517 461005 459132 458808 460124 462450 465139 468086 471429 474811 477333 478550 479183 480428 482629 485008
60635 485008 486656 487408 487726 488177 489172 490818 492753 494391 495603 497022 499484 503263 508046 513442 519203
60620 519203 525043 530657 536082 541788 548195 555227 562554 570143 578275 586976 595765 604166 612296 620731
60606 620731 629849 639486 649203 658686 667860 676728 685118 692558 698453 702523 705033 706584 707754 708920
60592 708920 710154 711146 711588 711858 713023 715837 720078 725289 731749 740020 749749 759867 770027 781006
60578 781006 793485 807281 822248 839078 858449 879916 902435 925782 950704 977727 1006386
$$ packed form
60678E04231O132P000P740P171N419L363J464l49k018l198l836m447n531o816
60664E16325p432o910n723m692m083l640l290l246l378l121k270j462j449k112
60650D63517k512j873l24J316K326K689K947L343L382K522J217O33J245K201K379
60635D85008J648P52L18M51R95J646J935J638J212J419K462L779M783N396N761
60620E19203N840N614N425N706O407P032P327P589Q132Q701Q789Q401Q130Q435
60606F20731R118R637R717R483R174Q868Q390P440N895M070K510J551J170J166
60592G08920J234R92M42K70J165K814M241N211O460Q271R729J0118J0160J0979
60578G81006J2479J3796J4967J6830J9371K1467K2519K3347K4922K7023K8659
$$ plain form
60567 1006386 1035733 1065157 1094594 1124185 1153887 1183302 1211797 1238679 1263002 1283220 1297423
60556 1297423 1304110 1302540 1292310 1273184 1245785 1212195 1175516 1138842 1104573 1074095 1047663 1024868
60544 1024868 1005665 990773 980950 976334 976797 982404 992991 1007727 1025740 1046775 1070451 1095034
60532 1095034 1117713 1136112 1148962 1155419 1154620 1146297 1131377 1111709 1089429 1066543 1044639 1024744
60520 1024744 1007630 994101 984574 978388 974058 970424 967308 965073 964002 964254 966040 969538 974736 981435
60506 981435 989279 997902 1007306 1018077 1031010 1046597 1065203 1087617 1115099 1148951 1190429 1240862
60494 1240862 1301178 1371101 1449271 1534233 1624836 1719339 1814541 1906086 1989396 2060176 2114471
60483 2114471 2148879 2160967 2149513 2114548 2057391 1980631 1888042 1784363 1674831 1564414 1457177
$$ packed form
60567A006386K9347K9424K9437K9591K9702K9415K8495K6882K4323K0218J4203
60556A297423O687j570j0230j9126k7399l3590l6679l6674l4269l0478k6432k2795
60544A024868j9203j4892r823m616M63N607J0587J4736J8013K1035K3676K4583
60532A095034K2679J8399J2850O457p99q323j4920j9668k2280k2886k1904j9895
60520A024744j7114j3529r527o186m330l634l116k235j071K52J786L498N198O699
60506I81435P844Q623R404J0771J2933J5587J8606K2414K7482L3852M1478N0433
60494A240862O0316O9923P8170Q4962R0603R4503R5202R1545Q3310P0780N4295
60483B114471L4408J2088j1454l4965n7157p6760r2589j03679j09532j10417j07237
$$ plain form
60472 1457177 1356180 1263620 1180696 1107363 1042622 985309 934711 890646 853106 821582 794502
60461 794502 769711 746010 724057 705279 689997 677103 665396 654505 644502 635392 627255 620297
60449 620297 614427 609260 604731 601126 598262 595217 591415 587401 584047 581393 578965 576834 575517 574902
60435 574902 574133 572830 571744 571788 572779 573619 573526 572689 571732 570950 570146 568970 567161 564655 561699 558840 556559
60418 556559 554894 553570 552449 551635 551136 550797 550655 550986 551809 552731 553579 554828 556929 559484 561571 562710
60402 562710 563053 562781 561922 560789 560012 559922 560211 560361 560188 559980 560312 561635 563738 565733 566942 567641 568528
60385 568528 569704 570794 571859 573335 575067 576309 576976 578088 580494 583799 587033 589868 592634 595561
60371 595561 598556 601524 604479 607525 610966 615192 620193 625534 630944 636487 641903 646354 649241 650788
$$ packed form
60472A457177j00997r2560q2924p3333o4741n7313n0598m4065l7540l1524k7080
60461G94502k4791k3701k1953j8778j5282j2894j1707j0891j0003r110q137o958
60449F20297n870n167m529l605k864l045l802m014l354k654k428k131j317o15
60435E74902p69j303j086M4R91Q40r3q37r57p82q04j176j809k506k956k859k281
60418E56559j665j324j121q14m99l39j42L31Q23R22Q48J249K101K555K087J139
60402E62710L43k72q59j133p77r0K89J50j73k08L32J323K103J995J209O99Q87
60385E68528J176J090J065J476J732J242O67J112K406L305L234K835K766K927
60371E95561K995K968K955L046L441M226N001N341N410N543N416M451K887J547
$$ plain form
60357 650788 651391 650910 649158 646575 643747 640619 636921 633111 630096 628141 626754 625622 624970 625082 626104
60342 626104 628335 631938 636227 639961 642623 644828 647218 649581 651489 653198 655278 657625 659496 660542
60328 660542 661336 662730 664936 667324 668915 669031 667697 665623 663710 662349 661135 659354 656832 654192 652301
60313 652301 651691 652664 655644 660958 668381 677422 688113 701038 716504 734372 754989 779601 809243
60300 809243 843628 881596 921925 962697 1000245 1030053 1049106 1056638 1052562 1036354 1008265 970865
60288 970865 928460 885049 843324 805136 771971 744707 723347 707211 695203 685982 678306 671464
60276 671464 665307 659914 655400 651975 649793 648579 647640 646453 645152 644279 644113 644356 644475 644203 643682 643209
60260 643209 642921 642728 642486 642158 641880 641882 642310 642996 643381 642860 641300 639200 637232 635639 634203 632721 631296
$$ packed form
60357F50788O03m81j752k583k828l128l698l810l015j955j387j132o52J12J022
60342F26104K231L603M289L734K662K205K390K363J908J709K080K347J871J046
60328F60542P94J394K206K388J591J16j334k074j913j361j214j781k522k640j891
60313F52301o10R73K980N314P423R041J0691J2925J5466J7868K0617K4612K9642
60300H09243L4385L7968M0329M0772L7548K9808J9053P532m076j6208k8089l7400
60288I70865m2405m3411m1725l8188l3165k7264k1360j6136j2008r221p676o842
60276F71464o157n393m514l425k182j214r39j187j301q73j66K43J19k72n21m73
60260F43209k88j93k42l28k78KM28O86L85n21j560k100j968j593j436j482j425
$$ plain form
60243 631296 630107 629069 627952 626743 625750 625225 625016 624671 623912 622997 622554 623010 624157 625425 626622 628253
60227 628253 630934 634634 638720 642701 646551 650242 653307 655145 655593 655077 654365 654274 655238 656890 658292 658910
60211 658910 659197 659921 661187 662551 663865 665440 667449 669714 672177 675014 678124 681007 683350 685321 687113
60196 687113 688666 690099 691920 694378 696988 699095 700641 701961 703066 703578 703218 702008 700152 698080 696395
60181 696395 695323 694308 692602 690259 688120 686793 686029 685197 684058 682905 682169 682006 682204 682463 682852 683847
60165 683847 685736 688132 690333 692033 693335 694162 694142 693163 691645 690091 688607 687000 685112 682937 680703
60150 680703 678974 678400 679107 680495 681867 683175 684995 687878 691903 696747 702068 707846 714461 722296 731163
60135 731163 740296 749161 758189 768372 779982 791867 802088 809149 812584 812668 809906 804767 797605 788713
$$ packed form
60243F31296j189j038j117j209r93n25k09l45p59r15m43M56J147J268J197J631
60227F28253K681L700M086L981L850L691L065J838M48n16p12r1R64J652J402O18
60211F58910K87P24J266J364J314J575K009K265K463K837L110K883K343J971J792
60196F87113J553J433J821K458K610K107J546J320J105N12l60j210j856k072j685
60181F96395j072j015j706k343k139j327p64q32j139j153p36j63J98K59L89R95
60165F83847J889K396K201J700J302Q27k0r79j518j554j484j607j888k175k234
60150F80703j729n74P07J388J372J308J820K883M025M844N321N778O615P835Q867
60135G31163R133Q865R028J0183J1610J1885J0221P061L435Q4k762n139p162q892
$$ plain form
60121 788713 778636 768498 759766 753422 749355 746725 744811 743414 742585 742285 742357 742660 743184 744174 746017
60106 746017 748807 752047 755033 757490 759486 760864 761315 761136 761334 762542 764214 765291 765388 764871 764078 763111
60090 763111 762321 762413 763818 766335 769567 773434 778119 783787 790561 798478 807116 815299 821533 824979 825996
60075 825996 825580 824215 821445 816719 810414 803611 796867 789715 781608 772885 764360 756245 748069 739578
60061 739578 731161 723325 716142 709417 703040 697027 691418 686325 681927 678338 675561 673582 672276 671192
60047 671192 669742 667764 665719 664180 663273 662785 662659 663126 664359 666226 668496 671147 674274 677671 680771
60032 680771 683190 685207 687418 689910 692108 693471 693928 693500 691875 688816 684645 679830 674224 667215 658588
60017 658588 648740 638038 626580 614819 603936 595063 588257 582597 577254 572213 567955 564668 561980
$$ packed form
60121G88713j0077j0138q732o344m067k630j914j397q29l00P2L03N24R90J843
60106G46017K790L240K986K457J996J378M51j79J98J208J672J077R7n17p93r67
60090G63111p90R2J405K517L232L867M685N668O774P917Q638Q183O234L446J017
60075H25996m16j365k770m726o305o803o744p152q107q723q525q115q176q491
60061G39578q417p836p183o725o377o013n609n093m398l589k777j979j306j084
60047F71192j450j978k045j539r07m88j26M67J233J867K270K651L127L397L100
60032F80771K419K017K211K492K198J363M57m28j625l059m171m815n606p009q627
60017F58588r848j0702j1458j1761j0883q873o806n660n343n041m258l287k688
$$ plain form
60004 561980 559459 557157 555456 554406 553537 552494 551593 551475 552382 554100 556466 559430 562651 565502 567689
59989 567689 569524 571447 573557 575762 578052 580345 582310 583732 584964 586663 588970 591108 591992 591270 589689
59974 589689 588365 587684 587050 585716 583644 581441 579663 578462 577690 577075 576381 575764 575814 576868 578372 579442
59958 579442 580045 581026 582808 584697 585817 586209 586485 586693 586191 584632 582604 581106 580621 580823 581066 581058 581007 581127
59940 581127 581213 580995 580809 581406 582892 584282 584485 583465 582088 581023 580234 579400 578343 577001 575392 573779
59924 573779 572584 572003 571828 571785 571921 572584 574064 576276 578749 580969 582809 584467 585918 586711 586649 586448 587217
59907 587217 589218 591591 593423 594654 595710 596693 597422 597984 598741 599804 600922 601963 603144 604700 606594
59892 606594 608690 610950 613365 615927 618809 622332 626610 631433 636618 642193 648033 653681 658924 664253
$$ packed form
60004E61980k521k302j701j050q69j043r01j18R07J718K366K964L221K851K187
59989E67689J835J923K110K205K290K293J965J422J232J699K307K138Q84p22j581
59974E89689j324o81o34j334k072k203j778j201p72o15o94o17N0J054J504J070
59958E79442O03R81J782J889J120L92K76K08n02j559k028j498m85K02K43qn1J20
59940E81127Q6k18j86N97J486J390K03j020j377j065p89q34j057j342j609j613
59924E73779j195n81j75m3J36O63J480K212K473K220J840J658J451P93o2k01P69
59907E87217K001K373J832J231J056R83P29N62P57J063J118J041J181J556J894
59892F06594K096K260K415K562K882L523M278M823N185N575N840N648N243N329
$$ plain form
59878 664253 670323 677127 684148 691190 698419 705625 712097 717377 721502 724198 724493 721619 715899 708316
59864 708316 699658 690576 682009 674788 668965 664152 660384 657969 656545 655068 652985 650887 649749 649905
59850 649905 650939 652233 653506 655182 658389 664180 672557 682549 693295 704679 716786 729226 741180
59837 741180 751660 759471 763529 763768 761569 758986 757754 759031 763265 769527 775310 777862 775890 769742
59823 769742 760343 748659 735981 723714 712449 701794 691378 681462 672257 663213 653666 643963 635328
59810 635328 628625 623700 619963 617114 615081 613547 611894 609620 606735 603762 601353 599788 598757 597651
59796 597651 596051 593890 591304 588560 586027 583816 581360 577821 573212 568734 565503 563237 560771 557762
59782 557762 555136 553761 553318 552854 551897 550606 549262 548112 547450 547346 547440 547390 547334 547510 547695 547504 547065 546849
$$ packed form
59878F64253O070O804P021P042P229P206O472N280M125K696K95k874n720p583
59864G08316q658r082q567p221n823m813l768k415j424j477k083k098j138J56
59850F49905J034J294J273J676L207N791Q377R992J0746J1384J2107J2440J1954
59837G41180J0480P811M058K39k199k583j232J277M234O262N783K552j972o148
59823G69742r399j1684j2678j2267j1265j0655j0416r916r205r044r547r703q635
59810F35328o703m925l737k849k033j534j653k274k885k973k409j565j031j106
59796E97651j600k161k586k744k533k211k456l539m609m478l231k266k466l009
59782E57762k626j375m43m64r57j291j344j150o62j04R4n0n6J76J85j91m39k16
$$ plain form
59764 546849 546904 546822 546476 546273 546585 547377 548492 549870 551413 553033 554882 557119 559379 560969 561749 562378 563531
59747 563531 565300 567493 569943 572293 573998 574976 575839 577085 578453 579509 580531 582225 584750 587533 589979
59732 589979 591914 593368 594315 594732 594593 593782 592223 590196 588348 587298 587169 587468 587447 586784 585907 585434 585217
59715 585217 584293 581987 578793 575927 574259 573941 574779 576500 578727 581090 583423 585641 587473 588567 588927
59700 588927 589065 589614 590783 592168 593156 593679 594517 596567 599808 603336 606460 609287 611959 613874 614214 612976
59684 612976 610965 608977 607496 606990 607790 609551 611394 612841 614229 615976 617771 618824 618736 617778 616316
59669 616316 614244 611166 607092 602791 599286 597046 595794 595071 594704 594639 594605 594226 593369 592191 590920 589788
59653 589788 589059 588932 589411 590412 591987 594335 597578 601542 605644 609048 611139 611946 611945 611430 610298 608428
$$ packed form
59764E46849N5q2l46k03L12P92J115J378J543J620J849K237K260J590P80O29J153
59747E63531J769K193K450K350J705R78Q63J246J368J056J022J694K525K783K446
59732E89979J935J454R47M17j39q11j559k027j848j050j29K99k1o63q77m73k17
59715E85217r24k306l194k866j668l18Q38J721K227K363K333K218J832J094L60
59700E88927J38N49J169J385R88N23Q38K050L241L528L124K827K672J915L40j238
59684F12976k011j988j481n06Q00J761J843J447J388J747J795J053q8r58j462
59669F16316k072l078m074m301l505k240j252p23l67o5l4l79q57j178j271j132
59653E89788p29j27M79J001J575K348L243L964M102L404K091Q07jn15j132j870
$$ plain form
59637 608428 605880 602650 598688 594415 590779 588389 586919 585698 584572 583761 583237 582822 582728 583372 584688 586125
59621 586125 587369 588631 590181 592001 593954 595928 597739 599162 600071 600305 599514 597561 595087 593250 592755
59606 592755 593444 594834 596701 599046 601913 605385 609481 613829 617642 620125 620876 619970 617948 615647 613671
59591 613671 611955 610106 608157 606632 605902 605935 606721 608359 610503 612201 612712 612155 610979 609064 605823 601082
59575 601082 595421 589618 584102 579009 574470 570654 567642 565378 563693 562330 561045 559775 558725 558245
59561 558245 558580 559735 561531 563669 565722 567219 568010 568588 569790 572030 574933 577818 580350 582562 584512
59546 584512 586251 588066 590431 593629 597615 602256 607583 613815 621327 630612 642120 656084 672544
59533 672544 691391 711977 732411 749369 759117 759530 751747 739838 728375 719941 714820 712602 713332
$$ packed form
59637F08428k548l230l962m273l636k390j470j221j126q11n24m15r4O44J316J437
59621E86125J244J262J550J820J953J974J811J423R09K34p91j953k474j837m95
59606E92755O89J390J867K345K867L472M096M348L813K483P51r06k022k301j976
59591F13671j716j849j949j525p30L3P86J638K144J698N11n57j176j915l241m741
59575F01082n661n803n516n093m539l816l012k264j685j363j285j270j050m80
59561E58245L35J155J796K138K053J497P91N78J202K240K903K885K532K212J950
59546E84512J739J815K365L198L986M641N327O232P512R285J1508J3964J6460
59533F72544J8847K0586K0434J6958R748M13p783j1909j1463q434n121k218P30
$$ plain form
59520 713332 717031 722990 730248 738366 747098 755611 762690 767612 770313 770798 769017 765247 760043 753716
59506 753716 746340 738276 730149 722212 714159 705713 697049 688484 680138 671997 664059 656332 648975 642438
59492 642438 637163 633127 629910 627149 624670 622388 620442 619211 618751 618488 618074 618267 620122 623466 627139
59477 627139 630804 635470 641916 649579 657530 665665 674210 682712 690242 696211 700447 702936 704083 704758
59463 704758 705405 705509 704698 704005 705254 709278 715492 723202 732622 744456 758922 775415 792873 810549
59449 810549 828663 848219 869878 893156 916889 940116 961968 980934 994875 1001830 1000492 990211
59437 990211 971355 945884 916992 887702 859828 834120 810890 790263 772137 756259 742369
59426 742369 730372 720477 713069 708307 705966 705900 708429 713958 722439 733629 747635 764642 784221
$$ packed form
59520G13332L699N959P258Q118Q732Q513P079M922K701M85j781l770n204o327
59506G53716p376q064q127p937q053q446q664q565q346q141p938p727p357o537
59492F42438n275m036l217k761k479k282j946j231m60k63m14J93J855L344L673
59477F27139L665M666O446P663P951Q135Q545Q502P530N969M236K489J147O75
59463G04758O47J04q11o93J249M024O214P710R420J1834J4466J6493J7458J7676
59449H10549J8114J9556K1659K3278K3733K3227K1852J8966J3941O955j338j0281
59437I90211j8856k5471k8892k9290k7874k5708k3230k0627j8126j5878j3890
59426G42369j1997r895p408m762k341o6K529N529Q481J1190J4006J7007J9579
$$ plain form
59413 784221 805567 828441 853213 879903 907920 936821 966138 993508 1013766 1021416 1014679 996882
59401 996882 973934 950864 930502 914232 902931 897059 896238 898782 901463 899890 889859 869280 839450
59388 839450 804591 769723 738236 710888 686827 665497 647515 633853 624486 618121 613146 608585
59376 608585 604183 600027 596378 593672 592274 592097 592639 593407 594243 595269 596675 598556 600803 603104 605173
59361 605173 606990 608783 610848 613476 616894 621050 625574 630292 635703 642587 651063 660502 670567 681921
59347 681921 695537 711595 729468 748621 769023 790594 812682 834312 854816 874047 892083
59336 892083 908848 924021 937120 947564 954614 957466 955745 949981 941397 931021 919082 905339
59324 905339 889833 873062 855622 838034 820939 805074 790771 777722 765552 754504 745170 737521
$$ packed form
59413G84221K1346K2874K4772K6690K8017K8901K9317K7370K0258P650o737j7797
59401I96882k2948k3070k0362j6270j1301n872q21K544K681j573j0031k0579k9830
59388H39450l4859l4868l1487k7348k4061k1330j7982j3662r367o365m975m561
59376F08585m402m156l649k706j398j77N42P68Q36J026J406J881K247K301K069
59361F05173J817J793K065K628L418M156M524M718N411O884Q476R439J0065J1354
59347F81921J3616J6058J7873J9153K0402K1571K2088K1630K0504J9231J8036
59336H92083J6765J5173J3099J0444P050K852j721n764q584j0376j1939j3743
59324I05339j5506j6771j7440j7588j7095j5865j4303j3049j2170j1048r334p649
$$ plain form
59312 737521 730671 723916 717651 712782 709411 706781 704529 703314 703823 705731 708203 711064 714850 719904
59298 719904 726099 733466 742522 753804 767489 783496 801551 821019 840860 859595 874841 883246
59286 883246 881950 870754 852555 831414 810472 791566 775816 763828 755690 751295 750472 752550 756332
59273 756332 761109 767420 776237 787612 800683 814858 830315 847283 865330 883568 901254 918049
59261 918049 933790 948017 959601 967040 969416 967052 960966 951842 939815 925240 909234 893237
59249 893237 878120 863828 849908 836373 823983 813536 804995 797570 790705 784613 779812 776578 775109
59236 775109 775706 778390 782613 787714 793406 799461 805366 810810 816197 821929 827260 830569 830874 828538 824370
59221 824370 818592 810952 801395 790211 777724 764188 750009 735848 722429 710181 699104 689057
$$ packed form
59312G37521o850o755o265m869l371k630k252j215N09J908K472K861L786N054
59298G19904O195P367R056J1282J3685J6007J8055J9468J9841J8735J5246Q405
59286H83246j296j1196j8199k1141k0942j8906j5750j1988q138m395q23K078L782
59273G56332M777O311Q817J1375J3071J4175J5457J6968J8047J8238J7686J6795
59261I18049J5741J4227J1584P439K376k364o086r124j2027j4575j6006j5997
59249H93237j5117j4292j3920j3535j2390j0447q541p425o865o092m801l234j469
59236G75109N97K684M223N101N692O055N905N444N387N732N331L309L05k336m168
59221H24370n778p640r557j1184j2487j3536j4179j4161j3419j2248j1077j0047
$$ plain form
59209 689057 680182 672822 666913 661727 656437 650785 645014 639431 634340 630140 627006 624606 622465 620558
59195 620558 619144 618153 617243 616462 616404 617522 619635 622288 625379 629234 634115 639716 645154 649675 653472
59180 653472 657582 662764 668726 674674 680263 685613 690776 695747 700873 706621 713044 719995 727771 736947
59166 736947 747569 759156 771487 784749 798749 812743 826296 839667 852962 865483 876342
59155 876342 885247 892155 896616 898054 896514 892603 886773 879142 869958 859779 849056 837898 826400
59142 826400 815069 804649 795524 787400 779724 772445 766093 761020 756845 752986 749477 746788 744953 743525
59128 743525 742377 741891 742183 742841 743747 745564 748889 753509 759109 766277 775991 788236 801855 815785
59114 815785 829890 844544 859995 876300 893264 910146 925859 939828 952400 964074 974610
$$ packed form
59209F89057q875p360n909n186n290n652n771n583n091m200l134k400k141j907
59195F20558j414r91r10p81n8J118K113K653L091L855M881N601N438M521L797
59180F53472M110N182N962N948N589N350N163M971N126N748O423O951P776R176
59166G36947J0622J1587J2331J3262J4000J3994J3553J3371J3295J2521J0859
59155H76342Q905O908M461J438j540l911n830p631r184j0179j0723j1158j1498
59142H26400j1331j0420r125q124p676p279o352n073m175l859l509k689j835j428
59128G43525j148m86K92O58R06J817L325M620N600P168R714J2245J3619J3930
59114H15785J4105J4654J5451J6305J6964J6882J5713J3969J2572J1674J0536
$$ plain form
59103 974610 983271 989783 994606 998205 1000473 1001064 1000037 997875 994991 991455 987209 982295 976817 970873
59089 970873 964697 958667 952963 947306 941295 934979 928813 922987 917118 910753 903894 896680 888742 879300
59075 879300 868014 855473 842741 830604 819337 808894 799011 789255 779353 769584 760639 752990 746558
59062 746558 741017 736178 731947 728180 724822 722052 720010 718425 716801 714915 712911 710970 709123 707364
59048 707364 705645 703764 701522 698950 696149 693005 689482 686103 683612 682067 680822 679567 678742 678665 678891
59033 678891 678969 679313 680661 683063 686084 689796 694787 701141 708020 714464 720304 726263 733445 742573 753340
59018 753340 764498 774930 784565 793908 802953 811141 818236 824516 829923 833752 835553 835895 835805 835721 835416
59003 835416 834827 834642 836005 839687 845481 852399 859627 867324 876261 886678 897713 908089 917133 925032
$$ packed form
59103I74610Q661O512M823L599K268N91j027k162k884l536m246m914n478n944
59089I70873o176o030n704n657o011o316o166n826n869o365o859p214p938r442
59075H79300j1286j2541j2732j2137j1267j0443r883r756r902r769q945p649o432
59062G46558n541m839m231l767l358k770k042j585j624j886k004j941j847j759
59048G07364j719j881k242k572k801l144l523l379k491j545j245j255q25p7K26
59033F78891P8L44J348K402L021L712M991O354O879O444N840N959P182R128J0767
59018G53340J1158J0432R635R343R045Q188P095O280N407L829J801L42r0q4l05
59003H35416n89j85J363L682N794O918P228P697Q937J0417J1035J0376R044P899
$$ plain form
58989 925032 932292 939150 945408 950588 954129 955562 954696 951704 946894 940256 931436 920489 908540 897284
58975 897284 887742 879965 873938 870124 868767 869325 871148 874380 879675 887346 897231 909016 922143 935746
58961 935746 949324 963175 977575 991831 1004890 1016512 1026987 1035804 1041588 1043414 1041343 1035544
58949 1035544 1025766 1012019 995172 976504 957113 937869 919362 901669 884618 868387 853423
58938 853423 839820 827373 816301 807213 800191 794509 789437 784784 780569 776764 773456 770602 767535
58925 767535 763507 758831 754659 751382 748136 744270 740400 737532 735940 735436 735934 737062 738023 738690 740219
58910 740219 743734 748808 754085 759013 764096 769761 775985 783028 791605 802034 813787 826122 838825
58897 838825 852147 866305 881149 896190 910900 925128 939244 953891 969724 987358 1007289
$$ packed form
58989I25032P260O858O258N180L541J433q66k992m810o638q820j0947j1949j1256
58975H97284r542p777o027l814j357N58J823L232N295P671R885J1785J3127J3603
58961I35746J3578J3851J4400J4256J3059J1622J0475Q817N784J826k071n799
58949A035544r778j3747j6847j8668j9391j9244j8507j7693j7051j6231j4964
58938H53423j3603j2447j1072r088p022n682n072m653m215l805l308k854l067
58925G67535m028m676m172l277l246l866l870k868j592n04M98J128R61O67J529
58910G40219L515N074N277M928N083N665O224P043Q577J0429J1753J2335J2703
58897H38825J3322J4158J4844J5041J4710J4228J4116J4647J5833J7634J9931
$$ plain form
58886 1007289 1029784 1055049 1083394 1114787 1148141 1181437 1212642 1240271 1263302 1281340 1294955
58875 1294955 1304951 1310926 1311215 1304622 1291522 1272908 1249249 1220984 1189498 1156732 1124205 1092991
58863 1092991 1064191 1038590 1016049 995809 977213 959722 942722 925996 910054 895321 881220
58852 881220 866666 851295 835597 820146 805319 791603 779421 768628 758724 749585 741606 735115
58840 735115 729960 725578 721228 716391 711234 706396 702098 697852 693286 688664 684181 679451 674346 669747
58826 669747 666541 664307 661888 658982 656270 654113 652146 650258 649134 649567 651740 655280 659569 663937
58812 663937 668017 671939 675900 679754 683312 686735 690099 692917 694660 695501 695965 696172 696014 695706 695345 694263
58796 694263 691693 687975 684310 681474 679548 678571 678431 678183 676722 674358 672761 673073 674928 677560 680903
$$ packed form
58886A007289K2495K5265K8345L1393L3354L3296L1205K7629K3031J8038J3615
58875A294955R996N975K89o593j3100j8614k3659k8265l1486l2766l2527l1214
58863A092991k8800k5601k2541k0240j8596j7491j7000j6726j5942j4733j4101
58852H81220j4554j5371j5698j5451j4827j3716j2182j0793r904r139p979o491
58840G35115n155m382m350m837n157m838m298m246m566m622m483m730n105m599
58826F69747l206k234k419k906k712k157j967j888j124M33K173L540M289M368
58812F63937M080L922L961L854L558L423L364K818J743Q41M64K07j58l08l61j082
58796F94263k570l718l665k836j926r77j40k48j461k364j597L12J855K632L343
$$ plain form
58781 680903 685178 690164 695444 700832 706185 711262 716033 720585 724520 727053 727955 727781 726822 724443 719943
58766 719943 713646 706731 700279 694718 689868 685245 680613 676357 673039 670581 668375 666247 664758 664408
58752 664408 665195 667196 670889 676459 683205 690155 696967 703868 710994 718184 725213 731993 738656 745667
58738 745667 753721 763335 774551 786918 799502 811087 820849 828991 836388 843606 850585 857239 863803
58725 863803 870458 877034 883282 889153 894686 899898 904818 909424 913594 917407 921346 925834 930813 936227
58711 936227 942635 950562 959427 967932 975511 982531 988924 993526 995079 993154 987791 979039 967278 953228
58697 953228 937100 918344 896828 873757 850823 828829 807674 787334 768210 750713 735048
58686 735048 721393 709826 700049 691419 683336 675509 667910 660470 652807 644497 635836 627976 621817 617008
$$ packed form
58781F80903M275M986N280N388N353N077M771M552L935K533R02j74r59k379m500
58766G19943o297o915o452n561m850m623m632m256l318k458k206k128j489l50
58752F64408P87K001L693N570O746O950O812O901P126P190P029O780O663P011
58738G45667Q054R614J1216J2367J2584J1585R762Q142P397P218O979O654O564
58725H63803O655O576O248N871N533N212M920M606M170L813L939M488M979N414
58711I36227O408P927Q865Q505P579P020O393M602J553j925n363q752j1761j4050
58697I53228j6128j8756k1516k3071k2934k1994k1155k0340j9124j7497j5665
58686G35048j3655j1567r777q630q083p827p599p440p663q310q661p860o159m809
$$ plain form
58672 617008 612687 609004 607071 607383 609192 611654 614724 618612 623234 628705 635611 644147 653494 662563
58658 662563 670846 678098 683800 687618 689928 691296 691762 691161 689790 688162 686442 684704 683435 683145 683599
58643 683599 684013 683909 683340 682376 680868 678740 676248 673944 672516 672467 673700 675624 677797 680209 682835 685377
58627 685377 687664 689803 691519 691840 690005 686417 682213 678129 674331 671138 669242 669146 670873 674357 679793
58612 679793 687412 697057 708057 719532 730891 742003 752731 762328 769625 773895 775309 774509 772165
58599 772165 769015 765854 763094 760565 757917 755033 752007 749084 746747 745447 745075 745163 745804 747909 752289
58584 752289 758908 767294 777179 788365 800411 812916 825802 838893 851500 862763 872191 879598
58572 879598 884805 887777 888893 888878 888742 889777 893056 898610 905523 913230 922294 933559 947003 961848
$$ packed form
58672F17008m321l683j933L12J809K462L070L888M622N471O906Q536R347R069
58658F62563Q283P252N702L818K310J368M66o01j371j628j720j738j269k90M54
58643F83599M14j04n69r64j508k128k492k304j428m9J233J924K173K412K626K542
58627F85377K287K139J716L21j835l588m204m084l798l193j896r6J727L484N436
58612F79793P619R645J1000J1475J1359J1112J0728R597P297M270J414q00k344
58599G72165l150l161k760k529k648k884l026k923k337j300l72Q8O41K105M380
58584G52289O619Q386R885J1186J2046J2505J2886J3091J2607J1263R428P407
58572H79598N207K972J116j5j36J035L279N554O913P707R064J1265J3444J4845
$$ plain form
58558 961848 977401 993266 1009003 1024051 1037848 1049738 1059029 1065390 1068874 1069371 1066461 1060175 1051404
58545 1051404 1041146 1029800 1017648 1005440 993845 982632 971152 959359 947681 935966 923319
58534 923319 909146 893955 878985 865356 853552 843370 834217 825670 817892 811542 807348 805649 806060
58521 806060 807588 809405 811560 814608 818548 822652 826436 830164 834129 838011 841353 844210 846921 849609
58507 849609 852298 855213 858572 862315 866255 870237 874056 877669 881604 886577 892424 897965 902260 905446
58493 905446 908025 909919 910596 909583 906489 901168 894361 887612 881998 877379 873270 869819 867408 865897
58479 865897 864920 864482 864747 865682 867415 870401 874701 879547 884208 888713 893201 897100 899590 900428 899653 897039
58463 897039 892513 886794 880995 875948 872220 870129 869176 868193 866764 865901 866667 868837 871671 875176 879648
$$ packed form
58558I61848J5553J5865J5737J5048J3797J1890R291O361L484M97k910o286q771
58545A051404j0258j1346j2152j2208j1595j1213j1480j1793j1678j1715j2647
58534I23319j4173j5191j4970j3629j1804j0182r153q547p778o350m194j699M11
58521H06060J528J817K155L048L940M104L784L728L965L882L342K857K711K688
58507H49609K689K915L359L743L940L982L819L613L935M973N847N541M295L186
58493I05446K579J894O77j013l094n321o807o749n614m619m109l451k411j511
58479H65897r77m38K65R35J733K986M300M846M661M505M488L899K490Q38p75k614
58463H97039m526n719n799n047l728k091r53r83j429q63P66K170K834L505M472
$$ plain form
58448 879648 884619 889309 893556 897332 899963 900988 901256 901966 903020 903600 904024 905583 908599 912022 915132
58433 915132 918486 922835 928086 933712 939468 945380 951524 957935 964390 970400 975890 981624 988453 996425
58419 996425 1005172 1014746 1025309 1036298 1046660 1055636 1062662 1067035 1068562 1068216 1067239 1065923 1064016 1061827
58405 1061827 1059915 1058142 1056160 1054437 1053583 1053023 1051676 1049774 1048704 1049094 1050412 1052466 1055866 1060671 1065883
58390 1065883 1070707 1075250 1079544 1082898 1084779 1085614 1086272 1087270 1088727 1090476 1092089 1093296 1094512 1096468 1099409
58375 1099409 1103137 1107590 1112668 1117828 1122727 1128007 1134592 1142433 1150903 1160112 1170715 1182576 1194805
58362 1194805 1207082 1219780 1232808 1245554 1258091 1271221 1285090 1298895 1312257 1325815 1339982
58351 1339982 1354056 1366994 1378419 1388524 1397632 1406107 1414231 1422194 1430602 1440668 1453096 1467052
$$ packed form
58448H79648M971M690M247L776K631J025K68P10J054N80M24J559L016L423L110
58433I15132L354M349N251N626N756N912O144O411O455O010N490N734O829P972
58419I96425Q747R574J0563J0989J0362Q976P026M373J527l46r77j316j907k189
58405A061827j912j773j982j723q54n60j347j902j070L90J318K054L400M805N212
58390A065883M824M543M294L354J881Q35O58R98J457J749J613J207J216J956K941
58375A099409L728M453N078N160M899N280O585P841Q470R209J0603J1861J2229
58362A194805J2277J2698J3028J2746J2537J3130J3869J3805J3362J3558J4167
58351A339982J4074J2938J1425J0105R108Q475Q124P963Q408J0066J2428J3956
$$ plain form
58339 1467052 1481126 1495077 1509745 1525515 1541933 1558633 1575594 1592697 1610066 1628629 1649170
58328 1649170 1671005 1692744 1714108 1735741 1757484 1778278 1797719 1816314 1834192 1850936 1866703
58317 1866703 1882171 1897351 1911803 1925979 1940914 1956618 1972326 1988393 2006298 2026524 2047968
58306 2047968 2069761 2092219 2115737 2140208 2165838 2193098 2221564 2250121 2278550 2307525 2337000
58295 2337000 2366159 2395074 2424734 2455188 2485402 2515314 2546361 2579555 2614660 2651562 2690631
58284 2690631 2731233 2771762 2811882 2853201 2897071 2943247 2991170 3040925 3092331 3144705 3198162
58273 3198162 3253718 3311582 3370935 3431819 3495610 3563077 3633545 3706435 3782034 3860402 3941233
58262 3941233 4025168 4113523 4206380 4302647 4402133 4505643 4612948 4722846 4835354 4951471
$$ packed form
58339A467052J4074J3951J4668J5770J6418J6700J6961J7103J7369J8563K0541
58328A649170K1835K1739K1364K1633K1743K0794J9441J8595J7878J6744J5767
58317A866703J5468J5180J4452J4176J4935J5704J5708J6067J7905K0226K1444
58306B047968K1793K2458K3518K4471K5630K7260K8466K8557K8429K8975K9475
58295B337000K9159K8915K9660L0454L0214K9912L1047L3194L5105L6902L9069
58284B690631M0602M0529M0120M1319M3870M6176M7923M9755N1406N2374N3457
58273C198162N5556N7864N9353O0884O3791O7467P0468P2890P5599P8368Q0831
58262C941233Q3935Q8355R2857R6267R9486J03510J07305J09898J12508J16117
$$ plain form
58252 4951471 5070580 5190731 5311915 5436384 5565315 5697988 5834898 5978644 6130753
58243 6130753 6290525 6457974 6635012 6822678 7020233 7228122 7448780 7683308 7930513
58234 7930513 8190567 8466368 8759835 9070212 9397625 9744883 10114046 10504728 10917792
58225 10917792 11357345 11827126 12328521 12864211 13440057 14061103 14729443 15448523 16225870
58216 16225870 17069277 17984509 18979552 20067191 21260754 22571901 24015967 25615356
58208 25615356 27395154 29381054 31606015 34114825 36959850 40200042 43910650 48189689
58200 48189689 53151423 58921211 65642583 73480590 82608845 93199315 105433437 119517385
58192 119517385 135679775 154163173 175215741 199038789 225648884 254695645 285313553
$$ packed form
58252D951471J19109J20151J21184J24469J28931J32673J36910J43746J52109
58243F130753J59772J67449J77038J87666J97555K07889K20658K34528K47205
58234G930513K60054K75801K93467L10377L27413L47258L69163L90682M13064
58225A0917792M39553M69781N01395N35690N75846O21046O68340P19080P77347
58216A6225870Q43407R15232R95043J087639J193563J311147J444066J599389
58208B5615356J779798J985900K224961K508810K845025L240192L710608M279039
58200D8189689M961734N769788O721372P838007R128255J0590470J2234122J4083948
58192A19517385J6162390J8483398K1052568K3823048K6610095K9046761L0617908
$$ plain form
58185 285313553 316014256 344592999 368161110 383556727 388224888 381218751 363694657
58178 363694657 338525894 309274647 279167387 250552199 224812524 202427918 183045408
58171 183045408 165714511 149391635 133480480 118026132 103468142 90245714 78584560
58164 78584560 68511388 59936088 52698653 46602529 41457758 37104695 33405845 30238182
58156 30238182 27502802 25128929 23060395 21245922 19644778 18229449 16975202 15853461
58148 15853461 14839083 13916368 13073300 12296247 11574484 10904005 10282676 9706230 9171930
58139 9171930 8680912 8233222 7824533 7450378 7109408 6799727 6516152 6253746 6010150
58130 6010150 5781869 5562192 5345850 5132873 4925726 4725812 4534737 4355319 4188511
$$ packed form
58185B85313553L0700703K8578743K3568111J5395617M668161p006137j7524094
58178C63694657k5168763k9251247l0107260k8615188k5739675k2384606j9382510
58171A83045408j7330897j6322876j5911155j5454348j4557990j3222428j1661154
58164G8584560j0073172q575300p237435o096124n144771m353063l698850l167663
58156C0238182k735380k373873k068534j814473j601144j415329j254247j121741
58148A5853461j014378r22715q43068p77053p21763o70479o21329n76446n34300
58139I171930m91018m47690m08689l74155l40970l09681k83575k62406k43596
58130F010150k28281k19677k16342k12977k07147j99914j91075j79418j66808
$$ plain form
58121 4188511 4031949 3883700 3744751 3615955 3495504 3381553 3274606 3175168 3081597 2992342
58111 2992342 2907868 2828482 2752704 2679673 2610712 2546551 2485288 2425033 2366294 2309941 2255104
58100 2255104 2201049 2148918 2099611 2051930 2004745 1958929 1915314 1872758 1830327 1789420 1751644
58089 1751644 1716292 1681955 1648913 1617891 1588130 1558813 1530926 1505522 1481437 1456736 1431263
58078 1431263 1405883 1380544 1355052 1330571 1308183 1286906 1265063 1242798 1221396 1201025 1181085
58067 1181085 1162045 1144934 1129482 1114514 1099817 1086069 1073379 1061360 1050183 1040116 1030360
58056 1030360 1019754 1008368 997159 986367 975390 963938 952202 940172 927814 915670 904422
58045 904422 894118 884505 875667 867671 860110 852699 845742 839417 833308 827206 821516 816113 809771 801676
$$ packed form
58121D188511j56562j48249j38949j28796j20451j13951j06947r9438r3571q9255
58111B992342q4474p9386p5778p3031o8961o4161o1263o0255n8739n6353n4837
58100B255104n4055n2131m9307m7681m7185m5816m3615m2556m2431m0907l7776
58089A751644l5352l4337l3042l1022k9761k9317k7887k5404k4085k4701k5473
58078A431263k5380k5339k5492k4481k2388k1277k1843k2265k1402k0371j9940
58067A181085j9040j7111j5452j4968j4697j3748j2690j2019j1177j0067r756
58056A030360j0606j1386j1209j0792j0977j1452j1736j2030j2358j2144j1248
58045I04422j0304r613q838p996p561p411o957o325o109o102n690n403o342q095
$$ plain form
58031 801676 792654 783996 775775 767254 758211 748907 739437 730011 721215 713191 705300 697384 690505 685575
58017 685575 682037 678773 675461 672206 668779 665232 662368 660547 658954 657041 655718 655883 656761 657064 657023
58002 657023 657808 659600 661651 663717 666041 668353 670232 672085 674505 677009 678594 679236 679698 680195 680389
57987 680389 680284 679928 678642 675794 672057 668693 665839 662688 658993 655153 651074 646318 641277 636840 632869
57972 632869 628282 622796 617348 612600 608131 603490 599110 595739 593628 592525 591956 591364 590485 589672 589433
57957 589433 589743 590165 590384 590168 589182 587416 585446 583719 582023 580211 578852 578409 578381 578090 577710 577552 577022
57940 577022 575512 573857 573505 574471 575417 575662 575898 576924 578887 581785 585523 589276 591854 592986 593439 593815
57924 593815 594112 594403 594912 595231 594464 592375 589643 586847 584031 581252 578649 575793 571891 566866 561483
$$ packed form
58031H01676r022q658q221q521r043r304r470r426q796q024p891p916o879m930
58017F85575l538l264l312l255l427l547k864j821j593j913j323J65Q78L03m1
58002F57023P85J792K051K066K324K312J879J853K420K504J585O42M62M97J94
57987F80389j05l56j286k848l737l364k854l151l695l840m079m756n041m437l971
57972F32869m587n486n448m748m469m641m380l371k111j103n69n92q79q13k39
57957E89433L10M22K19k16r86j766j970j727j696j812j359m43k8k91l80j58n30
57940E77022j510j655l52R66R46K45K36J026J963K898L738L753K578J132M53L76
57924E93815K97K91N09L19p67k089k732k796k816k779k603k856l902n025n383
$$ plain form
57909 561483 556225 550758 544638 537837 530520 523090 516439 511349 507504 503827 499790 495628 491391 486845
57895 486845 482347 478755 476229 474141 472380 471675 472227 473082 473418 473624 474544 476379 478914 482155 486129 490553
57879 490553 495155 499962 504960 509887 514631 519302 523687 527160 529414 530833 531879 532572 532708 532078 530338
57864 530338 527205 522952 518218 513323 508352 503833 500523 498392 496689 495221 494738 495753 497781 500065
57850 500065 502322 504524 506767 509678 514029 519538 524970 529937 535592 542888 551022 558455 564661 569937
57836 569937 574221 577264 579519 581718 583690 584588 584264 583512 582879 582025 580435 578158 575622 573230 571355
57821 571355 570294 569937 569673 568793 566997 564536 562018 560035 558854 558479 558926 560236 562127 563955 565153
57806 565153 565487 564740 562447 558249 552315 545204 537410 529226 520921 512915 505765 499872 495048 490496 485567
$$ packed form
57909E61483n258n467o120o801p317p430o651n090l845l677m037m162m237m546
57895D86845m498l592k526k088j761p05N52Q55L36K06R20J835K535L241L974M424
57879D90553M602M807M998M927M744M671M385L473K254J419J046O93J36o30j740
57864E30338l133m253m734m895m971m519l310k131j703j468m83J015K028K284
57850E00065K257K202K243K911M351N509N432M967N655P296Q134P433O206N276
57836E69937M284L043K255K199J972Q98l24p52o33q54j590k277k536k392j875
57821E71355j061l57k64q80j796k461k518j983j181l75M47J310J891J828J198
57806E65153L34p47k293m198n934p111p794q184q305q006p150n893m824m552m929
$$ plain form
57791 485567 480447 475730 471461 467256 463375 460932 460641 461886 463389 464421 465025 465547 466406 468052 470653
57776 470653 473904 477355 480792 484260 488032 492645 498519 505355 512347 519181 526327 534074 541914 549340
57762 549340 556672 564478 572511 579883 585998 590761 594088 595868 596304 595694 593875 590479 585840 581164 577568
57747 577568 575179 573343 571491 569681 568399 567997 568371 569116 569856 570310 570269 569841 569560 569794 570104 569762 568935
57730 568935 568738 569852 571826 574070 576839 580572 584854 588815 592235 595533 598886 602178 605685 609966
57716 609966 614938 619732 623657 626766 629288 631131 632271 633191 634473 636161 637859 639359 640935 643071
57702 643071 646025 649578 653076 655907 658135 660702 664757 670644 677655 684835 691933 699274 706729 713184
57688 713184 717384 719115 719259 718790 718165 717679 717912 719596 723319 729532 738580 750646 765907 784886 808388
$$ packed form
57791D85567n120m717m269m205l881k443k91J245J503J032O04N22Q59J646K601
57776D70653L251L451L437L468L772M613N874O836O992O834P146P747P840P426
57762E49340P332P806Q033P372O115M763L327J780M36o10j819l396m639m676l596
57747E77568k389j836j852j810j282m02L74P45P40M54m1m28k81K34L10l42q27
57730E68935j97J114J974K244K769L733M282L961L420L298L353L292L507M281
57716F09966M972M794L925L109K522J843J140R20J282J688J698J500J576K136
57702F43071K954L553L498K831K228K567M055N887P011P180P098P341P455O455
57688G13184M200J731J44m69o25m86K33J684L723O213R048J2066J5261J8979K3502
$$ plain form
57673 808388 837033 871133 911147 957953 1012647 1076393 1150403 1235370 1330251 1431293 1531505
57662 1531505 1620233 1683837 1709449 1690830 1631778 1543960 1441419 1336388 1237893 1151489 1079166
57651 1079166 1020083 972159 933410 902405 878210 859982 846474 836138 828021 822162 818621 816579
57639 816579 815084 814339 815319 818148 821744 825138 828346 831718 835225 838779 842666 847124 851835 856175 859742
57624 859742 862494 864652 866639 868781 870890 872431 873236 873804 874741 876235 878148 880315 882660 885321 888700
57609 888700 892959 897436 901061 903505 905462 907665 910236 913268 917315 922624 928328 933125 936642 939622
57595 939622 942866 946451 949948 952894 955023 956387 957362 958360 959610 961412 964305 968523 973377 977728 981133
57580 981133 984090 987014 989567 991332 992824 995313 999643 1005511 1011858 1017712 1022631 1026684 1030265 1033884
$$ packed form
57673H08388K8645L4100M0014M6806N4694O3746P4010Q4967R4881J01042J00212
57662A531505Q8728O3604K5612j8619n9052q7818j02541j05031r8495q6404p2323
57651A079166n9083m7924l8749l1005k4195j8228j3508j0336q117n859l541k042
57639H16579j495p45R80K829L596L394L208L372L507L554L887M458M711M340L567
57624H59742K752K158J987K142K109J541Q05N68R37J494J913K167K345K661L379
57609H88700M259M477L625K444J957K203K571L032M047N309N704M797L517K980
57595I39622L244L585L497K946K129J364R75R98J250J802K893M218M854M351L405
57580I81133K957K924K553J765J492K489M330N868O347N854M919M053L581L619
$$ plain form
57566 1033884 1037902 1042352 1047023 1051815 1056949 1062761 1069281 1076179 1083195 1090455 1098212 1106378 1114563 1122556
57552 1122556 1130522 1138667 1147025 1155693 1164974 1174908 1184803 1193699 1201324 1208233 1214895 1221045 1226304 1231127
57538 1231127 1236632 1243489 1251407 1259825 1268731 1278507 1289183 1300191 1310827 1320816 1330432 1340241 1350630
57525 1350630 1361371 1371619 1380583 1388333 1395792 1403812 1412369 1420848 1429070 1437736 1447721 1459047 1470748
57512 1470748 1481725 1491583 1500674 1509601 1518796 1528412 1538359 1548393 1558331 1568172 1577950 1587492 1596452
57499 1596452 1604623 1612155 1619441 1626836 1634451 1642215 1650142 1658561 1667914 1678242 1689000 1699511 1709551
57486 1709551 1719364 1729233 1739293 1749679 1760609 1772217 1784386 1796771 1808929 1820566 1831764 1842918
57474 1842918 1854270 1865658 1876877 1888146 1899945 1912527 1925806 1939566 1953475 1967090 1980286
$$ packed form
57566A033884M018M450M671M792N134N812O520O898P016P260P757Q166Q185P993
57552A122556P966Q145Q358Q668R281R934R895Q896P625O909O662O150N259M823
57538A231127N505O857P918Q418Q906R776J0676J1008J0636R989R616R809J0389
57525A350630J0741J0248Q964P750P459Q020Q557Q479Q222Q666R985J1326J1701
57512A470748J0977R858R091Q927R195R616R947J0034R938R841R778R542Q960
57499A596452Q171P532P286P395P615P764P927Q419R353J0328J0758J0511J0040
57486A709551R813R869J0060J0386J0930J1608J2169J2385J2158J1637J1198J1154
57474A842918J1352J1388J1219J1269J1799J2582J3279J3760J3909J3615J3196
$$ plain form
57463 1980286 1993586 2007616 2022332 2037219 2052115 2067198 2082248 2096712 2110707 2125173 2140668
57452 2140668 2156687 2172608 2188603 2205024 2221433 2237116 2252207 2267543 2283532 2299919 2316634
57441 2316634 2334087 2352426 2371045 2389116 2406250 2422509 2438171 2453734 2469885 2487090 2505239
57430 2505239 2523794 2542215 2560206 2577648 2594539 2611105 2627916 2645622 2664371 2683587 2702619
57419 2702619 2721493 2740680 2760237 2779751 2799275 2819591 2841065 2862728 2883116 2901846 2919886
57408 2919886 2938462 2958169 2979016 3000723 3022857 3044983 3066780 3087982 3108447 3128517 3149001
57397 3149001 3170446 3192608 3214993 3237616 3260763 3284257 3307568 3330563 3353615 3377028 3400854
57386 3400854 3425197 3450167 3475483 3500640 3525532 3550532 3575903 3601570 3627456 3653614 3679862
$$ packed form
57463A980286J3300J4030J4716J4887J4896J5083J5050J4464J3995J4466J5495
57452B140668J6019J5921J5995J6421J6409J5683J5091J5336J5989J6387J6715
57441B316634J7453J8339J8619J8071J7134J6259J5662J5563J6151J7205J8149
57430B505239J8555J8421J7991J7442J6891J6566J6811J7706J8749J9216J9032
57419B702619J8874J9187J9557J9514J9524K0316K1474K1663K0388J8730J8040
57408B919886J8576J9707K0847K1707K2134K2126K1797K1202K0465K0070K0484
57397C149001K1445K2162K2385K2623K3147K3494K3311K2995K3052K3413K3826
57386C400854K4343K4970K5316K5157K4892K5000K5371K5667K5886K6158K6248
$$ plain form
57375 3679862 3705690 3730652 3754704 3778226 3801917 3826419 3851651 3876727 3900999 3924919 3949322
57364 3949322 3974166 3998825 4023402 4048758 4075132 4101786 4128311 4155308 4183226 4211381 4238854
57353 4238854 4265779 4293005 4320871 4349055 4377358 4405938 4434841 4463846 4492822 4521862 4550994
57342 4550994 4580045 4608794 4637179 4665446 4694091 4723415 4753065 4782355 4811168 4840120 4869637
57331 4869637 4899327 4928631 4957655 4986883 5016356 5045645 5074523 5103220 5132135 5161646 5192061
57320 5192061 5223267 5254451 5284598 5313480 5341950 5371073 5401042 5431017 5460040 5488101 5516193
57309 5516193 5545218 5574986 5604469 5632942 5660545 5687872 5715479 5743730 5772520 5800991 5828080
57298 5828080 5853654 5878688 5904129 5930114 5956534 5983595 6011302 6038909 6065638 6091656 6117761
$$ packed form
57375C679862K5828K4962K4052K3522K3691K4502K5232K5076K4272K3920K4403
57364C949322K4844K4659K4577K5356K6374K6654K6525K6997K7918K8155K7473
57353D238854K6925K7226K7866K8184K8303K8580K8903K9005K8976K9040K9132
57342D550994K9051K8749K8385K8267K8645K9324K9650K9290K8813K8952K9517
57331D869637K9690K9304K9024K9228K9473K9289K8878K8697K8915K9511L0415
57320E192061L1206L1184L0147K8882K8470K9123K9969K9975K9023K8061K8092
57309E516193K9025K9768K9483K8473K7603K7327K7607K8251K8790K8471K7089
57298E828080K5574K5034K5441K5985K6420K7061K7707K7607K6729K6018K6105
$$ plain form
57287 6117761 6144345 6171240 6198311 6225541 6252635 6279123 6304858 6329993 6354628 6378961 6403535
57276 6403535 6428688 6453881 6478275 6501975 6525938 6550548 6575025 6598577 6621441 6644317 6667270
57265 6667270 6689776 6711515 6732549 6752837 6772177 6790716 6809131 6828057 6847447 6866696 6885354
57254 6885354 6903650 6922268 6941628 6961495 6981349 7001069 7021156 7042204 7064245 7086634 7108555
57243 7108555 7129520 7149343 7167814 7184737 7200357 7215327 7229856 7243189 7254452 7263915 7272711 7281243
57231 7281243 7288583 7293784 7297174 7299814 7302156 7303812 7304377 7303912 7302830 7301817 7301674 7302729 7304444 7306066 7307515
57216 7307515 7309288 7311714 7314817 7318676 7323292 7328154 7332609 7336704 7341080 7345915 7350509 7354122 7356691 7358526
57202 7358526 7359665 7359771 7358472 7355679 7351792 7347498 7343055 7337910 7331485 7324273 7317427 7311190 7304370 7295650
$$ packed form
57287F117761K6584K6895K7071K7230K7094K6488K5735K5135K4635K4333K4574
57276F403535K5153K5193K4394K3700K3963K4610K4477K3552K2864K2876K2953
57265F667270K2506K1739K1034K0288J9340J8539J8415J8926J9390J9249J8658
57254F885354J8296J8618J9360J9867J9854J9720K0087K1048K2041K2389K1921
57243G108555K0965J9823J8471J6923J5620J4970J4529J3333J1263R463Q796Q532
57231G281243P340N201L390K640K342J656N65m65j082j013j43J055J715J622J449
57216G307515J773K426L103L859M616M862M455M095M376M835M594L613K569J835
57202G358526J139J06j299k793l887m294m443n145o425p212o846o237o820q720
$$ plain form
57188 7295650 7284854 7272614 7259347 7245021 7229475 7212427 7193407 7172150 7148909 7124040 7097387
57177 7097387 7068408 7036859 7003174 6968283 6933197 6898517 6864123 6829419 6794058 6758285 6722571
57166 6722571 6687230 6652545 6618911 6586610 6555717 6526475 6499397 6474633 6451532 6429222 6407476
57155 6407476 6386601 6366666 6347323 6328264 6309320 6290027 6269567 6247300 6223030 6196583 6167415
57144 6167415 6134936 6099050 6060050 6017971 5972257 5922273 5868134 5810956 5752276 5693407 5635451
57133 5635451 5579632 5527073 5478089 5431993 5387883 5345408 5304551 5264920 5225573 5185475 5143804
57122 5143804 5099925 5053481 5004751 4954823 4905306 4857833 4813684 4773630 4738005 4706926 4680409
57111 4680409 4658284 4640281 4626576 4618347 4617652 4626746 4647704 4682667 4734158 4804969 4897952 5016333
$$ packed form
57188G295650j0796j2240j3267j4326j5546j7048j9020k1257k3241k4869k6653
57177G097387k8979l1549l3685l4891l5086l4680l4394l4704l5361l5773l5714
57166F722571l5341l4685l3634l2301l0893k9242k7078k4764k3101k2310k1746
57155F407476k0875j9935j9343j9059j8944j9293k0460k2267k4270k6447k9168
57144F167415l2479l5886l9000m2079m5714m9984n4139n7178n8680n8869n7956
57133E635451n5819n2559m8984m6096m4110m2475m0857l9631l9347m0098m1671
57122E143804m3879m6444m8730m9928m9517m7473m4149m0054l5625l1079k6517
57111D680409k2125j8003j3705q229o95R094K0958L4963N1491P0811R2983J18381
$$ plain form
57099 5016333 5164304 5347136 5570565 5840068 6160496 6535716 6967826 7456379 7998392
57090 7998392 8588858 9220629 9883580 10564449 11248115 11918915 12560709 13157240 13695430
57081 13695430 14170589 14588219 14958419 15285303 15558526 15752395 15832567 15766200 15530793 15118967
57071 15118967 14538950 13812112 12968952 12044501 11074116 10090638 9122990 8195214 7325367
57062 7325367 6524838 5798944 5148404 4570713 4061132 3613638 3221832 2879445 2580507
57053 2580507 2319570 2091916 1893388 1719964 1567669 1432975 1313193 1206403 1111147 1026234
57043 1026234 950727 883855 824755 772263 725094 682314 643552 608680 577418 549495 525034
57032 525034 504439 487844 475052 466094 461580 462347 469106 482588 503677 533157 571723 620691
$$ packed form
57099E016333J47971J82832K23429K69503L20428L75220M32110M88553N42013
57090G998392N90466O31771O62951O80869O83666O70800O41794N96531N38190
57081A3695430M75159M17630L70200L26884K73223J93869Q0172o6367k35407m11826
57071A5118967n80017p26838q43160r24451r70385r83478r67648r27776q69847
57062G325367q00529p25894o50540n77691n09581m47494l91806l42387k98938
57053B580507k60937k27654j98528j73424j52295j34694j19782j06790r5256q4913
57043A026234p5507o6872n9100n2492m7169m2780l8762l4872l1262k7923k4461
57032E25034k0595j6595j2792q958m514P67O759J3482K1089K9480L8566M8968
$$ plain form
57020 620691 682447 759370 850996 950640 1043507 1109047 1128717 1095505 1017873 914328 803360
57009 803360 697092 601537 519401 451340 396083 351312 314974 285638 262161 243688 229762
56998 229762 219877 213043 208106 204321 201257 198457 195633 192956 190666 188556 186352 184449 183674 184352 186152
56983 186152 188860 192657 197401 202149 205673 207065 205643 200857 192858 182945 172907 163865 155950 148971
56969 148971 143012 138362 135174 133354 132754 133462 135912 140507 147111 155082 163900 173516 183946 194909
56955 194909 206042 216963 226565 232741 233660 229351 221342 210864 198326 184610 171643 160923 152271
56942 152271 144921 139218 136256 136221 138251 141956 147973 156665 167136 178157 189558 202200 216758
56929 216758 232753 248368 260928 267918 268117 261834 250166 234352 215888 196638 178299 161790
$$ packed form
57020F20691O1756P6923R1626R9644R2867O5540J9670l3212p7632j03545j10968
57009H03360j06268r5555q2136o8061n5257m4771l6338k9336k3477j8473j3926
56998B29762r885o834m937l785l064k800k824k677k290k110k204j903p75O78J800
56983A86152K708L797M744M748L524J392j422m786p999r913j0038r042p915o979
56969A48971n959m650l188j820o00P08K450M595O604P971Q818R616J0430J0963
56955A94909J1133J0921R602O176R19m309q009j0478j2538j3716j2967j0720q652
56942A52271p350n703k962l5K030L705O017Q692J0471J1021J1401J2642J4558
56929B16758J5995J5615J2560O990J99o283j1668j5814j8464j9250j8339j6509
$$ plain form
56917 161790 147331 134815 123910 114237 105863 99367 95012 92071 89354 86259 83013 80150 78178
56904 78178 77577 78549 80730 83496 86526 89729 92805 95389 97660 100280 103687 107831 112664 118357 124940
56889 124940 132290 140760 151213 163861 177447 190195 201425 211608 220768 227485 229914 227560 221720
56876 221720 214339 206752 199531 193104 188174 185504 185547 188384 193993 202504 214161 229063 247007 267683
56862 267683 291042 317285 346396 377750 410204 442160 471087 493309 505168 505036 494102 475194
56850 475194 451275 425177 399854 377874 360580 348230 340864 338587 341231 348525 360761 378687
56838 378687 402540 431712 465680 504761 549413 598970 651262 702991 749790 786099 806120
56827 806120 806024 785785 749081 701460 648468 594853 544541 500377 463599 433912 410507 393031
$$ packed form
56917A61790j4459j2516j0905r673q374o496m355k941k717l095l246k863j972
56904G8178o01R72K181K766L030L203L076K584K271K620L407M144M833N693O583
56889A24940P350Q470J0453J2648J3586J2748J1230J0183R160O717K429k354n840
56876B21720p381p587p221o427m930k670M3K837N609Q511J1657J4902J7944K0676
56862B67683K3359K6243K9111L1354L2454L1956K8927K2222J1859j32j0934j8908
56850D75194k3919k6098k5323k1980j7294j2350p366k277K644P294J2236J7926
56838C78687K3853K9172L3968L9081M4652M9557N2292N1729M6799L6309K0021
56827H06120r6k0239l6704m7621n2992n3615n0312m4164l6778k9687k3405j7476
$$ plain form
56815 393031 381543 375974 376158 382285 394732 413304 437096 465295 497605 533378 570377 604630
56803 604630 631453 646656 647429 633019 605060 567163 523800 479159 436419 397530 363412 334412
56791 334412 310700 292338 279173 270815 266783 266702 270411 277898 289008 303164 319389 336597 353740
56778 353740 369587 382412 390042 390396 382278 366039 343532 317252 289304 261110 233916 209157
56766 209157 188011 170681 156395 144161 133448 124156 116189 109305 103311 98131 93535 89031 84327
56753 84327 79823 76300 73979 72168 69981 67197 64283 61851 60329 59881 60263 60852 61143 61112 60847 60067
56737 60067 58387 55985 53561 51716 50702 50675 51635 53161 54674 56021 57360 58473 58849 58586 58566 59445
56721 59445 60997 62759 64748 67046 69154 70378 70670 70628 70834 71549 72801 74319 75544 76117 76249 76266 76026
$$ packed form
56815C93031j1488n569J84O127J2447J8572K3792K8199L2310L5773L6999L4253
56803F04630K6823J5203P73j4410k7959l7897m3363m4641m2740l8889l4118k9000
56791C34412k3712j8362j3165q358m032q1L709P487J1110J4156J6225J7208J7143
56778C53740J5847J2825P630L54q118j6239k2507k6280k7948k8194k7194k4759
56766B09157k1146j7330j4286j2234j0713r292p967o884n994n180m596m504m704
56753H4327m504l523k321j811k187k784k914k432j522m48L82N89K91l1k65p80
56737F0067j680k402k424j845j014k7R60J526J513J347J339J113L76k63k0Q79
56721E9445J552J762J989K298K108J224K92m2K06P15J252J518J225N73J32J7k40
$$ plain form
56704 76026 75298 74495 74432 75290 76351 76890 76856 76464 75563 73856 71565 69508 68455 68590 69571 70856 71868
56687 71868 72076 71379 70476 70442 71528 72651 72552 71358 70431 70707 71837 73080 74303 75642 76826 77476 77699
56670 77699 77767 77511 76740 75998 76229 77649 79539 81191 82571 84036 85865 88130 90538 92314 92728 91881
56654 91881 90688 90006 90122 90955 92217 93239 93226 91980 90079 88125 86219 84346 82820 81923 81411 80777
56638 80777 79826 78723 77683 76964 76987 78006 79676 81321 82730 84343 86555 89095 91350 93068 94459
56623 94459 95709 96810 97910 99382 101233 102737 103136 102584 101886 101327 100352 98603 96655 95268 94390 93540
56607 93540 92913 93372 95256 97717 99461 99890 99440 99169 100099 102617 106171 109540 111627 112195 111971 112024 112816
56590 112816 113822 114245 114071 114067 114698 115627 116499 117629 119384 121401 123018 124105 124849 125133 124929 124995 126188
$$ packed form
56704G6026p28q03o3Q58J061N39l4l92r01j707k291k057j053J35R81J285J012
56687G1868K08o97r03l4J086J123r9j194r27K76J130J243J223J339J184O50K23
56670G7699O8k56p71p42K31J420J890J652J380J465J829K265K408J776M14q47
56654I1881j193o82J16Q33J262J022j3j246j901j954j906j873j526q97n12o34
56638H0777r51j103j040p19K3J019J670J645J409J613K212K540K255J718J391
56623I4459J250J101J100J472J851J504L99n52o98n59r75j749j948j387q78q50
56607I3540o27M59J884K461J744M29m50k71R30K518L554L369K087N68k24N3P92
56590A12816J006M23j74mO31R29Q72J130J755K017J617J087P44K84k04O6J193
$$ plain form
56573 126188 128086 129235 128867 127637 126561 126148 126757 128845 132311 136261 139948 143462 147193 151260 155872
56558 155872 161605 168731 176693 184664 192117 198441 202647 204153 203515 201857 199954 198323 197577 197853 198287
56543 198287 197892 196772 195708 194790 193352 191201 189018 187405 186295 185506 185109 184846 183852 181492 178153 174832
56527 174832 172173 170230 168860 167924 167185 166382 165416 164257 162682 160290 156934 153110 149840 148054 147909
56512 147909 148618 149027 148428 146934 145222 143961 143389 143221 142946 142253 141254 140335 139826 139762 139849 139666 139026 138167
56494 138167 137448 136935 136443 135947 135657 135729 136248 137490 139740 142616 145010 146092 146150 146242 147223 149299 152116
56477 152116 154890 156763 157535 157908 158607 159448 159719 159331 159059 159565 160648 161602 162031 162196 162762 164248 166561
56460 166561 169084 171329 173394 175563 177623 178964 179301 178971 178502 178254 178462 179273 180559 181951 183099 183772
$$ packed form
56573A26188J898J149l68j230j076m13O09K088L466L950L687L514L731M067M612
56558A55872N733P126P962P971P453O324M206J506o38j658j903j631p46K76M34
56543A98287l95j120j064r18j438k151k183j613j110p89l97k63r94k360l339l321
56527A74832k659j943j370r36p39q03r66j159j575k392l356l824l270j786j45
56512A47909P09M09n99j494j712j261n72j68k75o93r99r19n09o4Q7j83o40q59
56494A38167p19n13m92m96k90P2N19J242K250K876K394J082N8R2R81K076K817
56477A52116K774J873P72L73O99Q41K71l88k72N06J083R54M29J65N66J486K313
56460A66561K523K245K065K169K060J341L37l30m69k48K08Q11J286J392J148O73
$$ plain form
56444 183772 183737 182903 181639 180620 180164 179939 179462 178664 177772 176861 175843 174836 174248 174358 174971 175614 176057 176448
56426 176448 176914 177245 177138 176555 175595 174207 172402 170686 169763 169706 169893 169910 170022 170515 171154 171750 172725 174476
56408 174476 176504 177892 178569 179366 180831 182544 183765 184228 184193 184125 184455 185247 185939 185773 184653 183306 182493
56391 182493 182390 182766 183354 183826 183787 183195 182561 182485 183034 183769 184272 184482 184555 184583 184492 184217 183889 183763 183910 184101
56371 184101 184165 184358 185221 187120 190023 193566 197149 200086 201965 202902 203326 203597 203932 204523 205465 206665 207969
56354 207969 209259 210342 211037 211608 212735 214620 216419 217161 217084 217487 219197 221700 223885 225181 225862 226600
56338 226600 227910 229783 231790 233696 235837 238557 241430 243562 244606 245041 245452 246082 247146 248963 251556
56323 251556 254582 257823 261254 264427 266406 266777 266311 266124 266410 266438 265636 264254 263024 262511 262857 263859
$$ packed form
56444A83772l5q34j264j019m56k25m77p98q92r11j018j007n88J10O13O43M43L91
56426A76448M66L31j07n83r60j388j805j716r23n7J87J7J12M93O39N96R75J751
56408A74476K028J388O77P97J465J713J221M63l5o8L30P92O92j66j120j347q13
56391A82493j03L76N88M72l9n92o34p6N49P35N03K10P3K8r1k75l28j26J47J91
56371A84101O4J93Q63J899K903L543L583K937J879R37M24K71L35N91R42J200J304
56354B07969J290J083O95N71J127J885J799P42p7M03J710K503K185J296O81P38
56338B26600J310J873K007J906K141K720K873K132J044M35M11O30J064J817K593
56323B51556L026L241L431L173J979L71m66j87K86K8q02j382j230n13L46J002
$$ plain form
56307 263859 265142 266337 267280 268120 269231 270911 273083 275422 277865 280774 284397 288308 291698 294188 296095
56292 296095 297993 300194 302596 304857 306808 308837 311589 315093 318600 321663 324931 329239 334286 339000
56278 339000 343022 346999 351458 356268 361363 367046 373257 379226 384389 389178 394551 401093 408819 417459
56264 417459 426625 436011 445647 455784 466562 478118 490841 504975 520079 535660 552304 571316
56252 571316 593062 616565 641130 667516 697048 730338 767470 808798 854807 905575 960936
56241 960936 1020822 1084953 1152483 1222382 1293802 1365746 1436781 1505394 1570222 1629627 1681569
56230 1681569 1724352 1756964 1778391 1787264 1782818 1765734 1737513 1699467 1652833 1599228 1540232 1476867
56218 1476867 1410165 1341921 1274219 1208464 1145413 1085781 1030147 978570 930917 887353 847954
$$ packed form
56307B63859J283J195R43Q40J111J680K172K339K443K909L623L911L390K490J907
56292B96095J898K201K402K261J951K029K752L504L507L063L268M308N047M714
56278C39000M022L977M459M810N095N683O211N969N163M789N373O542P726Q640
56264D17459R166R386R636J0137J0778J1556J2723J4134J5104J5581J6644J9012
56252E71316K1746K3503K4565K6386K9532L3290L7132M1328M6009N0768N5361
56241I60936N9886O4131O7530O9899P1420P1944P1035O8613O4828N9405N1942
56230A681569M2783L2612K1427Q873m446j7084k8221l8046m6634n3605n8996o3365
56218A476867o6702o8244o7702o5755o3051n9632n5634n1577m7653m3564l9399
$$ plain form
56207 847954 812156 779251 749162 722133 697977 676311 657274 641196 627696 615802 604946
56196 604946 595221 586735 579340 572961 567649 563306 559839 557438 556180 555540 554884 554340 554559 555666 557081
56181 557081 558310 559312 560047 560370 560529 561263 563127 566018 569445 572985 576412 579716 582994 586162 588875
56166 588875 591045 593257 596255 600044 603888 607235 610389 614304 619807 626881 634564 641818 648641 656018
56152 656018 664685 674398 684599 695092 705661 715818 725703 736707 750325 766639 784627 803622
56140 803622 823665 844719 866535 889348 913988 941160 971231 1004848 1043310 1088262 1141191
56129 1141191 1203005 1273710 1352594 1438815 1531203 1627089 1722028 1811400 1891986 1961724 2019204
56118 2019204 2064801 2101795 2134748 2166347 2196253 2222360 2242018 2252526 2252309 2242352 2225737 2205431
$$ packed form
56207H47954l5798l2905l0089k7029k4156k1666j9037j6078j3500j1894j0856
56196F04946r725q486p395o379n312m343l467k401j258o40o56n44K19J107J415
56181E57081J229J002P35L23J59P34J864K891L427L540L427L304L278L168K713
56166E88875K170K212K998L789L844L347L154L915N503P074P683P254O823P377
56152F56018Q667R713J0201J0493J0569J0157R885J1004J3618J6314J7988J8995
56140H03622K0043K1054K1816K2813K4640K7172L0071L3617L8462M4952N2929
56129A141191O1814P0705P8884Q6221R2388R5886R4939Q9372Q0586O9738N7480
56118B019204M5597L6994L2953L1599K9906K6107J9658J0508k17r957j6615k0306
$$ plain form
56106 2205431 2182904 2158308 2130546 2096919 2054024 1999889 1935000 1861541 1782629 1702359 1625270
56095 1625270 1554880 1492986 1440346 1397252 1363249 1337092 1317449 1303291 1293653 1287739 1285364 1286626
56083 1286626 1291065 1297716 1305965 1315555 1325839 1336007 1346204 1357524 1370576 1384834 1399670 1415315
56071 1415315 1432488 1451621 1472637 1494971 1517760 1540620 1564227 1589488 1616259 1643567 1670946
56060 1670946 1698657 1726704 1754752 1783089 1812561 1843228 1874009 1903972 1933143 1961776 1989691
56049 1989691 2016783 2043580 2070926 2099447 2129313 2160035 2190712 2221139 2252508 2286246 2322448
56038 2322448 2360205 2399051 2439042 2479921 2521615 2565339 2612761 2663993 2717666 2772917 2829998
56027 2829998 2889072 2949994 3013385 3080299 3150577 3223021 3297445 3375040 3456424 3540869 3627834
$$ packed form
56106B205431k2527k4596k7762l3627m2895n4135o4889p3459p8912q0270p7089
56095A625270p0390o1894n2640m3094l4003k6157j9643j4158r638n914k375J262
56083A286626M439O651Q249R590J0284J0168J0197J1320J3052J4258J4836J5645
56071A415315J7173J9133K1016K2334K2789K2860K3607K5261K6771K7308K7379
56060A670946K7711K8047K8048K8337K9472L0667L0781K9963K9171K8633K7915
56049A989691K7092K6797K7346K8521K9866L0722L0677L0427L1369L3738L6202
56038B322448L7757L8846L9991M0879M1694M3724M7422N1232N3673N5251N7081
56027B829998N9074O0922O3391O6914P0278P2444P4424P7595Q1384Q4445Q6965
$$ plain form
56016 3627834 3717766 3810984 3907207 4006603 4109885 4217009 4327220 4440755 4559080 4683144
56006 4683144 4812857 4948425 5090525 5238918 5392717 5552415 5719920 5896318 6081483
55997 6081483 6276171 6482369 6701152 6932337 7176788 7436787 7713512 8006372 8315617
55988 8315617 8643305 8990969 9358781 9748061 10162393 10605397 11079657 11588594 12136896
55979 12136896 12728278 13365442 14053187 14799020 15610071 16492489 17454828 18509054 19667628
55970 19667628 20943414 22353819 23921794 25672433 27633453 29841150 32342756 35193507
55962 35193507 38458330 42219755 46580398 51657413 57580980 64498997 72574389 81974171
55954 81974171 92868641 105444123 119908515 136481414 155380137 176785081 200738203
$$ packed form
56016C627834Q9932R3218R6223R9396J03282J07124J10211J13535J18325J24064
56006D683144J29713J35568J42100J48393J53799J59698J67505J76398J85165
55997F081483J94688K06198K18783K31185K44451K59999K76725K92860L09245
55988H315617L27688L47664L67812L89280M14332M43004M74260N08937N48302
55979A2136896N91382O37164O87745P45833Q11051Q82418R62339J054226J158574
55970A9667628J275786J410405J567975J750639J961020K207697K501606K850751
55962C5193507L264823L761425M360643N077015N923567O918017Q075392R399782
55954H1974171J0894470J2575482J4464392J6572899J8898723K1404944K3953122
$$ plain form
55947 200738203 226976168 254769628 282813070 309143610 331143381 345845927 350696687
55940 350696687 344506224 327998064 303551318 274329201 243362152 213004066 184792612
55933 184792612 159539416 137508398 118612556 102579050 89055253 77670355 68076760
55926 68076760 59972563 53102115 47249299 42236697 37924055 34198382 30964311 28143034
55918 28143034 25672591 23502061 21586100 19886449 18374129 17025812 15819705 14736768
55910 14736768 13762575 12884789 12090708 11369168 10712272 10112938 9562862 9054750 8584286
55901 8584286 8148053 7741694 7361893 7007957 6679417 6373923 6089143 5824738 5580637
55892 5580637 5355048 5145817 4952129 4773366 4608021 4455268 4315986 4190731 4078200
$$ packed form
55947B00738203K6237965K7793460K8043442K6330540K1999771J4702546M850760
55940C50696687o190463j6508160k4446746k9222117l0967049l0358086k8211454
55933A84792612k5253196k2031018j8895842j6033506j3523797j1384898r593595
55926F8076760q104197o870448n852816n012602m312642l725673l234071k821277
55918B8143034k470443k170530j915961j699651j512320j348317j206107j082937
55910A4736768r74193q77786p94081p21540o56896n99334n50076n08112m70464
55901H584286m36233m06359l79801l53936l28540l05494k84780k64405k44101
55892E580637k25589k09231j93688j78763j65345j52753j39282j25255j12531
$$ plain form
55883 4078200 3977128 3888207 3812823 3751466 3704605 3673366 3657658 3654879 3661551 3674202 3686842
55872 3686842 3689275 3670454 3623411 3546479 3441757 3314424 3172172 3022692 2871478 2722730
55862 2722730 2580999 2450181 2331606 2224659 2128671 2042872 1965422 1894281 1828805 1769229
55852 1769229 1715028 1664989 1618393 1574881 1533556 1493408 1454342 1416705 1380284 1344801 1310952
55841 1310952 1279722 1250866 1223153 1195968 1169764 1145111 1122180 1100987 1081353 1062652 1044167
55830 1044167 1025635 1007153 989044 972107 957291 944490 932364 919983 907904 896856 886152
55819 886152 874432 861380 847627 833520 819088 804935 792011 780524 769989 760182 751239 742925
55807 742925 734741 726849 720182 715447 712443 710390 708636 707079 706140 706192 706981 707930 708966 710448 712249
$$ packed form
55883D078200j01072q8921p5384o1357m6861l1239j5708k779O672J2651J2640
55872C686842K433j8821m7043p6932j04722j27333j42252j49480j51214j48748
55862B722730j41731j30818j18575j06947r5988q5799p7450p1141o5476n9576
55852A769229n4201n0039m6596m3512m1325m0148l9066l7637l6421l5483l3849
55841A310952l1230k8856k7713k7185k6204k4653k2931k1193j9634j8701j8485
55830A044167j8532j8482j8109j6937j4816j2801j2126j2381j2079j1048j0704
55819H86152j1720j3052j3753j4107j4432j4153j2924j1487j0535r807q943q314
55807G42925q184p892o667m735l004k053j754j557r39N2P89R49J036J482J801
$$ plain form
55792 712249 713780 715080 716809 718725 719304 717589 714345 710580 706070 700460 694682 689795 685019 678304
55778 678304 668331 654767 637290 616122 593293 571787 553265 537790 525457 516698 510921 506595
55766 506595 503176 501639 502474 504304 505182 504334 502043 498725 494900 491342 488451 485712 482225 477473 471324
55751 471324 463820 455408 446962 439102 431616 423778 415127 405904 396991 389431 383606 378874 374342 369941
55737 369941 366266 363494 361081 358532 355783 352689 348933 344754 341066 338321 335750 332276 327881 323562
55723 323562 320116 317351 314402 310530 305671 300490 295848 292126 289085 286351 283810 281469 279262 277225
55709 277225 275724 275246 275948 277479 279296 281172 283293 285718 287797 288492 287405 285115 282237 278614 273897
55694 273897 268516 263383 258762 254146 249281 244688 241055 238598 237131 236185 234962 232799 230095 228290
$$ packed form
55792G12249J531J300J729J916N79j715l244l765m510n610n778m887m776o715
55778F78304r973j3564j7477k1168k2829k1506j8522j5475j2333q759n777m326
55766E06595l419j537Q35J830Q78q48k291l318l825l558k891k739l487m752o149
55751D71324p504q412q446p860p486p838q651r223q913p560n825m732m532m401
55737C69941l675k772k413k549k749l094l756m179l688k745k571l474m395m319
55723C23562l446k765k949l872m859n181m642l722l041k734k541k341k207k037
55709B77225j501m78P02J531J817J876K121K425K079O95j087k290k878l623m717
55694B73897n381n133m621m616m865m593l633k457j467r46j223k163k704j805
$$ plain form
55680 228290 228466 230177 231952 232715 232468 231768 230928 229773 227972 225536 222879 220314 217659 214613 211454
55665 211454 208963 207599 207070 206852 206792 207026 207602 208430 209450 210634 211911 213247 214749 216627 219074 222103
55649 222103 225374 228252 230335 231941 233826 236373 239224 241771 243707 244991 245495 244923 242976 239563 234904
55634 234904 229497 223924 218670 214082 210278 206960 203555 199852 196339 193631 191657 189839 187968 186507
55620 186507 186004 186553 187831 189265 190195 190351 190266 190697 191484 191519 190126 187906 185779 183656 180714 176682 172181
55603 172181 167833 163709 159886 156940 155401 154951 154658 153945 153005 152218 151584 151013 150844 151533 152794 153572 153174
55586 153174 152144 151653 152198 153250 154123 154766 155631 157122 159369 162362 166051 170329 174963 179623 184080
55571 184080 188499 193429 199377 206416 214231 222361 230184 236886 241759 244488 244986 243089 238754 232446
$$ packed form
55680B28290J76J711J775P63k47p00q40j155j801k436k657k565k655l046l159
55665B11454k491j364n29k18o0K34N76Q28J020J184J277J336J502J878K447L029
55649B22103L271K878K083J606J885K547K851K547J936J284N04n72j947l413m659
55634B34904n407n573n254m588l804l318l405l703l513k708j974j818j871j461
55620A86507n03N49J278J434R30J56q5M31P87L5j393k220k127k123k942m032m501
55603A72181m348m124l823k946j539m50k93p13r40p87o34n71j69O89J261P78l98
55586A53174j030m91N45J052Q73O43Q65J491K247K993L689M278M634M660M457
55571A84080M419M930N948P039P815Q130P823O702M873K729M98j897m335o308
$$ plain form
55557 232446 224933 216728 208030 199170 190626 182558 174731 167012 159641 152931 147065 142227 138515 135588
55543 135588 132862 130221 128072 126474 124754 122422 119992 118352 117608 117145 116572 116021 115580 115083 114555 114338
55527 114338 114663 115501 116848 118625 120214 120761 120300 119979 120659 121783 122254 122081 122340 123534 124831 125120 124168
55510 124168 122430 120368 118365 116815 115687 114328 112251 109899 108129 107077 106068 104538 102527 100372
55496 100372 98441 97105 96417 95879 95090 94480 94669 95189 94854 93565 92630 92834 93281 92956 92382 92650 93534 93951
55478 93951 93933 94712 96746 98917 100036 100153 99984 99923 100114 100794 101946 103006 103427 103240 102783 102237 101733 101506
55460 101506 101544 101429 100915 100352 100217 100483 100870 101452 102499 103823 104791 105022 104721 104229 103592 102754 101978 101753
55442 101753 102239 102961 103227 102832 102198 101813 101759 101877 102144 102593 103066 103361 103512 103619 103514 102967 102141 101470 101140
$$ packed form
55557B32446p513q205q698q860q544q068p827p719p371o710n866m838l712k927
55543A35588k726k641k149j598j720k332k430j640p44m63n73n51m41m97n28k17
55527A14338L25Q38J347J777J589N47m61l21O80J124M71j73K59J194J297K89r52
55510A24168j738k062k003j550j128j359k077k352j770j052j009j530k011k155
55496A00372j931j336o88n38p89o10J89N20l35j289r35K04M47l25n74K68Q84M17
55478I3951j8P79K034K171J119J17j69o1J91O80J152J060M21j87m57n46n04k27
55460A01506L8j15n14n63j35K66L87N82J047J324R68K31l01m92o37q38p76k25
55442A01753M86P22K66l95o34l85n4J18K67M49M73K95J51J07j05n47q26o71l30
$$ plain form
55423 101140 101134 101670 103013 104791 106145 106813 107585 109300 111793 114231 116174 117894 119808 121927 123797 124775
55407 124775 124513 123361 122140 121377 120885 120198 119133 117744 115972 113616 110548 106910 103330 100879 100293
55392 100293 101026 101554 100995 99971 99470 99383 98870 97858 97264 97659 98483 98793 98276 97215 95962 94822 94184
55375 94184 94324 95159 96395 97787 99010 99536 99038 97925 97128 97219 97909 98533 98838 99135 99805 100860 101938
55358 101938 102619 102750 102582 102468 102309 101471 99574 97291 95907 96009 97032 98246 99627 101334 102844 103315
55342 103315 102633 101455 100237 98878 97424 96468 96463 97052 97456 97310 96824 96343 96030 95901 95903 95918 95747 95158 94032
55323 94032 92631 91545 91155 91185 91062 90625 90163 89831 89515 89369 89974 91696 94132 96453 98120 99139 99783
55306 99783 100216 100308 99766 98606 97355 96561 96176 95766 95255 95043 95392 96111 96902 97606 98062 98144 97984 97761 97336
$$ packed form
55423A01140oN36J343J778J354O68P72J715K493K438J943J720J914K119J870R78
55407A24775k62j152j221p63m92o87j065j389j772k356l068l638l580k451n86
55392A00293P33N28n59j024n01q7n13j012n94L95Q24L10n17j061j253j140o38
55375I4184J40Q35J236J392J223N26m98j113p97R1O90O24L05K97O70J055J078
55358A01938O81J31j68j14j59q38j897k283j384J02J023J214J381J707J510M71
55342A03315o82j178j218j359j454r56nN89M04j46m86m81l13j29KJ5j71n89j126
55323I4032j401j086l90L0j23m37m62l32l16j46O05J722K436K321J667J019O44
55306I9783M33R2n42j160j251p94l85m10n11k12L49P19P91P04M56Q2j60k23m25
$$ plain form
55287 97336 96592 96058 96480 97724 98825 99227 99221 99016 98377 97508 97334 98281 99625 100640 101545 102568 103022 102354
55269 102354 101416 101449 102253 102569 102045 101568 101707 102056 102278 102709 103568 104464 105060 105547 106117 106577 106721 106516 105765
55250 105765 104218 102266 100876 100503 100644 100754 100980 101559 102045 101753 100708 99678 99335 99668 100121 100156 99730
55233 99730 99319 99331 99554 99473 99052 98772 98893 99062 98791 97983 96975 96387 96859 98420 100126 100944 100973 101164 101776
55214 101776 101987 101360 100727 101031 101985 102635 102688 102471 102007 101084 100095 99886 100599 101350 101304 100610 100105 100429 101582
55195 101582 103028 104047 104207 103649 102892 102394 102375 102829 103471 103794 103509 102845 102145 101335 100172 98922 98288 98607
55177 98607 99499 100462 101438 102685 104399 106602 109076 111197 112207 112002 111423 111398 111866 111955 111168 110018 109381
55160 109381 109568 110257 111041 111698 112019 111808 111183 110569 110216 109910 109378 108775 108459 108409 108216 107670 106977 106310 105498
$$ packed form
55287I7336p44n34M22J244J101M02ok05o39q69j74R47J344J015R05J023M54o68
55269A02354r38L3Q04L16n24m77J39L49K22M31Q59Q96N96M87N70M60J44k05p51
55250A05765j547j952j390l73J41J10K26N79M86k92j045j030l43L33M53L5m26
55233I9730m11J2K23q1m21k80J21J69k71q08j008n88M72J561J706Q18K9J91O12
55214A01776K11o27o33L04R54O50N3k17m64r23r89k09P13P51m6o94n05L24J153
55195A01582J446J019J60n58p57m98j9M54O42L23k85o64p00q10j163j250o34L19
55177I8607Q92R63R76J247J714K203K474K121J010k05n79k5M68Q9p87j150o37
55160A09381J87O89P84O57L21k11o25o14l53l06n32o03l16n0j93n46o93o67q12
$$ plain form
55141 105498 104446 103549 103367 103998 105063 106170 107095 107596 107483 106978 106625 106650 106683 106299 105650 105282 105459 105983
55123 105983 106621 107311 107807 107482 105897 103582 101859 101672 102687 103738 104071 103947 104039 104576 105239 105672 105780
55106 105780 105649 105522 105903 107255 109343 111161 111884 111734 111578 111827 112206 112589 113392 114793 116112 116545 116298
55089 116298 116355 117167 118120 118475 118311 118275 118733 119508 120256 120781 121020 120971 120668 120178 119607 119080 118592 117911 116822
55070 116822 115504 114494 114182 114480 114983 115256 114955 113934 112399 110800 109518 108757 108599 108815 108750 107919 106846
55053 106846 106727 108030 109929 111335 111921 111769 110775 109109 107730 107505 108030 108181 107688 107289 107357 107351 106918 106645
55035 106645 107193 108323 109405 110446 111969 114008 115822 116692 116622 116176 115775 115370 114735 113982 113567 113715 114035
55018 114035 113982 113542 113162 113056 112967 112651 112240 111996 112010 112302 112902 113680 114339 114776 115227 115866 116449 116631 116511 116604
$$ packed form
55141A05498j052q97j82O31J065J107R25N01j13n05l53K5L3l84o49l68J77N24
55123A05983O38O90M96l25j585k315j723j87J015J051L33j24R2N37O63M33J08
55106A05780j31j27L81J352K088J818P23j50j56K49L79L83Q03J401J319M33k47
55089A16298N7Q12R53L55j64l6M58P75P48N25K39m9l03m90n71n27m88o81j089
55070A16822j318j010l12K98N03K73l01j021j535j599j282p61j58K16o5q31j073
55053A06846j19J303J899J406N86j52r94j666j379k25N25J51m93l99O8om33k73
55035A06645N48J130J082J041J523K039J814Q70p0m46m01m05o35p53m15J48L20
55018A14035n3m40l80j06q9l16m11k44J4K92O00P78O59M37M51O39N83J82j20R3
$$ plain form
54998 116604 117188 117874 117922 117028 115708 114779 114527 114597 114723 115178 116273 117782 119241 120580 121940 123060 123444
54981 123444 123166 122942 123252 123822 124144 124084 123800 123460 123315 123744 124918 126502 127904 128720 128949 128937 129104 129560
54963 129560 129951 129892 129481 129110 128914 128752 128665 128871 129324 129705 129915 130123 130282 130074 129499 129067 129281 130205 131618
54944 131618 133145 134213 134408 134007 133677 133549 133124 132228 131430 131342 132062 133533 135708 138067 139688 140303 140700
54927 140700 141618 142872 144095 145702 148347 151889 155678 159573 163928 168852 174222 180305 187689 196511
54913 196511 206233 216106 225436 233491 239586 243248 244032 241477 235650 227512 218312 208805 199420 190731
54899 190731 183196 176658 170741 165561 161487 158436 156018 154178 153094 152567 152220 152157 152724 153643 154128 153931
54883 153931 153649 153918 154944 156818 159589 162856 165958 168913 172677 178246 185838 195023 205114 215295
$$ packed form
54998A16604N84O86M8q94j320r29k52P0J26M55J095J509J459J339J360J120L84
54981A23444k78k24L10N70L22o0k84l40j45M29J174J584J402Q16K29j2J67M56
54963A29560L91n9m11l71j96j62q7K06M53L81K10K08J59k08n75m32K14R24J413
54944A31618J527J068J95m01l30j28m25q96p98q8P20J471K175K359J621O15L97
54927A40700R18J254J223J607K645L542L789L895M355M924N370O083P384Q822
54913A96511R722R873R330Q055O095L662P84k555n827q138r200r507r385q689
54899A90731p535o538n917n180m074l051k418j840j084n27l47o3N67R19M85j97
54883A53931k82K69J026J874K771L267L102K955L764N569P592R185J0091J0181
$$ plain form
54869 215295 224856 233522 241182 247228 250641 250896 248304 243329 236110 226907 216501 205860 195696 186545
54855 186545 178837 172660 167771 164022 161333 159129 156363 152484 148051 144072 141013 138667 136615 134447
54841 134447 131882 129023 126397 124476 123271 122496 121919 121477 121313 121772 122996 124476 125403 125579 125533 125611 125526
54824 125526 125088 124781 125163 126115 127179 128229 129271 129935 129827 129252 129027 129583 130684 131955 133173 134013 134001
54807 134001 132950 131211 129397 128002 127305 127337 127834 128352 128550 128340 127819 127164 126621 126477 126965 128105 129584
54790 129584 130885 131633 131842 131693 131240 130558 130010 130007 130535 131314 132397 134103 136269 138170 139392 140304 141401
54773 141401 142734 144365 146782 150299 154495 158879 163689 169330 175384 181104 186824 193895 203004 213383
54759 213383 224017 234785 245768 255985 263686 267798 268433 265984 260445 251973 241661 231134 221399
$$ packed form
54869B15295R561Q666P660O046L413K55k592m975p219r203j0406j0641j0164r151
54855A86545p708o177m889l749k689k204k766l879m433l979l059k346k052k168
54841A34447k565k859k626j921j205p75n77m42j64M59J224J480R27J76m6P8q5
54824A25526m38l07L82R52J064J050J042O64j08n75k25N56J101J271J218Q40j2
54807A34001j051j739j814j395o97L2M97N18J98k10n21o55n43j44M88J140J479
54790A29584J301P48K09j49m53o82n48lN28P79J083J706K166J901J222R12J097
54773A41401J333J631K417L517M196M384M810N641O054N720N720P071R109J0379
54759B13383J0634J0768J0983J0217P701M112O35k449n539q472j0312j0527r735
$$ plain form
54746 221399 212479 204194 196835 190800 185919 181636 177732 174394 171576 168858 166139 163878 162309 160842
54732 160842 158821 156667 155673 156645 159105 161912 164295 166247 168251 170787 173934 177355 180798 184585 189474
54717 189474 196007 204062 212972 221887 230091 237148 242724 246171 246528 243218 236678 228028 218203 207774
54703 207774 197473 188269 180639 174130 168020 162245 157399 153954 151726 150105 148544 146757 144638 142238
54689 142238 139891 138200 137612 137889 138229 138070 137624 137398 137358 136963 135983 134854 134057 133549 133054 132656 132709 133294
54671 133294 134096 134807 135341 135584 135243 134152 132587 131067 129884 128995 128380 128293 129002 130353 131730 132466 132279
54654 132279 131418 130510 130219 130809 131928 132945 133536 133881 134245 134558 134615 134551 134873 135987 137779 139651 140875
54637 140875 140986 140066 138774 137971 138176 139262 140614 141535 141589 140724 139232 137601 136341 135753 135744 135873 135751 135450
$$ packed form
54746B21399q920q285p359o035m881m283l904l338k818k718k719k261j569j467
54732A60842k021k154r94R72K460K807K383J952K004K536L147L421L443L787M889
54717A89474O533Q055Q910Q915Q204P057N576L447L57l310o540q650r825j0429
54703B07774j0301r204p630o509o110n775m846l445k228j621j561j787k119k400
54689A42238k347j691n88K77L40j59m46k26m0l95r80j129p97n08m95l98N3N85
54671A33294Q02P11N34K43l41j091j565j520j183q89o15q7P09J351J377P36j87
54654A32279q61r08k91N90J119J017N91L45L64L13N7o4L22J114J792J872J224
54637A40875J11r20j292q03K05J086J352R21N4q65j492j631j260n88rJ29j22l01
$$ plain form
54619 135450 135383 135743 136200 136272 135805 134940 133793 132490 131471 131372 132334 133618 134248 134086 134009 134862 136393 137511
54601 137511 137510 136766 136114 135952 136161 136606 137182 137488 137002 135744 134386 133560 133278 133158 132870 132252 131374 130717 130889
54582 130889 131851 132760 132945 132693 132583 132417 131462 129700 128112 127550 127845 128289 128585 128995 129805 130960 132122
54565 132122 132929 133284 133464 133881 134671 135630 136513 137178 137447 137159 136484 135934 135881 136216 136613 136907 137051 136961 136678
54546 136678 136536 136868 137622 138482 139275 139996 140514 140652 140649 141152 142472 144098 145211 145566 145543 145472 145339 145218 145465
54527 145465 146221 147056 147553 148014 149084 150768 152357 153411 154231 155152 155883 155988 155591 155090 154452 153376 152056
54510 152056 151164 151023 151238 151296 151039 150458 149526 148520 148076 148435 148886 148424 146926 145334 144651 145009 145773 146233
54492 146233 146080 145443 144706 144279 144368 144891 145566 146082 146217 145949 145513 145271 145374 145610 145701 145790 146461 148159 150650
$$ packed form
54619A35450o7L60M57P2m67q65j147j303j019r9R62J284O30j62p7Q53J531J118
54601A37511jp44o52j62K09M45N76L06m86j258j358q26k82j20k88o18q78o57J72
54582A30889R62R09J85k52j10j66r55j762j588n62K95M44K96M10Q10J155J162
54565A32122Q07L55J80M17P90R59Q83O65K69k88o75n50n3L35L97K94J44r0k83
54546A36678j42L32P54Q60P93P21N18J38lN03J320J626J113L55k3p1j33j21K47
54527A45465P56Q35M97M61J070J684J589J054Q20R21P31J05l97n01o38j076j320
54510A52056q92j41K15N8k57n81r32j006m44L59M51m62j498j592o83L58P64M60
54492A46233j53o37p37m27Q9N23O75N16J35k68m36k42J03K36R1Q9O71J698K491
$$ plain form
54473 150650 153124 154784 155286 154794 153887 153349 153707 154817 156063 157075 158067 159434 161215 163143 164982 166560
54457 166560 167592 167761 166968 165385 163354 161364 159987 159526 159697 159896 159837 159783 160122 160830 161421 161354 160478 159209
54439 159209 158222 157911 158089 158241 157976 157255 156359 155806 156124 157415 159097 160202 160059 158743 157002 155733 155343
54422 155343 155533 155854 156379 157495 159021 160054 159977 159128 158145 157176 156308 156235 157622 159981 162077 163431 164578
54405 164578 165771 166397 166099 165603 165772 166463 166987 167280 167804 168505 168656 167892 166850 166553 167384 168815 170000
54388 170000 170592 171002 171840 173108 174123 174275 173589 172427 170953 169198 167403 165985 165219 165096 165321 165300 164444
54371 164444 162804 161214 160468 160532 160842 161147 161609 162211 162578 162463 162026 161537 161099 160784 160750 161056 161552 162068 162617
54352 162617 163296 164074 164710 164868 164406 163558 162722 161952 160901 159460 158209 157856 158329 158711 158032 155917 152739
$$ packed form
54473A50650K474J660N02m92r07n38L58J110J246J012R92J367J781J928J839J578
54457A66560J032J69p93j583k031j990j377m61J71J99n9n4L39P08N91o7q76j269
54439A59209r87l11J78J52k65p21q96n53L18J291J682J105j43j316j741j269l90
54422A55343J90L21N25J116J526J033p7q49r83r69q68p3J387K359K096J354J147
54405A64578J193O26k98m96J69O91N24K93N24P01J51p64j042k97Q31J431J185
54388A70000N92M10Q38J268J015J52o86j162j474j755j795j418p66j23K25k1q56
54371A64444j640j590p46O4L10L05M62O02L67j15m37m89m38l15l4L06M96N16N49
54352A62617O79P78O36J58m62q48q36p70j051j441j251l53M73L82o79k115l178
$$ plain form
54335 152739 149522 147525 147255 147864 148035 147572 147533 148625 150140 150821 150304 149215 148289 147955 148419 149476 150333
54318 150333 150269 149483 148816 148654 148617 148363 148086 148013 147966 147761 147600 147694 147851 147909 148281 149510 151346 152752 152931 152054
54298 152054 150979 150524 150993 152047 152981 153381 153485 153666 153675 152931 151541 150456 150359 150951 151659 152483 153604 154585
54280 154585 154732 154103 153487 153388 153585 153708 153658 153394 152900 152523 152776 153591 154280 154481 154593 154981 155408 155706 156389
54261 156389 157845 159391 159949 159508 159121 159536 160655 162392 165079 168656 172196 174859 176835 178779 180713
54246 180713 182123 182915 183640 184768 186278 188005 189898 191759 193110 193546 192983 191363 188416 184049 178862
54231 178862 173962 170222 167837 166509 165790 165193 164246 162733 160867 159030 157337 155621 153872 152485 151846
54216 151846 151814 151862 151733 151674 151944 152412 152810 153100 153283 153064 152175 150958 150143 149936 149754 149074 148122 147448 147176
$$ packed form
54335A52739l217j997k70O09J71m63l9J092J515O81n17j089r26l34M64J057Q57
54318A50333o4p86o67j62l7k54k77p3m7k05j61R4J57N8L72J229J836J406J79q77
54298A52054j075m55M69J054R34M00J04J81Rp44j390j085r7N92P08Q24J121R81
54280A54585J47o29o16r9J97J23n0k64m94l77K53Q15O89K01J12L88M27K98O83
54261A56389J456J546N58m41l87M15J119J737K687L577L540K663J976J944J934
54246A80713J410P92P25J128J510J727J893J861J351M36n63j620k947m367n187
54231A78862m900l740k385j328p19n97r47j513j866j837j693j716j749j387o39
54216A51846l2M8j29n9K70M68L98K90J83k19q89j217q15k07j82o80r52o74k72
$$ plain form
54197 147176 147098 147270 147978 149147 150250 150923 151356 151963 152894 153900 154486 154187 152986 151448 150184 149170 147923
54180 147923 146341 144969 144303 144246 144422 144659 144966 145415 146238 147634 149229 150159 150053 149507 149158 148730 147619
54163 147619 146097 145249 145734 147143 148509 148973 148109 146240 144451 143699 143797 143820 143533 143733 145010 146842 148269
54146 148269 148954 149127 148928 148324 147494 146851 146680 146931 147295 147450 147414 147663 148661 150257 151857 153163 154312 155248
54128 155248 155594 155312 154932 154759 154382 153451 152451 152152 152550 152905 152692 152041 151421 151313 152060 153594 155358 156803
54110 156803 157870 158770 159528 160143 160961 162358 164139 165683 166671 167285 167764 168196 168751 169659 170822 171749 171951
54093 171951 171215 169563 167268 164929 163168 162106 161337 160466 159499 158697 158297 158398 158954 159798 160775 161822 162861
54076 162861 163764 164503 165187 165845 166410 167071 168334 170374 172554 173928 174082 173266 171994 170850 170422 170922 172055
$$ packed form
54197A47176p8J72P08J169J103O73M33O07R31J006N86k99j201j538j264j014j247
54180A47923j582j372o66n7J76K37L07M49Q23J396J595R30j06n46l49m28j111
54163A47619j522q48M85J409J366M64q64j869j789p52R8K3k87K00J277J832J427
54146A48269O85J73j99o04q30o43j71K51L64J55l6K49R98J596J600J306J149R36
54128A55248L46k82l80j73l77r31j000k99L98L55k13o51o20j08P47J534J764J445
54110A56803J067R00P58O15Q18J397J781J544R88O14M79M32N55R08J163R27K02
54093A71951p36j652k295k339j761j062p69q71r67q02m00J01N56Q44R77J047J039
54076A62861R03P39O84O58N65O61J263K040K180J374J54q16j272j144m28N00J133
$$ plain form
54059 172055 173551 175514 177844 179782 180717 181109 181819 182754 183072 182648 182341 182706 183440 184307 185617 187350 188764
54042 188764 189586 190865 193844 198433 203498 208294 212910 217613 222491 227697 233426 239632 246101 252738
54028 252738 259448 265949 272069 278036 284085 289905 294917 298939 302175 304699 306430 307541 308387 309023 309234
54013 309234 309088 308958 308869 308245 306559 303908 300706 297018 292564 287262 281521 275890 270609 265625 260967
53998 260967 256840 253306 250093 246952 244019 241514 239216 236750 234357 232774 232106 231399 229736 227293 224855
53983 224855 222765 220925 219513 218843 218579 217843 216263 214349 212689 211289 209918 208593 207410 206271 205096
53968 205096 204057 203363 203021 203028 203536 204563 205751 206683 207324 207926 208688 209710 211107 212854 214660 216268 217848
53951 217848 219771 222007 224057 225602 226945 228585 230536 232319 233573 234443 235282 236207 237118 238074 239405
$$ packed form
54059A72055J496J963K330J938R35L92P10R35L18m24l07L65P34Q67J310J733J414
54042A88764Q22J279K979M589N065M796M616M703M878N206N729O206O469O637
54028B52738O710O501O120N967O049N820N012M022L236K524J731J111Q46O36K11
54013C09234j46j30q9o24j686k651l202l688m454n302n741n631n281m984m658
53998B60967m127l534l213l141k933k505k298k466k393j583o68p07j663k443k438
53983B24855k090j840j412o70k64p36j580j914j660j400j371j325j183j139j175
53968B05096j039o94l42PN08J027J188R32O41O02P62J022J397J747J806J608J580
53951B17848J923K236K050J545J343J640J951J783J254Q70Q39R25R11R56J331
$$ plain form
53936 239405 241405 244049 247063 250117 252913 255222 257072 258842 261067 264086 267905 272274 276863 281571
53922 281571 286829 293407 301615 310760 319659 327680 335021 342078 348984 355879 363175 371183 379685 388210
53908 388210 396570 404816 412757 419854 425660 430118 433455 436008 438163 440103 441436 441330 439276 435677
53894 435677 431513 427501 423702 419764 415252 409771 403071 395279 386945 378741 371169 364480 358594 352944
53880 352944 346655 339349 331786 325404 320983 317980 315284 312398 309584 307026 304328 301014 297182 293334
53866 293334 289669 285857 281596 277132 273139 270137 268107 266538 264804 262674 260580 259336 259404 260515 262049
53851 262049 263684 265531 267926 271388 276619 284067 293357 303586 314362 326259 339963 355236 370827
53838 370827 384981 395630 400612 398575 389928 376546 360482 343212 325910 309669 295053 281895
$$ packed form
53936B39405K000K644L014L054K796K309J850J770K225L019L819M369M589M708
53922B81571N258O578Q208R145Q899Q021P341P057O906O895P296Q008Q502Q525
53908C88210Q360Q246P941P097N806M458L337K553K155J940J333j06k054l599
53894D35677m164m012l799l938m512n481o700p792q334q204p572o689n886n650
53880C52944o289p306p563o382m421l003k696k886k814k558k698l314l832l848
53866B93334l665l812m261m464l993l002k030j569j734k130k094j244O8J111J534
53851B62049J635J847K395L462N231P448R290J0229J0776J1897J3704J5273J5591
53838C70827J4154J0649M982k037q647j3382j6064j7270j7302j6241j4616j3158
$$ plain form
53826 281895 269956 259573 251267 244946 239940 235793 232585 230382 228747 227163 225807 225537 226925 229443
53812 229443 231883 233591 235032 236972 239400 241561 242983 244124 245874 248703 252367 256276 259998 263566
53798 263566 267379 271797 276782 282022 287319 292685 298075 303285 308149 312646 316699 320051 322444 323817
53784 323817 324345 324430 324581 325027 325418 325169 324140 322730 321241 319490 317199 314460 311580 308615 305226 300933
53768 300933 295551 289591 284126 279907 276608 273347 269888 266739 263972 260761 256517 251851 247769 244388
53754 244388 241147 237928 235182 233068 231288 229815 229052 229037 229079 228505 227387 226217 225170 223968 222370 220574
53738 220574 219125 218482 218633 219212 220031 221282 223034 224748 225704 225788 225544 225491 225747 226220 226765 227141 227311 227793
53720 227793 229273 231665 233914 234967 234691 233735 232842 232450 232632 233072 233247 232928 232432 232246 232489 232924 233436
$$ packed form
53826B81895j1939j0383q306o321n006m147l208k203j635j584j356k70J388K518
53812B29443K440J708J441J940K428K161J422J141J750K829L664L909L722L568
53798B63566L813M418M985N240N297N366N390N210M864M497M053L352K393J373
53784C23817N28Q5J51M46L91k49j029j410j489j751k291k739k880k965l389m293
53768C00933n382n960n465m219l299l261l459l149k767l211m244m666m082l381
53754B44388l241l219k746k114j780j473p63j5M2n74j118j170j047j202j598j796
53738B20574j449o43J51N79Q19J251J752J714R56Q4k44n3K56M73N45L76J70M82
53720B27793J480K392K249J053k76r56q93l92J82M40J75l19m96j86K43M35N12
$$ plain form
53703 233436 234277 235818 238129 240902 243830 246940 250331 253590 255869 256786 257001 257472 258350 259102 259622 260565
53687 260565 262427 264790 266812 268133 268994 269628 269800 268964 266890 264258 262481 262529 263911 265192 265597 265659
53671 265659 266187 267196 268201 269099 270177 271445 272515 273145 273509 273873 274275 274666 275216 276408 278833 282804
53655 282804 288114 294278 301021 308452 316795 326236 337081 349754 364458 381064 399373 418977 438451
53642 438451 454907 464890 465965 457610 441208 419657 396616 375218 356921 341589 328604 317716
53630 317716 308983 302390 297743 294746 293063 292387 292490 293104 293876 294695 295958 298153 301050 303639 305098
53615 305098 305596 305959 306743 307987 309707 312156 315376 318751 321349 322711 323140 323312 323837 325160 327447 330277
53599 330277 332699 333969 334236 334287 334646 335204 335580 335498 334788 333463 331937 330804 330187 329601 328642 327486 326451
$$ packed form
53703B33436Q41J541K311K773K928L110L391L259K279R17K15M71Q78P52N20R43
53687B60565J862K363K022J321Q61O34J72q36k074k632j777M8J382J281M05O2
53671B65659N28J009J005Q98J078J268J070O30L64L64M02L91N50J192K425L971
53655B82804N310O164O743P431Q343R441J0845J2673J4704J6606J8309J9604J9474
53642D38451J6456R983J075q355j6402k1551k3041k1398j8297j5332j2985j0888
53630C17716q733o593m647k997j683o76J03O14P72Q19J263K195K897K589J459
53615C05098M98L63P84J244J720K449L220L375K598J362M29J72N25J323K287K830
53599C30277K422J270K67N1L59N58L76q2p10j325j526j133o17n86r59j156j035
$$ plain form
53582 326451 325410 324047 322407 320756 319054 317092 315092 313619 312779 311967 310578 308609 306295 303566 300345
53567 300345 297241 295396 295392 296490 297206 296599 294918 293088 291837 291399 291759 292735 293819 294329 294066 293652 293960
53550 293960 295255 297149 299262 301602 304214 306791 308934 310636 312298 314334 316981 320487 325159 330996
53536 330996 337422 343648 349351 354817 360426 366234 372192 378556 385863 394504 404469 415372 426585 437501
53522 437501 447991 458639 470301 483387 497653 512568 527677 542790 558206 574705 592874
53511 592874 612374 632233 651950 671906 692619 714059 735881 757819 779574 800778 821428
53500 821428 841970 862539 882530 901434 919718 938239 957030 975328 992719 1009520 1026016
53489 1026016 1042071 1057690 1073443 1089959 1107378 1125400 1143477 1160762 1176406 1190239 1202792
$$ packed form
53582C26451j041j363j640j651j702j962k000j473q40q12j389j969k314k729l221
53567C00345l104j845mJ098P16o07j681j830j251m38L60R76J084N10k63m14L08
53550B93960J295J894K113K340K612K577K143J702J662K036K647L506M672N837
53536C30996O426O226N703N466N609N808N958O364P307Q641R965J0903J1213J0916
53522D37501J0490J0648J1662J3086J4266J4915J5109J5113J5416J6499J8169
53511E92874J9500J9859J9717J9956K0713K1440K1822K1938K1755K1204K0650
53500H21428K0542K0569J9991J8904J8284J8521J8791J8298J7391J6801J6496
53489A026016J6055J5619J5753J6516J7419J8022J8077J7285J5644J3833J2553
$$ plain form
53478 1202792 1214401 1224697 1233328 1240683 1247319 1252957 1256755 1258496 1258823 1258148 1255914 1251280 1244125 1235000
53464 1235000 1224328 1212101 1198290 1183214 1167449 1151587 1136056 1120847 1105358 1088798 1070934
53453 1070934 1052293 1033519 1014778 996002 977434 959528 942417 925860 909718 894164 879415
53442 879415 865617 853028 841857 831756 821824 811430 800870 791035 782723 776368 772085 769627 768623
53429 768623 769187 772010 777489 785011 793527 802635 812616 823657 835630 848580 862790 878262 894627
53416 894627 911716 929756 948882 968936 989982 1012586 1037246 1063870 1092086 1121830 1153396
53405 1153396 1187134 1223306 1261945 1302553 1344192 1386258 1429088 1473541 1520033 1568230 1617522
53394 1617522 1667499 1717892 1768363 1818470 1867846 1916389 1964316 2011990 2059550 2106679 2152693
$$ packed form
53478A202792J1609J0296Q631P355O636N638L798J741L27o75k234m634p155r125
53464A235000j0672j2227j3811j5076j5765j5862j5531j5209j5489j6560j7864
53453A070934j8641j8774j8741j8776j8568j7906j7111j6557j6142j5554j4749
53442H79415j3798j2589j1171j0101r932j0394j0560r835q312o355m283k458j004
53429G68623N64K823N479P522Q516R108R981J1041J1973J2950J4210J5472J6365
53416H94627J7089J8040J9126K0054K1046K2604K4660K6624K8216K9744L1566
53405A153396L3738L6172L8639M0608M1639M2066M2830M4453M6492M8197M9292
53394A617522M9977N0393N0471N0107M9376M8543M7927M7674M7560M7129M6014
$$ plain form
53383 2152693 2196785 2238254 2276673 2311905 2343847 2372209 2396692 2417321 2434313 2447525 2456391
53372 2456391 2460523 2460138 2455729 2447601 2435900 2420675 2401474 2377172 2346824 2310769 2270426 2226857
53360 2226857 2179944 2129171 2074907 2018565 1961633 1904895 1848635 1793226 1739234 1687056 1636750
53349 1636750 1588270 1541624 1496643 1452842 1409766 1367355 1325725 1284725 1244146 1204328 1166040
53338 1166040 1129641 1094812 1061286 1029258 998749 969188 940366 913398 889887 870163 853069
53327 853069 837455 823048 809701 796802 784120 772615 763580 757197 752625 749311 747487 747329 748339
53314 748339 749897 751995 755150 759884 766471 774849 784492 794654 805066 816256 828959 843387 859332
53301 859332 876754 895852 916578 938497 961209 984648 1008857 1033682 1058839 1084173 1109831
$$ packed form
53383B152693M4092M1469L8419L5232L1942K8362K4483K0629J6992J3212Q866
53372B456391M132l85m409q128j1701j5225j9201k4302l0348l6055m0343m3569
53360B226857m6913n0773n4264n6342n6932n6738n6260n5409n3992n2178n0306
53349A636750m8480m6646m4981m3801m3076m2411m1630m1000m0579l9818l8288
53338A166040l6399l4829l3526l2028l0509k9561k8822k6968k3511j9724j7094
53327H53069j5614j4407j3347j2899j2682j1505r035o383m572l314j824j58J010
53314G48339J558K098L155M734O587Q378R643J0162J0412J1190J2703J4428J5945
53301H59332J7422J9098K0726K1919K2712K3439K4209K4825K5157K5334K5658
$$ plain form
53290 1109831 1136235 1163768 1192255 1220714 1247861 1272860 1295417 1315320 1332358 1346754 1359121
53279 1359121 1369679 1377846 1382902 1384840 1384257 1381681 1377313 1371190 1363198 1353093 1340861 1326924 1311588
53266 1311588 1294495 1275097 1253646 1231202 1208625 1185993 1162943 1139048 1113784 1086797 1058547
53255 1058547 1030144 1002138 973846 944373 914013 884076 855467 827989 801051 774497 748469
53244 748469 722832 697234 671767 647238 624507 603542 583338 562865 542009 521509 502132
53233 502132 484190 467705 452623 438767 425937 414275 404274 396153 389364 382936 376246 369312
53221 369312 362459 355902 349652 343672 338070 333034 328488 323904 318705 312894 306973 301256 295621 290046
53207 290046 284979 280871 277661 275009 272748 270756 268675 266196 263513 261091 259064 257215 255454 253904
$$ packed form
53290A109831K6404K7533K8487K8459K7147K4999K2557J9903J7038J4396J2367
53279A359121J0558Q167N056J938n83k576m368o123p992j0105j2232j3937j5336
53266A311588j7093j9398k1451k2444k2577k2632k3050k3895k5264k6987k8250
53255A058547k8403k8006k8292k9473l0360k9937k8609k7478k6938k6554k6028
53244G48469k5637k5598k5467k4529k2731k0965k0204k0473k0856k0500j9377
53233E02132j7942j6485j5082j3856j2830j1662j0001q121o789o428o690o934
53221C69312o853o557o250n980n602n036m546m584n199n811n921n717n635n575
53207B90046n067m108l210k652k261j992k081k479k683k422k027j849j761j550
$$ plain form
53193 253904 252569 251245 249813 248329 246875 245571 244642 244094 243420 242080 240286 238846 238099 237440 236118
53178 236118 234134 232160 230808 230248 230257 230433 230466 230354 230246 230068 229515 228482 227227 226058 225102 224471 224247 224217
53160 224217 224001 223702 224019 225380 227258 228693 229224 228983 228218 227238 226578 226597 226986 227159 227158 227595 228640 229616
53142 229616 229859 229530 229310 229623 230419 231437 232357 232907 233144 233535 234507 235962 237404 238480 239287 240204 241504
53125 241504 243081 244481 245352 245864 246480 247280 247804 247678 247097 246560 246473 247188 248949 251363 253286 253815 253231
53108 253231 252484 251969 251377 250548 249651 248469 246415 243611 241242 240286 240361 240365 239821 239058 238309 237338 235944 234320
53090 234320 232883 231983 231699 231605 230895 229112 226653 224264 222233 220501 219325 219171 219941 220872 221364 221380 220977
53073 220977 220006 218578 217288 216595 216296 216008 215817 216027 216506 216781 216664 216333 215822 214923 213684 212622 212087
$$ packed form
53193B53904j335j324j432j484j454j304r29n48o74j340j794j440p47o59j322
53178B36118j984j974j352n60RJ76L3j12j08j78n53j033j255j169r56o31k24l0
53160B24217k16k99L17J361J878J435N31k41p65r80o60J9L89J73jM37J045R76
53142B29616K43l29k20L13P96J018R20N50K37L91R72J455J442J076Q07R17J300
53125B41504J577J400Q71N12O16Q00N24j26n81n37q7P15J761K414J923N29n84
53108B53231p47n15n92q29q97j182k054k804k369r56P5Mn44p63p49r71j394j624
53090B34320j437r00k84r4p10j783k459k389k031j732j176j54P70R31M92J6m03
53073B20977r71j428j290o93k99k88j91K10M79K75j17l31n11q99j239j062n35
$$ plain form
53056 212087 211652 210489 208384 206116 204694 204384 204632 204794 204639 204211 203675 203450 204033 205254 206102 205803 204840
53039 204840 204291 204378 204386 203954 203500 203142 202163 200143 197919 196659 196459 196585 196684 196909 197092 196737 195899 195246 195060
53020 195060 194952 194826 195402 197200 199498 200936 201040 200663 200908 201987 203221 203910 204018 204060 204478 205194 205837
53003 205837 206284 206757 207370 207795 207542 206544 205321 204568 204564 204941 204952 204065 202382 200555 199237 198539 197981 197010
52985 197010 195653 194604 194618 195850 197858 200121 202263 203872 204552 204392 204065 204120 204315 203917 202595 200756
52969 200756 199131 198303 198617 200170 202732 205705 208294 209832 210148 209693 209160 208840 208524 208033 207552 207273 207027
52952 207027 206583 206064 205717 205484 205133 204652 204156 203606 203010 202698 202935 203379 203460 203177 203042 203252 203535 203793 204238
52933 204238 204707 204486 203137 201061 198928 196995 195274 193901 192938 192085 191043 189937 189081 188530 188251 188514
$$ packed form
53056B12087m35j163k105k268j422l10K48J62j55m28n36k25N83J221Q48k99r63
53039B04840n49Q7Qm32m54l58r79k020k224j260k00J26R9K25J83l55q38o53j86
53020A95060j08j26N76J798K298J438J04l77K45J079J234O89J08M2M18P16O43
53003B05837M47M73O13M25k53r98j223p53mL77J1q87j683j827j318o98n58r71
52985A97010j357j049J4J232K008K263K142J609O80j60l27N5J95l98j322j839
52969B00756j625q28L14J553K562K973K589J538L16m55n33l20l16m91m81k79k46
52952B07027m44n19l47k33l51m81m96n50n96l12K37M44Q1k83j35K10K83K58M45
52933B04238M69k21j349k076k133j933j721j373r63q53j042j106q56n51k79K63
$$ plain form
52917 188514 189651 191441 193056 193734 193416 192721 192370 192571 192875 192725 192073 191312 190667 189978 189100 188122 187152 186301
52899 186301 186003 186790 188435 189792 189963 189260 188628 188505 188775 189522 191047 193182 195224 196734 197934 199173
52883 199173 200317 200869 200461 199157 197459 196013 195079 194354 193524 192876 192997 193893 194813 195020 194411 193336 192188
52866 192188 191313 190959 191082 191420 191896 192701 193852 194973 195709 196099 196297 196299 196272 196839 198400 200253 201064 200488
52848 200488 199796 200450 202377 204197 204976 205047 204918 204138 201882 198315 194619 191652 189273 187222 186001 186265
52832 186265 187661 188920 189186 188849 188946 190012 191695 193296 194532 195700 197129 198564 199296 198988 198101 197328
52816 197328 196826 196342 195913 195932 196483 197059 197180 197041 197331 198544 200708 203615 207089 210944 214795 218019 220008
52799 220008 220465 219481 217278 214048 210076 205833 201734 197907 194429 191629 189823 188753 187696 186205 184472
$$ packed form
52917A88514J137J790J615O78l18o95l51K01L04j50o52p61o45o89q78r78r70q51
52899A86301k98P87J645J357J71p03o32j23K70P47J525K135K042J510J200J239
52883A99173J144N52m08j304j698j446r34p25q30o48J21Q96R20K07o09j075j148
52866A92188q75l54J23L38M76Q05J151J121P36L90J98Kk7N67J561J853Q11n76
52848B00488o92O54J927J820P79P1j29p80k256l567l696k967k379k051j221K64
52832A86265J396J259K66l37R7J066J683J601J236J168J429J435P32l08q87p73
52816A97328n02m84m29J9N51N76J21j39K90J213K164K907L474L855L851L224J989
52799B20008M57r84k203l230l972m243m099l827l478k800j806j070j057j491j733
$$ plain form
52784 184472 182847 181376 180042 179175 179267 180382 181955 183148 183394 182777 182013 181894 182569 183489 184161 184730 185591
52767 185591 186716 187771 188729 189839 190850 190879 189430 187283 185865 185796 186439 186906 187078 187397 188014 188599 188935
52750 188935 189229 189698 190211 190616 191188 192314 193830 195046 195555 195737 196252 197282 198470 199434 200076 200419 200429
52733 200429 200056 199340 198433 197608 197235 197606 198690 200149 201636 202999 204140 204787 204578 203396 201535 199471
52717 199471 197512 195680 193864 192016 190184 188448 186888 185630 184876 184854 185617 186829 187796 187903 187161 186197
52701 186197 185582 185228 184651 183754 183051 183046 183659 184422 185014 185326 185234 184792 184605 185538 187753 190349 192232 193113 193381
52682 193381 193291 192774 191996 191547 191880 192835 193918 194770 195253 195372 195349 195495 195780 195738 195077 194099 193197 192218 190881
52663 190881 189663 189590 190998 192980 194319 194605 194309 194177 194871 196727 199410 201936 203525 204391 205431 207211
$$ packed form
52784A84472j625j471j334q67R2J115J573J193K46o17p64j19O75R20O72N69Q61
52767A85591J125J055R58J110J011K9j449k147j418o9O43M67J72L19O17N85L36
52750A88935K94M69N13M05N72J126J516J216N09J82N15J030J188R64O42L43J0
52733B00429l73p16r07q25l73L71J084J459J487J363J141O47k09j182j861k064
52717A99471j959j832j816j848j832j736j560j258p54k2P63J212R67J07p42r64
52701A86197o15l54n77q97p03nO13P63N92L12r2m42j87R33K215K596J883Q81K68
52682A93381r0n17p78m49L33R55J083Q52M83J19k3J46K85m2o61r78r02r79j337
52663A90881j218p3J408J982J339K86k96j32O94J856K683K526J589Q66J040J780
$$ plain form
52647 207211 209470 211479 212608 212629 211813 210693 209497 207886 205543 202944 201117 200562 200714 200625 199907 198852
52631 198852 197849 196932 195893 194692 193767 193862 195407 198049 200934 203402 205259 206470 206972 206957 206947 207250 207432
52614 207432 206725 204963 202907 201540 201216 201575 202135 202779 203663 204824 205979 206711 206797 206360 205752 205329 205314 205764
52596 205764 206572 207492 208302 209064 210178 211949 214033 215518 215785 215166 214597 214744 215640 216959 218181 218587 217747
52579 217747 216244 215449 216210 218046 219883 221173 221975 222401 222557 222761 223167 223302 222624 221522 221094 221766 222734
52562 222734 222997 222419 221487 220555 219780 219466 219947 221174 222702 223998 224582 224149 222920 221775 221647 222682 224183
52545 224183 225382 226148 226920 228122 229680 231065 231734 231508 230552 229105 227390 225657 224085 222645 221367
52530 221367 220696 221197 222723 224229 224719 224204 223541 223442 223863 224240 224111 223565 223146 223212 223463 223383 223181 223827 225880
$$ packed form
52647B07211K259K009J129K1q16j120j196j611k343k599j827n55J52q9p18j055
52631A98852j003r17j039j201r25R5J545K642K885K468J857J211N02j5j0L03J82
52614B07432p07j762k056j367l24L59N60O44Q84J161J155P32Q6m37o08m23j5M50
52596B05764Q08R20Q10P62J114J771K084J485K67o19n69J47Q96J319J222M06q40
52579B17747j503p95P61J836J837J290Q02M26J56K04M06J35o78j102m28O72R68
52562B22734K63n78r32r32p75l14M81J227J528J296N84m33j229j145j28J035J501
52545B24183J199P66P72J202J558J385O69k26r56j447j715j733j572j440j278
52530B21367o71N01J526J506M90n15o63r9M21L77j29n46m19O6K51q0k02O46K053
$$ plain form
52511 225880 228715 231283 233315 235235 237163 238644 239433 239974 240844 242027 242963 243137 242480 241283 239793 237923
52495 237923 235468 232648 230186 228600 227612 226581 225424 224660 224612 225031 225632 226554 228029 229851 231424 232259
52479 232259 232278 231816 231409 231408 231709 231947 232064 232466 233519 235011 236300 236910 236902 236783 237083 237924 238951 239769 240474
52460 240474 241603 243579 246343 249481 252406 254407 254881 253807 251864 249878 248190 246592 244676 242186
52446 242186 239271 236572 234810 234086 233745 233108 232124 231134 230313 229748 229820 230921 232761 234374 235002 234653 233734
52429 233734 232469 230974 229607 228883 228969 229405 229406 228498 227009 225954 226255 227982 230408 232806 235017 237189
52413 237189 239284 241082 242549 243949 245630 247861 250876 254873 259938 266044 273043 280597 288251 295789
52399 295789 303366 310911 317367 320936 320374 315927 308910 300653 292081 283982 277101 271780 267788 264648
$$ packed form
52511B25880K835K568K032J920J928J481P89N41Q70J183R36J74o57j197j490j870
52495B37923k455k820k462j586r88j031j157p64m8M19O01R22J475J822J573Q35
52479B32259J9m62m07jL01K38J17M02J053J492J289O10qj19L00Q41J027Q18P05
52460B40474J129J976K764L138K925K001M74j074j943j986j688j598j916k490
52446B42186k915k699j762p24l41o37r84r90q21n65P2J101J840J613O28l49r19
52429B33734j265j495j367p24Q6M36Jr08j489j055L01J727K426K398K211K172
52413B37189K095J798J467J400J681K231L015L997N065O106O999P554P654P538
52399B95789P577P545O456L569n62m447p017q257q572q099o881n321l992l140
$$ plain form
52385 264648 262005 259716 257862 256801 256946 258277 260147 261780 262894 263727 264596 265597 266681 267833 269150
52370 269150 270849 273106 275772 278296 280161 281392 282461 283682 284852 285551 285617 285260 284840 284557 284252 283485
52354 283485 282016 280261 279039 278771 279092 279354 279336 279281 279511 280226 281517 283284 285248 287340 289922 293234
52338 293234 296707 299374 301103 302947 305964 310090 314509 318805 323254 328192 333670 339727 346510 353919
52324 353919 361538 369181 377233 386169 395950 406084 416124 425786 434754 442726 449734 456119 462024 467056
52310 467056 470629 472652 473858 475417 478149 481988 486145 489822 492778 495278 497680 500227 503043 506064
52296 506064 508962 511370 513252 514892 516446 517685 518249 517963 516823 514869 512297 509565 507179 505446 504591
52281 504591 504950 506688 509354 512072 514373 516646 519614 523492 527813 531963 535700 539253 543111 547679
$$ packed form
52385B64648k643k289j854j061J45J331J870J633J114Q33Q69J001J084J152J317
52370B69150J699K257K666K524J865J231J069J221J170O99O6l57m20k83l05p67
52354B83485j469j755j222k68L21K62j8n5K30P15J291J767J964K092K582L312
52338B93234L473K667J729J844L017M126M419M296M449M938N478O057O783P409
52324C53919P619P643Q052Q936R781J0134J0040R662Q968P972P008O385N905N032
52310D67056L573K023J206J559K732L839M157L677K956K500K402K547K816L021
52296E06064K898K408J882J640J554J239N64k86j140j954k572k732k386j733q55
52281E04591L59J738K666K718K301K273K968L878M321M150L737L553L858M568
$$ plain form
52267 547679 552993 558680 564258 569462 574329 579086 584029 589340 594863 600247 605530 611371 618319 625945
52253 625945 633169 639461 645213 650792 655837 659948 663547 667454 671814 676074 679887 683423 686826 690009
52239 690009 693191 697036 701986 707827 714176 720992 728369 736224 744482 753265 762581 772165 781834 791674
52225 791674 801573 810998 819633 827819 835929 843735 850925 857834 864942 872007 878569 885105 892706 901476
52211 901476 910191 917826 924649 931507 938808 946673 955339 964749 974207 983028 991223 999056 1006359 1012835
52197 1012835 1018699 1024358 1029707 1034348 1038381 1042335 1046451 1050654 1055112 1060101 1065226 1069513 1072508 1074775
52183 1074775 1076908 1078539 1078772 1077365 1075021 1072545 1069985 1066636 1061753 1055272 1047896 1040509 1033527 1026841
52169 1026841 1020293 1013971 1008083 1002792 998256 994649 992000 990089 988627 987565 987219 988009 989920 992192
$$ packed form
52267E47679N314N687N578N204M867M757M943N311N523N384N283N841O948P626
52253F25945P224O292N752N579N045M111L599L907M360M260L813L536L403L183
52239F90009L182L845M950N841O349O816P377P855Q258Q783R316R584R669R840
52225G91674R899R425Q635Q186Q110P806P190O909P108P065O562O536P601Q770
52211I01476Q715P635O823O858P301P865Q666R410R458Q821Q195P833P303O476
52197A012835N864N659N349M641M033L954M116M203M458M989N125M287K995K267
52183A074775K133J631K33j407k344k476k560l349m883o481p376p387o982o686
52169A026841o548o322n888n291m536l607k649j911j462j062l46P90J911K272
$$ plain form
52155 992192 993764 994231 994185 994379 994730 994520 993433 991942 990617 989482 988257 986873 985474 984150 982953 982058
52139 982058 981609 981354 980568 978444 974610 969414 963734 958430 953916 950208 947221 944881 943119 942121 942519
52124 942519 944950 949311 954843 961147 968723 978139 988981 1000120 1010959 1021898 1033441 1045232 1056291
52111 1056291 1065970 1074344 1081656 1087682 1091837 1093884 1094379 1094333 1094453 1094729 1094817 1094818 1095612 1098298 1103253 1109813 1116985
$$ packed form
52155I92192J572M67m6J94L51k10j087j491j325j135j225j384j399j324j197q95
52139I82058m49k55p86k124l834n196n680n304m514l708k987k340j762r98L98
52124I42519K431M361N532O304P576R416J0842J1139J0839J0939J1543J1791J1059
52111A056291R679Q374P312O026M155K047M95m6J20K76Q8JP94K686M955O560P172
$$ [...]
##END NTUPLES=NMR SPECTRUM
##END=
