
##TITLE=AC1266_CTIAH12084_6642311_Rj1SJilo9T
##JCAMPDX= 6.0         $$ Bruker NMR JCAMP-DX V2.0
##DATA TYPE= NMR SPECTRUM
##DATA CLASS= NTUPLES
##ORIGIN= BRUKER
##OWNER= Administrator
$$ 1.72 TOPSPIN		Version 2.1
$$ 2012-08-08 18:20:00.437 -0500  Administrator@TOPSPIN
$$ Compression mode = diff/dup
##.OBSERVE FREQUENCY= 400.02188249412
##.OBSERVE NUCLEUS= ^1H
##.ACQUISITION MODE= SIMULTANEOUS (DQD)
##.ACQUISITION SCHEME= undefined
##.AVERAGES= 64
##.DIGITISER RES= 22
##SPECTROMETER/DATA SYSTEM= spect
##.PULSE SEQUENCE= noesygpps1d.comp
##.SOLVENT NAME= COFFEE_meoh
##.SHIFT REFERENCE= INTERNAL, COFFEE_meoh, 1, 14.962
##AUDIT TRAIL= $$ (NUMBER, WHEN, WHO, WHERE, PROCESS, VERSION, WHAT)
$$ ##TITLE= Audit trail, TOPSPIN		Version 2.1
$$ ##JCAMPDX= 5.01
$$ ##ORIGIN= Bruker BioSpin GmbH
$$ ##OWNER= Administrator
$$ $$ C:\Bruker\TOPSPIN/data/COFFEE/nmr/AC1266_CTIAH12084_6642311_Rj1SJilo9T/12/pdata/1/auditp.txt
$$ ##AUDIT TRAIL=  $$ (NUMBER, WHEN, WHO, WHERE, PROCESS, VERSION, WHAT)
(   1,<2012-08-08 18:19:55.453 -0500>,<Administrator>,<TOPSPIN>,<go>,<TOPSPIN 2.1>,
      <created by zg
	started at 2012-08-08 18:08:25.062 -0500,
	POWCHK enabled, PULCHK disabled,
       configuration hash MD5:
       6B 1B 68 BB D9 2E 58 E2 7F 35 AD 54 07 DF 0E 41
       data hash MD5: 64K
       BF 98 B5 7F 64 B9 19 C3 B6 4A 55 8D 95 11 E9 AF>)
(   2,<2012-08-08 18:19:58.359 -0500>,<Administrator>,<TOPSPIN>,<proc1d>,<TOPSPIN 2.1>,
      <Start of raw data processing
       efp LB = 0.3 FT_mod = 6 PKNL = 1 PHC0 = 0 PHC1 = 0 SI = 128K 
       data hash MD5: 128K
       29 F3 FA B2 A5 98 41 C5 5B 59 02 C0 CE B8 3A 4C>)
(   3,<2012-08-08 18:19:59.500 -0500>,<Administrator>,<TOPSPIN>,<proc1d>,<TOPSPIN 2.1>,
      <pk PHC0 = -2.955322 PHC1 = 0 
       data hash MD5: 128K
       64 B9 FA 24 B7 38 13 FD 78 75 42 61 71 78 A3 52>)
(   4,<2012-08-08 18:20:00.093 -0500>,<Administrator>,<TOPSPIN>,<proc1d>,<TOPSPIN 2.1>,
      <abs ABSG = 1 
       data hash MD5: 128K
       16 27 B2 CB 37 69 9F 87 08 E8 5F 39 60 1A 6C DF>)
(   5,<2012-08-08 18:20:00.171 -0500>,<Administrator>,<TOPSPIN>,<proc1d>,<TOPSPIN 2.1>,
      <abs ABSG = 2 
       data hash MD5: 128K
       C2 AA 6D 92 8F 72 99 DF F5 17 90 0A C4 AB 51 9E>)
(   6,<2012-08-08 18:20:00.234 -0500>,<Administrator>,<TOPSPIN>,<proc1d>,<TOPSPIN 2.1>,
      <abs ABSG = 3 
       data hash MD5: 128K
       D9 8C 56 C6 36 42 91 65 11 9B A3 B3 4E 32 04 41>)
(   7,<2012-08-08 18:20:00.296 -0500>,<Administrator>,<TOPSPIN>,<proc1d>,<TOPSPIN 2.1>,
      <abs ABSG = 4 
       data hash MD5: 128K
       A6 2D 28 B7 E4 CC FC B3 D9 E9 9D B7 86 C5 3F 72>)
(   8,<2012-08-08 18:20:00.359 -0500>,<Administrator>,<TOPSPIN>,<proc1d>,<TOPSPIN 2.1>,
      <abs ABSG = 5 
       data hash MD5: 128K
       41 07 13 80 F4 46 6F 4F 1B C2 71 85 67 0F 9A 36>)
$$ ##END=
$$ 
$$ $$ hash MD5
$$ $$ C6 7C 5D FB 32 F9 55 79 5B BA 67 46 B2 F2 0C 41
##$RELAX= 
##$RELAX= 
##$RELAX= 
##$RELAX= 
##$RELAX= 
##$RELAX= 
##$RELAX= 
##$RELAX= 
$$ Bruker specific parameters
$$ [...]
150 150 150 150 150 150 150 150
##$TP07= 0
##$TPNAME0= <>
##$TPNAME1= <>
##$TPNAME2= <>
##$TPNAME3= <>
##$TPNAME4= <>
##$TPNAME5= <>
##$TPNAME6= <>
##$TPNAME7= <>
##$TPOAL= (0..7)
0.5 0.5 0.5 0.5 0.5 0.5 0.5 0.5
##$TPOFFS= (0..7)
0 0 0 0 0 0 0 0
##$TUNHIN= 0
##$TUNHOUT= 0
##$TUNXOUT= 0
##$USERA1= <user>
##$USERA2= <user>
##$USERA3= <user>
##$USERA4= <user>
##$USERA5= <user>
##$V9= 5
##$VALIST= <valist>
##$VCLIST= <CCCCCCCCCCCCCCC>
##$VD= 0
##$VDLIST= <DDDDDDDDDDDDDDD>
##$VPLIST= <PPPPPPPPPPPPPPP>
##$VTLIST= <TTTTTTTTTTTTTTT>
##$WBST= 1024
##$WBSW= 4
##$XGAIN= (0..3)
0 0 0 0
##$XL= 0
##$YL= 0
##$YMAX_a= 16298623
##$YMIN_a= -10804169
##$ZGOPTNS= <>
##$ZL1= 120
##$ZL2= 120
##$ZL3= 120
##$ZL4= 120
##$ABSF1= 14.962
##$ABSF2= -5.596182
##$ABSG= 5
##$ABSL= 3
##$ALPHA= 0
##$AQORDER= 0
##$ASSFAC= 0
##$ASSFACI= 0
##$ASSFACX= 0
##$ASSWID= 0
##$AUNMP= <proc_prof1d_extract.lims>
##$AXLEFT= 0
##$AXNAME= <>
##$AXNUC= <1H>
##$AXRIGHT= 0
##$AXTYPE= 0
##$AXUNIT= <>
##$AZFE= 0.1
##$AZFW= 0.1
##$BCFW= 0
##$BC_mod= 0
##$BYTORDP= 0
##$COROFFS= 0
##$CY= 15
##$DATMOD= 1
##$DC= 0
##$DFILT= <>
##$DTYPP= 0
##$F1P= 0
##$F2P= 0
##$FCOR= 0.5
##$FTSIZE= 131072
##$FT_mod= 6
##$GAMMA= 0
##$GB= 0
##$INTBC= 1
##$INTSCL= 1
##$ISEN= 128
##$LB= 0.3
##$LEV0= 0
##$LPBIN= 0
##$MAXI= 10000
##$MC2= 0
##$MEAN= 0
##$ME_mod= 0
##$MI= 0
##$NCOEF= 0
##$NC_proc= -2
##$NLEV= 6
##$NOISF1= 0
##$NOISF2= 0
##$NSP= 0
##$NTH_PI= 0
##$NZP= 0
##$OFFSET= 14.962
##$PC= 1
##$PHC0= -2.955322
##$PHC1= 0
##$PH_mod= 1
##$PKNL= yes
##$PPARMOD= 0
##$PPDIAG= 0
##$PPIPTYP= 0
##$PPMPNUM= 2147483647
##$PPRESOL= 1
##$PSCAL= 4
##$PSIGN= 0
##$PYNMP= <proc.py>
##$REVERSE= no
##$SF= 400.020009234795
##$SI= 131072
##$SIGF1= 0
##$SIGF2= 0
##$SINO= 400
##$SIOLD= 131072
##$SPECTYP= <>
##$SREGLST= <1H.CDCl3>
##$SSB= 0
##$STSI= 131072
##$STSR= 0
##$SW_p= 8223.68421052631
##$SYMM= 0
##$S_DEV= 0
##$TDeff= 65536
##$TDoff= 0
##$TI= <>
##$TILT= no
##$TM1= 0
##$TM2= 0
##$TOPLEV= 0
##$USERP1= <user>
##$USERP2= <user>
##$USERP3= <user>
##$USERP4= <user>
##$USERP5= <user>
##$WDW= 1
##$XDIM= 131072
##$YMAX_p= 281735917
##$YMIN_p= -11630
##$CURPLOT= <Network HP LaserJet P1505>
##$CURPRIN= <$Network HP LaserJet P1505>
##$DFORMAT= <normdp>
##$LAYOUT= <+/1D_H.xwp>
##$LFORMAT= <normlp>
##$PFORMAT= <normpl>
##$SURQMSG= 1
$$ End of Bruker specific parameters
$$ ---------------------------------
##NTUPLES= NMR SPECTRUM
##VAR_NAME=  FREQUENCY,     SPECTRUM/REAL,   SPECTRUM/IMAG
##SYMBOL=    X,             R,               I
##VAR_TYPE=  INDEPENDENT,   DEPENDENT,       DEPENDENT
##VAR_FORM=  AFFN,          ASDF,            ASDF
##VAR_DIM=   131072,        131072,          131072
##UNITS=     HZ,            ARBITRARY UNITS, ARBITRARY UNITS
##FACTOR=    0.0627417313425164, 1,          1
##FIRST=     8223.62146879497, -2481,        -58399
##LAST=      0,             -1601,           -60158
##MIN=       0,             -11630,          0
##MAX=       8223.62146879497, 281735917,    0
$$ Real data points
##PAGE= N=1
##DATA TABLE= (X++(R..R)), XYDATA
$$ [...]
60943B663825k03382j74905j50846j30491j13335r9469q9125q1618p5428o9487
60933A475739o3793n8667n4182n0384m7313m4608m1695l8707l6457l5265l4347
60922I70321l2798l0597k8344k6446k4941k3699k2420k0765j8743j6714j4893
60911G09961j3188j1599j0339r364q361p372o858o850o613n631m375l610l306
60898F12495k828j964j177q93r43q13k47M17M96l45j615k455k539k225j879j505
60882E91980j138j034j292j687k106k682l301l523l269l046l189l430l488l507
60868E55288l453k802j384P1Q43J163J594K044K184K349L075M111M850N468O627
60853E82028Q162R205R636J0322J1649J2793J2927J2346J1902J1828J1669J0996
$$ y = [2663825, 2460443, 2285538, 2134692, 2004201, 1890866, 1791397, 1702272, 1620654, 1545226, 1475739, 1411946, 1353279, 1299097, 1248713, 1201400, 1156792, 1115097, 1076390, 1039933, 1004668, 970321, 937523, 906926, 878582, 852136, 827195, 803496, 781076, 760311, 741568, 724854, 709961, 696773, 685174, 674835, 665471, 657110, 649738, 642880, 636030, 629417, 623786, 619411, 615801, 612495, 609667, 607703, 606526, 605633, 604690, 603877, 603630, 604047, 604543, 604198, 602583, 600128, 597589, 595364, 593485, 591980, 590842, 589808, 588516, 586829, 584723, 582041, 578740, 575217, 571948, 568902, 565713, 562283, 558795, 555288, 551835, 549033, 547649, 547720, 548563, 549726, 551320, 553364, 555548, 557897, 560972, 565083, 569933, 575401, 582028, 590190, 599395, 609031, 619353, 631002, 643795, 656722, 669068, 680970, 692798, 704467, 715463]
60841G15463R844Q602P724P275O770N686M080K363P28p50j681j823j835k624l919
60826G55903m449l758k923l091m187n472o535p177p102o451n999o196o501o178
60812F79884n280m329l636l470m103n060n094l682j902r56m90M45J597K014J936
60797F47874K583M092N201N293N329O275P749Q887R592J0200J0680J0874J0993
60784G45622J1236J1376J1156J0734J0277R658Q916Q522Q676Q816Q344P420O529
60771H67282N684M627L488K621K053J587J222R83N97j26q19j038j050j491k358
60756H83262l015l250l571m252m663m040k688j847k335l658m630m704m340m090
60742H32179l820l228k718l003l894m301l675k694k081j551n37O84J363J387J209
$$ y = [715463, 725307, 733909, 741633, 748908, 755678, 761364, 765444, 767807, 768535, 767785, 766104, 764281, 762446, 759822, 755903, 751454, 747696, 744773, 741682, 737495, 732023, 725488, 718311, 711209, 704758, 698759, 692563, 686062, 679884, 674604, 670275, 666639, 663169, 659066, 654006, 648912, 645230, 643328, 642372, 641882, 642327, 643924, 645938, 647874, 650457, 654549, 659750, 665043, 670372, 676647, 684396, 693283, 702875, 713075, 723755, 734629, 745622, 756858, 768234, 779390, 790124, 800401, 810059, 818975, 827497, 836173, 844989, 853333, 860753, 867282, 872966, 877593, 881081, 883702, 885755, 887342, 888564, 889547, 890144, 890018, 889199, 888161, 887111, 885620, 883262, 880247, 876997, 873426, 869174, 864511, 860471, 857783, 855936, 853601, 849943, 845313, 840609, 836269, 832179, 828359, 825131, 822413, 819410, 815516, 811215, 807540, 804846, 802765, 801214, 800677, 801361, 802724, 804111, 805320]
60727H05320R40L69l01o32p69j242j888j853q71K46P03N43J11o06j619k439k627
60710G93385k460k612l295m069m365l996l329l118l870n160n924n686n164n358
60696G34979o342p380p919q046q072q094q013p750p444p426p882q371q143p102
60682F26995o122o036o579o732n954m567l109j805p54j01J70L52O95J125J415
60667E88993J548J796K438L451M428M921M927M929N342N982O307O121N866O217
60653F53266P416Q992J0089J0226R722R299R234R203Q917Q572Q421Q356Q248Q345
60639G78306Q831R286R159Q657Q531Q954R294R122Q810Q821Q919Q539P516O075
60625H98820M334K378O16m70r68j482k391l473m362m965n291n199m633l839l124
$$ y = [805320, 806260, 806629, 806328, 805696, 804927, 803685, 801797, 799944, 799073, 799319, 800022, 800565, 800676, 800070, 798451, 796012, 793385, 790925, 788313, 785018, 780949, 776584, 772588, 769259, 766141, 762271, 757111, 751187, 745501, 740337, 734979, 728637, 721257, 713338, 705292, 697220, 689126, 681113, 673363, 665919, 658493, 650611, 642240, 634097, 626995, 620873, 614837, 608258, 601526, 595572, 591005, 587896, 586091, 585337, 585236, 585406, 585758, 586453, 587578, 588993, 590541, 592337, 594775, 598226, 602654, 607575, 612502, 617431, 622773, 628755, 635062, 641183, 647049, 653266, 660682, 669674, 679763, 689989, 699711, 709010, 718244, 727447, 736364, 744936, 753357, 761713, 769961, 778306, 787137, 796423, 805582, 814239, 822770, 831724, 841018, 850140, 858950, 867771, 876690, 885229, 892745, 898820, 903154, 905532, 906148, 905678, 904710, 903228, 900837, 897364, 893002, 888037, 882746, 877547, 872914, 869075, 865951]
60610H65951k465j731j125r99j291j578j818k529l976n565o475o628o534o436
60596H16801o182n851n836o156o276n833m969l782k065j8J479J945K177L222M786
60581G83442N572N147M520M672N329N640N382M935M494L937L301K846K606K265
60567H44088J495K59j283k851m089m746m900m915n152n714o409o850o702o033
60553G86198n328m981m754l966k322l77J071J911K755M017N391O489P745J0031
60539H03880J3423J6937J9694K1765K3468K4366K3786K1981J9951J7973J5184
60528A022408J0912N816J227k148m424n875o661p014p078o662n623m392l661l520
60514I83305l462l198k931k592j580L31K375L696M551N895Q007J0336J2670J5550
$$ y = [865951, 863486, 861755, 860630, 859631, 858340, 856762, 854944, 852415, 848439, 842874, 836399, 829771, 823237, 816801, 810619, 804768, 798932, 792776, 786500, 780667, 775698, 771916, 769851, 769833, 771312, 773257, 775434, 778656, 783442, 789014, 794161, 798681, 803353, 808682, 814322, 819704, 824639, 829133, 833070, 836371, 839217, 841823, 844088, 845583, 845842, 844559, 841708, 837619, 832873, 827973, 823058, 817906, 812192, 805783, 798933, 792231, 786198, 780870, 775889, 771135, 767169, 764847, 764470, 765541, 767452, 770207, 774224, 779615, 786104, 793849, 803880, 817303, 834240, 853934, 875699, 899167, 923533, 947319, 969300, 989251, 1007224, 1022408, 1033320, 1039136, 1040363, 1038215, 1033791, 1027916, 1021255, 1014241, 1007163, 1000501, 994878, 990486, 986825, 983305, 979843, 976645, 973714, 971122, 969542, 969873, 972248, 975944, 980495, 986390, 994397, 1004733, 1017403, 1032953]
60500A032953J9222K3059K6526L0059L4247L8628M2255M5103M8005N1293N4549
60489A445899N7873O2414O9164P7955Q8162R9749J13140J28571J46146J65724
60479B454797J85968K03937K16432K21600K18686K06905J85605J55386J18054
60470D167370P5552K9918j5824n8146r4955j26339j52954j74530j90402k00694
60460C258996k06152k07268k04262j97641j88243j76823j64047j50595j36960
60451A627005j23288j09734r6694q4459p3061o2748n4162m7484m1884l6396l1085
60440H66010k6732k3545k0900j8350j6139j4595j3503j2416j1231j0184r405q763
60428F80247q112p553p350p551p800p650p035o217n294m165k983k175j807j387
$$ y = [1032953, 1052175, 1075234, 1101760, 1131819, 1166066, 1204694, 1246949, 1292052, 1340057, 1391350, 1445899, 1503772, 1566186, 1635350, 1713305, 1801467, 1901216, 2014356, 2142927, 2289073, 2454797, 2640765, 2844702, 3061134, 3282734, 3501420, 3708325, 3893930, 4049316, 4167370, 4242922, 4272840, 4257016, 4198870, 4103915, 3977576, 3824622, 3650092, 3459690, 3258996, 3052844, 2845576, 2641314, 2443673, 2255430, 2078607, 1914560, 1763965, 1627005, 1503717, 1393983, 1297289, 1212830, 1139769, 1077021, 1022859, 975375, 933491, 897095, 866010, 839278, 815733, 794833, 776483, 760344, 745749, 732246, 719830, 708599, 698415, 689010, 680247, 672135, 664582, 657232, 649681, 641881, 634231, 627196, 620979, 615685, 611520, 608537, 606362, 604555, 603168]
60414F03168o60j50l56p69l01J308L099L942L620K743K030J779J890K209K752
60399F26304L525M222M451M347M534N245N909N995N799N889O158O035N470M927
60385F98810M533L918L036K392K229K057J342K20q36j650k289k619k435j937j727
60370G05044k142k793k891k110r89l42l71n57m21k3M19J002J867K756L267L425
60354G05141L602L995M454M865N370O223P505Q827R311Q379O711N817O219O707
60340G93126O127N183N348O491P013O403O080P161Q705R131Q505Q231Q908R569
60326H95981R067P368N259L321J528l67k305l886m851n465o232p306q414r256
60312H74442r733r756r251q384p458o557n571m595l882l437k997k438j809j037
$$ y = [603168, 602508, 602358, 602002, 601233, 600932, 602240, 605339, 609281, 612901, 615644, 617674, 619453, 621343, 623552, 626304, 629829, 634051, 638502, 642849, 647383, 652628, 658537, 664532, 670331, 676220, 682378, 688413, 693883, 698810, 703343, 707261, 710297, 712689, 714918, 716975, 718317, 718537, 717701, 716051, 713762, 711143, 708708, 706771, 705044, 702902, 700109, 697218, 695108, 694119, 693777, 693406, 692849, 692428, 692405, 692824, 693826, 695693, 698449, 701716, 705141, 708743, 712738, 717192, 722057, 727427, 733650, 741155, 749982, 759293, 767672, 774383, 780200, 786419, 793126, 799253, 804436, 809784, 816275, 823288, 829691, 835771, 842932, 851637, 860768, 869273, 877504, 886412, 895981, 905048, 912416, 917675, 920996, 922524, 922157, 919852, 915966, 911115, 905650, 899418, 892112, 883698, 874442, 864709, 854953, 845702, 837318, 829860, 823303, 817732, 813137, 809255, 805818, 802821, 800383, 798574, 797537]
60298G97537j05O01O67M03N28J080J362J033N07J03l23o13j01J360K893L731M102
60281H14765M534M990N346N938O921P686P742P546P696P901P647P276P328P322
60267I10638O404N001M509N343O474P090P625Q733J0191J1383J2226J3163J4534
60254A023314J6375J8460K0386K1873K3149K4794K7205L0359L3943L7481M0630
60243A317969M3724M7608N2421N7015O0440O3523O7850P3411P8522Q2135Q4885
60232B029503Q7390Q8925Q8575Q6775Q4575Q1965P7914P1879O4451N6488M8271
60221B866711L9629L0582K1579J3154N327k312r719j5865j9712k1547k2574k3202
60209B862051k2646k0381j7005j3072q016j035P531J6570K5489L4414M3345N1894
$$ y = [797537, 797432, 798033, 798700, 799103, 799631, 800711, 802073, 803106, 803613, 803716, 803393, 802780, 802679, 804039, 806932, 810663, 814765, 819299, 824289, 829635, 835573, 842494, 850180, 857922, 865468, 873164, 881065, 888712, 895988, 903316, 910638, 917042, 922043, 926552, 931895, 938369, 945459, 953084, 961817, 972008, 983391, 995617, 1008780, 1023314, 1039689, 1058149, 1078535, 1100408, 1123557, 1148351, 1175556, 1205915, 1239858, 1277339, 1317969, 1361693, 1409301, 1461722, 1518737, 1579177, 1642700, 1710550, 1783961, 1862483, 1944618, 2029503, 2116893, 2205818, 2294393, 2381168, 2465743, 2547708, 2625622, 2697501, 2761952, 2818440, 2866711, 2906340, 2936922, 2958501, 2971655, 2976982, 2974670, 2964951, 2949086, 2929374, 2907827, 2885253, 2862051, 2839405, 2819024, 2802019, 2788947, 2780931, 2779896, 2787427, 2803997, 2829486, 2863900, 2907245, 2959139]
60197B959139N9763O6840P2884P7532Q0614Q2119Q1888P9706P5481O9230O1139
60186C766335N1816M2074L2083K1264R349k926j4572k5217l4659m2226m7448n0877
60174C704996n3293n4383n3182m9652m4768l9066l2115k3643j4235m602N061J4568
60162C355686K3296L0718L6827M1666M4939M6460M6526M5389M2785L8450L2838
60151C785580K6853K0957J4925Q416J618m615r146j1287j1262r774p088k824L356
60138C805709J1200K0185L0024M0701N2292O4961P8811R3628J09003J24823J41247
60127D572584J58111J74795J90792K05967K19969K31985K41459K48595K53583
60118F497840K55745K54041K48184K38627K25504K08324J86753J61266J32790
$$ y = [2959139, 3018902, 3085742, 3158626, 3236158, 3316772, 3398891, 3480779, 3560485, 3635966, 3705196, 3766335, 3818151, 3860225, 3892308, 3913572, 3922921, 3919995, 3905423, 3880206, 3845547, 3803321, 3755873, 3704996, 3651703, 3597320, 3544138, 3494486, 3449718, 3410652, 3378537, 3354894, 3340659, 3336057, 3341118, 3355686, 3378982, 3409700, 3446527, 3488193, 3533132, 3579592, 3626118, 3671507, 3714292, 3752742, 3785580, 3812433, 3833390, 3848315, 3856731, 3858349, 3853734, 3844588, 3833301, 3822039, 3812265, 3805177, 3802353, 3805709, 3816909, 3837094, 3867118, 3907819, 3960111, 4025072, 4103883, 4197511, 4306514, 4431337, 4572584, 4730695, 4905490, 5096282, 5302249, 5522218, 5754203, 5995662, 6244257, 6497840, 6753585, 7007626, 7255810, 7494437, 7719941, 7928265, 8115018, 8276284, 8409074]
60109H409074J02043O9342L4965l71l5348o8560r9296j27532j53019j74742j91724
60098G764832k03922k11777k15237k13967k08351j99394j87544j72408j53937
60089E998295j33178j11484q9540o7563m5940k5185n694J1984K6983L8662M7086
60078E644426N2523N4788N3575M9170M2318L3534K3105J1587m12j2942k6573m1322
60066E883777n6186p0032q2498r3781j03874j12421j19093j23703j25969j25542
60056D870678j22397j17167j10834j03911r5921q5974p3982o1040m8253l5494
60046D015705k1854p183P501K1182L3728M5294N5545O3968P0500P5269P7995P8199
60034D515849P5844P1232O4423N5240M3858L0858J6721J682j3851k9154m3519
$$ y = [8409074, 8511117, 8580459, 8615424, 8615053, 8579705, 8511145, 8411849, 8284317, 8131298, 7956556, 7764832, 7560910, 7349133, 7133896, 6919929, 6711578, 6512184, 6324640, 6152232, 5998295, 5865117, 5753633, 5664093, 5596530, 5550590, 5525405, 5519711, 5531695, 5558678, 5597340, 5644426, 5696949, 5751737, 5805312, 5854482, 5896800, 5930334, 5953439, 5965026, 5964614, 5951672, 5925099, 5883777, 5827591, 5757559, 5675061, 5581280, 5477406, 5364985, 5245892, 5122189, 4996220, 4870678, 4748281, 4631114, 4520280, 4416369, 4320448, 4234474, 4160492, 4099452, 4051199, 4015705, 3993851, 3986668, 3994169, 4015351, 4049079, 4094373, 4149918, 4213886, 4284386, 4359655, 4437650, 4515849, 4591693, 4662925, 4727348, 4782588, 4826446, 4857304, 4874025, 4875707, 4861856, 4832702, 4789183]
60023D789183n6466o7664p6959q4442r0108r3499r4163r2450q9247q4864p8767
60012C880554p0588o0831n0153l8598k6016j2849K25J3172K6507M0376N4320O7965
60000C824084Q1383R4495J06534J16391J23382J27452J28762J27265J22693J14897
59990D967338J04148R1029P5979N9089M0456K0630N33j9028l7580n4770p0062
59979E177762q2706r1976r7594r9991j00013r8161r4223q7778p8917o8268n6472
59968D221663m3977l1143j8159m900Q710K2153L4487M5230N4624O2945O9877P4839
59956D496349P7641P8466P7473P4825P0946O6313O0960N4546M7143L9682L3392
59945E177736K8791K5456K2749K0733K0261K2301K7246L4952M5171N7756P2529
$$ y = [4789183, 4732717, 4665053, 4588094, 4503652, 4413544, 4320045, 4225882, 4133432, 4044185, 3959321, 3880554, 3809966, 3749135, 3698982, 3660384, 3634368, 3621519, 3621744, 3634916, 3661423, 3701799, 3756119, 3824084, 3905467, 3999962, 4106496, 4222887, 4346269, 4473721, 4602483, 4729748, 4852441, 4967338, 5071486, 5162515, 5238494, 5297583, 5338039, 5358669, 5359202, 5340174, 5302594, 5247824, 5177762, 5095056, 5003080, 4905486, 4805495, 4705482, 4607321, 4513098, 4425320, 4346403, 4278135, 4221663, 4177686, 4146543, 4128384, 4123484, 4132194, 4154347, 4188834, 4234064, 4288688, 4351633, 4421510, 4496349, 4573990, 4652456, 4729929, 4804754, 4875700, 4942013, 5002973, 5057519, 5104662, 5144344, 5177736, 5206527, 5231983, 5254732, 5275465, 5295726, 5318027, 5345273, 5380225, 5425396, 5483152, 5555681]
59934E555681Q9202J07550J27423J48521J70314J92241K13736K33789K50767K62960
59924G352184K69343K69525K62992K48857K26535J96461J59959J18609P4016K7944
59914I206425j7763o1600j02510j39527j71580j97889k18284k32934k41821k44855
59904G577662k42379k35201k24047k09310j91468j71271j49314j25771j00995
59895E927906p6021n1907k8716n840J6576L7203N4806O9323Q1193R0026R4646
59884F209195R4241Q8812P8559O3573M4416K2376j331k6221n2025p7806j02098
59873F341691j23828j42605j58151j69984j77900j82334j83935j83014j79585
59864D840355j73750j65751j55856j44516j32590j20981j10041r9619q9749q0934
$$ y = [5555681, 5644883, 5752433, 5879856, 6028377, 6198691, 6390932, 6604668, 6838457, 7089224, 7352184, 7621527, 7891052, 8154044, 8402901, 8629436, 8825897, 8985856, 9104465, 9178481, 9206425, 9188662, 9127062, 9024552, 8885025, 8713445, 8515556, 8297272, 8064338, 7822517, 7577662, 7335283, 7100082, 6876035, 6666725, 6475257, 6303986, 6154672, 6028901, 5927906, 5851885, 5799978, 5771262, 5765422, 5781998, 5819201, 5874007, 5943330, 6024523, 6114549, 6209195, 6303436, 6392248, 6470807, 6534380, 6578796, 6601172, 6599841, 6573620, 6521595, 6443789, 6341691, 6217863, 6075258, 5917107, 5747123, 5569223, 5386889, 5202954, 5019940, 4840355, 4666605, 4500854, 4344998, 4200482, 4067892, 3946911, 3836870, 3737251, 3647502, 3566568]
59854C566568p3494o6982o0661n4488m9205m5275m2078l8446l3938k9302k5540
59843C047159k2874k0800j8948j7474j6597j6221j6179j6552j7390j8411j9328
59832B846385k0316k1712k3381k4731k5339k5044k3608k0938j7828j5628j4707
59821B613153j3762j1354p681m160j492J053M422Q653J3260J8104K3340K8788
59809B672324L3764L7620M0298M2323M4174M5637M5909M4535M2050L9325L6554
59798C124513L3387K9967K7122K5355K4317K3668K3817K5308K7915L1094L5007
59787C431470M0395M7465N5692O4819P5390Q7957J02313J18019J35266J54575
59777D313361J75738J97494K18225K36347K49805K55762K51506K35900K09847
$$ y = [3566568, 3493074, 3426092, 3365431, 3310943, 3261738, 3216463, 3174385, 3135939, 3102001, 3072699, 3047159, 3024285, 3003485, 2984537, 2967063, 2950466, 2934245, 2918066, 2901514, 2884124, 2865713, 2846385, 2826069, 2804357, 2780976, 2756245, 2730906, 2705862, 2682254, 2661316, 2643488, 2627860, 2613153, 2599391, 2588037, 2580356, 2576196, 2574704, 2575757, 2580179, 2588832, 2602092, 2620196, 2643536, 2672324, 2706088, 2743708, 2784006, 2826329, 2870503, 2916140, 2962049, 3006584, 3048634, 3087959, 3124513, 3157900, 3187867, 3214989, 3240344, 3264661, 3288329, 3312146, 3337454, 3365369, 3396463, 3431470, 3471865, 3519330, 3575022, 3639841, 3715231, 3803188, 3905501, 4023520, 4158786, 4313361, 4489099, 4686593, 4904818, 5141165, 5390970, 5646732, 5898238, 6134138, 6343985]
59768F343985J75517J35358R1747M7044L512l6792p2089j01104j23439j39545
59758F324194j50181j55935j57303j54883j49135j40138j28007j13449r7549q1011
59748D996603o3931m6306k8391j0584O694K3000L8177N2780O7769Q3542R9600
59737E218953J15333J30765J46399J62692J79962J98422K17994K38439K59913
59728F868872K82993L07847L33803L60076L86468M12777M37864M60083M78439
59719A0329222M92668N02283N06362N04537M97664M87189M74316M59993M45303
59710A4699537M31434M19366M09673M02497L97575L94315L91710L88137L81603
59701A8315847L70789L55721L36827L13480K84257K48931K09425J68305J26930
$$ y = [6343985, 6519502, 6654860, 6746607, 6793651, 6797163, 6760371, 6688282, 6587178, 6463739, 6324194, 6174013, 6018078, 5860775, 5705892, 5556757, 5416619, 5288612, 5175163, 5077614, 4996603, 4932672, 4886366, 4857975, 4847391, 4854085, 4877085, 4915262, 4968042, 5035811, 5119353, 5218953, 5334286, 5465051, 5611450, 5774142, 5954104, 6152526, 6370520, 6608959, 6868872, 7151865, 7459712, 7793515, 8153591, 8540059, 8952836, 9390700, 9850783, 10329222, 10821890, 11324173, 11830535, 12335072, 12832736, 13319925, 13794241, 14254234, 14699537, 15130971, 15550337, 15960010, 16362507, 16760082, 17154397, 17546107, 17934244, 18315847, 18686636, 19042357, 19379184, 19692664, 19976921, 20225852, 20435277, 20603582, 20730512]
59692B0730512Q5689M5583Q731k2773m7841o6121p7220q0524p5607o2586m1981
59681B0395862j4244K0472O2001J09607J62045K18139K76883L36732L95115M48964
59671B2411576M95466N31950N55309N62164N49690N16106M60725L84281K89441
59662B6756708J80502O2338o0259j82335k98712m04818m97499n74862o35703o79658
59652B3665702p07845p22815p27583p24947p17828p09662p03573p00867p00552
59643A7250030p00689p00077o98459o95322o89255o78856o63927o45340o23888
59634A1154217n99722n72925n44066n13981m83237m52106m20725l89131l57291
59625F821033l25509k94702k65927k39554k15149j92270j71096j52035j34938
$$ y = [20730512, 20816201, 20861784, 20870515, 20847742, 20799901, 20733780, 20656560, 20576036, 20500429, 20437843, 20395862, 20381618, 20402090, 20464091, 20573698, 20735743, 20953882, 21230765, 21567497, 21962612, 22411576, 22907042, 23438992, 23994301, 24556465, 25106155, 25622261, 26082986, 26467267, 26756708, 26937210, 26999548, 26939289, 26756954, 26458242, 26053424, 25555925, 24981063, 24345360, 23665702, 22957857, 22235042, 21507459, 20782512, 20064684, 19355022, 18651449, 17950582, 17250030, 16549341, 15849264, 15150805, 14455483, 13766228, 13087372, 12423445, 11778105, 11154217, 10554495, 9981570, 9437504, 8923523, 8440286, 7988180, 7567455, 7178324, 6821033, 6495524, 6200822, 5934895, 5695341, 5480192, 5287922, 5116826, 4964791, 4829853]
59616D829853j19124j04298r1111q0459p2318o5695n9788n4852n1639n0262n0090
59605D030217n0568n1642n3239n4919n6356n7778n9477o1091o1804o1189n9492
59594C402662n7101n4184n0904m7510m4005m0054l5439l0455k5638k1238j7077
59583B979057j2748p890k579K432O251Q863J1265J4266J7495K0063K1887K3613
59571C081975K5432K6844K7813K9265L2016L5703L9404M2857M6601N1167N6701
59560C495778O3223P0625P8469Q6322R4292J02814J11941J21263J30587J40162
59550D495476J50160J60349J70354J79784J87922J93870J97319J98777J98708
59541F132719J96745J92086J84381J73868J60994J46224J30034J12634R4008P4662
$$ y = [4829853, 4710729, 4606431, 4515320, 4434861, 4362543, 4296848, 4237060, 4182208, 4130569, 4080307, 4030217, 3979649, 3928007, 3874768, 3819849, 3763493, 3705715, 3646238, 3585147, 3523343, 3462154, 3402662, 3345561, 3291377, 3240473, 3192963, 3148958, 3108904, 3073465, 3043010, 3017372, 2996134, 2979057, 2966309, 2958419, 2955840, 2958272, 2964523, 2973386, 2984651, 2998917, 3016412, 3036475, 3058362, 3081975, 3107407, 3134251, 3162064, 3191329, 3223345, 3259048, 3298452, 3341309, 3387910, 3439077, 3495778, 3559001, 3629626, 3708095, 3794417, 3888709, 3991523, 4103464, 4224727, 4355314, 4495476, 4645636, 4805985, 4976339, 5156123, 5344045, 5537915, 5735234, 5934011, 6132719, 6329464, 6521550, 6705931, 6879799, 7040793, 7187017, 7317051, 7429685, 7523693, 7598355]
59531G598355N6008L9343K4568J0661k550j3797k1720k6061k7035k4336j7512
59520G595924p009O101K1344L8906N8250P7362R3938J06823J15759J20072J18408
59509H345878J09851R4612P3421M6770J5251j9767n6326r2759j28023j61182j91034
59498H036692k16394k36531k51283k60918k65890k66499k62713k54561k42701
59489E779202k28216k11835j93695j73986j53459j32989j12980r3404p4137n5021
59479D349480l5933j7155O40J7240L3386M9906O6521Q2105R6004J08511J20025
59468D870730J30315J38763J44755J47697J47077J42760J34812J22942J06628
59459F086479Q6032O2281L6598R598j8215m5801p1974r6116j18002j37249j53461
$$ y = [7598355, 7654363, 7693706, 7718274, 7728935, 7726385, 7712588, 7690868, 7664807, 7637772, 7613436, 7595924, 7588915, 7595016, 7616360, 7655266, 7713516, 7790878, 7884816, 7991639, 8107398, 8227470, 8345878, 8455729, 8550341, 8623762, 8670532, 8685783, 8666016, 8609690, 8516931, 8388908, 8227726, 8036692, 7820298, 7583767, 7332484, 7071566, 6805676, 6539177, 6276464, 6021903, 5779202, 5550986, 5339151, 5145456, 4971470, 4818011, 4685022, 4572042, 4478638, 4404501, 4349480, 4313547, 4296392, 4297032, 4314272, 4347658, 4397564, 4464085, 4546190, 4642194, 4750705, 4870730, 5001045, 5139808, 5284563, 5432260, 5579337, 5722097, 5856909, 5979851, 6086479, 6172511, 6234792, 6271390, 6280988, 6262773, 6216972, 6144998, 6048882, 5930880, 5793631, 5640170]
59448E640170j66661j76995j84172j87829j88392j86898j83868j78962j71952
59439D014441j63500j54531j45243j35188j24218j12966j02330r2694q3734p4903
59429B825134o6085n7709n0254m3726l7681l1645k5415j9124j3246q327m372o32
59417B466918L579P792J0655J1469J1049J0753J1017J1247J0915J0290J0143J1158
59405B586985J3627J7308K1317K4483K6222K7050K8126L0154L2891L5739L8641
59394B882543M2264M7217N3326N9878O6513P3685Q2158R2215J03514J15628J28558
59383C747499J42579J57753J73901J91065K09798K30635K53422K77465L02371
59374E686488L28254L54787L80460M03208M21670M35424M44227M47688M45684
$$ y = [5640170, 5473509, 5296514, 5112342, 4924513, 4736121, 4549223, 4365355, 4186393, 4014441, 3850941, 3696410, 3551167, 3415979, 3291761, 3178795, 3076465, 2983771, 2900037, 2825134, 2759049, 2701340, 2651086, 2607360, 2569679, 2538034, 2512619, 2493495, 2480249, 2471922, 2467550, 2466918, 2470497, 2478289, 2488944, 2500413, 2511462, 2522215, 2533232, 2544479, 2555394, 2565684, 2575827, 2586985, 2600612, 2617920, 2639237, 2663720, 2689942, 2716992, 2745118, 2775272, 2808163, 2843902, 2882543, 2924807, 2972024, 3025350, 3085228, 3151741, 3225426, 3307584, 3399799, 3503313, 3618941, 3747499, 3890078, 4047831, 4221732, 4412797, 4622595, 4853230, 5106652, 5384117, 5686488, 6014742, 6369529, 6749989, 7153197, 7574867, 8010291, 8454518, 8902206, 9347890]
59365I347890M38540M26596M10073L89686L66866L42995L18494K92998K66117
59356A2600255K37757K07848J76137J42191J05515O5892K3792j9842o4437j10056
59346A3365052j56388k01865k44399k82906l17434l47843l73168l92574m06267
59337A0642208m14940m18672m17006m10011l98764l84598l68173l49412l28239
59328G152393l05282k81803k59046k37523k16961j96857j77215j58759j42462
59319E176485j28768j17275j07236r8302r0613q4222p8819p4162p0377o7571o5342
59308D193798o3129o0831n8692n6704n4582n2255m9785m6804m2617l7192l1550
59297C639657k6725k2653j8402j3282p348r53N728J2731K0171K8218L7017M6489
$$ y = [9347890, 9786430, 10213026, 10623099, 11012785, 11379651, 11722646, 12041140, 12334138, 12600255, 12838012, 13045860, 13221997, 13364188, 13469703, 13535595, 13559387, 13539545, 13475108, 13365052, 13208664, 13006799, 12762400, 12479494, 12162060, 11814217, 11441049, 11048475, 10642208, 10227268, 9808596, 9391590, 8981579, 8582815, 8198217, 7830044, 7480632, 7152393, 6847111, 6565308, 6306262, 6068739, 5851778, 5654921, 5477706, 5318947, 5176485, 5047717, 4930442, 4823206, 4724904, 4634291, 4550069, 4471250, 4397088, 4326711, 4259140, 4193798, 4130669, 4069838, 4011146, 3954442, 3899860, 3847605, 3797820, 3751016, 3708399, 3671207, 3639657, 3612932, 3590279, 3571877, 3558595, 3551247, 3550294, 3556022, 3568753, 3588924, 3617142, 3654159, 3700648]
59285C700648N6222O5621P4254Q2142Q9568R6546J02589J07224J10577J13129
59275D598520J14939J15459J14120J10655J04855R6425Q5300P1706N5859L8043
59265E505881J9030j23j8932l7525n5617p2138q6346r8620j09502j18565j24998
59254D802545j28912j31136j31990j31161j28603j24664j19394j12619j04731
59245C689335r6508q8026p8729o8726n9046n0257m1685l2599k3301j4348n400
59234C130710M293J4730K5265L5708M6572N8339P1103Q4842R9513J14929J30959
59223C816963J47850J66005J85462K05853K26621K46911K65323K80193K90172
59214E831353K94389K92277K83496K67804K44743K13830J75472J31460Q4053L4861
$$ y = [3700648, 3756870, 3822491, 3896745, 3978887, 4068455, 4165001, 4267590, 4374814, 4485391, 4598520, 4713459, 4828918, 4943038, 5053693, 5158548, 5254973, 5340273, 5411979, 5467838, 5505881, 5524911, 5524788, 5505856, 5468331, 5412714, 5340576, 5254230, 5155610, 5046108, 4927543, 4802545, 4673633, 4542497, 4410507, 4279346, 4150743, 4026079, 3906685, 3794066, 3689335, 3592827, 3504801, 3426072, 3357346, 3298300, 3248043, 3206358, 3173759, 3150458, 3136110, 3130710, 3135003, 3149733, 3174998, 3210706, 3257278, 3315617, 3386720, 3471562, 3571075, 3686004, 3816963, 3964813, 4130818, 4316280, 4522133, 4748754, 4995665, 5260988, 5541181, 5831353, 6125742, 6418019, 6701515, 6969319, 7214062, 7427892, 7603364, 7734824, 7818877, 7853738]
59204G853738j5007o4083j10524j52874j90139k21322k45697k63469k75470k82031
59194F033122k82915k78448k69874k58255k43896k27257k09712j92579j75895
59185C894291j58888j41436j24428j08848r5073q2968p2153o2140n2634m3768
59175B951955l5834k8879k2727j7205j2070o980k019J961M079M595M821N681O826
59162B854204P333O885N859M512K582k57l816p496j0907j4166j7494k0626k2889
59149B783724k3948k4237k4457k4771k4734k3905k2325k0419j8599j6908j4892
59138B544529j1976q147m165p67K163N349R114J3167J7283K1672K6411L1073L5335
59125B681041L9554M4260M9357N4310N8994O3723O8429P2519P5776P8861Q2418
$$ y = [7853738, 7838731, 7774648, 7664124, 7511250, 7321111, 7099789, 6854092, 6590623, 6315153, 6033122, 5750207, 5471759, 5201885, 4943630, 4699734, 4472477, 4262765, 4070186, 3894291, 3735403, 3593967, 3469539, 3360691, 3265618, 3182650, 3110497, 3048357, 2995723, 2951955, 2916121, 2887242, 2864515, 2847310, 2835240, 2828260, 2826241, 2828202, 2832281, 2836876, 2841697, 2847378, 2854204, 2861537, 2868422, 2874281, 2878793, 2881375, 2881118, 2877302, 2869806, 2858899, 2844733, 2827239, 2806613, 2783724, 2759776, 2735539, 2711082, 2686311, 2661577, 2637672, 2615347, 2594928, 2576329, 2559421, 2544529, 2532553, 2524406, 2520241, 2519474, 2521637, 2526986, 2536100, 2549267, 2566550, 2588222, 2614633, 2645706, 2681041, 2720595, 2764855, 2814212, 2868522, 2927516, 2991239, 3059668, 3132187, 3207963, 3286824, 3369242]
59114C369242Q5951Q8189Q8565Q7792Q6914Q6108Q4779Q2553P9809P7237P5166
59103D292305P3451P1877P0508O9685O9669P0225P0480O9354O6060O0239N1722
59092E035575M0463K6724J0978o513k5772m6414o7185q6585j03926j19435j33300
59081D524610j45067j54085j60161j63532j64529j63524j60949j57038j51747
59072C103978j45171j37875j30365j22448j13639j04236r5394q7846q1065p4051
59062B011888o6702n9841n4121m9442m5448m2025l9019l5961l2506k8990k6123
59051A531710k4188k2762k1275j9547j7718j5926j4182j2461j0786r225p838o538
59039A349264n062l252j304M74K117L855N532O566O786O951P988R879J1696J2648
$$ y = [3369242, 3455193, 3543382, 3631947, 3719739, 3806653, 3892761, 3977540, 4060093, 4139902, 4217139, 4292305, 4365756, 4437633, 4508141, 4577826, 4647495, 4717720, 4788200, 4857554, 4923614, 4983853, 5035575, 5076038, 5102762, 5113740, 5107227, 5081455, 5035041, 4967856, 4881271, 4777345, 4657910, 4524610, 4379543, 4225458, 4065297, 3901765, 3737236, 3573712, 3412763, 3255725, 3103978, 2958807, 2820932, 2690567, 2568119, 2454480, 2350244, 2254850, 2167004, 2085939, 2011888, 1945186, 1885345, 1831224, 1781782, 1736334, 1694309, 1655290, 1619329, 1586823, 1557833, 1531710, 1507522, 1484760, 1463485, 1443938, 1426220, 1410294, 1396112, 1383651, 1372865, 1363640, 1355802, 1349264, 1344202, 1340950, 1339646, 1340120, 1342237, 1346092, 1351624, 1358190, 1364976, 1371927, 1379915, 1389794, 1401490, 1414138]
59025A414138J2692J2189J1453J0724J0152R567Q572P124N778N125N216N727O404
59012A524861P118P659P890P988Q192Q419Q411Q205Q088Q069P759O853N486L919
58998A628917K209L22j578l238m564n610o404o968p383p657p554o821n551m166
58984A563954l003k128j477j003n28L19J805L797N833P492Q645R440J0161J1033
58970A614340J2135J3480J5134J7090J8941K0056K0252K0164K0503K1144K1370
58959A814609K0991K0744K1351K2645K3931K4831K5465K6065K6843K8003K9454
58948B084932L0771L1805L3112L5193L7509L9077M0018M1681M4900M8902N2440
58937B520340N5352N8319O1559O4635O7491P0860P5448Q1143Q7324R3639J00296
$$ y = [1414138, 1426830, 1439019, 1450472, 1461196, 1471348, 1480915, 1489487, 1496611, 1502389, 1507514, 1512730, 1518457, 1524861, 1531979, 1539638, 1547528, 1555516, 1563708, 1572127, 1580538, 1588743, 1596831, 1604900, 1612659, 1619512, 1624998, 1628917, 1631126, 1631448, 1629870, 1626632, 1622068, 1616458, 1610054, 1603086, 1595703, 1588046, 1580492, 1573671, 1568120, 1563954, 1560951, 1558823, 1557346, 1556343, 1555815, 1556134, 1557939, 1561736, 1567569, 1575061, 1583706, 1593146, 1603307, 1614340, 1626475, 1639955, 1655089, 1672179, 1691120, 1711176, 1731428, 1751592, 1772095, 1793239, 1814609, 1835600, 1856344, 1877695, 1900340, 1924271, 1949102, 1974567, 2000632, 2027475, 2055478, 2084932, 2115703, 2147508, 2180620, 2215813, 2253322, 2292399, 2332417, 2374098, 2418998, 2467900, 2520340, 2575692, 2634011, 2695570, 2760205, 2827696, 2898556, 2974004, 3055147, 3142471, 3236110, 3336406]
58926C336406J07737J16089J25038J34200J43665J53921J65290J77716J91225
58917D651287K06055K22059K38531K55154K72688K91965L12507L33023L53175
58908G136444L73869L95562M17168M36991M53951M67304M75794M77823M72219
58899A1107125M58271M35214M02342L59676L08185K49308J84598J15749M4738
58890A3665206k6262r5123j60099k20024k74079l21434l61295l93341m17751m34775
58880A0961023m44694m48248m46509m40096m29148m14328l97229l79147l60126
58871G201498l39914l19308k99563k80843k62344k43942k26582k10838j96084
58862D822080j81606j67666j54900j43227j32086j21384j11574j02920r5072q7350
$$ y = [3336406, 3444143, 3560232, 3685270, 3819470, 3963135, 4117056, 4282346, 4460062, 4651287, 4857342, 5079401, 5317932, 5573086, 5845774, 6137739, 6450246, 6783269, 7136444, 7510313, 7905875, 8323043, 8760034, 9213985, 9681289, 10157083, 10634906, 11107125, 11565396, 12000610, 12402952, 12762628, 13070813, 13320121, 13504719, 13620468, 13665206, 13638944, 13543821, 13383722, 13163698, 12889619, 12568185, 12206890, 11813549, 11395798, 10961023, 10516329, 10068081, 9621572, 9181476, 8752328, 8338000, 7940771, 7561624, 7201498, 6861584, 6542276, 6242713, 5961870, 5699526, 5455584, 5229002, 5018164, 4822080, 4640474, 4472808, 4317908, 4174681, 4042595, 3921211, 3809637, 3706717, 3611645, 3524295]
58852C524295p9227p0704o2375n4909m8284m1788l4929k8042k1763j6265j1270
58841C054739o455j500L924R793J5521K0577K5152K9851L4875L9940M4846M9734
58829C320997N4826O0328O6535P3648Q1410Q9324R7292J05677J14794J24681J35428
58818D324940J47233J59990J73240J86847K01381K17491K35147K53871K73491
58809F173631K94205L15943L38148L60323L82301M03661M23139M39095M50450
58800I580896M56681M56784M48854M31122M03251L66079L20317K66151K04288
58791A2934423J36780O6329m888p5342j43432k07262k65213l16302l59916l95631
58781A1369546m23366m43494m56551m62951m63121m57763m47919m34820m19537
$$ y = [3524295, 3445068, 3374364, 3311989, 3257080, 3208796, 3167008, 3132079, 3104037, 3082274, 3066009, 3054739, 3048284, 3046784, 3050708, 3060501, 3076022, 3096599, 3121751, 3151602, 3186477, 3226417, 3271263, 3320997, 3375823, 3436151, 3502686, 3576334, 3657744, 3747068, 3844360, 3950037, 4064831, 4189512, 4324940, 4472173, 4632163, 4805403, 4992250, 5193631, 5411122, 5646269, 5900140, 6173631, 6467836, 6783779, 7121927, 7482250, 7864551, 8268212, 8691351, 9130446, 9580896, 10037577, 10494361, 10943215, 11374337, 11777588, 12143667, 12463984, 12730135, 12934423, 13071203, 13137532, 13132644, 13057302, 12913870, 12706608, 12441395, 12125093, 11765177, 11369546, 10946180, 10502686, 10046135, 9583184, 9120063, 8662300, 8214381, 7779561, 7360024]
58772G360024m02500l83502l62468l40314l18608k98218k78771k59645k41103
58763D474895k23851k07890j92495j77474j63611j51605j40965j30586j20121
58754B966297j10200j01313r3061q4770p6418o8638o1991n6565n2096m8129m4174
58743B168942m0068l6178l2961l0327k7848k5566k4096k3684k3698k3388k2804
58732A858324k2498k2578k2621k2431k2307k2533k3025k3650k4454k5457k6514
58721A600256k7477k8195k8334k7622k6464k5846k6262k7115k7448k7012k6306
58710A302175k5799k5547k5358k4916k3855k2160k0413j9219j8457j7510j6257
58699A062684j5244j4786j4504j4028j3644j3735j3942j3453j2065j0501r588
$$ y = [7360024, 6957524, 6574022, 6211554, 5871240, 5552632, 5254414, 4975643, 4715998, 4474895, 4251044, 4043154, 3850659, 3673185, 3509574, 3357969, 3217004, 3086418, 2966297, 2856097, 2754784, 2661723, 2576953, 2500535, 2431897, 2369906, 2313341, 2261245, 2213116, 2168942, 2128874, 2092696, 2059735, 2029408, 2001560, 1975994, 1951898, 1928214, 1904516, 1881128, 1858324, 1835826, 1813248, 1790627, 1768196, 1745889, 1723356, 1700331, 1676681, 1652227, 1626770, 1600256, 1572779, 1544584, 1516250, 1488628, 1462164, 1436318, 1410056, 1382941, 1355493, 1328481, 1302175, 1276376, 1250829, 1225471, 1200555, 1176700, 1154540, 1134127, 1114908, 1096451, 1078941, 1062684, 1047440, 1032654, 1018150, 1004122, 990478, 976743, 962801, 949348, 937283, 926782, 917194]
58688I17194r424r450r050p988o483m956l616k257o03J168K504L142L407L728
58674H77316M123M354M409M460M387L781K533J221O30R27J449J366M49q17j864
58659I08724k580l242m015m677m890m600m068l569l199k885k511j965j187j83
58645H65153R90K204L225L826M111M606N774P493R155J0391J1443J2759J4396
58632I55526J6042J7469J8782K0231K1920K3765K5611K7384K9142L1094L3556
58621A220522L6857M1149M6199N1489N6645O1806O7376P3503P9967Q6553R3243
58610A915309R9992J06603J13055J19651J26511J32985J37833J39952J38823J34355
58600C165069J26616J15645J01364Q3721O3203M1127J9027k343k3088m3193o1780
$$ y = [917194, 907770, 898320, 889270, 881282, 874799, 869843, 866227, 863970, 863367, 864535, 867039, 870181, 873588, 877316, 881439, 885793, 890202, 894662, 899049, 902830, 905363, 906584, 907214, 908141, 909590, 910956, 911405, 910588, 908724, 906144, 902902, 898887, 894210, 889320, 884720, 880652, 877083, 873884, 870999, 868488, 866523, 865336, 865153, 866143, 868347, 871572, 875398, 879509, 884115, 889889, 897382, 906537, 916928, 928371, 941130, 955526, 971568, 989037, 1007819, 1028050, 1049970, 1073735, 1099346, 1126730, 1155872, 1186966, 1220522, 1257379, 1298528, 1344727, 1396216, 1452861, 1514667, 1582043, 1655546, 1735513, 1822066, 1915309, 2015301, 2121904, 2234959, 2354610, 2481121, 2614106, 2751939, 2891891, 3030714, 3165069, 3291685, 3407330, 3508694, 3592415, 3655618, 3696745, 3715772, 3713429, 3690341, 3647148, 3585368]
58589C585368p7707r0610j00992j09319j15402j18819j19634j18426j15668j11379
58579B507412j05511r8499r1107q3803p6512o9178o2238n6198n0866m5449l9581
58568A728470l3905k9336k5980k3159k0435j8148j6731j5980j5349j4885j5293
58557A499269j6966j9265k1103k2057k2583k3260k4213k5282k6319k7027k6841
58546A244353k5360k2937k0518j8880j8083j7666j7137j6291j5179j3981j2852
58535A045469j1850j0989j0316r929r882r992r816q997p771o953p066p605p583
58522I26720o834o250o497p027o832n827m948n005n880o741o690n338l225j575
58508H48051j064j042m76M97Q40M10L84J461K660K813K446L046M843O564P382
$$ y = [3585368, 3507661, 3417051, 3316059, 3206740, 3091338, 2972519, 2852885, 2734459, 2618791, 2507412, 2401901, 2303402, 2212295, 2128492, 2051980, 1982802, 1920564, 1864366, 1813500, 1768051, 1728470, 1694565, 1665229, 1639249, 1616090, 1595655, 1577507, 1560776, 1544796, 1529447, 1514562, 1499269, 1482303, 1463038, 1441935, 1419878, 1397295, 1374035, 1349822, 1324540, 1298221, 1271194, 1244353, 1218993, 1196056, 1175538, 1156658, 1138575, 1120909, 1103772, 1087481, 1072302, 1058321, 1045469, 1033619, 1022630, 1012314, 1002385, 992503, 982511, 972695, 963698, 955927, 948974, 941908, 934303, 926720, 919886, 913636, 907139, 900112, 893280, 887453, 882505, 877500, 871620, 864879, 858189, 852851, 849626, 848051, 846987, 845945, 845469, 845966, 846806, 847216, 847600, 849061, 851721, 854534, 856980, 860026, 864869, 871433, 878815]
58493H78815P942R039J0297J0844J0653J0333J0011R300Q330P964Q580R241Q588
58480I99937O356L622J544K91p22j870k967l744m328n048n955o792p370p702p747
58465I57505p328o504n808n745o159o397o069n310m257k794j044L27Q14Q46J360
58450I03437K700M368N788O756P095O553N397M691N435P525R838J1281J1625J1462
58436A003951J1552J2136J2739J2742J2091J1240J0458R614Q675P878P173O102
58424A126351M609L427L152L344L191K688K445K603K752K878L529M862O192O813
58410A178836O788O754P238Q308R543J0252J0125R615R333R138Q360O930N611
58397A286831M961M670M230L719L505L561L463K882J892J000R29K013L705N047
$$ y = [878815, 886757, 895796, 906093, 916937, 927590, 937923, 947934, 957234, 965564, 973528, 982108, 991349, 999937, 1006293, 1009915, 1011459, 1011750, 1011028, 1009158, 1006191, 1002447, 998119, 993071, 987116, 980324, 972954, 965252, 957505, 950177, 943673, 937865, 932120, 925961, 919564, 913495, 908185, 903928, 901134, 900090, 900417, 901231, 902077, 903437, 906137, 910505, 916293, 923049, 930144, 936697, 942094, 946785, 952220, 959745, 969583, 980864, 992489, 1003951, 1015503, 1027639, 1040378, 1053120, 1065211, 1076451, 1086909, 1096523, 1105198, 1113076, 1120249, 1126351, 1130960, 1134387, 1137539, 1140883, 1144074, 1146762, 1149207, 1151810, 1154562, 1157440, 1160969, 1165831, 1172023, 1178836, 1185624, 1192378, 1199616, 1207924, 1217467, 1227719, 1237844, 1247459, 1256792, 1265930, 1274290, 1281220, 1286831, 1291792, 1296462, 1300692, 1304411, 1307916, 1311477, 1314940, 1317822, 1319714, 1320714, 1321643, 1323656, 1327361, 1332408]
58383A332408N743O352P357Q560R590J0434J1107J1350J1085J0802J1113J2081
58371A447982J3328J4476J5280J5590J5489J5305J5278J5495J6146J7426J9002
58360A620797K0132K0548K0700K0959K1081K0909K0940K1612K2467K2677K2151
58349A854973K1537K1269K1108K0632J9743J8707J7898J7423J6929J6015J4974
58338B061208J4664J5411J6401J6646J6184J5959J6639J8004J9339K0205K0853
58327B251513K1997K3998K6300K7977K8873K9706L0992L2437L3569L4355L4943
58316B576660L5398L5899L6657L7384L7512L7164L7049L7144L6454L4663L2972
58305B974956L2501L2733L2491L1767L1472L1951L2778L3739L5021L6668L8525
$$ y = [1332408, 1338151, 1344503, 1351860, 1360420, 1370010, 1380444, 1391551, 1402901, 1413986, 1424788, 1435901, 1447982, 1461310, 1475786, 1491066, 1506656, 1522145, 1537450, 1552728, 1568223, 1584369, 1601795, 1620797, 1640929, 1661477, 1682177, 1703136, 1724217, 1745126, 1766066, 1787678, 1810145, 1832822, 1854973, 1876510, 1897779, 1918887, 1939519, 1959262, 1977969, 1995867, 2013290, 2030219, 2046234, 2061208, 2075872, 2091283, 2107684, 2124330, 2140514, 2156473, 2173112, 2191116, 2210455, 2230660, 2251513, 2273510, 2297508, 2323808, 2351785, 2380658, 2410364, 2441356, 2473793, 2507362, 2541717, 2576660, 2612058, 2647957, 2684614, 2721998, 2759510, 2796674, 2833723, 2870867, 2907321, 2941984, 2974956, 3007457, 3040190, 3072681, 3104448, 3135920, 3167871, 3200649, 3234388, 3269409, 3306077, 3344602]
58294C344602M0529M2452M3793M4581M5745M7986N0750N3130N5155N7347N9579
58283C885649O1382O2978O4940O7179O9235P1197P3475P5977P8328Q0575Q2766
58272D673681Q4449Q5426Q6393Q7863Q9135Q9451Q9423R0011R0815R0899R0735
58261E648281R1690R3923R6425R8927J02085J05947J09749J13285J17023J20963
58251F698298J24640J28135J31786J35216J38172J41838J47656J55115J62491
58242G963347J69503J77310J86109J94819K03215K12293K22387K32886K44047
58233I805916K57043K71885K87238L02586L18897L36914L56590L78204M02189
58224A2717462M27947M54746M83633N16401N53105N93061O37874O90736P53021
$$ y = [3344602, 3385131, 3427583, 3471376, 3515957, 3561702, 3609688, 3660438, 3713568, 3768723, 3826070, 3885649, 3947031, 4010009, 4074949, 4142128, 4211363, 4282560, 4356035, 4432012, 4510340, 4590915, 4673681, 4758130, 4843556, 4929949, 5017812, 5106947, 5196398, 5285821, 5375832, 5466647, 5557546, 5648281, 5739971, 5833894, 5930319, 6029246, 6131331, 6237278, 6347027, 6460312, 6577335, 6698298, 6822938, 6951073, 7082859, 7218075, 7356247, 7498085, 7645741, 7800856, 7963347, 8132850, 8310160, 8496269, 8691088, 8894303, 9106596, 9328983, 9561869, 9805916, 10062959, 10334844, 10622082, 10924668, 11243565, 11580479, 11937069, 12315273, 12717462, 13145409, 13600155, 14083788, 14600189, 15153294, 15746355, 16384229, 17074965, 17827986]
58215A7827986Q24569R07078J004156J118391J251667J407805J590396J797566
58207B7729614K022872K262253K517563K794627L102974L457494L876012M376089
58199E2139498M979211N716902O627962P753060R137085J0825693J2838271J5132658
58191A25150340J7580464J9928115K1737956K2420956K1486050J8887595J5114380
58184B62305856J0844807O487316K097938k280567o331699r605826j1893612j3365497
58176B38258716j4348644j5043731j5464466j5555349j5289666j4678533j3753312
58169A34125015j2562443j1172548r676233q209576o937112n973313n305848m821867
58161F9466075m424679m108159l907523l804668l715998l571435l377100l189193
$$ y = [17827986, 18652555, 19559633, 20563789, 21682180, 22933847, 24341652, 25932048, 27729614, 29752486, 32014739, 34532302, 37326929, 40429903, 43887397, 47763409, 52139498, 57118709, 62835611, 69463573, 77216633, 86353718, 97179411, 110017682, 125150340, 142730804, 162658919, 184396875, 206817831, 228303881, 247191476, 262305856, 273150663, 279637979, 281735917, 279455350, 273123651, 263517825, 251624213, 238258716, 223910072, 208866341, 193401875, 177846526, 162556860, 147878327, 134125015, 121562572, 110390024, 100713791, 92504215, 85567103, 79593790, 74287942, 69466075, 65041396, 60933237, 57025714, 53221046, 49505048, 45933613, 42556513, 39367320]
58153C9367320l044139k929623k812765k675222k517668k345557k161941j970207
58145A8910198j775637j583516j398874j227340j073363r37975q20226p19884
58137I373383o36562n67334n07963m56345m12616l76228l45054l17193k91789
58128E462299k68061k45458k24695k06880j91713j78075j66015j56186j47757
58119C677459j39036j30178j22913j17450j11856j05041r8211r2637q7983q3627
58109B588527p9809p6484p2719o8255o4277o1601n9342n6260n2366m8351m4549
58098A904514m1241l8882l7233l5205l2391k9804k8434k7937k7421k6608k5618
58087A553740k4488k3470k3013k2952k2611k2039k2077k2806k3191k2799k2555
$$ y = [39367320, 36323181, 33393558, 30580793, 27905571, 25387903, 23042346, 20880405, 18910198, 17134561, 15551045, 14152171, 12924831, 11851468, 10913493, 10093267, 9373383, 8736821, 8169487, 7661524, 7205179, 6792563, 6416335, 6071281, 5754088, 5462299, 5194238, 4948780, 4724085, 4517205, 4325492, 4147417, 3981402, 3825216, 3677459, 3538423, 3408245, 3285332, 3167882, 3056026, 2950985, 2852774, 2760137, 2672154, 2588527, 2508718, 2432234, 2359515, 2291260, 2226983, 2165382, 2106040, 2049780, 1997414, 1949063, 1904514, 1863273, 1824391, 1787158, 1751953, 1719562, 1689758, 1661324, 1633387, 1605966, 1579358, 1553740, 1529252, 1505782, 1482769, 1459817, 1437206, 1415167, 1393090, 1370284, 1347093, 1324294, 1301739]
58076A301739k2978k3085k2063k0831k0656k1083k0684j9168j7579j6622j5948
58065A081042j4916j3305j1396r813r042q778q327p730p755q409q591p772o940
58052I58268p000p311o877o064n898o334o471o045n488m917m211l734l871l989
58038H80058l061j260J64N43M22L88L19rl67m55k95o5P2q1n21p74l05P12J513
58019H76998J592J117N42J92K02M36N78M80L26J95j97r64j617j595j042n13k01
58002H76529O9K63J89kR3N09Q22P43M17J88K36L99J83p99k166k887k442j552j300
57983H69492j896k623k796k264j291m65l68p89o19Q59K787L603K941J944J697
57968H70212K090K380K264K019K055K464K919K947K463J862J388O78o08j984k536
$$ y = [1301739, 1278761, 1255676, 1233613, 1212782, 1192126, 1171043, 1150359, 1131191, 1113612, 1096990, 1081042, 1066126, 1052821, 1041425, 1031612, 1022570, 1013792, 1005465, 997735, 989980, 981571, 972980, 965208, 958268, 951268, 943957, 937080, 931016, 925118, 918784, 912313, 906268, 900780, 895863, 891652, 887918, 884047, 880058, 876997, 875737, 875901, 876444, 876866, 877254, 877573, 877564, 877197, 876742, 876447, 876382, 876454, 876373, 875852, 875078, 874773, 875485, 876998, 878590, 879707, 880249, 880441, 880643, 881079, 881657, 882137, 882463, 882658, 882461, 881497, 879880, 878285, 877243, 876730, 876529, 876598, 876861, 877050, 877048, 877141, 877650, 878472, 879215, 879632, 879820, 880056, 880455, 880638, 879839, 877673, 874786, 872344, 870792, 869492, 867596, 864973, 862177, 859913, 858622, 858157, 857789, 857000, 856381, 857240, 860027, 863630, 866571, 868515, 870212, 872302, 874682, 876946, 878965, 881020, 883484, 886403, 889350, 891813, 893675, 895063, 895741, 895133, 893149, 890613]
57953H90613k033j183p71r66j376j416p07N29J571K078K548L442M249M086L008
57938I03672J916J290R12P76J229J941J736J4k340l982m522m408m054l732l923
57923H86525m934o289p102p042o480n693m538l016j629p60j04Q78K113L073L713
57908H48715M640O082P306P590P392P709Q528Q790Q109P452P648Q091P720O649
57894I52421N928N934O017N653N095M681M175L129J486l17j584j745q95N6J80
57879I90214m51r01n32M07J295J802J988K127K534L334M307N208O058O811P094
57864A031295O743O424O958Q078Q652Q199P404O911O380N259L809K777K424K414
57850A113727K407K320K169K066K215K618K970L056L018K992K780K271J893K149
$$ y = [890613, 888580, 887397, 886626, 885660, 884284, 882868, 882161, 882690, 884261, 886339, 888887, 892329, 896578, 900664, 903672, 905588, 906878, 907790, 908566, 909795, 911736, 913472, 913486, 911146, 907164, 902642, 898234, 894180, 890448, 886525, 881591, 875302, 868200, 861158, 854678, 848985, 844447, 841431, 839802, 839042, 838938, 839816, 841929, 845002, 848715, 853355, 859437, 866743, 874333, 881725, 889434, 897962, 906752, 914861, 922313, 929961, 938052, 945772, 952421, 958349, 964283, 970300, 975953, 981048, 985729, 989904, 993033, 994519, 994202, 992618, 990873, 989978, 990034, 990214, 989763, 988862, 988330, 988737, 990032, 991834, 993822, 995949, 998483, 1001817, 1006124, 1011332, 1017390, 1024201, 1031295, 1038038, 1044462, 1051420, 1059498, 1068150, 1076349, 1083753, 1090664, 1097044, 1102303, 1106112, 1108889, 1111313, 1113727, 1116134, 1118454, 1120623, 1122689, 1124904, 1127522, 1130492, 1133548, 1136566, 1139558, 1142338, 1144609, 1146502, 1148651]
57836A148651K847L258L036K517K115J819J441J037P89P24P18O65M93Q4n88j315
57820A168291j842k103k149j876j165l03J65J78M16J446K993M416N565O567P128
57805A187727O951O680P385Q877R674R059Q076P818P787P045O127O371P738Q779
57791A296094Q770Q626R403J0870J2018J2183J1369J0096R197R175R563R457Q670
57778A425491P810P240O726O170N735N173L968K477J908K680L728M038L984M434
57764A491562N327O031O548P426Q758J0100J1133J1787J1969J1808J1882J2531
57752A606862J3200J3140J2511J2088J2045J1869J1455J1434J2214J3286J3866
57741A743970J3791J3512J3480J3750J4076J4230J4300J4582J5123J5510J5356
$$ y = [1148651, 1151498, 1154756, 1157792, 1160309, 1162424, 1164243, 1165684, 1166721, 1167510, 1168234, 1168952, 1169617, 1170110, 1170194, 1169606, 1168291, 1166449, 1164346, 1162197, 1160321, 1159156, 1158853, 1159018, 1159196, 1159612, 1161058, 1164051, 1168467, 1174032, 1180599, 1187727, 1194678, 1201358, 1208743, 1217620, 1227294, 1236353, 1244429, 1252247, 1260034, 1267079, 1273206, 1279577, 1287315, 1296094, 1304864, 1313490, 1322893, 1333763, 1345781, 1357964, 1369333, 1379429, 1388626, 1397801, 1407364, 1416821, 1425491, 1433301, 1440541, 1447267, 1453437, 1459172, 1464345, 1468313, 1470790, 1472698, 1475378, 1479106, 1483144, 1487128, 1491562, 1496889, 1502920, 1509468, 1516894, 1525652, 1535752, 1546885, 1558672, 1570641, 1582449, 1594331, 1606862, 1620062, 1633202, 1645713, 1657801, 1669846, 1681715, 1693170, 1704604, 1716818, 1730104, 1743970, 1757761, 1771273, 1784753, 1798503, 1812579, 1826809, 1841109, 1855691, 1870814, 1886324, 1901680]
57730A901680J4824J4443J4532J5048J5857J6766J7452J7679J7589J7494J7487
57719B080851J7525J7703J8141J8717J9218J9699K0314K0945K1346K1649K2290
57708B298398K3418K4714K5912K7138K8636L0355L1960L3136L3863L4431L5237
57697B627198L6454L8029L9953M2310M4922M7376M9708N2765N7349O3164O9120
57686C168348P4640Q0181Q6524R4098J03079J13478J24811J36148J46998J57918
57676D286223J69774J82365J94190K03536K09385K10977K06702J94069J71403
57667F028624J39701J02545O3990K6451r326m2787p2622r7411j16714j31127j41441
57656E749883j48013j50990j50757j47812j42367j34407j24283j12962j01438
$$ y = [1901680, 1916504, 1930947, 1945479, 1960527, 1976384, 1993150, 2010602, 2028281, 2045870, 2063364, 2080851, 2098376, 2116079, 2134220, 2152937, 2172155, 2191854, 2212168, 2233113, 2254459, 2276108, 2298398, 2321816, 2346530, 2372442, 2399580, 2428216, 2458571, 2490531, 2523667, 2557530, 2591961, 2627198, 2663652, 2701681, 2741634, 2783944, 2828866, 2876242, 2925950, 2978715, 3036064, 3099228, 3168348, 3242988, 3323169, 3409693, 3503791, 3606870, 3720348, 3845159, 3981307, 4128305, 4286223, 4455997, 4638362, 4832552, 5036088, 5245473, 5456450, 5663152, 5857221, 6028624, 6168325, 6270870, 6334860, 6361311, 6351985, 6309198, 6236576, 6139165, 6022451, 5891324, 5749883, 5601870, 5450880, 5300123, 5152311, 5009944, 4875537, 4751254, 4638292, 4536854]
57647D536854r0087p8826o7667n6793m6284l6276k7255j9665j3164o851l70N794
57635D099410J1237J6278K1337K6337L1218L6390M2114M7846N2884N7387O2105
57624D504543O7416P3274P9792Q7036R4434J01291J07807J14761J22023J28247
57614E480624J32218J33626J32218J27218J18278J06341R2734P7705O0633M1465
57604F503060K1296J613j6477l2313m5627n6631o5719p2901p7810q0386q1237
57593E996868q1047p9879p7329p3273o8096o2285n6082m9733m3667l8125l2776
57582E334576k7115k1271j5984j1634p681l470P79M252O705Q841J1429J4524J7649
57569E311600K0410K2656K4318K5440K6318K7325K8576K9921L1173L2213L2914
$$ y = [4536854, 4446767, 4367941, 4300274, 4243481, 4197197, 4160921, 4133666, 4114001, 4100837, 4093986, 4093616, 4099410, 4110647, 4126925, 4148262, 4174599, 4205817, 4242207, 4284321, 4332167, 4385051, 4442438, 4504543, 4571959, 4645233, 4725025, 4812061, 4906495, 5007786, 5115593, 5230354, 5352377, 5480624, 5612842, 5746468, 5878686, 6005904, 6124182, 6230523, 6323257, 6400962, 6461595, 6503060, 6524356, 6525969, 6509492, 6477179, 6431552, 6374921, 6309202, 6236301, 6158491, 6078105, 5996868, 5915821, 5835942, 5758613, 5685340, 5617244, 5554959, 5498877, 5449144, 5405477, 5367352, 5334576, 5307461, 5286190, 5270206, 5258572, 5250891, 5247421, 5248200, 5252452, 5259157, 5267998, 5279427, 5293951, 5311600, 5332010, 5354666, 5378984, 5404424, 5430742, 5458067, 5486643, 5516564, 5547737, 5579950, 5612864]
57558E612864L3239L3510L4312L5895L7777L9197L9982M0695M1827M3230M4569
57547F037097M6006M7917N0151N2142N3789N5622N7927O0226O1998O3420O5005
57536F651300O6921O9108P1768P5166P9138Q3265Q7435R1842R6619J01809J07539
57525G581910J13712J19751J25145J30037J34708J38605J40600J40186J37719
57516H762373J33391J26731J17441J06053R3379P9788O5455N0849L6580K3146
57506I595186J1156J335o208j2301j7689k1933k3972k3672k2063j9961j7136j3137
57494I429605q388l822L08M639R650J4901J9591K3529K7209L1049L4953L8589
57482I621813M1857M4942M8171N1919N6285O0805O4832O8368P2107P6414Q0746
$$ y = [5612864, 5646103, 5679613, 5713925, 5749820, 5787597, 5826794, 5866776, 5907471, 5949298, 5992528, 6037097, 6083103, 6131020, 6181171, 6233313, 6287102, 6342724, 6400651, 6460877, 6522875, 6586295, 6651300, 6718221, 6787329, 6859097, 6934263, 7013401, 7096666, 7184101, 7275943, 7372562, 7474371, 7581910, 7695622, 7815373, 7940518, 8070555, 8205263, 8343868, 8484468, 8624654, 8762373, 8895764, 9022495, 9139936, 9245989, 9339368, 9419156, 9484611, 9535460, 9572040, 9595186, 9606342, 9607677, 9601469, 9589168, 9571479, 9549546, 9525574, 9501902, 9479839, 9459878, 9442742, 9429605, 9421217, 9417395, 9417703, 9422342, 9431992, 9446893, 9466484, 9490013, 9517222, 9548271, 9583224, 9621813, 9663670, 9708612, 9756783, 9808702, 9864987, 9925792, 9990624, 10058992, 10131099, 10207513, 10288259]
57471A0288259Q4597Q8501R3390R9250J05254J11137J17467J24424J31221J37189
57461A1380689J42591J47734J51919J53989J53562J50983J46294J38984J28746
57452A2695491J15999J01565Q6315P1082N6502M2770K9871J8044P795m70o581
57441A3218383j0432j2160j2438j2057j1028q602m373R69O394J1596J6903K2347
57429A3205502K7514L2226L6830M1498M5787M9266N2296N5673N9522O3042O5472
57418A3734628O6952O8253O9907P1812P3596P5027P6137P7099P8014P8756P9136
57407A4549317P9261P9555Q0359Q1570Q2827Q3834Q4387Q4354Q3861Q3407Q3490
57396A5456222Q4142Q4996Q5695Q6050Q5989Q5619Q5214Q4927Q4611Q4195Q4010
$$ y = [10288259, 10372856, 10461357, 10554747, 10653997, 10759251, 10870388, 10987855, 11112279, 11243500, 11380689, 11523280, 11671014, 11822933, 11976922, 12130484, 12281467, 12427761, 12566745, 12695491, 12811490, 12913055, 12999370, 13070452, 13126954, 13169724, 13199595, 13217639, 13225434, 13224964, 13218383, 13207951, 13195791, 13183353, 13171296, 13160268, 13151666, 13147293, 13148262, 13154656, 13166252, 13183155, 13205502, 13233016, 13265242, 13302072, 13343570, 13389357, 13438623, 13490919, 13546592, 13606114, 13669156, 13734628, 13801580, 13869833, 13939740, 14011552, 14085148, 14160175, 14236312, 14313411, 14391425, 14470181, 14549317, 14628578, 14708133, 14788492, 14870062, 14952889, 15036723, 15121110, 15205464, 15289325, 15372732, 15456222, 15540364, 15625360, 15711055, 15797105, 15883094, 15968713, 16053927, 16138854, 16223465, 16307660, 16391670]
57385A6391670Q4341Q4817Q4775Q4172Q3685Q3802Q4361Q5069Q5933Q6915Q7579
57374A7327119Q7451Q6626Q5668Q5051Q4821Q4675Q4315Q3788Q3550Q3958Q4737
57363A8261759Q5234Q5220Q5088Q5169Q5243Q4866Q3898Q2510Q1002P9746P9052
57352A9178787P8862P8818P8684P8468P8053P7184P5902P4660P3697P2732P1496
57341B0017343P0172O9016O8023O7271O7180O7910O8867O9285O9126O8822O8380
57330B0771395O7287O5253O2565N9708N7079N4993N3544N2449N1484N1010N1621
57319B1398388N3180N4817N5907N6717N7823N9365O1129O2974O4820O6374O7232
57308B2058726O7253O6603O5494O3979O1952N9211N5581N1108M6149M1225L6800
$$ y = [16391670, 16476011, 16560828, 16645603, 16729775, 16813460, 16897262, 16981623, 17066692, 17152625, 17239540, 17327119, 17414570, 17501196, 17586864, 17671915, 17756736, 17841411, 17925726, 18009514, 18093064, 18177022, 18261759, 18346993, 18432213, 18517301, 18602470, 18687713, 18772579, 18856477, 18938987, 19019989, 19099735, 19178787, 19257649, 19336467, 19415151, 19493619, 19571672, 19648856, 19724758, 19799418, 19873115, 19945847, 20017343, 20087515, 20156531, 20224554, 20291825, 20359005, 20426915, 20495782, 20565067, 20634193, 20703015, 20771395, 20838682, 20903935, 20966500, 21026208, 21083287, 21138280, 21191824, 21244273, 21295757, 21346767, 21398388, 21451568, 21506385, 21562292, 21619009, 21676832, 21736197, 21797326, 21860300, 21925120, 21991494, 22058726, 22125979, 22192582, 22258076, 22322055, 22384007, 22443218, 22498799, 22549907, 22596056, 22637281, 22674081]
57297B2674081L3137L0179K7564K4915K2296K0311J9584K0094K1178K2155K2893
57286B2938387K3725K4929K6501K8358L0572L3226L6087L8621M0297M0870M0394
57275B3301967L9037L6928L4076L0452K6143K1271J5719R186J778n701j2501j8898
57263B3479457k5870l3661m1171m7135n1559n5534n9916o4634o9203p3281p6547
57252B2880946p8577p9280p9239p9206p9269p8941p8113p7505p7792p8579p8768
57241B2015677p7893p6548p5282p3637p0800o6884o3015o0237n8720n8010n7664
57230B1276987n7489n7522n7820n8215n8384n8380n8808o0051o1505o2173o1924
57219B0624716o1531o1445o1227o0433n9336n8438n7844n7548n7880n8969n9962
$$ y = [22674081, 22707218, 22737397, 22764961, 22789876, 22812172, 22832483, 22852067, 22872161, 22893339, 22915494, 22938387, 22962112, 22987041, 23013542, 23041900, 23072472, 23105698, 23141785, 23180406, 23220703, 23261573, 23301967, 23341004, 23377932, 23412008, 23442460, 23468603, 23489874, 23505593, 23514779, 23516557, 23510856, 23498355, 23479457, 23453587, 23419926, 23378755, 23331620, 23280061, 23224527, 23164611, 23099977, 23030774, 22957493, 22880946, 22802369, 22723089, 22643850, 22564644, 22485375, 22406434, 22328321, 22250816, 22173024, 22094445, 22015677, 21937784, 21861236, 21785954, 21712317, 21641517, 21574633, 21511618, 21451381, 21392661, 21334651, 21276987, 21219498, 21161976, 21104156, 21045941, 20987557, 20929177, 20870369, 20810318, 20748813, 20686640, 20624716, 20563185, 20501740, 20440513, 20380080, 20320744, 20262306, 20204462, 20146914, 20089034, 20030065, 19970103]
57208A9970103n9437n6699n2456m8052m4208m0563l6454l2049k8426k6378k5521
57197A9519860k5028k4925k6068k8937l3315l9045m6292n4751o3518p2221q1548
57186A9024212r2068j03253j14251j25191j36857j49374j61843j73158j82636
57177A7785581j89842j94395j95991j94541j90385j84399j77578j70245j61975
57168A6126230j52516j42491j33031j24985j18603j13610j09485j06116j04202
57159A5021191j04416j06225j08430j11006j15367j22379j31186j40661j50875
57150A3930646j62201j73802j84177j92624j99099k03146k04083k01902j97127
57141A2212485j90186j81797j73513j66831j62163j59587j59953j63955j70454
$$ y = [19970103, 19910666, 19853967, 19801511, 19753459, 19709251, 19668688, 19632234, 19600185, 19571759, 19545381, 19519860, 19494832, 19469907, 19443839, 19414902, 19381587, 19342542, 19296250, 19241499, 19177981, 19105760, 19024212, 18932144, 18828891, 18714640, 18589449, 18452592, 18303218, 18141375, 17968217, 17785581, 17595739, 17401344, 17205353, 17010812, 16820427, 16636028, 16458450, 16288205, 16126230, 15973714, 15831223, 15698192, 15573207, 15454604, 15340994, 15231509, 15125393, 15021191, 14916775, 14810550, 14702120, 14591114, 14475747, 14353368, 14222182, 14081521, 13930646, 13768445, 13594643, 13410466, 13217842, 13018743, 12815597, 12611514, 12409612, 12212485, 12022299, 11840502, 11666989, 11500158, 11337995, 11178408, 11018455, 10854500, 10684046]
57132A0684046j77087j82369j85995j87324j85155j79217j70605j60509j49669
57123I106116j39334j31431j27209j26569j29138j34956j43527j52829j59827
57114G861296j61781j57044j45255j27119j03773p6501m7201j8365Q336L3065
57104G065658N6602P8656R8456J16465J34264J53120J74110J99320K31396K72073
57094H580120L22374L83437M54971N33181O12060O86126P49968P98267Q33787
57085A3954291Q77507R62566J107202J289417J450015J523053J467452J278096
57077B3909599R77412O01307J89928k15985n77877q65227j062215j169200j198062
57068B0589680j167715j103530j035017r86454r66609r68168r76886r80368r70593
$$ y = [10684046, 10506959, 10324590, 10138595, 9951271, 9766116, 9586899, 9416294, 9255785, 9106116, 8966782, 8835351, 8708142, 8581573, 8452435, 8317479, 8173952, 8021123, 7861296, 7699515, 7542471, 7397216, 7270097, 7166324, 7089823, 7042622, 7024257, 7032593, 7065658, 7122260, 7200916, 7299372, 7415837, 7550101, 7703221, 7877331, 8076651, 8308047, 8580120, 8902494, 9285931, 9740902, 10274083, 10886143, 11572269, 12322237, 13120504, 13954291, 14831798, 15794364, 16901566, 18190983, 19640998, 21164051, 22631503, 23909599, 24887011, 25488318, 25678246, 25462261, 24884384, 24019157, 22956942, 21787742, 20589680, 19421965, 18318435, 17283418, 16296964, 15330355, 14362187, 13385301, 12404933, 11434340]
57059A1434340r43702r00420q45230p83079p17007o48999n81570n17361m58133
57050E038839m04814l57915l17316k82338k52456k27322k06009j87088j69724
57041B633857j53936j39720j26834j15601j06859j00718r6256r2660q9694q6862
57031A524717q3241p8596p3733o9220o4775o0229n6093n2511m8694m4016l8853
57020H54756l3686k8290k2421j6388j0193k965N976J6291K7524L9608N1193N8568
57008I39973N8219N0470L9130K7410J5429K080j2092k4839l4430m1089m6246n0893
56996I23122n4779n7059n7512n6837n5730n4012n1024m6668m1639l6697l2119
56985C79046k7885k4112k1073j8934j7570j6662j5972j5485j5172j4761j3957
$$ y = [11434340, 10490638, 9590218, 8744988, 7961909, 7244902, 6595903, 6014333, 5496972, 5038839, 4634025, 4276110, 3958794, 3676456, 3424000, 3196678, 2990669, 2803581, 2633857, 2479921, 2340201, 2213367, 2097766, 1990907, 1890189, 1793933, 1701273, 1611579, 1524717, 1441476, 1362880, 1289147, 1219927, 1155152, 1094923, 1038830, 986319, 937625, 893609, 854756, 821070, 792780, 770359, 753971, 743778, 740813, 746789, 763080, 790604, 830212, 881405, 939973, 998192, 1048662, 1087792, 1115202, 1130631, 1132711, 1120619, 1095780, 1061350, 1020261, 974015, 923122, 868343, 811284, 753772, 696935, 641205, 587193, 536169, 489501, 447862, 411165, 379046, 351161, 327049, 305976, 287042, 269472, 252810, 236838, 221353, 206181, 191420, 177463]
56974A77463j2809j1563j0169q393o393m716l513k306o97J091K808M782P432J0393
56960A43410J2660J3609J3566J3275J3091J2623J1168Q528N320K407R4j783l195
56947B44773l952m276m638m887m322k932j753j431j243j55J748L734N745Q224
56933B34635J0887J2690J3010J2087J0295P735M679J647j112l686n933p526q610
56920B80798r721j0853j1282j0624r495q668q208p773p335p040o745o199n468
56907A71387m729l868k697j443m89J89R57J881K640L070L464M240N536P220R002
56892A96360J0560J1798J2994J4430J5841J6580J6338J5397J4034J2152R615O692
56880C52791L857J395n33j810k646l601m782n328m303k149m40P2N49K793P253
$$ y = [177463, 164654, 153091, 142922, 134529, 128136, 123420, 119907, 117601, 116904, 117995, 120803, 125585, 133017, 143410, 156070, 169679, 183245, 196520, 209611, 222234, 233402, 241930, 247250, 249657, 249751, 247968, 244773, 240821, 236545, 231907, 227020, 222698, 219766, 218013, 216582, 215339, 215184, 216932, 220666, 226411, 234635, 245522, 258212, 271222, 283309, 293604, 301339, 306018, 307665, 306553, 302867, 296934, 289408, 280798, 271077, 260224, 248942, 238318, 228823, 220155, 211947, 204174, 196839, 189799, 183054, 176855, 171387, 166658, 162790, 160093, 158650, 158161, 158350, 159307, 161188, 163828, 166898, 170362, 174602, 180138, 187358, 196360, 206920, 218718, 231712, 246142, 261983, 278563, 294901, 310298, 324332, 336484, 346099, 352791, 356648, 358043, 357510, 355700, 353054, 349453, 344671, 339343, 335040, 332891, 332451, 332523, 333072, 335865, 343118]
56865C43118J2781J7974K2188K5406K7671K8796K8300K5663K0925J5047R316M314
56853E81499k39m563q230j0629j1737j2034j1804j0858q969o254l003P51N311
56840D99241J0993J7794K5402L3259M0419M5496M7179M5028L9711L2375K3969
56829H60866J5150O372k142j0340j7870k3939k7987l0308l1661l2329l1968l0285
56817F43559k7402k3490j8500j2422n462K063R700J6618K1752K4432K4643K2665
56805F78156J8788J3532P692J812m145j0305j6229k1111k4505k6623k7910k8598
56793E60554k8646k7879k6137k3402j9848j5702j1078o004o96M261Q065J0137
56781D23625J0490R653Q105N881K806r50m807q301j1431j4293j6591j7854j8208
$$ y = [343118, 355899, 373873, 396061, 421467, 449138, 477934, 506234, 531897, 552822, 567869, 577185, 581499, 581260, 576697, 568467, 557838, 546101, 534067, 522263, 511405, 502436, 496182, 493179, 493930, 499241, 510234, 528028, 553430, 586689, 627108, 672604, 719783, 764811, 804522, 836897, 860866, 876016, 882388, 880246, 869906, 852036, 828097, 800110, 769802, 738141, 705812, 673844, 643559, 616157, 592667, 574167, 561745, 556283, 558346, 568046, 584664, 606416, 630848, 655491, 678156, 696944, 710476, 718168, 719980, 715835, 705530, 689301, 668190, 643685, 617062, 589152, 560554, 531908, 504029, 477892, 454490, 434642, 418940, 407862, 401858, 401162, 405423, 413488, 423625, 434115, 443768, 451873, 457754, 460560, 459610, 454803, 446502, 435071, 420778, 404187, 386333, 368125]
56768C68125j8549j9607k0927k1226j9945j7974j6523j5605j4294j2337j0588
56757A80550r653q955p692o073m823l929k793j434o65r24j621j875j417o39j57
56742A27900l57j023j402j022l87l56q89j140p46l75o45j243j444j084n92m09
56726A14786o50j072j173o73k3M7m35o23j15M12J77n83j092j114r49o36Q5R96
56708A07365J272M56q08j356p88J3j49j362k458k424j616j135j227j054n0J195
56692I5874J722J380Q10O39R60J355J268N73j90l65k6K21J77L00Q97J712K379
56675A09686K754K660K058J574K005L078L546K945K290K455K866K582J851J535
56661A43885J649J545J182J139J538J891J932J848J748J582J529J792K102J981
$$ y = [368125, 349576, 329969, 309042, 287816, 267871, 249897, 233374, 217769, 203475, 191138, 180550, 170897, 161942, 154250, 148177, 143354, 139425, 136632, 135198, 134533, 133609, 131988, 130113, 128696, 128057, 127900, 127543, 126520, 125118, 124096, 123709, 123353, 122464, 121324, 120578, 120203, 119558, 118315, 116871, 115787, 115195, 114786, 114136, 113064, 111891, 111218, 111195, 111242, 110807, 110184, 110069, 110481, 110658, 110075, 108983, 107869, 106920, 106284, 106369, 107365, 108637, 109093, 108285, 106929, 106141, 106154, 106005, 104643, 102185, 99761, 98145, 97010, 95783, 94729, 94679, 95874, 97596, 98976, 99786, 100425, 101385, 102740, 104008, 104581, 104391, 104026, 104000, 104221, 104398, 104698, 105595, 107307, 109686, 112440, 115100, 117158, 118732, 120737, 123815, 127361, 130306, 132596, 135051, 137917, 140499, 142350, 143885, 145534, 147079, 148261, 149400, 150938, 152829, 154761, 156609, 158357, 159939, 161468, 163260, 165362, 167343]
56647A67343J411P26O5n33q23p41q24j507k289k334j699j174j091j132j206j642
56631A52550k471l212l505l356k883k295k009k131k106j511q91r72j367j155m56
56616A22230k41o74r33p50q36j411j664j214r34j531k307k145j031J38O81M31
56600A07809l58q66j28J734L300L458K649J880J334P38M06Q22J590J857J542J227
56584A28994J033N91J8qO67J387J640J527J180M91k67k99P38K072K666K383J898
56567A46711J712J776J944K269K742L100L183L232L652M457N105N025M173L075
56553A92156K329K111K131J947J354N29j79n61o55n61l63k37m49j019j561j656
56537A95316j296q62p30j050j706k287k313j748j112q30o83k35L89N92O8q89j729
$$ y = [167343, 168754, 169480, 169545, 169012, 168189, 167448, 166624, 165117, 162828, 160494, 158795, 157621, 156530, 155398, 154192, 152550, 150079, 146867, 143362, 140006, 137123, 134828, 132819, 130688, 128582, 127071, 126180, 125208, 123841, 122686, 122230, 121989, 121315, 120382, 119632, 118796, 117385, 115721, 114507, 113573, 112042, 109735, 107590, 106559, 106697, 107378, 107809, 107451, 106585, 106457, 108191, 111491, 114949, 117598, 119478, 120812, 121550, 121956, 122778, 124368, 126225, 127767, 128994, 130027, 130618, 130636, 130628, 131295, 132682, 134322, 135849, 137029, 137520, 137253, 136954, 137692, 139764, 142430, 144813, 146711, 148423, 150199, 152143, 154412, 157154, 160254, 163437, 166669, 170321, 174778, 179883, 184908, 189081, 192156, 194485, 196596, 198727, 200674, 202028, 202557, 202378, 201817, 201162, 200601, 200238, 200001, 199552, 198533, 196972, 195316, 194020, 193158, 192428, 191378, 189672, 187385, 185072, 183324, 182212, 181382, 180699, 180464, 180853, 181445, 181513, 180624, 178895]
56520A78895j997j509o30j69n09r99p97p8K60m5l96m99p62j273j334n07N21P94
56502A68966K58m40q65r22n13L21J096J330J162J122J330J436J224Q55N69L93
56486A77322K76K76N33J103J789K202K073J495P70J42j26K86J328K327K747K990
56470A97533L770M850N264M807M363M421M379L788L254L360L504K781J452N47
56456B48073L96N06N72P58J067J222J159R56M29m95j216j072m44m01j232k136
56440B48142k463k417k286j867j112o52r96j686j800j149l86q5j63k46k19k21
56424B30394k93l17k87l61n13l05N95J694J987J191K38J24P03J085R59Q22J014
56407B38730J244J202R68O28K3p66j205j041q58j338k209k495j807p87j83j4R0
$$ y = [178895, 176898, 175389, 174759, 174590, 174081, 173082, 172285, 172207, 172467, 172422, 172026, 171527, 170765, 169492, 168158, 167651, 168172, 168966, 169224, 168784, 167919, 166997, 166484, 166805, 167901, 169231, 170393, 171515, 172845, 174281, 175505, 176360, 176929, 177322, 177598, 177874, 178407, 179510, 181299, 183501, 185574, 187069, 187839, 187981, 187855, 188141, 189469, 191796, 194543, 197533, 201303, 206153, 211417, 216224, 220587, 225008, 229387, 233175, 236429, 239789, 243293, 246074, 247526, 248073, 248469, 248975, 249547, 250305, 251372, 252594, 253753, 254709, 255138, 254643, 253427, 252355, 251911, 251510, 250278, 248142, 245679, 243262, 240976, 239109, 237997, 237345, 236349, 234663, 232863, 231714, 231328, 231243, 231080, 230834, 230615, 230394, 230101, 229784, 229497, 229136, 228623, 228318, 228913, 230607, 232594, 233785, 234023, 234147, 234850, 235935, 236894, 237716, 238730, 239974, 241176, 242144, 242772, 242795, 242029, 240824, 239783, 238925, 237587, 235378, 232883, 231076, 230289, 230106, 230092, 230182]
56390B30182J69J7k70l64k97m19p59r06o96n28o98q26m53J89N42O43J079K035
56372B28640K998L472L573L737M194M815N246N233N034N315O265P098O997O265
56358B98882N840N830N452M416L416L007K914K821L014L715M476M763M581M139
56344C57266L525L049L203L850M178L879L586L652L455K584J794J914K613L219
56330D01767L938N116N990N572M382L913M558N306N439N306N356N553N971O860
56316D75027P922Q453Q493Q875R855J0605J0410R549Q592P611O548N751N543N668
56302E88902N600N144M548M182M267M612M701M292L843L842M057M023M070M972
56288F51055O687Q309R368J0242J1134J1696J1986J2842J4710J6906J8619K0001
$$ y = [230182, 230351, 230368, 230098, 229734, 229437, 229018, 228259, 227353, 226657, 226129, 225431, 224605, 224152, 224341, 224883, 225526, 226605, 228640, 231638, 235110, 238683, 242420, 246614, 251429, 256675, 261908, 266942, 272257, 278522, 285620, 292617, 298882, 304722, 310552, 316004, 320420, 323836, 326843, 329757, 332578, 335592, 339307, 343783, 348546, 353127, 357266, 360791, 363840, 367043, 370893, 375071, 378950, 382536, 386188, 389643, 392227, 394021, 395935, 398548, 401767, 405705, 410821, 416811, 422383, 426765, 430678, 435236, 440542, 445981, 451287, 456643, 462196, 468167, 475027, 482949, 491402, 499895, 508770, 518625, 529230, 539640, 549189, 557781, 565392, 571940, 577691, 583234, 588902, 594502, 599646, 604194, 608376, 612643, 617255, 621956, 626248, 630091, 633933, 637990, 642013, 646083, 651055, 657742, 666051, 675419, 685661, 696795, 708491, 720477, 733319, 748029, 764935, 783554, 803555]
56276H03555K1669K3754K6154K9144L2960L7094M0735M3835M7136N1172N5788
56265A212996O0673O5938P1968P8790Q5803R2259R8095J04013J10485J16889J22033
56254B219942J25363J27059J27090J25007J20681J14510J06518R6136Q3285O9048
56244C314639N4711M0644K6660J2935j29j2572k4650l6108m6239n4681o1643o7466
56232C146101p2338p6453p9954q2708q4454q5294q5777q6367q7004q7279q6899
56221B231574q5981q4837q3540q1738p9049p5556p1781o8097o4422o0583n6708
56210A419282n3071m9681m6225m2508l8762l5417l2517k9605k6323k3012k0328
56199A021833j8305j6298j4017j1979j0553r141o995m448k557j663j093k54O06
$$ y = [803555, 825224, 848978, 875132, 904276, 937236, 974330, 1015065, 1058900, 1106036, 1157208, 1212996, 1273669, 1339607, 1411575, 1490365, 1576168, 1668427, 1766522, 1870535, 1981020, 2097909, 2219942, 2345305, 2472364, 2599454, 2724461, 2845142, 2959652, 3066170, 3162306, 3245591, 3314639, 3369350, 3409994, 3436654, 3449589, 3449460, 3436888, 3412238, 3376130, 3329891, 3275210, 3213567, 3146101, 3073763, 2997310, 2917356, 2834648, 2750194, 2664900, 2579123, 2492756, 2405752, 2318473, 2231574, 2145593, 2060756, 1977216, 1895478, 1816429, 1740873, 1669092, 1600995, 1536573, 1475990, 1419282, 1366211, 1316530, 1270305, 1227797, 1189035, 1153618, 1121101, 1091496, 1065173, 1042161, 1021833, 1003528, 987230, 973213, 961234, 950681, 941540, 934545, 930097, 927540, 925877, 924784, 924530, 925136]
56186I25136R38O60K93N98K070M386O476P511P713P909Q530R516J0780J2123J3058
56171A017697J3540J4447J6394J8408J8978J8267J7963J8883K0059K0517K0533
56160A215686K0572K0293J9496J8938J9194J9575J9187J8443J8499J9663K1360
56149A430906K3385K6200L0008L4394L9028M4253N0805N9165O9050P9438Q9196
56138A975828R7848J05413J11578J15544J16909J16210J14300J11638J08427J04780
56128C078475J00467R4958Q8082Q0155P1252O0987M9368L7175K5067J2867K31
56117C699084j2635k5423l8297n1367o4040p5515q5466r3689r9593j02686j03229
56106B947144j01734r8279r2896q6252p9202p1922o4159n6095m8252m0678l3020
$$ y = [925136, 926074, 926734, 927027, 927625, 929695, 934081, 940557, 948068, 955781, 963690, 972220, 981736, 992516, 1004639, 1017697, 1031237, 1045684, 1062078, 1080486, 1099464, 1117731, 1135694, 1154577, 1174636, 1195153, 1215686, 1236258, 1256551, 1276047, 1294985, 1314179, 1333754, 1352941, 1371384, 1389883, 1409546, 1430906, 1454291, 1480491, 1510499, 1544893, 1583921, 1628174, 1678979, 1738144, 1807194, 1886632, 1975828, 2073676, 2179089, 2290667, 2406211, 2523120, 2639330, 2753630, 2865268, 2973695, 3078475, 3178942, 3273900, 3361982, 3442137, 3513389, 3574376, 3623744, 3660919, 3685986, 3698853, 3699084, 3686449, 3661026, 3622729, 3571362, 3507322, 3431807, 3346341, 3252652, 3153059, 3050373, 2947144, 2845410, 2747131, 2654235, 2567983, 2488781, 2416859, 2352700, 2296605, 2248353, 2207675, 2174655]
56095B174655k5392j8512j2884q268m131k64L112N614P052P646P958Q445R133
56082B154164R767J0160J0363J0670J1440J2798J4469J6091J7514J8649J9318
56071B305403J9634K0264K1739K3734K5605K7288K9030L0528L1321L1746L2550
56060B598842L3674L4479L5050L6114L7650L8861L9603M0566M1855M2801M3489
56049C022984M4975M7434M9559N0433N0806N1761N3311N5026N6849N8600N9753
56038C601491O0472O1724O3771O5700O7033O8478P0453P2273P3612P5240P7470
56027D357717P9423Q0786Q2704Q5772Q8776R0783R2858R6213J00074J03102J05644
56016E363852J08846J12607J16075J19257J22538J25557J27975J30484J33741
$$ y = [2174655, 2149263, 2130751, 2117867, 2109599, 2105468, 2105204, 2108316, 2113930, 2120982, 2128628, 2136586, 2145031, 2154164, 2163931, 2174091, 2184454, 2195124, 2206564, 2219362, 2233831, 2249922, 2267436, 2286085, 2305403, 2325037, 2345301, 2367040, 2390774, 2416379, 2443667, 2472697, 2503225, 2534546, 2566292, 2598842, 2632516, 2666995, 2702045, 2738159, 2775809, 2814670, 2854273, 2894839, 2936694, 2979495, 3022984, 3067959, 3115393, 3164952, 3215385, 3266191, 3317952, 3371263, 3426289, 3483138, 3541738, 3601491, 3661963, 3723687, 3787458, 3853158, 3920191, 3988669, 4059122, 4131395, 4205007, 4280247, 4357717, 4437140, 4517926, 4600630, 4686402, 4775178, 4865961, 4958819, 5055032, 5155106, 5258208, 5363852, 5472698, 5585305, 5701380, 5820637, 5943175, 6068732, 6196707, 6327191, 6460932]
56007F460932J37325J40954J45439J51096J56698J61584J67202J74827J83271
55998G879328J90979J98897K08886K20498K31792K42542K54324K67948K82872
55989I978066K98644L15193L32338L50522L71147L94822M20466M47463M77166
55980A3385827N10846N48170N89429O37178O93710P59157Q34219R22348J026983
55971A9907867J149357J291365J457184J648440J860441K086842K326345K583146
55963C4310987K865224L185777L562788M014261M558495N222034O042063P058946
55955G0820575Q313485R849951J1701941J3857557J6230733J8636238K0735052
55948A70145532K2000211K1855497K0013676J6734574J2672905Q401621M107246
$$ y = [6460932, 6598257, 6739211, 6884650, 7035746, 7192444, 7354028, 7521230, 7696057, 7879328, 8070307, 8269204, 8478090, 8698588, 8930380, 9172922, 9427246, 9695194, 9978066, 10276710, 10591903, 10924241, 11274763, 11645910, 12040732, 12461198, 12908661, 13385827, 13896673, 14444843, 15034272, 15671450, 16365160, 17124317, 17958536, 18880884, 19907867, 21057224, 22348589, 23805773, 25454213, 27314654, 29401496, 31727841, 34310987, 37176211, 40361988, 43924776, 47939037, 52497532, 57719566, 63761629, 70820575, 79134060, 88984011, 100685952, 114543509, 130774242, 149410480, 170145532, 192145743, 214001240, 234014916, 250749490, 263422395, 271824016, 275931262]
55941B75931262k28622m444424q124191j0913492j2809829j4092608j5029181
55934B10288915j5703611j6077368j6116737j5836304j5274071j4471448j3474173
55927A03335203j2334646j1111072r865456q655055p520587o484585n559867m753388
55919C7050547m062443l475329k979274k564350k219840j932670j691551j488983
55911A6636107j318196j171970j045499r36942q43916p62348o89548o25520n70191
55902H671977n21782m78661m40543m06972l76596l48596l23173l00138k78607
55893E196909k58353k39992k23568k08320j93926j80701j68543j56976j46176
55884C420354j36704j28331j20327j12673j05775r9279r2417q5365p9051p3770
$$ y = [275931262, 275702640, 271258216, 263134025, 252220533, 239410704, 225318096, 210288915, 194585304, 178507936, 162391199, 146554895, 131280824, 116809376, 103335203, 91000557, 79889485, 70024029, 61368974, 53848387, 47363802, 41803935, 37050547, 32988104, 29512775, 26533501, 23969151, 21749311, 19816641, 18125090, 16636107, 15317911, 14145941, 13100442, 12163500, 11319584, 10557236, 9867688, 9242168, 8671977, 8150195, 7671534, 7230991, 6824019, 6447423, 6098827, 5775654, 5475516, 5196909, 4938556, 4698564, 4474996, 4266676, 4072750, 3892049, 3723506, 3566530, 3420354, 3283650, 3155319, 3034992, 2922319, 2816544, 2717265, 2624848, 2539483, 2460432, 2386662]
55874B386662o9088o4796o0902n7064n3043m9339m6409m3795m1091l9023l8367
55863A823745l8511l8471l8638l9944m1868m2856m2449m1438m0202l8501l6758
55852A384109l5876l5677l4919l3053l0837k9030k7586k6127k4364k2042j9373
55841A065225j7302j6432j6025j5032j3592j2423j1285r512p709p253q136q888
55829I21636q728q368q534r103r995j1487j3202j4078j3900j3844j4921j6694
55817G78782j8052j8435j7966j7071j6337j6093j5897j5032j3601j2382j1544
55806F06372j0326q239n814l836k543j787j362q91o3Q42J139O01l67j340k142
55791E70244k552k550k723l602m559m319k821j640k144l970n772o827p407q044
$$ y = [2386662, 2317574, 2252778, 2191876, 2134812, 2081769, 2032430, 1986021, 1942226, 1901135, 1862112, 1823745, 1785234, 1746763, 1708125, 1668181, 1626313, 1583457, 1541008, 1499570, 1459368, 1420867, 1384109, 1348233, 1312556, 1277637, 1244584, 1213747, 1184717, 1157131, 1131004, 1106640, 1084598, 1065225, 1047923, 1031491, 1015466, 1000434, 986842, 974419, 963134, 953622, 945913, 938660, 930524, 921636, 912908, 904540, 896006, 886903, 876908, 865421, 852219, 838141, 824241, 810397, 795476, 778782, 760730, 742295, 724329, 707258, 690921, 674828, 658931, 643899, 630298, 617916, 606372, 596046, 587807, 581993, 578157, 575614, 573827, 572465, 571574, 571511, 572353, 573492, 574093, 573726, 572386, 570244, 567692, 565142, 562419, 558817, 554258, 549939, 547118, 545478, 543334, 539364, 533592, 526765, 519358, 511314]
55777E11314q941r879j0398j0222r569q851q145p361o766o822p463q076q260q191
55763C92370q189q368q686q975q924q389p641o983o372n745n372n346n244m901
55749B93235m940n713o267n549m200l800m510m911m205l156k526j999j277q93
55735B39289j152j362r58n39q77j650k060k075k183k356k220j946k048k411k347
55720B13105j730j378k066l452m336l945k786k022k017j858o47J122K111J901
55706A92002J346J211J255J016O66O27Q30R14P62M55j9o63j246j536j481j070
55690A95069k69P13J425J593J408J320J758K846M106M627M070L218K923K781J791
55675B29379J24r19q48o43j083j618j543j310j771k841l747m038l616k392o79
$$ y = [511314, 502373, 492494, 482096, 471874, 462305, 453454, 445309, 437948, 431182, 424360, 416897, 408821, 400561, 392370, 384181, 375813, 367127, 358152, 349228, 340839, 333198, 326215, 319843, 314098, 308726, 303380, 298136, 293235, 288295, 282582, 276315, 270766, 266566, 262766, 258256, 253345, 249140, 245984, 243458, 241459, 240182, 239289, 238137, 236775, 235817, 235278, 234401, 232751, 230691, 228616, 226433, 224077, 221857, 219911, 217863, 215452, 213105, 211375, 209997, 207931, 204479, 200143, 196198, 193412, 191390, 189373, 187515, 186868, 187990, 190101, 192002, 193348, 194559, 195814, 196830, 197496, 198123, 198953, 199867, 200629, 201084, 201065, 200402, 199156, 197620, 196139, 195069, 194800, 195513, 196938, 198531, 199939, 201259, 203017, 205863, 209969, 214596, 218666, 221884, 224807, 227588, 229379, 229503, 228584, 227736, 227093, 226010, 224392, 222849, 221539, 219768, 216927, 213180, 209142, 205526, 203134, 202455]
55660B02455N68P58N29Q95J856K574K609K242J865J688J862K217K111J165o0p28
55644B24606q36j015j533k157k800l517m038m083m079m736n862o391n808m831
55630A72920m416m653m963m918m536m094l923m168m551m600m183l610l151k812
55616A14342k597k676l045l342l246k830k398k069j773j488j289j136q64m81l35
55601H4773o93j228j208m14M54O90N81R39J759K130J596Q02M02J29m09o86LJ135
55583I0755J399N24k34K83J755K970L287L064L027L633M910O563Q171R372R840
55568A49319R308P842O094M851M199L404J793m62k597m061m896n511o295p352
55554A55636q365q734q096o751n497m899m879n017n121n246n229m596l182j639
$$ y = [202455, 203023, 203781, 204310, 205205, 207061, 209635, 212244, 214486, 216351, 218039, 219901, 222118, 224229, 225394, 225334, 224606, 223770, 222755, 221222, 219065, 216265, 212748, 208710, 204627, 200548, 195812, 189950, 183559, 177751, 172920, 168504, 163851, 158888, 153970, 149434, 145340, 141417, 137249, 132698, 128098, 123915, 120305, 117154, 114342, 111745, 109069, 106024, 102682, 99436, 96606, 94208, 92139, 90366, 88878, 87589, 86453, 85589, 85108, 84773, 84080, 82852, 81644, 81230, 81684, 82374, 82955, 83894, 85653, 87783, 89379, 90181, 90583, 90712, 90303, 89617, 89620, 90755, 92154, 92678, 92444, 92727, 94482, 97452, 100739, 103803, 106830, 110463, 115373, 121936, 130107, 139479, 149319, 158627, 166469, 172563, 177414, 181613, 185017, 186810, 186348, 183751, 179690, 174794, 169283, 162988, 155636, 147271, 138537, 130441, 123690, 118193, 113294, 108415, 103398, 98277, 93031, 87802, 83206, 80024, 78385]
55540G8385r26j273j948k139j731j128o14j71K43N16N23L22K45O88J654K509K452
55523G7607J450M53N30J834L528M618M716M138L399K751K109J376O07j32q42j356
55507A06786j367r77r84k016l577m545m532m215m210m378m375m238m108l898l569
55492E5797l292k989k288j232n30o70j245j580j525j301r72o18n87j046j692k207
55476C2023k584k630j816k38R30P36k58q09o17k53J20P94J486J385L87o29r28
55459B7099o35k29l9k59q23j174q57l25m22j071j317p47nK92K65J85K1q4K43P95
55439B0913P47r5p60m71K19L39o2k01J40M37L26k9l47m68k17L82Q09M74m64j060
55419B0612n47Q13J917J863Q86J78O30J838K666K571J899R63k72j477j862j241
$$ y = [78385, 77459, 76186, 74238, 72099, 70368, 69240, 68626, 68455, 68698, 69214, 69737, 70059, 70304, 70992, 72646, 75155, 77607, 79057, 79510, 80040, 81874, 85402, 90020, 94736, 98874, 102273, 105024, 107133, 108509, 109116, 108984, 108142, 106786, 105419, 104442, 103458, 101442, 97865, 93320, 88788, 84573, 80363, 75985, 71610, 67372, 63264, 59366, 55797, 52505, 49516, 47228, 45996, 45466, 44796, 43551, 41971, 40446, 39145, 38173, 37555, 36968, 35922, 34230, 32023, 29439, 26809, 24993, 24755, 25685, 26421, 26163, 25354, 24737, 24484, 24604, 25398, 26884, 28269, 28656, 28027, 27099, 26464, 26235, 26196, 25937, 25114, 23940, 23083, 22758, 22336, 21265, 19948, 19201, 19196, 19488, 19753, 19938, 19959, 19875, 20118, 20913, 21660, 21565, 20805, 20334, 20553, 20892, 20830, 20629, 20769, 21206, 21532, 21503, 21156, 20688, 20471, 20853, 21662, 22136, 21672, 20612, 20065, 20878, 22795, 24658, 25544, 25722, 26352, 28190, 30856, 33427, 35326, 36289, 36017, 34540, 32678, 31437]
55403C1437n21m23m70M2O79M75m62j058q96o33o68m82K96J003Q55J29k75j46q4
55384B8798m11o09j26P75J272R14j4r40j478j415o81M03J093Q66Kp79j181j429
55366B5060j564j267n66j38m86j184j465j210q82p31o16n20n70n55JJ034J757
55349A6098J581Q64L42J90P2j25j49Lp3n55r98r40n97n00o39m85J38P10P70M84
55329A6191K08m5l02k46L07Q22O04j57n80l00J91M18M40L26j29q62j296j115o88
55310A3787l88kO31J014O81P8OM24N67K02q6J22M83N36L69L47N35P07P22N88L73
55289B1696K16L23P47J223J345R39K75j67j45Q5J10q2j28Q4J33l94j286j943k063
55270B0968j826j509j209q55l52K31N46K65l94p83o67n24p31q89m93J56L61O4
$$ y = [31437, 30916, 30493, 30023, 30065, 30744, 31219, 30757, 29699, 28803, 28170, 27502, 27020, 27316, 28319, 29174, 29303, 29028, 28882, 28798, 28387, 27778, 27652, 28427, 29699, 30613, 30599, 29659, 28181, 26766, 26085, 26488, 27581, 28447, 28449, 27670, 26489, 25060, 23496, 22229, 21663, 21525, 21039, 19855, 18390, 17180, 16298, 15567, 14951, 14431, 13861, 13306, 13307, 14341, 16098, 17679, 18543, 18885, 19075, 19147, 19022, 18873, 18876, 18803, 18248, 17250, 16310, 15713, 15213, 14574, 14089, 14227, 14937, 15707, 16191, 16399, 16354, 16052, 15806, 16113, 16935, 17539, 17382, 16802, 16502, 16693, 17111, 17551, 17877, 17748, 16886, 15590, 14475, 13787, 13399, 13397, 14028, 15042, 15723, 15801, 15807, 16231, 16798, 17000, 16914, 17036, 17519, 18055, 18424, 18771, 19306, 20013, 20735, 21323, 21696, 21912, 22235, 22982, 24205, 25550, 26489, 26764, 26597, 26452, 26537, 26647, 26565, 26437, 26521, 26654, 26260, 24974, 23031, 20968, 19142, 17633, 16424, 15569, 15217, 15448, 15994, 16259, 15865, 15082, 14415, 13891, 13160, 12271, 11778, 11934, 12295, 12359]
55252A2359j97k46l41l84J58J258K082K020J411Q38K83m71j079r64k29L50L15
55235A7163N5K08Q01J291J319J137J142J160O47l83j101q68j48J11j82k14M71
55218B2609J295J461R19K62j6J37M51N78M18K56M12O98O09M0n67q24o89j46Q01
55199B8704J630J521M44n54o72l69n04r71r70l03L93O23N21L18pm70r63j481j972
55180B4918k007j172R6P23K93m06m57R5N49N38K40p2k28n4M29P71M67l48r91j003
55160B2381n60o5L23N47L98k33r49j117n90J16M78N57O58O67J79p82j546j523
55142A8939q52j05M17P55Q97O89J67l11l80Q1Q78J594J748J201M45J55L81M74
55124B7173N4l39J02J257K054J708P03J80N59J077Q51N4k98L27J310J698J361
$$ y = [12359, 12162, 11916, 11575, 11191, 11349, 12607, 14689, 16709, 18120, 18958, 19241, 18770, 17691, 16727, 16498, 16848, 17163, 17218, 17426, 18227, 19518, 20837, 21974, 23116, 24276, 24923, 24540, 23439, 22571, 22423, 22534, 22352, 22138, 22609, 23904, 25365, 26284, 26546, 26530, 26667, 27118, 27696, 28114, 28370, 28782, 29480, 30089, 30129, 29562, 28738, 28049, 27903, 28704, 30334, 31855, 32299, 31745, 31073, 30704, 30200, 29229, 28259, 27956, 28349, 28972, 29493, 29811, 29804, 29334, 28371, 26890, 24918, 22911, 21739, 21835, 22558, 22851, 22445, 21988, 22083, 22632, 23170, 23410, 23338, 23110, 23056, 23485, 24256, 24723, 24375, 23384, 22381, 21821, 21756, 22079, 22626, 23024, 22791, 21842, 20725, 20135, 20251, 20729, 21286, 21944, 22611, 22790, 22008, 20462, 18939, 18087, 17982, 18399, 19154, 20051, 20740, 20907, 20596, 20216, 20297, 21175, 22769, 24517, 25718, 26163, 26318, 26699, 27173, 27227, 26888, 26990, 28247, 30301, 32009, 32712, 32892, 33451, 34528, 35379, 35433, 35135, 35462, 36772, 38470, 39831]
55107C9831R18P19M40j88q13r08n58k67k06l4M78J056J333J311J241J235J277
55090D6865J420J677J779J363M71l80p16n54k29l5q7l48o05n68k30L6k0j61p3
55071D9605M9k04o38n60J60Q03Q38O88R00J079M71o21r84j97O19K30j149k208
55053D8881k161j356m91J67O74R91R75O46K75J80M42Q11R61Q39O41M36M3n80j079
55034E1295j140j006j137j488j526j037l97N4M75J088J683J856J511P75k80j374
55018D9352j727p36J031K119J771P63L28O66J035J006R71J271J476R54j32q77
55002E9271p13m8L27J76j17k46l40n39o29m23k22m48r32j034n66r5j10l41k35
54983E2736K46P16R65R87O45j06p45n82K44Q03N95K16L92R54J206R71O74N55M49
$$ y = [39831, 40749, 41468, 41908, 41720, 40907, 39999, 39441, 39174, 38968, 38934, 39412, 40468, 41801, 43112, 44353, 45588, 46865, 48285, 49962, 51741, 53104, 53575, 53195, 52479, 51925, 51696, 51661, 51574, 51226, 50621, 50053, 49823, 49859, 49839, 49678, 49605, 49654, 49450, 48812, 48252, 48412, 49215, 50053, 50741, 51641, 52720, 53191, 52570, 51586, 51389, 52008, 52238, 51089, 48881, 46720, 45364, 44873, 45040, 45714, 46705, 47680, 48326, 48601, 48781, 49223, 50034, 50995, 51834, 52475, 52911, 52954, 52374, 51295, 50155, 49149, 48012, 46524, 44998, 43961, 43564, 43618, 44093, 45181, 46864, 48720, 50231, 51006, 50726, 49352, 47625, 46889, 47920, 50039, 51810, 52573, 52901, 53567, 54602, 55608, 56579, 57850, 59326, 60280, 60148, 59271, 58558, 58510, 58837, 59013, 58896, 58650, 58310, 57771, 57142, 56719, 56497, 56049, 55117, 54083, 53517, 53422, 53312, 52971, 52736, 52982, 53698, 54663, 55650, 56295, 56189, 55444, 54862, 55106, 55909, 56504, 56720, 57112, 58066, 59272, 60243, 60917, 61472, 61921]
54964F1921L37N33J174J912K305K335K308K448K716K936L074L345M019N006N860
54949A02229O356O824P611Q436Q723Q487Q276Q174P547O094M527L651L159J993
54935A92087k29k746m644n729o337o709o846o797o808p175p938q657q657p702
54921A05113o345n355m841m280l336k254j326n03L06R34J322J818K642L391L553
54906I0839L445L992N477P112Q063Q471Q965R517R348P949N763L593J773J01j571
54891A72837l062m201n081n883o592p045p201p191p125o974o631o018n149m215
54877I0469l542l386l646l908l794l224k355j432o97l43m28q71j454j788j450
54862E8151m18O81J104Q12M22K76J00k34k52L48R39P46O3j85P5r9j079j997k016
$$ y = [61921, 62258, 62791, 63965, 65877, 68182, 70517, 72825, 75273, 77989, 80925, 83999, 87344, 91363, 96369, 102229, 108585, 115409, 123020, 131456, 140179, 148666, 156942, 165116, 172663, 178757, 183284, 186935, 190094, 192087, 191858, 189112, 184468, 178739, 172402, 165693, 158847, 152050, 145242, 138067, 130129, 121472, 112815, 105113, 98768, 93413, 88572, 84292, 80956, 78702, 77376, 76873, 77179, 78113, 79435, 81253, 83895, 87286, 90839, 94284, 98276, 103753, 110865, 118928, 127399, 136364, 145881, 155229, 163178, 168941, 172534, 174307, 174408, 172837, 169775, 165574, 160493, 154610, 148018, 140973, 133772, 126581, 119456, 112482, 105851, 99833, 94684, 90469, 86927, 83541, 79895, 75987, 72193, 68969, 66614, 65182, 64485, 64142, 63714, 62843, 61389, 59601, 58151, 57733, 58414, 59518, 60330, 60752, 61028, 61128, 60894, 60642, 60990, 61929, 62675, 62738, 62553, 62628, 62529, 61450, 59453, 57437]
54843E7437j535j430j674j582j036o31o38o41l28K4Q4K0J36L73M68M31N76J096
54825E1150J750K015J558O66N7J30N11N95L67L46P55J239J442J421J325J075O15
54808F7017J49n3J03O75J663K685L118K876K700L201M006M395M479N019O175P150
54792A15358P304O946O804P186P919Q727R240R017P925O278M357K066n39k763
54778A95825l916m225m548n149n448n093m615m647m943m759l964l240l175l560
54764A34543l662k888j208P63K130K460K266K518L600N030O262P369Q662J0042
54750A77887J1105J1772J2356J3021J3519J3537J2993J1881R992P117L487k00
54738B98467l244n458p145q635r956j1060j2090j3115j3726j3340j2048j0725
$$ y = [57437, 55902, 54472, 52798, 51216, 50180, 49549, 48911, 48270, 47942, 47966, 48050, 48070, 48206, 48579, 49047, 49478, 50054, 51150, 52900, 54915, 56473, 57139, 57196, 57326, 57837, 58432, 58799, 59145, 59900, 61139, 62581, 64002, 65327, 66402, 67017, 67166, 67113, 67216, 67891, 69554, 72239, 75357, 78233, 80933, 84134, 88140, 92535, 97014, 102033, 108208, 115358, 122662, 129608, 136412, 143598, 151517, 160244, 169484, 178501, 186426, 192704, 197061, 199127, 198588, 195825, 191909, 187684, 183136, 177987, 172539, 167446, 162831, 158184, 153241, 148482, 144518, 141278, 138103, 134543, 130881, 127993, 126785, 127548, 129678, 132138, 134404, 136922, 140522, 145552, 151814, 159183, 167845, 177887, 188992, 200764, 213120, 226141, 239660, 253197, 266190, 278071, 288063, 295180, 298667, 298467, 295223, 289765, 282620, 273985, 264029, 252969, 240879, 227764, 214038, 200698, 188650, 177925]
54726A77925j0075r944r856r740r638r088p535n323l559k913l077l470l824l876
54712H6007l209j808l56M75P16P89Q21P18N96O19O17K45n40j452k136k253j559
54695G8290l08O70P43J66l68o32p96p39j71O20Q74M75K27P17J422J471R32P40
54677H4333J452K541L024K478J353M58K63O54J214J672J956J994J645R57K66M6
54661A06306N56J604K548K759K303K032K684L918M675M453L777L352L326L623
54647A47916M454N903P388Q223Q573R296J0733J2252J3118J3294J3080J2376J0942
54634B77548R081P440N998L921P50k712n246o650p768r174j0547j1475j2066j2433
54620B26667j2178j1106r955r592r733r282p947o640o071n767m952l777l090l339
$$ y = [177925, 167850, 157906, 148050, 138310, 128672, 119584, 112049, 106726, 103167, 100254, 97177, 93707, 89883, 86007, 82798, 80990, 80634, 81109, 81825, 82614, 83435, 84153, 84749, 85368, 85985, 86230, 85690, 84238, 82102, 79849, 78290, 77982, 78652, 79395, 79561, 79193, 78561, 77765, 77026, 76855, 77475, 78349, 78824, 79051, 79768, 81190, 82661, 83593, 84333, 85785, 88326, 91350, 93828, 95181, 95639, 95902, 96556, 97770, 99442, 101398, 103392, 105037, 105994, 106260, 106306, 106862, 108466, 111014, 113773, 116076, 118108, 120792, 124710, 129385, 133838, 137615, 140967, 144293, 147916, 152370, 158273, 165661, 173884, 182457, 191753, 202486, 214738, 227856, 241150, 254230, 266606, 277548, 286629, 294069, 300067, 303988, 304738, 302026, 296780, 290130, 282362, 273188, 262641, 251166, 239100, 226667, 214489, 203383, 193428, 183836, 174103, 164821, 156874, 150234, 144163, 138396, 133444, 129667, 126577, 123238]
54606A23238m183m943m998m028k313p35n2j95n57q07j121j697k417k971l143k932
54590H6146k562k283k062j667j143r39j277j758j902j819j907k059j700n71Q90
54575F3387J899J873P58p47j532j191o31r94k083k519j590j01P72Q25O01M95N73
54558E9795R11J427J713J491J052Q02O32K31k11k13J80M15L12L76J041K083K950
54541G4987L378L426L213K868K522K252K223K773M083N623O493O486O369O742
54527A33438P125O696N565M539L809K681P71j283k622l232l673m161m401m197
54513A41055l797l630l868m291m436m119l764l966m572m681l805k613k037k086
54499H9390k148k085k194k282j709n63J49j68q31q36j46N22O95M99K68K59N47
$$ y = [123238, 119055, 114112, 109114, 105086, 102773, 102038, 101986, 101791, 101234, 100427, 99306, 97609, 95192, 92221, 89078, 86146, 83584, 81301, 79239, 77572, 76429, 75490, 74213, 72455, 70553, 68734, 66827, 64768, 63068, 62497, 63387, 65286, 67159, 67917, 67170, 65638, 64447, 63816, 62822, 60739, 58220, 56630, 56529, 57301, 58126, 58727, 59222, 59795, 60706, 62133, 63846, 65337, 66389, 67191, 67823, 68054, 67843, 67630, 67810, 68225, 68537, 68913, 69954, 72037, 74987, 78365, 81791, 85004, 87872, 90394, 92646, 94869, 97642, 101725, 107348, 113841, 120327, 126696, 133438, 140563, 147259, 152824, 157363, 161172, 163853, 164624, 163341, 160719, 157487, 153814, 149653, 145252, 141055, 137258, 133628, 129760, 125469, 121033, 116914, 113150, 109184, 104612, 99931, 96126, 93513, 91476, 89390, 87242, 85157, 82963, 80681, 78972, 78409, 78558, 78390, 77559, 76723, 76577, 77099, 77794, 78293, 78561, 78820, 79367]
54482G9367Q34O35l9m91k01M55P77O60N63P92J308J986K559K518J630L91m94q65
54464I2385r67p94k31L61M40N5l02n02q04j133j131r08r91j365j418j006p68j019
54446G9902j124n34K55L69k62r58j218j126j063j323j812j911j067K67Q81L17
54430F9593m78m71J15L96K25R2R9q2l73l25N3K64K57N38J205J588J192M61J78
54411G4527N28J107J521J630J464J299J570K401L219L247K386J353Q57Q81R49
54396I8939R16J122J716K274K301J793R80j53j510k359k008j008p79j769k818
54381I7637k797k083j688j666j366p60n18r04j480j872k062j931j269k89N19J026
54365G8497J396J461R08J13j10L17N22l2q01r79m44L95J117J382J059N42M51P74
$$ y = [79367, 80201, 80836, 80797, 80306, 80105, 80560, 81337, 81997, 82560, 83352, 84660, 86646, 89205, 91723, 93353, 93744, 93250, 92385, 91418, 90624, 90393, 90754, 91194, 91249, 90947, 90445, 89641, 88508, 87377, 86469, 85478, 84113, 82695, 81689, 80921, 79902, 78778, 78244, 78499, 78868, 78606, 77648, 76430, 75304, 74241, 72918, 71106, 69195, 68128, 68395, 69276, 69593, 69115, 68644, 68759, 69155, 69380, 69472, 69571, 69489, 69116, 68791, 68844, 69108, 69365, 69903, 71108, 72696, 73888, 74349, 74527, 75055, 76162, 77683, 79313, 80777, 82076, 83646, 86047, 89266, 92513, 94899, 96252, 97109, 97990, 98939, 99855, 100977, 102693, 104967, 107268, 109061, 110041, 109888, 108378, 106019, 104011, 103003, 102224, 100455, 97637, 94840, 92757, 91069, 89403, 88037, 87277, 86759, 85855, 84375, 82503, 80441, 78510, 77241, 76952, 77471, 78497, 79893, 81354, 82262, 82375, 82265, 82582, 83104, 83072, 82271, 81292, 80848, 81243, 82360, 83742, 84801, 85343, 85794, 86568]
54347H6568R24P51P70J135J223P48L93P04J058O03l40p34l75n8l22q37j108j102
54329I0001j076j191j495j876k089k043j951j956j830j360q61q13j205j587j707
54314F6961j663j636j728j961k083j659o78K35N82O35P92P12j21j297j763j210
54298E4118l56J12K02J31l2n6L79J057J262P51N1l88p44j160j243o61J53N50N11
54279E4637N06P03Q25O27J96j39J0P37J503J518O90j39l09j93m60q76o38K72R18
54260F0388P29L06M44R94J146N95j81o87r23r81o90QO02M71k55p52n44mL54N99
54240F1619R00Q66J11p59o13O19J645J432M08m07p96j179j540j371n83L36J016
54223F1704J503J761J491P10o5m26n65q39j186j250q72j57P23J527J862J435M27
$$ y = [86568, 87492, 88243, 89013, 90148, 91371, 92119, 92512, 93216, 94274, 94877, 94537, 93803, 93428, 93370, 93048, 92211, 91103, 90001, 88925, 87734, 86239, 84363, 82274, 80231, 78280, 76324, 74494, 73134, 72273, 71460, 70255, 68668, 66961, 65298, 63662, 61934, 59973, 57890, 56231, 55553, 55788, 56370, 57005, 57797, 58509, 58388, 57091, 55328, 54118, 53762, 53874, 54076, 54207, 54175, 54119, 54498, 55555, 56817, 57568, 57619, 57231, 56487, 55327, 54084, 53423, 53576, 54126, 54637, 55143, 55846, 56671, 57298, 57494, 57355, 57365, 58102, 59605, 61123, 61813, 61674, 61365, 61172, 60712, 59836, 59198, 59470, 60388, 61117, 61423, 61867, 62861, 64007, 64602, 64421, 63734, 62811, 61830, 61140, 61148, 61750, 62221, 61966, 61214, 60670, 60666, 61020, 61619, 62519, 63385, 63496, 62737, 62124, 62743, 64388, 65820, 66228, 65821, 65025, 63846, 62306, 60935, 60352, 60688, 61704, 63207, 64968, 66459, 67169, 67104, 66678, 66113, 65274, 64088, 62838, 61966, 61809, 62532, 64059, 65921, 67356, 67783]
54206F7783n92j169j219q63k81K31L08j49p98j184j160q50l91J02L34L1n61p40
54188E8832j41P44J115P60J81r3J1K08J54k95q80j065o30n0Q7j45j89O3J41j31
54168E8677k65J24O28N63j53r96j395j108l59J51k27j214j695j108k61k04p90
54151E0368j059p63n58p15o85j74K48R0j95Q8P59J047P29L33K87L96L29J47P8
54132E0750P5j22n41r01r89q71o53k58K82N52J85m38m24M50J255J031O6m92o5
54113D8892P83J228J045N48J10j5K36O24P84O33L95K01nj19J70Q65J462J489J034
54094F0360N34K21L2j60m13o98q56p08k94J52M35N24M06J25o5J00M53N02P2m78
54074F0244p37n99m5Q77J716J782J032K88K71Q20J470K219L092L456K619R98j38
$$ y = [67783, 67191, 66022, 64803, 63940, 63659, 63890, 64198, 64049, 63251, 62067, 60907, 60057, 59666, 59768, 60102, 60133, 59572, 58832, 58691, 59435, 60550, 61310, 61491, 61398, 61409, 61617, 61771, 61476, 60596, 59531, 58901, 58851, 58938, 58793, 58604, 58667, 58808, 58677, 58412, 58536, 59164, 59727, 59574, 58578, 57183, 56075, 55716, 55867, 55640, 54426, 52731, 51623, 51362, 51158, 50368, 49309, 48546, 47988, 47273, 46588, 46414, 46662, 46752, 46557, 46645, 47404, 48451, 49180, 49513, 49800, 50196, 50525, 50672, 50750, 50825, 50703, 50162, 49261, 48272, 47401, 46748, 46490, 46772, 47324, 47509, 47071, 46647, 47097, 48352, 49383, 49449, 48957, 48892, 49675, 50903, 51948, 52496, 52606, 52591, 52827, 53451, 54235, 54868, 55263, 55464, 55459, 55340, 55510, 56375, 57837, 59326, 60360, 60894, 61115, 61147, 60987, 60574, 59876, 59020, 58312, 58018, 58170, 58605, 59129, 59535, 59660, 59595, 59695, 60148, 60650, 60722, 60244, 59507, 58908, 58863, 59740, 61456, 63238, 64270, 64558, 64829, 65649, 67119, 69338, 72430, 75886, 78505, 79503, 79365]
54057G9365j12N76J146J413J575J718J746J565J149O75N01P79J186J345J358J463
54041I7448J452J053P65J470L082M375M492L973L852M327M855N050M912M474L753
54026A49333K973K387K033J932K266L029L758L990L806L506K991J914L23j279
54012A82962k410k811k368j331m51l98r96j510j683j961k618l201l189k725k426
53997A52884k585k919k955k518j881j562j822k300k356j829j222j039j138j001
53983A25757m63N7J03k80o73q34r69j380j944k203j902j219l67O84J783K346J919
53966A20415Q92J41l3p8l47o01n24k41l8K2n1l59q17r90n76J63P77J177J456J488
53946A21876J156Q24J100K049L065L574L563L368L227L176L169L122K972K679
$$ y = [79365, 79253, 79829, 80975, 82388, 83963, 85681, 87427, 88992, 90141, 90816, 91317, 92096, 93282, 94627, 95985, 97448, 98900, 99953, 100718, 102188, 105270, 109645, 114137, 118110, 121962, 126289, 131144, 136194, 141106, 145580, 149333, 152306, 154693, 156726, 158658, 160924, 163953, 167711, 171701, 175507, 179013, 182004, 183918, 184241, 182962, 180552, 177741, 175373, 174042, 173591, 173193, 172197, 170687, 169004, 167043, 164425, 161224, 158035, 155310, 152884, 150299, 147380, 144425, 141907, 140026, 138464, 136642, 134342, 131986, 130157, 128935, 127896, 126758, 125757, 125294, 125351, 125454, 125174, 124501, 123667, 122698, 121318, 119374, 117171, 115269, 114050, 113683, 114367, 116150, 118496, 120415, 121307, 121448, 121415, 121337, 120990, 120389, 119865, 119624, 119586, 119608, 119557, 119198, 118381, 117391, 116815, 116978, 117755, 118932, 120388, 121876, 123032, 123856, 124956, 127005, 130070, 133644, 137207, 140575, 143802, 146978, 150147, 153269, 156241, 158920]
53932A58920K224J661J239J258J613J694J051R9k73K28R78J296J260J482K247
53917A76977L197L783L881L838L963M161M197M214M577N175N281M475L308K636
53903B33663K554K534K344K170J957J390N93J25N7k72j190k119k509k702l256
53888B35339l943m096l739l563l911m403m585m496m439m632n032n268m826l676
53874A74730k606k446l029l422l183k788k780l113l524l945m208l821k568j099
53860A32198m06q08j748k503k767k592k131j583j226j324j850k331k127j130p5
53845A07597J55m46r97q67m24m05q91j324j294r08m41j6L09M25L13J36Q9K29M59
53826A01699O25O11M33J89q7m22o82n43J62J153J912K140J887J399J030J088J545
$$ y = [158920, 161144, 162805, 164044, 165302, 166915, 168609, 169660, 169759, 169486, 169714, 170692, 171988, 173248, 174730, 176977, 180174, 183957, 187838, 191676, 195639, 199800, 203997, 208211, 212788, 217963, 223244, 227719, 231027, 233663, 236217, 238751, 241095, 243265, 245222, 246612, 247205, 247330, 247387, 247115, 245925, 243806, 241297, 238595, 235339, 231396, 227300, 223561, 219998, 216087, 211684, 207099, 202603, 198164, 193532, 188500, 183232, 178406, 174730, 172124, 169678, 166649, 163227, 160044, 157256, 154476, 151363, 147839, 143894, 139686, 135865, 133297, 132198, 131792, 130984, 129236, 126733, 123966, 121374, 119243, 117660, 116434, 115110, 113260, 110929, 108802, 107672, 107597, 107752, 107306, 106309, 105442, 105018, 104613, 103722, 102398, 101104, 100196, 99755, 99739, 100048, 100473, 100786, 100922, 101011, 101240, 101699, 102324, 102935, 103368, 103557, 103470, 103048, 102366, 101823, 101985, 103138, 105050, 107190, 109077, 110476, 111506, 112594, 114139]
53809A14139J939J912J759K107K992L687L623L185L210L877M453M244L513L152
53795A57792L546M066L933L278K971L356L746L404K588K109K171K249K136K231
53781A99576K652K678J678J36q80j088j189j714k323k484k366k578l219l671l457
53766A81751k959k961l623m197l872k714j516r13r32j349j982k518k497j871j289
53751A46558j356j833k034j911k022k457k512j807r91q51j097q43rN49K85k99
53735A27370m21K2N84Q91Q53N65L11M22Q38J038P40L86N46J071J266Q96M91N97
53717A38466J104J503J469J043M32r6k66N3P50J524K075K313K417K640K874K680
53701A60981J935J246J281J839K088J750J470J759K184K039J451J213J701K503
$$ y = [114139, 116078, 117990, 119749, 121856, 124848, 128535, 132158, 135343, 138553, 142430, 146883, 151127, 154640, 157792, 161338, 165404, 169337, 172615, 175586, 178942, 182688, 186092, 188680, 190789, 192960, 195209, 197345, 199576, 202228, 204906, 206584, 206720, 205840, 204752, 203563, 201849, 199526, 197042, 194676, 192098, 188879, 185208, 181751, 178792, 175831, 172208, 168011, 164139, 161425, 159909, 158996, 158064, 156715, 154733, 152215, 149718, 147847, 146558, 145202, 143369, 141335, 139424, 137402, 134945, 132433, 130626, 129635, 128784, 127687, 126844, 126835, 127384, 127669, 127370, 126949, 126971, 127555, 128446, 129299, 129864, 130175, 130597, 131435, 132473, 133213, 133599, 134145, 135216, 136482, 137378, 137869, 138466, 139570, 141073, 142542, 143585, 144017, 143921, 143655, 143708, 144458, 145982, 148057, 150370, 152787, 155427, 158301, 160981, 162916, 164162, 165443, 167282, 169370, 171120, 172590, 174349, 176533, 178572, 180023, 181236, 182937, 185440]
53687A85440L112L515L943M333M342L767K883K228K072K143K015J660J318R46
53673B23717K50n57o81J65J035P73m66j360j051k0P16P55M45L05N72J034J144
53656B26776N34m51r38n03K57K76q57k368k901j766K76J658J576P27K33L01L57
53639B23187J34j08l04n92o25K55J842K939K840K128J568R70n2r20o68O18J856
53622B35068K373K444K499K547K530K607K904L372L941M453M515L912L108K885
53608B79158L414M151M640M918N088N083M990N090N413N693N878O132O266N734
53594C51648M592L729L750M103L908L240L011L676M718N320N117M240L021J837
53580D05910R50L77K3o4K48Q39J249J089M67q5j71Q4K72K81L64O06O29J62m34
$$ y = [185440, 188552, 192067, 196010, 200343, 204685, 208452, 211335, 213563, 215635, 217778, 219793, 221453, 222771, 223717, 223967, 223410, 222729, 222894, 223929, 224702, 224236, 222876, 221825, 221805, 222521, 223276, 223721, 224026, 224598, 225632, 226776, 227310, 226859, 225921, 225418, 225675, 225951, 225094, 222726, 219825, 218059, 218335, 219993, 221569, 222296, 222529, 222830, 223187, 223321, 223213, 222909, 222317, 221692, 221947, 223789, 226728, 229568, 231696, 233264, 234234, 234182, 233262, 232594, 233212, 235068, 237441, 239885, 242384, 244931, 247461, 250068, 252972, 256344, 260285, 264738, 269253, 273165, 276273, 279158, 282572, 286723, 291363, 296281, 301369, 306452, 311442, 316532, 321945, 327638, 333516, 339648, 345914, 351648, 356240, 359969, 363719, 367822, 371730, 374970, 377981, 381657, 386375, 391695, 396812, 401052, 404073, 405910, 406860, 407237, 407260, 407196, 407444, 408283, 409532, 410621, 411088, 411003, 410832, 410916, 411188, 411469, 411833, 412439, 413068, 413230, 412796]
53561D12796o40n64p08j056j096p55n89p77p34j13M49K50l38l22N45J528J834
53544D09710J302L13m16k14R22K121K677K959L708M680M879M101L373L589M492
53529D48196N317N759N923N956O181P095Q623R871J0167J0024J0466J1598J2585
53516E57761J2962J3264J4176J5539J6588J6897J6838J7162J8280J9883K1283
53505G40633K2123K2742K3648K4743K5434K5533K5675K6558K7997K9183K9760
53494A024029L0177L0846L1420L1347L0760L0356L0413L0507L0319L0119L0196
53483A360489L0335L0324L0540L1386L2355L2370L1103K9415K8275K7702K7052
53472A691346K5960K4678K3631K2906K2172K1003J9267J7250J5327J3567J1826
$$ y = [412796, 412156, 411592, 410884, 409828, 408732, 407977, 407388, 406611, 405877, 405764, 406213, 406463, 406125, 405803, 406348, 407876, 409710, 411012, 411325, 410909, 410695, 411617, 413738, 416415, 419374, 423082, 427762, 432641, 436742, 440115, 443704, 448196, 453513, 459272, 465195, 471151, 477332, 484427, 493050, 502921, 513088, 523112, 533578, 545176, 557761, 570723, 583987, 598163, 613702, 630290, 647187, 664025, 681187, 699467, 719350, 740633, 762756, 785498, 809146, 833889, 859323, 884856, 910531, 937089, 965086, 994269, 1024029, 1054206, 1085052, 1116472, 1147819, 1178579, 1208935, 1239348, 1269855, 1300174, 1330293, 1360489, 1390824, 1421148, 1451688, 1483074, 1515429, 1547799, 1578902, 1608317, 1636592, 1664294, 1691346, 1717306, 1741984, 1765615, 1788521, 1810693, 1831696, 1850963, 1868213, 1883540, 1897107, 1908933]
53461A908933R985P937N577L106J129r6j277l402o452r483j1982j4278j6479j7980
53447A855238j8568j9148k0665k2775k4452k5492k6501k7659k8407k8416k8114
53436A585041k8025k8153k8235k8076k7516k6421k4971k3595k2415k1094j9292
53425A307248j7114j4928j3009j1392r923q382o675m866k973q77J346L272M755
53412A226482O435R066J2380J5257J7086J8424K0076K2069K3951K5616K7369K9382
53400A453593L1489L3511L5438L7353L9327M1373M3374M5159M6772M8511N0580
53389A906480N2832N4998N7067N9187O1275O2998O4181O5047O5948O6909O7677
53378B584599O8123O8410O8514O7919O6101O3342O0510N8020N5472N2516M9439
$$ y = [1908933, 1918918, 1926855, 1932432, 1935538, 1936667, 1936571, 1935294, 1931892, 1925440, 1915957, 1903975, 1889697, 1873218, 1855238, 1836670, 1817522, 1796857, 1774082, 1749630, 1724138, 1697637, 1669978, 1641571, 1613155, 1585041, 1557016, 1528863, 1500628, 1472552, 1445036, 1418615, 1393644, 1370049, 1347634, 1326540, 1307248, 1290134, 1275206, 1262197, 1250805, 1240882, 1232500, 1225825, 1220959, 1217986, 1217109, 1218455, 1221727, 1226482, 1232917, 1241983, 1254363, 1269620, 1286706, 1305130, 1325206, 1347275, 1371226, 1396842, 1424211, 1453593, 1485082, 1518593, 1554031, 1591384, 1630711, 1672084, 1715458, 1760617, 1807389, 1855900, 1906480, 1959312, 2014310, 2071377, 2130564, 2191839, 2254837, 2319018, 2384065, 2450013, 2516922, 2584599, 2652722, 2721132, 2789646, 2857565, 2923666, 2987008, 3047518, 3105538, 3161010, 3213526, 3262965]
53367C262965M6423M2858L8141L2844K8173K4382K0593J6218J1612P073K092l833
53355C529541j0260j6310k1768k7151l2991l9366m5898n1842n6495n9869o2782
53344C104809o5912o8954p1024p1669p1195p0272o9508o9233o9351o9392o8963
53333B339336o8049o6802o5360o3931o2715o1478n9554n6562n2850m9023m5451
53322A687561m2391m0106l8438l6720l4515l2089k9785k7385k4655k1980j9833
53311A339664j7995j6028j4088j2542j1082r139o991n418m337k836o67J257K279
53298A242077K967M157N780P206Q304R552J1331J3566J5841J7686J9030K0451
53286A377948K2604K5236K7258K8017K8021K8162K8694K9354K9958L0402L0467
$$ y = [3262965, 3309388, 3352246, 3390387, 3423231, 3451404, 3475786, 3496379, 3512597, 3524209, 3531282, 3533374, 3529541, 3519281, 3502971, 3481203, 3454052, 3421061, 3381695, 3335797, 3283955, 3227460, 3167591, 3104809, 3038897, 2969943, 2898919, 2827250, 2756055, 2685783, 2616275, 2547042, 2477691, 2408299, 2339336, 2271287, 2204485, 2139125, 2075194, 2012479, 1951001, 1891447, 1834885, 1782035, 1733012, 1687561, 1645170, 1605064, 1566626, 1529906, 1495391, 1463302, 1433517, 1406132, 1381477, 1359497, 1339664, 1321669, 1305641, 1291553, 1279011, 1267929, 1258790, 1251799, 1246381, 1242044, 1239208, 1238541, 1239798, 1242077, 1245044, 1249201, 1254981, 1262187, 1270491, 1280043, 1291374, 1304940, 1320781, 1338467, 1357497, 1377948, 1400552, 1425788, 1453046, 1481063, 1509084, 1537246, 1565940, 1595294, 1625252, 1655654, 1686121]
53275A686121L0071K9473K8822K7802K6120K4005K1841J9611J7175J4867J3140
53264A939048J1835J0279Q134N620K953M9l183o579r883j2871j5363j7434j9585
53251A893020k2323k5489k8408l0727l2776l4967l7169l8966m0174m0828m0827
53240A520366m0049l8829l7965l7935l8257l8005l6942l5779l5128l4663l3734
53229A113080l2499l1679l1334l0657k9244k7733k6654k5444k3411k1148j9947
53218H13330j9915j9728j8438j6612j5312j4661j4041j3171j2352j1838j1521
53207F45741j1211j0836j0336r713r181q980r037q966q539p969p649p717p931
53194E27676p966p784p672p832q060q018p866q255r437j0631j0699r454p883p012
$$ y = [1686121, 1716192, 1745665, 1774487, 1802289, 1828409, 1852414, 1874255, 1893866, 1911041, 1925908, 1939048, 1950883, 1961162, 1969296, 1974916, 1977869, 1977918, 1974735, 1968156, 1958273, 1945402, 1930039, 1912605, 1893020, 1870697, 1845208, 1816800, 1786073, 1753297, 1718330, 1681161, 1642195, 1602021, 1561193, 1520366, 1480317, 1441488, 1403523, 1365588, 1327331, 1289326, 1252384, 1216605, 1181477, 1146814, 1113080, 1080581, 1048902, 1017568, 986911, 957667, 929934, 903280, 877836, 854425, 833277, 813330, 793415, 773687, 755249, 738637, 723325, 708664, 694623, 681452, 669100, 657262, 645741, 634530, 623694, 613358, 603645, 594464, 585484, 576447, 567481, 558942, 550973, 543324, 535607, 527676, 519710, 511926, 504254, 496422, 488362, 480344, 472478, 464223, 454786, 444155, 433456, 424002, 416119, 409107]
53180D09107o892o925o837o861p075p114o650n894n351n222n263n135m806m536
53166C24546m621n039n375n184m456l637l155l090l281l538l585l151k401j961
53152B72072k249k950l485l764m001m053l557k647j926j662j596j635j998k475
53138B34074k330j384n36o35j390j949k089k109j961j385o75m23o08p09p12j144
53122B14035j956k314j799j126j128j671k056k046j866j631j309j103j221j397
53108A91412j189p05o14j264k232k796k647k039j488j351j534j532r79j28L74
53093A71288K67p8k01j02q3k62m82n29k39M82J453K086J821Q00j49l83r0J4m88
53074A75125j409k243k517j990r01j8n3r31j877k300k262k084j839j563j563k096
$$ y = [409107, 402215, 395290, 388453, 381592, 374517, 367403, 360753, 354859, 349508, 344286, 339023, 333888, 329082, 324546, 319925, 314886, 309511, 304327, 299871, 296234, 293079, 289989, 286708, 283170, 279585, 276434, 274033, 272072, 269823, 266873, 263388, 259624, 255623, 251570, 248013, 245366, 243440, 241778, 240182, 238547, 236549, 234074, 231744, 230360, 229824, 229189, 227799, 225850, 223761, 221652, 219691, 218306, 217631, 217208, 216600, 215891, 215179, 214035, 212079, 209765, 207966, 206840, 205712, 204041, 201985, 199939, 198073, 196442, 195133, 194030, 192809, 191412, 190223, 189518, 188904, 187640, 185408, 182612, 179965, 177926, 176438, 175087, 173553, 172021, 171042, 170914, 171288, 171555, 171477, 171276, 171174, 171091, 170829, 170347, 169818, 169579, 170061, 171514, 173600, 175421, 176221, 176072, 175689, 175599, 175613, 175125, 173716, 171473, 168956, 166966, 166065, 166047, 165994, 165063, 163186, 160886, 158624, 156540, 154701, 153138, 151575, 149479]
53058A49479k875l283l020k291j450p68n05q11j504k120k296k012j470r20n57
53043A23597m30m53o04r36j357j518j258r41j075j672k274k484k184j355j42R64
53027A05878J393J005J40q28j652k084k017j684j365r96m69j73n51j255j438r35
53011I2969m01j58J89P47Q75K97k05K9M18N4q08j141o33O6M63N86M37n7n07l56
52991I2864K29N69N55P66J310J507R93L00j5j06j92m5L86M69j98r14p02L34J233
52972I9343J473J302J007N90K18K20N49P91Q44J045J502J841J816J645J509J191
52956A16886N05k28m77r4O13J202J329R74O44J023K125L046K914J956J243J452
52940A35113K222K711K482J754J053P91J027J508J886J922J548Q68J91r3J50O58
$$ y = [149479, 146604, 143321, 140301, 138010, 136560, 135792, 135287, 134476, 132972, 130852, 128556, 126544, 125074, 124154, 123597, 123167, 122714, 122110, 121174, 119817, 118299, 117041, 116100, 115025, 113353, 111079, 108595, 106411, 105056, 104914, 105878, 107271, 108276, 108416, 107588, 105936, 103852, 101835, 100151, 98786, 97790, 97321, 97148, 96597, 95342, 93904, 92969, 92568, 92410, 92599, 93346, 94221, 94518, 94313, 94342, 94760, 94814, 94006, 92865, 92232, 92298, 92761, 93347, 93784, 93727, 93220, 92864, 93093, 93662, 94217, 94983, 96293, 97800, 98793, 99093, 99078, 98972, 98780, 98735, 99121, 99590, 99392, 98478, 97776, 98110, 99343, 100816, 102118, 103125, 103715, 103933, 104153, 104702, 105493, 106337, 107382, 108884, 110725, 112541, 114186, 115695, 116886, 117391, 117163, 116686, 116592, 117205, 118407, 119736, 120710, 121354, 122377, 124502, 127548, 130462, 132418, 133661, 135113, 137335, 140046, 142528, 144282, 145335, 146126, 147153, 148661, 150547, 152469, 154017, 154885, 155076, 154983, 155133, 155791]
52924A55791J000R27M53k03o56n82n8M33M93J13n86j557k486k726k018r69l07
52907A47062M2N08Q65M92m49j081j140j263j615j402l09N22q8j583k354j694k27
52890A36286J275K392K583J475k59j209q58j37m9m50n72j64M13P74P40K74l98
52873A42116q08o94k94pNk03m73n93m18j29K7J94O36J057Q27N6l13J65P25N69
52853A42445J57M76J474K007J334m5j038r80k1J063J396P67j74o56n98l98j87
52836A47022J89O13O81L22n0p6J87M77N54L25JL7N25Q39L56n81j029p54n08q36
52816A48294j285j125l79L02M82K55j11m89q91j288j474j133k63N19M38n29j554
52799A39769j844j445r95r74j344j735j825j628j451j487j548j428j347j664k271
$$ y = [155791, 156791, 157718, 158171, 157968, 157312, 156730, 156672, 157105, 157598, 157711, 157125, 155568, 153082, 150356, 148338, 147369, 147062, 147104, 147612, 148477, 148969, 148520, 147439, 146299, 145036, 143421, 142019, 141710, 142232, 142144, 140561, 138207, 136513, 136286, 137561, 139953, 142536, 144011, 143752, 142543, 141685, 141548, 141499, 141049, 140477, 140313, 140726, 141500, 142240, 142514, 142116, 141308, 140614, 140320, 140313, 140318, 140115, 139642, 139049, 138631, 138502, 138529, 138723, 139359, 140416, 141243, 141299, 140986, 141151, 141876, 142445, 142602, 143078, 144552, 146559, 147893, 147848, 146810, 145830, 145809, 146872, 148268, 149035, 148861, 148205, 147607, 147209, 147022, 147211, 147824, 148505, 148827, 148777, 148701, 148888, 149365, 149919, 150244, 150245, 150282, 150807, 151646, 152002, 151421, 150392, 149638, 149130, 148294, 147009, 145884, 145505, 145807, 146289, 146544, 146433, 145944, 145053, 143765, 142291, 141158, 140895, 141414, 141852, 141323, 139769, 137925, 136480, 135485, 134511, 133167, 131432, 129607, 127979, 126528, 125041, 123493, 122065, 120718, 119054, 116783]
52784A16783k722k947l170l186k387q21N03P90L57r9n30j199j802j773j252r69
52768I5576j189j417j250q73n91l82j12J68K64Mp21j721k384k189j399q73j045
52751G9866j453j461j025n81m19m84n55l92Q1O00P12K28n78j269j533j134k9J211
52733G1785J582O71o37j003j08J080J528J173O19K12k49r83j777k133j794j019
52717F8947l12O7J92J79Ok27j90L13R53J167Q26L06q8m31q86j370j641j562j111
52698F5138l77L48P46Q42R86J276J337Q74K21o3R7L87O60R88J165Q07lo38o44
52679G4147j63N02J243J894K027J393L62l95n03J4R42J926K539K583K182J472
52663I2165N17l48m88K65J213J571J306P92N2r67j700j459n35O6J1m2L00N68L86
$$ y = [116783, 114061, 111114, 107944, 104758, 102371, 101550, 102053, 102843, 103200, 103101, 102571, 101372, 99570, 97797, 96545, 95576, 94387, 92970, 91720, 90847, 90256, 89874, 89762, 89930, 90194, 90198, 89477, 87756, 85372, 83183, 81784, 80911, 79866, 78413, 76952, 75927, 75346, 74927, 74443, 73888, 73496, 73577, 74177, 74889, 75117, 74539, 73270, 71737, 70603, 70574, 71785, 73367, 74038, 73401, 72398, 72290, 73370, 74898, 76071, 76690, 76902, 76653, 75670, 73893, 71760, 69966, 68947, 68635, 68702, 68894, 69073, 69079, 68852, 68662, 68975, 69928, 71095, 71921, 72227, 72139, 71708, 70822, 69452, 67811, 66249, 65138, 64761, 65109, 65855, 66697, 67683, 68959, 70296, 71170, 71391, 71328, 71425, 71812, 72472, 73460, 74625, 75432, 75429, 74791, 74147, 73984, 74486, 75729, 77623, 79650, 81043, 81405, 81010, 80507, 80521, 81463, 83389, 85928, 88511, 90693, 92165, 92682, 92334, 91846, 92111, 93324, 94895, 96201, 96993, 97045, 96078, 94378, 92919, 92384, 92450, 92461, 92419, 92719, 93287, 93673]
52644I3673J86M03O82N60L30M48N38j01j280k056k022j616j113k34R76J651J090
52627I2115k15j102j081o74n28o97q59q64p74n94k22K69N47L81j2j97m4J55J44
52608H5748M5R7K90M35M40L95M30O14Q87R67O18M6j24L77J039J192Q80O97R17
52589I5990J238J375J438J571J649J524J269J049R18Q68Q43O87L58J85N36J134
52573A12632J235O66J88M58J081J216Q16N78Q56J238J301J178J202J381J507J466
52557A28999J280J043J005J396K006K230J725P66j84r67j527j550p99L37J077
52542A36837J056N79J05j81k79k20q1J01M30Q79R76L02p15r82n0J259J861J635
52524A43512J180P97K61m78j078j272j117p47l33k45p45j420j440n82M39Q58O87
$$ y = [93673, 93859, 94262, 94944, 95504, 95834, 96282, 96820, 96719, 95439, 93383, 91361, 89745, 88632, 88398, 89374, 91025, 92115, 91900, 90798, 89717, 89043, 88515, 87818, 86959, 86095, 85321, 84727, 84505, 84774, 85321, 85702, 85690, 85493, 85449, 85604, 85748, 85793, 85890, 86180, 86615, 87055, 87450, 87880, 88494, 89381, 90348, 90966, 91012, 90888, 91265, 92304, 93496, 94376, 95073, 95990, 97228, 98603, 100041, 101612, 103261, 104785, 106054, 107103, 108021, 108889, 109732, 110419, 110777, 110962, 111498, 112632, 113867, 114533, 114721, 115179, 116260, 117476, 118292, 118870, 119726, 120964, 122265, 123443, 124645, 126026, 127533, 128999, 130279, 131322, 132327, 133723, 135729, 137959, 139684, 140450, 140266, 139299, 137772, 136222, 135423, 135760, 136837, 137893, 138472, 138577, 138396, 138117, 137897, 137816, 137917, 138347, 139226, 140202, 140504, 139789, 138807, 138757, 140016, 141877, 143512, 144692, 145489, 145750, 145272, 144194, 142922, 141805, 141058, 140725, 140480, 139735, 138315, 136875, 136293, 136732, 137590, 138277]
52507A38277M21L50N03Q67J304J454J089M93J05OjK0J09J27q4l04q5O22J300J350
52487A47923O34m66j311j418q71k08K84R56K122L183L095J752K77k91j17m4l97
52470A55103q52j105j138r34n38l22o81j332j453p37J55M98M10M22N47L99Q4K05
52452A48731Q59J298R01M1m84m42j79N9K74L49J45p7J09N39N67O2k22L24J232
52433A54086J489Q16o5l04K54J092J558J345O36j06n76p99r51j106j218j189r42
52416A54020n85l87m14k40M58J149R49J1m06L02J042N66n77p83K47J113P70j45
52398A57090n27l48k05n6O37J751K380K026J277J018J337J552J213O76N74R65
52382A71360J319J288J127J155J229J089R87J391K171K596K275J560Q89K54l62
$$ y = [138277, 138698, 139048, 139551, 140418, 141722, 143176, 144265, 144758, 144863, 144869, 144868, 144888, 144997, 145124, 145040, 144736, 144651, 145273, 146573, 147923, 148557, 148091, 146780, 145362, 144491, 144283, 144567, 145523, 147645, 150828, 153923, 155675, 155952, 155661, 155544, 155500, 155103, 154251, 153146, 152008, 151074, 150536, 150214, 149533, 148201, 146748, 146011, 146166, 146664, 147074, 147496, 148043, 148442, 148526, 148731, 149590, 150888, 151789, 151830, 151346, 150904, 150725, 150784, 151058, 151407, 151552, 151475, 151584, 152123, 152690, 152752, 152530, 152854, 154086, 155575, 156391, 156326, 156022, 156276, 157368, 158926, 160271, 160907, 160801, 160225, 159426, 158475, 157369, 156151, 154962, 154020, 153435, 153048, 152634, 152394, 152852, 154001, 154950, 154961, 154555, 154857, 155899, 156465, 155888, 155105, 155352, 156465, 157235, 157090, 156563, 156215, 156010, 155954, 156591, 158342, 160722, 162748, 164025, 165043, 166380, 167932, 169145, 169821, 170395, 171360, 172679, 173967, 175094, 176249, 177478, 178567, 179554, 180945, 183116, 185712, 187987, 189547, 190436, 190690, 190328]
52367A90328n60L2J085J819J882J591J412J495J737J974K050J887J609J496J696
52352B11533J996J979J483Q83P77J321J964K063J638J324J574K184K633K627K193
52337B38172J530R14N89N59O01N44M93O84J143J626J814J623J344J411J881K337
52321B57265K473K596L238M371N407N921N936N553M829M134M099M929O108P044
52307C23903P696Q318R010R717J0420J1014J1283J1189J0987J0820J0575J0279
52295D45211J0265J0672J1146J1396J1582J1863J1919J1464J0847J0653J0871
52284E67889J0982J0655R905Q854P821P369P631P796O909N135L535K584J756O12
52270F59433m24p59n04k24k06l60n91q91j211j488j676j690j450j028n61n7M90
$$ y = [190328, 189768, 189800, 190885, 192704, 194586, 196177, 197589, 199084, 200821, 202795, 204845, 206732, 208341, 209837, 211533, 213529, 215508, 216991, 217874, 218651, 219972, 221936, 223999, 225637, 226961, 228535, 230719, 233352, 235979, 238172, 239702, 240616, 241205, 241764, 242365, 242909, 243402, 244086, 245229, 246855, 248669, 250292, 251636, 253047, 254928, 257265, 259738, 262334, 265572, 269943, 275350, 281271, 287207, 292760, 297589, 301723, 305822, 310751, 316859, 323903, 331599, 339917, 348927, 358644, 369064, 380078, 391361, 402550, 413537, 424357, 434932, 445211, 455476, 466148, 477294, 488690, 500272, 512135, 524054, 535518, 546365, 557018, 567889, 578871, 589526, 599431, 608285, 616106, 623475, 631106, 638902, 645811, 650946, 654481, 657065, 658821, 659433, 659009, 658250, 657746, 657522, 657316, 656956, 656365, 655474, 654263, 652775, 651099, 649409, 647959, 646931, 646370, 646313, 646803]
52253F46803Q79J013J273K097L180L724L619L731M690N992O815P156P633Q488
52239G07093R360R864R795Q997P630O410N991O089N840N046M393M275M137L398
52225G98318K402J832J558Q16o10k050k946l542m329n286o071o617p045p208o853
52210G52369o190n777n774n793n622n628o088o571o437n722n042m728m515m119
52196F74363l651l374l302l247l048k663k230j960j868j617r32r0L60K93J19J18
52180F47271J82K06K36N3q14k228l138k726j565j011j580k567l243l593l749l378
52164F18356k228r00l75q53j565j772j554j426j572j721j684j588j656j889k141
52149E95432k322k453k551k586k506k368k323k447k559k424k108j986k177k284
$$ y = [646803, 647682, 648695, 649968, 652065, 655245, 658969, 662588, 666319, 671009, 677001, 683816, 690972, 698605, 707093, 716453, 726317, 736112, 745109, 752739, 759149, 765140, 771229, 777069, 782115, 786508, 790783, 794920, 798318, 800720, 802552, 804110, 804926, 804316, 802266, 799320, 795778, 791449, 786163, 780092, 773475, 766430, 759222, 752369, 746179, 740402, 734628, 728835, 723213, 717585, 711497, 704926, 698489, 692767, 687725, 682997, 678482, 674363, 670712, 667338, 664036, 660789, 657741, 655078, 652848, 650888, 649020, 647403, 646471, 646381, 646741, 647034, 647153, 647271, 647453, 647659, 647895, 647948, 647134, 644906, 641768, 639042, 637477, 636466, 634886, 632319, 629076, 625483, 621734, 618356, 616128, 615228, 614853, 614000, 612435, 610663, 609109, 607683, 606111, 604390, 602706, 601118, 599462, 597573, 595432, 593110, 590657, 588106, 585520, 583014, 580646, 578323, 575876, 573317, 570893, 568785, 566799, 564622, 562338]
52135E62338j979j638j877k553k808k256j509j303j547j731j728j667j418q55
52121E37469l73m40p23l89P34J946K738L321L963M431M501M470M795N542O546
52106E78531P764R155J0470J1455J2064J2317J2278J2279J2767J3683J4448J4726
52094G21937J4766J4722J4234J3171J2211J2042J2292J1966J0772R333Q236P452
52082H63134O738O027N295M460L482K336R49n06j477j633j499j952l146m419n271
52067H72518n802o156o156n745n302n190n291n216m752l945l008k241j843j667
52053H10204j437j118p87k04R31K264K968K876K762L170L576L259K527K345K983
52038H36319L755M009L776L366K843K102J133P5q16j239j152j000j364k343l546
$$ y = [562338, 560359, 558721, 556844, 554291, 551483, 549227, 547718, 546415, 544868, 543137, 541409, 539742, 538324, 537469, 537096, 536656, 535933, 535544, 536278, 538224, 540962, 544283, 548246, 552677, 557178, 561648, 566443, 571985, 578531, 586295, 595450, 605920, 617375, 629439, 641756, 654034, 666313, 679080, 692763, 707211, 721937, 736703, 751425, 765659, 778830, 791041, 803083, 815375, 827341, 838113, 847446, 855682, 863134, 869872, 875899, 881194, 885654, 889136, 891472, 892421, 891915, 890438, 888805, 887306, 885354, 882208, 877789, 872518, 866716, 860560, 854404, 848659, 843357, 838167, 832876, 827660, 822908, 818963, 815955, 813714, 811871, 810204, 808767, 807649, 806862, 806658, 807589, 809853, 812821, 815697, 818459, 821629, 825205, 828464, 830991, 833336, 836319, 840074, 844083, 847859, 851225, 854068, 856170, 857303, 857378, 856562, 855323, 854171, 853171, 851807, 849464, 845918]
52023H45918m690n792o763p273p276p303p834q606q974q903r066r932j1165j2220
52009G30121j3052j3858j4430j4300j3568j2986j3044j3434j3699j3930j4415
51998E79405j4962j5117j4938j4906j5160j5287j5043j4736j4720j4901j4914
51987D14721j4523j3676j2481j1329j0708j0700j0924j1058j1088j0924j0231
51976B87079q971p702o969o649o315n942n765n639n085l928k531j475j285k253
51962B16570l993n313n107l626k272k047k550k767k437k169k419k812k623j708
51948A74727p35m45q21j222j239j183j575k408l207l581l435k788j823r67o49
51933A48649q62j282j696k025k011j412n13K4%o6K85P59P47J38n97r86r20n74
$$ y = [845918, 841228, 835436, 828673, 821400, 814124, 806821, 798987, 790381, 781407, 772504, 763438, 753506, 742341, 730121, 717069, 703211, 688781, 674481, 660913, 647927, 634883, 621449, 607750, 593820, 579405, 564443, 549326, 534388, 519482, 504322, 489035, 473992, 459256, 444536, 429635, 414721, 400198, 386522, 374041, 362712, 352004, 341304, 330380, 319322, 308234, 297310, 287079, 278108, 270406, 263437, 256788, 250473, 244531, 238766, 233127, 228042, 224114, 221583, 220108, 218823, 216570, 212577, 207264, 202157, 198531, 196259, 194212, 191662, 188895, 186458, 184289, 181870, 179058, 176435, 174727, 173992, 173547, 172726, 171504, 170265, 169082, 167507, 165099, 161892, 158311, 154876, 152088, 150265, 149298, 148649, 147787, 146505, 144809, 142784, 140773, 139361, 138848, 138872, 138872, 138806, 139091, 139850, 140597, 140735, 140138, 139152, 138232, 137658]
51915A37658k05o9k71o66r68j014r07q87j091j411j623j608j345p42J64R09Q38
51898A26762n7r31j115r50j187j847k272k083j448n51M38R24L04j017j802j473
51882A11695p07k62l7L09N79N29M90Q14J190J190J063J288J677J625J060N05L23
51865A23331M85Q71J222J091M25k4M33J321J532Q21rl78n70r25j118o91K25R98
51847A29040J048K62q58j430r61J47J068J475J582J501J126N53Q5j46j28J99O14
51830A35177M38n21j214n72P66J167L28l91j94J10k28o33m47j49l28m58O7O02
51812A33520K51m40k65O29R21K62k19K77J044J011J64o52p13J14J430K490K703
51795A42527K142J356P45M25M99R78J508J694J651J746J897J731J343J328J944
$$ y = [137658, 137453, 137384, 137113, 136447, 135479, 134465, 133558, 132671, 131580, 130169, 128546, 126938, 125593, 124851, 125015, 125924, 126762, 126705, 125774, 124659, 123709, 122522, 120675, 118403, 116320, 114872, 114321, 114759, 115683, 115987, 114970, 113168, 111695, 110988, 110726, 110689, 110998, 111577, 112106, 112596, 113410, 114600, 115790, 116853, 118141, 119818, 121443, 122503, 123008, 123331, 123816, 124687, 125909, 127000, 127425, 127401, 127834, 129155, 130687, 131508, 131499, 131121, 130551, 129626, 128508, 127817, 128042, 129040, 130088, 130350, 129492, 128062, 127101, 127248, 128316, 129791, 131373, 132874, 134000, 134553, 134638, 134492, 134364, 134563, 135177, 135615, 135094, 133880, 133308, 134074, 135241, 135569, 135178, 134984, 135094, 134866, 134233, 133786, 133637, 133309, 132851, 132918, 133520, 133771, 133331, 133066, 133695, 134616, 134878, 134659, 134936, 135980, 136991, 137155, 136503, 135790, 135904, 137334, 139824, 142527, 144669, 146025, 146770, 147195, 147694, 148672, 150180, 151874, 153525, 155271, 157168, 158899, 160242, 161570, 163514]
51780A63514K838L619M158M348M080L601L401L653M117M526M637M054K662J128
51766B14336L37L37N10O19Q93J126P16k44r37j094j343j946k259j968j777k130
51750B05176k244j367j18M59N22R17J563J654J189J087J697K325K403K139J802
51735B19204J265O67O14J354K291K748K638K115J194J86j46N30J534K061K259
51720B40514K726L261K990J694L02k47k7K80K97J08j60m36n68m77l62m41n56m31
51702B48467k22k82l74K12J494K406K117J240J010J578K023J926J978K713L544
51687B69830L655L234L034L159L011K328J507Q42M1j199k604l584l887l779l673
51672B71915l716l752l552l162k887k910k991k756k206j745j682j890k007j867
$$ y = [163514, 166352, 169971, 174129, 178477, 182557, 186158, 189559, 193212, 197329, 201855, 206492, 210546, 213208, 214336, 214673, 215010, 215520, 216139, 217032, 218158, 218874, 218630, 217693, 216599, 215256, 213310, 211051, 209083, 207306, 205176, 202932, 201565, 201447, 201906, 202428, 203345, 204908, 206562, 207751, 208838, 210535, 212860, 215263, 217402, 219204, 220469, 221136, 221750, 223104, 225395, 228143, 230781, 232896, 234090, 234276, 234130, 234660, 236194, 238255, 240514, 243240, 246501, 249491, 251185, 251487, 251240, 251213, 251493, 251790, 251898, 251738, 251302, 250734, 250257, 249895, 249454, 248898, 248467, 248245, 247963, 247589, 247801, 249295, 251701, 253818, 255058, 256068, 257646, 259669, 261595, 263573, 266286, 269830, 273485, 276719, 279753, 282912, 285923, 288251, 289758, 290600, 290641, 289442, 286838, 283254, 279367, 275588, 271915, 268199, 264447, 260895, 257733, 254846, 251936, 248945, 246189, 243983, 242238, 240556, 238666, 236659, 234792]
51658B34792j677j779k242k656k479j708j041j178j988k649k590k067j744j910
51644B07084k296k482k343k044j821j779j869j903j662j105n15l27o86j276j699
51629A83277j861j850j597r47o1O10P79N52J92j37l37l99m42n17m07P5O40Q53
51611A78423Q92J357K155K281J197j63l66Q13K319L197L398L282K958K394J708
51596B05845J145R16J077J446J634J336N74l82j191j447q85J67Q63P43L15L27
51580B12483P36R05N81J33j10j07K29J027J963K393K190J888J791J500O84j54
51564B28132k30M18R15O40o3l71LN09M35k14p17n26Q1L67J7o75j337j825j995
51545B23564j634q32j33n0n10j012j263j475j957k481k349j220J87O46j68j232
$$ y = [234792, 233115, 231336, 229094, 226438, 223959, 222251, 221210, 220032, 218044, 215395, 212805, 210738, 208994, 207084, 204788, 202306, 199963, 197919, 196098, 194319, 192450, 190547, 188885, 187780, 187265, 186938, 186252, 184976, 183277, 181416, 179566, 177969, 177022, 176961, 177571, 178350, 178902, 179094, 178957, 178620, 178221, 177779, 177262, 176855, 176930, 177570, 178423, 179315, 180672, 182827, 185108, 186305, 186142, 185776, 186589, 188908, 192105, 195503, 198785, 201743, 204137, 205845, 206990, 207906, 208983, 210429, 212063, 213399, 213973, 213591, 212400, 210953, 210068, 210235, 211098, 211841, 212156, 212483, 213219, 214124, 214705, 214838, 214728, 214621, 214850, 215877, 217840, 220233, 222423, 224311, 226102, 227602, 228286, 228132, 227902, 228320, 229235, 229875, 229812, 229441, 229444, 229953, 230388, 230174, 229457, 228931, 229012, 229379, 229396, 228721, 227384, 225559, 223564, 221930, 221098, 220965, 220915, 220405, 219393, 218130, 216655, 214698, 212217, 209868, 208648, 208835, 209481, 209313, 208081]
51529B08081j401p33j56j77m67o23o41o14m64k14j11k83n64p83r19r44p59m23
51511A97805j94k42n11q27r29n31L63J250J632J570J430J190N80j84m41O8R38
51494B02967J736K324K572K343J971K055K604K991L005L204L897M492M373L784
51480B44318L330L102K907K889L226L578L526L261L208L240K910K327K095K400
51466B86317K771K794K500J980J134K0r83j531j638j480j186r62j161j968l005
51451B83602l486k993k041j641k153k740k405j286n13p59j482j725j114J7J042
51436B60323J345Q29J95K66Q61J034O05M69J110J733J583J124J033R00J5j209
51420B72216j843j971k323k764k566k012k231l348m199m163l920l955l693k781
$$ y = [208081, 206680, 205947, 205791, 205614, 205147, 204524, 203883, 203269, 202805, 202591, 202480, 202197, 201633, 200850, 199931, 198987, 198228, 197805, 197611, 197369, 196858, 196031, 195102, 194571, 194934, 196184, 197816, 199386, 200816, 202006, 202586, 202402, 201961, 202029, 202967, 204703, 207027, 209599, 211942, 213913, 215968, 218572, 221563, 224568, 227772, 231669, 236161, 240534, 244318, 247648, 250750, 253657, 256546, 259772, 263350, 266876, 270137, 273345, 276585, 279495, 281822, 283917, 286317, 289088, 291882, 294382, 296362, 297496, 297516, 296533, 295002, 293364, 291884, 290698, 289736, 288575, 286607, 283602, 280116, 277123, 275082, 273441, 271288, 268548, 266143, 264857, 264344, 263585, 262103, 260378, 259264, 259281, 260323, 261668, 262497, 262692, 262958, 263819, 264853, 265458, 265927, 267037, 268770, 270353, 271477, 272510, 273410, 273425, 272216, 270373, 268402, 266079, 263315, 260749, 258737, 256506, 253158, 248959, 244796, 240876, 236921, 233228, 230447]
51406B30447j993j987k152j685j065j320k398l278l419l164k863k468j970j584
51392A99101j444j503j693j829j602j114j082j947l004l110k152j139q16r09q69
51377A74888p25q12j143j419j471j362j203j086j148j455j823j856j294l96R3
51362A57788l85j444j966j337k50J12m01p58j33J031J650J288N07P5K45P36J127
51345A57885J229J182J301J633J833J554J033R43J575K340K318J220l33j470j842
51330A72401j795j944k580l315l388k477j272r01j752l047l764l655l163k676
51316A36672k257j937j774j601j129m47j01m71j282j940k147j963j512q80l35
51301A16896k38o21j031j029p55o98r33r11k31O99J104P79J84k52m45k60M81J419
$$ y = [230447, 228454, 226467, 224315, 222630, 221565, 220245, 217847, 214569, 211150, 207986, 205123, 202655, 200685, 199101, 197657, 196154, 194461, 192632, 191030, 189916, 188834, 186887, 183883, 180773, 178621, 177482, 176666, 175757, 174888, 174163, 173351, 172208, 170789, 169318, 167956, 166753, 165667, 164519, 163064, 161241, 159385, 158091, 157695, 157788, 157403, 155959, 153993, 152656, 152406, 152518, 152117, 151359, 151226, 152257, 153907, 155195, 155702, 155777, 156022, 156758, 157885, 159114, 160296, 161597, 163230, 165063, 166617, 167650, 168593, 170168, 172508, 174826, 176046, 175713, 174243, 172401, 170606, 168662, 166082, 162767, 159379, 156902, 155630, 154729, 152977, 149930, 146166, 142511, 139348, 136672, 134415, 132478, 130704, 129103, 127974, 127527, 127426, 126955, 125673, 123733, 121586, 119623, 118111, 117231, 116896, 116658, 116037, 115006, 113977, 113222, 112524, 111591, 110680, 110449, 111148, 112252, 113031, 113215, 112963, 112518, 112258, 112739, 114158]
51283A14158J703J053K78K25O27O45K22J22O93J335J339O87j38p52j112j462k070
51266A17553k749k806j895p16l33p63j037o30j28j98n59n29k4M23M07jm24m41
51248A05150O4O74P68L23l7R2L83L66J43J22M26Q85J320J530J306P83M49N27O57
51229A15931N13L37M82Q49J162J444J742J770J360R31Q80Q92M96L8K26Q81J044
51212A30978M17j46J78J112J756J613P81l29j155j234o72j45r4k04P1O54R16N39
51194A35036j00m25l72l49n88q11p17n25p05j156j225p24l53o98j274j184m33
51177A23397J09j03q04j549k047j951j057O7M76J34N8P68J443J204M87L38P92
51160A21762R32L76k58n01p22j325j856j504k33J027J369P45k18r94j499j750
$$ y = [114158, 115861, 116914, 117192, 117417, 118044, 118689, 118911, 119033, 119726, 121061, 122400, 123087, 122949, 122197, 121085, 119623, 117553, 114804, 111998, 110103, 109387, 109054, 108291, 107254, 106624, 106496, 106298, 105739, 105210, 105186, 105609, 106016, 106015, 105591, 105150, 105214, 105888, 106656, 106979, 106942, 107034, 107417, 107783, 107926, 108048, 108474, 109359, 110679, 112209, 113515, 114298, 114747, 115274, 115931, 116444, 116781, 117263, 118112, 119274, 120718, 122460, 124230, 125590, 126521, 127401, 128293, 128789, 128827, 129053, 129934, 130978, 131395, 131249, 131427, 132539, 134295, 135908, 136689, 136360, 135205, 133971, 133299, 133154, 133060, 132856, 132927, 133581, 134497, 135036, 134936, 134511, 134139, 133790, 133202, 132391, 131674, 131149, 130444, 129288, 128063, 127339, 126986, 126288, 125014, 123830, 123397, 123506, 123403, 122599, 121050, 119003, 117052, 115995, 116062, 116538, 116672, 116730, 117498, 118941, 120145, 120632, 120970, 121762, 122694, 123070, 122812, 122311, 121589, 120264, 118408, 116904, 116671, 117698, 119067, 119812, 119594, 118600, 117101, 115351]
51144A15351j570q84q3L09K48O7j41n59j029j021m56M8J43K74P67J062O12PJ15
51125A13260N34J5j527k699k583j785j059j08J369K473K162R28J95L44M90J29
51109A12138j78P3N95J056J574K094K084J389P42Q36J421J881K076K029J393P9
51093A31282j024q88K87J399J946K291K487K047J100P14J449K377K281J286M72
51078A49506L00K87P4K4N49J498K367K752K450J511L65m08n92l83O0P91J562J726
51060A64439J028J97J85Q64J117L12q72j429j307j183j265j041j94Q52J496J554
51044A64753J103L01l72k68N62J148P68m2k81J35N38P38J126J640J645J029M83
51027A75006L77K74K0L05J445K383J890L11q08o54J23N96O38O89J082J835K681
$$ y = [115351, 113781, 112897, 112814, 113123, 113371, 113438, 113297, 112738, 111709, 110688, 110232, 110280, 110423, 110697, 111464, 112526, 113138, 113145, 113260, 113794, 113809, 112282, 109583, 107000, 105215, 104156, 104048, 105417, 107890, 110052, 110980, 111175, 111519, 112009, 112138, 111960, 112033, 112628, 113684, 115258, 117352, 119436, 120825, 121567, 122403, 123824, 125705, 127781, 129810, 131203, 131282, 130258, 129370, 129657, 131056, 133002, 135293, 137780, 139827, 140927, 141641, 143090, 145467, 147748, 149034, 149506, 149806, 150093, 150167, 150191, 150740, 152238, 154605, 157357, 159807, 161318, 161683, 161275, 160683, 160300, 160360, 161151, 162713, 164439, 165467, 165664, 165849, 166713, 167830, 168142, 167270, 165841, 164534, 163351, 162086, 161045, 160851, 161703, 163199, 164753, 165856, 166157, 165785, 165517, 166079, 167227, 167995, 167953, 167672, 167807, 168345, 169083, 170209, 171849, 173494, 174523, 175006, 175383, 175657, 175677, 175982, 177427, 179810, 181700, 182011, 181203, 180549, 180672, 181268, 181906, 182595, 183677, 185512, 188193]
51010A88193L145K905K187J654J729K233K645K625K352K409L186M340N122N301
50996B30026N373N640N694N218M769N029N799O395O823P657Q902R872J0304J0787
50982C28288J1833J3201J4433J5450J6388J7301J8370J9917K1984K4216K6339
50971E27720K8341L0106L1393L2430L3967L6373L8975M0705M1160M0780M0280
50960I22230M0082L9984L9213L7065L3719L0030K6446K2617J8324J4155J0768
50949A234633P983N226K552N75n79j545k927m684o377p664q452q877r301j0117
50935A190446j1453j3101j4823j6581j8453k0437k2409k4264k6054k7870k9541
50924I65460l0687l1223l1611l2218l2655l2206l0886k9470k8321k6880k4599
$$ y = [188193, 191338, 194243, 196430, 198084, 199813, 202046, 204691, 207316, 209668, 212077, 215263, 219603, 224725, 230026, 235399, 241039, 246733, 251951, 256720, 261749, 267548, 273943, 280766, 288423, 297325, 307197, 317501, 328288, 340121, 353322, 367755, 383205, 399593, 416894, 435264, 455181, 477165, 501381, 527720, 556061, 586167, 617560, 649990, 683957, 720330, 759305, 800010, 841170, 881950, 922230, 962312, 1002296, 1041509, 1078574, 1112293, 1142323, 1168769, 1191386, 1209710, 1223865, 1234633, 1242616, 1247842, 1250394, 1250969, 1250390, 1248845, 1245918, 1241234, 1234857, 1227193, 1218741, 1209864, 1200563, 1190446, 1178993, 1165892, 1151069, 1134488, 1116035, 1095598, 1073189, 1048925, 1022871, 995001, 965460, 934773, 903550, 871939, 839721, 807066, 774860, 743974, 714504, 686183, 659303, 634704]
50913F34704k1846j9449j7707j6335j5010j3523j1662r464p418n915m673l117
50901D88585j255K88J014R58M59o0j27N20J630K657L228L263K860K406K529L420
50885E12375M378M552M060L773M045M334M232M179M767N857O857P526Q071Q694
50871E87700R447J0436J1762J3248J4546J5597J6781J8612K1328K4768K8457L1905
50859H04587L4980L8092M1857M6496N1588N6501O1030O5518P0294P5121P9419
50848A425483Q2951Q6016Q8813R0888R1445R0152Q7288Q3185P7767P0798O2438
50837B337224N3384M4400L5695K6903J7834R144J920l455p542j0806j2906j3484
50825B478311j3203j3217j3809j4365j4701j5565j7586k0505k3924k8116l3457
$$ y = [634704, 612858, 593409, 575702, 559367, 544357, 530834, 519172, 509708, 502290, 496375, 491702, 488585, 487330, 487618, 488632, 489590, 490049, 489989, 489862, 490382, 492012, 494669, 497897, 501160, 504020, 506426, 508955, 512375, 516753, 521305, 525365, 529138, 533183, 537517, 541749, 545928, 550695, 556552, 563409, 570935, 579006, 587700, 597147, 607583, 619345, 632593, 647139, 662736, 679517, 698129, 719457, 744225, 772682, 804587, 839567, 877659, 919516, 966012, 1017600, 1074101, 1135131, 1200649, 1270943, 1346064, 1425483, 1508434, 1594450, 1683263, 1774151, 1865596, 1955748, 2043036, 2126221, 2203988, 2274786, 2337224, 2390608, 2435008, 2470703, 2497606, 2515440, 2524584, 2526504, 2523049, 2515507, 2504701, 2491795, 2478311, 2465108, 2451891, 2438082, 2423717, 2409016, 2393451, 2375865, 2355360, 2331436, 2303320, 2269863]
50814B269863l9442m5033m9823n4292n8874o3320o7014o9508p0714p0858p0303
50803A610682o9158o7024o3484n8809n3813m8903m3744l7962l1840k5899k0209
50792A089837j4546r073m384p87K074M778P461R741J1161J1635J1628J1767J2090
50779A143382J1701R583N939K317P7j018k283m395o751q492r581j0517j1464j2117
50765A106381j2346j2469j2828j3375j3881j4309j4733j4906j4276j2649j0658
50754I59951r157q198o960m845k223K89K856O138J0128J4011J7279K0408K4112
50741A023789K8439L2954L7383M1715M5927M9972N3825N7246N9760O1195O1957
50730A554162O2417O2283O0914N8033N3767M8296M1924L5200K8421K1193J3114
$$ y = [2269863, 2230421, 2185388, 2135565, 2081273, 2022399, 1959079, 1892065, 1822557, 1751843, 1680985, 1610682, 1541524, 1474500, 1411016, 1352207, 1298394, 1249491, 1205747, 1167785, 1135945, 1110046, 1089837, 1075291, 1066218, 1061834, 1061047, 1063121, 1067899, 1075360, 1085101, 1096262, 1107897, 1119525, 1131292, 1143382, 1155083, 1164666, 1170605, 1172922, 1172999, 1171981, 1169698, 1165303, 1158552, 1150060, 1140479, 1129962, 1118498, 1106381, 1094035, 1081566, 1068738, 1055363, 1041482, 1027173, 1012440, 997534, 983258, 970609, 959951, 950794, 942596, 935636, 930791, 928568, 928857, 931713, 937851, 947979, 961990, 979269, 999677, 1023789, 1052228, 1085182, 1122565, 1164280, 1210207, 1260179, 1314004, 1371250, 1431010, 1492205, 1554162, 1616579, 1678862, 1739776, 1797809, 1851576, 1899872, 1941796, 1976996, 2005417, 2026610, 2039724]
50719B039724M731k856r297j5153k0662k5112k7788k8894k9094k8658k7483k5710
50707A803748k3761k2014k0671j9788j9219j8820j8824j9716k1502k3512k5265
50696A570656k7027k9204l1552l3535l5071l6278l6760l5994l4255l2388l0536
50685A208056k7887k3937j9274j4714j0279n540m82M612R789J5270K0807K5882
50673A182303L0500L5183L9955M3900M6052M6388M5661M4564M3406M2299M1139
50662A641350L9381L6351L2023K7259K3033J9576J6419J3202J0161P728N986M669
50650A877138L620K939K647K586K762L492M933O737Q494J0406J2956J6015J8752
50637A973477K0561K1494K1681K0924J9307J7571J6258J4891J2697R904P577O298
$$ y = [2039724, 2044455, 2041599, 2032302, 2017149, 1996487, 1971375, 1943587, 1914693, 1885599, 1856941, 1829458, 1803748, 1779987, 1757973, 1737302, 1717514, 1698295, 1679475, 1660651, 1640935, 1619433, 1595921, 1570656, 1543629, 1514425, 1482873, 1449338, 1414267, 1377989, 1341229, 1305235, 1270980, 1238592, 1208056, 1180169, 1156232, 1136958, 1122244, 1111965, 1106425, 1105943, 1110555, 1120344, 1135614, 1156421, 1182303, 1212803, 1247986, 1287941, 1331841, 1377893, 1424281, 1469942, 1514506, 1557912, 1600211, 1641350, 1680731, 1717082, 1749105, 1776364, 1799397, 1818973, 1835392, 1848594, 1858755, 1866483, 1872469, 1877138, 1880758, 1883697, 1886344, 1888930, 1891692, 1895184, 1900117, 1906854, 1915348, 1925754, 1938710, 1954725, 1973477, 1994038, 2015532, 2037213, 2058137, 2077444, 2095015, 2111273, 2126164, 2138861, 2148765, 2156342, 2162640]
50625B162640N753N635O088P077Q093Q886R836J1277J2910J4319J5522J6532J6883
50612B301451J6072J4238J1888R182N927J994k720q505j5437k2884k9857l5901
50600B245448m1354m6763n2328n7749o2358o5512o7147o7804o7807o6862o4759
50589A585005o2167n9991n8146n5626n1843m7348m3123l9610l6570l3517l0085
50578A066979k6181k1917j7435j2938q922n949l858j750R03L545N557P441J0135
50565I95610J3541J6760J9582K2656K6066K9048L1368L3900L7212M0596M3191
50554A309530M5326M7841N0633N2718N3496N3279N2641N1792N0530M8481M5592
50543A861859M2563M0436L9536L9283L9252L9721M0801M1783M2230M3067M5560
$$ y = [2162640, 2168393, 2174028, 2180116, 2187193, 2195286, 2204172, 2214008, 2225285, 2238195, 2252514, 2268036, 2284568, 2301451, 2317523, 2331761, 2343649, 2352831, 2358758, 2360752, 2358032, 2349527, 2334090, 2311206, 2281349, 2245448, 2204094, 2157331, 2105003, 2047254, 1984896, 1919384, 1852237, 1784433, 1716626, 1649764, 1585005, 1522838, 1462847, 1404701, 1349075, 1297232, 1249884, 1206761, 1167151, 1130581, 1097064, 1066979, 1040798, 1018881, 1001446, 988508, 979586, 973637, 969779, 968029, 968932, 972477, 978034, 985475, 995610, 1009151, 1025911, 1045493, 1068149, 1094215, 1123263, 1154631, 1188531, 1225743, 1266339, 1309530, 1354856, 1402697, 1453330, 1506048, 1559544, 1612823, 1665464, 1717256, 1767786, 1816267, 1861859, 1904422, 1944858, 1984394, 2023677, 2062929, 2102650, 2143451, 2185234, 2227464, 2270531, 2316091]
50532B316091M9520N3506N6761N9859O3344O6758O9444P1530P3406P4718P4563
50521C029500P2493O8856O4072N8074N0607M1856L2482K2976J3209K788q281j9514
50509C429118l0415m0656m9770n7091o2260o5477o7012o6765o4500o0236n4172
50498B810764m6593l8150k9796k2065j4733p628j348L304O161P266O021J720n158
50485B669765j3131k1331l0123l9840m9772n8885o6899p4101q0493q5740q9582
50474B059868r1844r2230r0656q7689q4108q0106p5363o9892o4314n9138n4190
50463A210338m9042m3684l8495l3638k8868k3972j9154j4819j1128p932n030k296
50451I32280M26L353O505R446J1530J2494J2862J3613J5313J7593J9636K1201
$$ y = [2316091, 2365611, 2419117, 2475878, 2535737, 2599081, 2665839, 2735283, 2806813, 2880219, 2954937, 3029500, 3101993, 3170849, 3234921, 3292995, 3343602, 3385458, 3417940, 3440916, 3454125, 3456913, 3448632, 3429118, 3398703, 3358047, 3308277, 3251186, 3188926, 3123449, 3056437, 2989672, 2925172, 2864936, 2810764, 2764171, 2726021, 2696225, 2674160, 2659427, 2651799, 2650451, 2653755, 2659916, 2667182, 2673203, 2674923, 2669765, 2656634, 2635303, 2605180, 2565340, 2515568, 2456683, 2389784, 2315683, 2235190, 2149450, 2059868, 1968024, 1875794, 1785138, 1697449, 1613341, 1533235, 1457872, 1387980, 1323666, 1264528, 1210338, 1161296, 1117612, 1079117, 1045479, 1016611, 992639, 973485, 958666, 947538, 939606, 934576, 932280, 932706, 936059, 942564, 952010, 963540, 976034, 988896, 1002509, 1017822, 1035415, 1055051, 1076252]
50439A076252K2829K4925K7009K8248K8515K8472K8679K9213L0036L1234L2650
50428A388062L3807L4424L4645L4632L4413L4314L4936L6319L7592L7935L7530
50417A778609L7226L7573L8590M0081M1676M2815M3152M2808M1847L9952L6982
50406B221311L3531L0236K6889K2834J7995J2836P440J368n635j3422k1772l0333
50394B303278l8338m5076n0674n5708o0157o3360o5007o5361o4587o2644n9888
50383A672478n6845n3177m7871m0832l3411k6845k0998j5176r492m670j037J546
50371A363670L122L614L111J617j173n397j0459j5471j9955k3832k7026k9565
50359A242256l1724l3647l5079l5845l6236l6475l6202l5031l3270l1514k9791
$$ y = [1076252, 1099081, 1124006, 1151015, 1179263, 1207778, 1236250, 1264929, 1294142, 1324178, 1355412, 1388062, 1421869, 1456293, 1490938, 1525570, 1559983, 1594297, 1629233, 1665552, 1703144, 1741079, 1778609, 1815835, 1853408, 1891998, 1932079, 1973755, 2016570, 2059722, 2102530, 2144377, 2184329, 2221311, 2254842, 2285078, 2311967, 2334801, 2352796, 2365632, 2373072, 2374440, 2368805, 2355383, 2333611, 2303278, 2264940, 2219864, 2169190, 2113482, 2053325, 1989965, 1924958, 1859597, 1795010, 1732366, 1672478, 1615633, 1562456, 1514585, 1473753, 1440342, 1413497, 1392499, 1377323, 1367831, 1363161, 1362124, 1363670, 1366792, 1370406, 1373517, 1375134, 1373961, 1368564, 1358105, 1342634, 1322679, 1298847, 1271821, 1242256, 1210532, 1176885, 1141806, 1105961, 1069725, 1033250, 997048, 962017, 928747, 897233, 867442]
50348H67442k7768k5499k3290k1006j8334j5611j3594j2302j0909q953o920n317
50336F77939l894k221m42J095K531M308O406Q317R655J0535J1334J2312J3428
50323G51303J4369J4889J5255J6059J7395J8476J8489J7737J7372J7950J8770
50312I38064J8839J8097J7246J6681J6218J5679J5209J4763J3867J2219J0184
50301A107066Q317O675N029L437K067N50j756m754p493r348j0828j2785j5220
50288A070957j7347j8650j9361j9961k0610k1157k1456k1522k1524k1675k2017
50277H45677k2289k2095k1252k0005j8816j7942j7134j5880j4073j2240j0939
50266F53012r999q756p013n368m437m138l944l577l185k986k978k933k572j888
$$ y = [867442, 839674, 814175, 790885, 769879, 751545, 735934, 722340, 710038, 699129, 690176, 683256, 677939, 674045, 671824, 671382, 672477, 675008, 679316, 685722, 694039, 703694, 714229, 725563, 737875, 751303, 765672, 780561, 795816, 811875, 829270, 847746, 866235, 883972, 901344, 919294, 938064, 956903, 975000, 992246, 1008927, 1025145, 1040824, 1056033, 1070796, 1084663, 1096882, 1107066, 1115383, 1122058, 1127087, 1130524, 1132591, 1133141, 1131385, 1126631, 1119138, 1109790, 1098962, 1086177, 1070957, 1053610, 1034960, 1015599, 995638, 975028, 953871, 932415, 910893, 889369, 867694, 845677, 823388, 801293, 780041, 760036, 741220, 723278, 706144, 690264, 676191, 663951, 653012, 643013, 634257, 627244, 621876, 617439, 613301, 609357, 605780, 602595, 599609, 596631, 593698, 591126, 589238]
50252E89238j277j168j479j733j706j636j782k171k800l614m161l860k948k450
50238E56453k862l398l216k724k867l476l387k212r85p75j357j740j481r20m35
50223E24618L2O32J179J303R78O75Q95J657K560L280L687L560K651J200j03r29
50207E47875j645k519l072k768k010j779k434l405m036m222m207m256m548n084
50193E01890n619n916n913n546m690l545k696k412k278k026k099k720k998k004
50179D51428l88L26j04m19P5N88L90K9K72Q62J138J131J155R52J61q49j428j591
50161D53728j752j850j543j057j005j427j679j339o45k6L68O78J199K129L153
50146D48932L538L041K356K197K311K102J852K349L476M266M416M666N361N746
$$ y = [589238, 587961, 586793, 585314, 583581, 581875, 580239, 578457, 576286, 573486, 569872, 565711, 561851, 558903, 556453, 553591, 550193, 546977, 544253, 541386, 537910, 534523, 532311, 531326, 530551, 529194, 527454, 525973, 525053, 524618, 524650, 525282, 526461, 527764, 528742, 529417, 530312, 531969, 534529, 537809, 541496, 545056, 547707, 548907, 548804, 547875, 546230, 543711, 540639, 537871, 535861, 534082, 531648, 528243, 524207, 519985, 515778, 511522, 506974, 501890, 496271, 490355, 484442, 478896, 474206, 470661, 467965, 465553, 463275, 461249, 459150, 456430, 453432, 451428, 451040, 451366, 451262, 450843, 450918, 451506, 451896, 451925, 452197, 453059, 454197, 455328, 456483, 457435, 457596, 456747, 455319, 453728, 451976, 450126, 448583, 447526, 446521, 445094, 443415, 442076, 441431, 441405, 441773, 442451, 443650, 445779, 448932, 452470, 455511, 457867, 460064, 462375, 464477, 466329, 468678, 472154, 476420, 480836, 485502, 490863, 496609]
50132D96609N270M695M985N800O040N532N168N439N767N517M845M242L814L401
50118E67124L074L070L396L728L653K952J879J196J551K623L349L241L045L608
50104F07489M618N130N052N215N968O675O863P054P899R206J0399J1429J2599
50091G05596J3905J5212J6721J8576K0356K1674K3055K5302K8222L0883L3200
50080I52702L6187M0420M5186M9535N3305N6595N8910N9584N8575N6301N3004
50069A520304M8868M4327L9812L5382L1031K7025K3541K0327J7109J3939J0647
50058A832312O421O54o077j2589j8510k4445l0727l6748m1656m5204m7698m9484
50046A526249n0685n1267n1208n0694n0003m9061m7402m4811m1759l8828l6009
$$ y = [496609, 501879, 506574, 511559, 517359, 523399, 528931, 534099, 539538, 545305, 550822, 555667, 559909, 563723, 567124, 570198, 573268, 576664, 580392, 584045, 586997, 588876, 590072, 591623, 594246, 597595, 600836, 603881, 607489, 612107, 617237, 622289, 627504, 633472, 640147, 647010, 654064, 661963, 671169, 681568, 692997, 705596, 719501, 734713, 751434, 770010, 790366, 812040, 835095, 860397, 888619, 919502, 952702, 988889, 1029309, 1074495, 1124030, 1177335, 1233930, 1292840, 1352424, 1410999, 1467300, 1520304, 1569172, 1613499, 1653311, 1688693, 1719724, 1746749, 1770290, 1790617, 1807726, 1821665, 1832312, 1838733, 1839387, 1833310, 1820721, 1802211, 1777766, 1747039, 1710291, 1668635, 1623431, 1575733, 1526249, 1475564, 1424297, 1373089, 1322395, 1272392, 1223331, 1175929, 1131118, 1089359, 1050531, 1014522]
50035A014522l3022k9983k7163k4387k1348j8443j6442j5296j4054j2177j0189
50024G92018q722p615o417n252m533m211l858l309k745k227j608r28n91q98j607
50009G37497k114k069j726j622j917k194k011j498j218j525k223k812k852k252
49995G09464j381q00o76n54K2R08J673K268K886L371L406L227L572M777O512Q450
49979G47125J0570J2617J3994J4619J5317J6866J9034K1004K2505K4061K6339
49968I44051K9609L3648L7983M2353M7096N2735N9048O5027P0031P4381P8362
49957A534324Q1233Q1939Q0462P7746P4468P0661O6400O2020N7537N2614M7381
49946B286785M2562L8411L4057K8386K1242J3320N083l672j3221k3301l3221m2400
$$ y = [1014522, 981500, 951517, 924354, 899967, 878619, 860176, 843734, 828438, 814384, 802207, 792018, 783296, 775681, 769264, 764012, 759479, 755268, 751410, 748101, 745356, 743129, 741521, 740593, 740002, 739104, 737497, 735383, 733314, 731588, 729966, 728049, 725855, 723844, 722346, 721128, 719603, 717380, 714568, 711716, 709464, 708083, 707283, 706607, 706053, 706075, 706983, 708656, 710924, 713810, 717181, 720587, 723814, 727386, 732163, 738675, 747125, 757695, 770312, 784306, 798925, 814242, 831108, 850142, 871146, 893651, 917712, 944051, 973660, 1007308, 1045291, 1087644, 1134740, 1187475, 1246523, 1311550, 1381581, 1455962, 1534324, 1615557, 1697496, 1777958, 1855704, 1930172, 2000833, 2067233, 2129253, 2186790, 2239404, 2286785, 2329347, 2367758, 2401815, 2430201, 2451443, 2464763, 2469846, 2466174, 2452953, 2429652, 2396431, 2354031]
49934B354031n0638n7957o4317o9574p3699p6964p9671q1789q2961q2881q1514
49923A552066p8947p5334p1039o6643o2534n8651n4742n0801m7005m3300l9404
49912I03666l5354l1748k9152k7355k5532k3178k0647j8607j7277j6379j5584
49901F42853j4795j4016j3278j2673j2180j1568j0685r791r260q986q456p534
49889E09631o702o362o212n620m376k865j695j383k134l583m819m960l813j895
49875D53212K2J355J898J830J493J156J012J316K176L236L963M280M535M776M717
49860D90977M564N151O698Q101Q289P802Q154R831J1824J3148J3957J4921J6255
49847F19672J7823J9644K1920K4761K8170L2068L6250M0492M4795M9226N3423
$$ y = [2354031, 2303393, 2245436, 2181119, 2111545, 2037846, 1960882, 1881211, 1799422, 1716461, 1633580, 1552066, 1473119, 1397785, 1326746, 1260103, 1197569, 1138918, 1084176, 1033375, 986370, 943070, 903666, 868312, 836564, 807412, 780057, 754525, 731347, 710700, 692093, 674816, 658437, 642853, 628058, 614042, 600764, 588091, 575911, 564343, 553658, 543867, 534607, 525621, 517165, 509631, 502929, 496567, 490355, 484735, 480359, 477494, 475799, 474416, 472282, 468699, 463880, 458920, 455107, 453212, 453234, 454589, 456487, 458317, 459810, 460966, 461978, 463294, 465470, 468706, 472669, 476949, 481484, 486260, 490977, 495541, 500692, 507390, 515491, 523780, 531582, 539736, 549567, 561391, 574539, 588496, 603417, 619672, 637495, 657139, 679059, 703820, 731990, 764058, 800308, 840800, 885595, 934821, 988244]
49836I88244N6564N7968N7561N5705N2861M9379M5346M0599L5164K9584K4537
49825A493512K0284J6834J4323J2547J0321O269M15n821j1555j7432k4281l1601
49813A483815l8163m3498m7907n1471n3944n5504n6632n7235n6650n4684n2020
49802I16107m9358m6683m3593m0004l6282l2857k9920k7308k4645k1821j9269
49791E44367j7490j6312j4971j3076j1099r732r044q550p911p223o669o212n707
49778D10371n126m558l987l301k521j937j871k300k808k918k418j470n15k5j01
49763C74515k94q7M26O40K57l71q02j030j159j006m33K30N55O29Q24J102J072
49746C75068O67L10K75L69L50L02M87J038J852K554K619J928J201J344K308K991
$$ y = [988244, 1044808, 1102776, 1160337, 1216042, 1268903, 1318282, 1363628, 1404227, 1439391, 1468975, 1493512, 1513796, 1530630, 1544953, 1557500, 1567821, 1574090, 1574505, 1568684, 1557129, 1539697, 1515416, 1483815, 1445652, 1402154, 1354247, 1302776, 1248832, 1193328, 1136696, 1079461, 1022811, 968127, 916107, 866749, 820066, 776473, 736469, 700187, 667330, 637410, 610102, 585457, 563636, 544367, 526877, 510565, 495594, 482518, 471419, 461687, 452643, 444093, 436182, 428959, 422290, 416078, 410371, 405245, 400687, 396700, 393399, 390878, 388941, 387070, 384770, 381962, 379044, 376626, 375156, 374641, 374616, 374515, 374221, 374134, 374560, 375200, 375457, 375086, 374284, 373254, 372095, 371089, 370656, 370886, 371441, 372070, 372894, 373996, 375068, 375735, 376045, 376320, 376689, 377039, 377341, 377828, 378866, 380718, 383272, 385891, 387819, 389020, 390364, 392672, 395663]
49730C95663K548J328K67j64p7L56R42J231Q54J03l16j87j3k32o23p35n78n05
49712C99862n78m71jN39P51O49N15M57L63K65M08Q06J027O86L8k68NL99L98P4
49692D05924n6K51P08R43J012J339K087K768K662J653M52q1K85J125J908K326
49676D25306K202J533O66J78L37R08J522K066K478K455J757P66L14P63J510J784
49660D46545J608J653K116K322J671N17k63l26pL90Q14J082R88Q70J365K307K593
49643D66245J686N38L60J001J422J288J146J130O60l97j203j039j77P30J507K249
49627D77146K755K787K516K262J980J472R18P88J319K344L438M118M138L785L632
49612E15398L826L980L980M343N381O447O654O096N682N924O421O663O635O588
$$ y = [395663, 398211, 399539, 399806, 399642, 399565, 399921, 400863, 402094, 402948, 403051, 402735, 402548, 402535, 402303, 401680, 400945, 400367, 399862, 399284, 398813, 398812, 399351, 400102, 400751, 401266, 401723, 402086, 402351, 402759, 403565, 404592, 405278, 405316, 405048, 405053, 405452, 405850, 405924, 405868, 406119, 406827, 407770, 408782, 410121, 412208, 414976, 417638, 419291, 419743, 419662, 419947, 421072, 422980, 425306, 427508, 429041, 429707, 429885, 430222, 431130, 432652, 434718, 437196, 439651, 441408, 442174, 442488, 443251, 444761, 446545, 448153, 449806, 451922, 454244, 455915, 456432, 456169, 455843, 455836, 456226, 457040, 458122, 459110, 459980, 461345, 463652, 466245, 467931, 468469, 468829, 469830, 471252, 472540, 473686, 474816, 475476, 475079, 473876, 472837, 472660, 473390, 474897, 477146, 479901, 482688, 485204, 487466, 489446, 490918, 491836, 492624, 493943, 496287, 499725, 503843, 507981, 511766, 515398, 519224, 523204, 527184, 531527, 536908, 543355, 550009, 556105, 561787, 567711, 574132, 580795, 587430, 594018]
49598E94018O574O554O632O997P664Q389Q838Q922Q999R516J0407J1087J1339
49585G05936J1689J2578J3558J3871J3645J3730J4428J5091J5173J5037J5347
$$ y = [594018, 600592, 607146, 613778, 620775, 628439, 636828, 645666, 654588, 663587, 673103, 683510, 694597, 705936, 717625, 730203, 743761, 757632, 771277, 785007, 799435, 814526, 829699, 844736, 860083]
$$ [...]
##END NTUPLES=NMR SPECTRUM
##END=
