
##TITLE=AC1270_CCJAH12088_6666195_LycgQF4GN3
##JCAMPDX= 6.0         $$ Bruker NMR JCAMP-DX V2.0
##DATA TYPE= NMR SPECTRUM
##DATA CLASS= NTUPLES
##ORIGIN= BRUKER
##OWNER= Administrator
$$ 1.72 TOPSPIN		Version 2.1
$$ 2012-08-13 16:09:17.921 -0500  Administrator@TOPSPIN
$$ Compression mode = diff/dup
##.OBSERVE FREQUENCY= 400.02188249412
##.OBSERVE NUCLEUS= ^1H
##.ACQUISITION MODE= SIMULTANEOUS (DQD)
##.ACQUISITION SCHEME= undefined
##.AVERAGES= 8
##.DIGITISER RES= 22
##SPECTROMETER/DATA SYSTEM= spect
##.PULSE SEQUENCE= zg30
##.SOLVENT NAME= COFFEE_meoh
##.SHIFT REFERENCE= INTERNAL, COFFEE_meoh, 1, 14.98509
##AUDIT TRAIL= $$ (NUMBER, WHEN, WHO, WHERE, PROCESS, VERSION, WHAT)
$$ ##TITLE= Audit trail, TOPSPIN		Version 2.1
$$ ##JCAMPDX= 5.01
$$ ##ORIGIN= Bruker BioSpin GmbH
$$ ##OWNER= Administrator
$$ $$ C:\Bruker\TOPSPIN/data/COFFEE/nmr/AC1270_CCJAH12088_6666195_LycgQF4GN3/10/pdata/1/auditp.txt
$$ ##AUDIT TRAIL=  $$ (NUMBER, WHEN, WHO, WHERE, PROCESS, VERSION, WHAT)
(   1,<2012-08-13 16:09:02.640 -0500>,<Administrator>,<TOPSPIN>,<go>,<TOPSPIN 2.1>,
      <created by zg
	started at 2012-08-13 16:07:53.046 -0500,
	POWCHK enabled, PULCHK disabled,
       configuration hash MD5:
       6B 1B 68 BB D9 2E 58 E2 7F 35 AD 54 07 DF 0E 41
       data hash MD5: 64K
       BD AA E1 FC 1D FF 00 3B F1 86 A9 DD A3 7A 45 76>)
(   2,<2012-08-13 16:09:11.031 -0500>,<Administrator>,<TOPSPIN>,<proc1d>,<TOPSPIN 2.1>,
      <Start of raw data processing
       efp LB = 0 FT_mod = 6 PKNL = 1 PHC0 = 0 PHC1 = 0 SI = 32K 
       data hash MD5: 32K
       95 B7 53 D0 CF 92 17 4C E5 34 8F EF 24 7B 74 A4>)
(   3,<2012-08-13 16:09:11.781 -0500>,<Administrator>,<TOPSPIN>,<proc1d>,<TOPSPIN 2.1>,
      <pk PHC0 = 174.1553 PHC1 = 0 
       data hash MD5: 32K
       30 98 D1 39 C9 09 84 D9 77 B8 3D 37 3D 86 15 FE>)
(   4,<2012-08-13 16:09:12.062 -0500>,<Administrator>,<TOPSPIN>,<proc1d>,<TOPSPIN 2.1>,
      <abs ABSG = 1 
       data hash MD5: 32K
       A5 27 20 86 D7 D9 D5 02 18 16 70 84 0F 13 26 CC>)
(   5,<2012-08-13 16:09:12.203 -0500>,<Administrator>,<TOPSPIN>,<proc1d>,<TOPSPIN 2.1>,
      <abs ABSG = 2 
       data hash MD5: 32K
       33 08 85 62 3D 3E 02 C5 BF 96 19 48 D0 76 F4 B4>)
(   6,<2012-08-13 16:09:12.296 -0500>,<Administrator>,<TOPSPIN>,<proc1d>,<TOPSPIN 2.1>,
      <abs ABSG = 3 
       data hash MD5: 32K
       75 AA 56 A4 5B 66 90 DE 86 61 AA C7 7A DA 54 47>)
(   7,<2012-08-13 16:09:12.375 -0500>,<Administrator>,<TOPSPIN>,<proc1d>,<TOPSPIN 2.1>,
      <abs ABSG = 4 
       data hash MD5: 32K
       64 D8 0F 11 2B DD B8 EC 4C BF E3 7B 2F 4A 4B F5>)
(   8,<2012-08-13 16:09:12.437 -0500>,<Administrator>,<TOPSPIN>,<proc1d>,<TOPSPIN 2.1>,
      <abs ABSG = 5 
       data hash MD5: 32K
       C4 D0 9F 02 8C 9E 03 87 6D 96 B4 41 5C 42 D6 C7>)
$$ ##END=
$$ 
$$ $$ hash MD5
$$ $$ 18 3D 54 D8 8E F6 68 62 CA D8 55 93 BD AB CB A2
##$RELAX= 
##$RELAX= 
##$RELAX= 
##$RELAX= 
##$RELAX= 
##$RELAX= 
##$RELAX= 
$$ Bruker specific parameters
$$ --------------------------
$$ [...]
##$TP= (0..7)
150 150 150 150 150 150 150 150
##$TP07= 0
##$TPNAME0= <>
##$TPNAME1= <>
##$TPNAME2= <>
##$TPNAME3= <>
##$TPNAME4= <>
##$TPNAME5= <>
##$TPNAME6= <>
##$TPNAME7= <>
##$TPOAL= (0..7)
0.5 0.5 0.5 0.5 0.5 0.5 0.5 0.5
##$TPOFFS= (0..7)
0 0 0 0 0 0 0 0
##$TUNHIN= 0
##$TUNHOUT= 0
##$TUNXOUT= 0
##$USERA1= <user>
##$USERA2= <user>
##$USERA3= <user>
##$USERA4= <user>
##$USERA5= <user>
##$V9= 5
##$VALIST= <valist>
##$VCLIST= <CCCCCCCCCCCCCCC>
##$VD= 0
##$VDLIST= <DDDDDDDDDDDDDDD>
##$VPLIST= <PPPPPPPPPPPPPPP>
##$VTLIST= <TTTTTTTTTTTTTTT>
##$WBST= 1024
##$WBSW= 4
##$XGAIN= (0..3)
0 0 0 0
##$XL= 0
##$YL= 0
##$YMAX_a= 457232
##$YMIN_a= -584592
##$ZGOPTNS= <>
##$ZL1= 120
##$ZL2= 120
##$ZL3= 120
##$ZL4= 120
##$ABSF1= 14.98509
##$ABSF2= -5.573092
##$ABSG= 5
##$ABSL= 3
##$ALPHA= 0
##$AQORDER= 0
##$ASSFAC= 0
##$ASSFACI= 0
##$ASSFACX= 0
##$ASSWID= 0
##$AUNMP= <proc_prof1d_extract_pilot.lims>
##$AXLEFT= 0
##$AXNAME= <>
##$AXNUC= <1H>
##$AXRIGHT= 0
##$AXTYPE= 0
##$AXUNIT= <>
##$AZFE= 0.1
##$AZFW= 0.1
##$BCFW= 0
##$BC_mod= 0
##$BYTORDP= 0
##$COROFFS= 0
##$CY= 15
##$DATMOD= 1
##$DC= 0
##$DFILT= <>
##$DTYPP= 0
##$F1P= 0
##$F2P= 0
##$FCOR= 0.5
##$FTSIZE= 32768
##$FT_mod= 6
##$GAMMA= 0
##$GB= 0
##$INTBC= 1
##$INTSCL= 1
##$ISEN= 128
##$LB= 0
##$LEV0= 0
##$LPBIN= 0
##$MAXI= 10000
##$MC2= 0
##$MEAN= 0
##$ME_mod= 0
##$MI= 0
##$NCOEF= 0
##$NC_proc= -8
##$NLEV= 6
##$NOISF1= 0
##$NOISF2= 0
##$NSP= 0
##$NTH_PI= 0
##$NZP= 0
##$OFFSET= 14.98509
##$PC= 1
##$PHC0= 174.1553
##$PHC1= 0
##$PH_mod= 1
##$PKNL= yes
##$PPARMOD= 0
##$PPDIAG= 0
##$PPIPTYP= 0
##$PPMPNUM= 2147483647
##$PPRESOL= 1
##$PSCAL= 4
##$PSIGN= 0
##$PYNMP= <proc.py>
##$REVERSE= no
##$SF= 400.02
##$SI= 32768
##$SIGF1= 0
##$SIGF2= 0
##$SINO= 400
##$SIOLD= 32768
##$SPECTYP= <>
##$SREGLST= <1H.CDCl3>
##$SSB= 0
##$STSI= 32768
##$STSR= 0
##$SW_p= 8223.68421052631
##$SYMM= 0
##$S_DEV= 0
##$TDeff= 65536
##$TDoff= 0
##$TI= <>
##$TILT= no
##$TM1= 0
##$TM2= 0
##$TOPLEV= 0
##$USERP1= <user>
##$USERP2= <user>
##$USERP3= <user>
##$USERP4= <user>
##$USERP5= <user>
##$WDW= 1
##$XDIM= 32768
##$YMAX_p= 478074395
##$YMIN_p= -767852
##$CURPLOT= <Network HP LaserJet P1505>
##$CURPRIN= <$Network HP LaserJet P1505>
##$DFORMAT= <normdp>
##$LAYOUT= <+/1D_H.xwp>
##$LFORMAT= <normlp>
##$PFORMAT= <normpl>
##$SURQMSG= 1
$$ End of Bruker specific parameters
$$ ---------------------------------
##NTUPLES= NMR SPECTRUM
##VAR_NAME=  FREQUENCY,     SPECTRUM/REAL,   SPECTRUM/IMAG
##SYMBOL=    X,             R,               I
##VAR_TYPE=  INDEPENDENT,   DEPENDENT,       DEPENDENT
##VAR_FORM=  AFFN,          ASDF,            ASDF
##VAR_DIM=   32768,         32768,           32768
##UNITS=     HZ,            ARBITRARY UNITS, ARBITRARY UNITS
##FACTOR=    0.250966925370066, 1,           1
##FIRST=     8223.43324360094, -137131,      -151469
##LAST=      0,             -122185,         -6443
##MIN=       0,             -767852,         0
##MAX=       8223.43324360094, 478074395,    0
$$ Real data points
##PAGE= N=1
##DATA TABLE= (X++(R..R)), XYDATA
$$ [...]
19511C71697b47831Q9936G089a01884j04235A02257b18398C7021b30696a08793
$$ 371697 -247831 -157895 7089 -101884 -206119 102257 -218398 37021 -230696 -108793
19500A24431f3832j18391B61552j28958b1493j57112D4461A6122b2837k2368l6821
$$ 124431 -63832 -182223 261552 132594 -21493 -178605 44461 16122 -22837 -45205 -82026
19489h2026A3965g2840l7511j39988g8086I8721a92811A63270h4475A68655m6468
$$ -82026 13965 -72840 -110351 -250339 -78086 98721 -192811 163270 -84475 168655 122187
19478A22187a18145A6658g2134C5169a35456c2024H9887Q27a90492f5438B3478
$$ 122187 -118145 16658 -72134 35169 -135456 -32024 89887 90714 -190492 -65438 23478
19466c3482j76705a5095C12765b52426L1427B34226a20960A59644E1199c69927
$$ -33482 -210187 -15095 312765 -252426 -220999 234226 -120960 159644 51199 -369927
19455c67078B22819L9584b06535d6377G3193D021R3468J6811m0047j9739q628
$$ -367078 222819 262403 -206535 -46377 73193 4021 97489 114300 74253 54514 45886
19444D5886i5429k56189G3696M6378c1759j53877A74560a45548D3635b30209B57254
$$ 45886 -95429 -351618 73696 120074 -31759 -185636 174560 -145548 43635 -230209 257254
19432f8055A43250m878b074k21356C58672c51404P5195j04951P6990K6178A22659
$$ -68055 143250 138372 -2074 -223430 358672 -351404 -276209 -381160 -304170 -277992 122659
19420c74065c6236j78328d9398j59563g4865j08130H247K4995b04435I6111b44017
$$ -374065 -36236 -214564 -49398 -208961 -74865 -182995 8247 33242 -204435 96111 -244017
19408G3434a47036K4237k36962e3953B87154J9112b88282M0564A43789b83314
$$ 73434 -147036 -122799 -359761 -53953 287154 306266 -288282 -247718 143789 -283314
19397b56453j8951e9707k28970L1595A21414a06034C5154a65720B67963b85696
$$ -256453 -275404 -59707 -288677 -257082 121414 -106034 35154 -165720 267963 -285696
19386D1390a15222G1228l0491c39917K8400E6795a97634j73439i5285A14792k6865
$$ 41390 -115222 71228 40737 -339917 -311517 56795 -197634 -371073 -95285 114792 87927
19375H7927A0201c02600J04558l02996a60849g4852q6013M5456J1606B3075i8567
$$ 87927 10201 -302600 -198042 -501038 -160849 -74852 -160865 -115409 -103803 23075 -98567
19363h0487j85367a00043A8100a98849A19895b783j30687G9957c42951L8844I2287
$$ -80487 -265854 -100043 18100 -198849 119895 -2783 -133470 79957 -342951 -304107 92287
19351a65734B17293G7831C1776f3969J7792q4061e1701q5630j3068E2686Q5659
$$ -165734 217293 77831 31776 -63969 -46177 -130238 -51701 -137331 -150399 52686 138345
19340A38345F6701R9345R3703E592K00784d72908G0070a15919K3623A38648b69134
$$ 138345 66701 166046 259749 5592 206376 -472908 70070 -115919 -92296 138648 -269134
19328e64055b5956A38466a56830a7651k54673c089l14095a24186a4187B33854
$$ -564055 -25956 138466 -156830 -17651 -272324 -3089 -317184 -124186 -14187 233854
19317a77709m2776C11024c03111B41655i3256M710A67590c68377B8299b87232
$$ -177709 -220485 311024 -303111 241655 -93256 -88546 167590 -368377 28299 -287232
19306b1544l49608D6584K93444g7846G5858d6186j30768g7953a8569j70038A66392
$$ -21544 -371152 46584 340028 -77846 75858 -46186 -176954 -77953 -18569 -188607 166392
19294b46976P1482F0227c44927A88592q5456j2698B7520J64870a98138O2520c6135
$$ -246976 -175494 60227 -344927 188592 103136 90438 27520 192390 -198138 -135618 -36135
19282b09686A49978o2114M6786o0160Q1252m4809a45632d3709j99010n7304d1414
$$ -209686 149978 87864 134650 74490 155742 110933 -145632 -43709 -242719 -300023 -41414
19270g7162J0506j39137e6880R308l7081D9148a75039l40062a84775A53302a70985
$$ -77162 -66656 -205793 -56880 -47572 -84653 49148 -175039 -515101 -184775 153302 -170985
19258c1526p1639r0057p5122E3411P9160b53833P0413k5332o76c5632A13764c7628
$$ -31526 -103165 -193222 -268344 53411 132571 -253833 -183420 -208752 -209428 -35632 113764 -37628
19245e4255k66217J29531H9140A2013g8436B2865b03068P4088p9405k80592b29468
$$ -54255 -320472 -190941 89140 12013 -78436 22865 -203068 -128980 -208385 -488977 -229468
19233c31097a4142q0545k0549A94468b48711A31203o0769a69989A65560a51149
$$ -331097 -14142 -94687 -115236 194468 -248711 131203 70434 -169989 165560 -151149
19222a52459f2927A9510a18988A30655E8774b36380B60236A3110f4237A34817
$$ -152459 -62927 19510 -118988 130655 58774 -236380 260236 13110 -64237 134817
19211B35041d3019k06071O4052K0835j81271b0472p9506B38939e07076L369b2008
$$ 235041 -43019 -249090 -185038 -164203 -345474 -20472 -99978 238939 -507076 -503707 -22008
19199c1157k29883a21658F8167J01938J73751a90584a2212p9229C4227h5335k24977
$$ -31157 -261040 -121658 68167 170105 343856 -190584 -12212 -91441 34227 -85335 -310312
19188c10312A05670l5005J57968h3767j36738B0611J87044a99851C081K6177J7055
$$ -310312 105670 70665 228633 -83767 -220505 20611 207655 -199851 3081 29258 46313
19177D6313L2983b587k11002a02318c313k02543j01173c0620k24084E5341b24708
$$ 46313 79296 -2587 -213589 -102318 -3313 -205856 -307029 -30620 -254704 55341 -224708
19165C33881b00854M1748N2631j40580k6778n3651k6959B7309K09934E7328a54702
$$ 333881 -200854 -159106 -106475 -247055 -273833 -327484 -354443 27309 237243 57328 -154702
19153A72283F7793i3797D7747D146a17884k84659J7349a81700K0380A24515a58309
$$ 172283 67793 -93797 47747 4146 -117884 -402543 -385194 -181700 -161320 124515 -158309
19141b09493e3610j67307j07765I111J82363a04555B61156H8015B3714a22349
$$ -209493 -53610 -220917 -328682 9111 191474 -104555 261156 88015 23714 -122349
19130b95544A25583n9848j8398d49919f3771A77736a16246e2424n345j53882A2635
$$ -295544 125583 65735 47337 -449919 -63771 177736 -116246 -52424 -57769 -211651 12635
19118d19825a59192g0573E948b16750b9894A85527G7369L7432D6504f2972l10453
$$ -419825 -159192 -70573 5948 -216750 -29894 185527 77369 114801 46504 -62972 -373425
19107c73425a58906P5695k63890C7581a75043C9016J9075J18095P8240f5567C47344
$$ -373425 -158906 -83211 -347101 37581 -175043 39016 58091 176186 254426 -65567 347344
19095b9517j3226k32235A91437a84692h0815A31815b38539f1229K5604r9429b8881
$$ -29517 -42743 -274978 191437 -184692 -80815 131815 -238539 -61229 -35625 -135054 -28881
19083a65758P0248E1420g1739j30482A1091K1332e00295F1669c6693A93989f2991
$$ -165758 -95510 51420 -71739 -202221 11091 32423 -500295 61669 -36693 193989 -62991
19071I3145L04222I5740a90934h2037A05752b60320a08120m72824B63001a11762
$$ 93145 397367 95740 -190934 -82037 105752 -260320 -108120 -580944 263001 -111762
19060B09051a11111J2221B869b77083C589a24622D6141J81289G7501a85613H6719
$$ 209051 -111111 -98890 2869 -277083 3589 -124622 46141 227430 77501 -185613 86719
19048a82143H5178g9013H1453b26062R8168C1916N3460a95911f6190J3925k1973
$$ -182143 85178 -79013 81453 -226062 -127894 31916 85376 -195911 -66190 -52265 -74238
19037g4238j50219c326q6488A69927a97397d99A3545J71807a09840j91813B20874
$$ -74238 -224457 -3326 -89814 169927 -197397 -499 13545 185352 -109840 -301653 220874
19025a60570j08030B23928a42098A63576C4934A4008a71294k8665A01728b28134
$$ -160570 -268600 223928 -142098 163576 34934 14008 -171294 -199959 101728 -228134
19014a27549p257D8932b40161d4580m23025a85812J510C0708h2078j82778E01452
$$ -127549 -134806 48932 -240161 -44580 -467605 -185812 -184302 30708 -82078 -264856 501452
19002h9363j32748M7679A02210d15681e7945l80028b01124R3731C68118F9419
$$ -89363 -222111 -174432 102210 -415681 -57945 -437973 -201124 -107393 368118 69419
18991B09688f4171I0536b09958q3338D5069O1531c55260A63863c10114A12806
$$ 209688 -64171 90536 -209958 -293296 45069 106600 -355260 163863 -310114 112806
18980d18876h050B7194c18548e9530A05525j5629e8249k89875B03230I0789L18493
$$ -418876 -8050 27194 -318548 -59530 105525 89896 -58249 -348124 203230 90789 409282
18969D09282o7210F8294J962K38433a15911A57201g2953C3092J19350l6095J61242
$$ 409282 342072 68294 70256 308689 -115911 157201 -72953 33092 152442 116347 277589
18958B77589c7161k10587D3014m60b161l72120H6000J14390H3277b34539G4125
$$ 277589 -37161 -247748 43014 42554 -2161 -374281 86000 200390 83277 -234539 74125
18946A69720d8884H2920a06680A72891d3526a8588E0768i0547l6422K2263k8518
$$ 169720 -48884 82920 -106680 172891 -43526 -18588 50768 -90547 -126969 -104706 -133224
18935a33224K477j19032A96340D1036a33691E7433c64502A51338a9441l00532
$$ -133224 -130747 -249779 196340 41036 -133691 57433 -364502 151338 -19441 -319973
18925c19973A9366L08815K9426A67288a02280k16662d9689F1978c383B8215b52465
$$ -319973 19366 328181 357607 167288 -102280 -318942 -49689 61978 -3383 28215 -252465
18913A33605a49942L0422a5374A43301o8813K91400O8715J52427B19004a44468
$$ 133605 -149942 -119520 -15374 143301 74488 365888 434603 587030 219004 -144468
18902a44002n3975A64991b49932G4134a43290B8973c4394M792E890a7141j61927
$$ -144002 -197977 164991 -249932 74134 -143290 28973 -34394 -29602 5890 -17141 -179068
18891a79068a4406l02754N5555g7170B86950C0058a46913a705j21705B02327K4076
$$ -179068 -14406 -317160 -261605 -77170 286950 30058 -146913 -1705 -123410 202327 226403
18880B26403A8147K8767c574m7743j11728K3820G5979J29907a90022g5105j32166
$$ 226403 18147 46914 -3574 -51317 -163045 -139225 75979 205886 -190022 -75105 -207271
18869b07271A27368c91237h9261M1844p4333O800H791N9721K68609a67810k43736
$$ -207271 127368 -391237 -89261 -47417 -121750 -114950 8791 68512 337121 -167810 -411546
18858d11546a37100A2031a75933f1839q9790d2754k35232i4216A2344i7056r7430
$$ -411546 -137100 12031 -175933 -61839 -151629 -42754 -277986 -94216 12344 -97056 -194486
18847a94486B46447c5732g363A22701a99100A10741L6007d31571a89729A12188
$$ -194486 246447 -35732 -7363 122701 -199100 110741 146748 -431571 -189729 112188
18836b85475D3722a25733c6477k00374f8077m56799b5938C44290A45419O5116
$$ -285475 43722 -125733 -36477 -236851 -68077 -524876 -25938 344290 145419 210535
18826B10535a83523K2777A15665C01a47932D4890r553L16492I7600C0790a99265
$$ 210535 -183523 -160746 115665 301 -147932 44890 35337 351829 97600 30790 -199265
18814C23954a75552j04797c27o7087I4620O8120J38369q2491a92030A08793b8103
$$ 323954 -175552 -280349 -327 -67414 94620 162740 301109 218618 -192030 108793 -28103
18802g3811A136c82479J81767Q3104N3374I1767c13653B7313M7709a37851A31513
$$ -73811 1136 -382479 -200712 -117608 -64234 91767 -313653 27313 75022 -137851 131513
18790a13033k14560J03675e037j7022j06571j90170a17009m4904g3597k58999
$$ -113033 -327593 -223918 -5037 -22059 -128630 -318800 -117009 -161913 -73597 -332596
18780c32596A8925Q6343a92287F7186k9782b84778C90528b15751j6503G3409R148
$$ -332596 18925 105268 -192287 67186 37404 -284778 390528 -215751 -232254 73409 82557
18769H2557A3154b74105J31187e2046F8719D935K04631j02891a8727j85661m6119
$$ 82557 13154 -274105 -142918 -52046 68719 4935 209566 106675 -18727 -204388 -250507
18758b50507j45778a17122E4905b03532A38865P3104b81878D5912R0935a92902
$$ -250507 -396285 -117122 54905 -203532 138865 211969 -281878 45912 136847 -192902
18747g5265l7309Q690H9920a23646m6883B21906B4027a89166P1606H3738P9212
$$ -75265 -112574 -103884 89920 -123646 -170529 221906 24027 -189166 -117560 83738 162950
18736A62950e982C5189a58041C5165c38836g3370K9198k15676C59664A5105e2094
$$ 162950 -5982 35189 -158041 35165 -338836 -73370 -44172 -259848 359664 15105 -52094
18724F2210a73211A10885l3387a72073k3997A68723d2928j72209R5220A1240L6024
$$ 62210 -173211 110885 77498 -172073 -196070 168723 -42928 -215137 -119917 11240 47264
18713D7264G641N3532c16359J6375a02275L199H4698a59009p5902h1501j25607
$$ 47264 7641 61173 -316359 -299984 -102275 -99076 84698 -159009 -234911 -81501 -207108
18702b07108R2402R39J5849C91630A18112c30681J23671d9978A11496b4671B66480
$$ -207108 -114706 -113767 -97918 391630 118112 -330681 -207010 -49978 111496 -24671 266480
18690a57807D6604c22383A91116C3996r214c01318P0582h8107B33734k9840b89341
$$ -157807 46604 -322383 191116 33996 24782 -301318 -230736 -88107 233734 203894 -289341
18678B46646l1781b60170d4859l1661l65804B0302J7016j1201P7012m2762a29898
$$ 246646 214865 -260170 -44859 -76520 -442324 20302 37318 26117 103129 60367 -129898
18666B47156b43409f693A01352M3057a58885I2996C5439i8410H835c88117a71688
$$ 247156 -243409 -6693 101352 144409 -158885 92996 35439 -98410 8835 -388117 -171688
18654g8069j91896A09763a20406B14254a37424j21790j10743J66881h7147L8094
$$ -78069 -269965 109763 -120406 214254 -137424 -259214 -369957 -203076 -87147 -49053
18644d9053j46079k2300H697L941R6841n4512g3858A39437d9168F333c14025J46610
$$ -49053 -195132 -217432 8697 12638 109479 54967 -73858 139437 -49168 6333 -314025 -167415
18632a67415M710r3383A1058i0627D8354c55775B46899b86361J09653c8547l8533
$$ -167415 -162705 -256088 11058 -90627 48354 -355775 246899 -286361 -176708 -38547 -77080
18621g7080c7104q5752C28467a93849M6220p5057i9829L0496B39615R9037b19603
$$ -77080 -37104 -122856 328467 -193849 -147629 -222686 -99829 -69333 239615 338652 -219603
18609I625g4715K334k1263D24579c25766F9663b01386i4855L5661B1592b95264
$$ 9625 -74715 -72381 -93644 424579 -325766 69663 -201386 -94855 -59194 21592 -295264
18597b78543d1883A82158a83506j13215Q8201B99798F9566p786j8047J54995a22293
$$ -278543 -41883 182158 -183506 -296721 -208520 299798 69566 61780 43733 198728 -122293
18585a66089E7137J81934F6673b59811i890m289l6826A49720i8926j6402B6409
$$ -166089 57137 239071 66673 -259811 -9890 -14179 -51005 149720 -98926 -115328 26409
18573a32614C62783a10464m07396b44544b6893C44782j34587o463I7564J12450
$$ -132614 362783 -110464 -517860 -244544 -26893 344782 210195 203732 97564 210014
18563B10014a20989b9720C1863c3260n9786A73316j8347a82033a771j02945N822
$$ 210014 -120989 -29720 31863 -33260 -93046 173316 154969 -182033 -1771 -104716 -98894
18552i8894D1603o530a38957C2948J4092K6359b37096B8662g5730A19088b84127
$$ -98894 41603 35073 -138957 32948 47040 73399 -237096 28662 -75730 119088 -284127
18540c62652J45459d3802A01765j5256b11300j40452N1461Q0114j29142E7099
$$ -362652 -217193 -43802 101765 86509 -211300 -351752 -300291 -220177 -349319 57099
18529B5079a97501k9364d4580C2527b66408j00176g0722C6334d6065A79028c6300
$$ 25079 -197501 -226865 -44580 32527 -266408 -366584 -70722 36334 -46065 179028 -36300
18517B3449A1231J27351a36944k744O100L7238A64721a97763C35311d6163j43614
$$ 23449 11231 138582 -136944 -139688 -133588 -96350 164721 -197763 335311 -46163 -189777
18506a89777C9025d27855K02893J00952O1513c0038k06882A00416H708c25561
$$ -189777 39025 -427855 -224962 -124010 -62497 -30038 -236920 100416 8708 -325561
18495a63470E8182c2790j5884j34666c6528k92169j65226B91614B4157d0510N88
$$ -163470 58182 -32790 -48674 -183340 -36528 -328697 -493923 291614 24157 -40510 -39922
18484c9922G07c74831h5097e806k98209g1492c2926p9989M764l418D4986i0042
$$ -39922 707 -374831 -85097 -5806 -304015 -71492 -32926 -112915 -108151 -111569 44986 -90042
18471e1451k08442J17968H6634B0901b88404J9714B88798J1499b61818a15772
$$ -51451 -259893 -141925 86634 20901 -288404 -268690 288798 300297 -261818 -115772
18460a6853j49049B0378b71531c3787E00890A27215j2912a59741D1769P6732J1920
$$ -16853 -165902 20378 -271531 -33787 500890 127215 114303 -159741 41769 118501 130421
18449A30421E1339c9921k56971H1577c29415a17412C8392Q3906j7137b59425h1934
$$ 130421 51339 -39921 -296892 81577 -329415 -117412 38392 122298 105161 -259425 -81934
18437A29856k1881g6652j11633A08590J92671I83L9106b9165A48726b47622K3528
$$ 129856 107975 -76652 -188285 108590 301261 983 40089 -29165 148726 -247622 -224094
18426b24094A19570c4751B18443b41472B89327B3827J64839c89756c572k62337
$$ -224094 119570 -34751 218443 -241472 289327 23827 188666 -389756 -3572 -265909
18416b65909B47561a90779B43770A07544g0622D0917a58590j08986A72412K25633
$$ -265909 247561 -190779 243770 107544 -70622 40917 -158590 -267576 172412 398045
18406C98045I8492d1996D4299a49052A23815c483m2448B31779a907l12171A09130
$$ 398045 98492 -41996 44299 -149052 123815 -3483 -45931 231779 -1907 -314078 109130
18394F288d3450f710B90764b63719l1175a34776j40204P3009d4694G1493b40154
$$ 6288 -43450 -6710 290764 -263719 -294894 -134776 -274980 -201971 -44694 71493 -240154
18382B42228H9356a14964k79901a32689L7635M1264A63491J81133M1103a29601
$$ 242228 89356 -114964 -394865 -132689 -95054 -53790 163491 344624 385727 -129601
18371b036j98310Q9150A13757F102L3007a77265A53618b23614A09106a69186G5203
$$ -2036 -200346 -111196 113757 6102 39109 -177265 153618 -223614 109106 -169186 75203
18359a28491A40348o0890k8850a99337f8958K9357j31342j91652D1318L3849a57612
$$ -128491 140348 79458 50608 -199337 -68958 -39601 -170943 -362595 41318 75167 -157612
18347A99713D5910f5393B49622c04A688b39161A33793Q9931a48790L0839C5447
$$ 199713 45910 -65393 249622 -304 1688 -239161 133793 223724 -148790 -117951 35447
18335A4838a55200P1761L0234H035K20128B5600a92765h943j50883m1652D12117
$$ 14838 -155200 -83439 -53205 8035 228163 25600 -192765 -8943 -159826 -201478 412117
18323B63269f351E4880k236a09822l68871J39090a24059J7556r0673d1571B44261
$$ 263269 -6351 54880 52644 -109822 -478693 -339603 -124059 -106503 -197176 -41571 244261
18311F5054O990c0713k0939j09078K5907B28670D3274K4854g3292E3718e37883
$$ 65054 72044 -30713 -51652 -160730 -134823 228670 43274 68128 -73292 53718 -537883
18299e73682b50164D5019c4278A19814a10289j19412c7666o5481A33618E1386
$$ -573682 -250164 45019 -34278 119814 -110289 -229701 -37666 -103147 133618 51386
18288A8676c30185A65902J2959a29500E6888c1262B94326R189a61032j60982b9755
$$ 18676 -330185 165902 178861 -129500 56888 -31262 294326 303515 -161032 -322014 -29755
18276a72674M7104A96398e0107j35290B00154a36733f7067L0917l58491A66989
$$ -172674 -125570 196398 -50107 -185397 200154 -136733 -67067 -36150 -394641 166989
18265c6159j77939O6638c1754k37965M6800i971E1089P8687c7896F2998a26905
$$ -36159 -214098 -147460 -31754 -269719 -222919 -9971 51089 129776 -37896 62998 -126905
18253a68623D5754a57695q3339R8445l92907K37411a1468A33912K3509o124a9005
$$ -168623 45754 -157695 -241034 -142589 -535496 -298085 -11468 133912 157421 151297 -19005
18241c75450J30820B95290F9944K3737A8489h7994I2572J60864d3354J597p4954
$$ -375450 -244630 295290 69944 93681 18489 -87994 92572 253436 -43354 -41757 -116711
18230a16711B26807c89425H328K15146c81028a348j30644l38782f630j13493A7217
$$ -116711 226807 -389425 8328 223474 -381028 -1348 -131992 -470774 -6630 -120123 17217
18218g7579A00445a27553E2671A4745L5667K1135K8063L2881h4680j76795n9357
$$ -77579 100445 -127553 52671 14745 50412 71547 99610 132491 -84680 -261475 -320832
18207c20832J32678I0126b31082p6258d4021C37521e14876a43357H2963O4512
$$ -320832 -188154 90126 -231082 -307340 -44021 337521 -514876 -143357 82963 147475
18197A47475b6265B91357G4319J93227A12812J70506A14491a94257j26014J28555
$$ 147475 -26265 291357 74319 267546 112812 283318 114491 -194257 -320271 -191716
18187a91716A00647a44440j33254g0239A33522a60727B5715a67385d3171l17278
$$ -191716 100647 -144440 -277694 -70239 133522 -160727 25715 -167385 -43171 -360449
18177c60449a5084k24109P2667d2307H5309F820a34833A8105K8468P4358c00565
$$ -360449 -15084 -239193 -166526 -42307 85309 6820 -134833 18105 46573 120931 -300565
18165a37202A99841c08971a11785k44897B21217r6417G946b80881E7842F384L9795
$$ -137202 199841 -308971 -111785 -356682 221217 124800 7946 -280881 57842 6384 46179
18154D6179K11113k0301a2881k85743h7530F4351M5472a56749F4310a71560j9856
$$ 46179 257292 236991 -12881 -298624 -87530 64351 109823 -156749 64310 -171560 -191416
18143a91416C00959c3856l50643B51822A00388a74068j02836E9925a15202A71751
$$ -191416 300959 -33856 -384499 251822 100388 -174068 -276904 59925 -115202 171751
18132c9412f963j92872A6727b27475B21644b7182H7635l060Q3260b2207B4178
$$ -39412 -6963 -199835 16727 -227475 221644 -27182 87635 84575 167835 -22207 24178
18120b10178b8066k0824l1177A26776j9512J52152R6952e12085B63761a96842
$$ -210178 -28066 -48890 -80067 126776 107264 259416 356368 -512085 263761 -196842
18109A07649b9645E02043j96923a09363C02705H8538h7344A36344a94957H0105
$$ 107649 -29645 502043 305120 -109363 302705 88538 -87344 136344 -194957 80105
18098C6414K15285b27974B14722n3927a46910B8173d1116A72720J54635A39143
$$ 36414 251699 -227974 214722 160795 -146910 28173 -41116 172720 327355 139143
18087A06782c56289J09430I3514c008p9566I8640i0200p7708h0414A04690a18348
$$ 106782 -356289 -246859 93514 -3008 -82574 98640 -90200 -167908 -80414 104690 -118348
18075g8864A29638J19140A8018b28081l2794d8403q467m9290G3309K02596a81659
$$ -78864 129638 248778 18018 -228081 -260875 -48403 -56870 -106160 73309 275905 -181659
18063F4372a39034o958N9303B5905b31220E9067c32142h7479j1786B06923Q7779
$$ 64372 -139034 -145992 -86689 25905 -231220 59067 -332142 -87479 -99265 206923 294702
18052B94702d8531A26125n406e1943l83180A8159a56289k611b2255k69226d192
$$ 294702 -48531 126125 120719 -51943 -435123 18159 -156289 -158900 -22255 -291481 -4192
18040b11736N2112a6220B4149J08851f2358B01840b77197B47070E5571I294c17746
$$ -211736 -159624 -16220 24149 133000 -62358 201840 -277197 247070 55571 9294 -317746
18028E13127a53724j24473A22549g4498H9365J71417d96862E1411A127b88997
$$ 513127 -153724 -278197 122549 -74498 89365 260782 -496862 51411 1127 -288997
18017B3504J74524p0147H25f55762a09455K5211c585B33234R6129b4275B97512
$$ 23504 198028 127881 825 -655762 -109455 -84244 -3585 233234 329363 -24275 297512
18005D18457c1157A06966J75817n8868l0558q6525b51712A53161a64975B26311
$$ 418457 -31157 106966 282783 223915 193357 106832 -251712 153161 -164975 226311
17994A91039A2607c3291A6519K05071I1464a97916A14971e7562H3117a86935D3359
$$ 191039 12607 -33291 16519 221590 91464 -197916 114971 -57562 83117 -186935 43359
17982g2169j16981h6823B49965a0628A97965i1613A0357a5699B58651e4489D61881
$$ -72169 -189150 -86823 249965 -10628 197965 -91613 10357 -15699 258651 -54489 461881
17970I4661K06021g6659b040k0698B65658k6731b93577H6656M3550a8333A4950
$$ 94661 300682 -76659 -2040 -22738 265658 238927 -293577 86656 130206 -18333 14950
17958f0004C78319b78739E7549J65742E7836a59452g6280A53603a40176j9808
$$ -60004 378319 -278739 57549 223291 57836 -159452 -76280 153603 -140176 -159984
17948a59984A16364c22964A24341i3629I2084K56196a19440a5395A64775m4191
$$ -159984 116364 -322964 124341 -93629 92084 348280 -119440 -15395 164775 120584
17938A20584l4193F510g2522C71993b70694B5699a99746h1462A9724a95153f572
$$ 120584 86391 6510 -72522 371993 -270694 25699 -199746 -81462 19724 -195153 -6572
17926b81714A43626n1915C7445H734O4345M6607E845d6179J9766n5694l5946B29988
$$ -281714 143626 91711 37445 8734 73079 119686 5845 -46179 -26413 -82107 -118053 229988
17913A41900b92380D0868O4573a61475A9733R0263b05777c2268k64549A16130
$$ 141900 -292380 40868 105441 -161475 19733 109996 -205777 -32268 -296817 116130
17902A12797e6347j75638A5953N1770q200k5401R776B61J00a58472N8340A97442
$$ 112797 -56347 -231985 15953 67723 59523 34122 43898 261 361 -158472 -100132 197442
17889B69343B0531b40953g0221q0583A75918d2539m383H621a37035L2596B07122
$$ 269343 20531 -240953 -70221 -150804 175918 -42539 -46922 8621 -137035 -104439 207122
17877A66962a68346N0052B01064a77404j65115i31j31893j71275c8544n2619B05719
$$ 166962 -168346 -118294 201064 -177404 -342519 -931 -132824 -304099 -38544 -91163 205719
17865a6143n6171k9344I82K83571j12297A9002J36011a9510j17566O6796j59415
$$ -16143 -72314 -101658 982 284553 172256 19002 155013 -19510 -137076 -70280 -229695
17854b29695A56443B3352Q7112b16855f1054F2585N9507b00946A54412b19335
$$ -229695 156443 23352 110464 -216855 -61054 62585 122092 -200946 154412 -219335
17843A17224m0647l488K69312G833a22211B40164h7757K1599j05125B22415E6498
$$ 117224 76577 73089 342401 7833 -122211 240164 -87757 -66158 -171283 222415 56498
17831A42693a3000k39553B4084K41745b4319A85755i0904K0374A09984J07571
$$ 142693 -13000 -252553 24084 265829 -24319 185755 -90904 -70530 109984 217555
17821B17555E7223J45877a64689H9602g0933D92749b3680A92934C440c27219A9060
$$ 217555 57223 203100 -164689 89602 -70933 492749 -23680 192934 3440 -327219 19060
17809D6387j5497A1497c2636n4917o9457j51269c2633C342O11324k23290b13290
$$ 46387 30890 11497 -32636 -87553 -157010 -308279 -32633 3342 614666 391376 -213290
17797A3459J19618N081b46272A33989e2571B23527a14808c014j52132a8199j49966
$$ 13459 133077 138158 -246272 133989 -52571 223527 -114808 -3014 -155146 -18199 -168165
17786a68165h3953n1102Q607D01143F886J52398K04870j06122b120j19203A67589
$$ -168165 -83953 -135055 -126448 401143 6886 159284 364154 258032 -2120 -121323 167589
17774A37304A1969K49386j22987E6515B5796e2199k3757G7816K3932a79098B5734
$$ 137304 11969 261355 138368 56515 25796 -52199 -75956 77816 101748 -179098 25734
17762f3896A16191J59545r5287I204a5661p2890A49263J6717N9500a3166m7955
$$ -63896 116191 275736 180449 9204 -15661 -88551 149263 165980 225480 -13166 -61121
17751f1121K9241A35471K7439K1781b09392F3400b75134E7846L0679e7018B39711
$$ -61121 -31880 135471 162910 184691 -209392 63400 -275134 57846 88525 -57018 239711
17739B06208K7255N6850a6953m2768l6685A8953b53345E1399f5887A0304K50631
$$ 206208 233463 290313 -16953 -59721 -96406 18953 -253345 51399 -65887 10304 260935
17728B60935B092K76513j23514J49895j16444K78122p4524h3899B02320g4798
$$ 260935 2092 278605 155091 304986 188542 466664 392140 -83899 202320 -74798
17717a23057C41747b2612p3261o8848L0967I4681K36095b31386n185c2704D04654
$$ -123057 341747 -22612 -95873 -164721 -133754 94681 330776 -231386 -236571 -32704 404654
17705f9124J0012B04150a44035N670m3668J0978M0022d2918j69555E4600M6172
$$ -69124 -59112 204150 -144035 -138365 -182033 -171055 -131033 -42918 -212473 54600 100772
17694A00772M9897M6962a22324C53343F1503J43250f3818B14396I1182m1555d8208
$$ 100772 150669 197631 -122324 353343 61503 204753 -63818 214396 91182 49627 -48208
17682C22401H6519P4172p7852M262a53835A68695q1290a78480M5420l5755b3274
$$ 322401 86519 160691 82839 87101 -153835 168695 87405 -178480 -133060 -168815 -23274
17670B68567k8538L15221d2634A68415e7666A28237b48958B23487a846j05249
$$ 268567 240029 555250 -42634 168415 -57666 128237 -248958 223487 -1846 -107095
17660a07095N2998D20404A5924b49091E7174J44070K05077f0382A9205c2411a2981
$$ -107095 -54097 420404 15924 -249091 57174 201244 406321 -60382 19205 -32411 -12981
17648H8652j2471K85852c15248c5156n4577A13204b36m053B62842c72094A35436
$$ 88652 76181 362033 -315248 -35156 -89733 113204 -236 -4289 262842 -372094 135436
17636C7167Q8492b27579E112d7978A41126K95566i8016A79712K5695O0868j8097
$$ 37167 125659 -227579 5112 -47978 141126 436692 -98016 179712 205407 266275 248178
17625B48178H9359d9091A5262J27538n9441a13095j2015A088J04211b31106B84117
$$ 248178 89359 -49091 15262 142800 83359 -113095 -125110 1088 105299 -231106 284117
17613i2754a0665B3854a25370C2091J35713b05045C22155A49498o0516R7539I1318
$$ -92754 -10665 23854 -125370 32091 167804 -205045 322155 149498 88982 186521 91318
17601C29228K1831j13583n4375K7427B6808N4034K0990h3480H7639N2091a08624
$$ 329228 351059 237476 183101 210528 26808 80842 101832 -83480 87639 139730 -108624
17589b4033j19361B32423A06406P5502M07370B11707A8781M25381A02987e446
$$ -24033 -143394 232423 106406 181908 589278 211707 18781 444162 102987 -5446
17578b58523A83907Q7871A17962d3005G0430J45628m6355D6871a34199a9007B64080
$$ -258523 183907 271778 117962 -43005 70430 216058 169703 46871 -134199 -19007 264080
17566b2298D5881R3773J40615N3734a9005A26605a6589B11785F1903a16117A67897
$$ -22298 45881 139654 280269 334003 -19005 126605 -16589 211785 61903 -116117 167897
17554B55422C2585N17427B00211b09088d9718j82727C07473d9095A71279a42079
$$ 255422 32585 550012 200211 -209088 -49718 -232445 307473 -49095 171279 -142079
17543B73641k6835I0610M0736K39827A53027J82160A03380K01964H9898J00053
$$ 273641 246806 90610 131346 371173 153027 335187 103380 305344 89898 189951
17533A89951E9169K90604I6259m5381L46482k5473O9417L78655J62153p8222j94101
$$ 189951 59169 349773 96259 50878 397360 371887 441304 819959 982112 903890 709789
17522G09789K56398l59393J87140j42131K4366p9901j29376J69206o0855o9041
$$ 709789 966187 606794 793934 651803 676169 596268 466892 636098 575243 506202
17512E06202P8474L5722o042q2846N17678k30180k95508J50536k67715d1759D98419
$$ 506202 584676 620398 614356 531510 1049188 819008 523500 674036 406321 -41759 498419
17500B82447K96220J71146A01595K52199q3883j0399M10237A89919q7755N4678
$$ 282447 578667 749813 101595 353794 269911 259512 669749 189919 102164 156842
17490A56842L29113B4850L4221q097L18470m6130G2575M37289o4259K8977k13708
$$ 156842 485955 24850 59071 50974 369444 323314 72575 509864 445605 474582 260874
17479B60874p6127n3517K90515j709r624A89416q5553K65579P6228A27404l9440
$$ 260874 184747 131230 421745 420036 410412 189416 103863 369442 445670 127404 87964
17468H7964K73910a77747B70567A6251J88054H3460a62159D89542A02904L66427
$$ 87964 361874 -177747 270567 16251 204305 83460 -162159 489542 102904 469331
17458D69331j24190m8568G1668L03145A72201f3931k2833B71067J2212B2254L49284
$$ 469331 345141 296573 71668 374813 172201 -63931 -86764 271067 283279 22254 371538
17447C71538j54859J64664N1932B13038K39675E694K8416M88870l5743A0083L16171
$$ 371538 216679 381343 433275 213038 452713 5694 34110 522980 487237 10083 326254
17436C26254j32258O59514I0104N5890L6036k3119K21935A28774o1345M7211J05966
$$ 326254 193996 853510 90104 145994 182030 158911 380846 128774 67429 114640 220606
17425B20606J70205j30793N6444J4076J4574O930b6767A92820c4854B32253N14168
$$ 220606 390811 260018 316462 330538 345112 352042 -26767 192820 -34854 232253 746421
17414G46421A54171L72256E7315n307K41638A24882M2594R3106G3383L26292p9647
$$ 746421 154171 526427 57315 52008 293646 124882 167476 260582 73383 399675 320028
17403C20028q0825a1277B57704l3893f8344C08616A44606K68506j76313O9522
$$ 320028 239203 -11277 257704 223811 -68344 308616 144606 413112 236799 306321
17393C06321j03389J1549J1116O3224O688A24718N5531p7010L15727H0996B5611
$$ 306321 202932 214481 225597 288821 295509 124718 180249 103239 418966 80996 25611
17381G2137N9787J22185J2539j32125P6871E4665O2120R1582n8386J98949B4930
$$ 72137 131924 254109 266648 134523 211394 54665 116785 208367 149981 348930 24930
17369B87433P4311Q9676l6426A28872J83006I43K16012K40849B23077L41278o9640
$$ 287433 361744 451420 414994 128872 311878 943 216955 457804 223077 564355 494715
17358D94715p0773A79971J69012J5679J8385A49064Q6631m7623L7799A01358K25637
$$ 494715 423942 179971 348983 364662 383047 149064 235695 188072 225871 101358 326995
17347C26995j22373J52356b5174j11162a9121A51726B6603J79343o391n1871a24943
$$ 326995 204622 356978 -25174 -136336 -19121 151726 26603 205946 199555 147684 -124943
17335a17308F7192J75086L3897A36920J18062L1415K72880M3246B96789B1964
$$ -117308 67192 242278 276175 136920 254982 286397 559277 602523 296789 21964
17324A01267J73410M3766D4686K69732q8095A04911J98367J52183k16722O7061
$$ 101267 274677 318443 44686 314418 226323 104911 303278 455461 238739 305800
17314C05800N08114A69920K35130j29131J58882j00029J95661B01583a7867C93477
$$ 305800 813914 169920 405050 275919 434801 334772 530433 201583 -17867 393477
17303C7510Q5642Q6681k2385G2821M49980A26558L64194B14176M00847A47531
$$ 37510 123152 209833 187448 72821 522801 126558 490752 214176 615023 147531
17292I8804b9452E5963K67016R5587i3877c8211B20716K07217C6108J88359Q2579
$$ 98804 -29452 55963 322979 418566 -93877 -38211 220716 427933 36108 224467 307046
17281C07046J37507J25630B60745j9464J44293k0660j53329D6561J68933K25996
$$ 307046 444553 570183 260745 241281 385574 364914 211585 46561 215494 441490
17271D41490j2682j96571N3118R9202o7551L17764A55598J10277Q5921A17956
$$ 441490 428808 232237 285355 384557 317006 634770 155598 265875 351796 117956
17260B21157A5717J52326K92968j87021J54664k5879A63811Q7741j19372a991
$$ 221157 15717 168043 461011 273990 428654 402775 163811 251552 132180 -1991
17249D52793D8491L88877j100j64542P3906j32577N6124k7839j3104f4162I6678
$$ 452793 48491 437368 436268 271726 345632 213055 269179 241340 228236 -64162 96678
17237D06680H2087L99126A97529N37161A83729n7006L14165K1607N8488C7794
$$ 406680 82087 481213 197529 734690 183729 126723 440888 462495 520983 37794
17226H1423J02893K32717A88462Q0476K68695j50029P5762o4971L3111m1563j17806
$$ 81423 184316 417033 188462 268938 537633 387604 463366 398395 431506 389943 272137
17215B72137L57390B26992K52285J19284L2813B25728M25196K197B39527Q9071
$$ 272137 629527 226992 479277 598561 631374 225728 650924 653121 239527 328598
17205C28598I7054Q3132R7879M0134J7365A39382K92746k8745I8566c2055E59783
$$ 328598 97054 180186 278065 318199 335564 139382 432128 403383 98566 -32055 559783
17193D32168j09414A42137R3666Q5579P0627o9545O0959p4916J6446L8706j77232
$$ 432168 322754 142137 235803 321382 392009 322464 383423 308507 324953 363659 186427
17182A86427K82572j8439l1491j50028K65846k46226K63131j5081J33118l01216
$$ 186427 468999 450560 419069 269041 534887 288661 551792 536711 669829 368613
17172C68613K81n1714G2772L41444j42873R2558Q6395j18573R0447J14956j27899
$$ 368613 368894 317180 72772 414216 271343 363901 450296 331723 422170 537126 409227
17161D09227L48904l10266j33166K94554j65868q5579O0797O5581j07101Q1999
$$ 409227 758131 447865 314699 609253 443385 357806 418603 484184 377083 459082
17151D59082K02501p7926k72451j31202M05234j67154A38330M94325j27191K6496
$$ 459082 661583 583657 311206 180004 585238 418084 138330 632655 505464 531960
17141E31960j86072K36387B83273K78618B40585M99572r5334j29213j31324o3262
$$ 531960 345888 582275 283273 561891 240585 740157 644823 515610 384286 321024
17131C21024J90065n2467j35288K65691k18090J31606K20358k62124j9473K25319
$$ 321024 511089 458622 323334 589025 370935 502541 722899 460775 441302 666621
17121F66621j78011K30326q7322J6873j78151k06565N17474C89587J4477M0986
$$ 666621 488610 718936 631614 648487 470336 263771 781245 389587 404064 445050
17111D45050Q8310l759j41859K99923j45123l0159J6535L08187C69943J88743
$$ 445050 533360 529601 387742 687665 542542 512383 528918 837105 369943 558686
17101E58686q2334K46401k08607J61021j65423L50947D16083M016K19075J86611
$$ 558686 476352 722753 514146 675167 509744 860691 416083 420099 639174 825785
17091H25785k92145Q4136J76112C31748N21537k54241M513n3983k127J15867j18795
$$ 825785 533640 617776 793888 331748 853285 599044 603557 549574 547447 663314 544519
17080E44519J9856N0829J13327J88704l24919j93153M92546C42475L14268l0858
$$ 544519 564375 615204 728531 917235 592316 399163 891709 342475 656743 625885
17070F25885J52943K5644j99810J59073j72936J15062k02920K95869j46685k67071
$$ 625885 778828 804472 604662 763735 590799 705861 502941 798810 652125 385054
17060C85054N67152O7416l07951J15504j15699K90063l19946o2453J31906j7198
$$ 385054 952206 1019622 711671 827175 711476 1001539 681593 619140 751046 733848
17050G33848j40975J06949K1536J33463L1737J675L95116o25128L81940k48217
$$ 733848 592873 699822 721358 854821 886558 888233 1283349 658221 1040161 791944
17040G91944j02003j87730L46817j18926L4529J35861j85917L53455j13524J7000
$$ 791944 689941 502211 849028 730102 764631 900492 714575 1068030 954506 971506
17030I71506j13336K6493k878k52251K14303m4070K35488k94465L72901j51885
$$ 971506 858170 884663 881785 629534 843837 799767 1035255 740790 1113691 961806
17020I61806q4209j67466K58603j6287l2731l48080O43556m68294N39982j61563
$$ 961806 877597 710131 968734 952447 919716 571636 1215192 746898 1286880 1125317
17010A125317k17357K72700k42741j47250J31401p2989j7676L39888j12429l1514
$$ 1125317 907960 1180660 937919 790669 922070 849081 831405 1171293 1058864 1027350
17000A027350k04607M76143k25074K58757j12681j49095k04890L56096k3536M1763
$$ 1027350 822743 1298886 1073812 1332569 1219888 1070793 865903 1221999 1198463 1240226
16990A240226R0720j72130j60330J03861N9865n0417P2533j57639K6810J73697
$$ 1240226 1330946 1158816 998486 1102347 1162212 1111795 1184328 1026689 1053499 1227196
16980A227196l38494K98263O9048p8653K90056l36557M6472J81638k5344K50988
$$ 1227196 888702 1186965 1256013 1177360 1467416 1130859 1177331 1358969 1333625 1584613
16970A584613k41864j32234J50549K31393j07552K03913k50104K01949l67588
$$ 1584613 1342749 1210515 1361064 1592457 1484905 1688818 1438714 1640663 1273075
16961A273075J87321J90833m99243k2915r9280K16799K56278J39084n7849k06063
$$ 1273075 1460396 1651229 1151986 1129071 1029791 1246590 1502868 1641952 1584103 1378040
16951A378040O5337k0311L49421j65593J48533m43174J58622K03657j6357r7711
$$ 1378040 1443377 1423066 1772487 1606894 1755427 1312253 1470875 1674532 1658175 1560464
16941A560464O0399L61896m34339J6177M11310j67852P7091m8021K26956l61924
$$ 1560464 1620863 1982759 1548420 1564597 1975907 1808055 1885146 1837125 2064081 1702157
16931A702157j45896N15387o2508J22621k14975L60260k68810J99491l18503n3355
$$ 1702157 1556261 2071648 2009140 2131761 1916786 2277046 2008236 2207727 1889224 1835869
16921A835869J52313L35607m54056K43701M892K67533r0760k66274J77781m28112
$$ 1835869 1988182 2323789 1869733 2113434 2118326 2385859 2295099 2028825 2206606 1778494
16911A778494M57425K0197K21542m39075L81934m3180j67110M33800k4516O1891
$$ 1778494 2235919 2256116 2477658 2038583 2420517 2377337 2210227 2644027 2619511 2681402
16901B681402j18449l2649J37420L2964q3110k52624R4696J27448J08669j38980
$$ 2681402 2562953 2530304 2667724 2700688 2617578 2364954 2459650 2587098 2695767 2556787
16891B556787O73996n36152L44802k72873K85261k30706J92727j46548K07508
$$ 2556787 3230783 2694631 3039433 2766560 3051821 2821115 3013842 2867294 3074802
16882C074802K4679J46157k68771o4218N17579J37081k01252L242k89674O64662
$$ 3074802 3099481 3245638 2976867 2912649 3430228 3567309 3366057 3369299 3079625 3744287
16872C744287o35957P81563j5402k70357K82275k90489L00968j60389j4177J67501
$$ 3744287 3108330 3889893 3874491 3604134 3886409 3595920 3896888 3736499 3722322 3889823
16862C889823J64161k66821M16596K11063l28513K16645O780M23472j28095o91354
$$ 3889823 4053984 3787163 4203759 4414822 4086309 4302954 4309734 4733206 4605111 3913757
16852C913757M71371N39515k7387j4252P8176R6179M58667k57981K57676k22254
$$ 3913757 4385128 4924643 4897256 4883004 4961180 5057359 5516026 5258045 5515721 5293467
16842E293467N3953j08403L51566J11179J41321J36682O5037L10923m41657M16146
$$ 5293467 5347420 5239017 5590583 5701762 5843083 5979765 6044802 6355725 5914068 6330214
16832F330214m3735R8931N40186j58390k3618j50220M53680K74512J29086K6540
$$ 6330214 6286479 6385410 6925596 6767206 6743588 6593368 7047048 7321560 7450646 7477186
16822G477186p9261N32976k1932m2942N66467k30247M25124q013L04036L22498
$$ 7477186 7397925 7930901 7908969 7866027 8432494 8202247 8627371 8619358 8923394 9245892
16812I245892Q8716J33498N26856M3322K12136m67418J119010o8170L96117L30369
$$ 9245892 9334608 9468106 9994962 10038284 10250420 9783002 10902012 10833842 11229959 11560328
16802A1560328j35560K90187O48725K25146M28872J11240J71438L66384L59919
$$ 11560328 11424768 11714955 12363680 12588826 13017698 13128938 13300376 13666760 14026679
16793A4026679L27005L13081L04056O72923K78245M60748K56037Q46724J74066
$$ 14026679 14353684 14666765 14970821 15643744 15921989 16382737 16638774 17485498 17659564
16784A7659564O89465M74140R1989Q50291M22199J224667L50225L04942J132338
$$ 17659564 18349029 18823169 18915158 19765449 20187648 21412315 21762540 22067482 23199820
16775B3199820L02588L88778J405155N99811Q53038J019154P95730J033562R26210
$$ 23199820 23502408 23891186 25296341 25896152 26749190 27768344 28564074 29597636 30523846
16766C0523846Q41131J194665J155038J227730J526390R46996J514708J026948
$$ 30523846 31364977 32559642 33714680 34942410 36468800 37415796 38930504 39957452
16758C9957452J807036J628119J494393J470887J768892K247475J933352J922041
$$ 39957452 41764488 43392607 44887000 46357887 48126779 50374254 52307606 54229647
16750E4229647K413917J900245K372519K325355K124031K897094K472031K635357
$$ 54229647 56643564 58543809 60916328 63241683 65365714 68262808 70734839 73370196
16742G3370196L178214K499244K745353L374323K420078L324649L026529L026803
$$ 73370196 76548410 79047654 81793007 85167330 87587408 90912057 93938586 96965389
16734I6965389K536331L036170K646337K485249K764970K023020K310500J554260
$$ 96965389 99501720 102537890 105184227 107669476 110434446 112457466 114767966 116322226
16726A16322226J509629J292456Q08776O38038m963k02679l31355r44667j065347
$$ 116322226 117831855 119124311 119933087 120571125 120566162 120363483 120032128 119087461 118022114
16717A18022114j733269j810042j690864k440975k573999k538207k642430k699087
$$ 118022114 116288845 114478803 112787939 110346964 107772965 105234758 102592328 99893241
16709I9893241l116325k943004k929563l320553k804255k992106l224907k703961
$$ 99893241 96776916 93833912 90904349 87583796 84779541 81787435 78562528 75858567
16701G5858567k633660k935809k582201k546714k539822k109517k277599k551243
$$ 75858567 73224907 70289098 67706897 65160183 62620361 60510844 58233245 55682002
16693E5682002j709063k116811k056535j973534j397452j777524k133895p44570
$$ 55682002 53972939 51856128 49799593 47826059 46428607 44651083 42517188 41772618
16685D1772618j790670j306274j376900j790087r46233j218959r64295j602490
$$ 41772618 39981948 38675674 37298774 35508687 34562454 33343495 32379200 30776710
16677C0776710n07773j294677r75570q73432p34944p28993j093289n09703o09392
$$ 30776710 30268937 28974260 27998690 27125258 26390314 25661321 24568032 24058329 23448937
16668B3448937o33052j167578k75950r27002l60319p13183j02185j043217m46842
$$ 23448937 22815885 21648307 21372357 20445355 20085036 19371853 19269668 18226451 17779609
16659A7779609n4672p28330l77381p88580l38773k04662n77738l39311l00414
$$ 17779609 17724937 16996607 16619226 15830646 15491873 15287211 14709473 14370162 14069748
16650A4069748k52024l04462o16054K2111l15125m30093p12781K19699k99694
$$ 14069748 13817724 13513262 12897208 12919319 12604194 12174101 11461320 11681019 11381325
16641A1381325m42197J63988l68356l05634K8327l61449n47498j64391p6024j00714
$$ 11381325 10939128 11103116 10734760 10429126 10457453 10096004 9548506 9384115 9308091 9207377
16631I207377l96356J92353j63976o59098J91811l27348J24358n87070j3839k4800
$$ 9207377 8811021 9003374 8839398 8180300 8372111 8044763 8169121 7582051 7568212 7543412
16621G543412o8213m01142J975q9760K08006l77124n8103l53645J65569j40256
$$ 7543412 7475199 7074057 7076032 6986272 7194278 6817154 6759051 6405406 6570975 6430719
16611F430719l21641O5781j6941l46145j35995L03734o08775Q1717l567r6587
$$ 6430719 6109078 6174859 6157918 5811773 5675778 5979512 5370737 5452454 5448887 5352300
16601E352300M851j67894j38227o4658J83144k96094j45765k96311M84385k50486
$$ 5352300 5357151 5189257 5051030 4986372 5169516 4873422 4727657 4431346 4915731 4665245
16591D665245p8463R7770r5263l48915m52511O31112l28279o7217j06599J52507
$$ 4665245 4586782 4684552 4589289 4240374 3787863 4418975 4090696 4023479 3916880 4069387
16581D069387k68265p1960j2791J82960l57565m1206k4922J32922l88347L5531
$$ 4069387 3801122 3729162 3716371 3899331 3541766 3500560 3475638 3608560 3220213 3255744
16571C255744M8389O8796r40l2779j14222l8097j39281K01403k27465N3338l89656
$$ 3255744 3304133 3372929 3371989 3339210 3224988 3186891 3047610 3249013 3021548 3074886 2685230
16560B685230L84654n78767Q90526r27871K94856J747j28903L7003J8711o4874
$$ 2685230 3069884 2491117 3381643 2453772 2748628 2750375 2621472 2658475 2677186 2612312
16550B612312L8487j53649N10787n18965J64824J56307m99529J98884J7679p8315
$$ 2612312 2650799 2497150 3007937 2488972 2653796 2810103 2310574 2509458 2527137 2448822
16540B448822k49286l6961K98612J0425k39733J35572j2192j3319j49616l22806
$$ 2448822 2199536 2162575 2461187 2471612 2231879 2367451 2355259 2341940 2192324 1869518
16530A869518O76798m80187j17429J14260K1860k36089J31841o1008l0775N6677
$$ 1869518 2546316 2066129 1948700 2062960 2084820 1848731 1980572 1919564 1888789 1945466
16520A945466q2832k4570J64056p6206r4199j27889K22913k73557J00233O0289
$$ 1945466 1862634 1838064 2002120 1925914 1831715 1703826 1926739 1653182 1753415 1813704
16510A813704l9702r9295j59786K20400K26633Q7973l76743L8760k87866M00721
$$ 1813704 1774002 1674707 1514921 1735321 1961954 2049927 1673184 1711944 1424078 1824799
16500A824799l06834L10746n065l63678K77618n8169L63j74196o01306J011331
$$ 1824799 1517965 1828711 1823646 1459968 1737586 1679417 1679780 1505584 904278 1915609
16490A915609m86531j56512P9961k0387K50246k1888K10790j54831j54042J5913
$$ 1915609 1429078 1272566 1352527 1332140 1582386 1560498 1771288 1616457 1462415 1478328
16480A478328J86830k96810j59969J82241l8252j62566r8380K93456Q4471k32210
$$ 1478328 1665158 1368348 1208379 1390620 1352368 1189802 1091422 1384878 1469349 1237139
16470A237139M58231q0653m54o13993K88816J70448J3504N6281k71725l26739
$$ 1237139 1695370 1614717 1614263 1000270 1289086 1459534 1473038 1529319 1257594 930855
16460I30855L97765j93255r2709J66596J29081m34141K23868J51302l46275M20172
$$ 930855 1328620 1135365 1042656 1209252 1338333 904192 1128060 1279362 933087 1353259
16450A353259l28419k8974o3632J71971M6126j48006m0465l50997J49653J24777
$$ 1353259 1024840 995866 932234 1104205 1150331 1002325 961860 610863 760516 885293
16440H85293J63278R1868k74531L17309E49906K95570P5312J93639l82419L76463
$$ 885293 1048571 1140439 865908 1183217 549906 845476 920788 1114427 732008 1108471
16430A108471D31202N33047j20488K77853l14535k22801R1977J65608L82159n70292
$$ 1108471 431202 964249 843761 1121614 807079 584278 676255 841863 1224022 653730
16420F53730J86445R1891j35626Q8777Q1812j8463K4650k63610J09988O6865N7298
$$ 653730 840175 932066 796440 885217 967029 948566 973216 709606 819594 886459 943757
16409I43757D41798L82835j65770J00094K2678j49658K71289J59261l64780J44852
$$ 943757 441798 824633 658863 758957 781635 631977 903266 1062527 697747 842599
16399H42599K26049m00449j17640k09168J58460M25572p4353o4100J66974l94031
$$ 842599 1068648 668199 550559 341391 499851 925423 851070 786970 953944 559913
16389E59913n5397L42849j68579K38982l30388M93032l97485J61743j72878k95003
$$ 559913 504516 847365 678786 917768 587380 1080412 682927 844670 671792 376789
16379C76789J19913j14674N45027l51962M27182l22120j37708J57578k58891K78521
$$ 376789 496702 382028 927055 575093 1002275 680155 542447 700025 441134 719655
16369G19655k84115L44324B57935M71609j64894j77153K82720J13141k35892l8802
$$ 719655 435540 779864 257935 729544 564650 387497 670217 783358 547466 508664
16359E08664I6001K44774M39268j6007j80130P9145M4182J08384Q857k65820K11311
$$ 508664 96001 340775 780043 764036 583906 663051 707233 815617 824474 558654 769965
16348G69965j15731J36934C51914q9883N20090q5447j65764P4643k90588J9362
$$ 769965 654234 791168 351914 262031 782121 696674 530910 605553 314965 334327
16338C34327R1194K81830C38398L92917P736B87177J72142J35086J97080l63121
$$ 334327 425521 707351 338398 731315 739051 287177 459319 594405 791485 428364
16328D28364K81907l52499d4075D75544q8894j28325K18571A08230M28802J97330
$$ 428364 710271 357772 -44075 475544 386650 258325 476896 108230 537032 734362
16318G34362M2500D1835N32341L8825B70901K94168O159k14412J84880M0674k49983
$$ 734362 776862 41835 574176 613001 270901 565069 571228 356816 541696 582370 332387
16307C32387K92249J8524H0521M06200k20794J18342J02507j60497K36956A57347
$$ 332387 624636 643160 80521 486721 265927 384269 486776 326279 563235 157347
16296B65244L37550k57892m4097M7602R696R6669l7999j0965A88934J54551m8896
$$ 265244 602794 344902 300805 348407 358103 454772 416773 405808 188934 343485 294589
16285B94589L14800A12592K11559I2711J99850J68661O907k13856J15771J47268
$$ 294589 609389 112592 324151 92711 292561 461222 468129 254273 370044 517312
16275E17312k02856j04408N69695A32963L22988O8384J7296j70304J2960J91584
$$ 517312 314456 210048 779743 132963 455951 524335 541631 371327 384287 575871
16265E75871B4593J74669l88N8110L2410L29540j31517B24272q1905R3626M22693
$$ 575871 24593 199262 198874 256984 289394 618934 487417 224272 142367 235993 658686
16254F58686A63823N122M57411p4671k20537l9298J1915N3148n9520O2330L07675
$$ 658686 163823 168945 626356 551685 331148 291850 303765 356913 297393 359723 667398
16243F67398H4680j2269K52865L00851G8576L04417j42601J74749J11360C3870
$$ 667398 84680 72411 325276 626127 78576 382993 240392 415141 526501 33870
16232C23035p7818R4699M8356n3429A38783a32910B21210M4967J44679A15645
$$ 323035 245217 339916 388272 334843 138783 -132910 221210 266177 410856 115645
16221C08401j19032J15324J01368A66767L56678j19749A16457P3615J74707J032
$$ 308401 189369 304693 406061 166767 523445 403696 116457 190072 364779 365811
16211C65811q2915l297H3549K59851K36831A48442K10528A15526L44771e884E07663
$$ 365811 282896 279599 83549 343400 580231 148442 358970 115526 460297 -5884 507663
16199C8476L13670b70983B79374i607D01723j34912P6621q3411p046j00561J30668
$$ 38476 352146 -270983 279374 -9607 401723 266811 343432 260021 252975 152414 283082
16188B83082j09177J52446a9656j78388B90089H3672K64022A24185K65613h6795
$$ 283082 173905 326351 -19656 -198044 290089 83672 347694 124185 389798 -86795
16177B24064D5518K07822j00362L9619C8855a4436B11619Q2775F8599P1992a70105
$$ 224064 45518 253340 152978 192597 38855 -14436 211619 294394 68599 140591 -170105
16165b17694K6325E6323J50454r1584J85797b9056A74555K73173J2544d8792A52020
$$ -217694 -191369 56323 206777 115193 300990 -29056 174555 447728 460272 -48792 152020
16153B90546C4576P231J45880j4111K8436P6242l50E9524J62003d5679I7618k7314
$$ 290546 34576 41807 187687 173576 202012 278254 277904 59524 221527 -45679 97618 70304
16141G0304k3582K31932F5060K66328A58236C2518M37050B06777P3590J2865j09151
$$ 70304 46722 278654 65060 331388 158236 32518 469568 206777 280367 293232 184081
16130A84081m9085K04709H6032K15053b4350C3788J15462B3480Q7311n3043L71238
$$ 184081 134996 339705 86032 301085 -24350 33788 149250 23480 110791 57748 428986
16119D28986a6965j88745B83267C3934M1336A7809K89225c985j099D12111A2L0891
$$ 428986 -16965 -205710 283267 33934 75270 17809 307034 -3985 -5084 412111 12 30903
16107C0903O3313J30679M3122j15784J31187L0916b6362A19377J40567H6895J79939
$$ 30903 94216 224895 268017 152233 283420 314336 -26362 119377 259944 86895 266834
16096B66834e2456Q235l4200E9177M1314B4617K21738j5122c92515A5364J35047
$$ 266834 -52456 -44221 -78421 59177 100491 24617 246355 231233 -392515 15364 150411
16085A50411M0890g4198J3941J8494j8064p8910B95343b72449B6148a85267F8173
$$ 150411 191301 -74198 -60257 -41763 -59827 -138737 295343 -272449 26148 -185267 68173
16073a96710A44745c0375A23618c4356J2217k2220B75196B7963J0265L6742L59314
$$ -196710 144745 -30375 123618 -34356 -22139 -44359 275196 27963 38228 74970 434284
16062D34284A47620j0915l4482J87939c97111I6500J2717a0385j9750a0379I3162
$$ 434284 147620 136705 102223 290162 -397111 96500 109217 -10385 -30135 -10379 93162
16050e6820l83940O7895b9434A90901b79290R8641g2715B3151a46304A04901j6227
$$ -56820 -440760 -372865 -29434 190901 -279290 -180649 -72715 23151 -146304 104901 88674
16039H8674b07424A09426c39993J68184m0270F9900a27489G7399J54106q0109
$$ 88674 -207424 109426 -339993 -171809 -212079 69900 -127489 77399 231505 151396
16029A51396I903K69352j11546p4145M9048d6564e642A52837J17882j17269c9039
$$ 151396 9903 279255 167709 93564 142612 -46564 -5642 152837 270719 153450 -39039
16017D4528M0732a10640C77355A29259l2256b34113A23919e8991A76135p5687
$$ 44528 85260 -110640 377355 129259 97003 -234113 123919 -58991 176135 100448
16007A00448C376J57452M5393i2693H145f5197k94687C12011c97802F4148J25814
$$ 100448 3376 160828 206221 -92693 8145 -65197 -359884 312011 -397802 64148 189962
15996A89962i9785B86383F2535J22866k2388C7827N1432K1617M45430m018J83811
$$ 189962 -99785 286383 62535 185401 163013 37827 89259 110876 556306 552288 736099
15985G36099M70188P3111j87057o8147D87975k7234I3393K74361h1788k7551o0476
$$ 736099 1206287 1279398 1092341 1024194 487975 460741 93393 367754 -81788 -109339 -169815
15974a69815C6461e4902D76059H9327E163O4710J9403a58832J6556J6521F2561
$$ -169815 36461 -54902 476059 89327 5163 69873 89276 -158832 -142276 -125755 62561
15962A8563M0636L15199g7935B35220c47610E2466b3042B29842c0853o53E5179
$$ 18563 59199 374398 -77935 235220 -347610 52466 -23042 229842 -30853 -31506 55179
15950A08580A8368J80273r2541f8110I6185J14823i18D8047J08206D9652M7148
$$ 108580 18368 198641 106100 -68110 96185 211008 -918 48047 156253 49652 96800
15939I6800k2640b98456a04839G0909J11215C563J60905H788K7781K12648r6728
$$ 96800 74160 -298456 -104839 70909 182124 3563 164468 8788 36569 249217 152489
15928A52489J35551A31884a15491k20499C8307c5421A50299i0318j65382B11758
$$ 152489 288040 131884 -115491 -335990 38307 -35421 150299 -90318 -255700 211758
15917A81673E9292e1244k22195P2670e2071b3467A69081b50861B5856e00987B8982
$$ 181673 59292 -51244 -273439 -200769 -52071 -23467 169081 -250861 25856 -500987 28982
15905a7811p7741j87526A47416b2224B03706k7674j225c56401A92722e95201b17224
$$ -17811 -95552 -283078 147416 -22224 203706 176032 174807 -356401 192722 -595201 -217224
15893A5735K9173K3571f7315R65B3439J97096K0954e8158A24302a88037F5302
$$ 15735 44908 68479 -67315 -66350 23439 220535 241489 -58158 124302 -188037 65302
15881b18671J7766A8217Q0193a77434f0155I6186j9386P0471d36591A05119J6308
$$ -218671 -200905 18217 98410 -177434 -60155 96186 76800 147271 -436591 105119 121427
15870A21427a12267M4004r0614p249c0638j20217c0907A50518D6538j3295J0067
$$ 121427 -112267 -68263 -158877 -166126 -30638 -150855 -30907 150518 46538 33243 43310
15859D3310a56096B11836b06311d7634a4224l9992H7983A569K2810a27523d8558
$$ 43310 -156096 211836 -206311 -47634 -14224 -54216 87983 1569 24379 -127523 -48558
15847C3198K06400N6045a18077c3658A06346J98581b41820D37933b6935A31475
$$ 33198 239598 295643 -118077 -33658 106346 304927 -241820 437933 -26935 131475
15836F7247h8992A66000j5788n5036b10309m73708C70550b41004J15054H8944
$$ 67247 -88992 166000 150212 95176 -210309 -684017 370550 -241004 -125950 88944
15825A45339a86844D05099A59703B0109a11602k49249e2020A34974J6482J39517
$$ 145339 -186844 405099 159703 20109 -111602 -360851 -52020 134974 151456 290973
15815B90973a35592p6265e5916p4644a9062A91084h8767a066k34797a03429C7731
$$ 290973 -135592 -211857 -55916 -130560 -19062 191084 -88767 -1066 -235863 -103429 37731
15803a58496f1933k82326J48203A4180a57620m9661f6557J18D0848P302K440K2864
$$ -158496 -61933 -344259 -196056 14180 -157620 -207281 -66557 -66439 40848 48150 50590 73454
15791G3454b7336k14988A10126b63199B33633A10130J15384b30035g4638k76611
$$ 73454 -27336 -242324 110126 -263199 233633 110130 225514 -230035 -74638 -351249
15781c51249R1383B5567a67535a8973A30352c13584g5761D0673b63635d8461A77993
$$ -351249 -259866 25567 -167535 -18973 130352 -313584 -75761 40673 -263635 -48461 177993
15769h9498G709J97153i1157n0968j49306F884b11790g4531c5336B12900J14916
$$ -89498 7709 204862 -91157 -142125 -291431 6884 -211790 -74531 -35336 212900 327816
15758C27816A15143d97804b10967A10310K80511f7270o2103B21745h173B26144
$$ 327816 115143 -497804 -210967 110310 390821 -67270 -129373 221745 -8173 226144
15747A60588K25442a27908A94704C8956g2555p8664k8970C9251J95434G2674b04392
$$ 160588 386030 -127908 194704 38956 -72555 -151219 -180189 39251 234685 72674 -204392
15735a25606J3465E5805a64057f8198J2695F501c46178A39885F4552J43747G4488
$$ -125606 -112141 55805 -164057 -68198 -55503 6501 -346178 139885 64552 208299 74488
15723a53992j97919n5902i7435A71657P5116a5128l24770k3066g9371A07118b88152
$$ -153992 -351911 -407813 -97435 171657 246773 -15128 -339898 -362964 -79371 107118 -288152
15711a91709O7691p66B989c59964f142A80070b72512a07234B15394i3687n6565
$$ -191709 -124018 -124784 2989 -359964 -6142 180070 -272512 -107234 215394 -93687 -150252
15700a50252k16454J54803N7958A22779E4440k5670N6213l7638K75681I7795k9640
$$ -150252 -366706 -211903 -153945 122779 54440 28770 84983 47345 323026 97795 68155
15689F8155m24M8160b15086B25769C569J21975a7645G2020e7916n9995N2184j04625
$$ 68155 67731 115891 -215086 225769 3569 125544 -17645 72020 -57916 -117911 -65727 -170352
15677a70352a2916p6424l37451K03272f7686A84393E7585L3581K1825a7128A56461
$$ -170352 -12916 -89340 -426791 -223519 -67686 184393 57585 91166 112991 -17128 156461
15665A80807h0881n2840L2793M4661B73009m6804b00004Q0122j72904b5616H1327
$$ 180807 -80881 -133721 -100928 -56267 273009 226205 -200004 -119882 -292786 -25616 81327
15653d7357A97942d3166j18704n4854a8308k15067A10270N5943K6130g3401K2304
$$ -47357 197942 -43166 -161870 -216724 -18308 -233375 110270 166213 192343 -73401 -51097
15642e1097a9055k03196B42222b52273B03355r7935b8679a2675E4658b51253f3679
$$ -51097 -19055 -222251 242222 -252273 203355 105420 -28679 -12675 54658 -251253 -63679
15630a34570o1110Q8907G3752e0578l12442A65304b4515q973Q494C65564B585
$$ -134570 -195680 -106773 73752 -50578 -363020 165304 -24515 -33488 -24994 365564 2585
15618C94941I9434B3498J6581L0212c05301D4428g7225l02513h5980A91714r3025
$$ 394941 99434 23498 40079 70291 -305301 44428 -77225 -379738 -85980 191714 98689
15607I8689G996J35104J75098d2877k31432A38819c0114B31941i117l23105c4759
$$ 98689 7996 143100 318198 -42877 -274309 138819 -30114 231941 -9117 -332222 -34759
15595C418J42650c03363a5921j31332O8959q6231B00375b82959A51286N8642a80780
$$ 3418 146068 -303363 -15921 -147253 -78294 -164525 200375 -282959 151286 209928 -180780
15583A71017j4943B6418a06622O945k5833D4941K61052H6761l8028c89778j27495
$$ 171017 156074 26418 -106622 -99677 -125510 44941 305993 86761 48733 -389778 -517273
15572e17273a40783N2483A02202l4213J39759d85637J99846q3833C0354d3438
$$ -517273 -140783 -88300 102202 67989 207748 -485637 -285791 -369624 30354 -43438
15561H0832c46646J67300F8263i9300D1883a4341K577G8325C2089g1977A22300
$$ 80832 -346646 -179346 68263 -99300 41883 -14341 -11764 78325 32089 -71977 122300
15549A19264B5755q870e5281J8910j10745b4581j76525D42501A42944l6587J65510
$$ 119264 25755 16885 -55281 -36371 -147116 -24581 -201106 442501 142944 106357 271867
15538B71867b03327o6259B03393m924B191g2641a3957I265c9767A77809h8829
$$ 271867 -203327 -269586 203393 198469 2191 -72641 -13957 9265 -39767 177809 -88829
15526a58217D47331f6182A80526J31172a22854k16232A78358o8170D5099K98475
$$ -158217 447331 -66182 180526 311698 -122854 -339086 178358 110188 45099 343574
15516C43574a34370C27297a90177F1687J99996j08724b3331A05078b21446A05899
$$ 343574 -134370 327297 -190177 61687 261683 152959 -23331 105078 -221446 105899
15505B19275o0963E7297a71852f0042B40466o9150O6639k955c29145B15834a17128
$$ 219275 158312 57297 -171852 -60042 240466 171316 237955 235000 -329145 215834 -117128
15493b06073f1938A02855N310K3171b2214A2973a75087C9759j1663h0212C61014
$$ -206073 -61938 102855 108165 131336 -22214 12973 -175087 39759 28096 -80212 361014
15481E01893a1221j16894B77260j06176B8649L87269j01071l7288J33096J76383
$$ 501893 -11221 -128115 277260 171084 28649 415918 314847 277559 410655 587038
15471E87038A69400L63880A82193h1744c4935A16855a85233P7798C32779J2428
$$ 587038 169400 533280 182193 -81744 -34935 116855 -185233 -107435 332779 345207
15461C45207j19476B3690M3425C1543M15L49921c42550k8445a35972B8706d36568
$$ 345207 225731 23690 67115 31543 31958 381879 -342550 -370995 -135972 28706 -436568
15449f3841B41944i0357j08651i4375B00214J9641n6445N69356L85395O5404k48554
$$ -63841 241944 -90357 -199008 -94375 200214 219855 163410 732766 1118161 1183565 935011
15438I35011k61371B14704L03130A69381J17544C5200a95269C56299a44398C8929
$$ 935011 673640 214704 517834 169381 286925 35200 -195269 356299 -144398 38929
15427B06625N7590a91960k45514I036K19130r1764Q0087g018p6520r6151J1358
$$ 206625 264215 -191960 -437474 9036 228166 136402 216489 -7018 -83538 -179689 -168331
15416a68331j3328f9983K1774j38276F3838a63341C1332K3780R8280D3023K68133
$$ -168331 -181659 -69983 -48209 -186485 63838 -163341 31332 55112 153392 43023 311156
15405C11156A3714b10214f3390m8630A21387p696c65786a2709p1231n5314B30095
$$ 311156 13714 -210214 -63390 -112020 121387 113691 -365786 -12709 -83940 -139254 230095
15393I7063L1883b06432A33188N7314H9576d6726A06155A6194K78522a08224G5988
$$ 97063 128946 -206432 133188 190502 89576 -46726 106155 16194 294716 -108224 75988
15381d298o8063A82473a52808j8511E3292K56144n5427L0943j12586J01549B2168
$$ -4298 -72361 182473 -152808 -171319 53292 309436 254009 284952 172366 273915 22168
15369B20467j0436a08921k0912B18295I8878c222k31573A41120P7766f8504C35324
$$ 220467 210031 -108921 -129833 218295 98878 -3222 -234795 141120 218886 -68504 335324
15357B15115I7771J12326J47344A76300K66901a05935A42306J42731F2674L2691
$$ 215115 97771 210097 357441 176300 443201 -105935 142306 285037 62674 95365
15347I5365m3804K67937L2268a75522C13977K39074b5538D88651I3056a60349
$$ 95365 51561 319498 351766 -175522 313977 553051 -25538 488651 93056 -160349
15336a29579j75565B77554h7294j63901A79484o381K63245A50877D1292K79747
$$ -129579 -305144 277554 -87294 -251195 179484 173103 436348 150877 41292 321039
15326C21039A24750J36950r4079G311J30345a90695L1414C44102A51079b18358
$$ 321039 124750 261700 167621 7311 137656 -190695 -159281 344102 151079 -218358
15315A38140n6061b02964F50872k74422j08147g1235D11475A57168f7437j0636
$$ 138140 82079 -202964 650872 376450 268303 -71235 411475 157168 -67437 -78073
15305g8073B91465G9790N2066G780L2141J04909l6873L10305A55102J68518l9873
$$ -78073 291465 79790 131856 7780 39921 144830 107957 418262 155102 323620 283747
15294B83747b26135A33248b63888A76349F6385J57910l0341o4107g7440B87510
$$ 283747 -226135 133248 -263888 176349 66385 224295 193954 129847 -77440 287510
15283E577Q7335m0651d18433A55229J45645e3087K4651B3783M612h7493C86125
$$ 5577 92912 52261 -418433 155229 300874 -53087 -28436 23783 28395 -87493 386125
15271A40507F5880i8427j69776a17269M438K6483C37674A11886k218n2130c5762
$$ 140507 65880 -98427 -268203 -117269 -112831 -86348 337674 111886 109668 57538 -35762
15259d6976M502G4339l1965K22738j08783A8185L89582C7937N9193J0239K76079
$$ -46976 -42474 74339 42374 265112 156329 18185 407767 37937 97130 107369 383448
15248C83448j26636J2743p0020J08929p8151N42159R05119M99143o44266J44219
$$ 383448 256812 269555 199535 308464 230313 772472 1677591 2176734 1532468 1676687
15238A676687k80599A69666n9384Q2855E5060A7087P633r603J080L1804K73546
$$ 1676687 1396088 169666 110282 193137 55060 17087 24720 15117 16197 48001 321547
15227C21547M0959c8526I0346c42073a8983B25183g2842K6014F1753b07539G4288
$$ 321547 362506 -38526 90346 -342073 -18983 225183 -72842 -46828 61753 -207539 74288
15215a927E519O2162J89316e5992b0275A90861F0361a26610D1039J24401m0759
$$ -1927 5519 67681 256997 -55992 -20275 190861 60361 -126610 41039 165440 124681
15204A24681b19580C8342J60613b23655G1188m131J25473e4266B49320P465d29914
$$ 124681 -219580 38342 198955 -223655 71188 67057 192530 -54266 249320 256785 -429914
15192h2438A50499L4278f7050d198A27792L21023C7599L2223b2000C24512r2951
$$ -82438 150499 184777 -67050 -4198 127792 448815 37599 69822 -22000 324512 231561
15181B31561A2842Q725a47559f1632B82253A09469h0097A68717C9872f9812B31891
$$ 231561 12842 21567 -147559 -61632 282253 109469 -80097 168717 39872 -69812 231891
15169A39147h0961I5497M5884b14660i7487B44845A03020Q1692a17282B3926f9827
$$ 139147 -80961 95497 141381 -214660 -97487 244845 103020 184712 -117282 23926 -69827
15157I4278h8108k90928D9001M4869P6735D9283b85441f73C63267D6962j5872
$$ 94278 -88108 -379036 49001 93870 170605 49283 -285441 -673 363267 46962 31090
15146C1090c05445A3667R3312J92288A01413J8368E0599a7934r2845j07804A97114
$$ 31090 -305445 13667 106979 299267 101413 119781 50599 -17934 -110779 -218583 197114
15134F0165K41135A26699j5855n5127K7253P7865j46k9588a41672C33605C4777
$$ 60165 301300 126699 110844 55717 82970 160835 160689 131101 -141672 333605 34777
15122C37832r2145j07157C7293M12571j10055r0539j18410F4074i4463F2821B774
$$ 337832 245687 138530 37293 449864 339809 249270 130860 64074 -94463 62821 2774
15110A54872K45573o5570b8444B08055C4305p051a00016C8693h0367A45208B8725
$$ 154872 400445 334875 -28444 208055 34305 27254 -100016 38693 -80367 145208 28725
15098B73999i9123C7646K0571J36458o0317F989J1335K56640b91762A53850b7684
$$ 273999 -99123 37646 58217 194675 134358 6989 18324 274964 -291762 153850 -27684
15086B37206A17978k306j8334J58238G8700P0841m8471D2206b00655I2976M7047
$$ 237206 117978 115672 97338 255576 78700 149541 101070 42206 -200655 92976 140023
15075A40023P4997d3278B8416Q8459L97310D3225c2225E8361O5255a81102G6159
$$ 140023 215020 -43278 28416 116875 514185 43225 -32225 58361 123616 -181102 76159
15063A14847O1828K77726A07433c85B94093a97667B02316J46287K35305B18673
$$ 114847 176675 454401 107433 -385 294093 -197667 202316 348603 583908 218673
15052G8298b77507I5554e8759C31017D4420L34021D5607L23375M3571j15722N6192
$$ 78298 -277507 95554 -58759 331017 44420 378441 45607 368982 412553 296831 353023
15041C53023K68566p3973J81409B22847N4634l5011G5570M08355j56948E2760
$$ 353023 621589 547616 729025 222847 277481 242470 75570 483925 326977 52760
15030C43780K71883l7520K19097C84093J60522J60680k77544L7988K12449B89490
$$ 343780 615663 578143 797240 384093 544615 705295 427751 465739 678188 289490
15019D06064o7051o4705L26798l6671k69971M7638A66710K45939Q2360A39314
$$ 406064 339013 274308 601106 564435 294464 342102 166710 412649 495009 139314
15008E55663j38384j36549Q7772j01488j09529m977J17876J10684O4560L78802
$$ 555663 417279 280730 368502 267014 157485 152508 270384 381068 445628 824430
14998H24430B70946m6994J58977J88612k33910o9208R7244J01277N4327k16541
$$ 824430 270946 223952 382929 571541 337631 268423 365667 466944 521271 304730
14988C04730M70384j46842j87967K34305B05492L28840K07765M0009m852j0479
$$ 304730 775114 628272 440305 674610 205492 534332 742097 782106 777254 766775
14978G66775B48246L7990K18704J02319j89610O7067L54865j17368j67760K8728
$$ 766775 248246 286236 504940 607259 417649 484716 839581 722213 554453 583181
14968E83181B44749G9258P9624L9642J28602m4846j7699Q4976F9122L06052A04239
$$ 583181 244749 79258 158882 198524 327126 282280 264581 349557 69122 375174 104239
14956C24528p8684K34975L5505j45975K07691q1396N1786j72459j25256J53632
$$ 324528 245844 480819 516324 370349 578040 496644 548430 375971 250715 404347
14946D04347m1465j1807H3163M82172N5559J26109C14611J61422j53316J65285
$$ 404347 362882 351075 83163 565335 620894 747003 314611 476033 322717 488002
14936D88002K37788C30371N2041j36973O44498k68654L38300q5223j4415J42140
$$ 488002 725790 330371 382412 245439 889937 621283 959583 874360 859945 1002085
14926A002085M73562M15010p54547N56184l00288q3046J03917j68050K75549M62048
$$ 1002085 1475647 1890657 1136110 1692294 1392006 1308960 1412877 1244827 1520376 1982424
14916A982424N2175K39706o15607l33196j87696l8736D81958L24504l98167j29451
$$ 1982424 2034599 2274305 1658698 1325502 1137806 1099070 481958 806462 408295 278844
14906B78844J6576J00385K4087j85923J80566m8754K37645B97902p8829C3315
$$ 278844 295420 395805 419892 233969 414535 365781 603426 297902 219073 33315
14895G0700N44054A51154J29333N3467o5359K90935A92416J71585O8477J83130
$$ 70700 614754 151154 280487 333954 268595 559530 192416 364001 432478 615608
14885F15608J00142l4679J46183q1322k49742K48103K16337l23442K6791j29371
$$ 615608 715750 681071 827254 745932 496190 744293 960630 637188 663979 534608
14875E34608L63230m04980m9295l7341K11525j69441o8059O6249K91517l3777
$$ 534608 897838 492858 443563 406222 617747 448306 380247 446496 738013 704236
14865G04236J14221j83478C07977M1808j0744K30373r7918J36797A61888L71080
$$ 704236 818457 634979 307977 349785 339041 569414 471496 608293 161888 532968
14855E32968A43486L01486j02691q4150K02533l8596o2038M7825R6109l7746M8976
$$ 532968 143486 444972 342281 258131 460664 422068 360030 407855 503964 466218 515194
14844E15194L32762M47512o38678M55368o8088p9797k72514P5820J15495C27750
$$ 515194 847956 1295468 656790 1112158 1044070 964273 691759 767579 883074 327750
14833G73331l54421L0133K7532j55438J91059O5315A28421M16981j97408K86262
$$ 773331 418910 449043 476575 321137 512196 577511 128421 545402 347994 634256
14823F34256j75694J13018K06558l67627L24222C43920L85202C18853J20635J12644
$$ 634256 458562 571580 778138 410511 734733 343920 729122 318853 439488 552132
14813E52132j2453L11580k86510J2897j94937M17700j92626K76045j87229J97283
$$ 552132 539679 851259 564749 577646 382709 800409 607783 883828 696599 893882
14803H93882J52236l00498k78004j24309J80875m2364j76606P51J36766K97835
$$ 893882 1046118 745620 467616 343307 524182 481818 305212 305963 442729 740564
14793G40564k15280k14787K26276J7377j8043J8011J51553l1653L7020p4238j40528
$$ 740564 525284 310497 536773 554150 536107 554118 705671 674018 711038 636800 496272
14782D96272j71278J8017L0577K75362n5804o7585K35149N446J2625J52518k34633
$$ 496272 324994 343011 373588 648950 593146 525561 760710 766156 778781 931299 696666
14771F96666k41040J57409j46405j95692L63345Q1181l10566J29904K4719n1907
$$ 696666 455626 613035 466630 270938 634283 715464 404898 534802 559521 507614
14761E07614j3753J23449B57743k4209J97484M1140J3507J00532j16506K69456
$$ 507614 493861 617310 257743 233534 431018 472158 485665 586197 469691 739147
14751G39147j40665k56222q6035R9372L25101K38931l03264R8327l11662K88805
$$ 739147 598482 342260 256225 355597 680698 919629 616365 714692 403030 691835
14741F91835L34824l12423l4412j24202M48875m76850J96517p0893l7857N02086
$$ 691835 1026659 714236 679824 555622 1004497 527647 724164 653271 615414 1117500
14731A117500r968M144m8562q7820N31636K84420M9219m03699k34079r2556j23249
$$ 1117500 1107532 1111676 1063114 975294 1506930 1791350 1840569 1436870 1202791 1110235 986986
14720I86986l7092j60162K4052J74605n5353J34083l80075R3749K68832k26518
$$ 986986 949894 789732 813784 988389 933036 1067119 687044 780793 1049625 823107
14710H23107l38236L26455n733j86017M46604j84650L71956P9657L8484J25033
$$ 823107 484871 811326 805593 619576 1066180 881530 1253486 1333143 1371627 1496660
14700A496660P0636Q7860j27216j39949j68123j57664k79624q4584m0512p6864
$$ 1496660 1567296 1655156 1527940 1387991 1219868 1062204 782580 697996 657484 580620
14690E80620J61865K35331l26857L1882L88778j21699q7859l09490K14086k18035
$$ 580620 742485 977816 650959 682841 1071619 949920 862061 552571 766657 548622
14680E48622R7252K08129k32815J14401K0056K44730l40663N0409J40654J38405
$$ 548622 645874 854003 621188 735589 755645 1000375 659712 710121 850775 989180
14670I89180q0349L8289j95201n7410L15503k47809K17030l02722K46502j33368
$$ 989180 908831 947120 751919 694509 1010012 762203 979233 676511 923013 789645
14660G89645J81309K52390j76520k66743r793R0303j43548M05805J98874j08615
$$ 789645 970954 1223344 1046824 780081 770288 860591 717043 1122848 1321722 1213107
14650A213107L34666o10903K53714k19039J48161P3932k59182j07370J92176j1300
$$ 1213107 1547773 936870 1190584 971545 1119706 1193638 934456 827086 1019262 1007962
14640A007962m2292j11588J35803C43663M82790J48304j53767K18119K0409K44367
$$ 1007962 965670 854082 989885 343663 826453 974757 820990 1039109 1059518 1303885
14630A303885n30271J98538r1066Q3325q4004O7553J85549J41696o5132l97257
$$ 1303885 773614 972152 881086 964411 880407 947960 1133509 1275205 1210073 812816
14620H12816M29410j37276J52961j34135K97285l24756N3005J4914j82117K99211
$$ 812816 1242226 1104950 1257911 1123776 1421061 1096305 1149310 1164224 982107 1281318
14610A281318p6778j10588J58219m2566K92496p7252K52256o51774L04400J07868
$$ 1281318 1204540 1093952 1252171 1209605 1502101 1424849 1677105 1025331 1329731 1437599
14600A437599k14303Q2360K74400r0243k48821j9155M93442k28659j97287j13280
$$ 1437599 1223296 1305656 1580056 1489813 1240992 1221837 1715279 1486620 1289333 1176053
14590A176053L65973n806j19811J83395m23188J23034P8070K17035O5436R8445
$$ 1176053 1542026 1536220 1416409 1599804 1176616 1299650 1377720 1594755 1660191 1758636
14580A758636k7297k65964L35387J46611j86393j23006L02708j09722k5275j70508
$$ 1758636 1731339 1465375 1800762 1947373 1760980 1637974 1940682 1830960 1805685 1635177
14570A635177N3336O2726N60428m70598J98028j7494K17395l8758k7990K75019
$$ 1635177 1688513 1751239 2311667 1841069 2039097 2021603 2238998 2200240 2172250 2447269
14560B447269L5649J21860J5604k19347P22642k84943Q05816J10271O41893L63011
$$ 2447269 2482918 2604778 2620382 2401035 3123677 2838734 3644550 3754821 4396714 4759725
14550D759725J066593J878970L385314R163656J8224518r79470A5456924F567738
$$ 4759725 5826318 7705288 11090602 20254258 38478776 37499306 15456924 6567738
14541C714875p04001q5193l07458N74880J709134q61733j953973p7198r2021m7177
$$ 3714875 3010874 2925681 2618223 3193103 4902237 4040504 2086531 2009333 1917312 1870135
14531A870135k57500K40430j18390L0563n875L98157q1248m75546N32065q6885
$$ 1870135 1612635 1853065 1734675 1765238 1759363 2157520 2076272 1600726 2132791 2045906
14521B045906m3374L88516m87517K26737l70583L49543K00727Q6533J76895k77420
$$ 2045906 2002532 2391048 1903531 2130268 1759685 2109228 2309955 2396488 2573383 2295963
14511B295963J06498P7525k4081k60931M56327L54968p66735J89354K62333P3869
$$ 2295963 2402461 2479986 2455905 2194974 2651301 3006269 2239534 2428888 2691221 2765090
14501B765090j49040l9653r2060J39924j41674K23827J02184l1366r13M6546l4759
$$ 2765090 2616050 2576397 2484337 2624261 2482587 2706414 2808598 2777232 2776319 2822865 2788106
14490B788106r3608M51961j73347J668n4859L02184j56417k84359O66366l59133
$$ 2788106 2694498 3146459 2973112 2974780 2919921 3222105 3065688 2781329 3447695 3088562
14480C088562L01801J25081j09846k89283O36998r8605k04757L14423M1203k33461
$$ 3088562 3390363 3515444 3405598 3116315 3753313 3654708 3449951 3764374 3805577 3572116
14470C572116M9655P3709k26696J22344L91734j79829j66715R0138M28979l47989
$$ 3572116 3621771 3695480 3468784 3591128 3982862 3803033 3636318 3726456 4155435 3807446
14460C807446N56975k93563R6978K92267k4589K8559J10960m38793K33697j1463
$$ 3807446 4364421 4070858 4167836 4460103 4435514 4464073 4575033 4136240 4369937 4358474
14450D358474O81396l08869j71223L67866l9973R9031L05130l40154l3593K23006
$$ 4358474 5039870 4731001 4559778 4927644 4887671 4986702 5291832 4951678 4918085 5141091
14440E141091P5971M0266J16214j85308L32670j30415L80347j06400K47041k17287
$$ 5141091 5217062 5257328 5373542 5188234 5520904 5390489 5770836 5664436 5911477 5694190
14430E694190L00677K99966m19806M98620j29077j03829L32278j17647M72040
$$ 5694190 5994867 6294833 5875027 6373647 6244570 6140741 6473019 6355372 6827412
14421F827412l4593o316N09518p8296L38434J11092k29736j94894M73687j9314
$$ 6827412 6792819 6786503 7296021 7217725 7556159 7667251 7437515 7242621 7716308 7696994
14411G696994l24296L70603L70096J8818k16777L53539J75386R8052K93646K14071
$$ 7696994 7372698 7743301 8113397 8132215 7915438 8268977 8444363 8542415 8836061 9050132
14401I050132k15681K77042J32504j40166K95341K84821l90370L10455O38660
$$ 9050132 8834451 9111493 9243997 9103831 9399172 9683993 9293623 9604078 10242738
14392A0242738N5332O136J07559L88287L51221N61225m26690J59413L98300N40622
$$ 10242738 10298070 10304206 10411765 10800052 11151273 11712498 11285808 11445221 11843521 12384143
14382A2384143J46757R0499Q15961l08501O20802J05893j27228M31441j01907
$$ 12384143 12530900 12621399 13437360 13128859 13749661 13855554 13728326 14159767 14057860
14373A4057860N93018N21283N36392L25435M33428J83546K60889L58217P15743
$$ 14057860 14650878 15172161 15708553 16033988 16467416 16650962 16911851 17270068 17985811
14364A7985811O8724M11935K25152M69606K70911J71867O49713N58221M76955
$$ 17985811 18054535 18466470 18691622 19161228 19432139 19604006 20253719 20811940 21288895
14355B1288895q1873Q24838Q96300K80517P80397P43396L20992K83777R49840
$$ 21288895 21207022 22031860 22928160 23208677 23989074 24732470 25053462 25337239 26287079
14346B6287079P97365P64018P15114O85751Q14265R95833Q63822J284809Q17730
$$ 26287079 27084444 27848462 28563576 29249327 30063592 31059425 31923247 33208056 34025786
14337C4025786P65139J032217J089903R37281J293710J347358J426160J244168
$$ 34025786 34790925 35823142 36913045 37850326 39144036 40491394 41917554 43161722
14329D3161722J664239J382461J331877J676008J527670J745726J745489K552948
$$ 43161722 44825961 46208422 47540299 49216307 50743977 52489703 54235192 56788140
14321E6788140J775658K560494K157315K118600K897458K264116K788124K799034
$$ 56788140 58563798 61124292 63281607 65400207 68297665 70561781 73349905 76148939
14313G6148939L252061L672481L631860L605616L833707M461936M695440M711790
$$ 76148939 79401000 83073481 86705341 90310957 94144664 98606600 103302040 108013830
14305A08013830N154559N421375O115855O082094O434348P246204P479422Q049498
$$ 108013830 113168389 118589764 124705619 130787713 137222061 144468265 151947687 159997185
14297A59997185Q701540Q947959R718260J0764301J0900811J2012325J2174304
$$ 159997185 168698725 177646684 187364944 198129245 209030056 221042381 233216685
14290B33216685J3762105J3815702J4408634J5302280J6106365J5649342J6804657
$$ 233216685 246978790 260794492 275203126 290505406 306611771 322261113 339065770
14283C39065770J6481752J6221235J5955696J5336865J4763339J3310376J1432601
$$ 339065770 355547522 371768757 387724453 403061318 417824657 431135033 442567634
14276D42567634J0032091Q527453O735586N414565L997753P99313l863866p877032
$$ 442567634 452599725 461127178 467862764 473277329 477275082 478074395 474210529 466333497
14268D66333497m841256p908779j1882906j4353874j5759745j6602017j7035034
$$ 466333497 461492241 453583462 441700556 427346682 411586937 394984920 377949886
14261C77949886j7454146j7466534j6872659j6396215j6213450j5399669j4858412
$$ 377949886 360495740 343029206 326156547 309760332 293546882 278147213 263288801
14254B63288801j3907839j3602129j2379829j2213667j1389240j0702362q694797
$$ 263288801 249380962 235778833 223399004 211185337 199796097 189093735 180398938
14247A80398938p887003r529553q255484p303501p329837o734936o042144o436374
$$ 180398938 172511935 162982382 154726898 147423397 140093560 133358624 127316480 120880106
14239A20880106n336805m978706n164086m403698m757613m109273l633596l781190
$$ 120880106 115543301 110564595 105400509 100996811 96239198 92129925 88496329 84715139
14231H4715139k915562l315307l394646k963245k542734k442771l082227k088769
$$ 84715139 81799577 78484270 75089624 72126379 69583645 67140874 64058647 61969878
14223F1969878k281068k194892j786525j710553j791888k141271j407437j462309
$$ 61969878 59688810 57493918 55707393 53996840 52204952 50063681 48656244 47193935
14215D7193935j541800j261921j356321j268537j596961j159708j143747o53553
$$ 47193935 45652135 44390214 43033893 41765356 40168395 39008687 37864940 37211387
14207C7211387q32692j459609r91848j110067n88216r44135o27792o26035q73672
$$ 37211387 36378695 34919086 33927238 32817171 32228955 31284820 30657028 30030993 29157321
14198B9157321p03202r23279o12183o84207p50782m15640q10465k54182r85006
$$ 29157321 28454119 27530840 26918657 26234450 25483668 25068028 24257563 24003381 23018375
14189B3018375p16063n6535q15228m76202m36481n36697q73160K32752p95910
$$ 23018375 22302312 22245777 21430549 20954347 20517866 19981169 19108009 19340761 18544851
14180A8544851k30504m6058n30976j60932q45272p4154m30849j69442l63594j69935
$$ 18544851 18314347 18268289 17737313 17576381 16731109 16656955 16226106 16056664 15693070 15523135
14170A5523135n19502j69250k35935k75777k48716j59611k90473k21005j12033
$$ 15523135 15003633 14834383 14598448 14322671 14073955 13914344 13623871 13402866 13290833
14161A3290833k42911j38127n58396k28554k3946n36015L60636n48382K76131
$$ 13290833 13047922 12909795 12351399 12122845 12098899 11562884 11923520 11375138 11651269
14152A1651269k45454m72530k51852k16420L50161m27588j56469m67457L07769
$$ 11651269 11405815 10933285 10681433 10465013 10815174 10387586 10231117 9763660 10071429
14143A0071429k74870L9950k52779j89591K1807n37597L6497j96405k24129l43289
$$ 10071429 9796559 9836509 9583730 9394139 9415946 8878349 8914846 8718441 8494312 8151023
14133H151023M17121n15468J53135l33094J42944m86364l5124q72k55467J14534
$$ 8151023 8568144 8052676 8205811 7872717 8015661 7529297 7494173 7493301 7237834 7352368
14123G352368k72592k16714N69880m41973k59804l9919j42224P4346j10315k45896
$$ 7352368 7079776 6863062 7432942 6990969 6731165 6691246 6549022 6623368 6513053 6267157
14113F267157k27798J36789J06551n11586K16220j48532n1235K02993n10083L49183
$$ 6267157 6039359 6176148 6282699 5771113 5987333 5838801 5787566 5990559 5480476 5829659
14103E829659m44654L7443M8176p854n33631L89910j9284L1022k34138j22395
$$ 5829659 5385005 5422448 5470624 5462770 4929139 5319049 5299765 5330787 5096649 4974254
14093D974254j70078Q7184j41462j91491M92296k61749j28121j58682l62012M40062
$$ 4974254 4804176 4891360 4749898 4558407 5050703 4788954 4660833 4502151 4140139 4580201
14083D580201k46552o8308n3551K9525N2599j81320K25448r981n1335k06224j49061
$$ 4580201 4333649 4265341 4211790 4241315 4293914 4112594 4338042 4328061 4276726 4070502 3921441
14072C921441j01915J68857J45717n55839J99429K6667L2671j30660j65496J07701
$$ 3921441 3819526 3988383 4134100 3578261 3777690 3804357 3837028 3706368 3540872 3648573
14062C648573K88845j34903l6865j93219K68461n14621R3968K44300k39039j40364
$$ 3648573 3937418 3802515 3765650 3572431 3840892 3326271 3420239 3664539 3425500 3285136
14052C285136k91377M936J14002K0813j82461K8117J06379Q6559k98240k30482
$$ 3285136 2993759 2998695 3112697 3133510 2951049 2979166 3085545 3172104 2873864 2643382
14042B643382L44007K0253j9495n9448J186m37395J13266K82274j1286k47787
$$ 2643382 2987389 3007642 2988147 2928699 2929885 2492490 2605756 2888030 2876744 2628957
14032B628957K07304j0281K04326n22622J83207L81962k41754l6351n24799M0471
$$ 2628957 2836261 2825980 3030306 2507684 2690891 3072853 2831099 2794748 2269949 2310420
14022B310420K48975k77360J10045J34152n2508l8750Q3027R0323j97168m085
$$ 2310420 2559395 2282035 2392080 2526232 2473724 2434974 2518001 2608324 2411156 2407071
14012B407071N020m34721Q4295j28704j3208n0490k59821K65596K71567K137k60652
$$ 2407071 2412091 1977370 2061665 1932961 1919753 1869263 1609442 1875038 2146605 2148742 1888090
14001A888090o4770L49917l05429K60958l90880L08930J96314l42163M51420J67668
$$ 1888090 1823320 2173237 1867808 2128766 1737886 2046816 2243130 1900967 2352387 2520055
13991B520055K72635O82518J255821K165715O730870J9245249O386936j7496629
$$ 2520055 2792690 3475208 4731029 6896744 13627614 32872863 39259799 21763170
13983B1763170A0818957l933702j639757j351323m71877j30054l76227k88389
$$ 21763170 10818957 6885255 5245498 3894175 3422298 3292244 2916017 2627628
13975B627628m72861L57972k79697P7215J25469n7621n7285r7116r5608Q2445
$$ 2627628 2154767 2512739 2233042 2310257 2435726 2378105 2320820 2223704 2128096 2210541
13965B210541k93965j25809q3183Q9927J65730O5196p3032L6769l22656K44985
$$ 2210541 1916576 1790767 1707584 1797511 1963241 2028437 1955405 1992174 1669518 1914503
13955A914503k88167L41588K39076l60935l37623L05630K47215n04971K32253
$$ 1914503 1626336 1967924 2207000 1846065 1508442 1814072 2061287 1556316 1788569
13946A788569l66322J16495l05491N61431o5139j19617J67491K68329m19439k88382
$$ 1788569 1422247 1538742 1233251 1794682 1729543 1609926 1777417 2045746 1626307 1337925
13936A337925j18047J59858J6864J53432p7788j38435m1980R3079R5486J88758
$$ 1337925 1219878 1379736 1396600 1550032 1472244 1333809 1291829 1384908 1480394 1669152
13926A669152k05700j80978J28633j8353j39955J9423K44170k53249j55378K47311
$$ 1669152 1463452 1282474 1411107 1392754 1252799 1272222 1516392 1263143 1107765 1355076
13916A355076L12412l01316J22525k67288j3900M08263k89998j22064L1006p9315
$$ 1355076 1667488 1366172 1488697 1221409 1207509 1615772 1325774 1203710 1234716 1155401
13906A155401K76828j35429J12697l0005m65335K72205J53050M547l80295L1358
$$ 1155401 1432229 1296800 1409497 1379492 914157 1186362 1339412 1343959 963664 995022
13896I95022L5273o76L08626l12867J06282L103O093N2687K7455K5443l11456
$$ 995022 1030295 1029619 1338245 1025378 1131660 1134763 1140856 1193543 1220998 1246441 934985
13885I34985K12130p1820J18200N0802k83608p3472L19151j11173j7830k02763
$$ 934985 1147115 1075295 1193495 1244297 960689 887217 1206368 1095195 1077365 874602
13875H74602M19080k00333j88696N9583M5503M4053J13795l1069J58299l36878
$$ 874602 1293682 1093349 904653 964236 1009739 1053792 1167587 1136518 1294817 957939
13865I57939O0778K47379J08205m00666j91268K00635L00027k60078j92836q392
$$ 957939 1018717 1266096 1374301 973635 782367 983002 1283029 1022951 830115 821723
13855H21723M5952M22896m82571J12508Q2205r7240j95858L21405j74062j13857
$$ 821723 867675 1290571 808000 920508 1002713 905473 709615 1031020 856958 743101
13845G43101J06974J94284l39304n9417J9828J83076p5823P3355J52168k29525
$$ 743101 850075 1044359 705055 645638 665466 848542 772719 846074 998242 768717
13835G68717k8040K78141j32075K0956K57386l0401D36448M76704N4537l66416
$$ 768717 740677 1018818 886743 907699 1165085 1134684 436448 913152 967689 601273
13825F01273J82045K24426j40410l32028q1044K13103j68146L98960P645k12160
$$ 601273 783318 1007744 867334 535306 454262 667365 499219 898179 905824 693664
13815F93664K79854M5286D28310K97747J91316j02350j69764O1561k66465j11045
$$ 693664 973518 1018804 428310 726057 917373 815023 645259 706820 440355 329310
13805C29310L37902R7286M4056N19259l12067k12400C70405L24225L4312k10561
$$ 329310 667212 764498 808554 1327813 1015746 803346 370405 694630 728942 518381
13795E18381k6198J45799J68821j92779o3986L10875l28958J16325j01168j0982
$$ 518381 492183 637982 806803 614024 550038 860913 531955 648280 547112 536130
13785E36130m6507m5232M5349K06165K8192j90492O26184D52219J75371O9182
$$ 536130 489623 444391 489740 695905 724097 533605 1159789 452219 627590 696772
13775F96772K24140l64661l6654Q357j29843M64128m5385j69665j15364N7285
$$ 696772 920912 556251 519597 527954 398111 862239 816854 647189 531825 589110
13765E89110j45360N7160K46831j20725k86468K14381k43357K25318K26193j96182
$$ 589110 443750 500910 747741 627016 340548 554929 311572 536890 763083 566901
13755E66901r7220J49067N7768J1901k68894N4632L78353l74737K22768J70499
$$ 566901 469681 618748 676516 688417 419523 474155 852508 477771 700539 871038
13745H71038C20395J12899k8703J5547j05390M45359l14251L448K37137j60184
$$ 871038 320395 433294 404591 420138 314748 760107 445856 449304 686441 526257
13735E26257J59206j24561J414J61529j5445k58902J77405K6484l12714J73862
$$ 526257 685463 560902 562316 723845 708400 449498 626903 653387 340673 514535
13725E14535j82382O44716l14264C27951R6986K7095k08610N8544M07890A99474
$$ 514535 332153 976869 662605 327951 424937 452032 243422 301966 709856 199474
13714D74994k07223J79910m9235J69913j53495B01001L15841j50776M7518J63540
$$ 474994 267771 447681 398446 568359 414864 201001 516842 366066 413584 577124
13704E77124j39903A71899L28596A68912L44834j73697J56634B12682p732k593
$$ 577124 437221 171899 500495 168912 513746 340049 496683 212682 204950 202357
13694B02357L50742j70977K49424A06945L46641j20349K97970k32864J68635k54215
$$ 202357 553099 382122 631546 106945 453586 333237 631207 398343 566978 312763
13684C12763L09225B90774M05295B96874K26382o4996B28140J1731K15909R5865
$$ 312763 621988 290774 696069 296874 523256 458260 228140 239871 455780 551645
13674E51645k61246r4107J71975J99177j98080L6707Q498l7262L6381J89793L11572
$$ 551645 290399 196292 368267 567444 369364 406071 414569 377307 413688 603481 915053
13663I15053A20401K90713K07351B82220M168J79483B28305K77176J62079o5465
$$ 915053 120401 411114 618465 282220 286388 465871 228305 505481 667560 602095
13653F02095A18231K79869K72454j50280B31052N4102A11582L36663P8062B12363
$$ 602095 118231 398100 670554 520274 231052 285154 111582 448245 526307 212363
13642C64784l761K1971k0985f4165B61782K30357b2428B91538K09268A27267L08455
$$ 364784 361023 382994 362009 -64165 261782 492139 -22428 291538 500806 127267 435722
13631D35722J92659P0643l45343J14710M40133C18655L9432r4224J76200j76918
$$ 435722 628381 699024 353681 468391 908524 318655 358087 263863 440063 263145
13621B63145N9706D7812M18349J5227L647p2982a32056C00422r9861r4245R320
$$ 263145 322851 47812 466161 481388 485035 412053 -132056 300422 200561 106316 115636
13610A15636J56475M52437l13066k3442m8226Q9901K4093B10731a12922E3252
$$ 115636 272111 724548 411482 388040 339814 429715 453808 210731 -112922 53252
13599C51458j00111L09337B08612Q2424N3278L0389B5323c8257B16488j5707a18497
$$ 351458 251347 560684 208612 291036 344314 374703 25323 -38257 216488 200781 -118497
13587A54663c5232C66094j05616R6732A22689L00091A15295J13163J74773A23597
$$ 154663 -35232 366094 260478 357210 122689 422780 115295 228458 403231 123597
13576C55781J391m587A23154L45591j87072P1426h1209C84156e8727D56217R8091
$$ 355781 357172 352585 123154 468745 281673 353099 -81209 384156 -58727 456217 554308
13565E54308E1156N8998K73320I7161M68471k18200B0400Q2550M79322H3104p948
$$ 554308 51156 110154 383474 97161 565632 347432 20400 102950 582272 83104 75156
13554G5156K40461H0898Q5199E5830L47027r1935J08049j28463j39542L25819
$$ 75156 315617 80898 166097 55830 402857 310922 418971 290508 150966 476785
13544D76785k071g2651D04184A57376K8798R1636K8110n235F9364a14927D51721
$$ 476785 474714 -72651 404184 157376 186174 277810 305920 300685 69364 -114927 451721
13532B19562L33656q4620A88641p218M3773J0852I3436d7595A89495M0051L8403
$$ 219562 553218 468598 188641 181423 225196 236048 93436 -47595 189495 229546 267949
13521B67949j19416J52683A30819k616K18560j02102K3403m5127l1567J01252
$$ 267949 148533 301216 130819 128203 346763 244661 268064 222937 191370 292622
13511B92622k2044J14594j74464J26520j2543H7190K25603J98749R768F5876Q6058
$$ 292622 270578 385172 210708 337228 324685 87190 312793 511542 521310 65876 151934
13500A51934n3724l7219g152A22117K7850o5573O7089J03755J51227J82580A58516
$$ 151934 98210 60991 -7152 122117 149967 84394 151483 255238 406465 589045 158516
13488A73470J38708I0101K88170E3834P4584J68177J49507k364H3326R6671C0029
$$ 173470 312178 90101 378271 53834 128418 296595 446102 443738 83326 179997 30029
13476A05765J7037l3474R5221o5495O2576B8692K15884A0785N6625K88113A50486
$$ 105765 122802 89328 184549 119054 181630 28692 244576 10785 67410 355523 150486
13464I9972l6857J39339r9821P2729J19375m3195B3798J21843h0905B46995a6009
$$ 99972 63115 202454 102633 175362 294737 251542 23798 145641 -80905 246995 -16009
13452A57544N15468a8258A88611q0342J76072d6702B70993m5302K11538N5432
$$ 157544 673012 -18258 188611 108269 284341 -46702 270993 225691 437229 492661
13442D92661B19963C328L20609b7927A40944R798b4544A06645M2263l9822G26
$$ 492661 219963 3328 323937 -27927 140944 150742 -24544 106645 148908 109086 726
13430H4932P7107K22868A88366G7525L11042F9359K16605j11339P4654f3317A23390
$$ 84932 162039 384907 188366 77525 388567 69359 285964 174625 249279 -63317 123390
13418B13934H5282K92570A86494P3777k0181F7919K53403q1680m8791q9729L2568
$$ 213934 85282 377852 186494 260271 240090 67919 321322 239642 190851 101122 133690
13407A33690c9717B88078A03216M1551B184L51609d3133C5351b54124F67646b9793
$$ 133690 -39717 288078 103216 144767 2184 353793 -43133 35351 -254124 667646 -29793
13395F932N10270A94751C7203a65655C12239K07421B07268L6307K0838C7174O7777
$$ 6932 517202 194751 37203 -165655 312239 519660 207268 243575 264413 37174 104951
13384A04951N424m7662J71205A15893J52188k6455A11361K0206J62370R1191j69548
$$ 104951 110375 62713 233918 115893 268081 241626 111361 131567 293937 385128 215580
13373B15580p271b9840C95428o8893a5202j61921e8389B48122C8367J33165L40899
$$ 215580 208309 -29840 395428 326535 -15202 -177123 -58389 248122 38367 171532 512431
13362E12431b1322A38270J9199P0352J64051j83206p1317m5391a47814C81013
$$ 512431 -21322 138270 157469 227821 391872 208666 137349 91958 -147814 381013
13351B74549a13416A76828J5060n7157d287B62407D7872K09568E1869K6938K11552
$$ 274549 -113416 176828 191888 134731 -4287 262407 47872 257440 51869 78807 290359
13340B90359N27H341Q6390L65860h2471E35857B23748E5173Q6708D5724J56848
$$ 290359 290886 8341 94731 460591 -82471 535857 223748 55173 141881 45724 202572
13329B02572f0194C15598G8026J50013M2302b6657A24768C1471e363I9755a64264
$$ 202572 -60194 315598 78026 228039 270341 -26657 124768 31471 -5363 99755 -164264
13317B09492a088B1184K50811a51217I1833Q825m3957j1244J18793h2745B06322
$$ 209492 -1088 21184 271995 -151217 91833 100658 56701 45457 164250 -82745 206322
13305B80673K16360A66486J40820r0339f1324n4399C07430j31610h8336F5194
$$ 280673 497033 166486 307306 216967 -61324 -115723 307430 175820 -88336 65194
13294A92782I3850J06687D4318P9989c6950k0857K6382B58990P7908j61512J9085
$$ 192782 93850 200537 44318 124307 -36950 -57807 -31425 258990 336898 175386 194471
13283A94471a5352l0804E9606B5219Q0335l3334K15151f8573q0454C86391j58715
$$ 194471 -15352 -46156 59606 25219 105554 72220 287371 -68573 -149027 386391 227676
13272B27676c30938J53539c559l28370b4865A24782N9632d7989D24630e0208k8985
$$ 227676 -330938 -177399 -3559 -331929 -24865 124782 184414 -47989 424630 -50208 -79193
13261g9193B38576l9758J87813p401A03882l3056e8823C54198h3005n3590B12214
$$ -79193 238576 198818 386631 379230 103882 70826 -58823 354198 -83005 -136595 212214
13249a16671b1327I0426A4296b9872k00174B28289k4864R6844D1874L6668b1552
$$ -116671 -21327 90426 14296 -29872 -230046 228289 203425 300269 41874 78542 -21552
13237C73642G0467b54735I1606j9212K6126b5893k2448n3785a4273A85777J25674
$$ 373642 70467 -254735 91606 72394 98520 -25893 -48341 -102126 -14273 185777 311451
13226C11451A23931P0626p7342i3421j7882C5717K5760K5224K71341j01638d1388
$$ 311451 123931 194557 117215 -93421 -111303 35717 61477 86701 358042 256404 -41388
13214A0431Q6597L9598b9557H2894R9J36321f188q5912k30114A93805a5407r2690
$$ 10431 97028 136626 -29557 82894 82993 219314 -6188 -92100 -322214 193805 -15407 -108097
13202a08097D0165J24321D0302J9486P2169K41577A74102B2811O4622J31990J38920
$$ -108097 40165 164486 40302 59788 131957 373534 174102 22811 87433 219423 358343
13191C58343A26009c23066A21905E4281J81949d5470E09651A16664B4986d8826
$$ 358343 126009 -323066 121905 54281 236230 -45470 509651 116664 24986 -48826
13180a87699C14140A22670i1613A35451B3337K56720H3904J9323J22179L80859
$$ -187699 314140 122670 -91613 135451 23337 280057 83904 103227 225406 606265
13170F06265B48910l503a99213E04405F7878N4559i8045A16003Q0149c4870o1069
$$ 606265 248910 245407 -199213 504405 67878 122437 -98045 116003 196152 -34870 -95939
13159i5939A7080f7030j88009a23822m23230I5390l0729J34683a23869A73158
$$ -95939 17080 -67030 -255039 -123822 -547052 95390 64661 199344 -123869 173158
13148D2933L0516R5975d6840q1467M1348H3258K42045A1237J91036N4763g9048
$$ 42933 73449 169424 -46840 -128307 -86959 83258 325303 11237 202273 257036 -79048
13136C3279J6978k5110b86340a12605C8051a18243I3297J2589B8667b42229F8779
$$ 33279 50257 25147 -286340 -112605 38051 -118243 93297 105886 28667 -242229 68779
13124D70127A4021P1283K7727a12323D0556R5338E4790O9811C1828M3369a28672
$$ 470127 14021 85304 113031 -112323 40556 135894 54790 124601 31828 75197 -128672
13112B97623a07807A00210k5149B2678J72056A932L4189K52473b75387j888D5274
$$ 297623 -107807 100210 75061 22678 194734 1932 36121 288594 -275387 -277275 45274
13100a82821C30730c03767A59896a8246F3725A1268K48538A03925D8446c30667
$$ -182821 330730 -303767 159896 -18246 63725 11268 259806 103925 48446 -330667
13089b80049a5310k27720c7982H3324O9567p3444a8213E4374d5446a6276G1609
$$ -280049 -15310 -243030 -37982 83324 152891 79447 -18213 54374 -45446 -16276 71609
13077a63804C13603b07880B72754c2120j24100A45711D8007O8413J55692b88571
$$ -163804 313603 -207880 272754 -32120 -156220 145711 48007 116420 272112 -288571
13066D2164J42459A5619M4672A8462L8390k4489K73384A44246a55748f3850p3241
$$ 42164 184623 15619 60291 18462 56852 32363 305747 144246 -155748 -63850 -137091
13055a37091A22561F320b04675C8467a47814B03180q3168b04431Q5425B66449
$$ -137091 122561 6320 -204675 38467 -147814 203180 120012 -204431 -119006 266449
13044E9995K10543a82468B27332a7354j19276G3594b8418D695J00797K38818H3557
$$ 59995 270538 -182468 227332 -17354 -136630 73594 -28418 4695 105492 344310 83557
13032a59099p8721A66610B4461a5972D5847J06864i0770R210A22543I392M6652
$$ -159099 -237820 166610 24461 -15972 45847 152711 -90770 -81560 122543 9392 56044
13021E6044K92664H7596a61775A31006b96410B90395a732o2533A21466j3629C3318
$$ 56044 348708 87596 -161775 131006 -296410 290395 -1732 -64265 121466 107837 33318
13009b51510I4095L75458k15965a1573A9683K72920a67539j20429b3169A92819
$$ -251510 94095 469553 253588 -11573 19683 292603 -167539 -287968 -23169 192819
12998B86674n0731b02189I1836b33304J08564I1666a7836A32125j1094A9615a34630
$$ 286674 235943 -202189 91836 -233304 -124740 91666 -17836 132125 121031 19615 -134630
12986h8839H712Q567b75078J32543n8598E03370j00273j8267b2504p2298H3317
$$ -88839 8712 17279 -275078 -142535 -201133 503370 403097 384830 -22504 -94802 83317
12974A04019l3821a85360k1852d875k18144C07574A0899a11490A6143a32346B585
$$ 104019 70198 -185360 -207212 -4875 -223019 307574 10899 -111490 16143 -132346 2585
12962G7554K30653A09144a68511A78048C0255d33913A54581O9200P2299c02989
$$ 77554 308207 109144 -168511 178048 30255 -433913 154581 223781 296080 -302989
12951B55761J39662c22290E4525K39811A38323f2479B14983m0029h6161G2613
$$ 255761 395423 -322290 54525 294336 138323 -62479 214983 174954 -86161 72613
12940B03901P7641A04049a67979i063G9986b9600A6513a77564l8178A01342f2535
$$ 203901 281542 104049 -167979 -9063 79986 -29600 16513 -177564 -215742 101342 -62535
12928b41214G460L34065A45657a02684C26165K50145d9515k04769B22236a42038
$$ -241214 7460 341525 145657 -102684 326165 576310 -49515 -254284 222236 -142038
12917H3278J21601D0342K61818j19331b4108B27455d9839k1258r9237e2612A46753
$$ 83278 204879 40342 302160 182829 -24108 227455 -49839 -71097 -170334 -52612 146753
12905A2449J90421B0005J39655g5609j32600m54682D46270c1922D2559J08546
$$ 12449 202870 20005 159660 -75609 -208209 -662891 446270 -31922 42559 151105
12895A51105a82269D23448a20015E402J91056i443r986j78310e0931A36621d71701
$$ 151105 -182269 423448 -120015 5402 196458 -9443 -19429 -197739 -50931 136621 -471701
12883C60335a09020D5195J8699c92407I2022M8482J11696c5042B14535b75607
$$ 360335 -109020 45195 63894 -392407 92022 140504 252200 -35042 214535 -275607
12872D927L422L3020Q3610a53685M8781B77730a58523l7205c8893G2631a05923
$$ 4927 8349 41369 124979 -153685 -104904 277730 -158523 -195728 -38893 72631 -105923
12860F1633a55556A20041f5016l72166B92680a78880I7550d34419e2130j74791
$$ 61633 -155556 120041 -65016 -437182 292680 -178880 97550 -434419 -52130 -226921
12850b26921B95995A42613k0084J7879e5068A06009c49191a7182j38042A92004
$$ -226921 295995 142613 122529 140408 -55068 106009 -349191 -17182 -155224 192004
12839D58642c39281C554J72137a59694e331G9789K35913K988j08603g1332B40021
$$ 458642 -339281 3554 175691 -159694 -5331 79789 315702 318690 210087 -71332 240021
12827a44656C593J74551b27322M0596C79894a57780A10885h277A87894h6751H5467
$$ -144656 3593 178144 -227322 -186726 379894 -157780 110885 -8277 187894 -86751 85467
12815b8466k81681k1452Q4948q9547B8282a02896K4900L5041j21186E8849J61794
$$ -28466 -310147 -331599 -246651 -336198 28282 -102896 -77996 -42955 -164141 58849 220643
12804B20643a45939C9105b49565q2045b8578o7504j38586c0624H88d75756C5001
$$ 220643 -145939 39105 -249565 -331610 -28578 -96082 -234668 -30624 888 -475756 35001
12792b05985d7254I3296i0193j72704I1132P5531b34790A90036R3658H8153A8035
$$ -205985 -47254 93296 -90193 -262897 91132 166663 -234790 190036 283694 88153 18035
12780A68125k0192a50278B25840a65807E4308a11304D8840L9697a88118O9377
$$ 168125 147933 -150278 225840 -165807 54308 -111304 48840 88537 -188118 -118741
12770a18741k09690a20488A73453C2289P5618d2981r188m21741C2786L25259F6554
$$ -118741 -328431 -120488 173453 32289 107907 -42981 -52169 -473910 32786 358045 66554
12758g9569A91247a13018B7421J43809q3836J34836f2404a3640j67912h0241I8696
$$ -79569 191247 -113018 27421 171230 87394 222230 -62404 -13640 -181552 -80241 98696
12746B2823c336o7217r8143C9140e853F5795L48076b898B42283b0143A3772d9438
$$ 22823 -3336 -70553 -168696 39140 -5853 65795 413871 -2898 242283 -20143 13772 -49438
12733d1382A29386d2895B194i3523C77552c11890J38352D0402M481J95171J64199
$$ -41382 129386 -42895 2194 -93523 377552 -311890 -173538 40402 44883 240054 404253
12722D04253b03674E12246a61580D2363K52727A40851L693h9060j89297B13662
$$ 404253 -203674 512246 -161580 42363 295090 140851 144544 -89060 -278357 213662
12711a08007F2702J71052i1949A26360M17207B0231J28856d6209j44393B02654
$$ -108007 62702 233754 -91949 126360 543567 20231 149087 -46209 -190602 202654
12700B1977K59113g4519c2184m1262B6978C563M9353M7490M8082K00128l9107
$$ 21977 281090 -74519 -32184 -73446 26978 3563 52916 100406 148488 348616 309509
12689C09509M4669c12438C12791j33099a57369D5674M33468f9901B31108b50214
$$ 309509 354178 -312438 312791 179692 -157369 45674 479142 -69901 231108 -250214
12678B24969O3689a40461C10277h5529K9885D1920j7500K09624B6177J51795b31578
$$ 224969 288658 -140461 310277 -85529 -55644 41920 24420 234044 26177 177972 -231578
12666b00596C2373L0923b31096A83726i114j86959A25522b69762G2326c2619j8466
$$ -200596 32373 63296 -231096 183726 -9114 -196073 125522 -269762 72326 -32619 -51085
12655e1085j68205A95445a24031j50729A93939a74643b4794B26685P7063A51176
$$ -51085 -219290 195445 -124031 -274760 193939 -174643 -24794 226685 303748 151176
12644D2732H661i9942d8190o8659F2312b0448E5877O0014M1357A4518K81940m5089
$$ 42732 8661 -99942 -48190 -116849 62312 -20448 55877 115891 157248 14518 296458 251369
12632B51369b67863f2163C06252H8639c1074B85831o1540q75i1218E64312B10797
$$ 251369 -267863 -62163 306252 88639 -31074 285831 224291 223416 -91218 564312 210797
12620D14157A86670f5683A47565f5548C813J30274L0802a38329B75470a2944m1157
$$ 414157 186670 -65683 147565 -65548 3813 134087 164889 -138329 275470 -12944 -54101
12609e4101j96022J18602D93768k35194a63019D49L60011a85422B20037q1755
$$ -54101 -250123 -131521 493768 258574 -163019 449 360460 -185422 220037 138282
12599A38282A969L29365k0382A48479k2602L314b50810G5952b21102J5897F3055
$$ 138282 1969 331334 310952 148479 125877 129191 -250810 75952 -221102 -205205 63055
12587A00618C1404J37226a35931E8520c92931B97057b11197D7624b88577C89678
$$ 100618 31404 168630 -135931 58520 -392931 297057 -211197 47624 -288577 389678
12576b02059A48296b40230i5738A8281C458c37510q6598Q0263a8126j358G9827
$$ -202059 148296 -240230 -95738 18281 3458 -337510 -424108 -343845 -18126 -19484 79827
12564c08127B89409b41656F7081a17201A19391b0099B23969H9779c10552e161
$$ -308127 289409 -241656 67081 -117201 119391 -20099 223969 89779 -310552 -5161
12553b11244f9560r6352C13505j08127A9551b25835A69029c834B72423D4699b24711
$$ -211244 -69560 -165912 313505 205378 19551 -225835 169029 -3834 272423 44699 -224711
12541B67996b21298B57483f9923r9750k16401c4944j45768O4641I9822j7660c16522
$$ 267996 -221298 257483 -69923 -169673 -386074 -34944 -180712 -116071 99822 82162 -316522
12529c3318B6382J67712g2916B76464g005j05287A08883I221J14890h8098D1096
$$ -33318 26382 194094 -72916 276464 -7005 -112292 108883 9221 124111 -88098 41096
12517a73475j49761a1965j93599G613K29624c5588C4442c6033A29027i9041E7277
$$ -173475 -323236 -11965 -205564 7613 237237 -35588 34442 -36033 129027 -99041 57277
12505a32562k45541A9752i346k7358k11129B41927j02929e2019o4500k06176e0187
$$ -132562 -378103 19752 -9346 -36704 -247833 241927 138998 -52019 -116519 -322695 -50187
12493H6543a35567A06205J72737a52869A06853N5905b72044a11220J8975A05773
$$ 86543 -135567 106205 278942 -152869 106853 162758 -272044 -111220 -92245 105773
12482A4788a73309E838b00375d5355H7103L2380a42065I8832I644J18529a7963
$$ 14788 -173309 5838 -200375 -45355 87103 119483 -142065 98832 9644 128173 -17963
12470a56451c959m5678B28173J26431E5844i8228A7363R5917b35224a03940L2905
$$ -156451 -3959 -49637 228173 354604 55844 -98228 17363 113280 -235224 -103940 -71035
12459g1035b9727k49154g2339q7311B02226A6005K68614a99450j08075a29026
$$ -71035 -29727 -278881 -72339 -159650 202226 16005 284619 -199450 -307525 -129026
12448C11061C5996a08365G5964j5239c1749A05351d8826A7526e8878j02620P6982
$$ 311061 35996 -108365 75964 60725 -31749 105351 -48826 17526 -58878 -161498 -84516
12437h4516m6551A34469k5503a69404B8936R5892k8564i0287A26328a4727C54442
$$ -84516 -131067 134469 108966 -169404 28936 124828 96264 -90287 126328 -14727 354442
12425A18075k5864d52015A03935a52204A7042c94102a11818j27766L1013H8592
$$ 118075 92211 -452015 103935 -152204 17042 -394102 -111818 -239584 -208571 88592
12414A6116h0801j84146G6707e163k36837h5475A27392K20217G906M4059J50589
$$ 16116 -80801 -264947 76707 -5163 -242000 -85475 127392 347609 7906 51965 202554
12403B02554r5177g0305A86205R348h6883J1604I1920b8762A18333a38560B50515
$$ 202554 107377 -70305 186205 195553 -86883 -75279 91920 -28762 118333 -138560 250515
12391B52874J4472A12889l8833J60722a60927C18802L5541c63H6791K31770b30768
$$ 252874 267346 112889 74056 234778 -160927 318802 354343 -363 86791 318561 -230768
12379G9042B6132a40738B42266f9426D7810K0781a50312J714P4097F6296K21939
$$ 79042 26132 -140738 242266 -69426 47810 68591 -150312 -148598 -74501 66296 288235
12368B88235I5481c06470J1054b1314k98158c1346I5821l3053i079B07713E9063
$$ 288235 95481 -306470 -295416 -21314 -319472 -31346 95821 62768 -9079 207713 59063
12356C68199j50012n7341m7885a62495h878j0501j47738m1731C9746b5033B55669
$$ 368199 218187 160846 112961 -162495 -8878 -19379 -167117 -208848 39746 -25033 255669
12344D0552N7480J27686l0083b3707A43058b09389f1468j5382p2143B10986I4417
$$ 40552 98032 225718 195635 -23707 143058 -209389 -61468 -76850 -148993 210986 94417
12332b97074A10099e987E1385a8133D17094j55780o8845p4003k8515A0418c3078
$$ -297074 110099 -5987 51385 -18133 417094 261314 192469 118466 89951 10418 -33078
12320A89984m0714n2331K2870R2246B0662a12194H8381b99792B65122E7965e5788
$$ 189984 149270 96939 119809 212055 20662 -112194 88381 -299792 265122 57965 -55788
12308a09068F1124J37908r7542j5667B8271J35890A4923a85903C80482j84641
$$ -109068 61124 199032 101490 85823 28271 164161 14923 -185903 380482 195841
12298A95841b2920A8932d6721l2369A26880K65292H6251h3449K1796B68342Q0908
$$ 195841 -22920 18932 -46721 -79090 126880 392172 86251 -83449 -61653 268342 349250
12287C49250n3957m0626f2554G1892F452i9284C50226F0975Q6009f633M29A65574
$$ 349250 295293 254667 -62554 71892 6452 -99284 350226 60975 146984 -6633 -6204 165574
12274A09720A00J92547L0095h5460G3534K17291A34930a93882A13895K21966O4230
$$ 109720 100 192647 222742 -85460 73534 290825 134930 -193882 113895 335861 400091
12263D00091A84838D6550J72405b35494B32278q8070K9010m4752J31876F6710
$$ 400091 184838 46550 218955 -235494 232278 144208 173218 128466 260342 66710
12252C41308l8078a25904F8405J254d3374B65362n3385E658N7464Q5372J78016
$$ 341308 303230 -125904 68405 69659 -43374 265362 211977 5658 63122 148494 326510
12241C26510B9831f4549E07970A93554b4239C4118J54032L12753a16444r5257
$$ 326510 29831 -64549 507970 193554 -24239 34118 188150 500903 -116444 -211701
12231b11701A16994a83721I3836f2328k21526C31971B8397f1339B08045A6250
$$ -211701 116994 -183721 93836 -62328 -283854 331971 28397 -61339 208045 16250
12220C61343o7665q4071n8404J91665k0028q444I2799J56322a9970A05201K47906
$$ 361343 293678 209607 151203 342868 322840 314396 92799 249121 -19970 105201 353107
12209C53107j66978j1262q2055A39N0259P3449B0937K86280h54k65168a933j04497
$$ 353107 186129 174867 92812 139 50398 123847 20937 307217 -854 -266022 -1933 -106430
12197a06430a9057A16162J46033q9128j634n5039J23010K78339k26841H4326h9218
$$ -106430 -19057 116162 262195 173067 171433 116394 239404 517743 290902 84326 -89218
12185G5507i1911A56897o4242b92900A00942a70542A37150l5919R9907P9780n3319
$$ 75507 -91911 156897 92655 -292900 100942 -170542 137150 101231 201138 280918 227599
12174B27599K45747A21531M3699J83640c1789A62905K34019A03302N6784P1574
$$ 227599 473346 121531 165230 348870 -31789 162905 396924 103302 160086 231660
12164B31660J47405a53066D5535A7619K68327c37580P4000A08028g1131e015B06729
$$ 231660 379065 -153066 45535 17619 285946 -337580 -263580 108028 -71131 -5015 206729
12152B06435M5035I4329e0594l27732J84364E5242J413f3632q0173H1314K7786
$$ 206435 251470 94329 -50594 -378326 -193962 55242 56655 -63632 -143805 81314 109100
12141A09100c06165H7149K79901l6513b45020B27393e5622j7526A82870J82416
$$ 109100 -306165 87149 367050 330537 -245020 227393 -55622 -73148 182870 365286
12131C65286F9948L4067a0045k8948C2302a4712A61705B1097K59447Q4831r7894
$$ 365286 69948 104015 -10045 -38993 32302 -14712 161705 21097 280544 365375 267481
12120B67481a098D13343b39000D9138J54558j6326b60962B42095j16673J62197
$$ 267481 -1098 413343 -239000 49138 203696 187370 -260962 242095 125422 287619
12110B87619O7825A4300J02456c49214a48789e577F4156C1776b5469A39017m2286
$$ 287619 355444 14300 116756 -349214 -148789 -5577 64156 31776 -25469 139017 96731
12099I6731c4128k51768b012B40510J54203F6276c77447C2837o422J63526A0468
$$ 96731 -34128 -285896 -2012 240510 394713 66276 -377447 32837 26415 189941 10468
12087A18038l472a15843A42115N7485a36696A65644a23040A16933J6647k9955
$$ 118038 114566 -115843 142115 199600 -136696 165644 -123040 116933 133580 103625
12077A03625c0950A41200E0958J16994a39170j39622B92961F3137c13602J56077
$$ 103625 -30950 141200 50958 167952 -139170 -278792 292961 63137 -313602 -157525
12067a57525A97391a25140B52402a3741m9232l1563I4230a53577J7475F1495g5090
$$ -157525 197391 -125140 252402 -13741 -62973 -94536 94230 -153577 -136102 61495 -75090
12055D56727A06129D747a68585H6915J7746i7766J3525A22511c0561E6372N880
$$ 456727 106129 4747 -168585 86915 104661 -97766 -84241 122511 -30561 56372 62252
12044F2252g1496C8861c80342d7941j242l12212J37753A72979e8868A4711K81324
$$ 62252 -71496 38861 -380342 -47941 -49183 -361395 -223642 172979 -58868 14711 296035
12033B96035a79768B48090d0980j65774A5905L60072A41877a85955j48207H3198
$$ 296035 -179768 248090 -40980 -206754 15905 375977 141877 -185955 -334162 83198
12022A50260k3181a00585B62796n4958c30842A66346o6916K5670J20429I1506
$$ 150260 127079 -100585 262796 207838 -330842 166346 99430 125100 245529 91506
12011A30177o2116N1904L79641a87766D04J04931g048B31952d4516A85166a42585
$$ 130177 68061 119965 499606 -187766 404 105335 -7048 231952 -44516 185166 -142585
11999g3124J6907A11441h8923L2031C30257E9135b51647A66103b45852C67116
$$ -73124 -56217 111441 -88923 -56892 330257 59135 -251647 166103 -245852 367116
11988a66377l0353b3293A98990b15373B3914a19890F5051c23599D757f9038c395
$$ -166377 -196730 -23293 198990 -215373 23914 -119890 65051 -323599 4757 -69038 -3395
11976a19769k30272J48781f9640B11941r5869a02324j20870D73981d42596J80248
$$ -119769 -350041 -201260 -69640 211941 116072 -102324 -223194 473981 -442596 -262348
11966b62348C3568P664a68839l7843J9526L5826E0563j138J6089a69254j36078
$$ -262348 33568 41232 -168839 -206682 -187156 -151330 50563 49425 65514 -169254 -305332
11955c05332A04934b0971I9179m4644J10014D398a75752A72086K6021a24782C48263
$$ -305332 104934 -20971 99179 54535 164549 4398 -175752 172086 198107 -124782 348263
11943B20543j7510D7310L60624q8872a077A21094O2827b53652A5297a08196e2331
$$ 220543 203033 47310 407934 319062 -1077 121094 183921 -253652 15297 -108196 -52331
11931h5618K0297A9348K19577f9052o1256B92033a42185A1639J59147c5636l42932
$$ -85618 -65321 19348 238925 -69052 -130308 292033 -142185 11639 170786 -35636 -378568
11920c78568A79081M8842g5170m2080m7425C98077b25316J10292A42607A7208
$$ -378568 179081 227923 -75170 -117250 -164675 398077 -225316 -115024 142607 17208
11909B7695P3451b98A51002i5317A09924e4618A28983a63418B41494c70338a29995
$$ 27695 101146 -298 151002 -95317 109924 -54618 128983 -163418 241494 -370338 -129995
11897G8030b835A16409P3711G2155A1131J11197d9915D6151g3029b7848C4981
$$ 78030 -2835 116409 190120 72155 11131 122328 -49915 46151 -73029 -27848 34981
11885i3409j82124C0587K1032a8516C8403c21775A43387e16927I1752L1662B2322
$$ -93409 -275533 30587 51619 -18516 38403 -321775 143387 -516927 91752 123414 22322
11873a91152B27013G1708L27271a43308B83446o9961P157b52919A27154k3852
$$ -191152 227013 71708 398979 -143308 283446 213485 220642 -252919 127154 103302
11863A03302a88889A8531a06974q2309b3141l49080G0446k619a52472A74408i1601
$$ 103302 -188889 18531 -106974 -189283 -23141 -372221 70446 67827 -152472 174408 -91601
11851a00027j46399h8032j1168D6107h102k62117A46357a42593j03471A14353
$$ -100027 -246426 -88032 -99200 46107 -8102 -270219 146357 -142593 -246064 114353
11840B5365c21382J44973A9321c9909k21623i0664H7736E590g5361m1846j09283
$$ 25365 -321382 -176409 19321 -39909 -261532 -90664 87736 5590 -75361 -117207 -226490
11829b26490n1512H555b12561p5652C13115b96488P3790E0887d27441b9828H9414
$$ -226490 -278002 8555 -212561 -288213 313115 -296488 -222698 50887 -427441 -29828 89414
11817g5010n1159b3979j37450j72783j42941a27767M1985A7181f5275l0661B9985
$$ -75010 -126169 -23979 -161429 -334212 -477153 -127767 -85782 17181 -65275 -95936 29985
11805c74904C18f7835C54830b98506A00668l3469h8474l4523j13595E0737c43600
$$ -374904 318 -67835 354830 -298506 100668 67199 -88474 -122997 -236592 50737 -343600
11793b70592g7687m2915e6841B213M1926l48b28899F3828R0322k1914h2121D8574
$$ -270592 -77687 -120602 -56841 2213 44139 43791 -228899 63828 154150 132236 -82121 48574
11780a31690j93088D6749K74727H378a73266B6639a7710C07206G5582j3O4874
$$ -131690 -324778 46749 321476 8378 -173266 26639 -17710 307206 75582 75569 140443
11769A40443J05350b23071J08684a0345A44083b65780d5930A43025J56019a87476
$$ 140443 245793 -223071 -114387 -10345 144083 -265780 -45930 143025 299044 -187476
11758b5006A93523a94380P9934A43394a5766G2304M4191J49169b14456B39897
$$ -25006 193523 -194380 -114446 143394 -15766 72304 116495 265664 -214456 239897
11747a97258C4612a42762r2555A07233M3483e92135b0217j18822A02238a06384
$$ -197258 34612 -142762 -235317 107233 150716 -592135 -20217 -139039 102238 -106384
11736A6797e5833A64360G088M4132K39308d2584j98147F6615K2276c78670A24558
$$ 16797 -55833 164360 7088 51220 290528 -42584 -240731 66615 88891 -378670 124558
11724A0905a5778j19225A98554c03769b8384A38762l8966L9443b28815n260H694
$$ 10905 -15778 -135003 198554 -303769 -28384 138762 99796 139239 -228815 -234075 8694
11712B26820j2529b6678n0649C629J00379J9467K8047e2733J7921I0841i5255
$$ 226820 214291 -26678 -77327 3629 104008 123475 151522 -52733 -34812 90841 -95255
11700A35243e9567A97820c67665e0135j73047B4773J02571b9442l10501A58001
$$ 135243 -59567 197820 -367665 -50135 -223182 24773 127344 -29442 -339943 158001
11689G2239Q6584o5083f4673A79293F8967K9152a82533A00507L0262L1140g5799
$$ 72239 158823 93740 -64673 179293 68967 98119 -182533 100507 130769 161909 -75799
11677a66961c8183A30526O982R3386a03682K0591g340m13407D27735E9613d6107
$$ -166961 -38183 130526 137508 230894 -103682 -83091 -7340 -420747 427735 59613 -46107
11665a33087A27954a55916e072l49514C52582g1564A00210d0060j64864A22844
$$ -133087 127954 -155916 -5072 -354586 352582 -71564 100210 -40060 -204924 122844
11654a13120D7203L8690K7168J99762A11335J89561b6091j25109A8294b53523
$$ -113120 47203 85893 113061 312823 111335 300896 -26091 -151200 18294 -253523
11643D0830L68482A44622P9130d13553E9443J25450a60811J1277A69084a3599
$$ 40830 409312 144622 223752 -413553 59443 184893 -160811 -149534 169084 -13599
11632H151L33244O0731a63104q4287A11742m9807J64174c334C46987R4711H871
$$ 8151 341395 402126 -163104 -247391 111742 61935 226109 -3334 346987 441698 8871
11620D8635J71756n0416B092e7051j98281b7052C44398i760p4818c4364C41310
$$ 48635 220391 169975 2092 -57051 -255332 -27052 344398 -9760 -84578 -34364 341310
11608B28017p5717a64825C8380J18615A4090c08566B31667a89651h0917c8381
$$ 228017 152300 -164825 38380 156995 14090 -308566 231667 -189651 -80917 -38381
11597c2301A34575L7169R8674a16815C14456A714c40378A96126f6832b5238m7314
$$ -32301 134575 171744 270418 -116815 314456 1714 -340378 196126 -66832 -25238 -72552
11586g2552A86443K73236d2741A7944K22903K09604e8139A08468k6087e2473G943
$$ -72552 186443 459679 -42741 17944 240847 450451 -58139 108468 82381 -52473 7943
11574I9456M9097g1204K1145A2546L6478b2674B45957h7812A44774n7896J65454
$$ 99456 148553 -71204 -50059 12546 49024 -22674 245957 -87812 144774 86878 252332
11563B52332G9834J66639g1744A29445J51437I2461d17965I9403J10722N403b4704
$$ 252332 79834 246473 -71744 129445 280882 92461 -417965 99403 210125 215528 -24704
11551A54703i0723H9719b03575E3978b6553B00998p0460M7526a848I968L7456
$$ 154703 -90723 89719 -203575 53978 -26553 200998 130538 178064 -1848 9968 47424
11540D7424M21334A96371R9490H7893b15532C16972M1987b53371J20750B77937
$$ 47424 468758 196371 295861 87893 -215532 316972 358959 -253371 -132621 277937
11529A84273J5903c39594I3516a64982M9430A62713J00720g6079E01123G4719
$$ 184273 200176 -339594 93516 -164982 -115552 162713 263433 -76079 501123 74719
11518i3320c3959I0920h4819D47427b7688j7658B73629p234A2320f6599H5608
$$ -93320 -33959 90920 -84819 447427 -27688 -45346 273629 266395 12320 -66599 85608
11506C66546B0771a95547A97037b14085M3485I4902O0323L19717j62087A11274
$$ 366546 20771 -195547 197037 -214085 -170600 94902 155225 474942 312855 111274
11495B22465G2483J67562e6657i687l43283A14921J18830q2609J0311p8330Q9808
$$ 222465 72483 240045 -56657 -9687 -352970 114921 233751 151142 161453 83123 172931
11484A72931J13168a35595M3990G3197K06980b12634C04500a16809H9899C3527
$$ 172931 286099 -135595 -91605 73197 280177 -212634 304500 -116809 89899 33527
11473B0900P3069k5273J47908k4677Q4683D6140B2480J60214N5936H286Q58a3122
$$ 20900 93969 68696 216604 191927 276610 46140 22480 182694 238630 8286 9144 -13122
11460b4786D26950e7149B76674E9390J52123N1213j4347G9347c8949G6165p462
$$ -24786 426950 -57149 276674 59390 211513 262726 248379 79347 -38949 76165 68703
11449F8703h4557B11239A8225J483d2008m0839B34857d3797B0818K9735L73641
$$ 68703 -84557 211239 18225 19708 -42008 -82847 234857 -43797 20818 50553 424194
11438D24194b37511b362C06410e3162G7003a40360B30315A05330N9103D5871a80117
$$ 424194 -237511 -2362 306410 -53162 77003 -140360 230315 105330 164433 45871 -180117
11426G2266b20989i3825A86683A4740J5761P5305L8011a2717k95567g5147F9039
$$ 72266 -220989 -93825 186683 14740 30501 105806 143817 -12717 -308284 -75147 69039
11414B25200F645b12776A5235e07791g352B31774b4195F679a01186I6066b05240
$$ 225200 6645 -212776 15235 -507791 -7352 231774 -24195 6679 -101186 96066 -205240
11402C512L28950A63379c16284E0603a05781B75132A31842J0125b50195D8724
$$ 3512 332462 163379 -316284 50603 -105781 275132 131842 141967 -250195 48724
11391A84722b54608g8870c3379l25610h6710J1929B28874F6774M8242a47067e3104
$$ 184722 -254608 -78870 -33379 -358989 -86710 -74781 228874 66774 115016 -147067 -53104
11379a31885A57146c0726A91672H0155k0940g8339I3573c08591N6330B7038N4034
$$ -131885 157146 -30726 191672 80155 59215 -78339 93573 -308591 -252261 27038 81072
11368H1072A4661J63937a30013O0065I8395b30428I8655L6581d16716d6817n083
$$ 81072 14661 178598 -130013 -69948 98395 -230428 98655 135236 -416716 -46817 -51900
11357e1900j7024p5949I4964N4217B227a20162D0632L2244f8532k47949g4797
$$ -51900 -68924 -144873 94964 149181 2227 -120162 40632 72876 -68532 -316481 -74797
11345B63287i1796B33529a88657A30261k3971a98696p5538L532j82487A34702
$$ 263287 -91796 233529 -188657 130261 106290 -198696 -274234 -270702 -453189 134702
11334d06051a75347D2415J25517c9035j04613g0876o4218e5440B13626b7518B8607
$$ -406051 -175347 42415 167932 -39035 -143648 -70876 -135094 -55440 213626 -27518 28607
11322a6419m00844G3336a09320b5559D2893b04681C49427g7274B05946b2932k51462
$$ -16419 -417263 73336 -109320 -25559 42893 -204681 349427 -77274 205946 -22932 -274394
11311b74394A03466a61823j70410H452c1110j36790A78064e11968K47929O9088
$$ -274394 103466 -161823 -332233 8452 -31110 -167900 178064 -511968 -264039 -194951
11301a94951A83208l7709e4430A0142a05983l1452J9094k11216f3998k06796j6250
$$ -194951 183208 145499 -54430 10142 -105983 -137435 -118341 -329557 -63998 -270794 -287044
11290b87044E706b11953k2649a17174D0324c54149B91835g6060A17696m5941N4546
$$ -287044 5706 -211953 -234602 -117174 40324 -354149 291835 -76060 117696 71755 126301
11279A26301C9019P0646c46951E6509b88167A86224e8621m18048a29210B14334
$$ 126301 39019 109665 -346951 56509 -288167 186224 -58621 -476669 -129210 214334
11268A19053J48694b41788C86061i7876M6399k78892e7910j72293C92493b3144
$$ 119053 267747 -241788 386061 -97876 -51477 -330369 -57910 -230203 392493 -23144
11257a21859M2031r8408I2280r556c19420i6712C26582H6125A9769g526p6818
$$ -121859 -79828 -178236 92280 82724 -319420 -96712 326582 86125 19769 -7526 -84344
11246h4344j83381A70172g8652b457j3953j87975C9590J19992K8348a01462B95413
$$ -84344 -267725 170172 -78652 -2457 -16410 -204385 39590 159582 187930 -101462 295413
11234B12895b94545a38781k70320Q1542h7677B8562a12001P665H2990A2940b70054
$$ 212895 -294545 -138781 -409101 -327559 -87677 28562 -112001 -104336 82990 12940 -270054
11222a11280B49050a02456G3867b36930F6797a85753A4117b98128C39708a7872
$$ -111280 249050 -102456 73867 -236930 66797 -185753 14117 -298128 339708 -17872
11211A81201c04558J24548I9087a91419A1864L8703f8306j70941N7522d6540b3022
$$ 181201 -304558 -180010 99087 -191419 11864 50567 -68306 -239247 -181725 -46540 -23022
11199d25013a28418B02797a36643j13712N7893M1678k36528C0701a25602A4327
$$ -425013 -128418 202797 -136643 -250355 -192462 -150784 -387312 30701 -125602 14327
11188f1945B77206b9025k17757A93662f9309c0737E1885a9205r1314q9136f3266
$$ -61945 277206 -29025 -246782 193662 -69309 -30737 51885 -19205 -110519 -199655 -63266
11176C6755J0206a5661A43461D3708b89277a00096j01674c3243k4015k17476h3230
$$ 36755 46961 -15661 143461 43708 -289277 -100096 -201770 -33243 -57258 -274734 -83230
11164G4673J23534g2915I4253f3431r1278B58658a70444B10627b8077A58594c10844
$$ 74673 198207 -72915 94253 -63431 -154709 258658 -170444 210627 -28077 158594 -310844
11152G5869c3640j9425q5895j47280J11218K9623M8636I9395a43728C11522a19002
$$ 75869 -33640 -53065 -138960 -286240 -175022 -145399 -96763 99395 -143728 311522 -119002
11140b40763P4665B06773b13499D2076b4400j51086D61628b47304C7093K8166
$$ -240763 -166098 206773 -213499 42076 -24400 -175486 461628 -247304 37093 65259
11130F5259J17177b43894B66810d7509p5964F7584G163a10862c0213J1956j47670
$$ 65259 182436 -243894 266810 -47509 -123473 67584 7163 -110862 -30213 -18257 -165927
11119a65927A23207l1182J73753G558c28140I711L41379A39240N040E0223L3324
$$ -165927 123207 92025 265778 7558 -328140 9711 351090 139240 144280 50223 83547
11108H3547b16238g7606G9770J43802l7170b33501C0910b2601r4265d5711A34899
$$ 83547 -216238 -77606 79770 223572 186402 -233501 30910 -22601 -116866 -45711 134899
11096H3577L4584A4484K57765j14700k7539f4134A31205E5220M14652H5003K13966
$$ 83577 118161 14484 272249 157549 130010 -64134 131205 55220 469872 85003 298969
11085B98969G9705J57433E4653J06852c4533l332m5870B05122j7011B6344J49674
$$ 298969 79705 237138 54653 161505 -34533 -37865 -83735 205122 188111 26344 176018
11074A76018a3678B03688q3783b8725C0430M62783C8045R3902J81497p9624j11185
$$ 176018 -13678 203688 119905 -28725 30430 493213 38045 131947 313444 233820 122635
11063A22635Q3429N2612r4505K25021Q6704P5446j0305H3597M18869m5784A98146
$$ 122635 206064 258676 164171 389192 475896 551342 541037 83597 502466 456682 198146
11051B94641Q3732K7260J21961K11566j16308L192K84319l63488j58217L58683
$$ 294641 378373 405633 527594 739160 622852 626044 910363 546875 388658 747341
11041G47341o9066L13891j30373C42876L49162m3798C02831K06032K10096k98960
$$ 747341 678275 992166 861793 342876 692038 648240 302831 508863 718959 419999
11031D19999L14352j52842p2324M8962O6110l8023J59011l61752J79605K57836
$$ 419999 734351 581509 509185 558147 624257 586234 745245 383493 563098 820934
11021H20934k95263J19149Q2156B81790J77355B04777O41277k87910J60339B83485
$$ 820934 525671 644820 726976 281790 459145 204777 846054 558144 718483 283485
11010C39160p6609q7917M72471j6175k59795Q9636J46748J44224C62636L59933
$$ 339160 262551 174634 647105 630930 371135 460771 607519 751743 362636 722569
11000G22569l20528L07222j96182p6301j39211Q2599N443N4844K5484q7021K21089
$$ 722569 402041 709263 513081 436780 297569 380168 385611 440455 465939 378918 600007
10989F00007p1027L15932k29100j31965J25796O9800j22462L21419r3487J80118
$$ 600007 528980 844912 615812 483847 609643 679443 556981 878400 784913 965031
10979I65031K34122j98322k31524N3407N94390k44046K80934K05732O8441Q1900
$$ 965031 1199153 1000831 769307 822714 1417104 1173058 1453992 1659724 1728165 1810065
10969A810065k36857N17881K5426j12151J50005n48524K69770r8750p4303j56818
$$ 1810065 1573208 2091089 2116515 2004364 2154369 1605845 1875615 1776865 1702562 1545744
10959A545744k66342K00283n8763L45083k41877L4825l79527J66950j32144j08714
$$ 1545744 1279402 1479685 1420922 1766005 1524128 1558953 1179426 1346376 1214232 1105518
10949A105518J85812m61989J80129l71866A21203L80939k30505G2051K21543J04077
$$ 1105518 1291330 829341 1009470 637604 121203 502142 271637 72051 293594 397671
10939C97671k9346d2591C0580J12730K08074j63802a39889l447F4789F483i4116
$$ 397671 368325 -42591 30580 143310 351384 187582 -139889 -143336 64789 6483 -94116
10927F3485B595c0017B04473J50753P3978a81020A32468o1118B3337b04568A50764
$$ 63485 2595 -30017 204473 355226 429204 -181020 132468 71350 23337 -204568 150764
10915C14047a40957L5443A92551c2013k97181g0696n3010b5985M57B07127b37880
$$ 314047 -140957 -105514 192551 -32013 -329194 -70696 -123706 -25985 -25528 207127 -237880
10903i0456C44734e3739l007p9843j27787D5949A893a11122H856e972k11090M0509
$$ -90456 344734 -53739 -56746 -136589 -264376 45949 1893 -111122 8856 -5972 -217062 -176553
10891a76553l294B31524A09293O4501e7805A56641a20758m7206j39976a28917
$$ -176553 -179847 231524 109293 173794 -57805 156641 -120758 -167964 -307940 -128917
10880a31075F2454a13746A58911F032O882b86510c1837j02985K6443A29121b18578
$$ -131075 62454 -113746 158911 6032 12914 -286510 -31837 -134822 -108379 129121 -218578
10868c5131i297I9128b00057f8913B12666a1998E445L9278B0233a96119D2753
$$ -35131 -9297 99128 -200057 -68913 212666 -11998 5445 44723 20233 -196119 42753
10856G6686k3249a08267G703g2875A43862A6597c70269a33845d2414A09712J17742
$$ 76686 53437 -108267 7703 -72875 143862 16597 -370269 -133845 -42414 109712 227454
10845B27454r5571e0304j40053O3038o7145Q8782j35178K1447j56873B16027c21958
$$ 227454 131883 -50304 -190357 -127319 -194464 -105682 -240860 -219413 -376286 216027 -321958
10833A82125H062J1039a53629A34533a99924E3581M2417B1269J2974a37237q0595
$$ 182125 8062 19101 -153629 134533 -199924 53581 95998 21269 34243 -137237 -217832
10822b17832d0410j70795g506A22590a47862O4714h877A82008p3496K18955b05913
$$ -217832 -40410 -211205 -7506 122590 -147862 -83148 -8877 182008 108512 327467 -205913
10810a28033A79828c64498C822a90826G2096a43322J999p1217E5117i0690j10522
$$ -128033 179828 -364498 3822 -190826 72096 -143322 -141323 -212540 55117 -90690 -201212
10799b01212e3151j26711c7940G5318M3189R1534d1257o0509k6312c0321c811
$$ -201212 -53151 -179862 -37940 75318 118507 210041 -41257 -101766 -128078 -30321 -3811
10787a95831K1808n7368A51719a50742E375a23399E3132J33244p3441A0990Q6719
$$ -195831 -174023 -231391 151719 -150742 5375 -123399 53132 186376 112935 10990 97709
10776I7709a92956o6519e0304I5945a57757B04918C8146b33729n1825E2621a66245
$$ 97709 -192956 -259475 -50304 95945 -157757 204918 38146 -233729 -285554 52621 -166245
10764a48524d2873A27843M3321b27797j60377a2591n56019A2916K56644b96013
$$ -148524 -42873 127843 171164 -227797 -388174 -12591 -568610 12916 269560 -296013
10753G6185d31217A34570a69556L0903b6814I7200a67189k8215d1290H2317N3651
$$ 76185 -431217 134570 -169556 -138653 -26814 97200 -167189 -195404 -41290 82317 135968
10742A35968e4135E7561B3530a9589k25541I2387d6649I4842K4063a44913d5378
$$ 135968 -54135 57561 23530 -19589 -245130 92387 -46649 94842 118905 -144913 -45378
10730b3366F051d66011b27415k740B37211a40559f455A02856c6766G3935J24582
$$ -23366 6051 -466011 -227415 -230155 237211 -140559 -6455 102856 -36766 73935 198517
10719A98517f7052a3039I0348a55995f6552B7686e5137j20842J1415j2168j00219
$$ 198517 -67052 -13039 90348 -155995 -66552 27686 -55137 -175979 -164564 -176732 -276951
10708b76951C799b59277i4318H8275a64795K7569e4988A80920P8823C2379R8518
$$ -276951 3799 -259277 -94318 88275 -164795 -137226 -54988 180920 259743 32379 130897
10697A30897b09864b4493j098J2431j55023A81112a73566B0481a02814j09389
$$ 130897 -209864 -24493 -25591 -13160 -168183 181112 -173566 20481 -102814 -212203
10687b12203r3199J23599e9115b0265E1208d97147h3085m3803o052B4296d22106
$$ -212203 -305402 -181803 -59115 -20265 51208 -497147 -83085 -126888 -132940 24296 -422106
10675h878k9275l04657G1518b45337j5322J11657p1394B06558a57123H9204a20644
$$ -8878 -38153 -342810 71518 -245337 -260659 -149002 -220396 206558 -157123 89204 -120644
10663b45646J469G7228J29640B3753K26532h7075B70278I9758a92734f5413q6044
$$ -245646 -244177 77228 206868 23753 250285 -87075 270278 99758 -192734 -65413 -151457
10652a51457n5085A61271n5711a6920l3206j269B06439i7234J6004j48337A83936
$$ -151457 -206542 161271 105560 -16920 -50126 -51395 206439 -97234 -81230 -229567 183936
10640I7800A1731a5475o4864k65679K9532C6412a30359m24981K47615L1815J19117
$$ 97800 11731 -15475 -80339 -346018 -316486 36412 -130359 -555340 -307725 -275910 -156793
10629a56793J5597N0153C05544A6774a44954a2340k10086B93962d7981a9756k24107
$$ -156793 -141196 -91043 305544 16774 -144954 -12340 -222426 293962 -47981 -19756 -243863
10618b43863H723J56170c50571B24701a18982A8128q122a44535A01142a26566
$$ -243863 8723 164893 -350571 224701 -118982 18128 10006 -144535 101142 -126566
10607a73838k31364A23968Q2798h7639D9026J1456K0039a435j211B74203i3014
$$ -173838 -405202 123968 206766 -87639 49026 60482 80521 -1435 -2646 274203 -93014
10595B01652d913j253k2771j84880n7676J35341O054e8125A90412a5827M651j6567
$$ 201652 -4913 -6166 -28937 -213817 -271493 -136152 -130098 -58125 190412 -15827 -11176 -27743
10583b7743A69222c0441A39426a79037A71685A2236h0163j91091d1728A72205
$$ -27743 169222 -30441 139426 -179037 171685 12236 -80163 -271254 -41728 172205
10572a44719b2913q216l08698d5930l4497A15877K01800c26634M0553L9676J9400
$$ -144719 -22913 -31129 -339827 -45930 -80427 115877 317677 -326634 -286081 -246405 -227005
10561b27005A22083l1577K3724b52948i978j04321C11442f9517Q670A84136F3110
$$ -227005 122083 90506 114230 -252948 -9978 -114299 311442 -69517 -60847 184136 63110
10549b7168B46170b08072A79709C8816e7091E9710a73706N8484C3184J29893P6957
$$ -27168 246170 -208072 179709 38816 -57091 59710 -173706 -115222 33184 163077 240034
10538B40034a40205a8256C9750P9322L2843L1988e6911B2048c39450a5186q3505
$$ 240034 -140205 -18256 39750 119072 151915 183903 -56911 22048 -339450 -15186 -98691
10527i8691K1671I4008m4238a87974L5116A291a5409j78953d9949b3190F3621
$$ -98691 -77020 94008 49770 -187974 -152858 1291 -15409 -194362 -49949 -23190 63621
10515b80431b273F9402a85922Q1420b4280j26182k69654a44088r1967A69412c30251
$$ -280431 -2273 69402 -185922 -104502 -24280 -150462 -420116 -144088 -236055 169412 -330251
10503c15820j23665H2617Q3874a03622d2938k91286c5802A56116k2926f3459H2710
$$ -315820 -439485 82617 166491 -103622 -42938 -334224 -35802 156116 133190 -63459 82710
10491b02894h6449K5075o7919k58570J45783h0770C4116b78716B21145J3987F0436
$$ -202894 -86449 -61374 -129293 -387863 -242080 -80770 34116 -278716 221145 235132 60436
10479B87836g769j18639D42954j92600j1281A03708J34508H8502P1990N0611a57431
$$ 287836 -7769 -126408 442954 250354 239073 103708 238216 88502 160492 211103 -157431
10467C1819P423J12808b329m30262J95545I0119a44755E4728d7187A89014a53601
$$ 31819 39242 152050 -2329 -432591 -237046 90119 -144755 54728 -47187 189014 -153601
10455i7602k0560C4208b53786R255B11121c10900A87978A3404a24881A18455c37596
$$ -97602 -118162 34208 -253786 -244531 211121 -310900 187978 13404 -124881 118455 -337596
10443i0394A91043c88243A4264a2604j54883B19224I900g0261A6110L0622a73074
$$ -90394 191043 -388243 14264 -12604 -167487 219224 9900 -70261 16110 46732 -173074
10431H4268a76606j06485C22910j30321g6118j42684J03718g348j90009i1963
$$ 84268 -176606 -283091 322910 192589 -76118 -218802 -115084 -7348 -197357 -91963
10420I9988B1237O703J08267B3521b88093a2340B6532c15983J09739A6225J17684
$$ 99988 21237 27940 136207 23521 -288093 -12340 26532 -315983 -206244 16225 133909
10409A33909b49439F0599g0875o095l16770A08691m3353J96307c40000B88534
$$ 133909 -249439 60599 -70875 -76970 -393740 108691 65338 261645 -340000 288534
10398c41958a9879j97545A50464n3392l0649k0689g1721D64496B5384M42422c30568
$$ -341958 -19879 -217424 150464 97072 66423 45734 -71721 464496 25384 467806 -330568
10386B44479J9270f2640j01307A22834n9110J77553B1426b0136D56088G5697K92172
$$ 244479 263749 -62640 -163947 122834 63724 241277 21426 -20136 456088 75697 367869
10375C67869l9129j26291a34721H3540j1964d0230D61074i4974B82292E2984J30346
$$ 367869 328740 202449 -134721 83540 71576 -40230 461074 -94974 282292 52984 183330
10364A83330N7337L89015A85337J34848L00480a91358f1980B76910j27910D2882
$$ 183330 240667 629682 185337 320185 620665 -191358 -61980 276910 149000 42882
10353A11933n3927k8463J89461M4855O0144M43630B50744J74471R5788m9696a904
$$ 111933 58006 29543 219004 263859 324003 767633 250744 425215 521003 471307 -1904
10341A1396O50738A84715m5177J84785n049q9183j09318a27469B60054P8149b08076
$$ 11396 662134 184715 139538 324323 319274 230091 120773 -127469 260054 338203 -208076
10329h8738B45144K27963h45A8407J8550i1639A92957M95494a6021O440A12936
$$ -88738 245144 473107 -845 18407 36957 -91639 192957 688451 -16021 -9581 112936
10317I5911l9089J27872h792k00386B80745a54619O2910H7689Q3952m7519J55447
$$ 95911 56822 184694 -8792 -209178 280745 -154619 -91709 87689 171641 124122 279569
10306B79569I4885R4984o0411b561k29659h4548B93932e34282a55374j02777I8660
$$ 279569 94885 189869 129458 -2561 -232220 -84548 293932 -534282 -155374 -258151 98660
10294b25791C4792c54469R4818d8409j00299k8083c0898J2691A62192l6829h2174
$$ -225791 34792 -354469 -259651 -48409 -148708 -176791 -30898 -18207 162192 125363 -82174
10282A47690A8178b52516A05875a40701c8667j46156H5497D2491c60932i683o6528
$$ 147690 18178 -252516 105875 -140701 -38667 -184823 85497 42491 -360932 -9683 -76211
10271g6211P542A77781b25986A3148a21584B0975h8491D919h6462A58957c67027
$$ -76211 -68669 177781 -225986 13148 -121584 20975 -88491 4919 -86462 158957 -367027
10259B28903B6306f04860A99485J14994j18435K89323k19985r8183d9984C51335
$$ 228903 26306 -604860 199485 314479 196044 485367 265382 167199 -49984 351335
10248B76531N1136b87783G9622g1895j91007J20124N9678F1196a93757A8976h216
$$ 276531 327667 -287783 79622 -71895 -262902 -142778 -83100 61196 -193757 18976 -8216
10236A63897a9190q7119a6369B86803c19007A51813b78123g6903k45738K4672
$$ 163897 -19190 -106309 -16369 286803 -319007 151813 -278123 -76903 -322641 -297969
10226b97969A24768b39231o3102J19317A3028a61464n3634i0393A75b42139d0118
$$ -297969 124768 -239231 -302333 -183016 13028 -161464 -215098 -90393 175 -242139 -40118
10214B40617A6049a25524d6310n16414K34169c5330k86878f777k42087N4693l9633
$$ 240617 16049 -125524 -46310 -562724 -328555 -35330 -322208 -6777 -248864 -194171 -233804
10203b33804i7150j61534h1514j49418e3842l6251k21473j6582a35249c0718l3654
$$ -233804 -97150 -258684 -81514 -230932 -53842 -90093 -311566 -328148 -135249 -30718 -64372
10192f4372b4303A18727M2818d47546a94610b3262G1645c641k1563j45276A31416
$$ -64372 -24303 118727 161545 -447546 -194610 -23262 71645 -3641 -25204 -170480 131416
10180H2970j5448b08081M3192E0534c0103m06673e116I6109a70066K0027A23265
$$ 82970 67522 -208081 -164889 50534 -30103 -436776 -5116 96109 -170066 -150039 123265
10168b53903I997c87139J06805B07878a25637m4532K5344b944I5639c09415C3451
$$ -253903 9997 -387139 -280334 207878 -125637 -170169 -144825 -2944 95639 -309415 33451
10156F3502a64122A18048i3978H7240b08601C0691a143j8533k26713B4935J54338
$$ 63502 -164122 118048 -93978 87240 -208601 30691 -1143 -19676 -246389 24935 179273
10145A79273a86959j75980H4401b10651N3827r0513b5242G022f65j40553L8691
$$ 179273 -186959 -362939 84401 -210651 -156824 -247337 -25242 7022 -665 -141218 -102527
10134a02527A77620a38073F1547a09641l55787E6161J43856a06521K8047A68329
$$ -102527 177620 -138073 61547 -109641 -465428 56161 200017 -106521 -78474 168329
10123h5765d964m38366A16936c5703BL908c11787A5073L3084a15041j60676A0692
$$ -85765 -4964 -443330 116936 -35703 2 3910 -311787 15073 48157 -115041 -275717 10692
10110b47553F5332J27330g3473j39762K1362A36284d36574a49385E8647j2989
$$ -247553 65332 192662 -73473 -213235 -191873 136284 -436574 -149385 58647 45658
10100D5658b93503e1620n585R260A63886K41955e5599G9859c87976a55639D4802
$$ 45658 -293503 -51620 -57205 -47945 163886 405841 -55599 79859 -387976 -155639 44802
10088a20006D8280l660P4563a56159N702A95742b92928j267f9880A51565h8756
$$ -120006 48280 44620 119183 -156159 -150457 195742 -292928 -294195 -69880 151565 -88756
10076g4597j08879B8615L47687r7977a67978f6574B8169i7997p8355e1639j25559
$$ -74597 -183476 28615 376302 278325 -167978 -66574 28169 -97997 -176352 -51639 -177198
10065a77198b4690j54517j23161a09584H45a3801A1809A535P5338a04797l39554
$$ -177198 -24690 -179207 -302368 -109584 845 -13801 11809 1535 76873 -104797 -444351
10054d44351G8479a04692k67416j16779a31318A95180b94291E9050b46988A85895
$$ -444351 78479 -104692 -372108 -488887 -131318 195180 -294291 59050 -246988 185895
10043a55292N8634j03174H4866M6467A7425e5796k4904j36584d8732A67387b62674
$$ -155292 -96658 -199832 84866 131333 17425 -55796 -80700 -217284 -48732 167387 -262674
10031a67119j0666f4756k15857a7085q498I0909c0366B1395K151J52496a14499
$$ -167119 -177785 -64756 -280613 -17085 -25583 90909 -30366 21395 23546 176042 -114499
10019c58867B12596a72591N618H2707b29617j68963a32509j90511i8424j55021
$$ -358867 212596 -172591 -166973 82707 -229617 -398580 -132509 -323020 -98424 -253445
10009b53445P5454A32404c53266g3084A28535a52137C9698e31281b05551k1677
$$ -253445 -177991 132404 -353266 -73084 128535 -152137 39698 -531281 -205551 -227228
9999b27228c5421B00099F6845N0416r082J95451G2000g5063l58743H7547a5478
$$ -227228 -35421 200099 66845 117261 108179 303630 72000 -75063 -433806 87547 -15478
9987B3553J17970a33637E9151d11548e2373j35727f5011g156H7083d53086J22269
$$ 23553 141523 -133637 59151 -411548 -52373 -188100 -65011 -7156 87083 -453086 -330817
9976c30817J51925h6016F1509g751B12153F8864b98874A07746i4997I1657b35782
$$ -330817 -178892 -86016 61509 -7751 212153 68864 -298874 107746 -94997 91657 -235782
9964b48916j753a08281I7168L1892D3074L2962c9696B28888h8733j03344B0404
$$ -248916 -250669 -108281 97168 129060 43074 76036 -39696 228888 -88733 -192077 20404
9952G7884f298B07435D9367j7935a2326j57036A37687D0032b5464C19535a80495
$$ 77884 -6298 207435 49367 31432 -12326 -169362 137687 40032 -25464 319535 -180495
9940B87324a55451k19054D8365a20014k11425a28569r6530J00912J5201M0166
$$ 287324 -155451 -374505 48365 -120014 -331439 -128569 -225099 -124187 -108986 -68820
9930f8820I3195b9165j94251R7274k82263D1750b37483Q6978A98367i8848B65489
$$ -68820 93195 -29165 -223416 -126142 -408405 41750 -237483 -150505 198367 -98848 265489
9918a28775l14379f3935k79522J43947E0987e8033o3132G6533r805a35336q8768
$$ -128775 -443154 -63935 -343457 -199510 50987 -58033 -121165 76533 66728 -135336 -224104
9907b24104m2586j56834b03835I9768K81755h9181j67846A7061R5845J5088e8241
$$ -224104 -266690 -423524 -203835 99768 381523 -89181 -257027 17061 112906 127994 -58241
9895A13534c53403g8152i301n7316m0429d4213p2961B00061e3857H3525C9853
$$ 113534 -353403 -78152 -9301 -66617 -107046 -44213 -117174 200061 -53857 83525 39853
9883a78561P368D5655h803C45197c2528M869l39198j05826A40088e4011J7735
$$ -178561 -171193 45655 -8803 345197 -32528 -27659 -366857 -472683 140088 -54011 -36276
9872c6276l96789c9855E2026K47644b77552a0133A11289j0416Q5381a17028D936
$$ -36276 -433065 -39855 52026 299670 -277552 -10133 111289 100873 186254 -117028 4936
9860H3164a57731n0892A03510a2540l5312D2529b06100h7181k7235l3220a8117
$$ 83164 -157731 -208623 103510 -12540 -47852 42529 -206100 -87181 -114416 -147636 -18117
9848i4786A5742M1973b37825c5118A35100b46674a20303B02957O9869a81663k79775
$$ -94786 15742 57715 -237825 -35118 135100 -246674 -120303 202957 272826 -181663 -461438
9837d61438H3564i4607j34322A04860e6039l02449c0418B2526d0156l63538F4729
$$ -461438 83564 -94607 -228929 104860 -56039 -358488 -30418 22526 -40156 -403694 64729
9825i295j51442K1686O6844m01072a98481b2432l7601j77222J10732C35848a59014
$$ -9295 -160737 -139051 -72207 -473279 -198481 -22432 -60033 -237255 -126523 335848 -159014
9813b9151j86430I7037f8584b1685A41572b95567e4242F8596M99899a00086l44471
$$ -29151 -215581 97037 -68584 -21685 141572 -295567 -54242 68596 568495 -100086 -444557
9802d44557H3693c1199j25726e4598B20901e15447B13321c48736r5004a82473
$$ -444557 83693 -31199 -156925 -54598 220901 -515447 213321 -348736 -443740 -182473
9791g9268C9555L5498c20858e8103A3472K34994j18660B0380P6468a83779B49532
$$ -79268 39555 75053 -320858 -58103 13472 248466 129806 20380 96848 -183779 249532
9779a14198N6027k29472E8250L1110h181j20323p4020f2659A93749a29025M1276
$$ -114198 -58171 -287643 58250 89360 -8181 -128504 -202524 -62659 193749 -129025 -87749
9768h7749K2941A62080B7895K854i4972B1395a24347N9065j24877A84944j0934
$$ -87749 -64808 162080 27895 30749 -94972 21395 -124347 -65282 -190159 184944 174010
9757A74010a85838d789l27829B47070c07965j49162d9476B50617R3659a56119
$$ 174010 -185838 -4789 -332618 247070 -307965 -457127 -49476 250617 344276 -156119
9746B36643o1101J8781a0354m76635i8217L7002C85012b09651f1402J6016n990
$$ 236643 175542 194323 -10354 -486989 -98217 -61215 385012 -209651 -61402 -45386 -51376
9735e1376j94840B8409d055m3246I1266A3073J12832K2579d15333e9540m12129
$$ -51376 -246216 28409 -4055 -47301 91266 13073 125905 148484 -415333 -59540 -471669
9724d71669A31907J69651e7062D2446b70106k4192i1014H9922b11777c427j93664
$$ -471669 131907 301558 -57062 42446 -270106 -294298 -91014 89922 -211777 -3427 -197091
9713a97091j557j95527J82656k32844J07645D0972K2694d49226B38123c1209a3823
$$ -197091 -198648 -394175 -211519 -444363 -336718 40972 63666 -449226 238123 -31209 -13823
9701a16743k16453a3692k93044B08305a21605n2059N9183n659m85663c5786A22363
$$ -116743 -333196 -13692 -306736 208305 -121605 -173664 -114481 -120140 -605803 -35786 122363
9689D389d17674I2962J82046K6714b7632j47399e1826C57925a76101l7218Q5450
$$ 4389 -417674 92962 275008 301722 -27632 -175031 -51826 357925 -176101 -213319 -127869
9678a27869A65982p1685k1046j9853f9995l04404J86340m6192o9i0422E041a28718
$$ -127869 165982 94297 73251 53398 -69995 -374399 -188059 -234251 -234320 -90422 5041 -128718
9665a21437D4152M3784a38229k90439b00874E736e7099m1910A34374L56828I8302
$$ -121437 44152 87936 -138229 -428668 -200874 5736 -57099 -99009 134374 491202 98302
9653a13206j23168M5287j54660a36559A87375h304j6508j11344c4224a1014G5559
$$ -113206 -236374 -191087 -345747 -136559 187375 -8304 -24812 -136156 -34224 -11014 75559
9641B24145a1985j81239L9709G5660R730L1351B7048d18623a17592p8721A20461
$$ 224145 -11985 -193224 -153515 75660 85390 116741 27048 -418623 -117592 -196313 120461
9629B23949i9420p0978A17654b92713D7335c63236F7459N79a82520H0053a67252
$$ 223949 -99420 -170398 117654 -292713 47335 -363236 67459 68038 -182520 80053 -167252
9617a16541A67749F1577A8645h2105A4563c6172I0715L93504i6465c3062j37682
$$ -116541 167749 61577 18645 -82105 14563 -36172 90715 484219 -96465 -33062 -170744
9606a70744d4493r4236H7925d60131J16422i7584D1329J46000G6556J39653r6703
$$ -170744 -44493 -138729 87925 -460131 -343709 -97584 41329 187329 76556 216209 119506
9595A19506q773C8206b83719h616n8928o5984A07606f6385a3356j00069k2756
$$ 119506 110733 38206 -283719 -8616 -67544 -133528 107606 -66385 -13356 -113425 -136181
9584a36181k112J9568j80386j09920f9193j07562J6354B6121K14178c84221b8074
$$ -136181 -138293 -118725 -299111 -409031 -69193 -176755 -160401 26121 240299 -384221 -28074
9572A78818K6001c96434L5311J13849C6138h9385k43954J58215k4768i9619a5934
$$ 178818 204819 -396434 -361123 -247274 36138 -89385 -333339 -175124 -199892 -99619 -15934
9560b82253J23195j5414O5580N305H450J96025G1939A3684i3782E6816b91422
$$ -282253 -159058 -174472 -108892 -103587 8450 204475 71939 13684 -93782 56816 -291422
9548a50464B24877B0958K95662d24810a08050m6796A5948O7148J23087a67788
$$ -150464 224877 20958 316620 -424810 -108050 -154846 15948 83096 206183 -167788
9537G7737a48428G4488P140K09740A41380N1759a15368L7911o3900M4545A18820
$$ 77737 -148428 74488 81628 291368 141380 193139 -115368 -77457 -141357 -96812 118820
9525b39830p620j1915A08097i5933q7780G4913K07014a45533r5265O9377g1093
$$ -239830 -247450 -259365 108097 -95933 -183713 74913 281927 -145533 -240798 -171421 -71093
9513a87889C9727a38188p0926e8217A04701b04816B5787M3060L27160f4338J7478
$$ -187889 39727 -138188 -209114 -58217 104701 -204816 25787 68847 396007 -64338 -46860
9502d6860k2360B5583O7848j2224P8571b13364d6480j50728d317A5194h4016r4305
$$ -46860 -69220 25583 93431 81207 159778 -213364 -46480 -197208 -4317 15194 -84016 -178321
9490a78321G7529J96091a30909l78619d0846B6959a59238k82950K00882B87033
$$ -178321 77529 273620 -130909 -509528 -40846 26959 -159238 -442188 -241306 287033
9479B39090a0718A8809a6882A90920a06497j72464J24473H684a53085M9324c6603
$$ 239090 -10718 18809 -16882 190920 -106497 -278961 -154488 8684 -153085 -103761 -36603
9467A98917F9622a09304F0017a5346j97266e5837J5690A65011L4090k242g3496
$$ 198917 69622 -109304 60017 -15346 -212612 -55837 -40147 165011 199101 196859 -73496
9455d785r8065l2702r2099k16681A28574c72291f3096A42053C6214d155k3443
$$ -4785 -102850 -135552 -227651 -444332 128574 -372291 -63096 142053 36214 -4155 -27598
9444b7598j11837R671C15005i2996F7382L5073J29412a37503B22179a45634r6190
$$ -27598 -139435 -129764 315005 -92996 67382 102455 231867 -137503 222179 -145634 -241824
9433b41824c5098j84152A5243Q8325a38607C9649a7939m07340A3982b41627R4284
$$ -241824 -35098 -219250 15243 103568 -138607 39649 -17939 -425279 13982 -241627 -147343
9422a47343E3269Q5742k0010a05216M8042H9649a95849A79419c480o8409j00226
$$ -147343 53269 139011 119001 -105216 -57174 89649 -195849 179419 -3480 -71889 -172115
9411a72115k15761b6580r187j22597p0986M3738d1435J9295A20501l9117e5872
$$ -172115 -387876 -26580 -35767 -158364 -229350 -185612 -41435 -22140 120501 81384 -55872
9399b14387a02404G873d54270A01496a41577a3667o8592L8610r9150k91629B74229
$$ -214387 -102404 7873 -454270 101496 -141577 -13667 -82259 -43649 -142799 -434428 274229
9387a81699f6176A31981a13867L393G3046f4656j35174j24504n8520J5287a23572
$$ -181699 -66176 131981 -113867 -110474 73046 -64656 -199830 -324334 -382854 -367567 -123572
9375I4190b17757i9343d4277a3136k21622a11115A48321c25206B26447B0907a23401
$$ 94190 -217757 -99343 -44277 -13136 -234758 -111115 148321 -325206 226447 20907 -123401
9363h0967C993h0039C09555a47554L9479b5338n7296q929j10826Q9043A08622
$$ -80967 3993 -80039 309555 -147554 -108075 -25338 -82634 -91563 -202389 -113346 108622
9351b7355n8958A23327a48945n1947g2210A70209a4930l16381A55834a93792j16491
$$ -27355 -86313 123327 -148945 -200892 -72210 170209 -14930 -331311 155834 -193792 -310283
9340c10283B2895a65891e7172G4985N8246N9324Q7532a62992a9311A24544J19038
$$ -310283 22895 -165891 -57172 74985 133231 192555 280087 -162992 -19311 124544 243582
9329B43582I1972a60822D2692J6270K549a33637I0139A5021c59915h3095E9109
$$ 243582 91972 -160822 42692 58962 61511 -133637 90139 15021 -359915 -83095 59109
9317c02979a09035E4734c16276A68306a13148N023N363K888m4636J0338G5661
$$ -302979 -109035 54734 -316276 168306 -113148 -108125 -102762 -99874 -144510 -134172 75661
9305f58851A0805a71588Q3741j37104D8906J0794B9804J53868f4612F1957A1809
$$ -658851 10805 -171588 -87847 -224951 48906 59700 29804 183672 -64612 61957 11809
9293a88971c1742k15358k2042I876e10731K24861C10950a17019J097r303d7768
$$ -188971 -31742 -247100 -269142 9876 -510731 -285870 310950 -117019 -115922 -125225 -47768
9281a22985A63787D6656d6072r9842E90a88843L3255a6388B31619G12e3743m27789
$$ -122985 163787 46656 -46072 -145914 590 -188843 -155588 -16388 231619 712 -53743 -481532
9269d81532a98098p855J3669A0377J31799c1409j08922p2540P5610p7118C659
$$ -481532 -198098 -205953 -192284 10377 142176 -31409 -140331 -212871 -137261 -214379 3659
9257g2232l91409A94154k1872i4997j81106D76605c6647j67876a5454j96802j06708
$$ -72232 -463641 194154 172282 -94997 -276103 476605 -36647 -204523 -15454 -212256 -318964
9246c18964a56297P5934D0255a12624k79229A04188c42143M853A17586b10003
$$ -318964 -156297 -80363 40255 -112624 -391853 104188 -342143 -337290 117586 -210003
9235B2308a12467F8298K8858J39917a21922j54404C88423d31554A99746K4490
$$ 22308 -112467 68298 97156 237073 -121922 -276326 388423 -431554 199746 224236
9225B24236o133b83157K6069A69880b43798C263L3082A6166J55769c81425d3783
$$ 224236 218103 -283157 -257088 169880 -243798 3263 36345 16166 171935 -381425 -43783
9213G0134b988D7224i8063m083j02770i2548q7605K5088E385N0248a75142A15178
$$ 70134 -2988 47224 -98063 -102146 -204916 -92548 -180153 -155065 5385 55633 -175142 115178
9200G9960a93264A71715a5590B5769d8222q2399d2678j19717B936a07876a4283
$$ 79960 -193264 171715 -15590 25769 -48222 -130621 -42678 -162395 2936 -107876 -14283
9188A61005p5940b56379A90224b18293i3114M2492m6340p2276B4178Q8355A5314
$$ 161005 85065 -256379 190224 -218293 -93114 -50622 -96962 -169238 24178 112533 15314
9176b1906A62483d49714I6129l7887a18257m352o4530J1131D7931b25481k59149
$$ -21906 162483 -449714 96129 58242 -118257 -122609 -187139 -176008 47931 -225481 -484630
9165d84630C1858d13045a41225d3869C13070j46749a41871p0220o7702g8642k63596
$$ -484630 31858 -413045 -141225 -43869 313070 166321 -141871 -212091 -279793 -78642 -342238
9154c42238E5013c179F1028a94611b5016q0596F5259d12471J64231A37486n888
$$ -342238 55013 -3179 61028 -194611 -25016 -105612 65259 -412471 -248240 137486 131598
9143A31598b13235m1882c1737j79867j63108a33099p2668a0075r777k7188j76373
$$ 131598 -213235 -255117 -31737 -211604 -374712 -133099 -205767 -10075 -19852 -47040 -223413
9132b23413N4565n5326M3273C58246E1806c76715J82399Q2274q8647A55051a5264
$$ -223413 -168848 -224174 -180901 358246 51806 -376715 -194316 -112042 -200689 155051 -15264
9120a39758O6517F8063d7497k6333m6555P569L8229m0132B29467B1413i1444A34546
$$ -139758 -73241 68063 -47497 -73830 -120385 -112816 -74587 -114719 229467 21413 -91444 134546
9107a55241c5483j38579j16293a4668k14898p573d8065A99106H0509h4061A7975
$$ -155241 -35483 -174062 -290355 -14668 -229566 -237139 -48065 199106 80509 -84061 17975
9095F3987a16148H2841d3920B33588F3331J10326Q8204c9327B47890K21745b07856
$$ 63987 -116148 82841 -43920 233588 63331 173657 261861 -39327 247890 469635 -207856
9083c40164G5067M7934d35642B28750B6435f1220k64715K6258a31068j70167J7896
$$ -340164 75067 123001 -435642 228750 26435 -61220 -325935 -299677 -131068 -301235 -283339
9072b83339A6954c10304K7657I7351L894C2140G727c3674B8633a98301A26027
$$ -283339 16954 -310304 -282647 97351 101245 32140 7727 -33674 28633 -198301 126027
9060b54654e9581j00900C1177K49120a03798C3792b1107k06899M429A79509a55186
$$ -254654 -59581 -160481 31177 280297 -103798 33792 -21107 -228006 -223577 179509 -155186
9048D4506o71a05368k6963F1737b17019O7773k41488C3224L04704c93495f7517
$$ 44506 43835 -105368 -132331 61737 -217019 -149246 -390734 33224 337928 -393495 -67517
9036B79679j20584b26503B9836M3758c731A91622B6480h4728K0575A8831Q1059
$$ 279679 159095 -226503 29836 73594 -3731 191622 26480 -84728 -64153 18831 99890
9025I9890a642E2773a5138E5335a37008d0722F6455a86920j33034i8468C6726
$$ 99890 -1642 52773 -15138 55335 -137008 -40722 66455 -186920 -319954 -98468 36726
9013i6427D4428a7139j85446N9340f2656A02544d10850B50546a17601o3076B05182
$$ -96427 44428 -17139 -202585 -143245 -62656 102544 -410850 250546 -117601 -180677 205182
9001A38083a49977I0152e9066A77881a75576A75325a19327d1923B4400b20855
$$ 138083 -149977 90152 -59066 177881 -175576 175325 -119327 -41923 24400 -220855
8990B2320N9597b14809P68I0924m3779b14047B217b20642H4482B8487d2462j00751
$$ 22320 81917 -214809 -214041 90924 47145 -214047 2217 -220642 84482 28487 -42462 -143213
8978a43213A17643b53824L9746J04832A28973d89093B03256a89732h2218B31735
$$ -143213 117643 -253824 -214078 -109246 128973 -489093 203256 -189732 -82218 231735
8967A25451d11871B42677a96706o198a01135E1587b52991g0358o4985G7829P0027
$$ 125451 -411871 242677 -196706 -202904 -101135 51587 -252991 -70358 -135343 77829 147856
8956A47856i7091A7280i3649j82660C10773b98273a13281j8232N0645j40543O6131
$$ 147856 -97091 17280 -93649 -276309 310773 -298273 -113281 -131513 -80868 -221411 -155280
8945a55280B90342A462g2261H9960i5439B72510B7940N1769i9626B12327n5682
$$ -155280 290342 1462 -72261 89960 -95439 272510 27940 79709 -99626 212327 156645
8934A56645K2875r576M00176D7735J26550a29733c1033m3051D03381A83090J31117
$$ 156645 179520 169944 570120 47735 174285 -129733 -31033 -74084 403381 183090 314207
8923C14207O87131L14851N92374P358889K808651C770104A367208F35760B79962
$$ 314207 1001338 1316189 1908563 9267452 12076103 3770104 1367208 635760 279962
8913I3733K8888P6556a10167J4992D60K44775H7494J75230g8821E2030h2508B00659
$$ 93733 122621 199177 -110167 -95175 460 245235 87494 262724 -78821 52030 -82508 200659
8900E4438J41872c0230o8198A61438c10547e0129j15867r3341d6900A450f8698
$$ 54438 196310 -30230 -98428 161438 -310547 -50129 -165996 -259337 -46900 1450 -68698
8888F1973K7725j0812P5027B3705a70891B01832e4435a9824m11696c9450A76443
$$ 61973 89698 78886 153913 23705 -170891 201832 -54435 -19824 -431520 -39450 176443
8876a65568m1711D1495J36365M0619o638a35673G2308L725a86683d3923B65214
$$ -165568 -207279 41495 177860 218479 211841 -135673 72308 76033 -186683 -43923 265214
8864b08937A71058c1880J659A14179a23157K7792A87950b52085I3372b3547A75938
$$ -208937 171058 -31880 -30221 114179 -123157 -95365 187950 -252085 93372 -23547 175938
8852c8978p5081C77884b4200A73819c78464B08697G4965k4988D379b10110J02754
$$ -38978 -114059 377884 -24200 173819 -378464 208697 74965 49977 4379 -210110 -107356
8841a07356A03953b95083J34601j39517J29512O2509k01358C4103m800K2105n717
$$ -107356 103953 -295083 -160482 -299999 -170487 -107978 -309336 34103 29303 51408 45691
$$ [...]
##END NTUPLES=NMR SPECTRUM
##END=
