
##TITLE=AC1271_CMOAH12089_6666151_nOufhXHdrs
##JCAMPDX= 6.0         $$ Bruker NMR JCAMP-DX V2.0
##DATA TYPE= NMR SPECTRUM
##DATA CLASS= NTUPLES
##ORIGIN= BRUKER
##OWNER= Administrator
$$ 1.72 TOPSPIN		Version 2.1
$$ 2012-08-13 16:48:21.953 -0500  Administrator@TOPSPIN
$$ Compression mode = diff/dup
##.OBSERVE FREQUENCY= 400.02188249412
##.OBSERVE NUCLEUS= ^1H
##.ACQUISITION MODE= SIMULTANEOUS (DQD)
##.ACQUISITION SCHEME= undefined
##.AVERAGES= 8
##.DIGITISER RES= 22
##SPECTROMETER/DATA SYSTEM= spect
##.PULSE SEQUENCE= zg30
##.SOLVENT NAME= COFFEE_meoh
##.SHIFT REFERENCE= INTERNAL, COFFEE_meoh, 1, 14.98509
##AUDIT TRAIL= $$ (NUMBER, WHEN, WHO, WHERE, PROCESS, VERSION, WHAT)
$$ ##TITLE= Audit trail, TOPSPIN		Version 2.1
$$ ##JCAMPDX= 5.01
$$ ##ORIGIN= Bruker BioSpin GmbH
$$ ##OWNER= Administrator
$$ $$ C:\Bruker\TOPSPIN/data/COFFEE/nmr/AC1271_CMOAH12089_6666151_nOufhXHdrs/10/pdata/1/auditp.txt
$$ ##AUDIT TRAIL=  $$ (NUMBER, WHEN, WHO, WHERE, PROCESS, VERSION, WHAT)
(   1,<2012-08-13 16:48:01.718 -0500>,<Administrator>,<TOPSPIN>,<go>,<TOPSPIN 2.1>,
      <created by zg
	started at 2012-08-13 16:46:54.953 -0500,
	POWCHK enabled, PULCHK disabled,
       configuration hash MD5:
       6B 1B 68 BB D9 2E 58 E2 7F 35 AD 54 07 DF 0E 41
       data hash MD5: 64K
       01 5A BF 00 F3 30 B9 68 60 71 30 F1 1A 2E 7F 0D>)
(   2,<2012-08-13 16:48:13.109 -0500>,<Administrator>,<TOPSPIN>,<proc1d>,<TOPSPIN 2.1>,
      <Start of raw data processing
       efp LB = 0 FT_mod = 6 PKNL = 1 PHC0 = 0 PHC1 = 0 SI = 32K 
       data hash MD5: 32K
       89 7A 4C 00 65 07 B4 A4 19 69 7C 93 14 A8 B3 2F>)
(   3,<2012-08-13 16:48:13.843 -0500>,<Administrator>,<TOPSPIN>,<proc1d>,<TOPSPIN 2.1>,
      <pk PHC0 = 182.0874 PHC1 = 0 
       data hash MD5: 32K
       28 9A 88 6D B2 CC 4F 8A F9 01 9C B2 37 B2 99 F4>)
(   4,<2012-08-13 16:48:14.046 -0500>,<Administrator>,<TOPSPIN>,<proc1d>,<TOPSPIN 2.1>,
      <abs ABSG = 1 
       data hash MD5: 32K
       9F 9D F2 55 50 1F BF DE 57 BC F5 99 12 12 79 80>)
(   5,<2012-08-13 16:48:14.078 -0500>,<Administrator>,<TOPSPIN>,<proc1d>,<TOPSPIN 2.1>,
      <abs ABSG = 2 
       data hash MD5: 32K
       1A E8 03 19 A7 80 C0 A8 4A 7C 98 81 22 A3 A3 05>)
(   6,<2012-08-13 16:48:14.125 -0500>,<Administrator>,<TOPSPIN>,<proc1d>,<TOPSPIN 2.1>,
      <abs ABSG = 3 
       data hash MD5: 32K
       8A 68 63 78 BF 6B 09 AC C5 24 6B 82 E3 86 34 B5>)
(   7,<2012-08-13 16:48:14.156 -0500>,<Administrator>,<TOPSPIN>,<proc1d>,<TOPSPIN 2.1>,
      <abs ABSG = 4 
       data hash MD5: 32K
       9D A6 F5 5C 8B AD 19 FA 75 44 37 90 26 93 49 53>)
(   8,<2012-08-13 16:48:14.187 -0500>,<Administrator>,<TOPSPIN>,<proc1d>,<TOPSPIN 2.1>,
      <abs ABSG = 5 
       data hash MD5: 32K
       77 7C 04 6D 1B AA 4E BE C6 14 3E D7 8E 7C 59 12>)
$$ ##END=
$$ 
$$ $$ hash MD5
$$ $$ 44 13 62 BE 9C F5 A4 60 5C 26 9C F9 41 2C 5B 0E
##$RELAX= 
##$RELAX= 
##$RELAX= 
##$RELAX= 
##$RELAX= 
##$RELAX= 
##$RELAX= 
$$ Bruker specific parameters
$$ --------------------------
$$ [...]
##$TP= (0..7)
150 150 150 150 150 150 150 150
##$TP07= 0
##$TPNAME0= <>
##$TPNAME1= <>
##$TPNAME2= <>
##$TPNAME3= <>
##$TPNAME4= <>
##$TPNAME5= <>
##$TPNAME6= <>
##$TPNAME7= <>
##$TPOAL= (0..7)
0.5 0.5 0.5 0.5 0.5 0.5 0.5 0.5
##$TPOFFS= (0..7)
0 0 0 0 0 0 0 0
##$TUNHIN= 0
##$TUNHOUT= 0
##$TUNXOUT= 0
##$USERA1= <user>
##$USERA2= <user>
##$USERA3= <user>
##$USERA4= <user>
##$USERA5= <user>
##$V9= 5
##$VALIST= <valist>
##$VCLIST= <CCCCCCCCCCCCCCC>
##$VD= 0
##$VDLIST= <DDDDDDDDDDDDDDD>
##$VPLIST= <PPPPPPPPPPPPPPP>
##$VTLIST= <TTTTTTTTTTTTTTT>
##$WBST= 1024
##$WBSW= 4
##$XGAIN= (0..3)
0 0 0 0
##$XL= 0
##$YL= 0
##$YMAX_a= 469288
##$YMIN_a= -609431
##$ZGOPTNS= <>
##$ZL1= 120
##$ZL2= 120
##$ZL3= 120
##$ZL4= 120
##$ABSF1= 14.98509
##$ABSF2= -5.573092
##$ABSG= 5
##$ABSL= 3
##$ALPHA= 0
##$AQORDER= 0
##$ASSFAC= 0
##$ASSFACI= 0
##$ASSFACX= 0
##$ASSWID= 0
##$AUNMP= <proc_prof1d_extract_pilot.lims>
##$AXLEFT= 0
##$AXNAME= <>
##$AXNUC= <1H>
##$AXRIGHT= 0
##$AXTYPE= 0
##$AXUNIT= <>
##$AZFE= 0.1
##$AZFW= 0.1
##$BCFW= 0
##$BC_mod= 0
##$BYTORDP= 0
##$COROFFS= 0
##$CY= 15
##$DATMOD= 1
##$DC= 0
##$DFILT= <>
##$DTYPP= 0
##$F1P= 0
##$F2P= 0
##$FCOR= 0.5
##$FTSIZE= 32768
##$FT_mod= 6
##$GAMMA= 0
##$GB= 0
##$INTBC= 1
##$INTSCL= 1
##$ISEN= 128
##$LB= 0
##$LEV0= 0
##$LPBIN= 0
##$MAXI= 10000
##$MC2= 0
##$MEAN= 0
##$ME_mod= 0
##$MI= 0
##$NCOEF= 0
##$NC_proc= -8
##$NLEV= 6
##$NOISF1= 0
##$NOISF2= 0
##$NSP= 0
##$NTH_PI= 0
##$NZP= 0
##$OFFSET= 14.98509
##$PC= 1
##$PHC0= 182.0874
##$PHC1= 0
##$PH_mod= 1
##$PKNL= yes
##$PPARMOD= 0
##$PPDIAG= 0
##$PPIPTYP= 0
##$PPMPNUM= 2147483647
##$PPRESOL= 1
##$PSCAL= 4
##$PSIGN= 0
##$PYNMP= <proc.py>
##$REVERSE= no
##$SF= 400.02
##$SI= 32768
##$SIGF1= 0
##$SIGF2= 0
##$SINO= 400
##$SIOLD= 32768
##$SPECTYP= <>
##$SREGLST= <1H.CDCl3>
##$SSB= 0
##$STSI= 32768
##$STSR= 0
##$SW_p= 8223.68421052631
##$SYMM= 0
##$S_DEV= 0
##$TDeff= 65536
##$TDoff= 0
##$TI= <>
##$TILT= no
##$TM1= 0
##$TM2= 0
##$TOPLEV= 0
##$USERP1= <user>
##$USERP2= <user>
##$USERP3= <user>
##$USERP4= <user>
##$USERP5= <user>
##$WDW= 1
##$XDIM= 32768
##$YMAX_p= 480105636
##$YMIN_p= -697331
##$CURPLOT= <Network HP LaserJet P1505>
##$CURPRIN= <$Network HP LaserJet P1505>
##$DFORMAT= <normdp>
##$LAYOUT= <+/1D_H.xwp>
##$LFORMAT= <normlp>
##$PFORMAT= <normpl>
##$SURQMSG= 1
$$ End of Bruker specific parameters
$$ ---------------------------------
##NTUPLES= NMR SPECTRUM
##VAR_NAME=  FREQUENCY,     SPECTRUM/REAL,   SPECTRUM/IMAG
##SYMBOL=    X,             R,               I
##VAR_TYPE=  INDEPENDENT,   DEPENDENT,       DEPENDENT
##VAR_FORM=  AFFN,          ASDF,            ASDF
##VAR_DIM=   32768,         32768,           32768
##UNITS=     HZ,            ARBITRARY UNITS, ARBITRARY UNITS
##FACTOR=    0.250966925370066, 1,           1
##FIRST=     8223.43324360094, -176312,      -25169
##LAST=      0,             -93790,          -93468
##MIN=       0,             -697331,         0
##MAX=       8223.43324360094, 480105636,    0
$$ Real data points
##PAGE= N=1
##DATA TABLE= (X++(R..R)), XYDATA
$$ [...]
19474B3055b40511A33875c17834B12013b05196m9012d5968A2810b6149C031J33596
19463A36627a00617B16025C7104h6851D56526k23160b0741m4113A85848d51304
19452a29850d2884j68452d188l9569A57467B6327a56459c9749O458j07757j67290
19441c08338g1850a4153k71910h8879D6563J44453a834D2318b2824j72784h9971
19429a11967m8458a8013C6084L9200h8306A5903F708a94909i3657r5782j02431
19418b91870I7893d471A4685e04899A831e05317f1936j90796j35462A85175a77364
19406b75067a7222j05215A40305a84391p5531A21731a05511L1755j67212j03844
19396c44812J28156f4051j0800L2191j20458E136a22986K1515j60687D0732J64079
$$ y = [23055, -240511, 133875, -317834, 212013, -205196, -254208, -45968, 12810, -26149, 3031, 136627, -100617, 216025, 37104, -86851, 456526, 233366, -20741, -64854, 185848, -451304, -129850, -42884, -211336, -4188, -43757, 157467, 26327, -156459, -39749, -33291, -141048, -308338, -71850, -14153, -286063, -88879, 46563, 191016, -1834, 42318, -22824, -195608, -89971, -111967, -160425, -18013, 36084, 75284, -88306, 15903, 6708, -194909, -93657, -189439, -291870, 97893, -4471, 14685, -504899, 1831, -505317, -61936, -252732, -388194, 185175, -177364, -275067, -17222, -122437, 140305, -184391, -259922, 121731, -105511, -73756, -240968, -344812, -216656, -64051, -74851, -42660, -163118, 5136, -122986, -101471, -262158, 40732, 204811]
19385B04811a30140k2165j5929F383d15868G9962I991J45123a28297M2437n3152
19374a39012m4825k4939I4963a10682B18317j03016c00052J03759A53298b00444
19363g1658B01630f4165j37765A41520a45654A53774n6884O4796g3574K5562r9971
19352a47983A8737R0098a13944A50979d20010F9552h9238j70882j92796A27281
19341a13718A11283b92613a20625I9393f0784l2210A22796b44458I0371k8683
19331F1688L5718a42288d7776l9464m4239K8757L1234k12201a09382G0146B4799
19319f7537p7852A10663a56668L2951J6764C9140M1717b35262h2609o2875q9076
19308b34560b0334B45326n017A7566a96331A96854a12484D7730B3139J8801j0575
$$ y = [204811, -130140, -152305, -168234, 6383, -415868, 79962, 9991, 155114, -128297, -85860, -139012, -183837, -208776, 94963, -110682, 218317, 115301, -300052, -196293, 153298, -200444, -71658, 201630, -64165, -201930, 141520, -145654, 153774, 96890, 161686, -73574, -48012, -147983, 18737, 108835, -113944, 150979, -420010, 69552, -89238, -260120, -452916, 127281, -113718, 111283, -292613, -120625, 99393, -60784, -92994, 122796, -244458, 90371, 61688, 97406, -142288, -47776, -87240, -131479, -102722, -71488, -283689, -109382, 70146, 24799, -67537, -145389, 110663, -156668, -123717, -106953, 39140, 80857, -235262, -82609, -145484, -234560, -20334, 245326, 240309, 17566, -196331, 196854, -112484, 47730, 23139, 41940, 31365]
19297C1365a07837b1428n2181H2238J49592C7289J78270i6470H2294a99318A02169
19285B3251d24060D6013K4885c49195d2B74738r0859b45304H5854I193O2752K34074
19273C06019b30131A11426A1009a10249j42094A58844M1440Q3767E7024c430j17345
19262a20775H250a983n5432j6604A59434l5194n5418h844r485H8988Q80a57528
19249b20010M9638A45417c14271m4953a37565j17686d4696D3189b63466l623a5129
19237b69560O3145L400M1095I0111f1454j38968B52358e9483b3317j60672g1259
19225B35048c9252J9585j51576B38011n4339a04006j65595k07113B32805d04650
19214C85734D4001J64766b63583g856j21221m1037j49255O4371a01405r5476c5044
$$ y = [31365, -107837, -21428, -73609, 82238, 231830, 37289, 215559, -96470, 82294, -199318, 102169, 23251, -424060, 46013, 70898, -349195, -42, 274738, 183879, -245304, 85854, 9193, 71945, 306019, -230131, 111426, 11009, -110249, -252343, 158844, 200284, 284051, 57024, -3430, -120775, 8250, -1983, -57415, -74019, 159434, 124240, 68822, -8844, -18329, 88988, 89868, -157528, -220010, -170372, 145417, -314271, -359224, -137565, -255251, -44696, 43189, -263466, -267089, -15129, -269560, -206415, -203015, -161920, 90111, -61454, -200422, 252358, -59483, -23317, -183989, -71259, 235048, -39252, -19667, -171243, 238011, 183672, -104006, -269601, -476714, 232805, -404650, 385734, 44001, 208767, -263583, -7856, -129077, -170114, -319369, -254998, -101405, -196881, -35044]
19202a53352C0417b59404R7447L456j11057A18148g6731k6957j46553j37559a20759
19190b84398M5358J13668M2187k97751a49316B85668A19771e9049A55474A5892
19179A4581c90348h3588C13952a34776j97887g9415j02943O0401j8621f3932g711
19167A37503b32277q9214A55333b17819M943j27656B10055G4828n966c7964j60069
19156a98033c7307q9451A35266a23635A50451B2560b51387A25544D9144Q561A2922
19144D822a06856C2944M4807N4823f9183A42903h0726c4576j93145e0313k58520
19133c08833J2064J30144F1342D090a89596j56737l5989J26362a2457j49537f2462
19121c03248A42726A0705c7559k62556l16841B4277J42887a21126J3497j31385
$$ y = [-153352, 30417, -259404, -161957, -158501, -269558, 118148, -76731, -103688, -250241, -387800, -120759, -284398, -239040, -125372, -83185, -380936, -149316, 285668, 119771, -59049, 155474, 15892, 14581, -390348, -83588, 313952, -134776, -332663, -79415, -182358, -121957, -140578, -63932, -7711, 137503, -232277, -321491, 155333, -217819, -212876, -340532, 210055, 74828, 68862, -37964, -198033, -37307, -126758, 135266, -123635, 150451, 22560, -251387, 125544, 49144, 57705, 12922, 4822, -106856, 32944, 77751, 132574, -69183, 142903, -80726, -34576, -227721, -50313, -308833, -296769, -166625, 61342, 4090, -189596, -346333, -382322, -255960, -12457, -161994, -62462, -303248, 142726, 10705, -37559, -300115, -616956, 24277, 167164, -121126, -107629, -239014]
19111b39014h5322K7988A16415b86460a07378k03574B62855j19406D9779c83632
19100c89337J33436C0022N1425a82888A30634E8025a26602A50845Q4209i3607
19089A87303a29568r7016m5435O1694C13336c0049k270q5798l53569a61454g5655
19077i235o8388H3845b60831A50743a7052D007M72861B26681j8595b20099e2112
19065a77248N7346l55481a66789M3127j24347i9571M2878B0675a26987j0322C0081
19053c7278I3727j6627c58966H4365b38084G8141M5499p42h7016I626b65860E5447
19040B08102j00927b36426A7698J3059b50454J24191B60406b83535A7143J63030
19030A80173C4024K37453f2371A46440N1035B2314Q4172c9938k797k21297A90078
$$ y = [-239014, -85322, -57334, 116415, -286460, -107378, -310952, 262855, 143449, 49779, -383632, -389337, -255901, 30022, 81447, -182888, 130634, 58025, -126602, 150845, 235054, -93607, 187303, -129568, -226584, -272019, -210325, 313336, -30049, -32319, -118117, -471686, -161454, -75655, -9235, -77623, 83845, -260831, 150743, -17052, 4007, 476868, 226681, 208086, -220099, -52112, -177248, -119902, -475383, -166789, -123662, -248009, -99571, -56693, 20675, -126987, -137309, 30081, -37278, 93727, 77100, -358966, 84365, -238084, 78141, 123640, 122898, -87016, 9626, -265860, 55447, 208102, 107175, -236426, 17698, 30757, -250454, -126263, 260406, -283535, 17143, 180173, 34024, 271477, -62371, 146440, 197475, 22314, 106486, -39938, -42735, -264032, 190078]
19018A49341p0954C121a07050b3980f555A3071h7224F5299K45360a45798B46925
19006A49014a77070h2294a0903C5898K75552A39013b21926B22785b75370J20129
18996a55241A44745a28512N8503B80191a70507n3111k01546J66150A19343c76948
18985b5178E8088d89369A46565K95797a01387b1522p2266H6443b63023d1773A69316
18973b00255C2573J71860J74109M03619j60369f3026A80458c24211J44021E7390
18962a07390e1989j71659A18703a05257B99296b47381g3034k5704k74097J66536
18952b06299j17232a44146C2869b83456A07521b66419J16364c2157A52439a21116
18941A77124L7251i0503j785n1034B32525g9624G4164O0504c8949D8277a95726
$$ y = [149341, 78387, 3121, -107050, -23980, -6555, 13071, -87224, 65299, 310659, -145798, 246925, 149014, -177070, -82294, -10903, 35898, 311450, 139013, -221926, 222785, -275370, -155241, 144745, -128512, -70009, 280191, -170507, -223618, -425164, -259014, 119343, -376948, -25178, 58088, -489369, 146565, 442362, -101387, -21522, -93788, 86443, -263023, -41773, 169316, -200255, 32573, 204433, 378542, 782161, 621792, -63026, 180458, -324211, -180190, 57390, -107390, -51989, -223648, 118703, -105257, 299296, -247381, -73034, -98738, -372835, -206299, -323531, -144146, 32869, -283456, 107521, -266419, -150055, -32157, 152439, -121116, 177124, 214375, -90503, -92288, -143322, 232525, -79624, 74164, 134668, -38949, 48277, -195726]
18929H8941k6821l218k3522J20949D4248K13309c3480j57859A80424b79640a29471
18917a58680B70611b13303D43942B086b343j30397F2494J54002H4447L21218J31901
18906E37566q6710e1788b2167l964k7417F5710c13496A58295j6699e60992K41823
18895c19169m637A01699i307l9667j74297d2783p7345C25632F0956b90427A13564
18883G0521a3536A58125d21318J92411h8122G9212k1256b58131A0239K51272a61621
18871B55115g0681n7666j91915a00774k58299R5113a2359E049b49944h895C14825
18859H1083d7508j83553j22733A10171a97481A44319a55981L3139A01279b90252
18848a99836e0000j53991A19068J29801e3337I6681c66779A02573J48762b20464
$$ y = [88941, 62120, 58902, 35380, 156329, 44248, 257557, -33480, -191339, 180424, -279640, -129471, -158680, 270611, -213303, 443942, 2086, -2343, -132740, 62494, 216496, 84447, 405665, 537566, 450856, -51788, -22167, -26131, -53548, 65710, -313496, 158295, 141596, -560992, -319169, -323806, 101699, -9307, -48974, -223271, -42783, -120128, 325632, 60956, -290427, 113564, 70521, -13536, 158125, -421318, -228907, -88122, 79212, 57956, -258131, 10239, 261511, -161621, 255115, -70681, -128347, -320262, -100774, -359073, -263960, -12359, 5049, -249944, -8895, 314825, 81083, -47508, -231061, -353794, 110171, -197481, 144319, -155981, -122842, 101279, -290252, -199836, -50000, -203991, 119068, 248869, -53337, 96681, -366779, 102573, 251335, -220464]
18837a94762j43376a15577A34136b37900P7213L3387A87065c4363m2973A53339
18826a1019j1092p7515A32863a12575J4838b6701J1390l00945K8499J02024L3236
18815a52497c0596j77049H7948d981j9824j55906f206A28701g4303H4136M2129
18804A26265n321c530B77983i2439k25547N863G7397a57064I0332b1122j8075
18793c9197k38561a0838F0586g3737E705a16709l5564H1150j0461M9062g7122
18781A14349i0904H044J19892b68446K8261i4848a9775j30201r2502h1540k9888
18770a11428C05979C8429J62572i7423K2675B42795M5642a79203h8145a1106E5877
18758I4631g955o0939H9863e7516q3588B02809J91956c41849m7506K8122I1226
$$ y = [-194762, -338138, -115577, 134136, -237900, -160687, -127300, 187065, -34363, -77336, 153339, -11019, -22111, -99626, 132863, -112575, -97737, -26701, -15311, -316256, -287757, -185733, -152497, -30596, -207645, 87948, -4981, -24805, -180711, -6206, 128701, -74303, 84136, 126265, 120944, -3530, 277983, -92439, -317986, -312123, 77397, -157064, 90332, -21122, -39197, -277758, -10838, 60586, -73737, 5705, -116709, -152273, 81150, 70689, 119751, -77122, 114349, -90904, 8044, 127936, -268446, -240185, -94848, -19775, -149976, -242478, -81540, -111428, 305979, 38429, 201001, -97423, -74748, 242795, 288437, -179203, -88145, -11106, 55877, 94631, -7955, -68894, 89863, -57516, -141104, 202809, 394765, -341849, -389355, -361233, 91226]
18746A78242d2994G6921j5431K13885h3066c5280l7666j36348P7335j12001A5756
18734i5409a5031H3429a45213j99549l855L7868A93095a07828l1805a4274m3055
18723e7329k02545M9483A3739L1303e7414k94138j92737J83228J14707E6720Q1520
18712A38240A7364a05783Q54j83108Q8239m04l3686B8054a96462n9104a23385
18700A53537e9300q0073N5833B97911D1718b6851r5581K355H824b70665i7413
18688a67273G1977a56925I5158J93406F9181l4534a29681D49197j84639i3312
18677a52737r5811B1329L0552a04785l4365B07267k6013K0044E583d2785j73386
18666b16171A5187a71373b4998o2535k3481d7811a1383k83964F6388R1471o7524
$$ y = [178242, -42994, 76921, 61490, 275375, -83066, -35280, -72946, -209294, -131959, -243960, 15756, -95409, -15031, 83429, -145213, -344762, -348617, -310749, 193095, -107828, -139633, -14274, -57329, -259874, -210391, 13739, 45042, -57414, -351552, -544289, -361061, -246354, 56720, 138240, 17364, -105783, -104929, -288037, -199798, -200202, -233888, 28054, -196462, -255566, -123385, 153537, -59300, -139373, -83540, 297911, 41718, -26851, -122432, -120077, 8824, -270665, -97413, -167273, 71977, -156925, 95158, 288564, 69181, 34647, -129681, 449197, 264558, -93312, -152737, -248548, 21329, 51881, -104785, -139150, 207267, 181254, 201298, 5583, -42785, -216171, 15187, -171373, -24998, -87533, -111014, -47811, -11383, -295347, 66388, 157859, 90335]
18655I0335c2454A12654c78350d9705l8772F6797I79K75012d17354D11127c30696
18643B20247a81942G941c4801k2387B09032J74172b3840k45045h7157k4909j11915
18632b23981j3907I7722b07041o1469g4554l16952H7133c4652j16776k25413a40320
18620I8745k3133c4949j1103A60420a47066A76497L5366b48192C48557d180j20745
18609a24925e7004r8330j27776A48133G1597a48959K0474A54534p5721a93842
18598a04708A26519a51988D5219M2162B1974c46039A6580J04970c42051A199a94522
18586b13684j54484d2682k47907K7571J4651d6135D0899b76312B4691d9466B09601
18574b02203D2455f5242o6667j73999Q1076l5258P3880A08477b23147m6129D0396
$$ y = [90335, -32454, 112654, -378350, -49705, -88477, 66797, 979, 275991, -417354, 411127, -330696, 220247, -181942, 7941, -34801, -57188, 209032, 383204, -23840, -268885, -87157, -112066, -223981, -237888, 97722, -207041, -268510, -74554, -391506, 87133, -34652, -151428, -376841, -140320, 98745, 75612, -34949, -46052, 160420, -147066, 176497, 211863, -248192, 348557, -4180, -124925, -57004, -155334, -283110, 148133, 71597, -148959, -128485, 154534, 78813, -193842, -104708, 126519, -151988, 45219, 87381, 21974, -346039, 16580, 121550, -342051, 1199, -194522, -213684, -368168, -42682, -290589, -263018, -248367, -46135, 40899, -276312, 24691, -49466, 209601, -202203, 42455, -65242, -131909, -305908, -224832, -260090, -186210, 108477, -223147, -269276, 40396]
18562I1622f5173m3300G0147a8782j4231F1664b91623C7080a35437j88465j99103
18551e23005J94235G8323C218g2979B04313l7311l7745a06938j10963e106j04819
18540a09925A15902a99646C7559b56599R2056j25637i5137j08349j39854e2224
18529A1373h1401j3311k2022j97082a1085A42965c45316A15509K93601A38966
18518c7060H7763b03247b2930k94636Q7845A92655a74570B70060A9619J49975
18508A69594k7117b14070A35083k5941A2535a09428B60974Q8228a85853g8141
18497i8108J8768k45352I7317c05366C71398c24068a7026j26810f9352j51548
18487b20900B57057h3986C8214c41906A15581D3336c9541j531B4167Q074K4099
$$ y = [91622, -65173, -108473, 70147, -18782, -33013, 61664, -291623, 37080, -135437, -323902, -523005, -328770, 78323, 3218, -72979, 204313, 167002, 129257, -106938, -217901, -5106, -109925, 115902, -199646, 37559, -256599, -164543, -290180, -95137, -203486, -343340, -52224, 11373, -81401, -94712, -116734, -313816, -11085, 142965, -345316, 115509, 409110, 138966, -37060, 87763, -203247, -22930, -317566, -229721, 192655, -174570, 270060, 19619, 169594, 142477, -214070, 135083, 109142, 12535, -109428, 260974, 349202, -185853, -78141, -98108, -79340, -324692, 97317, -305366, 371398, -324068, -17026, -143836, -69352, -220900, 257057, -83986, 38214, -341906, 115581, 43336, -39541, -41072, 24167, 32241, 56340]
18476E6340N952b12513A20465C6189a57319P2114A17937n7377b27975I7663O5081
18465A62744a42126A22038a32771C11349j24526a71001n3125Q1861k1913A90199
18454c69999J30402K2327A1645P5926a47099E2920a50493H6196q918a64965C80511
18442E2402c903j2866j65551C1419R397J3746J4497f7052r0822j4673O0013c9449
18429B44260K8988F9088i1971l06731a0619l0411A55434C8048M8459b99575e8823
18417h3850j23445b7714j66319h9728A71220h9772G9105b52984C1515c07336f1213
18405A11381b48378j49614A43871d0965k35647g6510B74136A07623b005B21559
18394A27005a67659M5272L2553H5729a1157A72112n1278J82200o7991r1251k6317
$$ y = [56340, 62292, -212513, 120465, 36189, -157319, -85205, 117937, 60560, -227975, 97663, 162744, -142126, 122038, -132771, 311349, 186823, -171001, -224126, -142265, -164178, 190199, -369999, -239597, -217270, 11645, 87571, -147099, 52920, -150493, 86196, 77278, -164965, 380511, 52402, -3903, -16769, -182320, 31419, 40816, 54562, 69059, -67052, -157874, -172547, -112534, -39449, 244260, 273248, 69088, -91971, -398702, -10619, -41030, 155434, 38048, 86507, -299575, -58823, -83850, -207295, -27714, -194033, -89728, 171220, -89772, 79105, -252984, 31515, -307336, -61213, 111381, -248378, -397992, 143871, -40965, -276612, -76510, 274136, 107623, -2005, 221559, 127005, -167659, -122387, -89834, 85729, -11157, 172112, 120834, 303034, 235043, 143792, 117475]
18383A17475O8900h7602l1636l0412j80426a56369O8750o0070k13368d9675k3643
18372g3318F1504a93071A48202c2455A23054J0033M730c944k56380a14066B53745
18360b4972n6845K8426f154A75238A5657K99646i1056A62561P1638F45a57589
18348C31454j47328b07915B0703a66596K7820E6470a37770B23453a59367C14299
18337a38171L7040j61591D8356J74083a78553M3677a0532G0919g5510j61515B1587
18325G4368b18248c2704a4291r6703C6892a76342K9717f0268A4959K9337J58929
18314B03225b62184I874e62813b46625C4245K5027f8440B06226L6000c41991H9610
18302a36921f0031j36455B3662J84327D4429a03738r4498F7519f36l2470R301
$$ y = [117475, 186375, -87602, -119238, -149650, -330076, -156369, -87619, -147689, -361057, -49675, -73318, 61504, -193071, 148202, -32455, 123054, 133087, 137817, -3944, -260324, -114066, 253745, -24972, -81817, -53391, -6154, 175238, 15657, 315303, -91056, 162561, 234199, 645, -157589, 331454, 184126, -207915, 20703, -166596, -138776, 56470, -137770, 223453, -159367, 314299, -138171, -101131, -262722, 48356, 222439, -178553, -134876, -10532, 70919, -75510, -237025, 21587, 74368, -218248, -32704, -14291, -110994, 36892, -176342, -146625, -60268, 14959, 44296, 203225, -262184, 9874, -562813, -246625, 34245, 59272, -68440, 206226, 242226, -341991, 89610, -136921, -60031, -196486, 23662, 207989, 44429, -103738, -198236, 67519, -636, -33106, -23805]
18291b3805R07k6754B62858g4502A53120K31262A79062n0556c45417C7738c52079
18279c58746j05174a82797B236e6378C5982g3874E3335a97495a5659l10667B51114
18267b11897b8789C68443c02300A32062b43720g3210A30259b40010L3587d0688
18256e52945A31397B2861J1407c6507o5647a220A98826a45175F8584b99712E1141
18244e585j8647A65000R903b43075H1001c9654K544j50307C2299b32055A84365
18232F5158a52428j7019g4752J1038A33217a01435C78227A20704a70375j2786
18222a83161C77521I2215N2857b8074H8156a34247H1819J00376a93889E9988B959
18210A51124C6624b35087m6489B15433p7413a87992b9138D0276R2662K3493l0981
$$ y = [-23805, -22898, -49652, 262858, -74502, 153120, 384382, 179062, 128506, -345417, 37738, -352079, -358746, -463920, -182797, 2236, -56378, 35982, -73874, 53335, -197495, -15659, -326326, 251114, -211897, -28789, 368443, -302300, 132062, -243720, -73210, 130259, -240010, -206423, -40688, -552945, 131397, 22861, 34268, -36507, -102154, -1220, 198826, -145175, 68584, -299712, 51141, -5585, -24232, 165000, 174903, -243075, 81001, -39654, -37110, -187417, 32299, -232055, 184365, 65158, -152428, -169447, -74752, -63714, 133217, -101435, 378227, 120704, -170375, -183161, 377521, 92215, 145072, -28074, 88156, -134247, 81819, 182195, -193889, 59988, 2959, 151124, 36624, -235087, -281576, 215433, 138020, -187992, -29138, 40276, 132938, 156431, 125450]
18199A25450a64864k31594A25860L25905d02547C89082H8551O6747M7760F2490
18188g7291l084j5113J0990I8347a6144r9198A45168b26756R2148D5859B2620
18176A20272J20214b78179d9094n5344A87818c42761I3000b15549g5833j48559
18166b24392R5508j73374a27103e4533Q723A19351L895K27983H0656a31031A34454
18154b58560i7428H7660b14070C9864b05006a00814G6319f9742m42253G5454h5021
18142B38032N0231e0663k01396F4517qd7651J1327C31998E685J28411j3472c39961
18129A37183D362a80067A50275C0018c2578A75104p6325c6376B04491a94497i0205
18117a34730o1506E3112b14651B85862a14060A83217o501i036n4281n0391j1423
$$ y = [125450, -164864, -396458, 125860, 451765, -402547, 389082, 88551, 155298, 203058, 62490, -77291, -80375, -95488, -84498, 98347, -16144, -115342, 145168, -226756, -134608, 45859, 22620, 120272, 240486, -278179, -49094, -104438, 187818, -342761, 93000, -215549, -75833, -224392, -128884, -302258, -127103, -54533, -45810, 119351, 123246, 351229, 80656, -131031, 134454, -258560, -97428, 87660, -214070, 39864, -205006, -100814, 76319, -69742, -511995, 75454, -85021, 238032, 288263, -50663, -252059, 64517, 64509, -47651, -36324, 331998, 5685, 134096, 120624, -339961, 137183, 4362, -180067, 150275, 30018, -32578, 175104, 98779, -36376, 204491, -194497, -90205, -134730, -196236, 53112, -214651, 285862, -114060, 183217, 176716, -9036, -63317, -113708, -125131]
18106a25131k45021J9736a31116o0003A20280a85577p257E6712e62175b45824
18095F9825N7996k6207B9703L0591b46661R3209C35220a7487q2646D1367J72374
18084B13741a82987B59328h3600j62095h8354B84771I5517Q7039g8593j23065
18074b01658J3915A46705i6236j6510e1563j05459j1154G7800a38713k8858C96276
18062B08874i2474a4197C5128Q276h8536A7709a42658B80531a83257A61202E4754
18050A82084a07383q2457A39209M4006n4483a73670A4486K5556b56780f0839G5575
18038C93819E4230i0271L3050B38607a15173e5231B5377N0198h049l68938h0368
18026a69842I554c1446n288C05752p9795K7272a48802d2609j49774K3425j12344
$$ y = [-125131, -370152, -350416, -131116, -191119, 120280, -185577, -192834, 56712, -562175, -245824, 69825, 127821, 101614, 29703, 60294, -246661, -153452, 335220, -17487, -100133, 41367, 213741, -182987, 259328, -83600, -245695, -88354, 284771, 95517, 182556, -78593, -201658, -187743, 146705, -96236, -112746, -51563, -157022, -168176, 77800, -138713, -167571, 396276, 208874, -92474, -14197, 35128, 43404, -88536, 17709, -142658, 280531, -183257, 161202, 54754, 182084, -107383, -189840, 139209, 183215, 128732, -173670, 14486, 40042, -256780, -60839, 75575, 393819, 54230, -90271, -57221, 238607, -115173, -55231, 25377, 75575, -8049, -376987, -80368, -169842, 9554, -31446, -36734, 305752, 225957, 253229, -148802, -42609, -192383, -168958, -281302]
18015b81302I0321g0623j19417B15085P9494A3587M4777R7591b77247I7739N1807
18004A49546p2663i4477A01115i2305j75266E25762A71882F6078f9265j61206
17994b30471K6479B42982a79221a8948C4667O9035c7064A47482o1639b02557J2706
17983a89851J8328N7638J8124j49842O6B37972q4748e9185k47365r8782c473E504
17970a17286a2047o7624D4166K56382E7296K57759a4009D3995b75703R0374H2752
17958B13023a381B44217r8997A3642b07097F4010J02759g4671H5094K16180b11242
17946a98359i2435a3310C6261d186m94730A09751J7691h913k03181c0857C61668
17934A04877a23508A34221J00900o431c19621A29687a1724C4044b65041H6365
$$ y = [-281302, 90321, -70623, -190040, 215085, 294579, 13587, 58364, 155955, -277247, 97739, 149546, 76883, -94477, 101115, -92305, -267571, 525762, 171882, 66078, -69265, -230471, -203992, 242982, -179221, -18948, 34667, 103702, -37064, 147482, 85843, -202557, -189851, -171523, -113885, -95761, -245603, -245537, 237972, 153224, -59185, -306550, -405332, -3473, 5504, -117286, -12047, -79671, 44166, 300548, 57296, 315055, -14009, 43995, -275703, -185329, 82752, 213023, -1381, 244217, 145220, 13642, -207097, 64010, 166769, -74671, 85094, 301274, -211242, -198359, -92435, -13310, 36261, -4186, -498916, 109751, 127442, -8913, -212094, -30857, 361668, 104877, -123508, 134221, 235121, 228690, -319621, 129687, -11724, 34044, -265041, 86365]
17923f7810B6057a71305b5434I0074a12137B3855K18342A8209J70545F4230a04785
17911a08472A63236l226J17372l1708E6254b04563C21738c48101A9253L6147g1088
17899A97423e6366j19748a065m1832n6742E6545a13146n7106A9802J08094l6760
17888I1136b879j56248h339q2599H2319a02219B16660a64419E8092J20625J52734
17877C31451D4075g0933c2206H3681a49757B02204i2281B37261o6475a66496D086
17865h1379A40049b2708j70120A01447a23130A45000c46922A20167B4277d9414
17854a62138A47762d7969k26672E5696g7203A10768b80979j8384f7083E6233J43958
17843B00191b76846A96359o7996O9562b0945B17075J5982a649j1854o9041n727
$$ y = [-67810, 26057, -171305, -25434, 90074, -112137, 23855, 242197, 18209, 188754, 64230, -104785, -108472, 163236, 160010, 277382, 245674, 56254, -204563, 321738, -348101, 19253, 55400, -71088, 197423, -56366, -176114, -1065, -42897, -99639, 56545, -113146, -170252, 19802, 127896, 91136, -2879, -159127, -8339, -90938, 82319, -102219, 216660, -164419, 58092, 178717, 331451, 44075, -70933, -32206, 83681, -149757, 202204, -92281, 237261, 170786, -166496, 4086, -81379, 140049, -22708, -192828, 101447, -123130, 145000, -346922, 120167, 24277, -49414, -162138, 147762, -47969, -274641, 55696, -77203, 110768, -280979, -299363, -67083, 56233, 200191, -276846, 196359, 128363, 197925, -20945, 217075, 233057, -1649, -13503, -82544, -88271]
17832h8271B86277E5330N715b55342a15089L642c5222a7330k73398a08565c2707
17820A48492l7279M2440A2531O0362Q9565A7602J08303e0734n7589A38278m5108
17809I3170Q0148G7941k5175b62629i6666K5465j52101J7773A63766e5952q6287
17798a42239D22774a41165F1598J93071L67633A1420b44235C9996a18591B4856
17787A19427b3387A55972G3429M7914e8432J1925A34940J42357D7040a66135K6660
17776a39475k871j44847J33254N613a8332B21819d8045j30736D253k47J50196
17765A54202a6763C32989a76443a1370j2175B19733A2285J52114m5788k4190D2276
17753F9711O0397b3544m2077B26927E0745a71648C87516b96163A1843K32764q7258
$$ y = [-88271, 286277, 55330, 61045, -255342, -115089, -111447, -35222, -17330, -290728, -108565, -32707, 148492, 111213, 153653, 12531, 72893, 162458, 17602, 125905, -50734, -108323, 138278, 93170, 173318, 77941, 52766, -262629, -96666, -71201, -223302, -205529, 163766, -55952, -142239, 422774, -141165, 61598, 254669, 622302, 11420, -244235, 39996, -118591, 24856, 119427, -23387, 155972, 73429, 121343, -58432, -46507, 134940, 277297, 47040, -166135, -139475, -142346, -287193, -153939, -148326, -18332, 221819, -48045, -178781, 4253, 4006, 154202, -16763, 332989, -176443, -11370, -23545, 219733, 12285, 164399, 118611, 94421, 42276, 69711, 130108, -23544, -65621, 226927, 50745, -171648, 387516, -296163, 11843, 244607, 157349]
17742A57349J66963f6436E181a15653A03169a86512B16926b91059a08012A2010
17731C3534M4128J79378F601J35381P9402O0537j38096K7809L4964J06734A43502
17719D2810b04214E1623a8718A23085K690a8641j62489B14178J40765d1973C40974
17707a29181A43763M5377p8147b04272C28064J70235c65013C21784A09974c08606
17696A39585i1676A49582E2113J772L87748k01299q9398J14975A07125a29333
17685C00584a36186A95099a58597G3347m882a16235C5107K16068J01753A05406
17674I8870H973J74638n139B3996R2922m7151b00759e4730A11283N7655J50156
17663C19094J44350i3610B19568L8925H8896k1633J73667c832a841A09058r17
$$ y = [157349, 324312, -66436, 5181, -115653, 103169, -186512, 216926, -291059, -108012, 12010, 33534, 77662, 257040, 6601, 141982, 221384, 281921, 143825, 171634, 206598, 313332, 143502, 42810, -204214, 51623, -18718, 123085, 125775, -18641, -181130, 214178, 354943, -41973, 340974, -129181, 143763, 189140, 110993, -204272, 328064, 498299, -365013, 321784, 109974, -308606, 139585, -91676, 149582, 52113, 53885, 441633, 240334, 150936, 265911, 107125, -129333, 300584, -136186, 195099, -158597, 73347, 68465, -116235, 35107, 251175, 352928, 105406, 98870, 8973, 183611, 178472, 23996, 116918, 69767, -200759, -54730, 111283, 168938, 319094, 463444, -93610, 219568, 258493, 88896, 67263, 240930, -3832, -1841, 109058, 108141]
17652A08141C9567i0920K5864a71o3893k2822c1335j66218I7043L87281b08210
17640A61550F1813A5477L00556J08622j356b61017f114B1886J30952F9869L24213
17629C94082A59875k0538g8513A53627b36683B99424A2267m875J00720N6706J11675
17618B76493i277D63559h8326H0045a54584F7581J49972L7802o6213p5813L21029
17607D34358k09074g3337A71899g7941B61091J05515c1206C72022b5434C26062
17596b31699A02444M4280o8416b9415l25817A8191a66150G7964C5936j6609a3102
17584B74579j10347M7790m3472N2678b5466N402K198A29853D2585K08298A02929
17572b99995C95862f3873B92208E0278b420j79878D75619b16968A45730J58631
$$ y = [108141, 39567, -90920, -65056, -171, -64064, -86886, -31335, -197553, 97043, 484324, -208210, 161550, 61813, 15477, 316033, 424655, 423299, -261017, -6114, 21886, 152838, 69869, 394082, 159875, 139337, -78513, 153627, -236683, 299424, 12267, 7392, 108112, 164818, 276493, -9277, 463559, -88326, 80045, -154584, 67581, 217553, 255355, 189142, 113329, 434358, 225284, -73337, 171899, -77941, 261091, 366606, -31206, 372022, -25434, 326062, -231699, 102444, 146724, 78308, -29415, -355232, 18191, -166150, 77964, 35936, 19327, -13102, 274579, 164232, 212022, 168550, 221228, -25466, -20064, -17866, 129853, 42585, 250883, 102929, -299995, 395862, -63873, 292208, 50278, -2420, -182298, 475619, -216968, 145730, 304361]
17562C04361j36288o7286M28200A42361N6520a5754C2161j0576J21376K8873J47665
17551C19499J33836A89416K34421j53839g6915I1892L61300j11965j37371B8944
17540A62390N9843H9988L00157h5885l2312A81885L7132P3981J05527R0901j652
17529D87774N120j87938K46611l7598L56368N25356k39889J67313n29515C57091
17518B69572D5052N39656j43063K9864k00498j24657K48937M81465j61658N30710
17508A245808k65037j89540j88801k28198K53821M1737C12758j10483m4483K00395
17498C58187n569J2524j77761o8416j7367J68016J3624K69072k58939p940A00772
17486A32090L1773J33673J60002A72054K35064j71565K47894J4696k26530A14570
$$ y = [304361, 168073, 100787, 528987, 142361, 198881, -15754, 32161, 21585, 142961, 171834, 319499, 453335, 189416, 423837, 269998, -76915, 91892, 453192, 341227, 203856, 28944, 162390, 222233, 89988, 390145, -85885, -118197, 181885, 219017, 292998, 398525, 489426, 487774, 492894, 304956, 551567, 513969, 870337, 1395693, 1155804, 1323117, 793602, 357091, 269572, 45052, 584708, 441645, 471509, 271011, 146354, 395291, 876756, 715098, 1245808, 980771, 791231, 602430, 374232, 628053, 669790, 312758, 202275, 157792, 358187, 352618, 365142, 187381, 118965, 101598, 269614, 283238, 552310, 293371, 285431, 100772, 132090, 163863, 297536, 457538, 172054, 407118, 235553, 483447, 498143, 271613, 114570]
17475B09156N375o593J6212J59625k7211A50266M1017M60245A80879R6873J96058
17464D73810j06501l4077K37241k37581J13193C2805J34286L9023C7070M25284
17454D62354A03646J6336L49010K1708n7897B12378q9263M50544B21092K41834
17444D62926m9458P8648A41771F9347J42972k5195K44063A76363M23787k44810
17434C55340A32128L1897j0520i2269F53056I5116K42349P3104N9260q8126m6795
17423C34908Q9616k11514J29476q2680J7639C8788J26904J365N1740J04600A60217
17411F27078j34731r7605J13479j87879l035K75429A57492J32423A25492K5118
17401A50610j5030a53515D94620k15820j17292L0111k7121j1978K62630j89903
$$ y = [209156, 214531, 207938, 224150, 383775, 356564, 150266, 191283, 651528, 180879, 277752, 473810, 367309, 333232, 570473, 332892, 446085, 32805, 167091, 206114, 37070, 462354, 103646, 119982, 468992, 490700, 432803, 212378, 123115, 573659, 221092, 462926, 413468, 492116, 141771, 69347, 212319, 187124, 431187, 176363, 600150, 355340, 132128, 164025, 153505, -92269, 653056, 95116, 337465, 410569, 469829, 381703, 334908, 424524, 213010, 342486, 259806, 277445, 38788, 165692, 167057, 218797, 323397, 160217, 627078, 492347, 394742, 508221, 320342, 317307, 592736, 157492, 289915, 125492, 150610, 135580, -153515, 494620, 278800, 161508, 191619, 164498, 152520, 415150, 225247]
17391B25247K6731j22755J27644J62229D1996K84161J92341B25937o7493J53497
17381C11941C0344N13162e1648B41083D1958J34587N2388L7703J86170B10139
17370B41202L33066B53540r8580K19200j29060P8513j07560M2198K00593A81056
17359A27075M01554b801B89759I4893K06707J97483B11682J7251j13198o238M12900
17348E22397B31777J35580k5153j25104A8224K5832K2933J05268K05206a48126
17337F3620R2043G5472J34979K76832q5385p4990m9131J76233e8906C50977r9370
17326B51607J48489A98440L45797m8811a74009D38630A96593Q4078A39013a48848
17315A30424K30887J44409m0749M0935D3011J76259L20517k41118K67028A59005
$$ y = [225247, 251978, 129223, 256867, 419096, 41996, 326157, 518498, 225937, 158444, 311941, 30344, 543506, -51648, 241083, 41958, 176545, 228933, 266636, 452806, 210139, 241202, 574268, 253540, 154960, 374160, 245100, 323613, 216053, 258251, 458844, 181056, 127075, 528629, -2801, 289759, 94893, 301600, 499083, 211682, 228933, 115735, 109497, 522397, 231777, 367357, 342204, 217100, 18224, 44056, 66989, 172257, 377463, -148126, 63620, 155663, 75472, 210451, 487283, 401898, 326908, 277777, 454010, -58906, 350977, 251607, 400096, 198440, 544237, 495426, -174009, 438630, 196593, 280671, 139013, -148848, 130424, 361311, 505720, 464971, 505906, 43011, 219270, 539787, 298669, 565697, 159005]
17304C10374q9379O3867n2901J97151r5416J48522A35304K00108a0139B08026
17293G33118k64827j26925J39369p1900A34388l147J20109L28537r1774P045R5411
17282E90569k66957e5127B86313A22910L35937p4705J49110F3200K50700N8504
17272C72404A59004P8908P2726K04820k16938a0429C13425P7746L8922j61068
17262B69025q0572K00640m4279R8915B458L96119h3019B92034o694j15077K28429
17251C98692q7680j04466l2155a309D59458q4907m3083l0613M75989C43665a8191
17239D22944q4330O9003J15338B47641J06000K9775P2124j62565p458B5538J70626
17228A96164K63472k23304M7010P7570j45181M0970J06624O9164j67360M40567
$$ y = [310374, 220995, 284862, 231961, 429112, 333696, 482218, 135304, 335412, -10139, 208026, 733118, 468291, 341366, 480735, 408835, 134388, 131241, 251350, 579887, 488113, 495158, 590569, 323612, -55127, 286313, 122910, 458847, 384142, 533252, 63200, 313900, 372404, 159004, 237912, 310638, 515458, 298520, -10429, 313425, 391171, 430093, 269025, 188453, 389093, 344814, 443729, 2458, 398577, -83019, 292034, 285340, 170263, 398692, 311012, 206546, 174391, -1309, 459458, 374551, 331468, 300855, 776844, 343665, -18191, 422944, 338614, 407617, 522955, 247641, 353641, 383416, 455540, 292975, 285517, 25538, 196164, 459636, 236332, 283342, 360912, 215731, 256701, 363325, 432489, 265129, 705696]
17218G05696j62513j22075j5501L888b30463E51454k19049a3185D00019j30020
17208B69999K39991B25507J43931j55290c3119I2847L58767k2691K67676B14003
17197E63178K23491C76577j38865N82877k46260B81033k8376n0305M10901k7832
17187E85421A64474L7409O7742m1695q770O7672K69968A75084K36012L37121l06515
17176D41702j93002F5418J96867J06830l2909J68334J13772B94822J09092J96552
17166F00466o0270n2054L30167j7630p450l03064J08042K49793j76970B48911
17155E89645B82083K07990J14849k83277N71782C50121J76420J87908j77053N4592
17145E91988j72110k1739l2079q003K33663j27728J47935k49895J58343J08215
$$ y = [705696, 543183, 421108, 405607, 409495, -230463, 551454, 332405, -13185, 400019, 269999, 509990, 225507, 369438, 214148, -33119, 92847, 451614, 428923, 696599, 214003, 563178, 786669, 376577, 237712, 820589, 574329, 281033, 252657, 202352, 613253, 585421, 164474, 201883, 269625, 227930, 219160, 286832, 556800, 175084, 411096, 748217, 441702, 248700, 65418, 262285, 369115, 336206, 504540, 618312, 294822, 403914, 600466, 540196, 488142, 818309, 800679, 793229, 490165, 598207, 848000, 671030, 248911, 589645, 282083, 490073, 604922, 321645, 893427, 350121, 526541, 714449, 537396, 591988, 419878, 398139, 366060, 358057, 591720, 463992, 611927, 362032, 520375, 628590]
17135F28590j84108K37750k34088j52670N28243l87259M3567L90103k11227j76276
17125D82625j23393O2260j25385L80593k02599K2048k32422Q0996K1190M9650
17115D15563O1813j30840K80093k91670K74300J82959j80185j68855O5237j9689
17105D88726k2730j00244M19930k88716j47531O8589J31463J35586K25504C96530
17094D97325K12328k65490j30786N15090o4164k55662K36642M5919j74047J63570
17084G80725J11061j06811R3529K2847k13279K09397o0346j50196K73301R956
17074I70184m39030L73792k30504P3251K90762l45372L54434k90295j32110j6000
17064F09112J48517O7298n2986M928K23334k7999j8334j25257K54973m3009m46989
$$ y = [628590, 444482, 682232, 448144, 295474, 823717, 436458, 480025, 870128, 658901, 482625, 359232, 421492, 296107, 676700, 474101, 496149, 263727, 344723, 365913, 415563, 477376, 346536, 626629, 334959, 609259, 792218, 612033, 443178, 508415, 488726, 465996, 365752, 785682, 496966, 349435, 418024, 549487, 685073, 910577, 396530, 497325, 709653, 444163, 313377, 828467, 764303, 508641, 745283, 791202, 617155, 780725, 891786, 784975, 878504, 901351, 688072, 897469, 837123, 686927, 960228, 970184, 531154, 904946, 674442, 747693, 1038455, 693083, 1047517, 757222, 625112, 609112, 757629, 824927, 771941, 776869, 1000203, 972204, 953870, 828613, 1083586, 1040577, 593588]
17053E93588K03521L57501k03501K2066n5824K61025m00201R3802q1663j64012
17043F26302r243K23835L97566m74205j90071K15874O25395l35684J99452l79711
17033H99510P931K75094l11930J92952K26349l63905l13551O97197n35201K70676
17023A045122k962J18875q6063k77268K31651q9638J03166k2833K14444k43680
17013I90814J84016N4811j8086n1209q3482J98490k2076l48815L66756j11077
17003A160142j78349K06318k0176J01312o9835n4607k18054J01271J71973j32177
16993A067818L19607r8004p5485N5746J65629l41628J72595K63089m84986O39674
16983A684055l11844l95771N01425k78602J83951l20868L24751Q0889O2985l41519
$$ y = [593588, 797109, 1154610, 951109, 973175, 917351, 1178376, 778175, 871977, 790314, 626302, 617059, 840894, 1238460, 764255, 574184, 790058, 1415453, 1079769, 1279221, 899510, 907441, 1182535, 870605, 1063557, 1289906, 926001, 612450, 1309647, 774446, 1045122, 1042160, 1161035, 1074972, 797704, 1029355, 939717, 1042883, 1020050, 1234494, 990814, 1174830, 1229641, 1211555, 1160346, 1076864, 1275354, 1253278, 904463, 1271219, 1160142, 981793, 1188111, 1167935, 1269247, 1199412, 1144805, 926751, 1028022, 1199995, 1067818, 1387425, 1289421, 1213936, 1269682, 1435311, 1093683, 1266278, 1529367, 1044381, 1684055, 1372211, 976440, 1477865, 1199263, 1383214, 1062346, 1387097, 1467986, 1530971, 1189452]
16973A189452L72393j14470J03531Q8092p66972Q67127j07575j08484J7397J11405
16963A651896k51214K1990K91623j34814n6885J83348l03475Q3044L59831k77769
16953A567575K63339j86281J70537k28080K87985l20011R4953Q110L12520k70299
16943A700348J96100j87692R9016j27503J33055P1465l6205K57206o2125j48530
16933A895135K40924P0464l53927J56383J70560L4526L4329K79161k72300j84673
16923B070582N36667o02906K75992J9856k85221K41892k24677L30553k95321L70519
16913B437936q9786K32203J68771j27862j02677k7018k4099L0996j13318L76462
16903B761608l03914N0563L86001j2305j47183J72720j24688p2790j5379N2693
$$ y = [1189452, 1561845, 1447375, 1550906, 1638998, 872026, 1739153, 1631578, 1523094, 1540491, 1651896, 1400682, 1422672, 1714295, 1579481, 1522596, 1705944, 1402469, 1485513, 1845344, 1567575, 1830914, 1644633, 1815170, 1587090, 1875075, 1555064, 1650017, 1658127, 1970647, 1700348, 1896448, 1708756, 1807772, 1680269, 1813324, 1884789, 1848584, 2105790, 2043665, 1895135, 2136059, 2206523, 1852596, 2008979, 2179539, 2214065, 2248394, 2527555, 2255255, 2070582, 2607249, 2004343, 2280335, 2300191, 2014970, 2256862, 2032185, 2362738, 2067417, 2437936, 2348150, 2580353, 2749124, 2621262, 2518585, 2491567, 2467468, 2498464, 2385146, 2761608, 2457694, 2508257, 2894258, 2881953, 2734770, 2907490, 2782802, 2710012, 2694633, 2747326]
16893B747326j73699M14493J57003m9623K28520l11231j1713m7521L88278j91162
16883C150671n9521K95277J41468K7476N0313m5616p5863P4066q2735N91414k10029
16872C856921j4084j72356K32131l43816N07647K99587l19163L83226m66267N90787
16862D554613j80267J80284j44906J51210J55565p4282N4298k18088M09685N49276
16852E437388o80223Q3540M4113K59602N57724m10038M37610j12808J42072N791
16842E764771J92394k32897L84398o688n75K86702K68350K448j15794R4095K10456
16831F847660j22157N40355k39767K51848K54122o7438M38643j92929J37363K56149
16821H103849J21208N30174k10929Q1339J14514K16300o0840N48458J72547Q7699
$$ y = [2747326, 2573627, 2988120, 3145123, 3095500, 3324020, 3012789, 3001076, 2953555, 3341833, 3150671, 3091150, 3386427, 3527895, 3555371, 3605684, 3560068, 3484205, 3558271, 3475536, 4066950, 3856921, 3842837, 3670481, 3902612, 3558796, 4066443, 4366030, 4046867, 4430093, 3963826, 4554613, 4374346, 4554630, 4409724, 4560934, 4716499, 4642217, 4696515, 4478427, 4888112, 5437388, 4757165, 4840705, 4884818, 5144420, 5702144, 5292106, 5729716, 5616908, 5758980, 5764771, 5957165, 5724268, 6108666, 6101978, 6101403, 6388105, 6656455, 6658903, 6543109, 6637204, 6847660, 6725503, 7265858, 7026091, 7277939, 7532061, 7464623, 7903266, 7710337, 7847700, 8103849, 8225057, 8755231, 8544302, 8625641, 8740155, 8956455, 8895615, 9444073, 9616620, 9704319]
16811I704319L92006K57767M68488N3183J16115N47084l6858K54061P2557j2593
16801A1816129Q95064m1528J88595L09038L30083N14486J91866N13945K50357
16792A4968035O7504O02030M17368M99772J37929K52007O82234M90130M04315
16783A8521324N90314O29689K01297N94635R68303M36469Q17949M60400L88013
16774B3608393Q71939R46531L54137R72004P82710P78994R85289P38728R60992
16765C0999717J446927R45015R34959J232931J006185J530554Q73761J568968
16757D0539017J331013J021097J846003J667146J178528K194151J599531K004022
16749E3380508J730208J767065K654784J791120J820348K288830K456154K218543
$$ y = [9704319, 10096325, 10354092, 10822580, 10875763, 10991878, 11538962, 11502104, 11756165, 11828722, 11816129, 12711193, 12669665, 12858260, 13167298, 13497381, 14011867, 14203733, 14717678, 14968035, 15035539, 15637569, 16054937, 16554709, 16692638, 16944645, 17626879, 18117009, 18521324, 19111638, 19741327, 19942624, 20537259, 21505562, 21942031, 22759980, 23220380, 23608393, 24480332, 25426863, 25781000, 26753004, 27535714, 28314708, 29299997, 30038725, 30999717, 32446644, 33391659, 34326618, 35559549, 36565734, 38096288, 38970049, 40539017, 41870030, 42891127, 44737130, 46404276, 47582804, 49776955, 51376486, 53380508, 55110716, 56877781, 59532565, 61323685, 63144033, 65432863, 67889017, 70107560]
16741G0107560K243008K359884K964957K311721K796060K053843K741528K792294
16733I0370855K211826K229635K404956K425130J784399K055505J610809J665193
16725A06758308R82726J767595J229139M28579L52856J70648o12406j41642o20277
16716A10315526j074677r93582j566102j657256j460911j793478k241814k603678
16708I6924028k280723k366225k509859k732058k508076k462234k867419k350805
16700G6846629k464614k764605j781264k968602k105086k121017k191270j707451
16692E8742720k335277k061104j705171k116385j717429k050194j319453j532258
16684D3905449j411027j361779j518661j506947r09372j252494j303126j287471
$$ y = [70107560, 72350568, 74710452, 77675409, 79987130, 82783190, 84837033, 87578561, 90370855, 92582681, 94812316, 97217272, 99642402, 101426801, 103482306, 105093115, 106758308, 107741034, 109508629, 110737768, 111166347, 111519203, 111689851, 111077445, 110935803, 110315526, 109240849, 108247267, 106681165, 105023909, 103562998, 101769520, 99527706, 96924028, 94643305, 92277080, 89767221, 87035163, 84527087, 82064853, 79197434, 76846629, 74382015, 71617410, 69836146, 66867544, 64762458, 62641441, 60450171, 58742720, 56407443, 54346339, 52641168, 50524783, 48807354, 46757160, 45437707, 43905449, 42494422, 41132643, 39613982, 38107035, 37197663, 35945169, 34642043, 33354572]
16676C3354572p51294j386700q02753p36727j323744q10180n96390o62680q87918
16667B5396186j079759k08889j213194p03416l97370n61451m05194r03545o99726
16658A9223642q7227p26917q62131k8358m91795k37087q58997j35492o21994l0377
16648A5143267o96937j5394o40300j55750p32467K79905m35594o03810L1106L8995
16638A2213021n95277m59037N9429k77962k09965l80280r5106k88439L7954o33071
16628I371267R0636j1953m78055k87571k38477k38773k07679N2343m4241j19863
16618G887634j67214q78j79921K0113l59587J41295l44154j19174j17174o5197
16608F695743q1349n35169J69503J80853o3977l89299k68884O8356j69718j19718
$$ y = [33354572, 32603278, 31216578, 30413825, 29677098, 28353354, 27543174, 26946784, 26284104, 25396186, 24316427, 24107538, 22894344, 22190928, 21793558, 21232107, 20826913, 19923368, 19223642, 19136415, 18409498, 17547367, 17519009, 17027214, 16790127, 15931130, 15795638, 15173644, 15143267, 14446330, 14430936, 13790636, 13634886, 12902419, 13182324, 12746730, 12142920, 12174026, 12213021, 11617744, 11158707, 11218136, 10940174, 10730209, 10349929, 10254823, 9966384, 10004338, 9371267, 9461903, 9449950, 8971895, 8684324, 8445847, 8207074, 7999395, 8051738, 8007497, 7887634, 7720420, 7719542, 7539621, 7559734, 7200147, 7341442, 6997288, 6878114, 6760940, 6695743, 6614394, 6079225, 6248728, 6429581, 6365604, 5976305, 5707421, 5775777, 5606059, 5486341]
16598E486341j49660o4401J09669k65359K01679n10965P7562l2k33290M24022
16588E075566l28182l74742J02959l0164m7667j46347J02118J4918o5638j12571
16578D190250j21749J8986N0835k79346Q755j91308J36969j54504L0263r0371
16568C598780k0730J8095j48903K06511m12132J35642j66149J8360J13128l83067
16558B959535R5568K24150L9743k09668l69150N07498m45644K77063R6681l98638
16548B777138k54400K44370l34195L60156k73788K4095J97090P5386l13237K51074
16538B753689j79440l09182L89555l05805q2487J8245K88800k32832J73307k83733
16528B230117k07902K09050J28324m63072L99893l28968R9803p6353n4381q9010
$$ y = [5486341, 5336681, 5272280, 5381949, 5116590, 5318269, 4807304, 4884866, 4884834, 4651544, 5075566, 4747384, 4372642, 4475601, 4445437, 4397770, 4251423, 4353541, 4368459, 4302821, 4190250, 4068501, 4087487, 4138322, 3858976, 3867731, 3676423, 3813392, 3658888, 3689151, 3598780, 3578050, 3596145, 3447242, 3653753, 3241621, 3377263, 3211114, 3229474, 3342602, 2959535, 3055103, 3279253, 3318996, 3109328, 2740178, 3247676, 2802032, 3079095, 3175776, 2777138, 2522738, 2767108, 2432913, 2793069, 2519281, 2543376, 2740466, 2815852, 2502615, 2753689, 2574249, 2265067, 2654622, 2348817, 2266330, 2284575, 2573375, 2340543, 2513850, 2230117, 2022215, 2231265, 2359589, 1896517, 2296410, 1967442, 2067245, 1990892, 1936511, 1847501]
16518A847501J76679k7669N9876k00244k45395K11920J84297J39419k18493J63225
16508B091116l50253J45365K91988o50623K67337k60822L88920L3958k85292R5795
16498A767489P2132l12909J00975J41939p9827l69567N59439o33113L16599R4652
16488A657809l21156j93762N82711m15851l41775M16297l05968K25707K73644
16479A577656k99114M52851k26219R9387Q801l98296Q5199k652l2055j84139j72431
16468I08988J57687J25637J10656k31773J21127K66142K16082n88026j2367K93493
16458A367646O1464k97783o2510P8855J4297o7732J13296o6535j17970L6587k17817
16447H41798J65748p7857J91176m98195K20927Q9668l58J11501O8352l08316N44452
$$ y = [1847501, 2024180, 1996511, 2056387, 1856143, 1610748, 1822668, 2006965, 2146384, 1927891, 2091116, 1740863, 1886228, 2178216, 1527593, 1794930, 1534108, 1923028, 1956986, 1671694, 1767489, 1839621, 1526712, 1627687, 1769626, 1689799, 1320232, 1879671, 1246558, 1563157, 1657809, 1336653, 1142891, 1725602, 1309751, 967976, 1384273, 1078305, 1304012, 1577656, 1278542, 1731393, 1505174, 1604561, 1613362, 1215066, 1300265, 1297613, 1265558, 1081419, 908988, 1066675, 1192312, 1302968, 1071195, 1192322, 1458464, 1674546, 1086520, 1074153, 1367646, 1429110, 1131327, 1068817, 1147672, 1161969, 1094237, 1207533, 1140998, 1023028, 1059615, 841798, 1007546, 929689, 1120865, 622670, 843597, 933265, 932907, 1044408, 1112760, 804444, 1348896]
16436A348896j78872k19856q8664K99566J24608l59156j97593M18353k09860m54385
16426D83037L98975L97099m43756j53862P8676K46899l72808L37916j07109k9435
16416H35632K95290k27451J80873j49230k22679J3649L5275l592o3280J0810k7652
16405F77645q2967L70844N1640j18003j83153l9791J14163j50831p5984K34024
16395G97587J39911j23393J0849Q3523k3456C97144K57959L8104J56808O3803
16385I13818j31030L02543k44578p0365j8772k48468k32275M24709n4293J98746
16375H40035j71839l32262M42506M85M0889l30898J16588B29906K55217L97933
16365H83056p5629k18039j74160j33790O5998O04525l51227J2482q4284M20213
$$ y = [1348896, 1170024, 950168, 861504, 1161070, 1285678, 926522, 728929, 1147282, 937422, 483037, 882012, 1279111, 835355, 681493, 760169, 1007068, 634260, 972176, 865067, 835632, 1130922, 903471, 1084344, 935114, 712435, 726084, 761359, 757767, 694487, 705297, 677645, 594678, 965522, 1017162, 899159, 716006, 676215, 790378, 639547, 563563, 797587, 937498, 814105, 824954, 908477, 885021, 397144, 655103, 693207, 850015, 913818, 782788, 1085331, 840753, 770388, 751616, 503148, 270873, 695582, 641289, 840035, 668196, 335934, 778440, 778925, 819814, 488916, 605504, 229906, 485123, 883056, 807427, 589388, 415228, 281438, 347436, 951961, 600734, 613216, 528932, 949145]
16355I49145k85020K0499o3903J60670B64910M45070m6625M595k74787L05278
16345F98441N4025M6848n6567J74674m54298L67418B44725K4000O28724l69670
16335E27779K39284j65322k9105K32610l08297O2063J9749p5171j51367m6588
16325C05635K54208j28249k9881j16656Q3517F7248M12607A04146N60336l00906
16315C63576J73617j15202j20781A11437O0263K17959j8154k3105M22001B21835
16304E38960m6763A71304J64678M66347A72956B3878K87335N054J58700k13746
16294B61221o7498J34798j12299Q427J13659j0201K07082A75307D8136L46089
16284C94225j66929K08959K24597A67588G8917L49315L6057a5710B09012J13177
$$ y = [949145, 664125, 684624, 620721, 781391, 264910, 709980, 663355, 667950, 393163, 698441, 752466, 799314, 742747, 917421, 463123, 830541, 244725, 268725, 897449, 527779, 767063, 601741, 572636, 805246, 496949, 559012, 578761, 503590, 352223, 305635, 559843, 431594, 401713, 285057, 368574, 67248, 479855, 104146, 664482, 363576, 537193, 421991, 301210, 111437, 171700, 389659, 371505, 348400, 770401, 221835, 538960, 492197, 171304, 335982, 802329, 172956, 23878, 311213, 316267, 474967, 261221, 193723, 328521, 216222, 224649, 338308, 328107, 535189, 175307, 48136, 394225, 227296, 436255, 660852, 167588, 78917, 428232, 464289, -15710, 209012, 322189]
16274C22189j0512A30667K4441K02057j42165K29296A04381J26663j10591K32303
16264C52756K5420r2214d1019B13395M01798k47622H4188J02324L06512Q1966
16254E74990A75433R5154K4647Q8368A67787J63350Q8055A04545A4299K12561
16244B26860k7818d226A49428B8504J28786J02685K52894j63801F2742M91769
16234E54511k18025o8002o2024K03265m2642M4718F9214J17387J43993G9126L14155
16223C93281A33029L66021I042a63509A37177L82794A29095J95750l6550H4733
16212B56249J05317O223A42064J44672P6320j14248O9268J52187B11951K38618
16202D50569A01277M1487C8682J97119N6075D8289M2967N5799J35743I0025M14961
$$ y = [322189, 311677, 130667, 155108, 357165, 215000, 444296, 104381, 231044, 120453, 352756, 378176, 285962, -41019, 213395, 615193, 367571, 84188, 186512, 493024, 574990, 175433, 270587, 295234, 383602, 167787, 331137, 419192, 104545, 14299, 226860, 199042, -4226, 149428, 28504, 157290, 259975, 512869, 349068, 62742, 554511, 336486, 268484, 206460, 409725, 367083, 411801, 69214, 186601, 330594, 79126, 393281, 133029, 499050, 9042, -163509, 137177, 519971, 129095, 324845, 288295, 84733, 256249, 361566, 367789, 142064, 286736, 363056, 248808, 318076, 470263, 211951, 450569, 101277, 142764, 38682, 235801, 291876, 48289, 91256, 147055, 282798, 90025, 504986]
16191E04986A58174N6770p5620J69950a7587I8626J00697p9442d2722B49194K79705
16180E28899B45322M0868J59743D5236K92302e7987A68721K5272j3815K61253
16170D41431B08012b47052D55714A0530K98226B9071L28982j56533M91J94662
16160C96673B4573b1276H8161a17485l5767J7635b6083A84255K38718k8382J15405
16149E09996B27909H0393e5151B89539f1955D83915B26306Q3059o3336D4552L5622
16138H0174K37371E8359K3440j3722B7089N5853J82495A11501L98525A93124e677
16126a03734B06166m2908a4481B39306N0044j2908l6131d1470B60236g0990A1837
16114a11501B3826f4215B45503A16118h5615F3117a45599e121C00610j21975R5901
$$ y = [504986, 158174, 214944, 139324, 309274, -17587, 98626, 199323, 119881, -42722, 249194, 528899, 245322, 286190, 445933, 45236, 337538, -57987, 168721, 193993, 180178, 441431, 208012, -247052, 455714, 10530, 308756, 29071, 358053, 201520, 202011, 396673, 24573, -21276, 88161, -117485, -153252, -135617, -26083, 184255, 422973, 394591, 509996, 227909, 80393, -55151, 289539, -61955, 483915, 226306, 309365, 246029, 44552, 80174, 317545, 58359, 81799, 68077, 27089, 82942, 265437, 111501, 510026, 193124, -5677, -103734, 206166, 163258, -14481, 239306, 289350, 276442, 240311, -41470, 260236, -70990, 11837, -111501, 23826, -64215, 245503, 116118, -85615, 63117, -145599, -5121, 300610, 178635, 274536]
16103B74536Q3392c48376A80800b53687A05107j2475B1434M0401K71333a46863
16092A42674K1909p3081J5668Q9847G534K59235e4012A19931J41228k9900r2526
16081A38733Q6479R3178A13542j8555e2842D762a26980B12883D3549J32467J94536
16070C70552f3748A95779J36742r6778h5285A22582b46956D7677b06571B62651
16059b41243B7182L9369C30c03205A80077J55119C7252J43218p5641J24988L05351
16048E35168e4267B3932K82677l6584C4147N54888a90150Q2330j74033A03032
16037b04867a198B7416a9152B23475A08623d3147B4355b60328b4957p0562E4699
16025a1282q3467j15978j89411C37154n1839Q1262E0796J27056O7373j14001a76081
$$ y = [274536, 357928, -348376, 180800, -253687, 105107, 92632, 21434, 61835, 333168, -146863, 142674, 164583, 91502, 107170, 197017, 7534, 266769, -54012, 119931, 261159, 231259, 138733, 225212, 318390, 113542, 94987, -52842, 4762, -126980, 212883, 43549, 176016, 370552, -63748, 195779, 332521, 235743, -85285, 122582, -246956, 47677, -206571, 262651, -241243, 27182, 66551, 330, -303205, 180077, 335196, 37252, 180470, 104829, 229817, 535168, -54267, 23932, 306609, 270025, 34147, 589035, -190150, -107820, -281853, 103032, -204867, -1198, 27416, -19152, 223475, 108623, -43147, 24355, -260328, -24957, -95519, 54699, -11282, -94749, -210727, -400138, 337154, 285315, 366577, 50796, 177852, 245225, 131224, -176081]
16013C05030A23703C9935k874g8223j24398B42364A06527B5038J2511a10582A12319
16001H9115J95300a37319m5609D5584b05395A39064J26055A19517K95682L3426
15991D48625B0344K25907J81800j20672O3811O86881k0387J72296j7907q5287
15981A106786l52211C59009b1372D45385f7054B03363b63549d8959l959C4694
15970a331j83606M7745K633A95003a72256d9331m8290j91275B47359A05894a22548
15958B92504a51944o2352l9892d3052k74787G1999L56339C270b53522C35940a13598
15946i0426j72256D5260A035a95252K4969A37419D2603c10626A40807J6795a94767
15934e4257A61214E2365j2412h9499j47228R2947j79828p7086e1306B86029A22513
$$ y = [305030, 123703, 39935, 37061, -78223, -202621, 242364, 106527, 25038, 37549, -110582, 112319, 89115, 284415, -137319, -182928, 45584, -205395, 139064, 265119, 119517, 415199, 448625, 20344, 246251, 428051, 307379, 371190, 1058071, 1037684, 1209980, 1192073, 1106786, 754575, 359009, -21372, 445385, -67054, 203363, -263549, -48959, -52918, 34694, -1331, -184937, -137192, -134559, 195003, -172256, -49331, -97621, -288896, 247359, 105894, -122548, 292504, -151944, -214296, -254188, -43052, -317839, 71999, 428338, 3270, -253522, 335940, -113598, -90426, -262682, 45260, 1035, -195252, -170283, 137419, 42603, -310626, 140807, 157602, -194767, -54257, 161214, 52365, 39953, -89499, -236727, -143780, -323608, -400694, -51306, 286029, 122513]
15922A82735c29616B72598a67728d201B27621j04931c3926l2565C30J43101k417
15911A41014b05270A47491e8229A48109J46E9619M6731d9160G2287K22221c1715
15899g3854j51157P8598c6403n88942i4548r6878a1933k28413A09392h2409p0086
15888a52495j57832C76124a29886A44235a75585p4007e1134I7085d5702r0838
15878a36540C4267K68560C0885J7205a18558J8842j69561a24766j74540A54724
15867A4726A800b6330j31238C01772a7431F6548b41553F1617B9511N0031K76036
15856C55578B2371c0323q8784m3557D0845R2965L7160a25082O0859k18929A34069
15844a45369G3660N5782a28580k4623A59630J53136j27116J19811F6917O2775
$$ y = [182735, -329616, 272598, -167728, -4201, 227621, 122690, -33926, -66491, 330, 143431, 141014, -205270, 147491, -58229, 148109, 148255, 59619, 106350, -49160, 72287, 294508, -31715, -73854, -225011, -146413, -36403, -625345, -94548, -191426, -11933, -240346, 109392, -82409, -152495, -310327, 376124, -129886, 144235, -175585, -249592, -51134, 97085, -45702, -136540, 34267, 302827, 30885, 48090, -118558, -99716, -269277, -124766, -299306, 154724, 14726, 1800, -26330, -157568, 301772, -17431, 66548, -241553, 61617, 29511, 79542, 355578, 22371, -30323, -119107, -162664, 40845, 133810, 170970, -125082, -64223, -283152, 134069, -145369, 73660, 129442, -128580, -153203, 159630, 312766, 185650, 305461, 66917, 129692]
15834A29692O7636o9776b86929A35812D5263e4926j2843o1979c8081G6677J14072
15823A90749E7213k8425a92647g6442F217K96517b5172j21504k2350L5944j3656
15812a46738P0459A78820q2692k8223g0402C27660d0541R204A18598b3501C17313
15800A6114J76905J3043L4503I6907K441L3403b26026I3712a24258C357g2067
15788A55038e6891a1015k27925A16107C5423c01040Q9987B25057q6826g5516J0902
15777f4614k16933e6919j50898J4187r577l33187a71107d3032G6191K855Q0547
15766A59593g2644A55409a77767j33287J04449i4350A41787F7669L32582C4646
15755C16498C9709a5976B44018C1967j0472e1603l6811p773A90887L1817b55729
$$ y = [129692, 197328, 127552, -286929, 135812, 45263, -54926, -67769, -129748, -38081, 76677, 190749, 57213, 28788, -192647, -76442, 6217, 302734, -25172, -146676, -169026, -133082, -146738, -76279, 178820, 96128, 67905, -70402, 327660, -40541, -31337, 118598, -23501, 317313, 16114, 193019, 206062, 240565, 96907, 99348, 132751, -226026, 93712, -124258, 3357, -72067, 155038, -56891, -11015, -238940, 116107, 35423, -301040, -211053, 225057, 138231, -75516, -64614, -281547, -56919, -207817, -193630, -203207, -536394, -171107, -43032, 76191, 79046, 159593, -72644, 155409, -177767, -311054, -206605, -94350, 141787, 67669, 400251, 34646, 316498, 39709, -15976, 244018, 31967, 21495, -51603, -88414, -96187, 190887, 222704, -255729]
15743A6275a41951C00499n6091R3318A28234g4322A60575b90714c6998j20646
15733a57644A8690K14895I7882i0897j95338A14531k5921k7586P7749J50063b20788
15721a15823n0869A72905a20950G6744a93199A46340a041I987i4661D9563J19111
15710A68674l391K9684E066h8717C04822j04679c96678b7725J1084j55849o8720
15699b41210l485k38872A26948a00016n4506P2222F0169b42080f4671A06005P0934
15688A76939e2194F3992J02786a04262A89648b05330Q4735B24711b0457n4483
15678g4940A13370d4107k70183a38545A36100l0000H508h140l5779A3733i6671
15666B11436a68258B11599e3992A16689d77873G4988b77902c6760p2024B0133
$$ y = [16275, -141951, 300499, 244408, 337726, 128234, -74322, 160575, -290714, -36998, -157644, 18690, 233585, 97882, -90897, -286235, 114531, 88610, 61024, 138773, 288836, -220788, -115823, -166692, 172905, -120950, 76744, -193199, 146340, -1041, 9987, -94661, 49563, 168674, 165283, 194967, 5066, -88717, 304822, 200143, -396678, -27725, -16641, -172490, -241210, -244695, -483567, 126948, -100016, -154522, -82300, 60169, -242080, -64671, 106005, 176939, -52194, 63992, 166778, -104262, 189648, -205330, -120595, 224711, -20457, -74940, 113370, -44107, -314290, -138545, 136100, 106100, 8508, -8140, -43919, 13733, -96671, 211436, -168258, 211599, -53992, 116689, -477873, 74988, -277902, -36760, -108784, 20133]
15655b89231G6939Q3645h0183C1084r583d34975a34872a4667A39359J00300c271
15643A03960c05748B16720b58130a241r9273A4217b64502j59470k792A78985N3988
15632B32973F0690A5307a65523B15871c81111J75965M2566h0769E6384K88264
15622C44648C1381i513m56379a96732B6709K4408d67565D09845a28420B33717
15611a60447L9471D67393b43834P6281a0093A74014K8529f7123J9926A88204k3193
15600A65011g6487o0783j04753a09499A40783k1057c029q3092D1980a77520j953
15589a79473A66950a37693A2237a18283a6301j15438D3442f8248b0170A64040
15578c60329g0838A87038a07099j09879A07807c258A25939b38433h3855F2205
$$ y = [-289231, 76939, 160584, -80183, 31084, 21501, -434975, -134872, -14667, 139359, 239659, -3271, 103960, -305748, 216720, -258130, -1241, -100514, 14217, -264502, -423972, -426764, 178985, 232973, 60690, 15307, -165523, 215871, -381111, -205146, -162580, -80769, 56384, 344648, 31381, -9513, -465892, -196732, 26709, 51117, -467565, 409845, -128420, 233717, -160447, -120976, 467393, -243834, -167553, -10093, 174014, 202543, -67123, -47197, 188204, 165011, -76487, -137270, -242023, -109499, 140783, 119726, -3029, -86121, 41980, -177520, -179473, 166950, -137693, 12237, -118283, -16301, -131739, 43442, -68248, -20170, 164040, -360329, -70838, 187038, -107099, -216978, 107807, -3258, 125939, -238433, -83855, 62205]
15567B0658b61495A86343a20282j738J5547E11438E3583J1251Q0333g4050k15353
15556b89403E9879c07355A55642k2568d7716l8293G8497K34631B9243J569d7039
15544H6009c8451E4693b27825A68790p6834B2540e2702F3979m183c5151k00983
15533b36134a17707A11316d14355A76688b10440H8963d544B75535G355J65647
15523A73002F1949i914D82127j59800j38155F1569R1441J30226o0872G1891J9248
15512I1139K67530j43249N5847a32653D00361a72343A23544a39921C24219h7323
15501h1774C11429Q1503j48100B0018J03178C243J00358M5603L4317k5142o3031
15490I5348e0794k04592A1987L14984J37125j40565o8546a0129E7517k0275e1823
$$ y = [20658, -261495, 186343, -120282, -122020, -106473, 511438, 53583, 64834, 145167, -74050, -289403, 59879, -307355, 155642, 133074, -47716, -86009, 78497, 313128, 29243, 30812, -47039, 86009, -38451, 54693, -227825, 168790, 91956, 22540, -52702, 63979, 59796, -35151, -236134, -117707, 111316, -414355, 176688, -210440, 88963, -4544, 275535, 7355, 173002, 61949, -9914, 482127, 322327, 184172, 61569, 153010, 283236, 222364, 71891, 91139, 358669, 215420, 271267, -132653, 400361, -172343, 123544, -139921, 324219, -87323, -81774, 311429, 392932, 244832, 20018, 123196, 3243, 103601, 149204, 183521, 158379, 95348, -50794, -255386, 11987, 326971, 464096, 323531, 254985, -10129, 57517, 37242, -51823]
15478D24175m8205A37757K28417Q5799L3757N57248l03471C02507E8359J98997
15468B57356L30551A35506K53711E2860M72544B7879i975l4459a2491A43327e01564
15456A33706D4803d7342j74527I3181a88218b80B1983e4664K2287E8778M8547
15445A07325Q1810B7457L75281M30145K70804K4400k63003k20063A99913R4763
15435B94676l2786D8000K23325a6681F385K39658o6695f9035A63557o0988a32514
15423i1097C10474B4949f6883I5177a74079f2690A8460L04285A02398h9967o9775
15412a59742k39185b1954m31F4695K02820c54866i7493l05456J74822B62609l7600
15401B25009m0914L9389J09891C9913a72202P7010A285a31465n4870I7279d15642
$$ y = [424175, 375970, 137757, 366174, 451973, 485730, 1042978, 739507, 302507, 58359, 257356, 587907, 135506, 389217, 52860, 525404, 27879, -9975, -44434, -12491, 143327, -501564, 133706, 44803, -47342, -221869, 93181, -188218, -280, 21983, -54664, -32377, 58778, 107325, 189135, 27457, 402738, 832883, 1103687, 1128087, 865084, 645021, 199913, 294676, 261890, 48000, 271325, -16681, 6385, 246043, 179348, -69035, 163557, 102569, -132514, -91097, 310474, 24949, -66883, 95177, -174079, -62690, 18460, 322745, 102398, -89967, -159742, -398927, -21954, -22385, 64695, 267515, -354866, -97493, -402949, -228127, 262609, 225009, 184095, 223484, 333375, 39913, -172202, -95192, 1285, -131465, -186335, 97279, -415642]
15389d63462A42344a28765e8034G9678K13487H6933N7899J56741o5059a1595A33222
15377C39868B2737c1164A93378r0934K72044J04902k21608J0332a85115G4708
15366B6183a8189B64747q2859b8652C79157R3000A11953K89006E0443J77992J56149
15355C84584G4842l2157J62479c331A00979K23921d5350A21079R5776f279B21642
15343C64980j13570L41574B29744O3764N9885A11412J32869a77258B19157p9004
15333A40153P1536p9864e5628I940J24555f3642l7573A47216J74764A58726J88829
15322C47555b08541A69453j7368a59507E1972M22266e220B01475b81207C23727
15311F07382j29978d8288C626L0433k484J20762d0654D0129L50048C2831a4362
$$ y = [-463462, 142344, -128765, -58034, 79678, 293165, 86933, 144832, 301573, 236514, -11595, 133222, 339868, 22737, -31164, 193378, 102444, 374488, 479390, 257782, 268114, -185115, 74708, 26183, -18189, 264747, 181888, -28652, 379157, 472157, 111953, 400959, 50443, 228435, 384584, 74842, 42685, 205164, -3331, 100979, 324900, -45350, 121079, 216855, -6279, 221642, 364980, 251410, 592984, 229744, 293508, 353393, 111412, 244281, -177258, 219157, 140153, 211689, 131825, -55628, 9940, 134495, -63642, -101215, 147216, 321980, 158726, 347555, -208541, 169453, 152085, -159507, 51972, 474238, -5220, 201475, -281207, 323727, 607382, 477404, -48288, 3626, 34059, 31575, 152337, -40654, 40129, 390177, 32831, -14362]
15299A52175f3754A41691B7214b8148q2799r0135C05684o3177a76471G7005l7897
15288C9108J40469G219J32315J71561g2312r7337B10790r9339q717l3144K98697
15277C68287A52540j3897k7234h2759L6412j31936H3744b01810A770a54806B10472
15265a53496B94391c4438J1198B36086i9405M5457C64877f8276J0821I932K11118
15254B21050F9251c76505A73768b34256l8601d7146c718A30484J05335E9073f7340
15242E43689j01951J392368o1516k47901O32223j042125B61947q316J0941h977
15231A81664a3437B31283d3417D1229P6959a01027n9886L2632r4560C35137A39156
15219A17394J75868G4393C3684J98584g7853B7458K92691C8912d975C01626d4925
$$ y = [152175, -63754, 141691, 27214, -28148, -110947, -201082, 305684, 242507, -176471, 77005, 39108, 179577, 7219, 139534, 311095, -72312, -169649, 210790, 111451, 102734, 69590, 368287, 152540, 138643, 111409, -82759, -46347, -178283, 83744, -201810, 1770, -154806, 210472, -153496, 294391, -34438, -23240, 236086, -99405, -53948, 364877, -68276, -57455, 9932, 221050, 69251, -376505, 173768, -234256, -272857, -47146, -3718, 130484, 235819, 59073, -67340, 543689, 441738, 1834106, 1772590, 1524689, 2156912, 1114787, 261947, 253631, 264572, -8977, 181664, -13437, 231283, -43417, 41229, 118188, -101027, -160913, -128281, -222841, 335137, 139156, 117394, 293262, 74393, 33684, 232268, -77853, 27458, 320149, 38912, -4975, 301626, -44925]
15207B92b33939A14838a22565B05613E0796R9991A5024M84470A0736K9340b4306
15195B40082A6112J7971d8042H52J81551l0104o5400e4919a4652j03385A63403
15183c2625D32668a43796F2175K01878C8952f6822A63277h0586C3636b12563A37501
15171a7157j00907C75178C9517b51756J03309o193C87309A82024L8234J00349
15161C20607b06271A34508A3059e9637A33158B4006J46601h9205G7138J62732
15151B39870E8326R4679j8410d0855A18305j2861A2545K29136B9696A4381f1755
15139D23451b1616D26710a29621j46121a5044H6233E037a03357A23195L49078
15129D72273B18965Q1306C7591d8581j22318B55553E6384L32342A05526M56089
$$ y = [292, -233939, 114838, -122565, 205613, 50796, 150787, 15024, 499494, 10736, 40076, -24306, 240082, 16112, 34083, -48042, 852, 182403, 152299, 86899, -54919, -14652, -118037, 163403, -32625, 432668, -143796, 62175, 264053, 38952, -66822, 163277, -80586, 33636, -212563, 137501, -17157, -118064, 375178, 39517, -251756, -148447, -154640, 387309, 182024, 220258, 320607, -206271, 134508, 13059, -59637, 133158, 24006, 170607, -89205, 77138, 239870, 58326, 153005, 134595, -40855, 118305, 105444, 12545, 241681, 29696, 14381, -61755, 423451, -21616, 426710, -129621, -275742, -15044, 86233, 5037, -103357, 123195, 472273, 218965, 300271, 37591, -48581, -170899, 255553, 56384, 388726, 105526, 561615]
15119E61615k42333M31216j47202j35679A5040J08379J69316i0793B53110r0320
15109A62790J79828A14044K79714A00886b61073A02729A189J5502b12390h7213
15098A81512A3954O9702a08999B13709N1066c01246i3995B99575j08307r3537
15088I7731L41990j98773q0054f9653F4077P232l2914Q6939J04386n4650a51879
15076A39942a16928p821m6975A9155J01192a71980A1491b7790E4313K51231C9177
15064E6692J81192A9398J0412a4626D84328A87492K16113i512A26469R4593L79
15053B21441J40123j458Q0489A01018L34520B14100K8732J0931L65186i1850E14818
15041F78277C6822K75604o1965K9903O5243G5578L82999n5482A78570M89575B70690
$$ y = [561615, 319282, 750498, 603296, 467617, 15040, 123419, 292735, -90793, 253110, 162790, 342618, 114044, 393758, 100886, -261073, 102729, 1189, 16691, -212390, -87213, 181512, 13954, 83656, -108999, 213709, 264775, -301246, -93995, 299575, 191268, 97731, 439721, 240948, 160894, -69653, 64077, 71309, 38395, 125334, 229720, 175070, -151879, 139942, -116928, -124749, -171724, 19155, 120347, -171980, 11491, -27790, 54313, 305544, 39177, 56692, 237884, 19398, 29810, -14626, 484328, 187492, 403605, -9512, 126469, 221062, 221441, 361564, 360106, 440595, 101018, 435538, 214100, 242832, 253763, 618949, -91850, 514818, 678277, 36822, 312426, 250461, 280364, 345607, 75578, 458577, 403095, 178570, 668145, 270690]
15029D55452L93811k40628j15193J46860A30940J60054M5279K7881J44524J09099
15019F17777O7903A17995L6984P35923k07528l28101m7907J127P9536O9116A81440
15007C13097J37544K40665l11906C4554f2065E32022B27904J43714K80731K5740
14997F78089C14943N2115K83409N3421A44563J19054o2642K30299J91450k04765
14987D17959K01426k76040N8390M43262l04959J56251J77081k37544J54405A43442
14976A75338J22965J44237L44051j12668j46054M10408k41865j48046L671B10026
14965D08339B01369M03388l00589J15550L0123A64260K14043A73568J08001A36341
14954C15271j34128K70805B15098J99674R7014R1380j87332A81536J32378L3663
$$ y = [455452, 849263, 608635, 493442, 640302, 130940, 290994, 336273, 364154, 508678, 617777, 685680, 117995, 154979, 890902, 683374, 355273, 307366, 308493, 388029, 457145, 181440, 313097, 450641, 691306, 379400, 34554, -62065, 532022, 227904, 371618, 652349, 678089, 314943, 367058, 650467, 703888, 144563, 263617, 200975, 431274, 622724, 417959, 619385, 343345, 401735, 844997, 540038, 696289, 873370, 635826, 790231, 143442, 175338, 298303, 442540, 786591, 673923, 527869, 938277, 696412, 548366, 552037, 210026, 408339, 201369, 604757, 304168, 419718, 449841, 164260, 378303, 173568, 281569, 136341, 315271, 181143, 451948, 215098, 414772, 511786, 603166, 415834, 181536, 313914, 347577]
14944C47577J75632N54378n23907A46922M75206B73427j01497K35584J05111j9036
14934D93589j16652J73482J16796K26195n7280J32059L78931j61410K46528J04874
14924A537112K60095l38482J45157j55570p9054K25700M05411K86333K17098k70903
14914B232897o59667l26559j68606J31013m80374l07747n3953j295j4784K22733
14904E73658j93927M7012j28131l2120A19028J83620A7028O03236k99421J26762
14894D47605l6477j63746J43777A21003J85598k8787N51335C81291M30296N6222
14884H67809K45044m48765J13385J05682K11688k45390q0111P1171k3112B43926
14873A73158L22847j40840O3446L18635k9236l04344L55277l7148l8679L9470
$$ y = [347577, 523209, 1077587, 553680, 146922, 622128, 273427, 171930, 407514, 512625, 493589, 376937, 550419, 667215, 893410, 836130, 968189, 1347120, 1185710, 1432238, 1537112, 1797207, 1458725, 1603882, 1448312, 1369258, 1594958, 2000369, 2286702, 2503800, 2232897, 1573230, 1246671, 1078065, 1209078, 728704, 420957, 367004, 365709, 350925, 573658, 379731, 426743, 298612, 266492, 119028, 302648, 17028, 620264, 320843, 447605, 411128, 247382, 391159, 121003, 306601, 277814, 829149, 381291, 811587, 867809, 1112853, 664088, 777473, 883155, 1094843, 849453, 769342, 840513, 817401, 243926, 173158, 496005, 355165, 418611, 737246, 708010, 403666, 758943, 721795, 683116, 722586]
14863G22586p6373j77385i2433E41258J73760j01764A36621K79092L87197C66777
14852A65630L21293l5477L2695J47582A73706M25680k844J39696L90227j04229
14842A022236j27068K84058k25105O6188o9637m31769N81270n07190j84656R543
14832D17870M9759k00991K95582K06429k01236J25115k77947M0358L05247j67184
14822E93002J3070K12437l13031K23269J1470q8444N817n0242j57192J01612M9487
14811F01255J43090m8571k58050J42136M58535k7310j05222j77067m6877k2580
14801F59339j53361L42662D09740K29543k80220K67873k47383K99805p298n4276
14791F17784k24076M68214A79433L44027n2971K19329K38374B88462L74845k4026
$$ y = [722586, 646213, 468828, -92433, 541258, 715018, 613254, 136621, 415713, 802910, 366777, 165630, 486923, 451446, 484141, 631723, 173706, 599386, 596542, 736238, 1126465, 1022236, 895168, 1179226, 954121, 1020309, 950672, 518903, 1100173, 592983, 408327, 417870, 467629, 266638, 562220, 768649, 567413, 692528, 414581, 454939, 760186, 593002, 606072, 818509, 505478, 728747, 740217, 651773, 657590, 607348, 450156, 551768, 601255, 744345, 695774, 437724, 579860, 1038395, 1011085, 905863, 728796, 681919, 659339, 505978, 848640, 409740, 639283, 359063, 626936, 379553, 679358, 672060, 617784, 393708, 861922, 179433, 523460, 470489, 689818, 928192, 288462, 663307, 639281]
14781F39281k53248M53411l12421K8487K27994O1495k01338J6300J01917Q1352
14771H43230l70966L97415l26290p7136J19737N9878j48060p3125k3719J23848
14761E24812J00387l1501m3471O450J94093l00286j6943J9793M48540k64372j66440
14750D71062B15621J93170K35296L1983k02732q8003K64920L1815o7877K47294
14740H61487j65829p5766k34940L41877j90385M80009k85891L80117m79622M16057
14730A047114j2584L16220K58379L81634r7043l51813p5542n85589J4328L12989
14720A208093l73789J81778j02597k10306J86495l81775N36869m72322j95376
14711C77070N49573j00024K7166J96204l89116K73138J70922N32407N0120l07088
$$ y = [639281, 386033, 839444, 527023, 555510, 783504, 844999, 643661, 659961, 761878, 843230, 472264, 869679, 543389, 466253, 585990, 645868, 497808, 424683, 400964, 524812, 625199, 593698, 550227, 556677, 750770, 450484, 433541, 453334, 901874, 637502, 471062, 215621, 408791, 644087, 676070, 473338, 385335, 650255, 682070, 614193, 861487, 695658, 619892, 384952, 726829, 536444, 1016453, 730562, 1110679, 631057, 1047114, 1034530, 1350750, 1609129, 1990763, 1893720, 1541907, 1466365, 880776, 895104, 1208093, 834304, 1016082, 913485, 703179, 889674, 507899, 1044768, 572446, 377070, 926643, 826619, 853785, 1049989, 660873, 934011, 1104933, 1637340, 1687460, 1380372]
14701A380372P55176o09694O61607q46290j48483k09658k08431j00604l6238J52514
14691G90271N5438q8400l00750n4052P16950m42626J99306l9763p5936J78598
14681I39036k782j42437J3319k19562J96482l05620L76883j69151J45943K57385
14671A089496k02190j59685K33180M0237o8354k3635l39107L88165L3984j26271
14661H65820L10818m9544q6704j53983J45114l99765K80581P4323M37763P6922
14651A501345l38109L64463M7571p10756J82654k14292L05129l2495k4664K52527
14641A333373j97700k5512l13478L36361j84831J05833k88758K25209K37145P2014
14631A299656j80671l88564M75834q378j18235O0576J74216j98055j65299L98947
$$ y = [1380372, 2135548, 1525854, 2187461, 1341171, 1192688, 983030, 774599, 673995, 637757, 790271, 845709, 757309, 456559, 402507, 1119457, 676831, 876137, 836374, 760438, 939036, 936254, 793817, 807136, 587574, 784056, 478436, 855319, 686168, 832111, 1089496, 887306, 727621, 960801, 1001038, 932684, 909049, 569942, 958107, 992091, 865820, 1176638, 1127094, 1040390, 886407, 1031521, 631756, 912337, 986660, 1424423, 1501345, 1163236, 1527699, 1575270, 864514, 1047168, 832876, 1138005, 1105510, 1080846, 1333373, 1135673, 1110161, 796683, 1133044, 948213, 1054046, 765288, 990497, 1227642, 1299656, 1118985, 730421, 1206255, 1197877, 1079642, 1140218, 1314434, 1116379, 951080, 1350027]
14621A350027L0618j10241M1403j82178L88523k34016p1557K14504j03779P3159
14611A396463n13580K80228L47800m32361K97617q2723J59603j52847R1186r3623
14601A297763L3836M0943K14054l59756M81643k27425j09375q4412L47530j61618
14591A473183j46903j49453J47347j21755M55043J37800j67078J05127j32223
14582A601088M7413P8995J0690o4545Q5422k11307J21267M257J42169k12227K76920
14571A880142J39425L4350l15961P4194k62953L19307j60596L56514K50910J4232
14561B329564k0910K19812J62193l22500l5908M53406m43273O28547J36540K79127
14551C386598M38608J024868J347679L339180P364130K3020514R301108A7396889
$$ y = [1350027, 1380645, 1270404, 1311807, 1129629, 1518152, 1284136, 1212579, 1427083, 1323304, 1396463, 882883, 1163111, 1510911, 1078550, 1376167, 1293444, 1453047, 1300200, 1391386, 1297763, 1331599, 1372542, 1586596, 1226840, 1708483, 1481058, 1371683, 1287271, 1634801, 1473183, 1326280, 1176827, 1324174, 1202419, 1657462, 1795262, 1628184, 1733311, 1601088, 1648501, 1727496, 1738186, 1673641, 1759063, 1547756, 1669023, 1673280, 1815449, 1603222, 1880142, 2019567, 2053917, 1737956, 1812150, 1549197, 1868504, 1707908, 2064422, 2315332, 2329564, 2308654, 2528466, 2690659, 2368159, 2332251, 2785657, 2342384, 2970931, 3107471, 3386598, 3825206, 4850074, 6197753, 9536933, 16901063, 39921577, 49222685, 17396889]
14542E802849k775244j006162J4886n0916O89729P83651L147758C251516j128786
14533B122730m82245P9729K7238j82012N08312j71715p0526K67569j15840k4014
14523A959226K16577l11790l630L10489r3349j42287r8913O78267m80457J56141
14513B190274r1105k8167K62956j95801j2117J29700M96876l00273O2729J44625
14503B659697p7146r4911j82619R6548l33040M50519M77989q1469l56361L80768
14493B939975l25209L92609N4083l58642J17069K90437l85408K68705p8776L99779
14483C314622l13558K45813K35875m59655K73101L2113J43870o6858l50763K68145
14473C322705M65503J0303m27092L70666L52386l46275J13545j74056K60031J28770
$$ y = [5802849, 3027605, 2021443, 2036329, 1985413, 2675142, 3458793, 6606551, 3251516, 2122730, 1640485, 1720214, 1747452, 1565440, 2073752, 1902037, 1831511, 2099080, 1983240, 1959226, 2175803, 1864013, 1860383, 2170872, 2077523, 1935236, 1836323, 2514590, 2034133, 2190274, 2099169, 2071002, 2333958, 2138157, 2126040, 2255740, 2752616, 2452343, 2515072, 2659697, 2582551, 2487640, 2305021, 2401569, 2068529, 2519048, 2997037, 2915568, 2559207, 2939975, 2614766, 3007375, 3061458, 2702816, 2819885, 3110322, 2724914, 2993619, 2914843, 3314622, 3001064, 3246877, 3482752, 3023097, 3296198, 3328311, 3472181, 3405323, 3054560, 3322705, 3788208, 3798511, 3371419, 3742085, 4094471, 3748196, 3861741, 3687685, 3947716, 4076486]
14463D076486k21440j80042K74324K21726J40228k10335p1341O08105n00985K01446
14453D338172j88383N98157j14324o9715J08922p146j60012K53347L01430O6487
14443E126935k60829K91355k35371L19669l12491M54311K76716j89073j44334
14434E326888L1324J58260J76611R6171k49724M61226m1041J98439J41351K01889
14424F501394L6067M02762l7472Q8411K89018j10941J79062L07381m81250J0903
14414G185335K01525K39393j38238K70013L02641J23248j25874M24778j71031
14405H311790L72939J08810J66209m17274K11861J71660r7659M89409K7620N5110
14395I400475K95273N6693J57936M03780q2798K39973L83944J47561M64183L0146
$$ y = [4076486, 3855046, 3675004, 3949328, 4171054, 4311282, 4100947, 4029606, 4637711, 4136726, 4338172, 4149789, 4747946, 4633622, 4563907, 4672829, 4665683, 4505671, 4759018, 5060448, 5126935, 4866106, 5157461, 4922090, 5241759, 4929268, 5383579, 5660295, 5471222, 5326888, 5358212, 5516472, 5693083, 5789254, 5539530, 6000756, 5959715, 6158154, 6299505, 6501394, 6537461, 6940223, 6902751, 6991162, 7280180, 7169239, 7348301, 7655682, 7174432, 7185335, 7386860, 7626253, 7488015, 7758028, 8060669, 8183917, 8058043, 8482821, 8311790, 8684729, 8793539, 8959748, 8542474, 8754335, 8925995, 8828336, 9317745, 9345365, 9400475, 9695748, 9752441, 9910377, 10314157, 10231359, 10471332, 10855276, 11002837, 11467020, 11497166]
14385A1497166J09884m960Q12756J89544l4460M77969k57640K06265M65302Q4730
14375A3546556J39921L26320O67103m802M86877R0830L84050K63577M24356L63156
14365A6687944M00427M13669O2592K26269N79850N40865K68139K49521R40071
14356B0369347J85915L75270N87999N54768J14877L28585J028671M57472J032219
14347B5035123K50864P37530L06597R12377R52681M85817N58223R98728R38211
14338C1176151N47494J542099N17132J077437R53086J283967J012302J046881
14330C9156549J314417J163722J542924J258739J313617J766731J956432J531753
14322E1004884K002735J845518K182759K099154J947428K431193J641756K721673
$$ y = [11497166, 11607050, 11602090, 12414846, 12604390, 12569930, 13047899, 12790259, 12996524, 13461826, 13546556, 13686477, 14012797, 14679900, 14675098, 15161975, 15252805, 15636855, 15900432, 16324788, 16687944, 17088371, 17502040, 17564632, 17790901, 18370751, 18911616, 19179755, 19429276, 20369347, 20555262, 20930532, 21518531, 22073299, 22188176, 22516761, 23545432, 24002904, 25035123, 25285987, 26023517, 26330114, 27242491, 28195172, 28680989, 29239212, 30237940, 31176151, 31723645, 33265744, 33782876, 34860313, 35813399, 37097366, 38109668, 39156549, 40470966, 41634688, 43177612, 44436351, 45749968, 47516699, 49473131, 51004884, 53007619, 54853137, 57035896, 59135050, 61082478, 63513671, 65155427, 67877100]
14314F7877100K825131K790785K790925L181420L789365L436024L713617M078526
14306I4482893M091649M618732N091864N061304N481761O066244O162556O644382
14298A37701385P103753P413263Q188738Q547982R102072R856094J0539835J0945449
14290B09398571J1751121J2630781J3237404J3799156J4890728J5248596J5899962
14283C06856319J6651166J6931497J7421598J7141299J7807511J6492744J5772961
14276D25075095J5203708J3442034J1179521O925617M180904L077009J021748
14269D80105636j507694k359558m454052q148294j0535576j2949309j4463349
14262D25687804j6266192j7177743j7830381j7721535j7696251j7095601j6901498
$$ y = [67877100, 70702231, 73493016, 76283941, 79465361, 83254726, 86690750, 90404367, 94482893, 98574542, 103193274, 108285138, 113346442, 118828203, 124894447, 131057003, 137701385, 144805138, 152218401, 160407139, 168955121, 178057193, 187913287, 198453122, 209398571, 221149692, 233780473, 247017877, 260817033, 275707761, 290956357, 306856319, 323507485, 340438982, 357860580, 375001879, 392809390, 409302134, 425075095, 440278803, 453720837, 464900358, 471825975, 476006879, 479083888, 480105636, 478597942, 476238384, 471784332, 463636038, 453100462, 440151153, 425687804, 409421612, 392243869, 374413488, 356691953, 338995702, 321900101, 304998603]
14255C04998603j6216326j5844638j4571663j3993127j3549158j2761428j1946909
14248B06115354j1412532q406711r098046r856119q316645q151601p604803p484175
14240A35784722o299770o318734n351487n459656n233934m760399m522857m611878
14232I3226007l742482k918087l906917l657263l398095k965999k308215l113921
14224F7215028k387573k618546k207732k129642j914164j826665j507507k362031
14216E0261168j465767j636822j572413r51314j531424j477909j485426j046243
14208C9093850j463195j41009q73705j322149j298383q07673j613571m24993r5295
14199C1053877j046034j051838p68228r82700q90385p8830q63031p95583l48155
$$ y = [304998603, 288782277, 272937639, 258365976, 244372849, 230823691, 218062263, 206115354, 194702822, 186296111, 177198065, 167341946, 159025301, 150873700, 143268897, 135784722, 129484952, 123166218, 117814731, 112355075, 107121141, 102360742, 97837885, 93226007, 89483525, 86565438, 82658521, 79001258, 75603163, 72637164, 70328949, 67215028, 64827455, 62208909, 60001177, 57871535, 55957371, 54130706, 52623199, 50261168, 48795401, 47158579, 45586166, 44634852, 43103428, 41625519, 40140093, 39093850, 37630655, 37489646, 36615941, 35293792, 33995409, 33187736, 31574165, 31149172, 31053877, 30007843, 28956005, 28187777, 27205077, 26314692, 26235862, 25372831, 24577248, 24229093]
14190B4229093o80071o85736n57790k90074p23334l96121o75753l66769k80435
14181A9573010o08872m97465k25972p95345j38969L7061l74726n91679P2113o66076
14171A5783080l45796k59063l28259l78851l06722m18557K44975m50607m59273
14162A3080927J18687m69671R9018l22784m13686j65616k92848j88385n4436r6933
14152A1294273q0078k16308j44837j19407l12106n45201J69664l97489m9129j56616
14142I442766K72117n03627J79156l89787k78190j03674q0345m5049k21164m31748
14132G840455L25287k33804q2337n7407m08173J84267L30984k51736l78165N6526
14122G325897j04888n64696j9984J52031K14255l29306O74j82204j77378K73914
$$ y = [24229093, 23549022, 22863286, 22305496, 22015422, 21292088, 20895967, 20220214, 19853445, 19573010, 18964138, 18466673, 18240701, 17445356, 17306387, 17343448, 16968722, 16377043, 16449156, 15783080, 15437284, 15178221, 14849962, 14471111, 14164389, 13745832, 13990807, 13540200, 13080927, 13199614, 12729943, 12828961, 12506177, 12092491, 11926875, 11634027, 11445642, 11391206, 11294273, 11214195, 10997887, 10853050, 10733643, 10421537, 9876336, 10046000, 9648511, 9599382, 9442766, 9714883, 9211256, 9390412, 9000625, 8722435, 8618761, 8538416, 8493367, 8272203, 7840455, 8165742, 7931938, 7849601, 7792194, 7384021, 7568288, 7899272, 7647536, 7269371, 7325897, 7221009, 6656313, 6636329, 6788360, 7002615, 6673309, 6673983, 6491779, 6314401, 6588315]
14112F588315p33998K05845K12587o15549j4021Q7673K12759k01947k57808p8324
14102E405532K48373j65121k85227J16339j93661j00080J54911j90574p1084J64642
14092E084050l88046L08404m15220K66746n26079L72328j76958j94784J92177
14083D522618j36212k40835m1111j6847O7793K06071p0087k32650l71378K59734
14073C947096l19980k61675N05992m3284L8014n69054K06269K60841J1108k9501
14063C745826K53218j72977k08834L31528j97299M73476q31936J95819j48319
14054C440502j96999k9670J39862l37617M8017K65621k1691j97272l9080j50990
14044B920683l24927K98171j39925r1705L40511j7877k67262K7466n77364M24981
$$ y = [6588315, 5854317, 6060162, 6272749, 5657200, 5643179, 5730852, 5943611, 5741664, 5483856, 5405532, 5653905, 5488784, 5203557, 5319896, 5126235, 5026155, 5181066, 4990492, 4919408, 5084050, 4696004, 5004408, 4589188, 4855934, 4329855, 4702183, 4525225, 4330441, 4522618, 4386406, 4145571, 4104460, 4087613, 4155406, 4361477, 4291390, 4058740, 3687362, 3947096, 3627116, 3365441, 3871433, 3828149, 3866163, 3297109, 3503378, 3764219, 3775327, 3745826, 3999044, 3826067, 3617233, 3948761, 3751462, 4224938, 3393002, 3588821, 3440502, 3243503, 3213833, 3353695, 3016078, 3064095, 3329716, 3308025, 3110753, 3071673, 2920683, 2595756, 2893927, 2754002, 2662297, 3002808, 2984931, 2717669, 2745135, 2167771, 2592752]
14034B592752J13646p717K76031l59118M5994L3504P3951l2438j39374K40989
14024B838220n17511j65124K71042L6820Q9471l90309M3512J93515k47922L98568
14014B550282m39161j52624L30775k90868L31561k38513m5091K01854j12143k8288
14004B107784j190m3459l54439L73203j80439j80887p0767L77566k2247k70791
13994A734334J35192j28512N2912j13813N26236O28458K053581M935450J9515975
13985B9339813K5370295B6051767A1098947m374995k006917p87832n30621J46085
13977C544667m75832j90004m85741J84838n7771o30833P07546n52042l7010J18483
13967B126301R5735J45630l43384k452l30327K90448r7982R8994j55687K6034
$$ y = [2592752, 2706398, 2698681, 2974712, 2615594, 2661588, 2695092, 2769043, 2736605, 2597231, 2838220, 2320709, 2155585, 2426627, 2463447, 2552918, 2162609, 2206121, 2399636, 2151714, 2550282, 2111121, 1958497, 2289272, 1998404, 2329965, 2091452, 2046361, 2248215, 2136072, 2107784, 2106594, 2063135, 1708696, 2081899, 1901460, 1720573, 1649806, 2027372, 2005125, 1734334, 1869526, 1741014, 1793926, 1680113, 2206349, 2834807, 4888388, 9823838, 29339813, 54710108, 26051767, 11098947, 6723952, 4717035, 3929203, 3398582, 3544667, 3068835, 2878831, 2393090, 2577928, 2520157, 1889324, 2596870, 2044828, 2007818, 2126301, 2222036, 2367666, 2024282, 2021830, 1691503, 1981951, 1883969, 1982963, 1827276, 1853310]
13957A853310J92094k38765j48526k64766L65197J24431l80498K42109l15102
13948A429484L50301k92327q5M2920k37161n2123L96279j45677m0734K8350J10198
13937A589425M26160m89114j85105N1581K40991l90082Q9689o6K67518l58267
13927A242730K77797l01010k28915K00580R9150l6502K08664j80248K22750l35059
13917A169937p4011K85825n8518k0629o0245l0014k80820K81723L27234p38723
13907H01759J38776J99517K11946J36956m43090J44417l27557J63991J94364j48699
13897A072380l68399M07441k15159P23674m31595k9474l23904L47537j62937M65831
13887A485395k88436r5429j98696K47726j2719r2744k52481N05582n42831J48893
$$ y = [1853310, 2045404, 1806639, 1658113, 1393347, 1758544, 1882975, 1502477, 1744586, 1429484, 1779785, 1487458, 1487373, 1530293, 1293132, 1241009, 1637288, 1491611, 1450877, 1479227, 1589425, 2015585, 1526471, 1341366, 1392947, 1633938, 1243856, 1333545, 1333479, 1600997, 1242730, 1520527, 1219517, 990602, 1191182, 1290332, 1253830, 1462494, 1282246, 1504996, 1169937, 1095926, 1381751, 1323233, 1302604, 1242359, 1212345, 931525, 1213248, 1540482, 801759, 940535, 1140052, 1351998, 1488954, 1045864, 1190281, 862724, 1026715, 1221079, 1072380, 703981, 1111422, 896263, 1619937, 1188342, 1158868, 834964, 1182501, 1019564, 1485395, 1196959, 1101530, 902834, 1150560, 1137841, 1045097, 792616, 1298198, 755367, 904260]
13877I04260K06925k07931J59297K05922k99122N6928N8627Q9706j05169l46191
13867G23252P8100J36969k08153K51967n2632j69853J62277R4160j24268K36536
13857A128355l53783k34650M83443j75449J50411l7162l68089M13895k78540J94453
13847I22884Q5839J4957q4159J43104k25511J77290m94831L18025L08927n62173
13837F04352N37364l48088k14922L78963j06897q5261k49270L01573O1196j42763
13827G36247L8473n115O8950q6061k09030L4186L81074l23563J70493R1337j31921
13816G65070J30517j04019r475K32796j53819j81278j68295j12742L95671J43002
13806I37428l63633j78450K17351j2289K24748j318j90661J81831k97927O39130
$$ y = [904260, 1111185, 903254, 1062551, 1268473, 969351, 1026279, 1084906, 1174612, 1069443, 723252, 801352, 938321, 730168, 982135, 929503, 759650, 921927, 1016087, 891819, 1128355, 774572, 539922, 1023365, 847916, 998327, 961165, 593076, 1006971, 728431, 922884, 1008723, 1023680, 939521, 1082625, 857114, 1034404, 539573, 857598, 1166525, 604352, 1141716, 793628, 578706, 957669, 850772, 765511, 516241, 817814, 879010, 736247, 774720, 769605, 838555, 752494, 543464, 577650, 958724, 635161, 805654, 896991, 765070, 895587, 791568, 782093, 1014889, 861070, 679792, 511497, 398755, 794426, 937428, 573795, 395345, 612696, 600407, 825155, 823837, 633176, 815007, 517080, 1156210]
13796A156210E01630K16078K19374j34627l30984J72385j00657J22287l04053
13787C61433J77094m9043J8750M33800m22890Q4403K53740m23197J27244J7490
13777E78824q1099Q6771j64679j28586K59228Q7921J74786C57035Q0101k14146
13767B22990K72189J38174q3976j10744J77516n4588j8892J57343Q9139k57019
13757E32132F9738N95641k28410K15948J78276k6713l51805L14468k25117C3426
13746D49402L2545P4602j03957K00526C22891J78040L3403J25569j44698l4229
13736D80976j02224J67845M7k64283J224K91315j63331O4090r8747p2539L39388
13725F43761L9120C32666K46363j05647k9125l042J97944B96069M65546C62749
$$ y = [1156210, 501630, 717708, 937082, 802455, 471471, 643856, 543199, 665486, 361433, 538527, 489484, 508234, 942034, 519144, 603547, 857287, 434090, 561334, 578824, 497725, 584496, 419817, 291231, 550459, 638380, 813166, 357035, 437136, 222990, 495179, 633353, 549377, 438633, 616149, 561561, 542669, 700012, 789151, 532132, 69738, 665379, 436969, 652917, 831193, 804480, 452675, 767143, 542026, 33426, 449402, 481947, 556549, 452592, 653118, 322891, 500931, 534334, 659903, 515205, 480976, 378752, 546597, 546644, 282361, 283585, 574900, 411569, 475659, 376912, 304373, 643761, 682881, 332666, 579029, 473382, 444257, 441215, 639159, 296069, 761615, 362749]
13714E26974K9602j75880A09299K82893K0512K0651q52R0774j80736j8630K18322
13703E42233J42579j58982k42801Q3401K57117L903k71312K41213p9082k24674
13693B93595M04893A18112M85694j77551R6111J70206B41650J8126K22724J91643
13683F74143B78831K40500j2949A68724J95041J27611k06576K9303M28529k41549
13673E01083B27673Q3822Q7336J33181p4668J78446p5538k0078J52109A61216
13662B87042R6135j17834K06048j58563J27996j30487m4515P5816K7688N22245
13652H91571C61200k7580K84792k39213L3787J34356j76867r1772J94706A17893
13641A8882J35224J98887o8365r7765Q313K42920M9163A26155J26928K04767A68458
$$ y = [526974, 556576, 380696, 109299, 392192, 412704, 433355, 432503, 523277, 342541, 323911, 542233, 684812, 525830, 283029, 366430, 623547, 627450, 356138, 597351, 518269, 293595, 698488, 118112, 603806, 426255, 522366, 692572, 241650, 259776, 482500, 674143, 278831, 519331, 506382, 168724, 363765, 491376, 284800, 314103, 742632, 501083, 227673, 311495, 398831, 532012, 457344, 635790, 560252, 540174, 692283, 161216, 287042, 383177, 265343, 471391, 312828, 440824, 310337, 265822, 341638, 369326, 891571, 361200, 333620, 618412, 379199, 412986, 547342, 370475, 278703, 473409, 117893, 18882, 154106, 352993, 284628, 186863, 195176, 438096, 487259, 126155, 253083, 457850, 168458]
13629B14803K15607A10473K24921j15064R6650r1258J55789O0906q5051F225M15135
13618D21360k08450P8261j26826K08600k473H579N21600p464l15k11868A23065
13606E31353B17326n0705M00293Q6133a42108C75515A77731J07136j00318C0984
13595D42375j83472M4996J0041G7592M12438p2284E5584R1778Q3531I8388K73865
13584C72253j05296J83554j77443k6474M00285A49834K36167J36048A87795K33096
13574D20891A25799k4569K17052J48797B9741M74408B22987G3196L02344h2069
13563A44274j2643M1600J57324j50875G675J0309K71015A18002i606F9916O4315
13552A34231l6444M63888B40289A07182J50211H2415K67366A56151K75394j74999
$$ y = [214803, 430410, 110473, 335394, 220330, 316980, 225722, 381511, 442417, 357366, 6225, 421360, 212910, 291171, 164345, 372945, 370472, 8579, 530179, 522715, 522400, 310532, 123065, 531353, 217326, 166621, 566914, 653047, -142108, 375515, 177731, 284867, 184549, 30984, 442375, 258903, 303899, 313940, 77592, 490030, 417746, 55584, 147362, 230893, 98388, 372253, 266957, 450511, 273068, 246594, 646879, 149834, 386001, 522049, 187795, 420891, 125799, 101230, 318282, 467079, 29741, 504149, 222987, 73196, 375540, -82069, 144274, 131631, 173231, 330555, 179680, 7675, 17984, 288999, 118002, -9606, 69916, 134231, 97787, 561675, 240289, 107182, 257393, 82415, 349781, 156151, 431545, 256546]
13542B56546j3515j01006K99654I9520M07255o581A14608L28418F2905O2120L2365
13531A57390R9480j14677J31079i7745A64425Q9310k4904A03979L74564k37684
13521B40859e5758b4540A99822K21117j51079a06161C93584j59114A2079K76790
13511B88869a16646A87489K44084j20388j53494O3828q1635j6155K37332m2505
13501C18556j38975g0775C44459A34327K93088k12648E4125K26091g9085B12335
13490F877K62891j21298k247J5195J6743q0845J20230J10254j50095a50600O3647
13479h6953A66971N2420M5825j1434R3046j04350m8981c368B65637R3159J09102
13468D67898j06733G031J61608J65004a22251C01496L2096A53532a1611D42298
$$ y = [256546, 243031, 142025, 441679, 99520, 506775, 500194, 114608, 443026, 62905, 125025, 157390, 256870, 142193, 273272, -97745, 164425, 253735, 228831, 103979, 478543, 240859, -55758, -24540, 199822, 420939, 269860, -106161, 393584, 234470, 12079, 288869, -116646, 187489, 431573, 311185, 157691, 221519, 139884, 123729, 361061, 318556, 179581, -70775, 344459, 134327, 427415, 214767, 54125, 280216, -79085, 212335, 6877, 269768, 148470, 146223, 161418, 178161, 97316, 217546, 327800, 177705, -150600, -86953, 166971, 219391, 265216, 253782, 346828, 242478, 193497, -3368, 265637, 358796, 467898, 361165, 7031, 168639, 333643, -122251, 301496, 333592, 153532, -11611, 442298]
13457B87517M52611a39609C14818B7560J50694A2909M54865A60096A506L16122
13447C17628h926m8251E1603J01494J36516a36738A58480A2654K02604D1743J20859
13436A62602j0994l8181J23062D6335d5076D27406p8752A04483L27555B9500K61730
13425B91230j32996d3520D2512L06392I4797K12598e2785C44340F4537B6218f8782
13413a28904B80497j34979l4708K81265a09258I0116J95411A1071K38516n8198
13403A91389e2487A24397L4624J08667k5294b5379n541J1466C32247j2593f3035
13391B86369H5827G955O9261j1939L11044J68737A93467m114A0954L98098P9722
13380D88774I962O0134N9853J45587j25435J96547C0920K63100q7021F966K5279
$$ y = [287517, 740128, -139609, 314818, 27560, 178254, 12909, 467774, 160096, 1506, 317628, -8926, -57177, 51603, 153097, 289613, -136738, 158480, 12654, 215258, 41743, 162602, 151608, 113427, 236489, 46335, -45076, 427406, 348654, 104483, 432038, 29500, 291230, 158234, -43520, 42512, 348904, 94797, 307395, -52785, 344340, 64537, 26218, -68782, -128904, 280497, 145518, 110810, 392075, -109258, 90116, 285527, 11071, 249587, 191389, -52487, 124397, 159021, 267688, 242394, -25379, -30920, -19454, 332247, 319654, -63035, 286369, 85827, 7955, 77216, 65277, 376321, 545058, 193467, 189353, 10954, 409052, 488774, 9962, 70096, 129949, 275536, 150101, 346648, 30920, 294020, 206999, 6966, 32245]
13369C2245J63538m4760A5727h0293C18528l4522J08305A04876e7878B02103E5473
13357A81914L3002k7951J02885O7222A57941i7437b3857B49456H5397L14647i7273
13345B47157L10968k48303o4195J45758A82165L8246N7477P7481j48085K16462
13335D23746O6804K1525k15654A34303O3465G1141J02483J7680J6651J68541A04544
13323A90816D59L40755K86311A56464M0112N8750E5511L03290H2872g9651A02784
13311B85679a99510K7298B75266A34715J43787k9177I3577K94232i7999a8973
13300B70841M9254j03142a89721C01285J91639E3874g9420k46618g9178q458A55268
13288a20138I9041C348b25592j09616c2257I7150L48330A5731N7215R4683b40756
$$ y = [32245, 195783, 151023, 15727, -80293, 318528, 284006, 392311, 104876, -57878, 202103, 55473, 181914, 214916, 186965, 289850, 357072, 157941, -97437, -23857, 249456, 85397, 400044, -97273, 247157, 558125, 309822, 245627, 391385, 182165, 220411, 277888, 355369, 207284, 423746, 490550, 512075, 296421, 134303, 197768, 71141, 173624, 191304, 207955, 376496, 104544, 190816, 459, 341214, 627525, 156464, 196576, 255326, 55511, 358801, 82872, -79651, 102784, 285679, -199510, -172212, 275266, 134715, 278502, 249325, 93577, 387809, -97999, -18973, 270841, 320095, 216953, -189721, 301285, 492924, 53874, -79420, -326038, -79178, -87636, 155268, -120138, 99041, 3348, -225592, -335208, -32257, 97150, 445480, 15731, 72946, 167629, -240756]
13276a7432q6528f70k8912A43128o1669G46d789A235f7945B54881r637J09147
13264C54391K54889A82581K07259j76392d8498H9618L12212H4600l4514d4688
13253A37811B006a18268B76729A30223a20550A13658a35481A11674N6094g8841
13242c0127A20195K1494J06915p8684j3092J65076L2355K137o7037A08439c8602
13230A3151L37250r9896F5850A4476Q7846a40101C13062a18859C7359Q3390J9848
13219A40597b93925A61099M4040e34j46931A51790C060b7443k12691F7666K42641
13208C10307c09472A59185b7959A34805c5652A23076K4665h7321J5206A51321
13197h5102p3089r707N6530I1378P3652M45805b00036A80522K0466q8186c28912
$$ y = [-17432, -103960, -670, -29582, 143128, 81459, 746, -4789, 1235, -67945, 254881, 245244, 354391, 609280, 182581, 389840, 213448, -48498, 89618, 401830, 84600, 50086, -44688, 137811, 2006, -118268, 276729, 130223, -120550, 113658, -135481, 111674, 167768, -78841, -30127, 120195, 141689, 248604, 169920, 156828, 321904, 354259, 356396, 289359, 108439, -38602, 13151, 350401, 250505, 65850, 14476, 102322, -140101, 313062, -118859, 37359, 120749, 140597, -293925, 161099, 205139, -534, -147465, 151790, 3060, -27443, -240134, 67666, 310307, -309472, 159185, -27959, 134805, -35652, 123076, 147741, -87321, -72115, 151321, -85102, -158191, -167898, -111368, 91378, 165030, 610835, -200036, 180522, 200988, 112802, -328912]
13185A3303L5839J61476a07911r8847D9944e4490a0478A43234K13277I0501b1486
13173a19610a0635k29642A68129K0717q8114b13644B08306b67288A46521p1728
13163G4793J83443b7963A11147a49786E3729A9229c34398E9141k0343J63695a05
13151a45068a2464I2893C701M7282a91162A22592C3150a67084i600H8848c18931
13139a14735a3644E2494h8956C50623A30123c196I7811P4995G3846C4671J01359
13128A36030a2877C63667b72325g6244k00463A40757L2750q0286e860D5829M5320
13117I1149c5448o84n4397A38815O370m382A8650J47387I49a48241C59031a79240
13104e5044j75321A15245k9106A7094K08568f5552r1170C0838N0892b60004a28921
$$ y = [13303, 49142, 210618, -107911, -206758, 49944, -54490, -10478, 143234, 356511, 90501, -21486, -119610, -10635, -240277, 168129, 188846, 100732, -213644, 208306, -267288, 146521, 74793, 258236, -27963, 111147, -149786, 53729, 19229, -334398, 59141, 38798, 202493, -105, -145068, -12464, 92893, 3701, 50983, -191162, 122592, 33150, -167084, -9600, 88848, -318931, -114735, -13644, 52494, -88956, 350623, 130123, -3196, 97811, 172806, 73846, 34671, 136030, -12877, 363667, -272325, -76244, -276707, 140757, 173507, 93221, -5860, 45829, 91149, -35448, -36132, -90529, 138815, 145185, 140803, 18650, 166037, 949, -148241, 359031, -179240, -55044, -230365, 115245, 86139, 17094, 225662, -65552, -156722, 30838, 81730, -260004, -128921]
13092G3898d7241r0603j23851J00492q929O4878A60135b8250H126J42978d8475
13080i2198k45464Q6923F3900a87628C48558j30692k7247n6495b23313C13444
13069a01986e357l8601o8692A59472O6289a96121E044J42404J31913h5538C67203
13057A50492B9981J61065n6791l2943k351j8336J6397J6784J2894a93923a3445
13045H8314L60097k02052F5447d0023D8252i1851n2515e1046A28838K71700g9058
13033A65377b5632D05673b3279k13313G4977a00558c9212G0066L9755d14202c8439
13021B83560G2672b64113A18661b03547A8118R750L40801j08230A7388K78780
13011B96168A39801E8286a11387o9715B63053F5495a39B21065e0548k431m624
$$ y = [73898, -47241, -137844, -261695, -161203, -170132, -105254, 160135, -28250, 8126, 151104, -48475, -92198, -337662, -250739, 63900, -187628, 348558, 217866, 190619, 134124, -223313, 313444, -101986, -5357, -43958, -112650, 159472, 225761, -196121, 5044, 147448, 279361, -85538, 367203, 150492, 29981, 191046, 134255, 101312, 98961, 80625, 97022, 113806, 126700, -193923, -13445, 88314, 448411, 246359, 65447, -40023, 48252, -91851, -144366, -51046, 128838, 400538, -79058, 165377, -25632, 405673, -23279, -236592, 74977, -100558, -39212, 70066, 109821, -414202, -38439, 283560, 72672, -264113, 118661, -203547, 18118, 27868, 368669, 260439, 17388, 296168, 139801, 58286, -111387, -181102, 263053, 65495, -139, 221065, -50548, -52979, -57603]
13000e7603B0969a13207L5609B46088h3123I2072k500f2276A60320n8867a21876
12988A36325j0550a89802C5284h8080D8035h428k1471A6488J897K09697B4100
12976B82060b48738D11535A89895B7532a59397j04742a01041o0575B25738a7975
12965b53415a24125j47164D1566K5592g7197E7743e2322A42444d5942B56104h9352
12953a11273l4034A65800J43444b36960B09254G7639a0989k32396j31207O5831
12943c08761A98119o2720a8342A55256o2631a8043I6293c04361a04750I7713a3515
12931D05593C0688P9570L9788g1451B90240a65465A09912J65956p5519c7300k4922
12920f2222A55114p6693P0555a52811D259a75687j30576A18012C4174a12482K9398
$$ y = [-57603, 20969, -113207, -77598, 246088, -83123, 92072, 89572, -62276, 160320, 101453, -121876, 136325, 125775, -189802, 35284, -88080, 48035, -8428, -29899, 16488, 18385, 228082, 24100, 282060, -248738, 411535, 189895, 27532, -159397, -264139, -101041, -161616, 225738, -17975, -253415, -124125, -271289, 41566, 67158, -77197, 57743, -52322, 142444, -45942, 256104, -89352, -111273, -145307, 165800, 309244, -236960, 209254, 77639, -10989, -243385, -374592, -308761, 198119, 135399, -18342, 155256, 92625, -18043, 96293, -304361, -104750, 97713, -13515, 405593, 30688, 110258, 150046, -71451, 290240, -165465, 109912, 275868, 200349, -37300, -62222, 155114, 78421, 148976, -152811, 4259, -175687, -306263, 118012, 34174, -112482, -83084]
12909h3084o1636j49119B43496H3304g5373d160k51840G0647L61555A00134e4161
12897b44982h9231E2645B017M4109A5979J12190n854P7549b01132j22034a44469
12885G0669b66276A04968d8725k6236F0360J98941I0317C598h9870B73970a08137
12873a84004B4833a41924G8062j3965k9995a97315k13467D8635b03276G6856O5949
12862A42805p217J33341b74929L6997B78112C1426a78053h6906k41686J35896
12852a92696G8100P0379E7811a28965G1605a17957j05460H2537K12920h3595K6609
12841e6986A86245k3339J020p7276a35967r994h053j86291B18237a28492j2706
12830a41198G3107a35353k3785A13885b58704J01520m5756K5360E0260d9531p9468
$$ y = [-83084, -144720, -293839, 243496, 83304, -75373, -4160, -256000, 70647, 432202, 100134, -54161, -244982, -89231, 52645, 2017, 46126, 15979, 128169, 122315, 199864, -201132, -323166, -144469, 70669, -266276, 104968, -48725, -74961, 60360, 259301, 90317, 3598, -89870, 273970, -108137, -184004, 24833, -141924, 78062, 64097, 34102, -197315, -410782, 48635, -203276, 76856, 142805, 135588, 268929, -274929, -237932, 278112, 31426, -178053, -86906, -328592, -192696, 78100, 148479, 57811, -128965, 71605, -117957, -223417, 82537, 295457, -83595, -56986, 186245, 162906, 163926, 86650, -135967, -145961, -8053, -194344, 218237, -128492, -141198, 73107, -135353, -159138, 113885, -258704, -157184, -202940, -177580, 50260, -49531, -128999]
12819a28999B33373E5883J23972b6908m5751D2457b2897o7088A158a2078I0105
12807b53749J22443D6340b2851A80068P5890j17474b68582e6015B75777h2942
12796e1604l5938G7971l4718a54310K8044H4451b23161J00608C9755g4858o0376
12785a35234K0120M151r5361K6911H1003b81876B06598a95002o9663e323j65440
12774a70763Q3214C66545b1881n5525c1861K551j08962A25642N5721a34653C51671
12762A20106A3553M3547J0851K53919D1383a65094r1393o4330A35019b67801b2425
12750d61977a27595A75650C8290J33883a30305F1256b7717A58112a91640n723
12740a97363a2295O91C22163L5962b03A61699m0199N0221G2063k464d6400k33976
$$ y = [-128999, 233373, 55883, 179855, -26908, -72659, 42457, -22897, -89985, 1158, -12078, 90105, -253749, -131306, 46340, -22851, 180068, 255958, 138484, -268582, -56015, 275777, -82942, -51604, -87542, 77971, 43253, -154310, -126266, 84451, -223161, -122553, 39755, -74858, -135234, -115114, -110963, -206324, -179413, 81003, -281876, 206598, -195002, -264665, -5323, -170763, -87549, 366545, -21881, -77406, -31861, -29310, -138272, 125642, 181363, -134653, 351671, 120106, 13553, 57100, 67951, 321870, 41383, -165094, -256487, -320817, 135019, -267801, -22425, -461977, -127595, 175650, 38290, 172173, -130305, 61256, -27717, 158112, -191640, -197363, -12295, -11604, 322163, 358125, -203, 161699, 121500, 171721, 72063, 69599, -46400, -280376]
12728b80376I2756J5198K3258j9722J29857E4663O0177j6831D1561A1583L06188
12717C17771A44745P1113A6228J65658H5207J93400K9905a15012N0574B9653K66742
12706B96395k5138b29284A10102m3590O1582E4465g6226B16646c50493C7597d27914
12694h9702L9877l8940M4197j98205g2088A87460g8275A46936a3311A49973a337
12682B0767L23796m1345o7919H9933L77320G6372Q0455I858a62069A73342b88570
12670I7937J21128E1780b47769B26533b448k85110C3909Q4271a86689j24103J22052
12659a88740F7151K53859q0680I6963N5184f2734I8745O8462M7422b59418C01956
12647A44819a34285A2244F035K30988h9947K0919C692c33690B3422J30487a63582
$$ y = [-280376, 92756, 107954, 131212, 111490, 241347, 54663, 114840, 98009, 41561, 11583, 317771, 144745, 215858, 16228, 181886, 85207, 278607, 308512, -115012, -64438, 29653, 296395, 271257, -229284, 110102, 66512, 128094, 54465, -76226, 216646, -350493, 37597, -427914, -89702, -49825, -88765, -44568, -242773, -72088, 187460, -78275, 146936, -13311, 149973, -1337, 20767, 344563, 303218, 235299, 89933, 467253, 76372, 156827, 9858, -162069, 173342, -288570, 97937, 219065, 51780, -247769, 226533, -2448, -287558, 33909, 118180, -186689, -310792, -188740, 67151, 321010, 240330, 96963, 152147, -62734, 98745, 167207, 214629, -259418, 301956, 144819, -134285, 12244, 6035, 237023, -89947, -69028, 3692, -333690, 23422, 153909, -163582]
12635B44872D4287Q0797a91488m31K4890K5605B9651O2554K39730j50923c8028
12623A0642c5034C60097A14626a66643I3258B5330J23953E3118j6942b99619h8646
12611a49216j3567l1384e6932j16466J9295A47139a42283A70368J39101H2121
12600A27035J15084f1331A37976m8375h2378C36712I3375e1076A38872N7640q3876
12589A12636b09959C80091A9786a28282A86815b14690A34501E9268L9379O2501
12579A61148h3004B59309K9026G644f9374n2860b3708A23736J43792A6378c21588
12567B11268G6056P5840b61989g752A61433n0368d2519r607r270E2871J31294
12556A84165c1919I4931h9560k43602C16832a80278A69500d38499f7867C34354
$$ y = [244872, 44287, 125084, -191488, -191919, -167029, -141424, 29651, 92205, 331935, 181012, -38028, 10642, -35034, 360097, 114626, -166643, 93258, 25330, 149283, 53118, 36176, -299619, -88646, -149216, -162783, -194167, -56932, -173398, -154103, 147139, -142283, 170368, 309469, 82121, 127035, 242119, -61331, 137976, 89601, -82378, 336712, 93375, -51076, 138872, 196512, 112636, -209959, 380091, 19786, -128282, 186815, -214690, 134501, 59268, 98647, 161148, -83004, 259309, 288335, 7644, -69374, -122234, -23708, 123736, 267528, 16378, -321588, 211268, 76056, 151896, -261989, -7752, 161433, 111065, -42519, -52126, -61396, 52871, 184165, -31919, 94931, -89560, -333162, 316832, -180278, 169500, -438499, -67867, 334354]
12545c602j49990D18491A2246P7440c20097A55729k6899C7406e2388k77866B26434
12533h8838m08968A40845c5215F0524K6096P1151o3731m3252a82576c0818k1171
12522e1989E7473K24346m1956b05609g6741j8009A39904j9361a17424j9188d3925
12510H3747c2025A43562K50676a7397A14403a23637l9381A82009q8612a35494
12499A49153o0699i974k86395r3236J51862B41033A1197J08671a08405A87326
12488c27238P8290F2182d6756j1317A28043e5817A71758b97163L6851a9392A27109
12476D8362a30634j89079A72989J00736a02158m5546A32612c9610A95131h4227
12465a63289b1135A52557m4404a11233j59813A14482g0068j5018q0282A70405
$$ y = [-3602, -153592, 418491, 12246, 89686, -320097, 155729, 128830, 37406, -52388, -330254, 226434, -88838, -497806, 140845, -35215, 60524, 86620, 157771, 94040, 50788, -182576, -30818, -51989, 57473, 281819, 239863, -205609, -76741, -94750, 139904, 120543, -117424, -136612, -43925, 83747, -32025, 143562, 394238, -17397, 114403, -123637, -163018, 182009, 93397, -135494, 149153, 88454, -9974, -296369, -389605, -237743, 241033, 11197, 119868, -108405, 187326, -327238, -248948, 62182, -46756, -58073, 128043, -55817, 171758, -297163, -260312, -19392, 127109, 48362, -130634, -319713, 172989, 273725, -102158, -147704, 132612, -39610, 195131, -84227, -163289, -21135, 152557, 108153, -111233, -271046, 114482, -70068, -85086, -165368, 170405]
12454a12652M7547A15293M9010G6033c09831A23340A0279R2760a57321f3633C08803
12442G4584b08450j30976A67845e13436J88450k37159a84883B19641a94126k77113
12432d71239P3095b8575j15334f1326k22722A3807O9578i8521j03240F6447E60
12420A32065H941L03353a46762F068M76227a21014l8198L5973O1484A05331a35754
12408A26349K31344a3616k043A25790C7559P189J09931Q6299b69844C14926j18234
12397A96692c1317A06767c9259A99760H3630k871a95812Q4960B89089d868k91608
12386b96476f4106A19041C881J80053b25630H6896K0553O4931Q9925L887E1483
12374C36303q7731a24147q793g494F2461J48586a11412k5312J9914B405J00801
$$ y = [-112652, -65105, 115293, 164303, 76033, -309831, 123340, 10279, 103039, -157321, -63633, 308803, 74584, -208450, -339426, 167845, -513436, -324986, -562145, -184883, 219641, -194126, -471239, -398144, -28575, -143909, -61326, -284048, 13807, 83385, -98521, -201761, 66447, 560, 132065, 8941, 312294, -146762, 6068, 482295, -121014, -159212, -123239, -61755, 105331, -135754, 126349, 357693, -13616, -15659, 125790, 37559, 44748, 154679, 240978, -269844, 314926, 196692, -31317, 106767, -39259, 199760, 83630, 80759, -195812, -110852, 289089, -4868, -296476, -64106, 119041, 3881, 183934, -225630, 86896, 107449, 172380, 262305, 266192, 51483, 336303, 248572, -124147, -132940, -7494, 62461, 211047, -111412, -136724, -116810, 2405, 103206]
12363A03206O6276a90274K2177N3749A56174b16431f16j35396l9542g510j29351
12352a36861f4613k0164G085b2190k13163A38657a3887k26560N9779A00465a27527
12340a9593K452D7665a36543B2584J13730h8733J1100C20561j55834P1526r8237
12329A38016J3514m8324L2581J2203J64357J59781j87041q8743l1376J62529J09174
12318D36671A26497J99068k7717E1748L86177H3884J47387C2486J50981m9701
12308A33766b80765G1533F219b12839B6012J60397a42732J2471A6165J25729L14825
12297D56719a95515B36051b34625J9598D13126F4049a97985A59180K5512c2244
12286C80244I8398J31120b47433A92298l481e1135C82687j10958p7285F5078B9107
$$ y = [103206, 169482, -190274, -168097, -114348, 156174, -216431, -616, -136012, -175554, -7510, -136861, -64613, -84777, 7085, -22190, -235353, 138657, -13887, -240447, -180668, 100465, -127527, -19593, -17141, 47665, -136543, 22584, 136314, -88733, -77633, 320561, 164727, 236253, 138016, 151530, 103206, 135787, 147990, 312347, 472128, 285087, 196344, 164968, 327497, 436671, 126497, 325565, 297848, 51748, 437925, 83884, 231271, 32486, 183467, 133766, -280765, 71533, 6219, -212839, 26012, 186409, -142732, -130261, 16165, 141894, 456719, -195515, 236051, -234625, -215027, 413126, 64049, -197985, 159180, 184692, -32244, 380244, 98398, 229518, -247433, 192298, 188817, -51135, 382687, 271729, 194444, 65078, 29107]
12274f2032r9676C12882m0326C3937b6883l11439k6513a13045C87397A39693b6126
12262A57765d1936A52466J18792Q880J92166k22156A12316b9827C29859o7175
12252B62684m4819C5772A0677L30923G39K02886j01786d0357j20914D6090b17058
12240A12193N6614a53368i950D2537K21680F903b13891i2747E9755R766K2314
12229I1835K35356e6558A03862j704l9328e1159B14902Q1931E5300L48335a22543
12217E09008p3091k8105k8343j83082k9428K3112f526A12270m6777J47445d8746
12205b4306p2756B99726I7512L38145A33970b5724D39823j66410j12865k749e7979
12193E7815J81084O1794J46973o458j19156J20825n6086j80740j4111a26657B80051
$$ y = [-62032, -161708, 312882, 272556, 33937, -26883, -338322, -364835, -113045, 387397, 139693, -26126, 157765, -41936, 152466, 271258, 280138, 472304, 250148, 112316, -29827, 329859, 262684, 217865, 35772, 10677, 341600, 739, 203625, 101839, -40357, -161271, 46090, -217058, 112193, 168807, -153368, -9950, 42537, 264217, 6903, -213891, -92747, 59755, 69521, 91835, 327191, -56558, 103862, 102158, 62830, -51159, 214902, 296833, 55300, 403635, -122543, 509008, 435917, 407812, 379469, 196387, 166959, 190071, -6526, 112270, 65493, 212938, -48746, -24306, -97062, 299726, 97512, 435657, 133970, -25724, 439823, 273413, 160548, 157799, -57979, 57815, 238899, 300693, 447666, 441208, 322052, 442877, 386791, 206051, 191940, -126657, 280051]
12181B7518K3004J4077a46442B24824d6889A70347b13160A66675J7413j3611F9778
12169G3442N2453J96420j10433A2257K94604o6713m2311J88089A46718D3993e9515
12157H5672d76006D55864e0435j10829C56725A11459j2343b32253C21816F2093
12146A25970L4765G2476a73761c5629a5987A08712j3125J14937H1070C8360b19150
12134h667D16121A50889L41279G0237a7031k5234j67885B82030A23589j3634C1583
12122A63582N5076a6206D00429H7835O2248L16356h3176B19367a15885A9671b57131
12110B75761b202C28468J4160o9785A18164c22346A31771Q9676m5002D5756J79816
12099B25572R4755h9604b5224A17871j2594A6378a55305a9892J121A86920m183
$$ y = [27518, 50522, 64599, -146442, 224824, -46889, 170347, -213160, 166675, 184088, 170477, 69778, 73442, 125895, 322315, 211882, 12257, 306861, 240148, 197837, 385926, 146718, 43993, -59515, 85672, -476006, 455864, -50435, -161264, 356725, 111459, 99116, -232253, 321816, 62093, 125970, 160735, 72476, -173761, -35629, -15987, 108712, 95587, 210524, 81070, 38360, -219150, -8667, 416121, 150889, 492168, 70237, -17031, -42265, -210150, 282030, 123589, 109955, 31583, 163582, 218658, -16206, 400429, 87835, 150083, 466439, -83176, 219367, -115885, 19671, -257131, 275761, -2202, 328468, 342628, 272843, 118164, -322346, 131771, 221447, 176445, 45756, 225572, 320327, -89604, -25224, 117871, 105277, 16378, -155305, -19892, -18771, 186920, 182737]
12088A82737L54397g0065D7359h4950o930k2467H3459j6606K05280A1138a26224
12076E04785d3394a8283B12605K5314e3825B48609N1482C5509A1505n097L65699
12065C72107j62143J9670o5935k101L6869o8209I2J70896O5602F36a68701B40386
12052B59474a2150k37419a07576J1466a9334r69D252J39373c57328a37669B62535
12040a02151H5109O7077B889e5636F2501b49232D14029e5937A25194F1522c8872
12028F1956b87456R8405b2540G5319J64369j07201a75809I2315N1827E7760A6156
12016h392B27408B0816K51279I4829a71502j54219P5961D18412j24124b50735
12005A66095e7068A57043b3862I0730J46572c7675l59123J73275a4776k50408
$$ y = [182737, 537134, -70065, 47359, -84950, -91880, -114347, 83459, 66853, 272133, 11138, -126224, 504785, -43394, -18283, 212605, 237919, -53825, 248609, 300091, 35509, 11505, 6408, 372107, 209964, 229634, 163699, 161598, 198467, 130258, 92, 170988, 236590, 636, -168701, 240386, 259474, -12150, -249569, -107576, -96110, -19334, -20303, 4252, 143625, -357328, -137669, 262535, -102151, 85109, 152186, 2889, -55636, 62501, -249232, 414029, -55937, 125194, 61522, -38872, 61956, -287456, -189051, -22540, 75319, 239688, 132487, -175809, 92315, 144142, 57760, 16156, -8392, 227408, 20816, 272095, 94829, -171502, -325721, -249760, 418412, 294288, -250735, 166095, -57068, 157043, -23862, 90730, 237302, -37675, -396798, -223523, -14776, -265184]
11995b65184E044a90989A21307b63652j09306C07039j52782C2904g8971F5960
11984A7075M31349a88671A31317a65010K6097B56220A20219P56m4817h1964G8259
11972A17019Q241a01753C5313b1238A22591K8677E8305c87608a47702j82579d332
11960a88904j24008h159n71279a16179j18858h0581j89278j9181I1006m1139L2412
11949H2279b79032a03709l4215G7276a96167B0229R8110i0647A73295J93729A82726
11937B72210A33419l6676N7584l2350Q2072b83272A49120L5958G5773B9421J14491
11926A43912R7109N4257d8954B2501N8772N8418a96857d7807E9018J92814C7827
11914A8284J57194B8975a9132A15907c4745j48046A4627a25495k50042B49866
$$ y = [-265184, 5044, -190989, 121307, -263652, -372958, 307039, 154257, 32904, -78971, 65960, 17075, 448424, -188671, 131317, -165010, -138913, 256220, 120219, 120975, 76158, -81964, 78259, 117019, 125260, -101753, 35313, -21238, 122591, 151268, 58305, -387608, -147702, -330281, -4332, -188904, -312912, -8159, -579438, -116179, -235037, -80581, -269859, -289040, 91006, 49867, 82279, -279032, -103709, -137924, 77276, -196167, 20229, 118339, -90647, 173295, 367024, 182726, 272210, 133419, 96743, 154327, 121977, 204049, -283272, 149120, 185078, 75773, 29421, 143912, 241021, 295278, -48954, 22501, 81273, 139691, -196857, -47807, 59018, 251832, 37827, 18284, 175478, 28975, -19132, 115907, -34745, -182791, 14627, -125495, -375537, 249866]
11903A44407A7829J87284N9540b72200A56515b23942I1665k1922c44986C2773
11892b78960C43107a83489E9755b25503h7691q1496B49376a52028e5959j72237
11882b28196D0617a80990b6469j5003l2564L6331q4753d8613k01799i2319F9992
11870a05699B89870j30782a49845C60168A6169L6503a76663j11479F9422G864
11859D4078a30751m9385A61911M9965a81770A8644a42732C2120d2109a4981E5467
11847a01513A17737b02199O5822A09118J01889a25010E44915f1623E4774a49266
11836c08043a03798H1759f2886r6971g9394C4780g9081A18524d02244g6593o1654
11825a38247E8011K45492d38140a83625k42155I8712n206B2088c31365Q7354B2817
$$ y = [144407, 17829, 205113, 264653, -272200, 156515, -223942, 91665, 69743, -344986, 32773, -278960, 343107, -183489, 59755, -225503, -87691, -169187, 249376, -152028, -55959, -228196, 40617, -180990, -26469, -41472, -74036, -37705, -122458, -48613, -250412, -92319, 69992, -105699, 289870, 159088, -149845, 360168, 16169, 52672, -176663, -288142, 69422, 7864, 44078, -130751, -180136, 161911, 211876, -181770, 18644, -142732, 32120, -42109, -14981, 55467, -101513, 117737, -202199, -136377, 109118, 211007, -125010, 544915, -61623, 54774, -149266, -308043, -103798, 81759, -62886, -159857, -79394, 34780, -79081, 118524, -402244, -76593, -138247, 58011, 303503, -438140, -183625, -425780, 98712, 93506, 22088, -331365, -244011, 22817]
11813a94514B22502a69342e6059k35562A85117h2633A7871e96011b23192F3623
11802i9850A37322J18179c17218a29292m7769f0491l8184G7776k1349a48538B61369
11790a90145e5501q171I6195K07784j49702a02730l28391A6813L1386a61372I1123
11778a54986m7806p3797c4739F166d0611C44472L9i7695A01916c48308a03440
11766D5432c2592A57502i564n180E5214i7714A36317b58181A8144K00283P892
11755B26319C7987g8966H9831a31283B97352b98577a06611A09252L4845K05195
11745C49292c96317B7225c64077J05108J25386e271m9190n5810A68978c02869
11734a17547q9359K9525h2311p7600g5090r348L997A18237d0777C6552a7720B73321
$$ y = [-194514, 222502, -169342, -56059, -291621, 185117, -82633, 17871, -596011, -223192, 63623, -99850, 137322, 255501, -317218, -129292, -177061, -60491, -98675, 77776, 56427, -148538, 261369, -190145, -55501, -63672, 96195, 303979, 154277, -102730, -431121, 16813, 48199, -161372, 91123, -154986, -202792, -276589, -34739, 6166, -40611, 344472, 344511, -97695, 101916, -348308, -103440, 45432, -32592, 157502, -9564, -14744, 55214, -97714, 136317, -258181, 18144, 218427, 226319, 37987, -78966, 89831, -131283, 297352, -298577, -106611, 109252, 144097, 349292, -396317, 27225, -364077, -258969, -133583, -5271, -54461, -110271, 168978, -302869, -117547, -206906, -177381, -82311, -159911, -75090, -84438, -80441, 118237, -40777, 36552, -17720, 273321]
11721H5839l5282K11942F0237d5855p7710B81078A31170j30g822A9208L9484c5266
11708h9764n8655D64539a12356B5715Q8591E6546a39208L7302A10023J51224a70713
11696C2624a23541b2788A7490b1115B41410a91428g5038C238J9991f0151n2490
11685a12641p8212C7124B536N17417A04462k1814J99784b46826A63408a54373
11674A0881M81294A80633c5417A69463M583o7167k9431c32915N5780C9001b16294
11662g7300A99752P0390c17882g6877A46888c62014B82932j15694a91289A79965
11651A42037f1712g810k52045g0256L2540j2396p9418a439r3891A74555M2278
11640B16833a13125o5923L7020O3926C7786a8240E8909i8963B69969D4780B2051
$$ y = [85839, 50557, 262499, 60237, -45855, -123565, 281078, 131170, 131040, -7822, 19208, 58692, -35266, -89764, -148419, 464539, -112356, 25715, 114306, 56546, -139208, -101906, 110023, 261247, -170713, 32624, -123541, -22788, 17490, -21115, 241410, -191428, -75038, 3238, 23229, -60151, -112641, -190853, 37124, 2536, 519953, 104462, 82648, 282432, -246826, 163408, -154373, 10881, 492175, 180633, -35417, 169463, 174046, 106879, 77448, -332915, -277135, 39001, -216294, -77300, 199752, 270142, -317882, -76877, 146888, -362014, 282932, 167238, -191289, 179965, 142037, -61712, -7810, -259855, -70256, -37716, -50112, -129530, -1439, -95330, 174555, 216833, -113125, -179048, -142028, -78102, 37786, -18240, 58909, -98963, 269969, 44780, 22051]
11628A79274c8150C141a08423B00695E9534K17769b19919J8249n249a9282j57347
11617a76629B37461F2638k2411o175g1536K5704l97878f1363A01278N0355a75280
11605c06C4692J8873h0596C9941a23511D03580j47385A03495J9503D126K2978
11594B7104L07140j33502b54368B10508L1234c429H0298J16182E5362J67056f2323
11582F2263J97443b02660I7845r98A3207a28076b2093Q432l9940A16901e4453
11570B0975b93866c0601C3377L22638A48085g1607p9494b2961A91231K9925c9557
11558I5276l2293a1018A35320B1664J54279L1899o5008a22370p4153a2205D4468
11546B63790j16256E6331E060J05552N7636l8592e1366A23380b64971A2288f5586
$$ y = [179274, -38150, 3141, -108423, 200695, 59534, 277303, -219919, -201670, -206919, -19282, -176629, 237461, 62638, 40227, 34052, -71536, -45832, -443710, -61363, 101278, 151633, -175280, -306, 34692, 53565, -80596, 39941, -123511, 403580, 256195, 103495, 122998, 4126, 27104, 334244, 200742, -254368, 210508, 241742, -3429, 80298, 196480, 55362, 222418, -62323, 62263, 259706, -202660, 97845, 96847, 13207, -128076, -22093, -13661, -53601, 116901, -54453, 20975, -293866, -30601, 33377, 356015, 148085, -71607, -151101, -22961, 191231, 221156, -39557, 95276, 62983, -11018, 135320, 21664, 175943, 207842, 142834, -122370, -196523, -12205, 44468, 263790, 147534, 56331, 5060, 110612, 168248, 129656, -51366, 123380, -264971, 12288, -65586]
11534a7755j75845D61092f8779F0718J59610n7268a25845C59675F3968b4568A29067
11522c1051A90301D3916K4186b19457B18370c1953A22247a1688r0397A41921A2740
11510G5073h994k07235H4150L85752A64432f7069C4710J6623Q4461J82201F3104
11498A45560K19296a40571q3597D4789c36269A95727a61310a5099A75439A6018
11487A06912f9746A31035A4903J74209K48330l6392p6565J3564i921A40586C8293
11475E6491J03851B890K06686h6874p4099C31355r3814J6719G9433f5224B47611
11463A905a70278B26810A07553K1689A4441K14877a59858B81211G9149J93894
11453B73043A20955k0032Q6925C6399L14417c4127a3858A79455c2628p8747B15776
$$ y = [-17755, -193600, 461092, -68779, 60718, 220328, 163060, -125845, 359675, 63968, -24568, 129067, -31051, 190301, 43916, 68102, -219457, 218370, -31953, 122247, -11688, -102085, 141921, 12740, 75073, -8994, -216229, 84150, 469902, 164432, -67069, 34710, 51333, 135794, 317995, 63104, 145560, 364856, -140571, -224168, 44789, -336269, 195727, -161310, -15099, 175439, 16018, 106912, -69746, 131035, 14903, 189112, 437442, 401050, 324485, 338049, -9921, 140586, 38293, 56491, 160342, 2890, 209576, -86874, -160973, 331355, 237541, 254260, 79433, -65224, 247611, 1905, -170278, 226810, 107553, 129242, 14441, 229318, -159858, 281211, 79149, 273043, 120955, 100923, 187848, 36399, 350816, -34127, -13858, 179455, -32628, -111375, 215776]
11441A56539K98803k24464K3255a6687r5463o4026B23925b62832A11789g0324
11430b68723A33368a57222O8661A33837M2758l1166M896P4272q5316f0257j34698
11419a94955c1178A32495b26818p5971h349H9874l9970J36154e4947p1836b1273
11407A23306b47841N3315d9365n6436c7118A36699a09017M3105E5386e4283q5169
11396a39452J4000b8885p1245M4489k0643n9839j38271C49489j57046a86431c6991
11384B3449b3201j39186g8848L0453j47101G2232b63583B52494C8101O4722J6577
11373A19400n056K23037d3365F9823J7424c02611E2160a75401I9538J5445N8473
11362A73456a21929M580c5819j0214j30340C14615a54008j62385C6344L322L9317
$$ y = [156539, 455342, 230878, 254133, -16687, -112150, -176176, 223925, -262832, 111789, -70324, -268723, 133368, -157222, -88561, 133837, 176595, 145429, 150325, 224597, 139281, -60257, -194955, -31178, 132495, -226818, -302789, -8349, 89874, 49904, 186058, -54947, -126783, -21273, 123306, -247841, -194526, -49365, -105801, -37118, 136699, -109017, -65912, 55386, -54283, -139452, -125452, -28885, -100130, -55641, -76284, -136123, -274394, 349489, 192443, -186431, -36991, 23449, -23201, -162387, -78848, -48395, -195496, 72232, -263583, 252494, 38101, 102823, 119400, 114344, 337381, -43365, 69823, 87247, -302611, 52160, -175401, 99538, 114983, 173456, -121929, -117349, -35819, -46033, -176373, 314615, -154008, -316393, 36344, 39666, 78983]
11351G8983d1762r2233C0605J30991J00838g5636j28931a01350G55i6890A99443
11339A0562a53570B30688A3535a91399j91222D9797j9992a0130A51222b0034A1242
11327b01379d4567k1943k7422H0080K95481a46918F0214a52517C76184A2101a88
11315c87625g2936k69612b1736B34905d3185F3363J46398F8664d28706A01551
11304a65561f4287l06577J67146k00380a85085J3360J5723d6461A67803r435b25603
11292a55011d8009B70054A8043a61261b9333k33108j29623A06774m4629J19117
11282A81262j7536d0451j4241o950A54980f330j18680B21126H394M6363E481e51390
11269a59810O1617L1546j11779m349m8405D3942R9294c22090A25082a02939J5589
$$ y = [78983, -41762, -133995, 30605, 161596, 262434, -75636, -204567, -101350, 755, -96890, 199443, 10562, -153570, 230688, 13535, -191399, -382621, 49797, 29805, -10130, 151222, -20034, 11242, -201379, -44567, -66510, -93932, 80080, 375561, -146918, 60214, -152517, 376184, 12101, -188, -387625, -72936, -342548, -21736, 234905, -43185, 63363, 209761, 68664, -428706, 101551, -165561, -64287, -370864, -203718, -404098, -185085, -171725, -156002, -46461, 167803, 158368, -225603, -155011, -48009, 270054, 18043, -161261, -29333, -262441, -392064, 106774, 62145, 181262, 163726, -40451, -54692, -61642, 154980, -6330, -125010, 221126, 8394, 54757, 5481, -551390, -159810, -98193, -66647, -178426, -182775, -231180, 43942, 143236, -322090, 125082, -102939, -87350]
11258h7350I6541a02687M0775b197F4736M9961a60731G513N3601h3j95383j11738
11246c07204P5263E1061c65280A35835e3750B59375j15153a5278j329p4260A0556
11234C02372e3683l68642A33983o310e5851A61317d60500E2852M2944d90600a34761
11222D5835c10901a34309A96568c29456J57336A23739h9838B5603K3675e5959
11211C58555b01264n066A39415a56940l0407a3597G0957b45984d5259j1408o3438
11200a20105p4551k19040O9477e1105B37973m7594c08703a138C420c97665J82042
11189b15623b3411m0078J8053F174a75908P7800a8785A39933h9488J81j29696
11178b19003C66197i8365A31073d1485k31603F3405C608J2283B650b83056b1286
$$ y = [-87350, 96541, -102687, -61912, -2197, 64736, 114697, -160731, 7513, 61114, -83, -195466, -307204, -231941, 51061, -365280, 135835, -53750, 259375, 144222, -15278, -16607, -90867, 10556, 302372, -53683, -422325, 133983, 127673, -55851, 161317, -460500, 52852, 95796, -490600, -134761, 45835, -310901, -134309, 196568, -329456, -172120, 123739, -89838, 25603, 49278, -55959, 358555, -201264, -206330, 139415, -156940, -187347, -13597, 70957, -245984, -45259, -56667, -120105, -194656, -413696, -344219, -51105, 237973, 190379, -308703, -1138, 3420, -397665, -215623, -23411, -63489, -45436, 6174, -175908, -98108, -18785, 139933, -89488, -89307, -219003, 366197, -98365, 131073, -41485, -273088, 63405, 3608, 15891, 2650, -283056, -21286]
11166b95408A24685c09219O6214B29907r4769G819N9793b83750C1353K1259b0964
11154C5538a43566A85969c2001H4595i6834B75955g5666K051B47625b24291H7322
11142a05949E8059h224j35744N2070C36880A0441f4595m5730G5034a03598k9647
11131a33245e2795J2934A10327L19621a89785d7286I7546a01937C18011K322F8720
11119A22032C9309a0464D1347O5784N1308J01433B3577a0612B31210a16735d1313
11107A8813L46975C1869L9938N8609K06199d61609B43614h4048q6887A35117J26410
11096B61527K4909m8143L1083r4768K26088c9268G9116J88925j15466G5068R2191
11085A67259M2984R7669J33785m5826M936A75567F2457K12130a83515B025Q6036
$$ y = [-295408, 124685, -309219, -243005, 229907, 135138, 7819, 67612, -283750, 31353, 52612, -20964, 35538, -143566, 185969, -32001, 84595, -96834, 275955, -75666, -73615, 247625, -224291, 87322, -105949, 58059, -8224, -143968, -91898, 336880, 10441, -64595, -110325, 75034, -103598, -133245, -52795, -39861, 110327, 429948, -189785, -47286, 97546, -101937, 318011, 320333, 68720, 122032, 39309, -10464, 41347, 107131, 158439, 259872, 23577, -10612, 231210, -116735, -41313, 18813, 365788, 31869, 71807, 130416, 336615, -461609, 243614, -84048, -170935, 135117, 261527, 286436, 238293, 269376, 174608, 400696, -39268, 79116, 268041, 152575, 75068, 167259, 210243, 307912, 441697, 395871, 400807, 175567, 62457, 274587, -183515, 2025, 88061]
11074H8061K8478K25896j42675L57131K29691a7584B77858C1521M35157k14282
11064B52396C6750K77667j55921N18692k44133L8853J87203j45992M9279j85241
11054C77157P9821N17236J2283l17724J00580K16680r2672j44781P3362j12956
11044G08986J52864K45051j81467J34178p0393J39666l08079q3725J47081o8056
11034H16106K4839j77817M35410r6220q686k96508J28496m7060j9235K48967j55731
11023H52561j33107o5344K99528O8945l92314L35851l95097k20635Q34761m78295
11013G06854K07206o1557m14041L58037l63827L30465j36907q0337M42618J39487
11003A127998m33125J7140k09149l4718J82886L51087m88256M30508l18020K7841
$$ y = [88061, 116539, 342435, 199760, 556891, 786582, -17584, 277858, 31521, 466678, 252396, 36750, 314417, 158496, 677188, 433055, 471908, 659111, 513119, 562398, 377157, 456978, 974214, 986497, 668773, 769353, 986033, 893361, 748580, 821942, 708986, 861850, 1106901, 925434, 1059612, 989219, 1128885, 820806, 737081, 884162, 816106, 840945, 663128, 1098538, 1002318, 993632, 697124, 825620, 778560, 759325, 1008292, 852561, 719454, 654110, 953638, 1022583, 630269, 966120, 571023, 350388, 1185149, 706854, 914060, 852503, 438462, 796499, 432672, 763137, 626230, 545893, 988511, 1127998, 694873, 712013, 502864, 468146, 651032, 1002119, 513863, 944371, 626351, 654192]
10993F54192k71167K41332K38471K075j50999K30812J16711p1291m80234K95819
10983H05721J88276K18437k72955Q0512L6425J81725j76301M37306l89054M85337
10973A595429J8576J13444O78040o8220L80945M44504m76161L09801K89468n2641
10963C233185l29849j92204l18028m02031m27937J32480j91322k69785L2082L69657
10953A636248L11871k69676K4800k19697k0063N8477m93943k43085j65858o110
10943F12964A86380M51666B61190L6751K54J18536j68207A3181J88734A00642
10932A49275m5612d7424C86901A245L65125g4627q5440d8759H0826O7320o6337
10921H1809a49636a5119A85083d2824H4085c4071A17644J70082e1033p0454e4175
$$ y = [654192, 383025, 624357, 862828, 864903, 713904, 944716, 1061427, 990136, 509902, 805721, 993997, 1212434, 939479, 1019991, 1056416, 1238141, 1061840, 1499146, 1110092, 1595429, 1614005, 1727449, 2405489, 2337269, 2718214, 3162718, 2686557, 2996358, 3285826, 3233185, 2903336, 2711132, 2393104, 1991073, 1563136, 1695616, 1504294, 1234509, 1266591, 1636248, 1948119, 1678443, 1703243, 1483546, 1463483, 1521960, 1028017, 784932, 619074, 612964, 186380, 638046, 261190, 297941, 298195, 416731, 248524, 13181, 201915, 100642, 149275, 103663, -47424, 386901, 1245, 366370, -74627, -160067, -48759, 80826, 148146, 81809, -149636, -15119, 185083, -42824, 84085, -34071, 117644, 287726, -51033, -121487, -54175]
10909b47900B83034D7225L66663I6988M3669P3677O2356A6903a44470p9939B34519
10897D87508b4829C13139A32532a42387A04904b73930A3879a12556d1911k84441
10887c26352B32610G9364c38043a55318A58053h1827H9379c1547j35358J3916
10877a52989A18030g3237J7198E6287a33896k71984J50887C0131J38425J0511
10867A79067c56800G0443L0924J68156A4470a54875j36600J10588J8293J2196
10857a50398R735R462N0782j13170G4406N2716d0737B6637b80271B97893C5473
10845B2596e4940o1002p2376A71870l6495a22428J671G1512h6171K413G0038a37103
10832a79834A39721c19335h0900a3615A13112b23039A87812H5297e7391k86198
$$ y = [-247900, 283034, 47225, 413888, 96988, 140657, 214334, 276690, 16903, -144470, -224409, 234519, 487508, -24829, 313139, 132532, -142387, 104904, -273930, 13879, -112556, -41911, -326352, 232610, 79364, -338043, -155318, 158053, -81827, 89379, -31547, -166905, -152989, 118030, -73237, -56039, 56287, -133896, -405880, -254993, 30131, 168556, 179067, -356800, 70443, 101367, 269523, 14470, -154875, -291475, -180887, -162594, -150398, -140663, -131201, -80419, -193589, 74406, 127122, -40737, 26637, -280271, 297893, 35473, 22596, -54940, -115942, -188318, 171870, 135375, -122428, -120757, 71512, -86171, -83758, 70038, -137103, -179834, 139721, -319335, -80900, -13615, 113112, -223039, 187812, 85297, -57391, -343589]
10822c43589B7747b71909e6502k32040A56177a87402k32614f4533j55574g4886
10811b72667O8033a8231j18206j3861A7529a70118h0687F4092P4254D3327a51451
10799c1364C8302O4943J36036c040C7422A0833i3107R691p4410G2281O7195C8254
10786i7893j44103J05117C218i190k09684E1098b13321H2271i5240H0060b60699
10774a91504A0518a2426j37964B49054b31597i4654I7129g2688k00601N2915J292
10763b19082B51854a30221Q231e5915A09776M76986F5348L0983D3495b85745D3951
10751h0230m81186A97347l9402N8358b34415K245G5813P7627b37058M4653i5637
10739f3566q2541G9377f5384A67123A1029c03476J42921B13329I9860a58983A43592
$$ y = [-343589, 27747, -271909, -56502, -288542, 156177, -187402, -420016, -64533, -220107, -74886, -272667, -204634, -18231, -136437, -150298, 17529, -170118, -80687, 64092, 138346, 43327, -151451, -31364, 38302, 103245, 239281, -3040, 37422, 10833, -93107, -83416, -157826, 72281, 139476, 38254, -97893, -241996, -136879, 3218, -9190, -218874, 51098, -213321, 82271, -95240, 80060, -260699, -191504, 10518, -12426, -150390, 249054, -231597, -94654, 97129, -72688, -273289, -220374, -219082, 251854, -130221, -121990, -55915, 109776, 586762, 65348, 96331, 43495, -285745, 43951, -80230, -561416, 197347, 157945, 216303, -234415, -232170, 75813, 153440, -237058, -192405, -95637, -63566, -146107, 79377, -65384, 167123, 11029, -303476, -160555, 213329, 99860, -158983, 143592]
10727F72M2385R2250b43035m3870e0676o5369A35694a09953E3191J4664M8857
10716A16712j3292b31970b7855k3162A52498a75689q3163B73184a74202k3395
10706a97597C29443a08972G4453b86202c299l44034f5941j02948E7237J3454J8891
10695H9582b01885j3221B98262b9723p5651b7655l0242r2155C11792a02734A64013
10683a34960f3311J8754J3958j06442n9193F2993N9160a8131A1242K98722a19859
10671B9186j677K1780e3323J0061k79059c7031l5126J8354k69287O6622A0602
10659A05066m4398R9920o4582c11406A60686B7676J01173J20010G847J99286a97645
10647c5117L351j24519l31752a71345G7867j209b46394h009o8666A78248D1954
$$ y = [672, 43057, 135307, -243035, -286905, -50676, -116045, 135694, -109953, 53191, 67855, 116712, 103420, -231970, -27855, -51017, 152498, -175689, -258852, 273184, -174202, -197597, 329443, -108972, 74453, -286202, -3299, -347333, -65941, -168889, 57237, 70691, 89582, -201885, -215106, 298262, -29723, -105374, -27655, -57897, -150052, 311792, -102734, 164013, -134960, -63311, -44557, -30599, -137041, -196234, 62993, 122153, -18131, 11242, 309964, -119859, 29186, 27509, 49289, -53323, -43262, -322321, -37031, -72157, -53803, -323090, -256468, 10602, 105066, 60668, 160588, 96006, -311406, 160686, 27676, 128849, 248859, 7847, 207133, -197645, -35117, -31766, -156285, -488037, -171345, 77867, 76658, -246394, -8009, -76675, 178248, 41954]
10635A0839a47898f4801k537K9167o4771A60768b11131m3430J8564d5594B6201
10623B00329e6986K3612a6363n3837o4883j06135l9581B2961a18573D2867f7925
10611d25141A46431a10335A63450b84482B05613a85354k09013a5808j66433H6315
10600A88a29091k9693H6824c64246a78065d5218j50595A49189i2477M079k87276
10589c75674c751k92820P4653A86674b67371B82391A0688K8260K33328a15382
10578A49036F8919a71354A05120a82125J5374L7093L3626A24019J0673L8040E9524
10566b45974A39149c54817f6356A4462g5182b3975k13307k850p2863a31382j67219
10555b98601h0104c1236l3444j4245j57377B53319c54448J15375k4568G2923c9832
$$ y = [10839, -147898, -64801, -67338, -38171, -102942, 160768, -211131, -254561, -235997, -45594, 26201, 200329, -56986, -33374, -16363, -70200, -135083, -241218, -280799, 22961, -118573, 42867, -67925, -425141, 146431, -110335, 163450, -284482, 205613, -185354, -394367, -15808, -182241, 86315, 188, -129091, -158784, 86824, -364246, -178065, -45218, -195813, 149189, -92477, -88398, -375674, -3751, -296571, -221918, 186674, -267371, 282391, 10688, 38948, 272276, -115382, 149036, 68919, -171354, 105120, -182125, -166751, -129658, -96032, 124019, 134692, 172732, 59524, -245974, 139149, -354817, -66356, 14462, -75182, -23975, -237282, -240132, -312995, -131382, -298601, -80104, -31236, -64680, -78925, -236302, 253319, -354448, -239073, -263641, 72923, -39832]
10543E9235c8582r2377n704j3415j58983Q7523K2458j16704P8091b1131k33805
10532b54936d9978B18172d1060o3151F2233O0727d90k68B1443M8897d4011j90229
10520b34240R0050N3803c0316j7093n0822J3033m5327F3885h6253j93461K2154
10509b57560c4047A49868l8881d46656G1263j361c61245A05372h9768A14029a13892
10497c21631e4557A85499a06791l0326M8523K5136E6056J59710K06910a46991
10486h1850A45821J33516g871k73601B442N5688N5918P6345h2302B39150Q0767
10475C19917q2426N44820C85450A58735L09563A07980L78812q9665m9428f3080
10464a97354b0748m943j23831A74620h074k80937B61871C0784J661J0122b63024
$$ y = [59235, -38582, -130959, -136663, -150078, -309061, -221538, -199080, -315784, -237693, -21131, -254936, -49978, 218172, -41060, -104211, 62233, 122960, -490, -758, 21443, 70340, -44011, -234240, -144190, -90387, -30316, -47409, -98231, -85198, -130525, 63885, -86253, -279714, -257560, -34047, 149868, 110987, -446656, 71263, 69902, -361245, 105372, -89768, 114029, -113892, -321631, -54557, 185499, -106791, -137117, -88594, -63458, 56056, 215766, 422676, -146991, -81850, 145821, 279337, -7871, -281472, 2442, 58130, 114048, 190393, -82302, 239150, 319917, 237491, 782311, 385450, 158735, 468298, 107980, 486792, 397127, 347699, -63080, -197354, -20748, -25691, -149522, 174620, -8074, -289011, 261871, 30784, 32445, 42567, -263024]
10452C51501i3534D3127P2725b04667D1317g9990A139c0290B21299c04977R2842
10441b12135A86428f555A38402a43553K2640A39923a50691F6979K34030a17204
10430a80476A91242J29365a25506l2700C67406b8241r0727q5724m30508A24905
10419b80196a20631E1544k0062a14486D459K2885i3175K2302c3798j7212a1217
10407a57661A126b29789I7578a79552h6622K0653j92782a11301A24075L230b72088
10395G5266b60253b1390j61225B36764A149a56959b9114k23526d9439A46267a24977
10383A94650f6927c0589B71965M6862c3688F8576M9862K8971K86810K01858h6033
10371C33481J5839j43131R2551M6304K09526j69851N2885B08387M23527k63824
$$ y = [351501, -93534, 43127, 115852, -204667, 41317, -79990, 1139, -30290, 221299, -304977, -212135, 186428, -6555, 138402, -143553, -120913, 139923, -150691, 66979, 301009, -117204, -180476, 191242, 320607, -125506, -158206, 367406, -28241, -118968, -204692, -635200, 124905, -280196, -120631, 51544, 31482, -114486, 4459, 27344, -93175, -70873, -33798, -51010, -11217, -157661, 1126, -229789, 97578, -179552, -86622, -65969, -258751, -111301, 124075, 127305, -272088, 75266, -260253, -21390, -182615, 236764, 1149, -156959, -29114, -252640, -49439, 146267, -124977, 194650, -66927, -30589, 271965, 318827, -33688, 68576, 118438, 147409, 434219, 636077, -86033, 333481, 349320, 206189, 298740, 345044, 554570, 384719, 437604, 208387, 631914, 368090]
10361C68090J58019A64308L07883R4762B62914M4304J0047G789L99819E7593M96308
10350E53901k60035k409L98319J7207L2197C31434n5390n3088J9406A09085L83473
10339D92558n2524i4322A62001K10818G4055a64266a1796B17028K10722j99136
10329B28614p0368J31215B5786J89668r8594e3215D04513a76536D64637b8656
10318F1724L90445R791F7631J16925a28822B18455o1275B6296d0478I3976a04906
10306D49901A30701J8419a82356Q8050G516c39787A01755a54689g3171k30742
10296c03913B72520a82266B7630b93226f7143B53414j3676b73727D5520a36947
10285A21759E4368a37530i532m1508k4488p782b9275k21941f0438F3988a63818
$$ y = [368090, 526109, 164308, 472191, 566953, 262914, 307218, 317265, 7789, 407608, 57593, 553901, 293866, 291457, 689776, 706983, 739180, 331434, 276044, 222956, 242362, 109085, 492558, 440034, -94322, 162001, 372819, 74055, -164266, -11796, 217028, 427750, 228614, 158246, 289461, 25786, 215454, 116860, -53215, 404513, -176536, 464637, -28656, 61724, 452169, 461960, 67631, 184556, -128822, 218455, 157180, 26296, -40478, 93976, -104906, 449901, 130701, 149120, -182356, -94306, 7516, -339787, 101755, -154689, -73171, -303913, 272520, -182266, 27630, -293226, -67143, 253414, 239738, -273727, 45520, -136947, 121759, 54368, -137530, -9532, -51040, -75528, -83310, -29275, -251216, -60438, 63988, -163818]
10273a62551l039O7582M4838q5383e0672m1196A6766a71209n5691C9103L79472
10262D18575E233J37491p0606a58515L1239j47656G7036a52664B942K78236E4125
10250D04589A13684J8208Q7468g4241j1211B37313C8374J02764J86751b89270
10239B84594I3403q935d5687D18414g0654K9160I1398a34810f274p8399k73386
10228c58059m1900h1917A2195L4894g9543r7233B86502a81744m4210A42677h2060
10216A55774K8085a33479j65760g0181r2268L5580l3504A46711a53029A20449
10205B9488K63475a1876j63546O2160j17464f5458l15428J44365F5165a44063
10194A79821l388m9659i3865j42230C82968C7312j8242c98914A16515N6432a79442
$$ y = [-162551, -165590, -98008, -53170, -138553, -50672, -91868, 16766, -171209, -226900, 39103, 418575, 5233, 142724, 72118, -158515, -127276, -274932, 77036, -152664, 2942, 281178, 54125, 404589, 113684, 131892, 219360, -74241, -85452, 237313, 38374, 141138, 327889, -289270, 284594, 93403, 84468, -45687, 418414, -70654, -41494, 91398, -134810, -6274, -84673, -358059, -399959, -81917, 12195, 47089, -79543, -176776, 286502, -181744, -225954, 142677, -82060, 155774, 183859, -133479, -299239, -70181, -162449, -126869, -160373, 146711, -153029, 120449, 29488, 292963, -11876, -175422, -113262, -230726, -65458, -380886, -236521, 65165, -144063, 179821, 176433, 126774, -93865, -236095, 382968, 37312, 19070, -398914, 116515, 172947, -179442]
10182A41439K38826f6597A56120j4337n0615a92799p5954I3503J23785D0275b46523
10170A99248q1083c094j22542M6992G0408F040Q8421b49035e1113K577j53600
10159b02136D6877c84877c8413G9294N0795b5231l39005j5658h6878q5201G3588
10147a87469d6953j93742A32667C3657e146G3029e8162k9318j75526R3183E2997
10135b9282j8374k19459E8530a560l99895A42804b05790B4765c8281k70892B28533
10123a71175k40698g0638b5337j96375p0550D744K01237b65087N3065f5981A66875
10111B0468a88918b0396B41347d81696h8853M2761B7765d0643A52417A2053c17302
10099b6470j88853E1468J93887c03183a21606C1395c78899a51349D3115a7858
$$ y = [141439, 380265, -66597, 156120, 141783, 91168, -192799, -268753, 93503, 217288, 40275, -246523, 199248, 118165, -3094, -125636, -78644, 70408, 6040, 94461, -249035, -51113, -48536, -202136, 46877, -384877, -38413, 79294, 130089, -25231, -364236, -379894, -86878, -172079, 73588, -187469, -46953, -240695, 132667, 33657, -5146, 73029, -58162, -87480, -263006, -169823, 52997, -29282, -47656, -267115, 58530, -1560, -401455, 142804, -205790, 24765, -38281, -309173, 228533, -171175, -411873, -70638, -25337, -221712, -292262, 4744, 205981, -265087, -212022, -65981, 166875, 20468, -188918, -20396, 241347, -481696, -88853, -46092, 27765, -40643, 152417, 12053, -317302, -26470, -215323, 51468, 245355, -303183, -121606, 31395, -378899, -151349, 43115, -17858]
10088c4230E1659L44805d12257a44557j59163B2686J52221c71490J04250g5162
10077b13319A47305l337E3356Q052b74398e9614K7842j02136G0518a53563A83910
10065b94034J39254d2527l75951B1888J63844N2317a31357A44752A2449K12353
10055B24802a32030A00045N2888a16105j22131j66105A37022L949J9966a63234
10044e6154K7512A93468a97250G6269h4200a1562A2866b14040O8257j33949A06130
10032a13230n5405F7524Q1153b81107A65859b7594j01138e4110H7052K20146c98348
10020e9037k7003a7440n6567k14635a353A14608f5426A7851Q2940a65791O9593
10009i6198j19035F8985J7524L7224b94014B45537I2440j2625e39842h5147j23093
$$ y = [-34230, 51659, 396464, -412257, -144557, -303720, 22686, 174907, -371490, -267240, -75162, -213319, 147305, 143968, 53356, 61408, -274398, -59614, -31772, -133908, 70518, -153563, 183910, -294034, -154780, -42527, -418478, 21888, 185732, 238049, -131357, 144752, 12449, 224802, -132030, 100045, 152933, -116105, -238236, -404341, 137022, 140971, 160937, -163234, -56154, -28642, 193468, -197250, 76269, -84200, -11562, 12866, -214040, -145783, -279732, 106130, -113230, -168635, 67524, 148677, -281107, 165859, -27594, -128732, -54110, 87052, 307198, -398348, -59037, -86040, -17440, -74007, -288642, -1353, 114608, -65426, 17851, 100791, -165791, -96198, -215233, 68985, 86509, 123733, -294014, 245537, 92440, 79815, -539842, -85147, -208240]
9998b08240j11373A0230a82772A28K62059c4771I237J45692j8767a40454r2225
9987b32679I1233b31839f5888q8785f7880m7512K4249B0892J68330b71273J9515
9976b51758j897A54062m0243m7359R137f6949k52621A86693j5351a88145N4681
9965a33464j10569a08380B41074E4704j1233e0234j47902r4565e9297B2104K65318
9954B87422j14921A9784i8095K638A90227A7501K00913d06313a50604j25158B4267
9942d79319B01380a24022l7669C39041D0474h3706A15348B2934P9166a485r9153
9931a00638A8839Q4074b83832G1630p318b13594l44636G7932B163K40297i365
9919c25540f2255j5440k87460C4563a25683j92012E6665b59293G8090d07067a48270
$$ y = [-208240, -319613, 10230, -182772, 128, 262187, -34771, 9237, 154929, 136162, -140454, -232679, 91233, -231839, -65888, -154673, -67880, -115392, -91143, 20892, 189222, -271273, -251758, -253655, 154062, 113819, 66460, 75597, -66949, -319570, 186693, 171342, -188145, -133464, -244033, -108380, 241074, 54704, 43471, -50234, -198136, -292701, -59297, 22104, 287422, 172501, 19784, -98095, -95457, 190227, 17501, 218414, -406313, -150604, -275762, 24267, -479319, 201380, -124022, -161691, 339041, 40474, -83706, 115348, 22934, 102100, -1485, -100638, 18839, 102913, -283832, 71630, 64312, -213594, -558230, 77932, 2163, 242460, -9365, -325540, -62255, -77695, -365155, 34563, -125683, -317695, 56665, -259293, 78090, -407067, -148270]
9907A25955a69966f8883p6988N3017F9814c63512H7188J69264a32444q2584g744
9895B63963a66128G5998a37706j6941l8082j55882a22110A64325C9992c24776
9884b08789b890G982M1999L7287a53482k18096b9672j38146P7205A54401d42649
9872B82267A32041b81327o4116Q439B29253d43911e2605a6725j41820A85302h8867
9860G8072A7290b71126d0982m0949B6210a53274q9941J13259N7531q0248A86841
9848h1730A93976f6506b9606k37059L4424I9323l1299O0042L6011d00581F3700
9836a87792M0842j34150J5834h167B1027M3110b4842m19628C887b07821d6624
9824c22928N6081J21414j32923i4636q1216j1074e9612A18122c6805q6359A64689
$$ y = [125955, -169966, -68883, -145871, -92854, 69814, -363512, 87188, 256452, -132444, -215028, -7744, 263963, -166128, 75998, -137706, -154647, -192729, -348611, -122110, 164325, 39992, -324776, -208789, -2890, 7982, 49981, 87268, -153482, -371578, -29672, -167818, -90613, 154401, -442649, 282267, 132041, -281327, -345443, -337004, 229253, -443911, -52605, -16725, -158545, 185302, -88867, 78072, 17290, -271126, -40982, -81931, 26210, -153274, -243215, -129956, -72425, -152673, 186841, -81730, 193976, -66506, -29606, -266665, -232241, 99323, 68024, 128066, 164077, -400581, 63700, -187792, -146950, -281100, -265266, -8167, 21027, 64137, -24842, -444470, 3887, -207821, -46624, -322928, -266847, -145433, -278356, -94636, -175852, -186926, -59612, 118122, -36805, -123164, 164689]
9812B30731C9697e2007A65108d5281g766j50420k29150a64941a7848j90385c416
9800a31726A29762b04006j1504e8832G8776c2621A55783d54381b01291j75541
9790c76832C19688k9726b35479L1466A04616a81808d811A4152c63221H5713a04342
9778B92832c30693P5797G3350a1091l87436C8514K01370i7554F0462K63955j09685
9767B14732b31858j53614B02616e73006A38647b56616c1038A05220f6913k22622
9757b89535A79403n308K3287e4019m4725r7489C5180c97186b1313o1853k27464
9746c10630J23406B45733q9645A2512b49291A73078b23255C9914K21989b72734
9735h7504a3192j45057j97276g9396j89092c5389A08711A8783h3216k88379b0973
$$ y = [230731, 39697, -52007, 165108, -45281, -7766, -158186, -387336, -164941, -17848, -208233, -3416, -131726, 129762, -204006, -215510, -58832, 78776, -32621, 155783, -454381, -201291, -376832, 319688, 289962, -235479, -204013, 104616, -181808, -4811, 14152, -363221, 85713, -104342, 292832, -330693, -254896, 73350, -11091, -398527, 38514, 239884, -97554, 60462, 324417, 214732, -231858, -385472, 202616, -573006, 138647, -256616, -31038, 105220, -66913, -289535, 179403, 174095, 197382, -54019, -98744, -196233, 35180, -397186, -21313, -83166, -310630, -187224, 245733, 156088, 12512, -249291, 173078, -223255, 39914, 261903, -272734, -87504, -13192, -158249, -355525, -79396, -268488, -35389, 108711, 18783, -83216, -371595, -20973]
9723B9446e1312e72D263g140l03903D3590f3963j39310j77123C57152j38399g5756
9710f6327N743C0366a34338o2591F1711D151K8428A436K65476o6919P6145a12320
9697b6279A88511a73640A71861p9644O6104n7424a38261o9914B52229A05019b91354
9685a27494M1716B9545L6093J22264a32765E8719b81199a14386j63480A48709
9674a7523A68953E2995d89313b34758j32729A36195a03469j88666g3993j51926
9664b25919a09046I416a96678n5333P1259e3849j34158j5449A24001n1608J27317
9653A99710p3249b9728l7672F9910K8860a92249L2617N5280G8201d8435q3216
9642a31651I5706a80919P7420A56306a77262A11746a32648r2423b4091l6189k44157
$$ y = [29446, -51312, -572, 4263, -7140, -311043, 43590, -63963, -203273, -380396, 357152, 218753, -75756, -66327, -60584, 30366, -134338, -196929, 61711, 4151, 32579, 1436, 266912, 199993, 276138, -112320, -26279, 188511, -173640, 171861, 92217, 158321, 100897, -138261, -208175, 252229, 105019, -291354, -127494, -85778, 29545, 65638, 187902, -132765, 58719, -281199, -114386, -277866, 148709, -17523, 168953, 52995, -489313, -234758, -367487, 136195, -103469, -292135, -73993, -225919, -109046, 9416, -196678, -252011, -180752, -53849, -188007, -203456, 124001, 72393, 199710, 126461, -29728, -67400, 69910, 98770, -192249, -159632, -104352, 78201, -48435, -131651, 95706, -180919, -103499, 156306, -177262, 111746, -132648, -225071, -24091, -60280, -304437]
9631c04437J37886A43547b16970h4413D5954c93355a16784j65696O7729j53989
9621c68740i4019m19610K35040B07419G4574P8145J05042a95458d1253j93285
9611b34538k2031B9246a91421j50173A45854f5443j34238F1291b00578B57187
9600B07848b06679j5918D0674c95201J48343J962A89095J7983a08884l6996p0689
9589b16569G5310J38820D2188b87266P2214d3934k32724A86073l8653b6438j71297
9578a97735A0746b02836f0843j88473A51530a46168q2797j31663C89734b53173
9567b8114M302k03593R7164r5038A242b43304c4356B08566a18079E6444j6639
9556C9805c37533h8477B56959e2109j59009N5397k1259C04283f3950L0907A05264
$$ y = [-304437, -166551, 143547, -216970, -84413, 45954, -393355, -116784, -282480, -214751, -368740, -94019, -513629, -278589, 207419, 74574, 152719, 257761, -195458, -41253, -234538, -256569, 29246, -191421, -341594, 145854, -65443, -199681, 61291, -200578, 257187, 207848, -206679, -222597, 40674, -395201, -246858, -244896, 189095, 207078, -108884, -145880, -216569, 75310, 214130, 42188, -287266, -215052, -43934, -276658, 186073, 147420, -26438, -197735, 10746, -202836, -60843, -249316, 151530, -146168, -228965, -360628, 389734, -253173, -28114, -23812, -227405, -130241, -225279, 1242, -243304, -34356, 208566, -118079, 56444, 39805, -337533, -88477, 256959, -52109, -211118, -155721, -176980, 304283, -63950, -33043, 105264]
9544c80478a08462n5118a3734j13255C6163f18613B47990a53541j4605F8402a271
9532F6237e9156j52606a05570o9541p2468E6009d09824A31034A7608J0500K26812
9521B54920a50574A27051j2523b39078l6683j59680K04175C1204J5423P3825c25432
9509F4680a42420o5670F0566b77227B00290b4706k31212e1951H3991P980m4650
9498D7321c04327a51680l44j5393f3034j6501A18889D1656a9501j90825B6475
9486D3383c80021F7100k0135c25460a15433L0544q8430k41027F4566B6502d13907
9474c3807F3703a09462k36239a2456A65647b08061f1993I7129l4583b52119f0714
9462b08553C08422b42006M7427H2767N9581F5239a60065j3795l3444L0277g8124
$$ y = [-380478, -108462, -163580, -13734, -126989, 36163, -618613, 247990, -153541, -168146, 68402, -1271, 66237, -59156, -211762, -105570, -175111, -247579, 56009, -409824, 131034, 17608, 28108, 254920, -150574, 127051, 114528, -239078, -275761, -435441, -231266, 31204, 46627, 120452, -325432, 64680, -142420, -208090, 60566, -277227, 200290, -24706, -255918, -51951, 83991, 91971, 47321, -304327, -151680, -152024, -167417, -63034, -79535, 118889, 41656, -19501, -210326, 26475, 43383, -380021, 67100, 46965, -325460, -115433, -84889, -173319, -414346, 64566, 26502, -413907, -33807, 63703, -109462, -345701, -12456, 165647, -208061, -61993, 97129, 62546, -252119, -60714, -208553, 308422, -242006, -194579, 82767, 142348, 65239, -160065, -173860, -207304, -177027, -78124]
9450a29870E4902J26560a66312B56082b29579k7143A8994J7125b07412j16560
9440c23972a13512F3256k2204b85327A52389m5493h5316j01610o51d4387k29523
9429b73910K3595p2416A3983L27668a67198H5126J82922J21194a92134A84473
9418A49939b60527A20265C6249a81149A37522b12427c4429k74584a27761K622
9408a25139H3530c2024A7634J41628c28562f3975J0968G2470a41748J5489r7259
9397b23518h6414k13941m4781B5666b02324b8896A01633a39213A01706b13763
9386F2115g164k65284H6807b6851j17490A48076c00028c6600E5919c02700J5291
9375b87409B43696E8320a58835q0412j3747C55730b44889B15453e08918b07395
$$ y = [-129870, 54902, 181462, -166312, 256082, -229579, -256722, 18994, 36119, -207412, -323972, -113512, 63256, 41052, -285327, 152389, 106896, -85316, -186926, -187577, -44387, -273910, -250315, -322731, 13983, 341651, -167198, 85126, 268048, 389242, -192134, 184473, 149939, -260527, 120265, 36249, -181149, 137522, -212427, -34429, -309013, -127761, -125139, 83530, -32024, 17634, 159262, -328562, -63975, -53007, 72470, -141748, -126259, -223518, -86414, -300355, -345136, 25666, -202324, -28896, 101633, -139213, 101706, -213763, 62115, -7164, -272448, 86807, -26851, -144341, 148076, -300028, -36600, 55919, -302700, -287409, 243696, 58320, -158835, -239247, -252994, 355730, -244889, 215453, -508918, -207395]
9364A21564h0026B40157c04073e83B49646a04884b9165l65733I9257a67142p1384
9353b38526f7661L2451C4738K69568a96596O7330O2114A72585g6764I8895b23301
9341a86625J9186e7129G5638J29815m1960h6073j56461a08246A58830c3398p4263
9330a07661N3073I9958a77139j54719k0835d4863P530g140k07945A24166c67964
9318b46229d5743B2022K9639K4403c14437e3648I9195J5994a80501d8018l9041
9307h7059n7953D3240a49845A3527b41443M3j70320f3898D8616j4610M1083b19341
9294C19140c15058F192M0212A154a34673M3593j00738B60599I3861d86324C8252
9282a72689J312G4650a58147g5450l65833i897k94403c5103o1284P077D903J40672
$$ y = [121564, -80026, 240157, -304073, -583, 249646, -104884, -29165, -394898, 99257, -167142, -238526, -67661, -35210, 34738, 304306, -196596, -129266, -67152, 172585, -76764, 98895, -223301, -186625, -167439, -57129, 75638, 205453, 163493, -86073, -242534, -108246, 158830, -33398, -107661, -54588, 99958, -177139, -331858, -352693, -44863, -37333, -7140, -215085, 124166, -367964, -246229, -45743, 22022, 51661, 76064, -314437, -53648, 99195, 115189, -180501, -48018, -87059, -145012, 43240, -149845, 13527, -241443, -241400, -411720, -63898, 48616, 34006, 75089, -219341, 319140, -315058, 6192, 46404, 1154, -134673, -91080, -191818, 260599, 93861, -486324, 38252, -172689, -171377, 74650, -158147, -75450, -441283, -9897, -304300, -35103, -96387, -89310, 4903, 145575]
9270A45575b57871c7500l05861I7059B2685b37441J17648d8223j29019d9384B60009
9258a89689b4042o8523L520A47759a61025B86812i2719n8706N4385j26326j06412
9247c29778F4436a48091A26025a03938k2647a1746j42210j77007J46420O7893
9237a16650J520j95239A8137c23024J2265a36265k32129a74723D27164b31636
9226B2715b26515L6090O5302j20009b0695l169p7333A6533M5272b9874C9115M6748
9214H5863m0026c23282a8761j59475G8679N4936a9244A59787A3743N5121O3538
9203A32402d7728l04193a65777j10633a18927M461A22330J70881a47529M1821
9193a05708D8871N2739c11746A42579c39408c7038k85188h0620A00901M5602a20168
$$ y = [145575, -257871, -37500, -343361, 97059, 22685, -237441, -119793, -48223, -177242, -49384, 260009, -189689, -24042, -92565, -89045, 147759, -161025, 286812, -92719, -151425, -97040, -223366, -329778, 64436, -148091, 126025, -103938, -126585, -11746, -153956, -330963, -184543, -116650, -115130, -310369, 18137, -323024, -310759, -136265, -368394, -174723, 427164, -231636, 22715, -226515, -190425, -125123, -245132, -20695, -23864, -101197, 16533, 61805, -29874, 39115, 85863, 45837, -323282, -18761, -178236, 78679, 133615, -19244, 159787, 13743, 68864, 132402, -47728, -351921, -165777, -276410, -118927, -114466, 122330, 293211, -147529, -105708, 48871, 101610, -311746, 142579, -339408, -37038, -322226, -80620, 100901, 146503, -120168]
9181a8425l95498a00199B09464a08250j24098A58255e54769b62929C53851g827
9170B67916D4391b59134L7001J09799o3816F2086a32598e5289B40031a17580k4177
9159a41757B72114a91471N0820G2565a46600B9941c12770d7233n0152l13455A38727
9147a81565O1787j1151f0500j61267A69180q4097a84451A2399b72841g6919a8943
9135H6663c77865a67187C15704D8530b66078A22838b926j98285G7903c3567m3884
9124g7451n3274l04590B88792b41961F5595O4079c4003j28629b6400f691j2375
9113a9066j14709k20164K6094D89555b6127k81807A26353L613d83422d4880j3529
9102e8409a33j2859A38560l0124d028j95196g3300R682A463b4345A73267a80080
$$ y = [-18425, -413923, -100199, 209464, -108250, -232348, 158255, -554769, -262929, 353851, -7827, 267916, 44391, -259134, -222133, -112334, -176150, 62086, -132598, -55289, 240031, -117580, -141757, 272114, -191471, -140651, 72565, -146600, 29941, -312770, -47233, -97385, -410840, 138727, -181565, -119778, -130929, -60500, -221767, 169180, 85083, -184451, 12399, -272841, -76919, -18943, 86663, -377865, -167187, 315704, 48530, -266078, 122838, -2926, -201211, 77903, -33567, -77451, -130725, -435315, 288792, -241961, 65595, 129674, -34003, -162632, -26400, -6691, -19066, -133775, -353939, -327845, 489555, -26127, -307934, 126353, 129966, -483422, -44880, -58409, -133, -12992, 138560, 108436, -4028, -199224, -73300, -63618, 1463, -24345, 173267, -180080]
9089D07974c03413B1156Q8337b15980C37350d3774A01f5601P749j65633c6571
9077B04017A6275c19171A6860b56372O7927A35363d2850A77512d53724h2045A72791
9065a20275j62173B37107Q4974a57470G5935a1723j82359A70036D9171a87084
9054b09390c3327B41893a00114d5452j20883P9983o0578A6897R1053a1914l11977
9043c23891a29342b8545h142B1794J46708c27615d3289A9703b02252M0993f8291
9031A3296a02535j32463a5451A18048B7629K547J12267f4021k10293n3971e4330
9019B06029a84028j05678A55895c06675B13249b48389L0436B20433R0460F9600
9008B8832c0810k73498i0599g474p4566A32531c71460d2571A87127a78700g3478
$$ y = [407974, -303413, 21156, 109493, -215980, 337350, -43774, 101, -65601, -57852, -223485, -36571, 204017, 16275, -319171, 16860, -256372, -188445, 135363, -42850, 177512, -453724, -82045, 172791, -120275, -282448, 237107, 322081, -157470, 75935, -11723, -194082, 170036, 49171, -187084, -209390, -33327, 241893, -100114, -45452, -166335, -86352, -146930, 16897, 107950, -11914, -323891, -129342, -28545, -8142, 21794, 168502, -327615, -43289, 19703, -202252, -161259, -68291, 13296, -102535, -234998, -15451, 118048, 27629, 30176, 142443, -64021, -274314, -328285, -54330, 206029, -184028, -289706, 155895, -306675, 213249, -248389, -217953, 220433, 310893, 69600, 28832, -30810, -304308, -90599, -7474, -82040, 132531, -371460, -42571, 187127, -178700, -73478]
8996a27604B07011A9076K4983N7702a41842k9284j17801m1511O7648j2731a21792
8984a74021a5887j53820o41J8673M4906D7445e1514F356a5573A89824a26819B5524
8971B65655j26551m5320a38276k3804q6459J14072l31861d3856B24535G6148e33
8959b14166D2274e3183j84968N6677C1213J08153B3795Q1847b23859B9426G818
8947A01834j6020L70404b28244a13706k1406G7519a01681k98169J34250j15268
8937c80868a43525j84901A96900J08859a75940F13281A30282o2509b52964D4569
8926a71279d1978D7688J45106L58650M84226J60240K779820J5867053F884832
8916A296513D49204J90021e2187B42660a87349B2909a72052A32894i4244j88925
$$ y = [-127604, 207011, 19076, 44059, 101761, -141842, -171126, -288927, -330438, -262790, -275521, -121792, -174021, -15887, -169707, -170348, -151675, -106769, 47445, -51514, 6356, -15573, 189824, -126819, 25524, 265655, 139104, 93784, -138276, -162080, -248539, -134467, -466328, -43856, 224535, 76148, -533, -214166, 42274, -53183, -238151, -181474, 31213, 139366, 23795, 105642, -223859, 29426, 7818, 101834, 85814, 456218, -228244, -113706, -135112, 77519, -101681, -399850, -265600, -380868, -143525, -328426, 196900, 305759, -175940, 613281, 130282, 67773, -252964, 44569, -171279, -41978, 47688, 192794, 551444, 1035670, 1195910, 3975730, 19842783, 6884832, 1296513, 449204, 639225, -52187, 242660, -187349, 22909, -172052, 132894, -94244, -283169]
8906b83169B14583L26321h1932M956o0427A98611F010e66737b09498A95153g082
8894a02872n7949A77250a15262F1367g5524E2289N1426A8469Q5322a18179A86812
8882e02470B46665a04885a6613j79208A13530R2992l0574d2673j87112a01819
8871d94035d0113k3284r8050C0748a72464E282K22621J05669j6947f2552k42333
8860c04885N7179K8052A08730a31067f5131m2445B45098b31876B0423L53757b09346
$$ y = [-283169, 214583, 540904, -81932, -76976, -137403, 198611, 6010, -566737, -209498, 195153, -7082, -102872, -160821, 177250, -115262, 61367, -75524, 52289, 103715, 18469, 103791, -118179, 186812, -502470, 246665, -104885, -16613, -195821, 113530, 206522, 175948, -42673, -229785, -101819, -494035, -40113, -63397, -161447, 30748, -172464, 5282, 227903, 333572, 316625, -62552, -304885, -247706, -219654, 108730, -131067, -65131, -107576, 245098, -231876, 20423, 374180, -209346]
$$ [...]
##END NTUPLES=NMR SPECTRUM
##END=
