
##TITLE=AC1289_SALAH11099_6615578_FZIyRlrXwm
##JCAMPDX= 6.0         $$ Bruker NMR JCAMP-DX V2.0
##DATA TYPE= NMR SPECTRUM
##DATA CLASS= NTUPLES
##ORIGIN= BRUKER
##OWNER= Administrator
$$ 1.72 TOPSPIN		Version 2.1
$$ 2012-08-02 21:36:31.640 -0500  Administrator@TOPSPIN
$$ Compression mode = diff/dup
##.OBSERVE FREQUENCY= 400.02188249412
##.OBSERVE NUCLEUS= ^1H
##.ACQUISITION MODE= SIMULTANEOUS (DQD)
##.ACQUISITION SCHEME= undefined
##.AVERAGES= 8
##.DIGITISER RES= 22
##SPECTROMETER/DATA SYSTEM= spect
##.PULSE SEQUENCE= zg30
##.SOLVENT NAME= COFFEE_meoh
##.SHIFT REFERENCE= INTERNAL, COFFEE_meoh, 1, 14.98509
##AUDIT TRAIL= $$ (NUMBER, WHEN, WHO, WHERE, PROCESS, VERSION, WHAT)
$$ ##TITLE= Audit trail, TOPSPIN		Version 2.1
$$ ##JCAMPDX= 5.01
$$ ##ORIGIN= Bruker BioSpin GmbH
$$ ##OWNER= Administrator
$$ $$ C:\Bruker\TOPSPIN/data/COFFEE/nmr/AC1289_SALAH11099_6615578_FZIyRlrXwm/10/pdata/1/auditp.txt
$$ ##AUDIT TRAIL=  $$ (NUMBER, WHEN, WHO, WHERE, PROCESS, VERSION, WHAT)
(   1,<2012-08-02 21:36:24.937 -0500>,<Administrator>,<TOPSPIN>,<go>,<TOPSPIN 2.1>,
      <created by zg
	started at 2012-08-02 21:35:18.500 -0500,
	POWCHK enabled, PULCHK disabled,
       configuration hash MD5:
       6B 1B 68 BB D9 2E 58 E2 7F 35 AD 54 07 DF 0E 41
       data hash MD5: 64K
       4F 34 51 68 02 0B F2 47 4A 68 2D C2 14 9B B0 2F>)
(   2,<2012-08-02 21:36:27.562 -0500>,<Administrator>,<TOPSPIN>,<proc1d>,<TOPSPIN 2.1>,
      <Start of raw data processing
       efp LB = 0 FT_mod = 6 PKNL = 1 PHC0 = 0 PHC1 = 0 SI = 32K 
       data hash MD5: 32K
       50 AB DA 49 92 1B 72 E9 2A 21 BF 20 8E B0 24 19>)
(   3,<2012-08-02 21:36:27.953 -0500>,<Administrator>,<TOPSPIN>,<proc1d>,<TOPSPIN 2.1>,
      <pk PHC0 = 180.6812 PHC1 = 0 
       data hash MD5: 32K
       90 06 C7 76 E2 F9 21 0E F6 01 DB 7C 86 47 DA 45>)
(   4,<2012-08-02 21:36:28.046 -0500>,<Administrator>,<TOPSPIN>,<proc1d>,<TOPSPIN 2.1>,
      <abs ABSG = 1 
       data hash MD5: 32K
       5E 7B D0 95 20 7F DC 71 3C 89 C4 A9 B9 AA 0B 9B>)
(   5,<2012-08-02 21:36:28.078 -0500>,<Administrator>,<TOPSPIN>,<proc1d>,<TOPSPIN 2.1>,
      <abs ABSG = 2 
       data hash MD5: 32K
       A4 1F 7D 4F A9 D1 C7 13 8E 08 0C B4 83 D8 46 6C>)
(   6,<2012-08-02 21:36:28.109 -0500>,<Administrator>,<TOPSPIN>,<proc1d>,<TOPSPIN 2.1>,
      <abs ABSG = 3 
       data hash MD5: 32K
       E7 34 B6 DF 4D 5E CE CF 86 B4 A6 FE 25 B0 33 38>)
(   7,<2012-08-02 21:36:28.140 -0500>,<Administrator>,<TOPSPIN>,<proc1d>,<TOPSPIN 2.1>,
      <abs ABSG = 4 
       data hash MD5: 32K
       B4 35 05 92 53 F5 CB B3 C8 F8 B3 65 63 A6 6A 8A>)
(   8,<2012-08-02 21:36:28.171 -0500>,<Administrator>,<TOPSPIN>,<proc1d>,<TOPSPIN 2.1>,
      <abs ABSG = 5 
       data hash MD5: 32K
       74 B6 B1 4B F7 1B 97 F0 BD 0C E8 8B 27 22 DE AD>)
$$ ##END=
$$ 
$$ $$ hash MD5
$$ $$ 0D 6B BF BB 6C 0F 5A 87 C5 84 A0 E6 60 0A 5C 5D
##$RELAX= 
##$RELAX= 
##$RELAX= 
##$RELAX= 
##$RELAX= 
##$RELAX= 
##$RELAX= 
$$ Bruker specific parameters
$$ --------------------------
$$ [...]
##$TP= (0..7)
150 150 150 150 150 150 150 150
##$TP07= 0
##$TPNAME0= <>
##$TPNAME1= <>
##$TPNAME2= <>
##$TPNAME3= <>
##$TPNAME4= <>
##$TPNAME5= <>
##$TPNAME6= <>
##$TPNAME7= <>
##$TPOAL= (0..7)
0.5 0.5 0.5 0.5 0.5 0.5 0.5 0.5
##$TPOFFS= (0..7)
0 0 0 0 0 0 0 0
##$TUNHIN= 0
##$TUNHOUT= 0
##$TUNXOUT= 0
##$USERA1= <user>
##$USERA2= <user>
##$USERA3= <user>
##$USERA4= <user>
##$USERA5= <user>
##$V9= 5
##$VALIST= <valist>
##$VCLIST= <CCCCCCCCCCCCCCC>
##$VD= 0
##$VDLIST= <DDDDDDDDDDDDDDD>
##$VPLIST= <PPPPPPPPPPPPPPP>
##$VTLIST= <TTTTTTTTTTTTTTT>
##$WBST= 1024
##$WBSW= 4
##$XGAIN= (0..3)
0 0 0 0
##$XL= 0
##$YL= 0
##$YMAX_a= 482895
##$YMIN_a= -633342
##$ZGOPTNS= <>
##$ZL1= 120
##$ZL2= 120
##$ZL3= 120
##$ZL4= 120
##$ABSF1= 14.98509
##$ABSF2= -5.573092
##$ABSG= 5
##$ABSL= 3
##$ALPHA= 0
##$AQORDER= 0
##$ASSFAC= 0
##$ASSFACI= 0
##$ASSFACX= 0
##$ASSWID= 0
##$AUNMP= <proc_prof1d_extract_pilot.lims>
##$AXLEFT= 0
##$AXNAME= <>
##$AXNUC= <1H>
##$AXRIGHT= 0
##$AXTYPE= 0
##$AXUNIT= <>
##$AZFE= 0.1
##$AZFW= 0.1
##$BCFW= 0
##$BC_mod= 0
##$BYTORDP= 0
##$COROFFS= 0
##$CY= 15
##$DATMOD= 1
##$DC= 0
##$DFILT= <>
##$DTYPP= 0
##$F1P= 0
##$F2P= 0
##$FCOR= 0.5
##$FTSIZE= 32768
##$FT_mod= 6
##$GAMMA= 0
##$GB= 0
##$INTBC= 1
##$INTSCL= 1
##$ISEN= 128
##$LB= 0
##$LEV0= 0
##$LPBIN= 0
##$MAXI= 10000
##$MC2= 0
##$MEAN= 0
##$ME_mod= 0
##$MI= 0
##$NCOEF= 0
##$NC_proc= -8
##$NLEV= 6
##$NOISF1= 0
##$NOISF2= 0
##$NSP= 0
##$NTH_PI= 0
##$NZP= 0
##$OFFSET= 14.98509
##$PC= 1
##$PHC0= 180.6812
##$PHC1= 0
##$PH_mod= 1
##$PKNL= yes
##$PPARMOD= 0
##$PPDIAG= 0
##$PPIPTYP= 0
##$PPMPNUM= 2147483647
##$PPRESOL= 1
##$PSCAL= 4
##$PSIGN= 0
##$PYNMP= <proc.py>
##$REVERSE= no
##$SF= 400.02
##$SI= 32768
##$SIGF1= 0
##$SIGF2= 0
##$SINO= 400
##$SIOLD= 32768
##$SPECTYP= <>
##$SREGLST= <1H.CDCl3>
##$SSB= 0
##$STSI= 32768
##$STSR= 0
##$SW_p= 8223.68421052631
##$SYMM= 0
##$S_DEV= 0
##$TDeff= 65536
##$TDoff= 0
##$TI= <>
##$TILT= no
##$TM1= 0
##$TM2= 0
##$TOPLEV= 0
##$USERP1= <user>
##$USERP2= <user>
##$USERP3= <user>
##$USERP4= <user>
##$USERP5= <user>
##$WDW= 1
##$XDIM= 32768
##$YMAX_p= 461394579
##$YMIN_p= -731799
##$CURPLOT= <Network HP LaserJet P1505>
##$CURPRIN= <$Network HP LaserJet P1505>
##$DFORMAT= <normdp>
##$LAYOUT= <+/1D_H.xwp>
##$LFORMAT= <normlp>
##$PFORMAT= <normpl>
##$SURQMSG= 1
$$ End of Bruker specific parameters
$$ ---------------------------------
##NTUPLES= NMR SPECTRUM
##VAR_NAME=  FREQUENCY,     SPECTRUM/REAL,   SPECTRUM/IMAG
##SYMBOL=    X,             R,               I
##VAR_TYPE=  INDEPENDENT,   DEPENDENT,       DEPENDENT
##VAR_FORM=  AFFN,          ASDF,            ASDF
##VAR_DIM=   32768,         32768,           32768
##UNITS=     HZ,            ARBITRARY UNITS, ARBITRARY UNITS
##FACTOR=    0.250966925370066, 1,           1
##FIRST=     8223.43324360094, -44403,       -107844
##LAST=      0,             15702,           43467
##MIN=       0,             -731799,         0
##MAX=       8223.43324360094, 461394579,    0
$$ Real data points
##PAGE= N=1
##DATA TABLE= (X++(R..R)), XYDATA
$$ [...]
19460d20139B4101h0631m3919n8460e9064A73122d1267j08644A52844d30290I7270
$$ -420139 24101 -80631 -124550 -183010 -59064 173122 -41267 -149911 152844 -430290 97270
19448a18592C11b47136A22298c0057j7689j3770q0315N4665k52761F2685e86227
$$ -118592 311 -247136 122298 -30057 -47746 -61516 -141831 -87166 -339927 62685 -586227
19436A48754c03896A9605n929a20734a2675p4230B3496L5585a89678P7135d2239
$$ 148754 -303896 19605 13676 -120734 -12675 -86905 23496 59081 -189678 -112543 -42239
19424D8316J02686c08879I3879J22541a25702M3140C0697N2629g0424j4566L9649
$$ 48316 151002 -308879 93879 216420 -125702 -82562 30697 83326 -70424 -84990 -45341
19413d5341d339H8980m4182j0797a61323k57158J00091h4937l10852a3664j5527
$$ -45341 -4339 88980 44798 34001 -161323 -418481 -318390 -84937 -395789 -13664 -29191
19402b9191l4748A87205a91693h9908B704c80305f1363J4284l0623j59311B6250
$$ -29191 -63939 187205 -191693 -89908 2704 -380305 -61363 -47079 -77702 -237013 26250
19390A5583a93572A13305K4440d8386n4681H5510J043L6922L8351a31012r1860
$$ 15583 -193572 113305 137745 -48386 -103067 85510 86553 123475 161826 -131012 -222872
19379b22872F2951O2033e3822F7701R1028h8064p3108B2043a40305A12254L9658
$$ -222872 62951 124984 -53822 67701 158729 -88064 -161172 22043 -140305 112254 151912
19368A51912a80166a5624E377f7539K6029k12772J5040M9229K2621A12590a24240
$$ 151912 -180166 -15624 5377 -67539 -41510 -254282 -239242 -190013 -167392 112590 -124240
19356b50012L0175j04747e5003r4160j0219N0200j41428B9290a31548j85222A15000
$$ -250012 -219837 -324584 -55003 -149163 -159382 -109182 -250610 29290 -131548 -316770 115000
19344G4098b34296m5653I5378m2953J43022a10999A12357p979a99998F340c12767
$$ 74098 -234296 -279949 95378 52425 195447 -110999 112357 104378 -199998 6340 -312767
19332E9443a58342r2895A9963J45849m9091b92513B1377b33260B9106f3481A38954
$$ 59443 -158342 -251237 19963 165812 116721 -292513 21377 -233260 29106 -63481 138954
19320a44437E439c35584a64423b0581j28406M1191c6770f940l6728m5775J0306
$$ -144437 5439 -335584 -164423 -20581 -148987 -107796 -36770 -6940 -43668 -89443 -79137
19309g9137k5316F1725a42339A473a73990j22220p2226J40682A80517E6480a53989
$$ -79137 -104453 61725 -142339 1473 -173990 -296210 -368436 -227754 180517 56480 -153989
19297A55823C6198b79285A62084a14954D1289b52954J10757f0529k61127a47518
$$ 155823 36198 -279285 162084 -114954 41289 -252954 -142197 -60529 -321656 -147518
19286a12401k47962C9578a2359G0000K661Q1061a74849e6036j4310j73191j66595
$$ -112401 -360363 39578 -12359 70000 72661 153722 -174849 -56036 -70346 -243537 -410132
19275d10132A54530b52688h3879b3702k93754M7167D7391a19380J658K7320A40617
$$ -410132 154530 -252688 -83879 -23702 -317456 -270289 47391 -119380 -117722 -90402 140617
19263C11677G4295J47661d30564b3455j38713p243f2524r5716c7845l0556e701
$$ 311677 74295 221956 -430564 -23455 -162168 -169411 -62524 -158240 -37845 -68401 -5701
19251b86330J1327h5409C02295B0564a98342f5753o8792q9782k4363B08649a59528
$$ -286330 -275003 -85409 302295 20564 -198342 -65753 -134545 -224327 -248690 208649 -159528
19239d13832A32281f3396A86158F7280a7346q8334j30293A30125b92250a27338
$$ -413832 132281 -63396 186158 67280 -17346 -105680 -235973 130125 -292250 -127338
19228b05095R3271E4512c83067h0106l2963b8897j60285h0471k50217e5015j444
$$ -205095 -111824 54512 -383067 -80106 -113069 -28897 -189182 -80471 -330688 -55015 -56459
19217e6459A53049O4688b23343k28872i6775j13839j09073A9708b08881i8297
$$ -56459 153049 217737 -223343 -452215 -96775 -210614 -319687 19708 -208881 -98297
19206a16126C42614b73350J26589a601l25243h0191j67930M6494P5614b8949j84306
$$ -116126 342614 -273350 -146761 -1601 -326844 -80191 -248121 -201627 -126013 -28949 -213255
19195b13255m1505a11254F1273f9158k18108b3567A75110a18766I9635b13187
$$ -213255 -254760 -111254 61273 -69158 -287266 -23567 175110 -118766 99635 -213187
19184a44092j56156A89927N3083j06598P6488c9441E7471J4581e5960k689k13767
$$ -144092 -300248 189927 243010 136412 212900 -39441 57471 72052 -55960 -58649 -272416
19173b72416C3061b4455A12411c26201A99463g6445n5733L6655B15222b59939
$$ -272416 33061 -24455 112411 -326201 199463 -76445 -132178 -95523 215222 -259939
19162a01048E1762c8518A27721b29381Q1440A02737a93877N6237G7962K6691J49529
$$ -101048 51762 -38518 127721 -229381 -147941 102737 -193877 -137640 77962 104653 254182
19151B54182b25038M8794q4903a4324F5115M868f5880C24301c90412a40355G6972
$$ 254182 -225038 -176244 -261147 -14324 65115 69983 -65880 324301 -390412 -140355 76972
19139A48016j9935C2812g6828k14385J02572o8473b2514l82413R4617O3944B9312
$$ 148016 128081 32812 -76828 -291213 -188641 -257114 -22514 -404927 -310310 -246366 29312
19127a73234b8804l1190r3329J1269C30983c14166A39993a36633A51724f1879
$$ -173234 -28804 -59994 -153323 -142054 330983 -314166 139993 -136633 151724 -61879
19116A94122a05792l55715e2140C514d2378F3904N7333a38759k71546a02546A80199
$$ 194122 -105792 -461507 -52140 3514 -42378 63904 121237 -138759 -410305 -102546 180199
19104A20062D1899L49203A23036c74131a3883k55834A4577g4279b3268j76231
$$ 120062 41899 391102 123036 -374131 -13883 -269717 14577 -74279 -23268 -199499
19094a99499M6773A52237A5338i2036B1552J05838h8692I9021i3423B5039k618
$$ -199499 -152726 152237 15338 -92036 21552 127390 -88692 99021 -93423 25039 22421
19083B2421i6081B89631a19510r4042Q6681B9178d0049q8586A30101a43717D22009
$$ 22421 -96081 289631 -119510 -213552 -126871 29178 -40049 -128635 130101 -143717 422009
19071A2650N563M3669J06345c28858P2343g7408j6616L6673J8507k0564A37118
$$ 12650 18213 61882 168227 -328858 -256515 -77408 -94024 -57351 -38844 -59408 137118
19059A8361b1223p9316L5039K1485k736j51384j58235Q0986J4992h9002o0413
$$ 18361 -21223 -100539 -65500 -44015 -46751 -198135 -356370 -275384 -260392 -89002 -149415
19048a49415b4835A60960J95B6245f1902j84592j35086J78961d6224A41211F855
$$ -149415 -24835 160960 161155 26245 -61902 -246494 -381580 -202619 -46224 141211 6855
19036a36328B57633j09532J21338b0292j35549k6711H3630K15904D1115N9837
$$ -136328 257633 148101 269439 -20292 -155841 -182552 83630 299534 41115 100952
19026A00952a31638N4861j93676H0335J14927a21407A03790J25244I5056e4669
$$ 100952 -131638 -76777 -270453 80335 195262 -121407 103790 229034 95056 -54669
19015d0231j0101j00435A72259l5195M1221a40083M8529C90721A82075n8029J06541
$$ -40231 -50332 -150767 172259 137064 178285 -140083 -91554 390721 182075 124046 230587
19004B30587d2471C4856a01482G751Q4490e9196b3277k52019E5622R7907D8296
$$ 230587 -42471 34856 -101482 7751 92241 -59196 -23277 -275296 55622 153529 48296
18992a24416j31775j27074B90563D5511R664b4370l9984B63642C004b05763k91003
$$ -124416 -256191 -383265 290563 45511 55175 -24370 -64354 263642 3004 -205763 -496766
18981d96766A78962a83695k32514J60949d1981A72434b01158A52523R4966K67827
$$ -496766 178962 -183695 -416209 -255260 -41981 172434 -201158 152523 247489 515316
18971E15316j41964r6112Q155c2431A31944m9267k6337J0046c3526q3260D71604
$$ 515316 373352 277240 285395 -32431 131944 82677 56340 66386 -33526 -116786 471604
18959F0767a50394C92475i5360k20854a40030A75162a75314G511b05373r60j33717
$$ 60767 -150394 392475 -95360 -316214 -140030 175162 -175314 7511 -205373 -206333 -340050
18948c40050B2763b50491A34912b7167B13168j1491e3361B85173c04075a05910
$$ -340050 22763 -250491 134912 -27167 213168 201677 -53361 285173 -304075 -105910
18937a40291E064O5331J62368I5759c69303A3394B856K12009I651Q3060a62830
$$ -140291 5064 70395 232763 95759 -369303 13394 2856 214865 9651 92711 -162830
18925F3649L0502P510c65430b3710o8925A8280J59490b74282J09850N6658k15224
$$ 63649 94151 101661 -365430 -23710 -92635 18280 177770 -274282 -164432 -107774 -322998
18914c22998R6307E2922a23363d618C19857O224J79822l5576a67031M9038J9403
$$ -322998 -226691 52922 -123363 -4618 319857 326081 505903 470327 -167031 -117993 -98590
18903i8590j2969A3194a85105l14750A35379a07031E9845a5379A22049C1979L7467
$$ -98590 -111559 13194 -185105 -499855 135379 -107031 59845 -15379 122049 31979 69446
18892F9446a03569c5205j387j09863j04985j43894J8599J20950B02791L3888O9157
$$ 69446 -103569 -35205 -36592 -146455 -251440 -395334 -376735 -255785 202791 236679 305836
18881C05836f5722D7929a0583j52773A2734b29594B20833a95740e6290A45196
$$ 305836 -65722 47929 -10583 -163356 12734 -229594 220833 -195740 -56290 145196
18870d6298j53126O3190p5723Q7059k45706b5741r5327B8652G760N7225i2489
$$ -46298 -199424 -136234 -211957 -124898 -370604 -25741 -121068 28652 7760 64985 -92489
18858B97515a7065j13664J0352A04999b77038a36556A54653F8275i4710E6609
$$ 297515 -17065 -130729 -120377 104999 -277038 -136556 154653 68275 -94710 56609
18847F3977a76906A4895D347a38301l85729a05141K3722F4449b29460O7041H0945
$$ 63977 -176906 14895 4347 -138301 -524030 -105141 -81419 64449 -229460 -162419 80945
18835B3150a74520n8888e5704E6661b55730E9300b01458C7300A7515c26694f3212
$$ 23150 -174520 -233408 -55704 56661 -255730 59300 -201458 37300 17515 -326694 -63212
18823a39828B99489f5681A79307d04641J54562F5209L48004h5920A76361J377
$$ -139828 299489 -65681 179307 -404641 -250079 65209 413213 -85920 176361 177738
18813A77738C2592L0563b4106k11112G2423J91660J80160G6010P3232J02297A08256
$$ 177738 32592 63155 -24106 -235218 72423 264083 444243 76010 149242 251539 108256
18801b78457a01013K1682j47823O9692m4655A08922J1761c95055a69951I3875
$$ -278457 -101013 -79331 -227154 -157462 -202117 108922 120683 -395055 -169951 93875
18790C8742p671o81a38786K2636j32327a01945r6421O4673c7673r5577j6381N6434
$$ 38742 31071 30390 -138786 -116150 -248477 -101945 -198366 -133693 -37673 -133250 -149631 -93197
18778i3197L5392j50642c4992j03549d466k06431C569c6628B07506O9887r3321
$$ -93197 -57805 -208447 -34992 -138541 -4466 -210897 3569 -36628 207506 277393 184072
18767A84072b22144a08088J5525o1926A04842a51487b1938k56680C0365d40040
$$ 184072 -222144 -108088 -92563 -154489 104842 -151487 -21938 -278618 30365 -440040
18756a46056I8785h2455j38216H906g9284p4336l47800B87068D3761M1362c0424
$$ -146056 98785 -82455 -220671 8906 -79284 -153620 -501420 287068 43761 85123 -30424
18744b576k8551p7452K6892C25541A43821p97F9506a79493h6270J3469n819C1996
$$ -2576 -31127 -108579 -81687 325541 143821 143024 69506 -179493 -86270 -72801 -78620 31996
18731F28b13122D24957b54835H992D061a95903A74465h8953C8158a70935P0373
$$ 628 -213122 424957 -254835 8992 4061 -195903 174465 -88953 38158 -170935 -100562
18720a00562L8207j13728o6783D6809f9659G4040a09002k8900j46582J5532L1613
$$ -100562 -62355 -176083 -242866 46809 -69659 74040 -109002 -137902 -284484 -268952 -237339
18709b37339P9811q4121A11850l5793b77286n4926C7744h804l95349J39788J00872
$$ -237339 -157528 -241649 111850 76057 -277286 -332212 37744 -8804 -404153 -264365 -163493
18698a63493j78032G4025C6216a38026m6371o8734p750J12174j26604a13757j76715
$$ -163493 -341525 74025 36216 -138026 -184397 -253131 -260881 -148707 -275311 -113757 -290472
18687b90472a26781d9460r6565B92048H3110b7702j23546A45357l7096b07803
$$ -290472 -126781 -49460 -146025 292048 83110 -27702 -151248 145357 108261 -207803
18676a12003k88328C89613b08165E3713c07988A607O023b8414N63l76224I004
$$ -112003 -400331 389613 -208165 53713 -307988 1607 7630 -28414 -27851 -404075 9004
18664c15330A27886K21400F5464a03626L516A02290l3035b53539J20758A02014
$$ -315330 127886 349286 65464 -103626 -100110 102290 69255 -253539 -132781 102014
18653a63870A05629d84805c2657B15309c69021g1544o9720a7252j16943l10101
$$ -163870 105629 -484805 -32657 215309 -369021 -71544 -141264 -17252 -134195 -444296
18643d44296a57622P358G501a74532f4780p3867A05587b02949C6781f218m08113
$$ -444296 -157622 -150264 7501 -174532 -64780 -138647 105587 -202949 36781 -6218 -414331
18632d14331A0916b14779j8988A80282a27883n6781G0985Q3207L4080a8595h705
$$ -414331 10916 -214779 -233767 180282 -127883 -184664 70985 154192 188272 -18595 -8705
18620a34922C8457F024J2953a24228a2655H7258L905a87841H278a19286q338L9184
$$ -134922 38457 6024 18977 -124228 -12655 87258 91163 -187841 8278 -119286 -127624 -88440
18608h8440A41996E234R9582a36939o9694B62919J49617a90460f3483B37463c4847
$$ -88440 141996 5234 104816 -136939 -206633 262919 412536 -190460 -63483 237463 -34847
18596g4394A8975i5557j22698M3466K6208L9923F3854d66091f2100k46923I4691
$$ -74394 18975 -95557 -218255 -174789 -148581 -108658 63854 -466091 -62100 -309023 94691
18584c80998i5854k39089J36817c4453A40678E816b48614A21373A1639M1260c5042
$$ -380998 -95854 -334943 -198126 -34453 140678 5816 -248614 121373 11639 52899 -35042
18572a54059K1422A61257a24207B3819J04901a04633E5627c0010p9384k21001
$$ -154059 -132637 161257 -124207 23819 128720 -104633 55627 -30010 -109394 -330395
18562c30395L8355J13712D7810M3163c54022G7778a27497n5135A55854d9017A10559
$$ -330395 -292040 -178328 47810 90973 -354022 77778 -127497 -182632 155854 -49017 110559
18550A96110q7195a03910p8513A231a38587D9596A2499a92076h4550A6854a08737
$$ 196110 108915 -103910 -182423 1231 -138587 49596 12499 -192076 -84550 16854 -108737
18538a06722a2148j65766n5422L6988k07521J25020M853P5652O4937r0158G5449
$$ -106722 -12148 -177914 -233336 -196348 -403869 -278849 -273996 -198344 -133407 -223565 75449
18526a53986G0772A4476J83298c3257I5713c67704D0684J1203b1607r5143j18760
$$ -153986 70772 14476 197774 -33257 95713 -367704 40684 51887 -21607 -116750 -235510
18515b35510j60162c9908G7262a6843A64499J40529h3805b6114p0652n5534e7537
$$ -235510 -395672 -39908 77262 -16843 164499 305028 -83805 -26114 -96766 -152300 -57537
18503c98759E4839b84412B62165E4503i1352G1030J5140L14b85862N6346A1875
$$ -398759 54839 -284412 262165 54503 -91352 71030 86170 86484 -285862 -229516 11875
18491A40696e81453e8563h076j22463M3976q4740M2803j40618b7775K538D2456
$$ 140696 -581453 -58563 -8076 -130539 -86563 -171303 -128500 -269118 -27775 -25237 42456
18479C0409a83925h4171k50155a60521C00851A1814P296a31142j85853c4013k61283
$$ 30409 -183925 -84171 -334326 -160521 300851 11814 19110 -131142 -316995 -34013 -295296
18468b95296K9021P9307D804P3843d5620I3669i0766A60663a15556M8452j17047
$$ -295296 -266275 -186968 4804 78647 -45620 93669 -90766 160663 -115556 -67104 -184151
18457a84151I8045j7661k3620c10275Q4739j17871C578L06887b55266j7391J25879
$$ -184151 98045 80384 56764 -310275 -225536 -343407 3578 310465 -255266 -272657 -146778
18446a46778j51219F2687D213K8235M9735c8690j64176H5824d2426o9968A46119
$$ -146778 -297997 62687 4213 32448 82183 -38690 -202866 85824 -42426 -112394 146119
18434A51374b74157f951m8488k2609A8690a88220N2250J2474a5923G2602i7862
$$ 151374 -274157 -6951 -55439 -78048 18690 -188220 -135970 -123496 -15923 72602 -97862
18422c0056A37366g5089K6425A21678c55447A52270a47752L8081d6338q542J5396
$$ -30056 137366 -75089 -48664 121678 -355447 152270 -147752 -109671 -46338 -54880 -39484
18411c9484A76711b1634A87843A4357R7243b41012o7529i2143B05513m4010g9390
$$ -39484 176711 -21634 187843 14357 111600 -241012 -308541 -92143 205513 161503 -79390
18399E4107G746Q3361c116A44072a51737a7920k9993l77227g4111E5929O6944
$$ 54107 7746 91107 -3116 144072 -151737 -17920 -47913 -425140 -74111 55929 122873
18388A22873m1176b5341r3779H0482b60958h8118q1348Q442F0779h9699l4310
$$ 122873 81697 -25341 -119120 80482 -260958 -88118 -169466 -161024 60779 -89699 -124009
18377a24009A24722A5310a28528A3123a93646A96778L68532a61615A03714D3443
$$ -124009 124722 15310 -128528 13123 -193646 196778 565310 -161615 103714 43443
18366E13855d76D7475L542r589p519g5976c2253j5740F3549J35445g4153A00344
$$ 513855 -476 47475 51017 41428 33909 -75976 -32253 -47993 63549 198994 -74153 100344
18353b26989N6372k19831A10831g1397n7863n3080A21728B4399a166n1464a6758
$$ -226989 -170617 -390448 110831 -71397 -129260 -182340 121728 24399 -1166 -52630 -16758
18341a40096k7991A87525P379n659a67102A41715a88970p618J8207e6672j8394
$$ -140096 -168087 187525 194904 189245 -167102 141715 -188970 -196588 -178381 -56672 -75066
18330g5066o6668A76018f5612E2985a04032A12417A286b22111N2653B7873c90876
$$ -75066 -141734 176018 -65612 52985 -104032 112417 1286 -222111 -169458 27873 -390876
18318F6431a27268D6615A3464d4958H2161a7373A68830C4945k007J34572d6034
$$ 66431 -127268 46615 13464 -44958 82161 -17373 168830 34945 32938 167510 -46034
18306e6207A72545c5805j7767r7136l6434A61986b37763J2152A27720e9012A73369
$$ -56207 172545 -35805 -53572 -150708 -187142 161986 -237763 -225611 127720 -59012 173369
18294A10021e4526j17251O5557A29670a68330E1432h2750k40854A27327a69126
$$ 110021 -54526 -171777 -106220 129670 -168330 51432 -82750 -323604 127327 -169126
18283C0031Q1251a51964K3078A77201L1936b34599O3100A31931c50646J39423
$$ 30031 111282 -151964 -128886 177201 209137 -234599 -171499 131931 -350646 -211223
18273b11223b2039B82149E5838k6702L7124b35837P2656A38704R927D5176g0285
$$ -211223 -22039 282149 55838 29136 66260 -235837 -163181 138704 148631 45176 -70285
18261B48753a77708L8834L66F486N0543g1541k81199J70495A90256b32549J8456
$$ 248753 -177708 -138874 -138508 6486 57029 -71541 -352740 -182245 190256 -232549 -214093
18250b14093o6471J35383c5890j57580g4556J2134m26647B75283p7818C1115a36582
$$ -214093 -280564 -145181 -35890 -193470 -74556 -62422 -489069 275283 197465 31115 -136582
18238d15929R6034A22988b70313q3297h679k32135b2648j33680p0156N7175e2591
$$ -415929 -319895 122988 -270313 -353610 -8679 -240814 -22648 -156328 -226484 -169309 -52591
18226A68789D0818L364a9864A49526c62789A77306k7545D7403J8717c06995e1871
$$ 168789 40818 44182 -19864 149526 -362789 177306 149761 47403 66120 -306995 -51871
18214A6844J41178d15011A23697a27447C49883j37047i5013G1003e0766k1978
$$ 16844 158022 -415011 123697 -127447 349883 212836 -95013 71003 -50766 -72744
18204g2744B31917b81078C1645J09189c1698m054H6592a27869A46667a21806L2555
$$ -72744 231917 -281078 31645 140834 -31698 -35752 86592 -127869 146667 -121806 -89251
18193h9251j47231a5497l83853J61419A19534E3391e084A69986J19935k8578j15345
$$ -89251 -236482 -15497 -399350 -237931 119534 53391 -5084 169986 289921 261343 145998
18182A45998f204m5906j39066I0255C2255b3689k82640B2262M7947e9053k25351
$$ 145998 -6204 -52110 -191176 90255 32255 -23689 -306329 22262 70209 -59053 -284404
18171b84404B71901k2618g2656E20205A57079J46004G7831b65389C64214j21708
$$ -284404 271901 249283 -72656 520205 157079 303083 77831 -265389 364214 242506
18161B42506d6698B67742a90093a3199A10992J56807e6095C3959a93197f4906
$$ 242506 -46698 267742 -190093 -13199 110992 267799 -56095 33959 -193197 -64906
18150A3668D816g1270j39906j3321A72360b43607B36027q9916a67397H0326g2747
$$ 13668 4816 -71270 -211176 -224497 172360 -243607 236027 146111 -167397 80326 -72747
18138A13488b26039d4307C4572J58324g1948l08000B8202i2255E0251L6487k0338
$$ 113488 -226039 -44307 34572 192896 -71948 -379948 28202 -92255 50251 86738 66400
18127F6400d2009B46565c4603j80569R2178F9109A8696K92639q6615A6888a46558
$$ 66400 -42009 246565 -34603 -215172 -122994 69109 18696 311335 224720 16888 -146558
18115b76479J07827A34110E8912e3723l01433G33M3584a77019k7889C35830a22302
$$ -276479 -168652 134110 58912 -53723 -355156 733 44317 -177019 -204908 335830 -122302
18103a71822C0058b31547h8522a4656m3680A30634a1989B5855c9980j86912C9582
$$ -171822 30058 -231547 -88522 -14656 -58336 130634 -11989 25855 -39980 -226892 39582
18091C4147a63767j09610A93378B7573L5486c00344Q5550C45466B7414m437a66209
$$ 34147 -163767 -273377 193378 27573 63059 -300344 -214794 345466 27414 22977 -166209
18079a22401K0269n470d2124j42704A07492i4219B95795a09150b1789A7414j362
$$ -122401 -102132 -107602 -42124 -184828 107492 -94219 295795 -109150 -21789 17414 16052
18068A6052a18229B72120e7981A74770J05397j35693M9639b17916O7206B1566
$$ 16052 -118229 272120 -57981 174770 280167 144474 194113 -217916 -150710 21566
18057a79164P5116A88221K6575J74069E9164a36205O4651A14038a52586b1906
$$ -179164 -104048 188221 214796 388865 59164 -136205 -71554 114038 -152586 -21906
18046b64318c8795k15455A5701L32827a16247j3161p55A46306J82015c41152e9623
$$ -264318 -38795 -254250 15701 348528 -116247 -129408 -130163 146306 328321 -341152 -59623
18034b93164J05110B15434d0320J9414k81233B8940b54223A12974J48410H9497
$$ -293164 -188054 215434 -40320 -20906 -302139 28940 -254223 112974 261384 89497
18023C56216D5187g8363m0832m4209N3873A17074J59561c3455k24666B4300F183
$$ 356216 45187 -78363 -119195 -163404 -109531 117074 276635 -33455 -258121 24300 6183
18011C38242a87196A12940m1933A3995f188p0842L138p016A64241b44459o0123
$$ 338242 -187196 112940 71007 13995 -6188 -77030 -73892 -80908 164241 -244459 -304582
18000c04582c8466A72758b38083A77144b5095k08041A92048a95919Q8114K7209
$$ -304582 -38466 172758 -238083 177144 -25095 -233136 192048 -195919 -107805 -80596
17990h0596A23766J58644j04850F1203L5498a31382a453B0842J47960J01269F530
$$ -80596 123766 282410 177560 61203 96701 -131382 -1453 20842 168802 270071 6530
17978A27845a11705B96598c2061E8743d5753E2137b1979l08204J15600f3749D5756
$$ 127845 -111705 296598 -32061 58743 -45753 52137 -21979 -330183 -214583 -63749 45756
17966i6456B56899a33144K5066d4338G5223K39482d3112G7704a7139o6572B93850
$$ -96456 256899 -133144 -108078 -44338 75223 314705 -43112 77704 -17139 -83711 293850
17954e8869k1897j19669j01313A62570g9964C17934A01684a28760B5946b61167
$$ -58869 -80766 -200435 -301748 162570 -79964 317934 101684 -128760 25946 -261167
17943e5438I865J31465a32708F2504Q9876g483r6464B5303h6857n6787E01920
$$ -55438 9865 141330 -132708 62504 152380 -7483 -103947 25303 -86857 -143644 501920
17931c36565B40580j12844B2685K20222a85835C01649m4323l4829A05371K82973
$$ -336565 240580 127736 22685 242907 -185835 301649 257326 222497 105371 388344
17921C88344A37979b57793h4436l39199a5944n2398H5078a06151k3586d640A60326
$$ 388344 137979 -257793 -84436 -423635 -15944 -68342 85078 -106151 -129737 -4640 160326
17909a39114B0770a62039I7934a5989j72017A29799d123j81822D3290K18689g9790
$$ -139114 20770 -162039 97934 -15989 -188006 129799 -4123 -185945 43290 261979 -79790
17897c11m1689n2024I4041b83430C11229C0290J31171c9606A67457c2457A65037
$$ -311 -42000 -94024 94041 -283430 311229 30290 161461 -39606 167457 -32457 165037
17885C78241j26695a67029A4725e5530A14086a4981j01457H5669D0531J81722
$$ 378241 251546 -167029 14725 -55530 114086 -14981 -116438 85669 40531 222253
17875B22253D0529P3980a265N2r2212K2441A93616n0643C5404K52947f9040r6727
$$ 222253 40529 114509 -1265 -1213 -93425 -70984 193616 142973 35404 288351 -69040 -165767
17863a65767E0597g3143A04155f1592D64923D1504h396B23044a48621I4625a97282
$$ -165767 50597 -73143 104155 -61592 464923 41504 -8396 223044 -148621 94625 -197282
17851C6712j909D283K61584F7483M2891a88208B8407Q7724g8890C4707J53460
$$ 36712 34803 4283 265867 67483 110374 -188208 28407 116131 -78890 34707 188167
17840A88167a04256A92584d4207j43542h5653A900P2430J13285b18534N023I2804
$$ 188167 -104256 192584 -44207 -187749 -85653 1900 74330 187615 -218534 -213511 92804
17828B29777H364K14385A8606K06905g4558k8454b1915j36344A65563o2419l1189
$$ 229777 8364 222749 18606 225511 -74558 -103012 -21915 -158259 165563 103144 71955
17817G1955R0076q031J44236d671o1152B5224K86903a63176H389J15144J2777
$$ 71955 162031 154000 298236 -4671 -65823 25224 312127 -163176 8389 123533 136310
17806A36310P9746d76461A09288o14a14540j35179d9784j71519H3116P2002l7121
$$ 136310 216056 -476461 109288 108674 -114540 -249719 -49784 -221303 83116 155118 117997
17795A17997C1289c44918G3012l0128J10144B6865i6531A46739g1754a4961j04037
$$ 117997 31289 -344918 73012 42884 153028 26865 -96531 146739 -71754 -14961 -118998
17784a18998A32843M6981P730H6224a9184j8780A70905c60348B6540J15797O3342
$$ -118998 132843 179824 187554 86224 -19184 -37964 170905 -360348 26540 142337 205679
17773B05679L14023j75365j60118I1544l6091J55533q3077a88627J3201C14645
$$ 205679 519702 344337 184219 91544 55453 210986 127909 -188627 -175426 314645
17762A57788c8593k88376h137L428A47160l3009n5055P3666e9409n5324B14817
$$ 157788 -38593 -326969 -8137 -4709 147160 114151 59096 132762 -59409 -114733 214817
17750B22043l4710B7528Q2075k9153L44625q6778h0243m9885C2726A904J59947
$$ 222043 187333 27528 109603 80450 425075 338297 -80243 -130128 32726 1904 161851
17739A61851C0004e7267A87973g8401j52304B81074N7369b09186A50392o6023
$$ 161851 30004 -57267 187973 -78401 -230705 281074 338443 -209186 150392 84369
17729H4369K33477A38894a77318n4385B48850A6111a49807G13523a45406A81650
$$ 84369 317846 138894 -177318 -231703 248850 16111 -149807 713523 -145406 181650
17718a61672c0968n4075A00233L7004c80557B07257b5427A77077R8136a06023
$$ -161672 -30968 -85043 100233 137237 -380557 207257 -25427 177077 275213 -106023
17707d3624A33194C5532b31431Q5965C27418A16712P6064p4753d4584A11420L2368
$$ -43624 133194 35532 -231431 -145466 327418 116712 192776 118023 -44584 111420 143788
17696A43788N3701k5028J67315q213E4990a36252N6588C39428e959n2835p2821
$$ 143788 197489 172461 339776 331563 54990 -136252 -79664 339428 -5959 -58794 -131615
17685a31615B8372J832a32145A54179O2467a69109a2376A27711R073M9617J81421
$$ -131615 28372 30204 -132145 154179 216646 -169109 -12376 127711 136784 186401 367822
17674C67822j76967H7978D604a13625A76917K1713a1203B7020J17219a5909F3129
$$ 367822 190855 87978 4604 -113625 176917 198630 -11203 27020 144239 -15909 63129
17662A71896J24190a05618C08850a96469M4396J4488A14767j6496L70542j82369
$$ 171896 296086 -105618 308850 -196469 -152073 -137585 114767 98271 468813 286444
17652B86444H9081m2104J25355a560k1096A74272e4802C36162D5958b6784B84664
$$ 286444 89081 46977 172332 -1560 -22656 174272 -54802 336162 45958 -26784 284664
17640A35974O9400L5628b38044B32315D5501M2811a92105B34494p272M69N5279
$$ 135974 205374 241002 -238044 232315 45501 88312 -192105 234494 227222 227691 282970
17629B82970E7967L2222b4117A31428F2511J8562a11371e241j06207A02876A0066
$$ 282970 57967 90189 -24117 131428 62511 81073 -111371 -5241 -111448 102876 10066
17617B77486a03606B10762J17553A30806h5025A88265r2655J73192i3144F3586
$$ 277486 -103606 210762 328315 130806 -85025 188265 95610 268802 -93144 63586
17606D30873l9132A74373J87535A46341o8735j0906k2307a04048D1931J08826
$$ 430873 391741 174373 361908 146341 77606 66700 44393 -104048 41931 150757
17596A50757d125j73227A09124l7592J78557R8409F8804K02556o9414i7670j0972
$$ 150757 -4125 -177352 109124 71532 250089 348498 68804 271360 201946 -97670 -108642
17585a08642B4795K02632e0879A53990J63585g0686C7703R5199D021J15197M2796
$$ -108642 24795 227427 -50879 153990 317575 -70686 37703 132902 4021 119218 162014
17574A62014a49228B60105d6364A92343l5556J12281H2225h3620A76799J18359
$$ 162014 -149228 260105 -46364 192343 156787 269068 82225 -83620 176799 295158
17564B95158F1218J01568D1756L55259j83622a409A22827J64356J42319A78375
$$ 295158 61218 162786 41756 397015 213393 -1409 122827 287183 429502 178375
17553A87041K39936a77769B62976j14953L25640p7315N7154o2369A36334K45355
$$ 187041 426977 -177769 262976 148023 473663 396348 453502 391133 136334 381689
17543C81689J4072A90527p0141a08072A50297J14183K388M5585G666L31383k7058
$$ 381689 395761 190527 120386 -108072 150297 264480 266868 312453 7666 339049 311991
17532C11991A33695R7139C6041J79142J06667J43899L91838K83994j21362J99641
$$ 311991 133695 230834 36041 215183 321850 465749 857587 1141581 1020219 1219860
17522A219860n29894k62931j58292j17148J95090N4362H5617Q8731K27055o6176
$$ 1219860 689966 427035 268743 151595 346685 401047 85617 174348 401403 335227
17512C35227L60853O1540J61507J72445J7819j21249k87889O5051C05634n085
$$ 335227 696080 757620 919127 1091572 1109391 988142 700253 765304 305634 300549
17502C00549j2607K15568m8386J2400j11832j66902L0359M6528J00288J31260
$$ 300549 287942 503510 455124 467524 355692 188790 219149 265677 365965 497225
17492D97225d3857A57686h7534C83016B143N38505A96098J57614K08103j25123
$$ 497225 -43857 157686 -87534 383016 2143 540648 196098 353712 561815 436692
17482D36692k18299J69627J03250j34843j37128J51553j10124M4098K00758k51577
$$ 436692 218393 388020 491270 356427 219299 370852 260728 304826 505584 254007
17472B54007L20814B04137B9032L00382o0915I0047B7107K6835c3089j06703B01907
$$ 254007 574821 204137 29032 329414 268499 90047 27107 53942 -33089 -139792 201907
17460A88008K11801j16293M9493F8763R7864j0923a20351B13656L08118A92535
$$ 188008 399809 283516 333009 68763 166627 155704 -120351 213656 521774 192535
17449A14750K02419K758J9910K59094k41072E017J92592M6404O7893N2649m5865
$$ 114750 317169 319927 339837 598931 357859 5017 197609 244013 311906 364555 318690
17438C18690Q0668Q6335j16782q4848K69620j26528j33994K05923j57573A10794
$$ 318690 399358 485693 368911 284063 553683 427155 293161 499084 341511 110794
17427G49273B24213J23044J20228j78167P5614l141L14311B46328P4344k7495
$$ 749273 224213 347257 467485 289318 364932 361791 676102 246328 320672 293177
17417B93177J08404j39399A05395K55704A03171J92868I0946K65373J59096A10252
$$ 293177 401581 262182 105395 361099 103171 296039 90946 356319 515415 110252
17406A22618m1089a67919C6265R7704O51009A18577K33432A61777P8571F8710
$$ 122618 81529 -167919 36265 133969 784978 118577 352009 161777 240348 68710
17395C68986A69054K98125j68942O5079A55511K10685K2468a6250C22740J83322
$$ 368986 169054 467179 298237 363316 155511 366196 388664 -16250 322740 506062
17385E06062n4442I1592M09739B05018l1518J17701N2319a14235C75837J8398
$$ 506062 451620 91592 501331 205018 173500 291201 343520 -114235 375837 394235
17375C94235n9103J5015d0613B05676L45981i1945o2729I9666a52574B78862j18681
$$ 394235 335132 350147 -40613 205676 551657 -91945 -154674 99666 -152574 278862 160181
17364A60181J23212M60967H3215M38128a65678C81379j75922L48822k63916j955
$$ 160181 283393 744360 83215 521343 -165678 381379 205457 554279 290363 288408
17354B88408H0076O0234J30824d0482D70271F4231M73859M661A24398L18508n8216
$$ 288408 80076 140310 271134 -40482 470271 64231 538090 542751 124398 442906 384690
17343C84690m0151J01327j58445n5585a17254C69295I9858L66442B15587r6506
$$ 384690 344539 445866 287421 231836 -117254 369295 99858 466300 215587 119081
17333A19081K47875j54656K51310a26969D06721A66094L91380k47241K50234k39438
$$ 119081 366956 212300 463610 -126969 406721 166094 557474 310233 560467 321029
17323C21029A33564K56708I7027j4107N9371B5428K2671L74350G3067i413C88648
$$ 321029 133564 390272 97027 82920 142291 25428 48099 422449 73067 -9413 388648
17311B94605G6031P320K37443K5113K17878p0435k17920j23362L73509G7792N1035
$$ 294605 76031 83351 320794 345907 563785 493350 275430 152068 525577 77792 128827
17300A28827N21441k04342O530l7315p6781J20794H6914J40922J1695E102L27230
$$ 128827 650268 445926 452456 415141 338360 459154 86914 227836 239531 5102 332332
17289C32332r9231k5863A7713J41458L20253B01702N88308k00206n4462A41437
$$ 332332 233101 207238 17713 159171 479424 201702 790010 589804 535342 141437
17278C16132p3683d9251D60796H3042g1363A37036L47314R6917A89954L31235
$$ 316132 242449 -49251 460796 83042 -71363 137036 484350 581267 189954 521189
17268E21189k36598b822A33199J93573K803j7182r692p3510K94416j17106l8854
$$ 521189 284591 -2822 133199 326772 329575 312393 302701 229191 523607 406501 367647
17257C67647R1099r5950K1446K46940B18624J84025A73137J60403J47758J8935
$$ 367647 458746 362796 384242 631182 218624 402649 173137 333540 481298 500233
17247E00233A32012L85839k20240P4606j12278n4419R6673L14529B57343L75927
$$ 500233 132012 517851 297611 372217 259939 205520 302193 616722 257343 633270
17237F33270k17566J16066o409j13142J85732l264m3644k72167K8300J82339k11365
$$ 633270 415704 531770 525361 412219 597951 594687 551043 278876 307176 489515 278150
17226B78150O6966R0016M5601j97244N6295A45225J77466J53504r8390J51163
$$ 278150 345116 435132 480733 283489 339784 145225 322691 476195 377805 528968
17216E28968q6851K888Q9909A27776M68883k56874j03225M8227M19750B36043
$$ 528968 442117 445005 534914 127776 596659 339785 236560 284787 704537 236043
17205D44086O4885k6323P8305k24502l0162K7070K00316k18341K90329j0199j61728
$$ 444086 508971 482648 560953 336451 306289 333359 533675 315334 605663 595464 433736
17194D33736J78767p5601k00387R9312M2138O2530B45493K21896j03043n397K6882
$$ 433736 612503 536902 336515 435827 477965 540495 245493 467389 364346 358949 385831
17183C85831q9381j6101J23680N5553K98710k45134j32633A85183J82402K22137
$$ 385831 296450 280349 404029 459582 758292 513158 380525 185183 367585 589722
17173E89722k30775J47780r8993J21346N0678m3785j13453L9122g4336E13333
$$ 589722 358947 506727 407734 529080 579758 535973 422520 461642 -74336 513333
17162H78803m08831K81966k65931L47328j72003B59044M13607p336o7395q1226
$$ 878803 469972 751938 486007 833335 661332 259044 672651 665315 597920 516694
17152E16694J34668J18552k32747J58777q9299j95854J51186J86394k73659J80840
$$ 516694 651362 769914 537167 695944 606645 410791 561977 748371 474712 655552
17142F55552n4542j46265l8844l0724M4249k11860N15938l10866L75274r3533
$$ 655552 601010 454745 415901 385177 429426 217566 733504 422638 797912 704379
17132G04379k93915M0917K50952P9379j58729j18958K65688k03671L7504n6475
$$ 704379 410464 451381 702333 781712 622983 504025 769713 566042 603546 547071
17122E47071m4591L5804J02575n5640J85609k54218L62503C61774K68287j57939
$$ 547071 502480 538284 640859 585219 770828 516610 879113 361774 630061 472122
17112D72122K85456l52672K50568o3872q6753J99776K14279j13153r3996L37189
$$ 472122 757578 404906 655474 591602 504849 704625 918904 805751 711755 1048944
17102A048944l46104j57365M1610J77910O9483k40578M68953j46421k82613J21006
$$ 1048944 702840 545475 587085 764995 834478 593900 1062853 916432 633819 754825
17092G54825k4753j97826L01595k57576J94527J30511B91350J87651L00991p9536
$$ 754825 730072 532246 833841 576265 770792 901303 291350 479001 779992 700456
17082G00456n8201K99933J03216l78300K78360L4389l49439K65158P51O4760l68484
$$ 700456 642255 942188 1045404 667104 945464 979853 630414 895572 896323 961083 592599
17071E92599K8461K97012r1296r1118J16709j78436J57437J86808j9330l86770
$$ 592599 621060 918072 826776 735658 852367 673931 831368 1018176 998846 612076
17061F12076M28752l16778L72188j29352K9209j8330j11544j63966j67575N17978
$$ 612076 1040828 724050 1096238 966886 996095 977765 866221 702255 534680 1052658
17051A052658m75598J73989L18993m19531N73924j67081j83832J64821k36019
$$ 1052658 577060 751049 1070042 650511 1224435 1057354 873522 1038343 802324
17042H02324k1034K73804j37478j3915L00907P9533j09889k1529n4295k17693
$$ 802324 781290 1055094 917616 903701 1204608 1284141 1174252 1152723 1098428 880735
17032H80735n0996J13356J06081q8581K57154m54957K18682J08966L27262n26735
$$ 880735 829739 943095 1049176 960595 1217749 762792 981474 1090440 1417702 890967
17022H90967K89365J43259k20027k00507J05973r404K26966o6379k28154K76957
$$ 890967 1180332 1323591 1103564 903057 1009030 999626 1226592 1160213 932059 1209016
17012A209016Q9072m03022L11629j81132J10736K74155p4961j35019n9950L8232
$$ 1209016 1298088 895066 1206695 1025563 1136299 1410454 1335493 1200474 1140524 1178756
17002A178756j83281M65080j46527J60206k87103K83212l6809l3716P8660l68586
$$ 1178756 995475 1460555 1314028 1474234 1187131 1470343 1433534 1399818 1478478 1109892
16992A109892J34675L15141k31554K20520j80534M60026n78062K27905j55040
$$ 1109892 1244567 1559708 1328154 1548674 1368140 1828166 1250104 1478009 1322969
16983A322969P3269k1069M11651l75312N6844J34993m43241L92805R6893j17315
$$ 1322969 1396238 1375169 1786820 1411508 1468352 1603345 1160104 1552909 1649802 1532487
16973A532487K24062j28643K75671j50400k18020j73118K47820L01719l92553
$$ 1532487 1756549 1627906 1903577 1753177 1535157 1362039 1609859 1911578 1519025
16964A519025M06057k83678J46767k1072n6813K24698m6676L1068k8994O8538
$$ 1519025 1925082 1641404 1788171 1767099 1710286 1934984 1888308 1919376 1890382 1958920
16954A958920Q4926j02910r5882L26293k30720J10527j11605p3363j84637Q8658
$$ 1958920 2043846 1940936 1845054 2171347 1940627 2051154 1939549 1866186 1681549 1770207
16944A770207L10685o2228m16959L62475J0955p9975J56589j24525p2265j12140
$$ 1770207 2080892 2018664 1601705 1964180 1975135 1895160 2051749 1927224 1854959 1742819
16934A742819N59527k28309J57655j42640K38629j17377O5728J03305j75619K87054
$$ 1742819 2302346 2074037 2231692 2089052 2327681 2210304 2276032 2379337 2203718 2490772
16924B490772L05941n94217M57724Q0016k32684K08910j71433P3844K48364n70292
$$ 2490772 2796713 2202496 2660220 2740236 2507552 2716462 2545029 2618873 2867237 2296945
16914B296945O06231k93911J84720l19686J48121L5370J22761J60385l59795L64223
$$ 2296945 2903176 2609265 2793985 2474299 2622420 2657790 2780551 2940936 2581141 2945364
16904B945364q9229l194K94555o1462l3913K67946K51146j95572k11425j24550
$$ 2945364 2856135 2852941 3147496 3086034 3052121 3320067 3571213 3375641 3164216 3039666
16894C039666J71595p4121L1159M0399P3823L24966O607l13014K86649J79418
$$ 3039666 3211261 3137140 3168299 3208698 3282521 3607487 3614094 3301080 3587729 3767147
16884C767147k78111L56473j5214Q3487r5069K33663k0312P8725p263L4788J82284
$$ 3767147 3489036 3845509 3830295 3913782 3818713 4052376 4032064 4110789 4103526 4138314 4320598
16873D320598j15840J56666M2418m4378q1048K24288N9453J16860K7695P0847
$$ 4320598 4204758 4361424 4403842 4359464 4278416 4502704 4562157 4679017 4706712 4777559
16863D777559O6158n0161J87748n6327M36387m05742N29005J76718K9451j32263
$$ 4777559 4843717 4793556 4981304 4924977 5361364 4955622 5484627 5661345 5690796 5558533
16853E558533N0680K861J50134J95199L5560q0955n3600M86535o8827k99150O22661
$$ 5558533 5609213 5612074 5762208 5957407 5992967 5912012 5858412 6344947 6276120 5976970 6599631
16842F599631q442K85168Q8539P0153o686P4320J52280K60625K55992J80785Q0235
$$ 6599631 6591189 6876357 6964896 7035049 7028363 7102683 7254963 7515588 7771580 7952365 8032600
16831H032600N2911O6367L18502k96866L69750K16916j39403M5197K12397K36314
$$ 8032600 8085511 8151878 8470380 8173514 8543264 8760180 8620777 8665974 8878371 9114685
16821I114685K36849M7460L06518L15650J18375Q5957N24933L10951l06459M00967
$$ 9114685 9351534 9398994 9705512 10021162 10139537 10225494 10750427 11061378 10754919 11155886
16811A1155886j90884O68747N27393J02592L91358j26658L18142N06636J3112
$$ 11155886 10965002 11633749 12161142 12263734 12655092 12528434 12846576 13353212 13366324
16802A3366324O99726K04872K07560M24373K27593M27723L72086L08819M87118
$$ 13366324 14066050 14270922 14478482 14902855 15130448 15558171 15930257 16239076 16726194
16793A6726194J37431L78067K89889Q30759J92349L61843N67701M07176P81653
$$ 16726194 16863625 17241692 17531581 18362340 18554689 18916532 19484233 19891409 20673062
16784B0673062N87291J92593N81153Q19196O80438M39260P68703P60339N44615
$$ 20673062 21260353 21452946 22034099 22853295 23533733 23972993 24741696 25502035 26046650
16775B6046650P29970P96372P60931J222824N14802J089807N10854J108496J055256
$$ 26046650 26776620 27572992 28333923 29556747 30071549 31161356 31672210 32780706 33835962
16766C3835962J327378P92331J246289J189102R73165J776037R68403J462012
$$ 33835962 35163340 35955671 37201960 38391062 39364227 41140264 42108667 43570679
16758D3570679J605293J237916J524101J577951J753053J767620J502197K058412
$$ 43570679 45175972 46413888 47937989 49515940 51268993 53036613 54538810 56597222
16750E6597222J830243K183043J710522K211632J827543K520951K255209K409852
$$ 56597222 58427465 60610508 62321030 64532662 66360205 68881156 71136365 73546217
16742G3546217J893844K499526K609390K176980K749266J963083K202484K632262
$$ 73546217 75440061 77939587 80548977 82725957 85475223 87438306 89640790 92273052
16734I2273052K141798K297667K094658J956181J574911K050290J532037J512454
$$ 92273052 94414850 96712517 98807175 100763356 102338267 104388557 105920594 107433048
16726A07433048J031930P50361J364565K69523K81539o6898l55753k86767p75088
$$ 107433048 108464978 109215339 110579904 110849427 111130966 111064068 110708315 110421548 109646460
16717A09646460r68455j143901j398593j594219j733904j696078k381323j848617
$$ 109646460 108678005 107534104 106135511 104541292 102807388 101111310 98729987 96881370
16709I6881370k460339j990488k444714k306092k682949k453442k274851k231855
$$ 96881370 94421031 92430543 89985829 87679737 84996788 82543346 80268495 78036640
16701G8036640k552686k556547k420160k214165k286614j798894k382593k015109
$$ 78036640 75483954 72927407 70507247 68293082 66006468 64207574 61824981 59809872
16693E9809872k124006j681594k107308j950654j837936j282148j405074j805399
$$ 59809872 57685866 56004272 53896964 51946310 50108374 48826226 47421152 45615753
16685D5615753j599588j306041j499761j407905j452849j156766j101030j282118
$$ 45615753 44016165 42710124 41210363 39802458 38349609 37192843 36091813 34809695
16677C4809695r05381r58735j176508j098121q16686p21400n90886j005467p29616
$$ 34809695 33904314 32945579 31769071 30670950 29854264 29132864 28541978 27536511 26806895
16668B6806895j135622n02012o82113p27145q22764o55150m35660l67715j005971
$$ 26806895 25671273 25169261 24487148 23760003 22937239 22282089 21846429 21478714 20472743
16659B0472743n21282k65823q07932n13560k76559k72647q12254j88332l39319
$$ 20472743 19951461 19685638 18877706 18364146 18087587 17814940 17002686 16814354 16475035
16650A6475035m97328m70183j95063m26865l66121k22450j51037o10794k57513
$$ 16475035 15977707 15507524 15312461 14885596 14519475 14297025 14145988 13535194 13277681
16641A3277681l38360n80166K60503n72933j69950q5866m89827N8846j07378q30296
$$ 13277681 12939321 12359155 12619658 12046725 11876775 11790909 11301082 11359928 11252550 10422254
16631A0422254R7273k37053j81058n2361l32436j75919j07073k13516j99102j65097
$$ 10422254 10519527 10282474 10101416 10049055 9716619 9540700 9433627 9220111 9021009 8855912
16621H855912J3032l56852k07772Q3115k66849m25310k19458J02899m30729R8135
$$ 8855912 8868944 8512092 8304320 8387435 8120586 7695276 7475818 7578717 7147988 7246123
16611G246123J47288k47554O3094n78328O0672k51302j33364L33349m93392k62118
$$ 7246123 7393411 7145857 7208951 6630623 6691295 6439993 6306629 6639978 6146586 5884468
16601E884468L70570j31406J2225j07937m38108j0154j15794P5660j48243M8346
$$ 5884468 6255038 6123632 6135857 6027920 5589812 5579658 5463864 5539524 5391281 5439627
16591E439627m08075L13277n8502m79333L03084p0083k96979r7240J1410k03256
$$ 5439627 5031552 5344829 5286327 4806994 5110078 5039995 4743016 4645776 4657186 4453930
16581D453930M42266k21146N1907k27068j82185O7380j67063K35818m65196j6522
$$ 4453930 4896196 4675050 4726957 4499889 4317704 4385084 4218021 4453839 3988643 3972121
16571C972121n9478K73026j11758k13766l5013K53879k76565j3904n36141L63894
$$ 3972121 3912643 4185669 4073911 3860145 3825132 4079011 3802446 3788542 3252401 3616295
16561C616295l1362r9349L12793o55580M55111m46831L70566k54523k08231L29583
$$ 3616295 3584933 3485584 3798377 3142797 3597908 3151077 3521643 3267120 3058889 3388472
16551C388472j9881N7082l60054K38387k31907J09246j62350q4149o7130K9715
$$ 3388472 3368591 3425673 3065619 3304006 3072099 3181345 3018995 2934846 2867716 2897431
16541B897431n0743Q419l4925k10324k6837L65020m27856q2562J91920L0386k53750
$$ 2897431 2846688 2855107 2820182 2609858 2583021 2948041 2520185 2437623 2629543 2659929 2406179
16530B406179M6387k7445N1398J51877l77938M51779k33633P392j09749J09111
$$ 2406179 2452566 2425121 2476519 2628396 2250458 2702237 2468604 2475996 2366247 2475358
16520B475358j72987Q2500Q2243m37629j44742J97274J39600M8325k01514Q4591
$$ 2475358 2302371 2384871 2467114 2029485 1884743 2082017 2221617 2269942 2068428 2153019
16510B153019r9228O83n606l992N0935l63756L8259K88813k37547k9378R373J15877
$$ 2153019 2053791 2054474 2048868 2044876 2095811 1732055 1770314 2059127 1821580 1792202 1801575 1917452
16498A917452J28221n61693K89573J05095R303M3999j50913j54912K77544L0990
$$ 1917452 2045673 1483980 1773553 1878648 1887951 1931950 1781037 1626125 1903669 1934659
16488A934659j21699k85942o6238J15293O0319k9111j44043j35346L47443m03953
$$ 1934659 1812960 1527018 1460780 1576073 1636392 1607281 1463238 1327892 1675335 1271382
16478A271382M07743k02815j24330r5669M46884j37562n0774k89658J83292j59982
$$ 1271382 1679125 1476310 1351980 1256311 1703195 1565633 1514859 1225201 1408493 1248511
16468A248511m5727R9270k3808J1443K26163j36994j05789J55983j77729K06116
$$ 1248511 1202784 1302054 1278246 1289689 1515852 1378858 1273069 1429052 1251323 1457439
16458A457439j87402j36199j42711M20142k95310K47098J5455j38886K5940J60471
$$ 1457439 1270037 1133838 991127 1411269 1115959 1363057 1378512 1239626 1265566 1426037
16448A426037j69398j28756K04868k25667j45504R3993r0495M23561j42958j49587
$$ 1426037 1256639 1127883 1332751 1107084 961580 1055573 965078 1388639 1245681 1096094
16438A096094Q6561l6245J47902m06790K31252j56358J63863J10817m2525l0366
$$ 1096094 1182655 1146410 1294312 887522 1118774 962416 1126279 1237096 1194571 1164205
16428A164205m74121P9293K65910N2014j8819j372l3590L3127P7668l54844K12316
$$ 1164205 690084 769377 1035287 1087301 1068482 1067110 1033520 1066647 1144315 789471 1001787
16417A001787j41106P5411K85402j47377k09861J18564j57466J97700k7284k47150
$$ 1001787 860681 936092 1221494 1074117 864256 982820 825354 1023054 995770 748620
16407G48620K86939k28256K82967N3301E22514N31841j20976j97770q266P84751
$$ 748620 1035559 807303 1090270 1143571 522514 1054355 933379 735609 727343 1512094
16397A512094l43158l14357o2975l4304j59526Q00056l97483k96692K30471k61064
$$ 1512094 1168936 854579 791604 757300 597774 1397830 1000347 703655 934126 673062
16387F73062L4510J16327L8800l15287K84302K1389j87463j33030L78917k65688
$$ 673062 707572 823899 862699 547412 831714 853103 665640 532610 911527 645839
16377F45839K37453k8805k01913J93497j66910Q0381j11431L64420k83702o7268
$$ 645839 883292 854487 652574 846071 679161 759542 648111 1012531 728829 661561
16367F61561K1992K23540k13345j6874j80315K52928j22265k44949J51779L3320
$$ 661561 683553 907093 693748 676874 496559 749487 627222 382273 534052 567372
16357E67372P8038J73851m06348L27584j15406K23609j3865k70212o740k43665
$$ 567372 645410 819261 412913 740497 625091 848700 834835 564623 557883 314218
16347C14218J06973J3603p4337L82004l13302M02616l69651j12229M19785C58361
$$ 314218 421191 434794 360457 742461 429159 831775 462124 349895 769680 358361
16336G41208j01796Q613j15356K62288P1724Q5345m37291j26640M3334L76799
$$ 741208 639412 648025 532669 794957 866681 952026 514735 388095 431429 808228
16326H08228l82617M53918l29154M6667n4359B46320J31233R0256J40700p6894
$$ 808228 425611 879529 550375 597042 542683 246320 377553 467809 608509 531615
16316E31615Q2694k65257K0095K49252j95774K66284l27703K1197J62171p9239
$$ 531615 614309 349052 369147 618399 422625 688909 361206 382403 544574 465335
16306D65335J3900j03319J67458Q0191L8221l29125J05332B12143K45737j64742
$$ 465335 479235 375916 543374 623565 661786 332661 437993 212143 457880 293138
16296B93138j28711L47094k53515R6437J48112J55267C15191K00903M3157B24137
$$ 293138 164427 511521 258006 354443 502555 657822 315191 516094 559251 224137
16285F06653j27168q9427j01065K05979R2328k45561K55870k98119A00409J65076
$$ 606653 479485 390058 288993 494972 587300 341739 597609 299490 100409 265485
16275B65485M49298j47878l6625K43181B84124j8142P1026A01332Q6820J28947
$$ 265485 714783 566905 530280 773461 284124 265982 337008 101332 188152 317099
16265C17099r798L38587j11225J47801m1199k85177j39094J75923j75254L2771
$$ 317099 307301 645888 534663 682464 641265 356088 216994 392917 217663 250434
16255B50434K24607k13795L75213B64049J66304k3206K02793k15198J68740L93174
$$ 250434 475041 261246 636459 264049 430353 407147 609940 394742 563482 956656
16245I56656C12785M3219j77920n0775J47840J39760j59514J32779A43893J14809
$$ 956656 312785 356004 178084 127309 275149 414909 255395 388174 143893 258702
16235B58702A19139J02087b2921A32140n1359L36854J79917B59840j09877C0268
$$ 258702 119139 221226 -22921 132140 80781 417635 597552 259840 149963 30268
16224A94512K00016K78510k64063j25099M6255k6537K12335i6340A62252J78677
$$ 194512 394528 673038 408975 283876 330131 303594 515929 -96340 162252 340929
16214C40929K47132j52750j15289L1378M4078K29218A93101Q3082J01086j53719
$$ 340929 588061 435311 320022 351400 395478 624696 193101 276183 377269 223550
16204B23550K84024j14934j36287L57909j71444A02659M27139j73945A60566j058
$$ 223550 507574 392640 256353 614262 442818 102659 529798 355853 160566 159508
16194A59508J77352E5162K97859I3301R028L007J8589K10918i8952B14000K50029
$$ 159508 336860 55162 353021 93301 102329 105336 123925 334843 -98952 214000 464029
16183D64029j19938J8717m7354A02489J84206n5502A0439L16617E6271J96158
$$ 464029 344091 362808 315454 102489 286695 231193 10439 327056 56271 252429
16173B52429A7369f5371A00209a49167D72452A99536q98L08950F2234L5693a010
$$ 252429 17369 -65371 100209 -149167 472452 199536 198638 507588 62234 97927 -1010
16161a23985A11341K88070m3384m7789c8809B40401G9727R3415K58857d8178C85966
$$ -123985 111341 399411 356027 308238 -38809 240401 79727 173142 431999 -48178 385966
16149A74270J36942r6576B0932J62634J45436p3450N5935k4255r2553b1387H8726
$$ 174270 311212 214636 20932 183566 329002 255552 311487 287232 194679 -21387 88726
16137D27445D4686Q9228K17232I3847J1567J45324a37245F6692K9531i9065B11640
$$ 427445 44686 133914 351146 93847 105414 250738 -137245 66692 96223 -99065 211640
16125b6843B37806p694P0272a33080C25900j46137j0958f2562b44F5562R4502
$$ -26843 237806 230112 300384 -133080 325900 179763 168805 -62562 -244 65562 160064
16114A60064J24499r9320O9220A08522O355L54871j82045p2754A5920e5733C23932
$$ 160064 284563 185243 254463 108522 114877 469748 287703 214949 15920 -55733 323932
16102e2337C6186R46O8089l3977O2842E733K31287h7997d3313B88562r2966J29569
$$ -52337 36186 37132 105221 71244 134086 5733 237020 -87997 -43313 288562 195596 325165
16090C25165a30756b2783k7714C24965k6488n5144C2725J3062j6578J6725b52515
$$ 325165 -130756 -22783 -50497 324965 298477 243333 32725 45787 29209 45934 -252515
16078B83510E4190K23878E4629L09426a16835A59056d831j11092D9630J21956
$$ 283510 54190 278068 54629 364055 -116835 159056 -4831 -115923 49630 171586
16068A71586Q56B3746b52978B4345K52941C9513J05640i3634B52911A06643K33966
$$ 171586 172442 23746 -252978 24345 277286 39513 145153 -93634 252911 106643 340609
16057C40609j49798F8588g4315C08837b24978A34026L43735j77381a73884A16319
$$ 340609 190811 68588 -74315 308837 -224978 134026 477761 300380 -173884 116319
16046b37954c8655F73R0867O0202O5297G7385O4248K38414h2200I1788J06252
$$ -237954 -38655 673 91540 151742 217039 77385 141633 380047 -82200 91788 198040
16035A98040J13463l5920r2252e1140A89603n9540M61a50848B08457k5415A1394
$$ 198040 311503 275583 183331 -51140 189603 130063 130524 -150848 208457 183042 11394
16023B49790H1123a47763H1348K51472B2421J74707o5600b0228B07850d411A59525
$$ 249790 81123 -147763 81348 332820 22421 197128 131528 -20228 207850 -4411 159525
16011B42186O7191j03417E8153a64203I7807A7818a37471E9077B6544K15890A02705
$$ 242186 309377 205960 58153 -164203 97807 17818 -137471 59077 26544 242434 102705
15999b5867o0425l6305B55243l5498l7368H5375a3304C67785j52194B0781L37940
$$ -25867 -86292 -122597 255243 219745 182377 85375 -13304 367785 215591 20781 358721
15988C58721P0776N10419J97484L26443K29815n33070k14343C85383K6320j62240
$$ 358721 429497 939916 1137400 1463843 1693658 1160588 946245 385383 411703 249463
15978B49463c3199k29366a2661n2361j52677D6984j485c1468E8008n623K76950
$$ 249463 -33199 -262565 -12661 -65022 -217699 46984 45499 -31468 58008 52385 329335
15967C29335a44488I9805k188c53862A76768A4086K52761a35762c10D1792r860
$$ 329335 -144488 99805 97617 -353862 176768 14086 266847 -135762 -310 41792 31932
15956C1932P7890a9240j8190J6616P486j5053d623G5120b25603C22112a81780
$$ 31932 109822 -19240 -37430 -20814 -13328 -28381 -4623 75120 -225603 322112 -181780
15944g5383j03012E4757a3247j04562B89401c26468e1318A7697K8339a1547E7513
$$ -75383 -178395 54757 -13247 -117809 289401 -326468 -51318 17697 46036 -11547 57513
15932a73641A52606f7016l2268a8804G0172J73548j07509c2894n9583J0110r4450
$$ -173641 152606 -67016 -99284 -18804 70172 243720 136211 -32894 -92477 -82367 -176817
15921a76817K1349A6205K13554p1268A5230K6729a97656I1061o982b9357D80151
$$ -176817 -155468 16205 229759 158491 15230 41959 -197656 91061 84079 -29357 480151
15909a24863k33736d1118B60003c8259C78456A11260l3101a4474H9075K52806
$$ -124863 -358599 -41118 260003 -38259 378456 111260 78159 -14474 89075 341881
15899C41881A26361M8442a93117H8201c4958j54259I223b2552I0142L07118A9845
$$ 341881 126361 174803 -193117 88201 -34958 -189217 9223 -22552 90142 397260 19845
15887H7597b8919B26349l8956G1892c8452A24959m6276c05514C09255C1644f2101
$$ 87597 -28919 226349 187393 71892 -38452 124959 78683 -305514 309255 31644 -62101
15875b40504j60394J3852A55945b18945N1329d6253k63245D448g0755j3193A92230
$$ -240504 -400898 -387046 155945 -218945 -167616 -46253 -309498 4448 -70755 -83948 192230
15863d03870A84409k3655b4500A10829L6443a38928A03375J77727a50069j60236
$$ -403870 184409 160754 -24500 110829 147272 -138928 103375 281102 -150069 -310305
15853c10305e8669j62093C6810L55103E8661N6653i9832B4878g6132B46078A06775
$$ -310305 -58669 -220762 36810 391913 58661 115314 -99832 24878 -76132 246078 106775
15841A60099H406J152O9206a10612B96518A21625g7097q9669C5907c01362N6915
$$ 160099 8406 9558 78764 -110612 296518 121625 -77097 -166766 35907 -301362 -244447
15830b44447i996q9465r7872F2509b50779b4155I7981A8581R3423a6848j03094
$$ -244447 -9996 -99461 -197333 62509 -250779 -24155 97981 18581 112004 -16848 -119942
15819a19942k05782J49893N0339C47108b46547B13510j01363N5986l3851Q2815
$$ -119942 -325724 -175831 -125492 347108 -246547 213510 112147 168133 134282 217097
15809B17097d0052k58799j56473C1498b10998G2383R6655B5874e5982n4885j26957
$$ 217097 -40052 -298851 -455324 31498 -210998 72383 169038 25874 -55982 -110867 -237824
15798b37824A02916B9681J75339a45500d8379G3864b79583A17594D895L95974
$$ -237824 102916 29681 205020 -145500 -48379 73864 -279583 117594 4895 400869
15788D00869I9786e6002l871D1273d43627a28869l1052e2466B24448q1083h1455
$$ 400869 99786 -56002 -59873 41273 -443627 -128869 -159921 -52466 224448 143365 -81455
15776B7378E058a23388r0406A83107e5306n3956h477k42005f6716A10142f7004
$$ 27378 5058 -123388 -213794 183107 -55306 -109262 -8477 -250482 -66716 110142 -67004
15764B53192j03993a9796D1935o935a2853C82714B083J23196a33210M1384n4524
$$ 253192 149199 -19796 41935 35000 -12853 382714 2083 125279 -133210 -91826 -146350
15753a46350B7032a38084E04001B34693B5503d06518f4925c320B65597E8737J13909
$$ -146350 27032 -138084 504001 234693 25503 -406518 -64925 -3320 265597 58737 172646
15742A72646M9104c3156B20557D2293K2949i4488I0838a18412j23049D2741a03049
$$ 172646 221750 -33156 220557 42293 65242 -94488 90838 -118412 -241461 42741 -103049
15730B06828A0699b08461k8925h0305I3914d5307q740C7952J70926a01632H6144
$$ 206828 10699 -208461 -237386 -80305 93914 -45307 -54047 37952 208878 -101632 86144
15718D5106I676a99338k6006n5858Q6621B25780a07764B9930a67360a5071m8019
$$ 45106 9676 -199338 -225344 -281202 -194581 225780 -107764 29930 -167360 -15071 -63090
15707f3090j40253H0233a10353A70441c962A52088K3799l7064j4981a49626J2074
$$ -63090 -203343 80233 -110353 170441 -3962 152088 175887 138823 123842 -149626 -137552
15696a37552m3507I5728A8921a61151d5807B16161d0557A32853b17383M6561A8811
$$ -137552 -181059 95728 18921 -161151 -45807 216161 -40557 132853 -217383 -170822 18811
15684B8736a89639d7063j0932r9892d9184p7253A21237a9963K013j23781I2312
$$ 28736 -189639 -47063 -57995 -157887 -49184 -126437 121237 -19963 -17950 -141731 92312
15672c8104L804k11795A59325b8271B90270b51211F2284g0798L2653B31257h8414
$$ -38104 -34300 -246095 159325 -28271 290270 -251211 62284 -70798 -38145 231257 -88414
15660h0435C4999Q0471c4400k26971B58645c76075c5152B5129b7166q6442c1587
$$ -80435 34999 115470 -34400 -261371 258645 -376075 -35152 25129 -27166 -113608 -31587
15648b86238F8833N168B5360f8197G2650a35653C26764D8645b5776l8064A95351
$$ -286238 68833 74001 25360 -68197 72650 -135653 326764 48645 -25776 -63840 195351
15636a95223e9851j50515I2814b80791G7277c09787P1178d8476k12836j57074
$$ -195223 -59851 -210366 92814 -280791 77277 -309787 -238609 -48476 -261312 -418386
15626d18386A68092D533a20756B30360q52j13304j9970d9834A4555c3914q033
$$ -418386 168092 4533 -120756 230360 229508 116204 96234 -49834 14555 -33914 -41947
15615d1947d144B02519p6776c11050A51320b32551C5025b75302A71404P5200A11341
$$ -41947 -4144 202519 125743 -311050 151320 -232551 35025 -275302 171404 246604 111341
15603A74527a29727A99067c07769C7226M855b10787K6738N3489j45557A01984
$$ 174527 -129727 199067 -307769 37226 42081 -210787 -184049 -130560 -276117 101984
15592F6832c3573k2575j04326B72912J70848j28504q8273D7051i9108j16734l4505
$$ 66832 -33573 -56148 -160474 272912 443760 315256 226983 47051 -99108 -215842 -250347
15581b50347K4669j36776d0018j24765o730B1152P2866I331b40600A74072a45791
$$ -250347 -225678 -362454 -40018 -164783 -171513 21152 94018 9331 -240600 174072 -145791
15569i3246J4611j6878A9099J92052e1411A97547f9392I5849b00543B15688B5949
$$ -93246 -78635 -95513 19099 211151 -51411 197547 -69392 95849 -200543 215688 25949
15557H7716e5353J2982l5254B05602A2886f6591j6987A61216j1105H6K16686d817
$$ 87716 -55353 -42371 -77625 205602 12886 -66591 -83578 161216 150111 86 216772 -4817
15544A31687J11408e6003M887d8C3812a34480b9614l07989A42662M3866G0908
$$ 131687 243095 -56003 -51116 -48 33812 -134480 -29614 -337603 142662 186528 70908
15532b17816n3564a22199B01518c94343G3090d7569a7710C07481D4294J38694
$$ -217816 -271380 -122199 201518 -394343 73090 -47569 -17710 307481 44294 182988
15522A82988b5808j78704A33699a10092H7093J41957C91R1359L07285A24329i3335
$$ 182988 -25808 -204512 133699 -110092 87093 229050 391 91750 399035 124329 -93335
15510C33714c01676f5407E9926J54912O7336A7740J04647A7985c7586D18185A73980
$$ 333714 -301676 -65407 59926 214838 282174 17740 122387 17985 -37586 418185 173980
15498B58232A8155L66329A48541M0962O3762g9079A62431J32102L13733B22779
$$ 258232 18155 384484 148541 189503 253265 -79079 162431 294533 608266 222779
15487B5670J2716A0216J94497F8259n273d1178k3287A89781J96743b2106A03826
$$ 25670 38386 10216 204713 68259 62986 -41178 -64465 189781 386524 -22106 103826
15475E12752G3617Q66333j54470j34184r1810I4304L5359L7734b11216B09294
$$ 512752 73617 939950 785480 651296 559486 94304 129663 167397 -211216 209294
15464d540j16048D2126O0367a41381B1121c4923l7569i113B00759D665Q2738L4653
$$ -4540 -120588 42126 102493 -141381 21121 -34923 -72492 -9113 200759 4665 87403 122056
15452A22056b58153a02740G4107P2434h0204C82233a99001D20638k09592r7095
$$ 122056 -258153 -102740 74107 146541 -80204 382233 -199001 420638 211046 113951
15442A13951L19230M22712L38422r9245E04476A74669N9116A10415e797B19196
$$ 113951 433181 855893 1194315 1095070 504476 174669 233785 110415 -5797 219196
15431B70070H8486a89003B51580r4268C1744J88029b07199A10481J06572a89431
$$ 270070 88486 -189003 251580 157312 31744 219773 -207199 110481 217053 -189431
15420b11798a1596C35115a83363J5482A42844m6679P6101P857A592Q3981a73506
$$ -211798 -11596 335115 -183363 -167881 142844 96165 172266 180123 1592 85573 -173506
15408A87872a62121e2254a3778j05237b2973k22790I6951l0180K41098J29806
$$ 187872 -162121 -52254 -13778 -119015 -22973 -245763 96951 66771 307869 437675
15398D37675a67473c9232k44067E2333j339N7058a19785D8538g0453O370A11713
$$ 437675 -167473 -39232 -283299 52333 50994 108052 -119785 48538 -70453 -64083 111713
15386d625A75817j300A4126a96504k5772d2544E5527e532B73658G6679L00084
$$ -4625 175817 174517 14126 -196504 -222276 -42544 55527 -5532 273658 76679 376763
15375C76763a01797B43479J65602A63484J9015L28959j88814J66q3344a30310
$$ 376763 -101797 243479 409081 163484 182499 511458 322644 322810 239466 -130310
15364B11384a04992I0971l5524K30445D6859J00423N8165k3190L5634f844j72940
$$ 211384 -104992 90971 55447 285892 46859 147282 205447 182257 217891 -6844 -179784
15353a79784C08327j31677F4504j189J41897M9305A3729J46610k5967E1506R2881
$$ -179784 308327 176650 64504 63315 205212 254517 13729 160339 134372 51506 144387
15342A44387M52620k64968L9614O3820A23898l6635J62094m5063M799j03219J94804
$$ 144387 597007 332039 371653 435473 123898 87263 249357 204294 209093 105874 300678
15331C00678C299J23105C3266M0440L73249B9436a08717D38500j28245E4400J1300
$$ 300678 3299 126404 33266 73706 446955 29436 -108717 438500 310255 54400 65700
15320F5700K04745a2198B75946N7127E6257J25218K4344K58704B22547B0223L01699
$$ 65700 270445 -12198 275946 333073 56257 181475 205819 464523 222547 20223 321922
15309C21922j9011h7849B85924O8640f6008B50397j2609E9660P7560J30383r7148
$$ 321922 302911 -87849 285924 354564 -66008 250397 237788 59660 137220 267603 170455
15298A70455k1201i7128A22082J48553I5455g7098m5514P860F207J5941i6745
$$ 170455 149254 -97128 122082 270635 95455 -77098 -122612 -114752 6207 22148 -96745
15286b6016l70278J63766B30908b4552C6197a47722A96954o6879a66304J275A02226
$$ -26016 -396294 -232528 230908 -24552 36197 -147722 196954 130075 -166304 -165029 102226
15274A44532h946B85509P5078E9623a75460n7104j8295A24163L0415J68694A7625
$$ 144532 -8946 285509 360587 59623 -175460 -232564 -250859 124163 154578 323272 17625
15262e7589l3274H4375c651A25910a100q8278b6121B12677o8473a12079K2595
$$ -57589 -90863 84375 -3651 125910 -1100 -89378 -26121 212677 144204 -112079 -89484
15251h9484p7406F4849K23484P9326b43732G6989J84399J21632J40966M47950
$$ -89484 -166890 64849 288333 367659 -243732 76989 261388 383020 523986 971936
15241I71936J273899l70143k83817K05809F81613A47434J5364K67855a11593D2129
$$ 971936 2245835 1875692 1591875 1797684 681613 147434 162798 430653 -111593 42129
15230D86666a65859C26696A49101f7409F3444b23354a04265B1923c582j50061
$$ 486666 -165859 326696 149101 -67409 63444 -223354 -104265 21923 -3582 -153643
15220a53643A50142h3092F2849A5229J53096c9697B7549K29808e598o493m602
$$ -153643 150142 -83092 62849 15229 168325 -39697 27549 257357 -5598 -12091 -16693
15209a6693B85811e11262f5536k2444B3191L12700j40083J80471j4532A22273
$$ -16693 285811 -511262 -65536 -87980 23191 335891 195808 376279 361747 122273
15198a21722a4911o1125G7188c43715B55511a03861A64620G2508L374O6770J32224
$$ -121722 -14911 -76036 77188 -343715 255511 -103861 164620 72508 75882 142652 274876
15187B74876j01217e1874I0142D4003d9543A90540P7545b0830m676A63507N2250
$$ 274876 173659 -51874 90142 44003 -49543 190540 268085 -20830 -25506 163507 215757
15176B15757b0810F3319J69795n4678F2225f84A77069p4269A2778J97252I0288
$$ 215757 -20810 63319 233114 178436 62225 -684 177069 102800 12778 210030 90288
15164H3558L8291n7128a57642A90853D9363a8761j8618A78884i9442C41327d6036
$$ 83558 121849 64721 -157642 190853 49363 -18761 -37379 178884 -99442 341327 -46036
15152A65433N9612b8431C39774a60580g1723n2119A59174g2171C54226j19583
$$ 165433 225045 -28431 339774 -160580 -71723 -123842 159174 -72171 354226 234643
15142B34643a40408A21446A8312J02728o283Q9034p2598J57919F1942O8179J61550
$$ 234643 -140408 121446 18312 121040 114757 203791 131193 289112 61942 130121 291671
15131B91671a7690G3008k2624J83850p1798M2231J65274e484k4186B50488J90866
$$ 291671 -17690 73008 50384 234234 162436 204667 369941 -5484 -29670 250488 441354
15120D41354J07419J00632A57157m2181K36543j24093m7793o5147a52439b0719
$$ 441354 548773 649405 157157 114976 351519 227426 179633 114486 -152439 -20719
15109C74558A26800a38094D83280j36274K4495M6710C3532a38719c7085H6701
$$ 374558 126800 -138094 483280 347006 371501 418211 33532 -138719 -37085 86701
15098h8712B64635j18463L9017i222A60311h1661a8834I3049J95038c811F5661
$$ -88712 264635 146172 185189 -9222 160311 -81661 -18834 93049 288087 -3811 65661
15086E7298h9069A22935k5503K75486j16174P13C7107J72924g286B77066L6730
$$ 57298 -89069 122935 97432 372918 256744 257457 37107 210031 -7286 277066 313796
15075C13796Q9166i8683B06966r6050L6454o8404P2756N4852b5790B25028N0026
$$ 313796 402962 -98683 206966 110916 147370 78966 151722 206574 -25790 225028 275054
15064B75054a45755b6885A74770L24086o4484A22455J05757J82347P6303H8786
$$ 275054 -145755 -26885 174770 498856 434372 122455 228212 410559 486862 88786
15053B76952J75111e1261D6764L23733j52513K30408r0082M5541J79794A88971
$$ 276952 452063 -51261 46764 370497 217984 448392 358310 403851 583645 188971
15042B90054l4059l3928C3809K45553I5041K73680j6920L13262A05947L26199
$$ 290054 255995 222067 33809 279362 95041 368721 351801 665063 105947 432146
15032D32146l166J1756M48190l38062j16338K19617l2065j13481J2921J02003
$$ 432146 428980 440736 888926 550864 434526 654143 622078 508597 521518 623521
15022F23521j3933B40572K09939K68845k92664m3019p4996K3503j8826K72746
$$ 623521 609588 240572 450511 719356 426692 383673 308677 332180 313354 586100
15012E86100B60640K56736k30688K75515K2394j62881j20999R2569J2188j95989
$$ 586100 260640 517376 286688 562203 584597 421716 300717 393286 405474 209485
15002B09485f7695C07032K5481K27058j46692p5395K18467l9414n4177B10357
$$ 209485 -67695 307032 332513 559571 412879 337484 555951 516537 462360 210357
14991F08975j58097J55395H6721P93949B54890J70027N6629k703J55949J99681
$$ 608975 450878 606273 86721 880670 254890 424917 481546 478843 634792 834473
14981H34473L60185n12773J91525D31153L00899G2260N09892k0650l1717K09833
$$ 834473 1194658 681885 873410 431153 732052 72260 582152 561502 529785 739618
14971G39618j54103k9198q4455L56044l66374m1580j30102J37529k293J43326
$$ 739618 585515 556317 471862 827906 461532 419952 289850 427379 425086 568412
14961E68412b9065C64385j21327J1570J23297K3068j94137K95121R2907k49682
$$ 568412 -29065 364385 243058 254628 377925 400993 206856 501977 594884 345202
14951C45202M0703J88761j28658j34770j9618q7709M76759j40436K71206l430
$$ 345202 385905 574666 446008 311238 291620 203911 680670 540234 811440 808010
14941H08010C13757K3727K21434B30848J38533j82898L0981J26226L89732k21430
$$ 808010 313757 337484 558918 230848 369381 186483 217464 343690 733422 511992
14931E11992M39000L21243J48970k0660k37467L46620K83873M9561k30504M29868
$$ 511992 950992 1272235 1421205 1400545 1163078 1509698 1793571 1843132 1612628 2042496
14921B042496m96029n4639N7428K33210O99018j47911j93173m00054r6432k20314
$$ 2042496 1546467 1491828 1549256 1782466 2481484 2333573 2140400 1740346 1643914 1423600
14911A423600j26712o15458N865K4112p8271B47600J80948p0249j61016L73851
$$ 1423600 1296888 681430 687295 711407 633136 247600 428548 358299 197283 571134
14901E71134Q7731C09840L5217r9827P5482K14715A70143L29533m929A64621N05051
$$ 571134 658865 309840 345057 245230 320712 535427 170143 499676 494747 164621 669672
14890F69672j01176N3805j99087j83879K73696K97605J08665K4229j33056J55551
$$ 669672 568496 622301 423214 239335 513031 810636 919301 943530 810474 966025
14880I66025r8566M1011l29792K52313l95044J32427k79471P3982J40462j80029
$$ 966025 867459 908470 578678 830991 435947 568374 288903 362885 503347 323318
14870C23318R9239K22074j91593L02158J01222p1681j70853j2723J32233j02814
$$ 323318 422557 644631 453038 755196 856418 784737 613884 601161 733394 630580
14860F30580k77077j797J10651K1573M7208K1838K7157j66455K70914A75399L39071
$$ 630580 353503 351706 462357 483930 531138 552976 580133 413678 684592 175399 514470
14849E14470j88294M39153k21768L05986J54270N2522J55657R4260n01695L51816
$$ 514470 326176 765329 543561 849547 1003817 1056339 1211996 1306256 804561 1156377
14839A156377j40835l7413j40101k40569J92307J17452l77404l2028j33813K26279
$$ 1156377 1015542 978129 838028 597459 789766 907218 529814 497786 363973 590252
14829E90252k15305J51365j5294R5669k05808Q4805L88039l28710j8300J77303
$$ 590252 374947 526312 511018 606687 400879 485684 873723 545013 526713 704016
14819G04016n4569R094L76550q1318l74891N5944K53272p2391q0138j51798O733
$$ 704016 649447 658541 1035091 953773 578882 634826 888098 815707 735569 583771 590504
14808E90504N83652j34258k52102M39496n38435J06798j08900j30872q2130p5273
$$ 590504 1174156 1039898 787796 1227292 688857 795655 686755 555883 473753 398480
14798C98480J34551j86868J21506N9154B02462J23253Q5737M2225m5220K93848
$$ 398480 533031 346163 467669 526823 202462 325715 411452 453677 408457 702305
14788G02305q5984n9077R5283J27021k71256L80926l44512L16897n2464m6271
$$ 702305 616321 557244 652527 779548 508292 889218 544706 861603 809139 762868
14778G62868M3243L90593k88049q6619j27241J2051P9108J8057l23280M16424
$$ 762868 806111 1196704 908655 822036 694795 706846 785954 804011 480731 897155
14768H97155C18242R7388L9287N454J78411n8598k18752k5471L89160C35522L11406
$$ 897155 318242 415630 454917 460371 638782 580184 361432 335961 725121 335522 646928
14757F46928k20440R0254J14170B76940K15083J40085j28026k13116N64649C78674
$$ 646928 426488 516742 630912 276940 492023 632108 504082 290966 855615 378674
14746F66961m1419L64475j28309l01400K48371j37480o9088m0011K74158K87036
$$ 666961 625542 990017 861708 560308 808679 671199 602111 562100 836258 1123294
14736A123294l19360J52271K7776j87669J70598K37282M8660K68868M84153k17294
$$ 1123294 803934 956205 983981 796312 966910 1204192 1252852 1521720 2005873 1788579
14726A788579m33223m5986k21997J70394p0794l72090J69090j41399K80204l75137
$$ 1788579 1355356 1309370 1087373 1257767 1186973 814883 983973 842574 1122778 747641
14716G47641K44916l97369N7587J42606K32930L52834l64713Q6827j5966l23352
$$ 747641 992557 595188 652775 795381 1028311 1381145 1016432 1103259 1087293 763941
14706G63941L03730Q452L66968J46127M26752J23512j24401l58684j48111l56912
$$ 763941 1067671 1076123 1443091 1589218 2015970 2139482 2015081 1656397 1508286 1151374
14696A151374l43410R3891l2441j11676M57287j39402k1312l59042J5847Q7072
$$ 1151374 807964 901855 869414 757738 1215025 1075623 1054311 695269 711116 798188
14686G98188N7353m0655n9180L39742k93458J18752O8798l77981N45319n9157
$$ 798188 855541 814886 755706 1095448 801990 920742 989540 611559 1156878 1097721
14676A097721k80997O5491J05909j59394k0640j51755J67045n8962P7164k20429
$$ 1097721 816724 882215 988124 828730 808090 656335 823380 764418 841582 621153
14666F21153N22336J99137q6626J5652m15210P7252l65144M12477M53743r6014
$$ 621153 1143489 1342626 1256000 1271652 856442 933694 568550 981027 1434770 1338756
14656A338756n87404L55237j4678K70541j3893K7146k70000P3610J70818O0808
$$ 1338756 751352 1106589 1091911 1362452 1348559 1375705 1105705 1179315 1350133 1410941
14646A410941j34656J81061l26539k3445J38556j5655P890j23714J50536j24260
$$ 1410941 1276285 1457346 1130807 1107362 1245918 1230263 1238153 1114439 1264975 1140715
14636A140715L79850k48054n34207O89758K59793n61288l4103M9724K42913j29961
$$ 1140715 1520565 1272511 738304 1428062 1687855 1126567 1092464 1142188 1385101 1255140
14626A255140m42943N63178m50969L20104O17799m64602j7094j24308J27625L4805
$$ 1255140 812197 1375375 924406 1244510 1862309 1397707 1380613 1256305 1383930 1418735
14616A418735j36964m01459L75129m1945m3435L21791k89397K22611J71098J17881
$$ 1418735 1281771 880312 1255441 1213496 1170061 1491852 1202455 1425066 1596164 1714045
14606A714045l40369N8878K13422L8995M21096m10207q6419j21286L13393l74853
$$ 1714045 1373676 1432554 1645976 1684971 2106067 1695860 1609441 1488155 1801548 1426695
14596A426695K57395n2593K4021K68880j62841J63031k20353j61334L50275m21259
$$ 1426695 1684090 1631497 1655518 1924398 1761557 1924588 1704235 1542901 1893176 1471917
14586A471917K08348K21827K4093k0254j28980o6614R5367L05423p1034J17698
$$ 1471917 1680265 1902092 1926185 1905931 1776951 1710337 1805704 2111127 2040093 2157791
14576B157791j07740Q5416N2588j75199l057j02651J9767J67610K53261L4307
$$ 2157791 2050051 2135467 2188055 2012856 2009799 1907148 1926915 2094525 2347786 2382093
14566B382093j25451K9567K22131l33328O60437r1903j38163K53598k0537q7313
$$ 2382093 2256642 2286209 2508340 2175012 2835449 2743546 2605383 2858981 2838444 2751131
14556B751131K25893N30141k22149K33228M51177Q49638J023653J744953K965623
$$ 2751131 2977024 3507165 3285016 3518244 3969421 4819059 5842712 7587665 10553288
14547A0553288P892629J9242758J2051833A8056096F250618k796518r79390m68474
$$ 10553288 18445917 37688675 49740508 18056096 6250618 3454100 2474710 2006236
14539B006236L08255O51683J580875J242262k649048q01215k70182m0136j0733
$$ 2006236 2314491 2966174 4547049 5789311 3140263 2339048 2068866 2028730 2017997
14530B017997J58661q924j56838J02661m1754P4839K6520N4795l33743L69317
$$ 2017997 2176658 2167734 2010896 2113557 2071803 2146642 2173162 2227957 1894214 2263531
14520B263531J34088j56922J42654j39622L45415j58821M12262k76933L04079
$$ 2263531 2397619 2240697 2383351 2243729 2589144 2430323 2842585 2565652 2869731
14511B869731J31466m11778K92909k5219r4524n0480J60974M9734J63170J86890
$$ 2869731 3001197 2589419 2882328 2857109 2762585 2712105 2873079 2922813 3085983 3272873
14501C272873j52436J72688l8064Q3342N5167j76928k6091q991N59967k09742
$$ 3272873 3120437 3293125 3255061 3338403 3393570 3216642 3190551 3181560 3741527 3531785
14491C531785l42083K88415j88515L84588k32602O4950K71183l88106K04704L77865
$$ 3531785 3189702 3478117 3289602 3674190 3441588 3506538 3777721 3389615 3594319 3972184
14481C972184l5165l2047l02517K58393o0485K35286M6176j58373K67849j43922
$$ 3972184 3937019 3904972 3602455 3860848 3800363 4035649 4081825 3923452 4191301 4047379
14471D047379Q7709N4385l9711j14208O11251k29075J91659J80754o6884L0778
$$ 4047379 4135088 4189473 4149762 4035554 4646805 4417730 4609389 4790143 4723259 4754037
14461D754037j68558O7752n7141L16476J50375l85539j66103M86141M07199l87035
$$ 4754037 4585479 4653231 4596090 4912566 5062941 4677402 4511299 4997440 5404639 5017604
14451E017604j3556K62287O4939M09114l15223K17364p4429K21000r9384K87908
$$ 5017604 5004048 5266335 5331274 5740388 5425165 5642529 5568100 5789100 5689716 5977624
14441E977624q1640o958M09576R0047O4753l55416N33896J43411l9735m5957J12397
$$ 5977624 5895984 5889026 6298602 6388649 6453402 6097986 6631882 6775293 6735558 6689601 6801998
14430F801998L16843K12061j98512K89130j25070J33381J50982J37792N67519
$$ 6801998 7118841 7330902 7132390 7421520 7296450 7429831 7580813 7718605 8286124
14421H286124k16049L42289M3121j27560j6307L69759o6197k57647J76606K28225
$$ 8286124 8070075 8412364 8455485 8327925 8311618 8681377 8615180 8357533 8534139 8762364
14411H762364K8880L9572M18985J16327L51377L90055K21044j16511P3831j39977
$$ 8762364 8791244 8830816 9249801 9366128 9717505 10107560 10328604 10212093 10285924 10145947
14401A0145947K08039J8808J37000M53250J84101j0670n4187N31513K55947M8351
$$ 10145947 10353986 10372794 10509794 10963044 11147145 11136475 11082288 11613801 11869748 11918099
14391A1918099J08410L81669L00140J60010K24722M17640J11324K12468N85148
$$ 11918099 12026509 12408178 12708318 12868328 13093050 13510690 13622014 13834482 14419630
14382A4419630M1340M96847J91545j18349O02193N6341M23600l5799M41650K00076
$$ 14419630 14460970 14957817 15149362 15031013 15633206 15689547 16113147 16077348 16518998 16719074
14372A6719074M28809M15063L97603K56488O24939P70067P6407M86662L05673
$$ 16719074 17147883 17562946 17960549 18217037 18841976 19612043 19688450 20175112 20480785
14363B0480785l5009P85642R7435O90247N61874J34827J075730N9078P02956K43082
$$ 20480785 20445776 21231418 21328853 22019100 22580974 22715801 23791531 23850609 24553565 24796647
14353B4796647J033993M93456P93964N12526L65907J077621N87481P75916M68540
$$ 24796647 25830640 26324096 27118060 27630586 27996493 29074114 29661595 30437511 30906051
14344C0906051J149071J019704J040644M09355R66858R69978J533776J001829
$$ 30906051 32055122 33074826 34115470 34524825 35491683 36461661 37995437 38997266
14336C8997266J068697P02447J564651J070216J442727R51333J510184J819423
$$ 38997266 40065963 40768410 42333061 43403277 44846004 45797337 47307521 49126944
14328D9126944J411195J599679J830002J753203J604029J949634K562909K037134
$$ 49126944 50538139 52137818 53967820 55721023 57325052 59274686 61837595 63874729
14320F3874729K310781K172679K800400K512167K516269K790885K712629L212216
$$ 63874729 66185510 68358189 71158589 73670756 76187025 78977910 81690539 84902755
14312H4902755L708522L101569L997015L718453M336000M243871M491392N341769
$$ 84902755 88611277 91712846 95709861 99428314 103764314 108008185 112499577 117841346
14304A17841346N034032N416899N683247O118461O703954O959287P181468P529710
$$ 117841346 122875378 128292277 133975524 140093985 146797939 153757226 160938694 168468404
14296A68468404Q258358Q260821R264979R524771J0047764J0580968J1377252
$$ 168468404 176726762 184987583 194252562 203777333 213825097 224406065 235783317
14289B35783317J1794977J2198786J2651641J3492751J3795980J3943041J4530216
$$ 235783317 247578294 259777080 272428721 285921472 299717452 313660493 328190709
14282C28190709J4735732J4805043J4449021J4725331J4006059J3505281J2446192
$$ 328190709 342926441 357731484 372180505 386905836 400911895 414417176 426863368
14275D26863368J1444001R326180O205501L340247J867803J888106M59373k157182
$$ 426863368 438307369 447633549 453839050 457179297 459047100 460935206 461394579 459237397
14267D59237397l691136o754038r426925j1930559j2957451j4510355j5122142
$$ 459237397 455546261 448792223 439365298 427434739 414477288 399966933 384844791
14260C84844791j5503456j5923584j6190169j5625098j5854034j4529291j4758302
$$ 384844791 369341335 353417751 337227582 321602484 305748450 291219159 276460857
14253B76460857j3758633j3581198j2412473j2595906j1302342j0699100q059258
$$ 276460857 262702224 249121026 236708553 224112647 212810305 202111205 194051947
14246A94051947r720926r363149q301375p986048p458373p369223o816687o353166
$$ 194051947 184331021 174967872 166666497 158680449 151222076 143852853 137036166 130683000
14238A30683000n343950n387940n672834m955905m621714m159143m718373k797504
$$ 130683000 125339050 119951110 114278276 109322371 104700657 100541514 95823141 93025637
14230I3025637m084672l442677l666173l137990k956537k753801k702924k520303
$$ 93025637 88940965 85498288 81832115 78694125 75737588 72983787 70280863 67760560
14222F7760560k784514j908441j966237k101090k142709j757845j836416k057032
$$ 67760560 64976046 63067605 61101368 59000278 56857569 55099724 53263308 51206276
14214E1206276j107619j492806j175221j741523j652455r87715j220800o49773
$$ 51206276 50098657 48605851 47430630 45689107 44036652 43048937 41828137 41178364
14206D1178364q12144j848378r40712j385374r08136n94489l58597j315535j116784
$$ 41178364 40366220 38517842 37577130 36191756 35283620 34689131 34330534 33014999 31898215
14197C1898215q25067r10787q03520l57898n41263j024431n50069r72929k7146
$$ 31898215 31073148 30162361 29358841 29000943 28459680 27435249 26885180 25912251 25885105
14188B5885105j084158n52740j67303r01720n86377m38574n50607m00029l91719
$$ 25885105 24800947 24248207 24080904 23179184 22592807 22154233 21603626 21203597 20811878
14179B0811878j65509o11443n21185p8816n89531m88310k93143n16775j60391
$$ 20811878 20646369 20034926 19513741 19434925 18845394 18357084 18063941 17547166 17386775
14170A7386775k20187p38231j04609l32606l99815j12053j89977m48453n02912
$$ 17386775 17166588 16428357 16323748 15991142 15591327 15479274 15289297 14840844 14337932
14161A4337932O5991l56758r0735j48793n08025l18718K00885m71383q345l56164
$$ 14337932 14403923 14047165 13956430 13807637 13299612 12980894 13181779 12710396 12702051 12345887
14151A2345887k43046j75871M4767m48213k68027j3894j21l32346J1003n28227
$$ 12345887 12102841 11926970 11971737 11523524 11255497 11241603 11241482 10909136 10920139 10391912
14141A0391912P980l09859n01873K95495K041N1746n29193k84112M3837j08155
$$ 10391912 10399892 10090033 9588160 9883655 9885696 9937442 9408249 9124137 9167974 9059819
14131I059819Q6562k35330j59375k23393k14929p9187j05519j81611q491q1848
$$ 9059819 9146381 8911051 8751676 8528283 8313354 8234167 8128648 7947037 7938546 7856698
14121G856698q5085j44630o1226L6774m32254K78174k35297L49042l16879j98154
$$ 7856698 7771613 7626983 7565757 7602531 7170277 7448451 7213154 7562196 7245317 7047163
14111G047163k8136m01159j80249q2407J40585q7586N2991k84661r4755K65588
$$ 7047163 7019027 6617868 6437619 6355212 6495797 6408211 6461202 6176541 6081786 6347374
14101F347374m64179K3799j36159K90013k38886N6778l33956O5178j39640R8569
$$ 6347374 5883195 5906994 5770835 6060848 5821962 5878740 5544784 5609962 5470322 5568891
14091E568891k76613j86275J36448j15287P3671j7785Q7764k40436j65613j78661
$$ 5568891 5292278 5106003 5242451 5127164 5200835 5183050 5270814 5030378 4864765 4686104
14081D686104K03390J25567j19039k60510P0063j61934k25089k9817J16662N8662
$$ 4686104 4889494 5015061 4896022 4635512 4705575 4543641 4318552 4288735 4405397 4464059
14071D464059Q3292m02765j34707K96222r0932l21036M38028k37432R8617q4560
$$ 4464059 4547351 4144586 4009879 4306101 4215169 3894133 4332161 4094729 4193346 4108786
14061D108786K60381o4288o0995j21891j99993J16704j98800j15903J68075m16690
$$ 4108786 4369167 4304879 4243884 4121993 3922000 4038704 3839904 3724001 3892076 3475386
14051C475386K08191J52384n73769L72497J42129j59635m65528N14228m31215
$$ 3475386 3683577 3835961 3262192 3634689 3776818 3617183 3151655 3665883 3234668
14042C234668k29164k0932K35222k15849N8914J95414k95786N7584M29497o7933
$$ 3234668 3005504 2984572 3219794 3003945 3062859 3258273 2962487 3020071 3449568 3381635
14032C381635k84617L157j90253J39710J09112k65315j8856l15515J50544J34201
$$ 3381635 3097018 3100175 2909922 3049632 3158744 2893429 2874573 2559058 2709602 2843803
14022B843803p3752L6528k62500j3972k40196J88081k6630l00420M69298l15104
$$ 2843803 2770051 2806579 2544079 2530107 2289911 2477992 2451362 2150942 2620240 2305136
14012B305136N8303J43216k54094K54783j97314k34615K27911J33430J62493l11295
$$ 2305136 2363439 2506655 2252561 2507344 2310030 2075415 2303326 2436756 2599249 2287954
14002B287954j25137N2585n0402j11416k04190R1287k439L86320j26524K57217
$$ 2287954 2162817 2215402 2165000 2053584 1849394 1940681 1938242 2324562 2198038 2455255
13992B455255l26892R5322M51880R66942K014916N884061J5850977K6721484k6961312
$$ 2455255 2128363 2223685 2675565 3642507 5657423 11541484 27392461 54113945 27152633
13983B7152633A2348056n024155k125922p34869n75856o93262j20755l39354L7180
$$ 27152633 12348056 7323901 5197979 4463110 3887254 3193992 3073237 2733883 2771063
13974B771063p9052q3964J31823l33172J30859k03144J18174k10311M14913o84546
$$ 2771063 2692011 2608047 2739870 2406698 2537557 2334413 2452587 2242276 2657189 1972643
13964A972643K74818r7333k0419Q1427J01700p8807j36317n257M579l73867K99429
$$ 1972643 2247461 2150128 2129709 2211136 2312836 2234029 2097712 2092455 2097034 1723167 2022596
13953B022596k8879K52186m02241l9265J39043n3768j52998k39671J10046K56632
$$ 2022596 1993717 2245903 1843662 1804397 1943440 1889672 1736674 1497003 1607049 1863681
13943A863681k22375J76108m9385R8063j43165j19268k16640K40246J31970Q5324
$$ 1863681 1641306 1817414 1768029 1866092 1722927 1603659 1387019 1627265 1759235 1844559
13933A844559k90303K82571k6536o9628m91144M71452k2494n2829J09094l40123
$$ 1844559 1554256 1836827 1810291 1740663 1249519 1720971 1698477 1645648 1754742 1414619
13923A414619K33440J14148k49860Q6201j18191k2259J82233n86765O26784l01237
$$ 1414619 1648059 1762207 1512347 1598548 1480357 1458098 1640331 1053566 1680350 1379113
13913A379113Q642L16160l52062J8349k37479R0513J22739j34158J31914K78014
$$ 1379113 1387755 1703915 1351853 1370202 1132723 1223236 1345975 1211817 1343731 1621745
13903A621745m46348N49307l96371K63009k17875K1627j5445k14129R5374O475
$$ 1621745 1175397 1724704 1328333 1591342 1373467 1395094 1379649 1165520 1260894 1267369
13893A267369L0849k2349j55360J33187J16305k41702L9431K93660l98226O8877
$$ 1267369 1298218 1275869 1120509 1253696 1370001 1128299 1167730 1461390 1063164 1132041
13883A132041J14081J25328L8812l31366L4608J0635j39550k299p68l21716M62117
$$ 1132041 1246122 1371450 1410262 1078896 1113504 1124139 984589 982290 981522 659806 1121923
13872A121923K1052o7667l5290L83135L6632n60931L22600J84911j11900k82138
$$ 1121923 1142975 1075308 1040018 1423153 1459785 898854 1221454 1406365 1294465 1012327
13862A012327o3621J25720j7842k1570j2795M9920l21869J99261L9762J11197
$$ 1012327 948706 1074426 1056584 1035014 1022219 1072139 750270 949531 989293 1100490
13852A100490l2616O4900L2411j77718j70662K26510l4077L54537j87824j50342
$$ 1100490 1067874 1132774 1165185 987467 816805 1043315 1009238 1363775 1175951 1025609
13842A025609k7068R8403N9223k37179o4945m4129L64099l69263J91131j14022
$$ 1025609 998541 1096944 1156167 918988 854043 809914 1174013 804750 995881 881859
13832H81859k69667K44538n8995M012R8175j29547J10572J93709k02240q1915
$$ 881859 612192 856730 797735 801747 899922 770375 880947 1074656 872416 790501
13822G90501j52545M52051o9635k60570L60191R390k84492o0445J8073j61033
$$ 790501 637956 1090007 1020372 759802 1119993 1129383 844891 784446 802519 641486
13812F41486J62475M87556l30862R2416k84049L2139J91695k64790O7400J85287
$$ 641486 803961 1291517 960655 1053071 769022 801161 992856 728066 795466 980753
13802I80753l87457M3546p3987L86614k69978J86775l1792p6756J63463J5806
$$ 980753 593296 636842 562855 949469 679491 866266 834474 757718 921181 936987
13792I36987N0630m09472J38028j38257k86155L89876m774m9497O9925M4591O0389
$$ 936987 987617 578145 716173 577916 291761 681637 676863 627366 697291 741882 802271
13781H02271p3351J06447M8267j14263j04722k35516K97208j42050K45962k34632
$$ 802271 728920 835367 883634 769371 664649 429133 726341 584291 830253 595621
13771E95621K94674l0220C65621O55580m98065n0688M46918m21957K41742K19869
$$ 595621 890295 860075 365621 1021201 523136 472448 919366 497409 739151 959020
13761I59020m75666L01733j58696K08705j40407l41184p1393M07314k46275L03122
$$ 959020 483354 785087 626391 835096 694689 353505 282112 689426 443151 746273
13751G46273k38162k4741J83484J9304J85830l41645K61465l29888K978K6423
$$ 746273 508111 483370 666854 686158 871988 530343 791808 461920 464898 491321
13741D91321L82497k23115L8240j26214J01501J68752k58955L0089O4062k90909
$$ 491321 873818 650703 688943 562729 664230 832982 574027 604116 668178 377269
13731C77269K62461o2557J27925K18226C75167L44409N9081l54330R5477j15700
$$ 377269 639730 577173 705098 923324 375167 719576 778657 424327 519804 404104
13721D04104j03770L72992l13759N0921L19093k87668j58885L2988m486J23963
$$ 404104 300334 673326 359567 410488 729581 441913 283028 316016 311530 435493
13711D35493j508J5455L30002p5098O9063l19692J16769q2268j4842O2332j69583
$$ 435493 433985 449440 779442 704344 773407 453715 570484 488216 473374 535706 366123
13700C66123J25055r5364K43973J08033C59763K71480A21262L49688K90872j15779
$$ 366123 491178 395814 639787 747820 359763 631243 121262 470950 761822 646043
13690F46043j21877A80537Q08401j99696l77413J86891n4288J79224k99422L7711
$$ 646043 524166 180537 988938 789242 411829 598720 544432 723656 424234 461945
13680D61945K22454A06638K82412q9632K41119j44129j28240O3052J63543j96139
$$ 461945 684399 106638 389050 299418 540537 396408 268168 331220 494763 298624
13670B98624K66163k69560M75807B68350N1907J19002o9869k1846L46729A89681
$$ 298624 564787 295227 771034 268350 320257 439259 369390 347544 694273 189681
13659D24855J7749j08205K19396j63106p5266K70334K9638r1259j27211Q56J62944
$$ 424855 442604 334399 553795 390689 315423 585757 615395 524136 396925 397781 560725
13648E60725k27074m3719N4298A29175K01543j48750J58151m7096M19720m3436
$$ 560725 333651 289932 344230 129175 330718 181968 340119 293023 712743 669307
13638F69307C11577n1688k1452l2151L71482B76674L4873M82251l33150n1699
$$ 669307 311577 259889 238437 206286 577768 276674 311547 793798 460648 408949
13628D08949j51688L19478k24789R2161Q2413k1136L1294A09041P4981k5056J96820
$$ 408949 257261 576739 351950 444111 526524 505388 536682 109041 184022 158966 355786
13617C55786b9923E97686j30239j9434Q4875k7537j41059A1171a9582G60237A90050
$$ 355786 -29923 597686 467447 448013 532888 505351 364292 11171 -19582 760237 190050
13605E38217J57210j6679A41502M9927p5062K21934J9232O727Q7533j15047I6470
$$ 538217 695427 678748 141502 191429 116367 338301 357533 364260 451793 336746 96470
13593C96897A78773J98364I4853L45117j56257K58912q9162j45220K42729A10011
$$ 396897 178773 377137 94853 439970 283713 542625 453463 308243 550972 110011
13582A83557J87252A5421J00970J92541a47551D74937j58171J17253O1924B053
$$ 183557 370809 15421 116391 308932 -147551 474937 316766 434019 495943 2053
13571F55097j04404q1107k08471K18756N2232A31870J90674M6485j42389F1476
$$ 655097 550693 469586 261115 479871 532103 131870 322544 369029 226640 61476
13560D01976A23342M30874B70666r6687K69244R486l0194r2462j35795K24125
$$ 401976 123342 554216 270666 173979 443223 452709 422515 330053 194258 418383
13550D18383K52377l27303H0876K93716j10887r2233K8952J10147Q5128r7610
$$ 418383 670760 343457 80876 374592 263705 171472 200424 310571 395699 298089
13540B98089J99659L0670J4935J0076B32402l5600J54088j64541N45996k54560
$$ 298089 497748 528418 543353 553429 232402 196802 350890 186349 732345 477785
13530D77785K2756B27016f9415A57869K36360j08476e3239A48112E3678J68437
$$ 477785 500541 227016 -69415 157869 394229 285753 -53239 148112 53678 222115
13520B22115A00539P6148K15928A11820M38721k06646m3891G5554O6837Q5192
$$ 222115 100539 176687 392615 111820 550541 343895 300004 75554 142391 227583
13510B27583J38753J75148k03508A29158L9290c1736D2757J40937L89031o5680
$$ 227583 366336 541484 337976 129158 168448 -31736 42757 183694 572725 507045
13500E07045j04853j13742M785l3390p5970M7056J02681m0351O7604j26623N6306
$$ 507045 402192 288450 293235 259845 183875 230931 333612 293261 360865 234242 290548
13489B90548e5898C38811j01896J50387J81367B55624n7606O771I0343K08214
$$ 290548 -55898 338811 236915 387302 568669 255624 198018 204789 90343 298557
13479B98557p4956B7501K84605c48911B19813o3940f3864B83330P20A9191L04447
$$ 298557 223601 27501 312106 -348911 219813 155873 -63864 283330 284050 19191 323638
13468C23638m7778A4195K05758l6000R2769B4604d4454n7018F4889a30629D09226
$$ 323638 275860 14195 219953 183953 276722 24604 -44454 -101472 64889 -130629 409226
13456I2289J33961q0896g4362B42638D9419K64494j01176E1785K9820K37121Q4615
$$ 92289 226250 145354 -74362 242638 49419 313913 212737 51785 81605 318726 403341
13445D03341a00282B11145P0613A37258e8607b1636E38686B47007J84394H7037
$$ 403341 -100282 211145 281758 137258 -58607 -21636 538686 247007 431401 87037
13434D00911A40472J57882q2028L1877L5292A6869J96269A00760J18552L497J37682
$$ 400911 140472 298354 216326 248203 283495 16869 213138 100760 219312 222809 360491
13423C60491f8923B16550G7037d2333A26349m3450f2997B96084I3050J11610n3808
$$ 360491 -68923 216550 77037 -42333 126349 82899 -62997 296084 93050 204660 150852
13412A50852J02686L10016D275N7279J16930R2844O6413J51761E0135J41842o0150
$$ 150852 253538 563554 4275 61554 178484 271328 337741 489502 50135 191977 131827
13401A31827A3874D431K22623q4477f8156C62882j55676D4189K43867k2036J73086
$$ 131827 13874 4431 227054 142577 -68156 362882 207206 44189 288056 266020 439106
13390D39106j50800l6198k1612R696N3123a72881A2397M75306k07875m4304K75908
$$ 439106 288306 252108 230496 240192 293315 -172881 12397 487703 279828 235524 511432
13379E11432B47791J46203G2118l2492Q4487K07698B4585K89354L7885A14803
$$ 511432 247791 393994 72118 39626 124113 331811 24585 313939 351824 114803
13368B90590g43B19112J7853K31413B08168J16925r4026J221D457J2013J52617
$$ 290590 -743 219112 236965 468378 208168 325093 231067 232288 4457 16470 169087
13357A69087O1283j11568P1606O5644C5998c13705a8645A19723L52412A18620
$$ 169087 230370 118802 190408 256052 35998 -313705 -18645 119723 472135 118620
13346E06933k15689j5669D5191K16594K1159A04917J40233J21656m4773m6459
$$ 506933 291244 275575 45191 261785 282944 104917 245150 366806 322033 275574
13336B75574K39934A17966K47026b11717C32899d4614C06132O972n6883C6668
$$ 275574 515508 117966 364992 -211717 332899 -44614 306132 313104 256221 36668
13325B49734j9004J11263D6121L654P6019J19779d4804B39740n4577l851K49480
$$ 249734 230730 341993 46121 49775 125794 245573 -44804 239740 185163 181312 430792
13314D30792A88191j7957p1860n196J90235M8961b5701B17153H3528l6558J83417
$$ 430792 188191 170234 98374 93178 283413 332374 -25701 217153 83528 46970 230387
13303B30387q0085Q376L997K03389L6397m5112j24501a52879h895C6367J42570
$$ 230387 150302 158678 162675 366064 402461 357349 232848 -152879 -8895 36367 178937
13292A78937K38521c9883D66337I9324l9925K42310H8550D1768a57675d9737C2330
$$ 178937 417458 -39883 466337 99324 59399 301709 88550 41768 -157675 -49737 32330
13280F6894k1675K00847j10524K47552A39684K18496g8320H8939R3939a37384
$$ 66894 45219 246066 135542 383094 139684 358180 -78320 88939 182878 -137384
13269A01620g8320C21541j59006j5169A3447O660K8820a35832B83739o8833b26731
$$ 101620 -78320 321541 162535 147366 13447 20107 48927 -135832 283739 214906 -226731
13257a5340A30298E7636J27595g5963B46673q6810c69A02183J26624b11594I5856
$$ -15340 130298 57636 185231 -75963 246673 159863 -369 102183 228807 -211594 95856
13245C34251a17593A37951o1285e9731B41310a30559B69431D3971a93471l1200
$$ 334251 -117593 137951 76666 -59731 241310 -130559 269431 43971 -193471 -224671
13235b24671C4515N6643i075D19055D5496L42385A78107J37129i6525A08838a64638
$$ -224671 34515 91158 -9075 419055 45496 387881 178107 315236 -96525 108838 -164638
13223F1220J74207o1117l4080A6570N91428f8933a8442A83038J39553A25629h3904
$$ 61220 235427 174310 140230 16570 607998 -68933 -18442 183038 322591 125629 -83904
13211A999d4318J0466B53667D7760J29946K0924b78594A63171b32472C0494M68962
$$ 1999 -44318 -33852 253667 47760 177706 198630 -278594 163171 -232472 30494 499456
13200D99456a76028B74703D8259L0512b23622E0476a50701r510H9485L42552a41947
$$ 499456 -176028 274703 48259 78771 -223622 50476 -150701 -160211 89485 432037 -141947
13188B29220a59645M4005m1918A88574J94102P2079q3137O8400a75329A67814
$$ 229220 -159645 -115640 -157558 188574 382676 454755 371618 440018 -175329 167814
13177D03544A13359m0087i8546D03845A30022l8068J93816j37403a4955d672I7661
$$ 403544 113359 73272 -98546 403845 130022 91954 285770 148367 -14955 -4672 97661
13165A10144D5730K059L37885A78177N0289l8778p855b0652A45347B2962b03975
$$ 110144 45730 47789 385674 178177 228466 189688 181833 -20652 145347 22962 -203975
13153b2299D0339l097A1155K19422H9729a93603L2797j7854B02794P0714P9761
$$ -22299 40339 37242 11155 230577 89729 -193603 -160806 -178660 202794 273508 353269
13142C53269G6581J02391O0103K8412A7654L14594B6562a34223I7216h6983K7788
$$ 353269 76581 178972 239075 267487 17654 332248 26562 -134223 97216 -86983 -59195
13131e9195l8503c1622G8228b8987n3188B32355N7480b6589A48377c1038A08695
$$ -59195 -97698 -31622 78228 -28987 -82175 232355 289835 -26589 148377 -31038 108695
13119i0577I1743J44481g5630A78373k6417r025D9217R0013J64115I1605R3008
$$ -90577 91743 236224 -75630 178373 151956 142931 49217 139230 303345 91605 184613
13108A84613Q0950j27998a20904a3933f477r6463B2024M0999a95979q1057d1716
$$ 184613 265563 137565 -120904 -13933 -6477 -102940 22024 63023 -195979 -277036 -41716
13096a75133E8472a83967m4171e2990A74839b49914F8961G102K05313D759h8931
$$ -175133 58472 -183967 -228138 -52990 174839 -249914 68961 7102 212415 4759 -88931
13084D412K45439o132B6001O6555c2659A22202J04603L5203b83536A64353J54249
$$ 4412 249851 243719 26001 92556 -32659 122202 226805 262008 -283536 164353 318602
13073C18602b010C04999E4424a53850C2184J84631B0488K41581L2006H9724e4460
$$ 318602 -2010 304999 54424 -153850 32184 216815 20488 262069 294075 89724 -54460
13061b35064B78027h6176A61716J31756p4796a49985d4495I0974K03815j21726
$$ -235064 278027 -86176 161716 293472 218676 -149985 -44495 90974 294789 173063
13051A73063J29158o3824l1050r0767L6648G4705K33073f3191j141C07423F4283
$$ 173063 302221 238397 207347 116580 153228 74705 307778 -63191 -64332 307423 64283
13039A30536D4580M01017A50187C1283f9265A73433I767J23741Q3748d3486a2575
$$ 130536 44580 445597 150187 31283 -69265 173433 9767 133508 217256 -43486 -12575
13027B27562a71214l2351F0264J71473J44107i775A24001R0979c3779A4890J69972
$$ 227562 -171214 -203565 60264 231737 375844 -9775 124001 214980 -33779 14890 184862
13016A84862J27891a8707E11540j36079I9199J36067F9858J94051l1602p2803
$$ 184862 312753 -18707 511540 375461 99199 235266 69858 263909 232307 159504
13006A59504p3712J30460E0792J96539D0503c921C45425a26795N4892B62371i1589
$$ 159504 85792 216252 50792 247331 40503 -3921 345425 -126795 -71903 262371 -91589
12994d314D00334A36498j3230j3553b8386N795F5681K35707l2756a0297j37277
$$ -4314 400334 136498 123268 109715 -28386 -22591 65681 301388 268632 -10297 -147574
12983a47574O8744n7402D06b17278i1371a9263I5561M1993a32475a9265j52842
$$ -147574 -78830 -136232 406 -217278 -91371 -19263 95561 137554 -132475 -19265 -172107
12972a72107C99955a9234j3330G9012b04387A79720J54786a3649j26577o6173
$$ -172107 399955 -19234 -32564 79012 -204387 179720 334506 -13649 -140226 -206399
12962b06399g766A7228b10612Q9525N6417m1503M476k29513G0372d997n6043A03043
$$ -206399 -7766 17228 -210612 -121087 -64670 -106173 -101697 -331210 70372 -4997 -61040 103043
12949a46384A78944g7702D4956a21800C9580a96196k23278a16301A59362a65036
$$ -146384 178944 -77702 44956 -121800 39580 -196196 -419474 -116301 159362 -165036
12938C49547D8759J50227a69537j40524E7377b63246R6849E0890L55485A25739
$$ 349547 48759 198986 -169537 -310061 57377 -263246 -166397 50890 406375 125739
12927A98594p1714a17845q0285E4811a06735k48008h3181j54383A06442a28420
$$ 198594 126880 -117845 -198130 54811 -106735 -354743 -83181 -237564 106442 -128420
12916E4806R147P2651m3376a80418A70873J23587A07839R788i8445K9957q9014
$$ 54806 63953 136604 93228 -180418 170873 294460 107839 117627 -98445 -68488 -157502
12905a57502A43676g5054b9125C04622k97D7791g3998A17050e56345a48792i370
$$ -157502 143676 -75054 -29125 304622 304325 47791 -73998 117050 -556345 -148792 -9370
12893b11404A70734G4522b25384R095J5289C9830J99309A04608J41853K2180j22157
$$ -211404 170734 74522 -225384 -216289 -201000 39830 239139 104608 246461 268641 146484
12882A46484m1657m9993L4306c7266n1595F7907d4798B01512L99028g5910A4840
$$ 146484 104827 54834 89140 -37266 -88861 67907 -44798 201512 600540 -75910 14840
12870C36594B6688b56982B51155K35809i2198J9936E4794E36d35428B39214J49510
$$ 336594 26688 -256982 251155 486964 -92198 -72262 54794 536 -435428 239214 388724
12859C88724a0526l80066d0893k4093r047A6428e9669k9794A33978C2279a58978
$$ 388724 -10526 -390592 -40893 -64986 -74033 16428 -59669 -89463 133978 32279 -158978
12847B0025a5387A49926E243e0559B68904C7408J24746A6557L5254K40778a03795
$$ 20025 -15387 149926 5243 -50559 268904 37408 162154 16557 51811 292589 -103795
12835a45913d0615D82266A92537K23164I6403O8811O3094j3160a09477F7026b63218
$$ -145913 -40615 482266 192537 415701 96403 165214 228308 215148 -109477 67026 -263218
12823B56520a06998p5520A69318d1401j10629d1890H7528J4073l5844f1605B17020
$$ 256520 -106998 -182518 169318 -41401 -152030 -41890 87528 101601 65757 -61605 217020
12811e0714j65816G546e6290A37707b48607A99959a06120k49477A07906a43475
$$ -50714 -216530 7546 -56290 137707 -248607 199959 -106120 -355597 107906 -143475
12800c6603j35445B914a72641D0771a80891B09011f0344f545A25418i5785k10862
$$ -36603 -172048 2914 -172641 40771 -180891 209011 -60344 -6545 125418 -95785 -306647
12789c06647I6416l2311a11080C55971j47195B6623R803L07385e6036F4561i7551
$$ -306647 96416 64105 -111080 355971 208776 26623 36426 343811 -56036 64561 -97551
12777C08416A00171a31455d2832B7365i6376C1457Q2698b77177b9935A350a13883
$$ 308416 100171 -131455 -42832 27365 -96376 31457 114155 -277177 -29935 1350 -113883
12765d9986B535i5781A8568R4147b58551J27276c519o2104J6190a1440e126C4904
$$ -49986 2535 -95781 18568 112715 -258551 -131275 -3519 -65623 -49433 -11440 -5126 34904
12752d8055F377a42422C1563c77252A79796n7002K0576h560B06189c3948a0197
$$ -48055 6377 -142422 31563 -377252 179796 122794 143370 -8560 206189 -33948 -10197
12740B21692c9709B32224B5134K46407f908q0807H6123Q5398J53657d5637A7620
$$ 221692 -39709 232224 25134 271541 -6908 -87715 86123 171521 325178 -45637 17620
12728h2161j62185J06558m3457b0358k20623g0408J1052A54681B815a74854A33124
$$ -82161 -244346 -137788 -181245 -20358 -240981 -70408 -59356 154681 2815 -174854 133124
12716b42812A64252m6360h0216k3311l71852J26851G8531C2676K30709C6120o672
$$ -242812 164252 117892 -80216 -103527 -475379 -348528 78531 32676 263385 36120 29448
12705B9448f5990A62221Q3031C3756J39593K63020N4118B37423b44379B19684
$$ 29448 -65990 162221 245252 33756 173349 436369 490487 237423 -244379 219684
12694a16926a3093j79344A33273E8701b6310A26510L34410C0811a41420M5073
$$ -116926 -13093 -192437 133273 58701 -26310 126510 460920 30811 -141420 -96347
12684i6347D24754A07021a5546A72103c17146R2616B05548G8981a8192B51612
$$ -96347 424754 107021 -15546 172103 -317146 -224530 205548 78981 -18192 251612
12673a9105B394d3986A5291K17809b36787J17411a590I6364a36523E759M7214
$$ -19105 2394 -43986 15291 233100 -236787 -119376 -1590 96364 -136523 5759 52973
12662E2973G501O8383O3640a18712G6933P8291f6238j8964e071C8462K18709A08302
$$ 52973 7501 75884 139524 -118712 76933 155224 -66238 -85202 -5071 38462 257171 108302
12649C54623r9231K31805d8862B37033a77715A87774P14H5844b74958a18605F2871
$$ 354623 255392 487197 -48862 237033 -177715 187774 188488 85844 -274958 -118605 62871
12637D589a47819H6951g1331j48905G623J14886a15592B52731l5801b31148E5436
$$ 4589 -147819 86951 -71331 -220236 7623 122509 -115592 252731 216930 -231148 55436
12625d7721C21188a11835A41706o5857J01639e2405l6810B0804a17241C384a34996
$$ -47721 321188 -111835 141706 75849 177488 -52405 -89215 20804 -117241 3384 -134996
12613C7984a42374C03565c19839C67165I8288l0491b08504B47282a02587C9221
$$ 37984 -142374 303565 -319839 367165 98288 67797 -208504 247282 -102587 39221
12602F37K8761K26710j24104a48276B54355a1421B97102C4717d5239A93657a00953
$$ 637 29398 256108 132004 -148276 254355 -11421 297102 34717 -45239 193657 -100953
12590H4154g5401D5039b374j53353B71936k5344b9302a3269A55109c82022C02836
$$ 84154 -75401 45039 -2374 -155727 271936 246592 -29302 -13269 155109 -382022 302836
12578i7171B49607g9992B47977d0903j39422A10314K88789E008M3433a32325A65245
$$ -97171 249607 -79992 247977 -40903 -180325 110314 399103 5008 48441 -132325 165245
12566b55956A6985b71232A34627a36541A09453B8136b204A03362R7935h1085A08585
$$ -255956 16985 -271232 134627 -136541 109453 28136 -2204 103362 201297 -81085 108585
12554C07989A39123b56786e2564C9339a06573o3958B3536J70278r5330B7502e4137
$$ 307989 139123 -256786 -52564 39339 -106573 -170531 23536 193814 98484 27502 -54137
12542B95617b92055A3219a35588F312f4206m3035C2810J24647h9891q3678C4922
$$ 295617 -292055 13219 -135588 6312 -64206 -107241 32810 157457 -89891 -173569 34922
12530f0030l47645C4011b5364j6595E771O2929a00307j4991j76844J32186d8523
$$ -60030 -407675 34011 -25364 -41959 5771 68700 -100307 -115298 -292142 -159956 -48523
12518A3586L0558J89634B6869J56887J32841c9738n319j59806P8033c9137D4484
$$ 13586 44144 233778 26869 183756 316597 -39738 -45057 -204863 -126830 -39137 44484
12506B70844C6702b99637Q3619h3522Q629p4701h066m0035k65852B9460J17619
$$ 270844 36702 -299637 -216018 -83522 -74893 -149594 -8066 -48101 -313953 29460 147079
12495A47079f6827q2311G381P8604a58647D6763d8694k80259G7748J15858h6751
$$ 147079 -66827 -149138 7381 85985 -158647 46763 -48694 -328953 77748 193606 -86751
12483b3088F7585c11565c9697a465j1807c643A37059b69624A27195b5372D7288
$$ -23088 67585 -311565 -39697 -1465 -13272 -3643 137059 -269624 127195 -25372 47288
12471a68425e977C06907q1522b58492D2406a8349A25876m4812l9053Q67L2424
$$ -168425 -5977 306907 225385 -258492 42406 -18349 125876 81064 42011 42878 75302
12460G5302K17565i2591C20482n8673b60329D0447J59911J2243n4481a2442j18718
$$ 75302 292867 -92591 320482 261809 -260329 40447 200358 212601 158120 -12442 -131160
12449a31160I0150a85813k26359A18183a58639I3493g6048H6842O9259c0895l0039
$$ -131160 90150 -185813 -412172 118183 -158639 93493 -76048 86842 156101 -30895 -60934
12438f0934P897F7326a63636M5954N7676K5973E0106J74606C6288a38813A04726
$$ -60934 -53037 67326 -163636 -117682 -60006 -34033 50106 224712 36288 -138813 104726
12426a90511k5406R1449a1524k38887a13283k56825b2353A0783b20746C3175a31382
$$ -190511 -215917 -124468 -11524 -250411 -113283 -370108 -22353 10783 -220746 33175 -131382
12414A85701R2076a74637E04042c80849A91131g2197l00587a00059B04736e5117
$$ 185701 277777 -174637 504042 -380849 191131 -72197 -372784 -100059 204736 -55117
12403c6910h160B6422a54075A033a8199l16217a53925o4422C84617a51212b4211
$$ -36910 -8160 26422 -154075 1033 -18199 -334416 -153925 -218347 384617 -151212 -24211
12391b42526I3914M1777A8705J73412k3490e0514r2200c0540B3753J83742g619
$$ -242526 93914 135691 18705 192117 168627 -50514 -142714 -30540 23753 207495 -7619
12379A43559K83449A74450q2572J07451C4327b6931A52981a76614O0755K0898
$$ 143559 427008 174450 91878 199329 34327 -26931 152981 -176614 -115859 -94961
12369i4961K2966I5827J788c01328M255A2176J11039c69232h8894j24546b551
$$ -94961 -71995 95827 97615 -301328 -297073 12176 123215 -369232 -88894 -213440 -2551
12357A37276a57693G3797L8130a17338k25M3236B4411J12341n5552h5497e764
$$ 137276 -157693 73797 111927 -117338 -117563 -74327 24411 136752 81200 -85497 -5764
12345b60362d3571l3976A92030p8945h1354A78076a29244A27155a75104j5856
$$ -260362 -43571 -77547 192030 113085 -81354 178076 -129244 127155 -175104 -190960
12335a90960A81090a27876F5623a86945A82480a08380B12765J85737A3288M48255
$$ -190960 181090 -127876 65623 -186945 182480 -108380 212765 398502 13288 461543
12325D61543H6314a2545C12129o4941G7094N9227J1684a87071A8151K60801j19529
$$ 461543 86314 -12545 312129 247188 77094 136321 148005 -187071 18151 278952 159423
12314A59423c2217A24942P616b02978A95341b22499C48107a25953a7024B20555
$$ 159423 -32217 124942 132558 -202978 195341 -222499 348107 -125953 -17024 220555
12303A68428A4585c7319A15025N7507b01352d501A06455J96535b98056E6536M1315
$$ 168428 14585 -37319 115025 172532 -201352 -4501 106455 302990 -298056 56536 97851
12292I7851K02879c3305H137g1702C82670A32885j0610b2998q572A40626K0360
$$ 97851 300730 -33305 8137 -71702 382670 132885 122275 -22998 -31570 140626 160986
12281A60986b1742j48862F7663j0849b78765A45829J99631E9484L48402e932B25364
$$ 160986 -21742 -170604 67663 56814 -278765 145829 345460 59484 407886 -5932 225364
12269a22905p2437B23562J15812N3678a19942D50304B24355m1134B6063o907J57914
$$ -122905 -195342 223562 339374 393052 -119942 450304 224355 183221 26063 19156 177070
12258A77070J84913K31002B55308c6124A45403h9173B99397j31369M72817A05809
$$ 177070 361983 592985 255308 -36124 145403 -89173 299397 168028 640845 105809
12247C49626A35232l5241K06417j04335M4078d9804A93267L3174l2725E5769N4751
$$ 349626 135232 99991 306408 202073 246151 -49804 193267 226441 193716 55769 110520
12236A10520J19462A3379a20149j60441B97533A09384b9206j45828j35029C68459
$$ 110520 229982 13379 -120149 -280590 297533 109384 -29206 -175034 -310063 368459
12225c89243A08105K33029a69464H5766J28510h7376A97657l6210L2322p6131
$$ -389243 108105 341134 -169464 85766 214276 -87376 197657 161447 193769 117638
12215A17638K52533A11539K83139C7466a5737A66155a4330k02472g9927A21262
$$ 117638 370171 111539 394678 37466 -15737 166155 -14330 -216802 -79927 121262
12204a14811M4798C20771M6628A55555G2849K16099D1022L42340J02891B308L14429
$$ -114811 -70013 320771 367399 155555 72849 288948 41022 383362 486253 2308 316737
12193C16737a92780A17783J80931e9125q7926e9313D62864j84761A39021M86628
$$ 316737 -192780 117783 298714 -59125 -147051 -59313 462864 278103 139021 625649
12183F25649B27953L3777A14392k9110e1991E4205b3473D04006j97200J19662
$$ 625649 227953 261730 114392 85282 -51991 54205 -23473 404006 206806 326468
12173C26468A18604E0016K43184N7684A07847K1117K75679J866b3269p8358B77251
$$ 326468 118604 50016 293200 350884 107847 128964 404643 406509 -23269 -101627 277251
12161d1771C99942D3668K68768o2194N6254A29452O5550m6832M4575j9093a61577
$$ -41771 399942 43668 312436 250242 306496 129452 195002 148170 192745 173652 -161577
12149B65908Q0756H5401a63099c7044H8473D17M8000J4949j1374M6181A3141e3924
$$ 265908 346664 85401 -163099 -37044 88473 417 48417 63366 51992 98173 13141 -53924
12136B76573a694F6284J41566N7840q0196b81353G9914e9830o9421j66444B28104
$$ 276573 -1694 66284 207850 265690 185494 -281353 79914 -59830 -129251 -295695 228104
12124A66945q1578a01512H5604L3175K23074p0826j7493E6357b5373A86407J52791
$$ 166945 85367 -101512 85604 118779 341853 271027 253534 56357 -25373 186407 339198
12113C39198k615A65720K07107A04677J20286r5674K78221B03067b7712A59310
$$ 339198 336583 165720 372827 104677 224963 129289 407510 203067 -27712 159310
12102a05251B39203A12312b061B88338b266A54170B3160d6264C57854A8433a3661
$$ -105251 239203 112312 -2061 288338 -2266 154170 23160 -46264 357854 18433 -13661
12090b08659J5668C11068D0011O8379K08951i9358A68314M8553I6358d0364C04447
$$ -208659 -192991 311068 40011 108390 317341 -99358 168314 216867 96358 -40364 304447
12078g6361B65709A12929e473C8593J67838K56075A67620B5616g2429B47061J02596
$$ -76361 265709 112929 -5473 38593 206431 462506 167620 25616 -72429 247061 349657
12067C49657j53834E8450L40743c4632G7760J77116F0701J32910d7406D43824
$$ 349657 195823 58450 399193 -34632 77760 254876 60701 193611 -47406 443824
12056D4960M2819P7880b76720B25169c63764f0758D6985L6184J52759F7472J50142
$$ 44960 87779 165659 -276720 225169 -363764 -60758 46985 83169 235928 67472 217614
12045B17614g1642k8179j58D3799a46036m1985F8945B3798b15642j8088A17393
$$ 217614 -71642 -99821 -99979 43799 -146036 -188021 68945 23798 -215642 -233730 117393
12033a21103E889J7283a56989L8768C69522a16542c2207k76625A73385c5325B95217
$$ -121103 5889 23172 -156989 -118221 369522 -116542 -32207 -308832 173385 -35325 295217
12021b20527h0555A92480e1421A20136C0837L9537g6952k24688A27455E9200J71074
$$ -220527 -80555 192480 -51421 120136 30837 70374 -76952 -301640 127455 59200 230274
12010B30274H5214p396J4084a4084A03694M2651J16046A4436L52294g0762j00245
$$ 230274 85214 77818 91902 -14084 103694 146345 262391 14436 366730 -70762 -171007
11999a71007f7250K8958B23420R782C361g7935G5701J00869J37523b0361I1573
$$ -171007 -67250 -38292 223420 233202 3361 -77935 75701 176570 314093 -20361 91573
11987f4084p8901F9954b080A57927a44317B16414I1246O2594l0527a26333J5660
$$ -64084 -142985 69954 -2080 157927 -144317 216414 91246 153840 123313 -126333 -110673
11976a10673A63597b55520A84180d4980B53373e05528A85438i1509k53510J10517
$$ -110673 163597 -255520 184180 -44980 253373 -505528 185438 -91509 -345019 -234502
11966b34502D97653A52591O2892a51991K1298b828A93682J5844f3246j76709a17907
$$ -234502 497653 152591 215483 -151991 -130693 -2828 193682 209526 -63246 -239955 -117907
11954e3888k78972a15576j33483f4269m1195l21146l0388J12955A72243b05990
$$ -53888 -332860 -115576 -249059 -64269 -105464 -426610 -456998 -344043 172243 -205990
11943a64682N1641b5199O821B76619A04699g3504C29548c9274m7734G3591g8274
$$ -164682 -113041 -25199 -18378 276619 104699 -73504 329548 -39274 -87008 73591 -78274
11931a10521j66997k0780a34949e6930B78021c63773A05514l836A9542H67h8815
$$ -110521 -277518 -298298 -134949 -56930 278021 -363773 105514 101678 19542 867 -88815
11919a51657m46982G9285c5194m6612k87894A40987a45956a189F8477a32854N0925
$$ -151657 -598639 79285 -35194 -81806 -369700 140987 -145956 -1189 68477 -132854 -81929
11908h1929j44922B6941a91972C3454J34565g4550j26827C41416A43999a2177
$$ -81929 -226851 26941 -191972 33454 168019 -74550 -201377 341416 143999 -12177
11897b69721K1448I7765J6740e242C61069A53521H393K30560F5389O4851g0949
$$ -269721 -248273 97765 114505 -5242 361069 153521 8393 238953 65389 130240 -70949
11885A66244E3473C375d5705K0893H2126J41147K18104c5386j1495A21000g6955
$$ 166244 53473 3375 -45705 -24812 82126 223273 441377 -35386 -46881 121000 -76955
11873g9342m16087b24197D9775c65557B03022h2335L3848A39597g5012A69177
$$ -79342 -495429 -224197 49775 -365557 203022 -82335 -48487 139597 -75012 169177
11862A33764R8470C2035P4199C2209J25563b6440j19440j35233A68241b23022
$$ 133764 232234 32035 106234 32209 157772 -26440 -145880 -281113 168241 -223022
11851c19375I3432a94263B31677C5808a05056K2206A00623c53159B44752q5862
$$ -319375 93432 -194263 231677 35808 -105056 -82850 100623 -353159 244752 158890
11841A58890f3268J5274k01363C0500h2532l102A58392a58996C4688N1064a51878
$$ 158890 -63268 -47994 -249357 30500 -82532 -85634 158392 -158996 34688 85752 -151878
11829D0232N2027c77845C513a1847I0017a49168A09098k1694R8928R1132j18922
$$ 40232 92259 -377845 3513 -11847 90017 -149168 109098 87404 186332 277464 158542
11818A58542b2050B45827a08250j14470K889q1607A1178a82205d036j2926A53951
$$ 158542 -22050 245827 -108250 -222720 -219831 -301438 11178 -182205 -4036 -16962 153951
11806H1307a07751E2149a6114k08571r1328g1018b9908B03075J7942A7618a50601
$$ 81307 -107751 52149 -16114 -224685 -316013 -71018 -29908 203075 221017 17618 -150601
11794a27996A1365b27408c5942o9127E811c07944B15556M5094h3307A3142K21523
$$ -127996 11365 -227408 -35942 -105069 5811 -307944 215556 260650 -83307 13142 234665
11783B34665a67322B748b40721H4754b09999E0675g7069k1932k62297A24761a00727
$$ 234665 -167322 2748 -240721 84754 -209999 50675 -77069 -99001 -361298 124761 -100727
11771h027j17236G2050J00156i2497l12569d8541I4930d04955e0351l36926a33850
$$ -8027 -125263 72050 172206 -92497 -405066 -48541 94930 -404955 -50351 -387277 -133850
11759f4555H3574J11638f2619G9182a20980A50422c1969j10476m7533c6558k43336
$$ -64555 83574 195212 -62619 79182 -120980 150422 -31969 -142445 -189978 -36558 -279894
11748b79894A29882e31015i2129j92590J21502b4004D2678b98934B37235A06487
$$ -279894 129882 -531015 -92129 -284719 -163217 -24004 42678 -298934 237235 106487
11737e1780g0A13780D7913c1661H0196J843b42539b7517H2181q594L1439K02246
$$ -51780 -70 113780 47913 -31661 80196 82039 -242539 -27517 82181 73587 105026 307272
11725C07272d1573m6596k6230A93050q0220L6218a11739L7132B09551b19058A59867
$$ 307272 -41573 -88169 -114399 193050 112830 149048 -111739 -74607 209551 -219058 159867
11713B9698r235a31090K6131K3958L0569D4589h0852G3195M1946L0244J50373
$$ 29698 20463 -131090 -104959 -81001 -50432 44589 -80852 73195 115141 145385 295758
11702B95758F8741J27862h9290B41460n5219J3121b50386A97608G0138b2557G4516
$$ 295758 68741 196603 -89290 241460 186241 199362 -250386 197608 70138 -22557 74516
11690A49675B8276a99188B37522e0779A86483b47954A58390a04140o8688j5262
$$ 149675 28276 -199188 237522 -50779 186483 -247954 158390 -104140 -172828 -188090
11680a88090F1288c9514H3265K47034A39061B1826K64950m6426a10917C5161J92496
$$ -188090 61288 -39514 83265 330299 139061 21826 286776 240350 -110917 35161 227657
11669B27657G3465a52792C62726a67192B8669J40055c12167B55799i1143m120
$$ 227657 73465 -152792 362726 -167192 28669 168724 -312167 255799 -91143 -95263
11659i5263A36991l1005C7459J46159A6659K85738b03207j79840J82473r7941
$$ -95263 136991 105986 37459 183618 16659 302397 -203207 -383047 -200574 -298515
11649b98515A0864J06526n4076R0497A9875f1907A52807n8075c4579k5279F8628
$$ -298515 10864 117390 63314 153811 19875 -61907 152807 94732 -34579 -59858 68628
11637D48366k16627A8451a17577N7341j06260E8930L75944a52709k8470N8664
$$ 448366 231739 18451 -117577 -60236 -166496 58930 434874 -152709 -181179 -122515
11627a22515D0289K37996e7089G8053c97190d5608B32254D1094P5887a33341B96793
$$ -122515 40289 278285 -57089 78053 -397190 -45608 232254 41094 116981 -133341 296793
11615e7713b3432k10626A18613a33880n6627k6520A51927P2434a24503B0133a58227
$$ -57713 -23432 -234058 118613 -133880 -190507 -217027 151927 224361 -124503 20133 -158227
11603A6232Q4651K67694D7946d8404q3099A08509l3720P061i6715B83330a29193
$$ 16232 100883 368577 47946 -48404 -131503 108509 74789 81850 -96715 283330 -129193
11591C90082a28505B0816J85024G3726h4855j17265A89098h9166A62019p4786
$$ 390082 -128505 20816 205840 73726 -84855 -202120 189098 -89166 162019 87233
11581H7233e9553K9688B22495r2178k3555O0737i9647A28911d3602C7889h1336
$$ 87233 -59553 -29865 222495 130317 106762 167499 -99647 128911 -43602 37889 -81336
11569A80069A8975K170K01759a29117B8251K03472o6121a24304N6018B08645F2520
$$ 180069 18975 21145 222904 -129117 28251 231723 165602 -124304 -68286 208645 62520
11557g7372m0457A46324n6317R9948b13036j2132B14062a69669j12992B08100
$$ -77372 -117829 146324 90007 189955 -213036 -225168 214062 -169669 -282661 208100
11546G9766a92403H1864l0841N5736N834n5689n596J94876a1174j0943B7086R3994
$$ 79766 -192403 81864 51023 106759 112593 56904 51308 246184 -11174 -22117 27086 121080
11534A21080c70244A06513a7340A79026A3693b1802A66769J31360I5275c4941
$$ 121080 -370244 106513 -17340 179026 13693 -21802 166769 298129 95275 -34941
11523B73142a1312B59783O6270A16061B0703c06909a1992C9994J54816d3421G4835
$$ 273142 -11312 259783 326053 116061 20703 -306909 -11992 39994 194810 -43421 74835
11511h523n68B0959R0833m9363M8405a61195B5432K52223j18222J62565A50181
$$ -8523 -9091 20959 111792 62429 110834 -161195 25432 277655 159433 321998 150181
11499G0179h4561F4153M3140m2540P2942N7280J6340b24503h8725B44099K8222
$$ 70179 -84561 64153 107293 64753 137695 194975 211315 -224503 -88725 244099 272321
11488B72321j18866k9697d2567I2631e8129j28509r9352b8548D3780L18255A27857
$$ 272321 153455 123758 -42567 92631 -58129 -186638 -285990 -28548 43780 362035 127857
11476G5476a58367C28369b55415B28634M175E4873f7589j173E1662e5212E5629
$$ 75476 -158367 328369 -255415 228634 232809 54873 -67589 -68762 51662 -55212 55629
11464A36701J24038A00612J42711b1731k77079D0913J34046G7847a07433b2931
$$ 136701 260739 100612 243323 -21731 -298810 40913 174959 77847 -107433 -22931
11453A97609D5709a01817A35684A3704g0958A42086n9858P5565o6021E240c49315
$$ 197609 45709 -101817 135684 13704 -70958 142086 82228 157793 91772 5240 -349315
11441b90033D2024c4694D72941A13734E0393a58835D15978b5722j31464D62404
$$ -290033 42024 -34694 472941 113734 50393 -158835 415978 -25722 -157186 462404
11430H0489i6705K5882n1133D3269a84803C10600b8886j17256c0454l7753B3913
$$ 80489 -96705 -70823 -121956 43269 -184803 310600 -28886 -146142 -30454 -68207 23913
11418C8063a79714g1003m257o0866d4161A99286a1947B4205a28237B57331b0893
$$ 38063 -179714 -71003 -75260 -136126 -44161 199286 -11947 24205 -128237 257331 -20893
11406C9845M6372A2564K99958a83147Q6372j04644g3285E0513P0051O116c5474
$$ 39845 86217 12564 312522 -183147 -96775 -201419 -73285 50513 120564 126680 -35474
11394C6324a61094d0536D7810M9615c523j47552A91094a5534B490a72110A78255
$$ 36324 -161094 -40536 47810 97425 -3523 -151075 191094 -15534 2490 -172110 178255
11382c6972j67668B35873b18996d807k16110d9267D82384c2859r5768B38431A8742
$$ -36972 -204640 235873 -218996 -4807 -220917 -49267 482384 -32859 -128627 238431 18742
11370A32665L10397b05088i3712q0701B3703a15337l3469d9033j551r6511G0239
$$ 132665 443062 -205088 -93712 -174413 23703 -115337 -148806 -49033 -50584 -147095 70239
11358i1152B02739c9016j49851B04118a96698h6918D39825E2136a19481i62j65422
$$ -91152 202739 -39016 -188867 204118 -196698 -86918 439825 52136 -119481 -962 -166384
11347a66384g3426E6080b93244F9041A3506b11468a6743A04429a02782I3969K12029
$$ -166384 -73426 56080 -293244 69041 13506 -211468 -16743 104429 -102782 93969 305998
11336C05998a63442j99247a11583D9793L2001J71772c23992o499A01721a8278
$$ 305998 -163442 -362689 -111583 49793 81794 253566 -323992 -330491 101721 -18278
11325a11837k36859a70814C59358E3893O1975a96287b3732C70391b40676D0917
$$ -111837 -348696 -170814 359358 53893 115868 -196287 -23732 370391 -240676 40917
11314b02964A43523a12822A23646b48817K8522D3156K64850e12j81867B39460
$$ -202964 143523 -112822 123646 -248817 -220295 43156 308006 -512 -182379 239460
11303G9169j7491k4801g5178a3963j94040K4882B57974a30664B55400g8404b6845
$$ 79169 61678 36877 -75178 -13963 -208003 -183121 257974 -130664 255400 -78404 -26845
11291E068c9009j96281C3361g6954A02231b2824A65471B7419l944a32834A42363
$$ 5068 -39009 -235290 33361 -76954 102231 -22824 165471 27419 23475 -132834 142363
11279a41099A48949b77363B26197D7793a51455M6884l836L0635b1225B1081J91949
$$ -141099 148949 -277363 226197 47793 -151455 -104571 -108407 -77772 -21225 21081 213030
11268B13030J13797o2481j04674b69298E4015N5275b10298p9385a5710m48876
$$ 213030 326827 264346 159672 -269298 54015 109290 -210298 -289683 -15710 -464586
11258d64586c0041j11851A89109g7619A7913c8261m86805I1948d7838A34514d2325
$$ -464586 -30041 -141892 189109 -77619 17913 -38261 -525066 91948 -47838 134514 -42325
11246B99505C6817i4856A03846C3067i5178G0247B9982a4079A07349c2577j13886
$$ 299505 36817 -94856 103846 33067 -95178 70247 29982 -14079 107349 -32577 -146463
11235a46463K4068A35663b35096A35061b52110I8161k5411d49279a1279j8020
$$ -146463 -122395 135663 -235096 135061 -252110 98161 72750 -449279 -11279 -29299
11225b9299l18573C8649K61494a27931A35884A7949b50740j44538A30255J70191
$$ -29299 -347872 38649 300143 -127931 135884 17949 -250740 -395278 130255 300446
11215C00446A19135e838F5827j8731b5144j15198j11531a18085j14832o3683P3316
$$ 300446 119135 -5838 65827 47096 -25144 -140342 -251873 -118085 -232917 -296600 -223284
11204b23284p8665A47248c20847N9733A69356d97867a5521j19644m9479j10534
$$ -223284 -301949 147248 -320847 -261114 169356 -497867 -15521 -135165 -184644 -295178
11194b95178f1392A97534B5531b26020d0462j34370D3420d6391r576k61652e4187
$$ -295178 -61392 197534 25531 -226020 -40462 -174832 43420 -46391 -55967 -317619 -54187
11182a52768r6840A48137c031q3591r8173d3872o482D2694a38362J7974p9335
$$ -152768 -249608 148137 -3031 -86622 -184795 -43872 -50354 42694 -138362 -120388 -199723
11171a99723R4867j7301j84040J32098D640a12103j0197I3090a6640l27074c0585
$$ -199723 -104856 -122157 -306197 -174099 4640 -112103 -122300 93090 -16640 -343714 -30585
11159a02645j09399B9232J46191C0379J1559K17532m9678e0448C9941g3514q2109
$$ -102645 -212044 29232 175423 30379 41938 259470 209792 -50448 39941 -73514 -155623
11148a55623j67132G9008C0684h4600l53566A83602a18651F9396c02346a06283
$$ -155623 -322755 79008 30684 -84600 -438166 183602 -118651 69396 -302346 -106283
11137C8902A2374g0083b0519A17338f3746E3725a90296P8825n2032k5889B48216
$$ 38902 12374 -70083 -20519 117338 -63746 53725 -190296 -111471 -163503 -189392 248216
11125e8972K3543O377n5042d082A62572N1199M6207a02905j68114a27341k50492
$$ -58972 -35429 -29052 -84094 -4082 162572 213771 259978 -102905 -271019 -127341 -377833
11114c77833B77665A24819J2315M2435L6419F3773b78202b8067j39218I5154Q1526
$$ -377833 277665 124819 137134 179569 215988 63773 -278202 -28067 -167285 95154 176680
11103A76680o6849h2018A24884m9663a99397D5479K72211j12750h4383B27052
$$ 176680 109831 -82018 124884 75221 -199397 45479 317690 204940 -84383 227052
11092A63569a01959B5455g484F3070j5075K81170j4721b3623A1793J46836M2203
$$ 163569 -101959 25455 -7484 63070 47995 329165 314444 -23623 11793 158629 200832
11081B00832P5433B9186b08569E14322A34041J64258D7549K7575K92487j18299
$$ 200832 276265 29186 -208569 514322 134041 298299 47549 75124 367611 249312
11071B49312q6152L21074a4588C12018k7336k2960j08271K6040L32786j24682
$$ 249312 163160 484234 -14588 312018 284682 261722 153451 179491 512277 387595
11061C87595l9861J6708n3324J86625j66586q3136L59337B56347M4474J06877
$$ 387595 347734 364442 311118 497743 331157 248021 607358 256347 300821 407698
11051D07698K18005j35073N6719R1274B71334J34819O0826q701j9435L39071q1956
$$ 407698 625703 490630 547349 638623 271334 406153 466979 458278 438843 777914 695958
11040F95958j58977J30749L04747l01077j0349j75201K85118j54962L39049l05040
$$ 695958 536981 667730 972477 671400 661051 485850 770968 616006 955055 650015
11030F50015k80687M3379J14504N192J85362J6934K99664l34954r1200o5537j98595
$$ 650015 369328 412707 527211 532403 717765 734699 1034363 699409 608209 542672 344077
11019C44077J58263B20494G1189M99825L71790D67784M7380Q7555K60584B68677
$$ 344077 502340 220494 71189 571014 942804 467784 515164 602719 863303 268677
11008D72086j56816L4180J5597K64650j48159J14111k85220J96484j40633m5318
$$ 472086 315270 349450 365047 629697 481538 595649 310429 506913 366280 320962
10998C20962K9647L09173J38249j96124k35866q6642J61182R3963Q0017R777K45555
$$ 320962 350609 659782 798031 601907 366041 279399 440581 534544 614561 624338 869893
10987H69893l41119L14061K2562R4217k35208J87295J18975j10795O0945l01138
$$ 869893 528774 842835 865397 959614 724406 911701 1030676 919881 980826 679688
10977F79688j23076M01681K15736J20309P0817m7804M69574p9660O03657k39283
$$ 679688 556612 958293 1174029 1294338 1365155 1317351 1786925 1707265 2310922 2071639
10967B071639J77355K17079n41059l957q0684K1447j11844P820J08993M3511m68603
$$ 2071639 2248994 2466073 1925014 1921057 1840373 1861820 1749976 1757796 1866789 1910300 1441697
10956A441697J29630M92762l43539l15612J44883K7214k18765P8041j06439k35708
$$ 1441697 1571327 2064089 1720550 1404938 1549821 1577035 1358270 1436311 1329872 1094164
10946A094164m59298J995B05488M35909a40176O4771C04628A39854J16468m6861
$$ 1094164 634866 636861 205488 641397 -140176 -75405 304628 139854 256322 209461
10936B09461K1708C541c9124J4189A31048C7291M2191K33922G2233L1579b69188
$$ 209461 231169 3541 -39124 -24935 131048 37291 79482 313404 72233 103812 -269188
10924A0458a22286D4603J46270h3630a488F8756a20657B22305B0990J67345d4807
$$ 10458 -122286 44603 190873 -83630 -1488 68756 -120657 222305 20990 188335 -44807
10912A60271l3572a12506k3391e3178G6057c36516c7669B0515N2246k3131L93075
$$ 160271 126699 -112506 -135897 -53178 76057 -336516 -37669 20515 72761 49630 442705
10901D42705a08641B63423a69397A91071J2539d2743j6398l02370j90799E5610
$$ 442705 -108641 263423 -169397 191071 203610 -42743 -59141 -361511 -552310 55610
10890a17842r02k24982I4406P665e6070k1597a6826m9302C48219a9161A26468
$$ -117842 -118744 -343726 94406 102071 -56070 -77667 -16826 -66128 348219 -19161 126468
10878A60265J26783a1132j05647A96667D3342a49178F4136a57605L3112L8894
$$ 160265 287048 -11132 -116779 196667 43342 -149178 64136 -157605 -124493 -85599
10868h5599j00033j87820a01162k4243c6235l65813H8791d5177A01756A7377K62849
$$ -85599 -185632 -373452 -101162 -125405 -36235 -402048 88791 -45177 101756 17377 280226
10857B80226c5934B2289b00821c4545l30284A18308a24057A00162i5897q4578
$$ 280226 -35934 22289 -200821 -34545 -364829 118308 -124057 100162 -95897 -180475
10847a80475A02021R8554h0852A73464P0113a40220n557C1085b1071j1517B6724
$$ -180475 102021 200575 -80852 173464 243577 -140220 -145777 31085 -21071 -32588 26724
10835B83574c13839A14242a37600G0557J5487a35376j66473K8311A27428L7211
$$ 283574 -313839 114242 -137600 70557 86044 -135376 -301849 -273538 127428 164639
10825A64639a94318F5201R362O7902g703j27767b9363B9348b25823g7385l41512
$$ 164639 -194318 65201 74563 142465 -7703 -135470 -29363 29348 -225823 -77385 -418897
10814d18897J86726e8975F0681g1603A20840c02020P7840I9360D9656M206E502
$$ -418897 -232171 -58975 60681 -71603 120840 -302020 -224180 99360 49656 53862 5502
10802c75005B24808c83012F662J34475E8828b25614e5255l03906R9973J06842
$$ -375005 224808 -383012 6662 141137 58828 -225614 -55255 -359161 -259188 -152346
10792a52346M613K3662C3868h8191j84167G7059C3999e6051C19144j04693d6423
$$ -152346 -147733 -124071 33868 -88191 -272358 77059 33999 -56051 319144 214451 -46423
10780b67718N4969E9557N5265a68059B974a36193j11441h579B18176b81463i902
$$ -267718 -212749 59557 114822 -168059 2974 -136193 -247634 -8579 218176 -281463 -9902
10768a59713k14700C67057j75678h3785I3756f08270g2045j19679j02235B16476
$$ -159713 -374413 367057 191379 -83785 93756 -608270 -72045 -191724 -293959 216476
10757I7811c69700B3401K53667F7527K0144R0846c45310a6344m3521k1541a6729
$$ 97811 -369700 23401 277068 67527 87671 178517 -345310 -16344 -59865 -81406 -16729
10745F1636c17194J02670B28181b05594A56975J6855g8926b7572k69581J45117
$$ 61636 -317194 -214524 228181 -205594 156975 173830 -78926 -27572 -297153 -152036
10735a52036B99536I0495a09038M4206F7181a89387A12942a48290b9964k6150
$$ -152036 299536 90495 -109038 -64832 67181 -189387 112942 -148290 -29964 -56114
10725e6114l1187C10669a69448g1656A40161m9014c66625c8884H5613J96742b5715
$$ -56114 -87301 310669 -169448 -71656 140161 91147 -366625 -38884 85613 282355 -25715
10713H4319a90264K1011C5378J1a17233G4718a39681a6904j35775j05906e3362
$$ 84319 -190264 -169253 35378 35389 -117233 74718 -139681 -16904 -152679 -258585 -53362
10701B57917a58559d0445m0215c8975A25822m6425c0777a3630B2708i4639k39963
$$ 257917 -158559 -40445 -80660 -38975 125822 79397 -30777 -13630 22708 -94639 -334602
10690c34602A01719b33987f2709k98984a8170A95186M4250F8479b98034i7093
$$ -334602 101719 -233987 -62709 -361693 -18170 195186 239436 68479 -298034 -97093
10679a19761e7661j50833j2394d1824l64920J64748l39205K72799B30658a35899
$$ -119761 -57661 -208494 -220888 -41824 -406744 -241996 -581201 -308402 230658 -135899
10668A52447n3140K40233c7198A1166a63482e747A04024k2292c5239l23907J55123
$$ 152447 99307 339540 -37198 11166 -163482 -5747 104024 81732 -35239 -359146 -204023
10657b04023J00154k21907I6828i2816j74266O4023O1011g898p0759B82295j25799
$$ -204023 -103869 -325776 96828 -92816 -267082 -203059 -142048 -7898 -78657 282295 156496
10646A56496g0221E2138J3310a55651E6867k3278b83259G4418C3575P8330a84980
$$ 156496 -70221 52138 65448 -155651 56867 33589 -283259 74418 33575 111905 -184980
10634c60518r6904a59981j15931c2934e805j54916A98077r6295d50475e6094O865
$$ -360518 -457422 -159981 -275912 -32934 -5805 -160721 198077 101782 -450475 -56094 -49229
10623d9229q3386G2798C4804h7018A12440e5977F4071f0676k84829B74619c22270
$$ -49229 -132615 72798 34804 -87018 112440 -55977 64071 -60676 -345505 274619 -322270
10611a65122D9322j4619a13192A3062J04421J300b33822f2467A31332g0710j18195
$$ -165122 49322 34703 -113192 13062 117483 118783 -233822 -62467 131332 -70710 -188905
10600a88905c1783p8123A75710A7178J42607n6204A4603a24980k71774a9405j28696
$$ -188905 -31783 -109906 175710 17178 159785 103581 14603 -124980 -396754 -19405 -148101
10589a48101n3991J2932i2712A19464b24706B7889i8005B54960G3468o977K17948
$$ -148101 -202092 -189160 -92712 119464 -224706 27889 -98005 254960 73468 66491 284439
10578B84439b34859A45429F0969O9545b4404I875c95736G607b53073a07045A63061
$$ 284439 -234859 145429 60969 130514 -24404 9875 -395736 7607 -253073 -107045 163061
10566A71007b7244j12575H2671a86683i1848C65401A06897c5853B3213J53298
$$ 171007 -27244 -139819 82671 -186683 -91848 365401 106897 -35853 23213 176511
10556A76511J5081a89137K6776e3155k36654I5122d9302j41867A52686a97568
$$ 176511 191592 -189137 -162361 -53155 -289809 95122 -49302 -191169 152686 -197568
10545c8966m85607G9042a64051Q832A14846L05731E4862K3670k8281K3250a85435
$$ -38966 -524573 79042 -164051 -155219 114846 420577 54862 78532 50251 73501 -185435
10533G4504H348i0536B9294a32200j17315Q3603C2478b16213A15922e6212k11819
$$ 74504 8348 -90536 29294 -132200 -249515 -165912 32478 -216213 115922 -56212 -268031
10522b68031J19457o1792F4173a10948J7582H2196c55605a15739A40613J11714
$$ -268031 -148574 -210366 64173 -110948 -93366 82196 -355605 -115739 140613 252327
10512B52327c34086a31422c3144I7855a91223A85458b29728e672m09909J62092
$$ 252327 -334086 -131422 -33144 97855 -191223 185458 -229728 -5672 -415581 -253489
10502b53489d2988j62216G3184d9621l3105B50715D2841i615p4015j3737D3307
$$ -253489 -42988 -205204 73184 -49621 -82726 250715 42841 -9615 -83630 -97367 43307
10490C8231J17106L0851a5161M86A13810a24851p6195B9947i786A27386d4328
$$ 38231 155337 186188 -15161 -14675 113810 -124851 -201046 29947 -9786 127386 -44328
10478b13532b1883K893C878K62477r7713k8117J36464N1832O2841a0742j78967
$$ -213532 -21883 -18990 3878 266355 168642 140525 276989 328821 391662 -10742 -189709
10467a89709A01547l2565a521j41878m8658N1399j17359E2737g9464L1295K666
$$ -189709 101547 68982 -1521 -143399 -192057 -140658 -258017 52737 -79464 -48169 -45503
10456d5503j1602p6582m5844K4208A38726a46861c3397k75278L4249D0542e7199
$$ -45503 -57105 -133687 -179531 -155323 138726 -146861 -33397 -308675 -274426 40542 -57199
10444e6723G8536b78817H0848C2125J4128b68058d8162G2220c9897C8093h5361
$$ -56723 78536 -278817 80848 32125 46253 -268058 -48162 72220 -39897 38093 -85361
10432H5932e9817K2474j03745j08705d8107A92516E1081K8702b25446D5521a73542
$$ 85932 -59817 -37343 -141088 -249793 -48107 192516 51081 79783 -225446 45521 -173542
10420d1413o5760o480p3479I1075a28822a4103A20020J57914F7170a73476e7070
$$ -41413 -107173 -113653 -187132 91075 -128822 -14103 120020 277934 67170 -173476 -57070
10408C9365b63313D9153K0451a77160N9062o1343G0119M7699h2973m36317b24246
$$ 39365 -263313 49153 69604 -177160 -118098 -179441 70119 117818 -82973 -519290 -224246
10396a52887r1643b1768j16977a8714A07289a75002B05237o8290F2240A0924K95788
$$ -152887 -244530 -21768 -138745 -18714 107289 -175002 205237 136947 62240 10924 306712
10385C06712a50396A4502J42258n5254J1652b99176A03660e4070B39622O6863
$$ 306712 -150396 14502 156760 101506 113158 -299176 103660 -54070 239622 306485
10375C06485b2530B79157J0419j33310n4953B398a02219A53437L99891k31097
$$ 306485 -22530 279157 289576 156266 101313 2398 -102219 153437 553328 322231
10365C22231l9991H8238M20591B26130J48979j39842M2401j25645K33310I7439
$$ 322231 282240 88238 508829 226130 375109 235267 277668 152023 385333 97439
10354B49990J9171I397L99730j19141q0493J49099J3244j4931j67637k2658J35597
$$ 249990 269161 9397 409127 289986 209493 358592 371836 356905 189268 166610 302207
10343C02207M59k149A48724L38143k17427B5640d3498H9689k2926a9243A05590
$$ 302207 302666 300517 148724 486867 269440 25640 -43498 89689 66763 -19243 105590
10331I4750R8054e1612C15423j28558B1974K51580a83549A41435M1305j6821a59090
$$ 94750 192804 -51612 315423 186865 21974 273554 -183549 141435 182740 165919 -159090
10319d4837B90909o9695F2282a2368H2462L95118a25856J0386E8482B624c8016
$$ -44837 290909 221214 62282 -12368 82462 477580 -125856 -115470 58482 2624 -38016
10307a5246m1566e669l06769f0639k63383J9973M1114N5225A71392b55753n6679
$$ -15246 -56812 -5669 -312438 -60639 -324022 -304049 -262935 -207710 171392 -255753 -312432
10296c12432B46367d12375E1738a87449a4590j1374E9147a3839r1668J0408k59188
$$ -312432 246367 -412375 51738 -187449 -14590 -25964 59147 -13839 -105507 -95099 -354287
10285c54287P1369J18624o6483q4397f7466B87536a21308M1977C26107c51253
$$ -354287 -282918 -164294 -230777 -315174 -67466 287536 -121308 -79331 326107 -351253
10274B6797h3735m6899p4170A9557P5978R6182d71052I9218d32540B7177b36069
$$ 26797 -83735 -130634 -204804 19557 95535 191717 -471052 99218 -432540 27177 -236069
10262f2097E05133A047J56744i8687a9589F4515J33509a92723D37998j14143R310
$$ -62097 505133 1047 157791 -98687 -19589 64515 198024 -192723 437998 323855 333165
10251C33165J50370Q0314k3143j08782A23909D8191b2384f282k6501j31266B47909
$$ 333165 483535 563849 540706 431924 123909 48191 -22384 -6282 -32783 -164049 247909
10239a27781l6342B9147f4628b632k61958a31561D10397b06770Q907d4629j02310
$$ -127781 -164123 29147 -64628 -2632 -264590 -131561 410397 -206770 -197863 -44629 -146939
10228a46939B56675r4616K3655H3678e4873j42906A55352b8399n92j0025B949
$$ -146939 256675 162059 185714 83678 -54873 -197779 155352 -28399 -28991 -39016 2949
10216b43601k97621E3852e5496B09986a34956b1312C943M6383J15724F7544k4158
$$ -243601 -541222 53852 -55496 209986 -134956 -21312 3943 50326 166050 67544 43386
10205D3386J07769c17368J52638A01353e3094H4616f3731j41790d4203r3064L7721
$$ 43386 151155 -317368 -164730 101353 -53094 84616 -63731 -205521 -44203 -137267 -99546
10194i9546L2861l86440c0581B1971J28587a12718l07371A21228f2042l34689
$$ -99546 -66685 -453125 -30581 21971 150558 -112718 -420089 121228 -62042 -396731
10184c96731I4894c04205A78503A0277f6272n1026a8977n6428l56344a8457r9055
$$ -396731 94894 -304205 178503 10277 -66272 -117298 -18977 -75405 -431749 -18457 -117512
10173a17512k3355E2263M8084A9843K53324n6051I2339b60489g3024l40934A68781
$$ -117512 -140867 52263 100347 19843 273167 217116 92339 -260489 -73024 -413958 168781
10161A42980a05482D9708j3501b22601R7832B15616g5347B33771j10094a72632
$$ 142980 -105482 49708 36207 -222601 -124769 215616 -75347 233771 123677 -172632
10150C9124P7913a67413l08774c2466A68142M244a12507N0997l44887D6881b51896
$$ 39124 117037 -167413 -476187 -32466 168142 172386 -112507 -61510 -406397 46881 -251896
10138a65180H8104g6247q448p347M5636r3563b3888A75651a47435K0353F5603
$$ -165180 88104 -76247 -84695 -92042 -46406 -139969 -23888 175651 -147435 -127082 65603
10126A44396f3157j39907b725k16357h8900F4450b09832b2571A68037b54442A38851
$$ 144396 -63157 -203064 -2725 -219082 -88900 64450 -209832 -22571 168037 -254442 138851
10114C7882f2471D2957a44883J030C49707c23803B72076d84663a441k16002A82106
$$ 37882 -62471 42957 -144883 -143853 349707 -323803 272076 -484663 -1441 -217443 182106
10102a23918r3335A83960b60928i1185h20j46825l3918F5170b3753j33048e204
$$ -123918 -217253 183960 -260928 -91185 -820 -147645 -181563 65170 -23753 -156801 -5204
10090b64823c1320j11912d5810C4072J65202F956a14834M7619r8605J7144D7264
$$ -264823 -31320 -143232 -45810 34072 199274 6956 -114834 -67215 -165820 -148676 47264
10078a18125C6607a59476N7467j6292r4964c0463q9702k4353B8651a24959I380
$$ -118125 36607 -159476 -102009 -118301 -213265 -30463 -120165 -144518 28651 -124959 9380
10066a76011k54418d2630p6472j26186P8719j48472h5719A40264g8003J7737r104
$$ -176011 -430429 -42630 -119102 -245288 -166569 -315041 -85719 140264 -78003 -60266 -69370
10055f9370q4887f600j29045k44805A58851b22911o4123h7996A85944b41759j05125
$$ -69370 -154257 -6600 -135645 -380450 158851 -222911 -287034 -87996 185944 -241759 -346884
10044c46884c3848j67487I9774a56402j82571I6794g3035j9697k79989A53582
$$ -346884 -33848 -201335 99774 -156402 -338973 96794 -73035 -92732 -372721 153582
10033b90394P3468O7273j27550b3961k19355L9943N4934I2259i6901B0639J70733
$$ -290394 -216926 -149653 -277203 -23961 -243316 -203373 -148439 92259 -96901 20639 191372
10022A91372c60070F9808K47178d5563j85334g6447A08180a56688D5413h6962
$$ 191372 -360070 69808 316986 -45563 -230897 -76447 108180 -156688 45413 -86962
10011A15866M1575F6376d3530a8004l42542A4604K11571b3740F1321R8003f3309
$$ 115866 157441 66376 -43530 -18004 -360546 14604 226175 -23740 61321 159324 -63309
9999B68015c47267f6106l23733g068j56197B24408r4409b46731j49092a23415
$$ 268015 -347267 -66106 -389839 -7068 -163265 224408 129999 -246731 -395823 -123415
9988c17898H5910C0990a21687F7275c27073a16643D1200A9617a41138A50039a89395
$$ -317898 85910 30990 -121687 67275 -327073 -116643 41200 19617 -141138 150039 -189395
9976a90697C031a89465h7862A50445d5203B45914q1162B6777a72430g2774J266
$$ -190697 3031 -189465 -87862 150445 -45203 245914 164752 26777 -172430 -72774 -71508
9965g1508H466c33417A2374J842a25271o9292C7198J03840a36962m0824G8911
$$ -71508 8466 -333417 12374 14216 -125271 -194563 37198 141038 -136962 -177786 78911
9953i9779d5844B2309a85763h7822p3014P4650D4434j965b6044j45898j51792
$$ -99779 -45844 22309 -185763 -87822 -160836 -86186 44434 42469 -26044 -171942 -323734
9942c23734F7318f5668b4633A37044i6481c6611k65799h2621k35440B85084b44031
$$ -323734 67318 -65668 -24633 137044 -96481 -36611 -302410 -82621 -318061 285084 -244031
9930a58743A19252k9346d31037a18084F9229J5073a90446b710B01375c37982Q3942
$$ -158743 119252 89906 -431037 -118084 69229 84302 -190446 -2710 201375 -337982 -254040
9919b54040i5746A3739n184a27725G5346b23956B50344G305a03469j34480A65096
$$ -254040 -95746 13739 8555 -127725 75346 -223956 250344 7305 -103469 -237949 165096
9907C21467a71971b8077B50504D9664c05877c6001B10619c32475J45470O8321
$$ 321467 -171971 -28077 250504 49664 -305877 -36001 210619 -332475 -187005 -118684
9897a18684j80868J32956M6767k7634A35459k4809a50474e2193n6440M5583j13761
$$ -118684 -299552 -166596 -119829 -147463 135459 110650 -150474 -52193 -108633 -63050 -176811
9886a76811I7278l368h6896a3666m0819l48911E748R6842J1679i6416j09811C0110
$$ -176811 97278 93910 -86896 -13666 -54485 -403396 5748 102590 114269 -96416 -206227 30110
9873b02465O0160c7345G0290f6554H2922M47m459a18422c9397Q719k0272B30841
$$ -202465 -142305 -37345 70290 -66554 82922 83369 78910 -118422 -39397 -30678 -50950 230841
9860d0486k47798i9642A56297m665B3105a43719N344e5631q7976j75217C40692
$$ -40486 -288284 -99642 156297 151632 23105 -143719 -138375 -55631 -143607 -318824 340692
9848b2110k17179j35978h6282I6610b384k23752K1539q4259a03851j16941a08839
$$ -22110 -239289 -375267 -86282 96610 -2384 -226136 -204597 -288856 -103851 -220792 -108839
9836H7078e4222m6960B51512o3071b2077A064c09533a41270B09763a00382G2641
$$ 87078 -54222 -101182 251512 188441 -22077 1064 -309533 -141270 209763 -100382 72641
9824f8038j9592C3750a24831k49583a36071j10839j72529J45432A7488g1125d628
$$ -68038 -87630 33750 -124831 -374414 -136071 -246910 -419439 -274007 17488 -71125 -4628
9812b14903f175F0944Q581h9733L3344F4250b24348f3999p6895E9494a03600C07218
$$ -214903 -6175 60944 69525 -89733 -56389 64250 -224348 -63999 -140894 59494 -103600 307218
9799D21668a84860A6360c91647A55675G4912a60399c8575a5024k97630H6607M0270
$$ 421668 -184860 16360 -391647 155675 74912 -160399 -38575 -15024 -312654 86607 126877
9788A26877K9528a73808C1940B58Q8873b23857B05667k9298a48882j18975A06986
$$ 126877 156405 -173808 31940 258 89131 -223857 205667 176369 -148882 -267857 106986
9776A84258a6633k17113N762Q3777c0223k05856m9204l78892h6246p1061C10648
$$ 184258 -16633 -233746 -227984 -144207 -30223 -236079 -285283 -664175 -86246 -157307 310648
9764A603a69580K6726B01741a04241j52912J14517p4371a9015F053J50252a11874
$$ 1603 -169580 -142854 201741 -104241 -257153 -142636 -217007 -19015 6053 156305 -111874
9752b00237c7995F8378a14360j96219g5158F2287a05601c1447D3583d33586e3953
$$ -200237 -37995 68378 -114360 -310579 -75158 62287 -105601 -31447 43583 -433586 -53953
9740d0966A30158a25322B17719e3265n7992A35851b02899A57512D4189K03142
$$ -40966 130158 -125322 217719 -53265 -111257 135851 -202899 157512 44189 247331
9730B47331b63348C56935I1018J0431J41857b78048P8809B809a96600d211m8044
$$ 247331 -263348 356935 91018 101449 243306 -278048 -199239 2809 -196600 -4211 -52255
9719e2255k00814B84997a53838H369K867J78400n6624J52768a38697e6735k17457
$$ -52255 -253069 284997 -153838 8369 11236 189636 133012 285780 -138697 -56735 -274192
9708b74192A16420n7037A9132K3179c07831A19259f0387l5721C40742c88778J32308
$$ -274192 116420 59383 19132 42311 -307831 119259 -60387 -96108 340742 -388778 -256470
9697b56470J19794b0565j41320k39757j07256f3679C55105b44010f5275l1014
$$ -256470 -136676 -20565 -161885 -401642 -508898 -63679 355105 -244010 -65275 -96289
9687i6289j09814j52574C2004c153q795j09689p0872K5145K0845k1569k1913d0236
$$ -96289 -206103 -358677 32004 -3153 -11948 -121637 -192509 -167364 -146519 -168088 -190001 -40236
9674C25187b05372g9007B6008d06383B73282b76397A6643a63424A73110i7944
$$ 325187 -205372 -79007 26008 -406383 273282 -276397 16643 -163424 173110 -97944
9663i6787b2800B15625I093a05391a8213k67576a08261n9944P3939l7591N2722
$$ -96787 -22800 215625 9093 -105391 -18213 -285789 -108261 -168205 -94266 -131857 -79135
9652g9135m1698A02492M4181i6974Q984M1380k33362g541j58455h1157P243j3232
$$ -79135 -120833 102492 146673 -96974 -87990 -46610 -279972 -7541 -165996 -81157 -73914 -87146
9640h7146A33491b31729A001a52224D4461J75835q9986b71560c0241k35783a17055
$$ -87146 133491 -231729 1001 -152224 44461 220296 130310 -271560 -30241 -266024 -117055
9628B1751a44076k11841A34667c99799A64248L634a84568g0606k44403b9057j29472
$$ 21751 -144076 -355917 134667 -399799 164248 167882 -184568 -70606 -315009 -29057 -158529
9617a58529H2380O1008b01237g2831j06285c0178o1210j96253a15934p0409j85762
$$ -158529 82380 143388 -201237 -72831 -179116 -30178 -91388 -287641 -115934 -186343 -372105
9606c72105I1218c08979h3687j27644A4252M4135a35226j94541g8001b426m3631
$$ -372105 91218 -308979 -83687 -211331 14252 58387 -135226 -329767 -78001 -2426 -46057
9595d6057m9578I4133m5951a8613k60320J38228m4516G0858J13537a41236j44931
$$ -46057 -95635 94133 48182 -18613 -278933 -140705 -185221 70858 184395 -141236 -286167
9584b86167R2883j42387B0889g9826c6987i605B5376J28902O5897d63575O9649
$$ -286167 -193284 -335671 20889 -79826 -36987 -9605 25376 154278 220175 -463575 -393926
9573c93926i9639B42714m406c75135O2301A022b2151j10921K8702B2420c7050
$$ -393926 -99639 242714 238308 -375135 -312834 1022 -22151 -133072 -104370 22420 -37050
9561g468o4924j24677e3373j45796H7043g5878k27685c1667A33154a9066j20634
$$ -7468 -72392 -197069 -53373 -199169 87043 -75878 -303563 -31667 133154 -19066 -139700
9550a39700L3925j83800E5797i495A10961C7772i6119b6071j10300f3983j94021
$$ -139700 -105775 -289575 55797 -9495 110961 37772 -96119 -26071 -136371 -63983 -258004
9539b58004e5060C0370j3450K52367I6837m5608b22453H2128b38783e7965k26562
$$ -258004 -55060 30370 16920 269287 96837 51229 -222453 82128 -238783 -57965 -284527
9528b84527p924a21808C5151c47818J41960j29684A29998b27530a05941j29243
$$ -284527 -292451 -121808 35151 -347818 -205858 -335542 129998 -227530 -105941 -235184
9518b35184c9983j92532i9603B80430J40284e8841B63359C4690N951a047j07334
$$ -235184 -39983 -232515 -99603 280430 420714 -58841 263359 34690 40641 -1047 -108381
9507a08381a2500l21172f8202k80805a64118l77122a91111p875m0139R1426d8869
$$ -108381 -12500 -333672 -68202 -349007 -164118 -541240 -191111 -198986 -239125 -147699 -48869
9495A40762L1456G5693l1072b20601c6467r6370k22282B0795R261Q0668e0550
$$ 140762 172218 75693 44621 -220601 -36467 -132837 -355119 20795 30056 110724 -50550
9483c42862a41314G4454c68813a37760d2336l7766E5051a28310m4240E6932J5886
$$ -342862 -141314 74454 -368813 -137760 -42336 -80102 55051 -128310 -172550 56932 72818
9472G2818a16766k32221J43007A83177a08713d836l3955E5694f3291j99618B13861
$$ 72818 -116766 -348987 -205980 183177 -108713 -4836 -38791 55694 -63291 -262909 213861
9460b71890e3526B08513D3476c907j23875k05185n8819I4669a08810J8154k5006
$$ -271890 -53526 208513 43476 -3907 -127782 -332967 -391786 94669 -108810 -90656 -115662
9449a15662A81286N9680f3304r2389D2125g6181B7876a49721f6044k37089I514
$$ -115662 181286 240966 -63304 -155693 42125 -76181 27876 -149721 -66044 -303133 9514
9437g5549a9880l1329b4296B98614h2286k02551g9591A4207O1640b81927h9393
$$ -75549 -19880 -51209 -24296 298614 -82286 -284837 -79591 14207 75847 -281927 -89393
9425A23025c44637d7936j05268E5817J51055a39959A10631n4622N465K238B1695
$$ 123025 -344637 -47936 -153204 55817 206872 -139959 110631 56009 61474 63712 21695
9413a66776A8653b46708H2894B446L68815E19i5671a1882j99880A78067a07163
$$ -166776 18653 -246708 82894 2446 371261 519 -95671 -11882 -211762 178067 -107163
9401B19809l3516c95801g4745m08725E5289a94578B83276a28433B36330a7944
$$ 219809 186293 -395801 -74745 -483470 55289 -194578 283276 -128433 236330 -17944
9390a43515M3236j00176i9049m0073A02420A3655b09873A60713E609L0643a17128
$$ -143515 -100279 -200455 -99049 -139122 102420 13655 -209873 160713 5609 36252 -117128
9378c24967A543Q9730k5701A5215N3704I350d8303e661q2662j95583i9311F1860
$$ -324967 1543 91273 65572 15215 68919 9350 -48303 -5661 -88323 -283906 -99311 61860
9365D45930I7748Q5810a17601a8867B49811e5837j7120A29966F1176K7210K2198
$$ 445930 97748 183558 -117601 -18867 249811 -55837 -72957 129966 61176 88386 110584
9354A10584a02196k18820P9321N5118B1782c6334B23713i8463f730p5426N884
$$ 110584 -102196 -321016 -241695 -186577 21782 -36334 223713 -98463 -6730 -82156 -76272
9343g6272A42893c7421A901J00155K9213B8107O4536a35896j4114p6387H5524
$$ -76272 142893 -37421 1901 102056 131269 28107 92643 -135896 -150010 -226397 85524
9331f7004B40441b3727j29562N2410l6487n1392e4318k04521H1722e57k26995
$$ -67004 240441 -23727 -153289 -100879 -137366 -188758 -54318 -258839 81722 -557 -227552
9320b27552H4412c63009J56038B64916b13493O9888A48443k3405n8488i19F4577
$$ -227552 84412 -363009 -206971 264916 -213493 -143605 148443 125038 66550 -919 64577
9308A22916b59788j12355c8553m03583C8759f8974j8787B4006a65426F6230a70126
$$ 122916 -259788 -372143 -38553 -442136 38759 -68974 -87761 24006 -165426 66230 -170126
9296f3663j05293J5249B0249g5016k0789N07j70171D4029b40893R4078f97k59917
$$ -63663 -168956 -153707 20249 -75016 -95805 -95298 -265469 44029 -240893 -146815 -697 -260614
9284b60614J28271C85471j87461A5211a23667j73181i8482c0918B38218b26268
$$ -260614 -132343 385471 198010 15211 -123667 -296848 -98482 -30918 238218 -226268
9273d26301K3676O7701a46975l1694J6586j09250a26464l8770k40174h8185C80250
$$ -426301 -402625 -334924 -146975 -178669 -162083 -271333 -126464 -165234 -405408 -88185 380250
9261B3929J36991Q0002a5096k71218F4745B4261c04039o409a35751j84488J47444
$$ 23929 160920 240922 -15096 -286314 64745 24261 -304039 -310448 -135751 -320239 -172795
9250a72795O3786e2957j74661q4892i087B79586A00967C2504P4793N2186K01105
$$ -172795 -109009 -52957 -227618 -312510 -9087 279586 100967 32504 107297 159483 360588
9239C60588a49653n887B18222I6358a32709B9823a79880B50792d6022B58994a21095
$$ 360588 -149653 -155540 218222 96358 -132709 29823 -179880 250792 -46022 258994 -121095
9227F0077J75122q2400b69531E0588a46048k18417G3447d7741H5507O4887C9447
$$ 60077 235199 152799 -269531 50588 -146048 -364465 73447 -47741 85507 150394 39447
9215a59596B36552d4091j51504k12140A29325a88161A00041b20192H0358c31996
$$ -159596 236552 -44091 -195595 -407735 129325 -188161 100041 -220192 80358 -331996
9204B84747a29046q4483k24j40687a0210j1077B9371a37745G8138l0822j0294
$$ 284747 -129046 -213529 -213753 -354440 -10210 -21287 29371 -137745 78138 47316 37022
9193C7022a53967L4982B3083a20704B78513a98770a9032k17548A30776a07634
$$ 37022 -153967 -118985 23083 -120704 278513 -198770 -19032 -236580 130776 -107634
9182c3776k20299A34504a20911j70015j88144a09742j03906i6298B18756j08464
$$ -33776 -254075 134504 -120911 -290926 -479070 -109742 -213648 -96298 218756 110292
9172A10292c885k67797a059l72873a00361q2197A4127J19023a48124c9117J7243
$$ 110292 -3885 -271682 -1059 -373932 -100361 -182558 14127 133150 -148124 -39117 -21874
9161b1874F9350c00358f8379F5691a2327B14269c58202l3511a9011H5465a01620
$$ -21874 69350 -300358 -68379 65691 -12327 214269 -358202 -391713 -19011 85465 -101620
9149B9476b51611A41663F1110i8434d5097J0739m5841H6381B0191a56879B67020
$$ 29476 -251611 141663 61110 -98434 -45097 -34358 -80199 86381 20191 -156879 267020
9137D06458H4323J94996a81223k1372e2101N907C28929c2852B3966h6559a0008
$$ 406458 84323 279319 -181223 -202595 -52101 -46194 328929 -32852 23966 -86559 -10008
9125A80075N1583I5229d6141k47720F2464c59153c1290r6338L8606L7178j88956
$$ 180075 231658 95229 -46141 -293861 62464 -359153 -31290 -127628 -89022 -51844 -240800
9114b40800A3663i411G5458K27405F9484a63210B81599a0034k51544B5778c6702
$$ -240800 13663 -9411 75458 302863 69484 -163210 281599 -10034 -261578 25778 -36702
9102b622B6773b43317N0977l4677B53828e5005o7303o3474n9945a04365j61028
$$ -2622 26773 -243317 -192340 -227017 253828 -55005 -122308 -185782 -245727 -104365 -265393
9091b65393c1555C2431L0221h5100r7355K0688N3548A73354f0366A67587b18132
$$ -265393 -31555 32431 62652 -85100 -182455 -161767 -108219 173354 -60366 167587 -218132
9079c25864J26329f1654n6351h670l37749R0895p2013a3800E6003J13436n8264
$$ -325864 -199535 -61654 -118005 -8670 -346419 -255524 -327537 -13800 56003 169439 111175
9068A11175K61193I893f5028j41529r3873d0535A58779A0967J33282b468j24412
$$ 111175 372368 9893 -65028 -206557 -300430 -40535 158779 10967 144249 -2468 -126880
9057a26880b3224F7699a10361l8797C9202a47003j03419N5489P1558B57041j15236
$$ -126880 -23224 67699 -110361 -149158 39202 -147003 -250422 -194933 -123375 257041 141805
9046A41805b92823B09128a74704A09593a14534q1050B37306F9227a97411h6247
$$ 141805 -292823 209128 -174704 109593 -114534 -195584 237306 69227 -197411 -86247
9035b25738R7577r3556e0074k71947F1379f5364j99406E2358a80331k7786A41548
$$ -225738 -128161 -221717 -50074 -322021 61379 -65364 -264770 52358 -180331 -208117 141548
9023b45461A59026e1970J9916j25031l0740q9809H23c2993A1910c73861g0335
$$ -245461 159026 -51970 -32054 -157085 -187825 -277634 823 -32993 11910 -373861 -70335
9011a57381n1681A31105C88J49835j4860a74727h5903j85815C3918e8945o609
$$ -157381 -209062 131105 388 150223 135363 -174727 -85903 -271718 33918 -58945 -65554
9000f5554J236k85608f4343E6838a53364C5265a45260L6034j9919B5703o445c08352
$$ -65554 -64318 -349926 -64343 56838 -153364 35265 -145260 -109226 -129145 25703 19258 -308352
8987c9042k29670A95135a2025B08337B4415f1649l85409A27465b15250h8711c073
$$ -39042 -268712 195135 -12025 208337 24415 -61649 -447058 127465 -215250 -88711 -3073
8975b74044C4066J55066f2540A12356j6279L8820n4633d4113H6472c94250f259
$$ -274044 34066 189132 -62540 112356 96077 134897 80264 -44113 86472 -394250 -6259
8963A2789K52295I1532b85841D71620a16193p6447B21137a69613G6176g0114F4914
$$ 12789 265084 91532 -285841 471620 -116193 -192640 221137 -169613 76176 -70114 64914
8951H8718C4663J79886k429c26250B30595E2033a68994E8737J27893A3162J43110
$$ 88718 34663 214549 212120 -326250 230595 52033 -168994 58737 186630 13162 156272
8940A56272b47225E8597g5842a6195l2830A05252K41712g2131B08487d4846b1169
$$ 156272 -247225 58597 -75842 -16195 -49025 105252 346964 -72131 208487 -44846 -21169
8928a04351A47647f9473A34779B2327K68248L0056M2609O89195J400416P452394
$$ -104351 147647 -69473 134779 22327 290575 320631 363240 1052435 2452851 9905245
8918I905245D029721F70494b3024F1829K05745J03422g6242K2960j34857f3980
$$ 9905245 4029721 670494 -23024 61829 267574 370996 -76242 -53282 -188139 -63980
8907A21258f2399G3913L10849H2528b07359j57476D1145K4175J6876b31502I3329
$$ 121258 -62399 73913 384762 82528 -207359 -364835 41145 65320 82196 -231502 93329
8895a99591l27292i6995o7160P500O9315F9089b0341B37551e4464j12143A96750
$$ -199591 -526883 -96995 -164155 -156655 -87340 69089 -20341 237551 -54464 -166607 196750
8883I4540J11042C2358b02757G8853b52297J13655A37730b31070N2104B3525c6694
$$ 94540 205582 32358 -202757 78853 -252297 -138642 137730 -231070 -178966 23525 -36694
8871A30137h8804j0931b642A31835b19989h5431l99716a29214F0674a81542b9603
$$ 130137 -88804 -99735 -2642 131835 -219989 -85431 -485147 -129214 60674 -181542 -29603
8859e18733A175a3337k02158b769m633A09740c78769a74783p6930g5986I784C892
$$ -518733 1175 -13337 -215495 -2769 -7402 109740 -378769 -174783 -251713 -75986 9784 3892
$$ [...]
##END NTUPLES=NMR SPECTRUM
##END=
