
##TITLE=AC1289_SALAH11099_6615578_FZIyRlrXwm
##JCAMPDX= 6.0         $$ Bruker NMR JCAMP-DX V2.0
##DATA TYPE= NMR SPECTRUM
##DATA CLASS= NTUPLES
##ORIGIN= BRUKER
##OWNER= Administrator
$$ 1.72 TOPSPIN		Version 2.1
$$ 2012-08-02 21:49:35.953 -0500  Administrator@TOPSPIN
$$ Compression mode = diff/dup
##.OBSERVE FREQUENCY= 400.02188249412
##.OBSERVE NUCLEUS= ^1H
##.ACQUISITION MODE= SIMULTANEOUS (DQD)
##.ACQUISITION SCHEME= undefined
##.AVERAGES= 64
##.DIGITISER RES= 22
##SPECTROMETER/DATA SYSTEM= spect
##.PULSE SEQUENCE= noesygpps1d.comp
##.SOLVENT NAME= COFFEE_meoh
##.SHIFT REFERENCE= INTERNAL, COFFEE_meoh, 1, 14.96257
##AUDIT TRAIL= $$ (NUMBER, WHEN, WHO, WHERE, PROCESS, VERSION, WHAT)
$$ ##TITLE= Audit trail, TOPSPIN		Version 2.1
$$ ##JCAMPDX= 5.01
$$ ##ORIGIN= Bruker BioSpin GmbH
$$ ##OWNER= Administrator
$$ $$ C:\Bruker\TOPSPIN/data/COFFEE/nmr/AC1289_SALAH11099_6615578_FZIyRlrXwm/12/pdata/1/auditp.txt
$$ ##AUDIT TRAIL=  $$ (NUMBER, WHEN, WHO, WHERE, PROCESS, VERSION, WHAT)
(   1,<2012-08-02 21:49:31.265 -0500>,<Administrator>,<TOPSPIN>,<go>,<TOPSPIN 2.1>,
      <created by zg
	started at 2012-08-02 21:38:01.046 -0500,
	POWCHK enabled, PULCHK disabled,
       configuration hash MD5:
       6B 1B 68 BB D9 2E 58 E2 7F 35 AD 54 07 DF 0E 41
       data hash MD5: 64K
       AC 7D 67 A9 6C 4C E4 0B E0 C0 A1 21 1A B9 B0 C4>)
(   2,<2012-08-02 21:49:34.125 -0500>,<Administrator>,<TOPSPIN>,<proc1d>,<TOPSPIN 2.1>,
      <Start of raw data processing
       efp LB = 0.3 FT_mod = 6 PKNL = 1 PHC0 = 0 PHC1 = 0 SI = 128K 
       data hash MD5: 128K
       8A F7 35 C8 AA 7A 00 55 C0 34 C1 52 E4 57 66 10>)
(   3,<2012-08-02 21:49:35.203 -0500>,<Administrator>,<TOPSPIN>,<proc1d>,<TOPSPIN 2.1>,
      <pk PHC0 = 2.905884 PHC1 = 0 
       data hash MD5: 128K
       8E 9A E4 2E 08 BC FC 57 DF 3C 6C 7D 76 35 6C C9>)
(   4,<2012-08-02 21:49:35.437 -0500>,<Administrator>,<TOPSPIN>,<proc1d>,<TOPSPIN 2.1>,
      <abs ABSG = 1 
       data hash MD5: 128K
       88 1E C1 98 F2 EF 76 B5 FF 87 F7 26 BF 49 F2 EB>)
(   5,<2012-08-02 21:49:35.500 -0500>,<Administrator>,<TOPSPIN>,<proc1d>,<TOPSPIN 2.1>,
      <abs ABSG = 2 
       data hash MD5: 128K
       31 3E 20 EA E6 12 B9 AF 40 F8 35 95 58 E1 FC 5B>)
(   6,<2012-08-02 21:49:35.562 -0500>,<Administrator>,<TOPSPIN>,<proc1d>,<TOPSPIN 2.1>,
      <abs ABSG = 3 
       data hash MD5: 128K
       B3 6F B2 15 79 11 B3 75 03 7B 49 93 2A 90 B3 1F>)
(   7,<2012-08-02 21:49:35.828 -0500>,<Administrator>,<TOPSPIN>,<proc1d>,<TOPSPIN 2.1>,
      <abs ABSG = 4 
       data hash MD5: 128K
       5D 5C 1F B2 80 FC 80 21 1A 82 7B 90 E3 70 41 AD>)
(   8,<2012-08-02 21:49:35.875 -0500>,<Administrator>,<TOPSPIN>,<proc1d>,<TOPSPIN 2.1>,
      <abs ABSG = 5 
       data hash MD5: 128K
       58 E1 F1 5F BD C2 7D F4 47 FF A2 9E 07 13 BD FC>)
$$ ##END=
$$ 
$$ $$ hash MD5
$$ $$ FC 69 E7 5E A3 08 AD 27 3D FD B3 FC 88 15 52 9A
##$RELAX= 
##$RELAX= 
##$RELAX= 
##$RELAX= 
##$RELAX= 
##$RELAX= 
##$RELAX= 
##$RELAX= 
$$ Bruker specific parameters
$$ [...]
150 150 150 150 150 150 150 150
##$TP07= 0
##$TPNAME0= <>
##$TPNAME1= <>
##$TPNAME2= <>
##$TPNAME3= <>
##$TPNAME4= <>
##$TPNAME5= <>
##$TPNAME6= <>
##$TPNAME7= <>
##$TPOAL= (0..7)
0.5 0.5 0.5 0.5 0.5 0.5 0.5 0.5
##$TPOFFS= (0..7)
0 0 0 0 0 0 0 0
##$TUNHIN= 0
##$TUNHOUT= 0
##$TUNXOUT= 0
##$USERA1= <user>
##$USERA2= <user>
##$USERA3= <user>
##$USERA4= <user>
##$USERA5= <user>
##$V9= 5
##$VALIST= <valist>
##$VCLIST= <CCCCCCCCCCCCCCC>
##$VD= 0
##$VDLIST= <DDDDDDDDDDDDDDD>
##$VPLIST= <PPPPPPPPPPPPPPP>
##$VTLIST= <TTTTTTTTTTTTTTT>
##$WBST= 1024
##$WBSW= 4
##$XGAIN= (0..3)
0 0 0 0
##$XL= 0
##$YL= 0
##$YMAX_a= 16747155
##$YMIN_a= -9385493
##$ZGOPTNS= <>
##$ZL1= 120
##$ZL2= 120
##$ZL3= 120
##$ZL4= 120
##$ABSF1= 14.96257
##$ABSF2= -5.595612
##$ABSG= 5
##$ABSL= 3
##$ALPHA= 0
##$AQORDER= 0
##$ASSFAC= 0
##$ASSFACI= 0
##$ASSFACX= 0
##$ASSWID= 0
##$AUNMP= <proc_prof1d_extract.lims>
##$AXLEFT= 0
##$AXNAME= <>
##$AXNUC= <1H>
##$AXRIGHT= 0
##$AXTYPE= 0
##$AXUNIT= <>
##$AZFE= 0.1
##$AZFW= 0.1
##$BCFW= 0
##$BC_mod= 0
##$BYTORDP= 0
##$COROFFS= 0
##$CY= 15
##$DATMOD= 1
##$DC= 0
##$DFILT= <>
##$DTYPP= 0
##$F1P= 0
##$F2P= 0
##$FCOR= 0.5
##$FTSIZE= 131072
##$FT_mod= 6
##$GAMMA= 0
##$GB= 0
##$INTBC= 1
##$INTSCL= 1
##$ISEN= 128
##$LB= 0.3
##$LEV0= 0
##$LPBIN= 0
##$MAXI= 10000
##$MC2= 0
##$MEAN= 0
##$ME_mod= 0
##$MI= 0
##$NCOEF= 0
##$NC_proc= -2
##$NLEV= 6
##$NOISF1= 0
##$NOISF2= 0
##$NSP= 0
##$NTH_PI= 0
##$NZP= 0
##$OFFSET= 14.96257
##$PC= 1
##$PHC0= 2.905884
##$PHC1= 0
##$PH_mod= 1
##$PKNL= yes
##$PPARMOD= 0
##$PPDIAG= 0
##$PPIPTYP= 0
##$PPMPNUM= 2147483647
##$PPRESOL= 1
##$PSCAL= 4
##$PSIGN= 0
##$PYNMP= <proc.py>
##$REVERSE= no
##$SF= 400.020009010297
##$SI= 131072
##$SIGF1= 0
##$SIGF2= 0
##$SINO= 400
##$SIOLD= 131072
##$SPECTYP= <>
##$SREGLST= <1H.CDCl3>
##$SSB= 0
##$STSI= 131072
##$STSR= 0
##$SW_p= 8223.68421052631
##$SYMM= 0
##$S_DEV= 0
##$TDeff= 65536
##$TDoff= 0
##$TI= <>
##$TILT= no
##$TM1= 0
##$TM2= 0
##$TOPLEV= 0
##$USERP1= <user>
##$USERP2= <user>
##$USERP3= <user>
##$USERP4= <user>
##$USERP5= <user>
##$WDW= 1
##$XDIM= 131072
##$YMAX_p= 452577703
##$YMIN_p= -11767
##$CURPLOT= <Network HP LaserJet P1505>
##$CURPRIN= <$Network HP LaserJet P1505>
##$DFORMAT= <normdp>
##$LAYOUT= <+/1D_H.xwp>
##$LFORMAT= <normlp>
##$PFORMAT= <normpl>
##$SURQMSG= 1
$$ End of Bruker specific parameters
$$ ---------------------------------
##NTUPLES= NMR SPECTRUM
##VAR_NAME=  FREQUENCY,     SPECTRUM/REAL,   SPECTRUM/IMAG
##SYMBOL=    X,             R,               I
##VAR_TYPE=  INDEPENDENT,   DEPENDENT,       DEPENDENT
##VAR_FORM=  AFFN,          ASDF,            ASDF
##VAR_DIM=   131072,        131072,          131072
##UNITS=     HZ,            ARBITRARY UNITS, ARBITRARY UNITS
##FACTOR=    0.0627417313425164, 1,          1
##FIRST=     8223.62146879497, -2122,        -55927
##LAST=      0,             10,              -57008
##MIN=       0,             -11767,          0
##MAX=       8223.62146879497, 452577703,    0
$$ Real data points
##PAGE= N=1
##DATA TABLE= (X++(R..R)), XYDATA
$$ [...]
63178H76246K5011K7698L0691L2396L2522L2213L2470L3266L4167L4867L4957
$$ 876246 901257 928955 959646 992042 1024564 1056777 1089247 1122513 1156680 1191547 1226504
63167A226504L3996L2135L0134K8486K6877K4589K1065J5945R104Q91p891j6371
$$ 1226504 1260500 1292635 1322769 1351255 1378132 1402721 1423786 1439731 1448835 1449726 1441835 1425464
63155A425464k3908l0258l5620m0246m3690m5021m4174m2547m1400m0253l7848
$$ 1425464 1401556 1371298 1335678 1295432 1251742 1206721 1162547 1120000 1078600 1038347 1000499
63144A000499l4354l1228k8981k6430k2658j8499j5454j3931j3255j2774j2193
$$ 1000499 966145 934917 905936 879506 856848 838349 822895 808964 795709 782935 770742
63133G70742j1305j0073q812p882p310o915o583o209n640m865m014l120k146j306
$$ 770742 759437 749364 740552 732670 725360 718445 711862 705653 700013 695148 691134 688014 685868 684562
63119F84562q89p24l21L42P85Q28R31J387J878K223K936M477O326P530P855P805
$$ 684562 683673 682949 682628 682970 683755 684583 685514 686901 688779 691002 693938 698415 704741 712271 720126 727931
63103G27931P646P172O583O753Q126R732J0025Q674O952O194O357O482O127N723
$$ 727931 735577 742749 749332 756085 764211 773943 783968 792642 799594 805788 812145 818627 824754 830477
63089H30477N644N646N380M819M017K980K031J758K217K664K506K030J784J703
$$ 830477 836121 841767 847147 851966 855983 858963 860994 862752 864969 867633 870139 872169 873953 875656
63075H75656J408R77P94R79J440K183L067L585L510L406L946N015O118P275Q794
$$ 875656 877064 878041 878835 879814 881254 883437 886504 890089 893599 897005 900951 905966 912084 919359 928153
63060I28153J0456J1801J3050J4932J7631K0611K3428K6049K8402L0396L2325
$$ 928153 938609 950410 963460 978392 996023 1016634 1040062 1066111 1094513 1124909 1157234
63049A157234L4613L7059L9047M0457M1755M3157M4306M4844M4793M4341M3737
$$ 1157234 1191847 1228906 1267953 1308410 1350165 1393322 1437628 1482472 1527265 1571606 1615343
63038A615343M3358M3407M3616M3691M3837M4305M4704M4437M3555M2498M1081
$$ 1615343 1658701 1702108 1745724 1789415 1833252 1877557 1922261 1966698 2010253 2052751 2093832
63027B093832L8464L3991K7562J9450J0342J170p830j7429k7918l7870m5441n0445
$$ 2093832 2132296 2166287 2193849 2213299 2223641 2224811 2216981 2199552 2171634 2133764 2088323 2037878
63015B037878n3886n5919n5811n3720n0749m7131m1957l5071k7669k0498j2979
$$ 2037878 1983992 1928073 1872262 1818542 1767793 1720662 1678705 1643634 1615965 1595467 1582488
63004A582488m763L221J0182J6659K3444L0287L6615M2601M8570N4088N8545O2029
$$ 1582488 1577725 1580946 1591128 1607787 1631231 1661518 1698133 1740734 1789304 1843392 1901937 1963966
62992A963966O4919O7135O8544O9491P0309P0749P0507O9754O8569O6433O2814
$$ 1963966 2028885 2096020 2164564 2234055 2304364 2375113 2445620 2515374 2583943 2650376 2713190
62981B713190N7716N1130M2616L1968J9643O023r034k5320m1642n6843p0794q3662
$$ 2713190 2770906 2822036 2864652 2896620 2916263 2922286 2913252 2887932 2846290 2789447 2718653 2634991
62969B634991r4728j02802j07472j09273j08943j07094j04132r9960r4099q6683
$$ 2634991 2540263 2437461 2329989 2220716 2111773 2004679 1900547 1800587 1706488 1619805
62959A619805p8920p1992o5912o0008n4064m8384m3132l8307l4078l0585k7615
$$ 1619805 1540885 1468893 1402981 1342973 1288909 1240525 1197393 1159086 1125008 1094423 1066808
62948A066808k4873k2415k0380j8583j6704j4601j2350j0341r320r569j0026r133
$$ 1066808 1041935 1019520 999140 980557 963853 949252 936902 926561 917241 907672 897646 888513
62936H88513o904n072m722m936m470l606l286l419l288k959k931k930k309j408
$$ 888513 881609 876537 871815 866879 862409 858803 855517 852098 848810 845851 842920 839990 837681 836273
62922H36273j252k037l015l702m344n132n932o708p450p767p379o882p159q124
$$ 836273 835021 832984 829969 826267 821923 816791 810859 804151 796701 788934 781555 774673 767514 759390
62908G59390q860q909q630q303p797p096o446n841n150m697m938n565n756n372
$$ 759390 750530 741621 732991 724688 716891 709795 703349 697508 692358 687661 682723 677158 671402 666030
62894F66030n114n309n439n204n181n947p114p800p683p137o583o085n540m929
$$ 666030 660916 655607 650168 644964 639783 633836 626722 618922 611239 604102 597519 591434 585894 580965
62880E80965m413m164m093l881l408k973k836k736k207j278m81k20m24p13o85
$$ 580965 576552 572388 568295 564414 561006 558033 555197 552461 550254 548976 548495 548275 547851 547138 546453
62865E46453j54N93Q85L63n41j029p87j23M32M51j57q27n89Q04K283K575J750
$$ 546453 546299 546892 547777 548140 547599 546570 545783 545660 546092 546543 546386 545559 544970 545774 548057 550632 552382
62848E52382J080J378K191K654K532K181J965K051K483L136L704L984M035M015
$$ 552382 553462 554840 557031 559685 562217 564398 566363 568414 570897 574033 577737 581721 585756 589771
62834E89771L929L656L232K917K870K806K222J057j38q87j328j745j931j629j289
$$ 589771 593700 597356 600588 603505 606375 609181 611403 612460 612322 611435 610107 608362 606431 604802 603513
62819F03513j595k362k784k807l264m384n200m923l994l239k721k108j476j073
$$ 603513 601918 599556 596772 593965 590701 586317 581117 576194 572200 568961 566240 564132 562656 561583
62805E61583p55l39k4R2M12J172J918K163K114K238K649L399M647O054O806O866
$$ 561583 560828 560489 560465 560557 560969 562141 564059 566222 568336 570574 573223 576622 581269 587323 594129 600995
62789F00995P350Q882J0508J1230J1725J3290J5865J8420K0770K3569K6890L0268
$$ 600995 608345 617227 627735 638965 650690 663980 679845 698265 719035 742604 769494 799762
62777G99762L3956L8591M3653M7669N0198N2435N5495N9123O2413O4773O5919
$$ 799762 833718 872309 915962 963631 1013829 1066264 1121759 1180882 1243295 1308068 1373987
62766A373987O5579O3628N9938N4190M6325L7000K6842J5550K728j0657k2776
$$ 1373987 1439566 1503194 1563132 1617322 1663647 1700647 1727489 1743039 1745767 1735110 1712334
62755A712334l2850m1441m8924n4902n9248o2380o4239o4195o2416o0106n7892
$$ 1712334 1679484 1638043 1589119 1534217 1474969 1412589 1348350 1284155 1221739 1161633 1103741
62744A103741n5095n1194m6931m3247m0005l6636l3163k9816k6300k2412j8850
$$ 1103741 1048646 997452 950521 907274 867269 830633 797470 767654 741354 718942 700092
62733G00092j6548j5397j4358j2782j1047r874r444r205q400o919n494m860m751
$$ 700092 683544 668147 653789 641007 629960 620086 610642 601437 593037 586118 580624 575764 571013
62720E71013m254l011j498j21J224K571L592M250N076O498Q391J0558J3045J5674
$$ 571013 566759 563748 562250 562129 563353 565924 569516 573766 578842 585340 593731 604289 617334 633008
62706F33008J7953J9815K1944K4882K8279L1499L4553L7972M2075M6807N2062
$$ 633008 650961 670776 692720 717602 745881 777380 811933 849905 891980 938787 990849
62695I90849N7824O4137P1056P8384Q5523R1949R7799J03407J08194J10799J10392
$$ 990849 1048673 1112810 1183866 1262250 1347773 1439722 1537521 1640928 1749122 1859921 1970313
62684A970313J07135J01052R1390P7756O1047M2547K2707J671j9507l9252n6935
$$ 1970313 2077448 2178500 2269890 2347646 2408693 2451240 2473947 2475618 2456111 2416859 2359924
62673B359924p3030q7687r9928j08545j13222j14484j13033j09531j04695r9151
$$ 2359924 2286894 2199207 2099279 1990734 1877512 1763028 1649995 1540464 1435769 1336618
62663A336618r3126q6576p9608p2592o5789n9227n3074m7844m3804m0410l6898
$$ 1336618 1243492 1156916 1077308 1004716 938927 879700 826626 778782 734978 694568 657670
62652F57670l3365l0533k8352k5774k2366j9213j7446j6551j5219j3337j1944
$$ 657670 624305 593772 565420 539646 517280 498067 480621 464070 448851 435514 423570
62641D23570j1403j0956j0169r595r550r351q344o946o005n672n498n244n060
$$ 423570 412167 401211 391042 381447 371897 362546 354202 347256 341251 335579 330081 324837 319777
62628C19777n061n157n130m743l951l055k445k169k020j911j748j148O3J219J395
$$ 319777 314716 309559 304429 299686 295735 292680 290235 288066 286046 284135 282387 281239 281302 282521 283916
62613B83916P13K75P20J594K316K903L439L582L129K535K372K768L637N024O830
$$ 283916 284629 284904 285624 287218 289534 292437 295876 299458 302587 305122 307494 310262 313899 318923 325753
62598C25753Q686J0365J1939J3328J4270J4991J6269J8470K0986K3108K4991K7243
$$ 325753 334439 344804 356743 370071 384341 399332 415601 434071 455057 478165 503156 530399
62586E30399K9942L2498L4291L5115L5079L4293L2557K9410K4722J9057J3092
$$ 530399 560341 592839 627130 662245 697324 731617 764174 793584 818306 837363 850455
62575H50455O843P2o724j2518j6970k0638k3874k6389k8028k9078k9513k8771
$$ 850455 857298 857370 850646 838128 821158 800520 776646 750257 722229 693151 663638 634867
62563F34867k6764k4268k1932j9640j7279j5281j3920j2755j1434j0338r867r740
$$ 634867 608103 583835 561903 542263 524984 509703 495783 483028 471594 461256 451389 441649
62551D41649r576r544r745r670q937q085p796p810p387o412n282m106k719j382
$$ 441649 432073 422529 412784 403114 394177 386092 378296 370486 363099 356687 351405 347299 344580 343198
62537C43198n78k67Q7P88J708K727L883N079N994O292N838M940M472N341P545
$$ 343198 342620 342353 342440 343228 344936 347663 351546 356625 362619 368911 374749 379689 384161 389502 397047
62522C97047J0057J1933J3111J4096J5325J7087J9463K2054K4343K6535K9433
$$ 397047 407104 419037 432148 446244 461569 478656 498119 520173 544516 571051 600484
62511F00484L3175L6948M0358M4121M8681N3040N6001N7873N9826O1815O2269
$$ 600484 633659 670607 710965 755086 803767 856807 912808 970681 1030507 1092322 1154591
62500A154591N9790N4339M6789L7965K8267J7655N967o516j8898l0222l9923m7622
$$ 1154591 1214381 1268720 1315509 1353474 1381741 1399396 1405363 1398847 1379949 1349727 1309804 1262182
62488A262182n3044n6432n8399n9025n7748n4712n1291m8544m5874m2205l7773
$$ 1262182 1209138 1152706 1094307 1035282 977534 922822 871531 822987 777113 734908 697135
62477F97135l3613k9836k5746k1506j8257j6421j5032j3059j0566q165o097m246
$$ 697135 663522 633686 607940 586434 568177 551756 536724 523665 513099 504934 498837 494591
62465D94591k570j154q6O36J274K257L576M529M606M390N001O792R112J1199J2663
$$ 494591 492021 490867 490781 491417 492691 494948 498524 503053 507659 512049 517050 523842 532954 544153 556816
62450E56816J3328J3307J3153J3196J2846J1271Q691O166M034J380k622p558j2261
$$ 556816 570144 583451 596604 609800 622646 633917 642608 648774 652808 654188 651566 644008 631747
62437F31747j5954j8529k0178k1134k1496k1110j9744j7548j5186j3363j2269
$$ 631747 615793 597264 577086 555952 534456 513346 493602 476054 460868 447505 435236
62426D35236j1454j0242q423o548n291m472l182j088J068K600L819N224O486P058
$$ 435236 423782 413540 405117 398569 393278 388806 385624 384536 385604 388204 392023 397247 403733 410791
62412D10791P323Q068R217J0078J0637J1432J2256J2150J0885R304P907O164L728
$$ 410791 418114 426182 435399 445477 456114 467546 479802 491952 502837 512141 520048 526212 529940
62399E29940J341j92j159k402m112n886p517r015j0042j0013q816p070n644n032
$$ 529940 531281 531089 529930 527528 523416 517530 510013 500998 490956 480943 472127 465057 459413 454381
62385D54381n043m937m059k492r31K08J290K923N260Q008J0910J3839J6649J9241
$$ 454381 449338 444401 440342 437850 436919 437127 438417 441340 446600 454608 465518 479357 496006 515247
62371E15247K1807K4760K8252L1958L5393L8403M1231M4020M6510M8348M9603
$$ 515247 537054 561814 590066 622024 657417 695820 737051 781071 827581 875929 925532
62360I25532N0528N0903N0016M7489M3658L8906L3052K5841J7618R065N00p934
$$ 925532 976060 1026963 1076979 1124468 1168126 1207032 1240084 1265925 1283543 1292608 1293108 1285174
62348A285174j5611k1532k5303k7569k9400l1447l3623l5326l6013l5750l5102
$$ 1285174 1269563 1248031 1222728 1195159 1165759 1134312 1100689 1065363 1029350 993600 958498
62337I58498l4335l3054l0923k8428k6337k4717k3017k1048j9278j8133j7527
$$ 958498 924163 891109 860186 831758 805421 780704 757687 736639 717361 699228 681701
62326F81701j7151j6773j6147j5039j3449j1538r337o907m723l431l136l249l190
$$ 681701 664550 647777 631630 616591 603142 591604 582267 575360 570637 567206 564070 560821 557631
62313E57631k967k979l575m828o542q337r879j1029j1661j1545j0635r359q351
$$ 557631 554664 551685 548110 543282 536740 528403 518524 507495 495834 484289 473654 464295 455944
62300D55944p860p661p413o862n861m487l070j851o84O52J944K752L036L319M094
$$ 455944 448084 440423 433010 426148 420287 415800 412730 410879 410195 410847 412791 415543 418579 421898 425992
62285D25992N296O448P203P689Q260Q973R517R845J0538J2030J3673J4328J3939
$$ 425992 431288 437736 444939 452628 460888 469861 479378 489223 499761 511791 525464 539792 553731
62272E53731J3749J4675J6230J7456J8166J8770J9538K0723K2755K5634K8578
$$ 553731 567480 582155 598385 615841 634007 652777 672315 693038 715793 741427 770005
62261G70005L0988L3351L6456M0102M3344M5605M6827M6790M5071M1451L5767
$$ 770005 800993 834344 870800 910902 954246 999851 1046678 1093468 1138539 1179990 1215757
62250A215757K7734J7650O954k724j0868j7811k3629k8219l2115l6094l9986m2771
$$ 1215757 1243491 1261141 1268095 1265371 1254503 1236692 1213063 1184844 1152729 1116635 1076649 1033878
62238A033878m3902m3754m2795m1150l8967l6519l3832l0838k7816k5061k2279
$$ 1033878 989976 946222 903427 862277 823310 786791 752959 722121 694305 669244 646965
62227F46965j9096j5913j3514j1921j0498r056p956p187o263n101m092l351k640
$$ 646965 627869 611956 598442 586521 576023 566967 559011 551824 545561 540460 536368 533017 530377
62214E30377k054j803j412j93J496K494K516K500L038L630L871M331N563P068
$$ 530377 528323 526520 525108 524915 526411 528905 531421 533921 536959 540589 544460 548791 554354 561422
62200E61422P937Q041Q016Q508R697J1276J2695J3718J4717J6075J7534J8721
$$ 561422 569359 577400 585416 593924 603621 614897 627592 641310 656027 672102 689636 708357
62188G08357J9822K0876K0945J9212J6604J4785J3632J1454Q010N387N144O322
$$ 708357 728179 749055 770000 789212 805816 820601 834233 845687 853697 859084 864228 870550
62176H70550P424Q766J1375J4766J7583J9791K2580K6348L0160L3178L5405L6918
$$ 870550 877974 886740 898115 912881 930464 950255 972835 999183 1029343 1062521 1097926 1134844
62164A134844L7345L6359L3990L0378K5748K0703J6002J2046Q835O309M250K056
$$ 1134844 1172189 1208548 1242538 1272916 1298664 1319367 1335369 1347415 1356250 1362559 1366809 1368865
62152A368865q36m259p487j0021j1929j3434j4562j5231j5413j5144j4518j3678
$$ 1368865 1368029 1363770 1356283 1346262 1334333 1320899 1306337 1291106 1275693 1260549 1246031 1232353
62140A232353j2802j2121j1923j2294j2931j3410j3634j3750j3744j3476j3026
$$ 1232353 1219551 1207430 1195507 1183213 1170282 1156872 1143238 1129488 1115744 1102268 1089242
62129A089242j2550j1841j0523q698o849n138l295j258O76K307L607M348M363
$$ 1089242 1076692 1064851 1054328 1045630 1038781 1033643 1030348 1029090 1029766 1032073 1035680 1040028 1044391
62116A044391M185M694N964P206P941Q411Q784Q849Q863R658J1477J3448J4815
$$ 1044391 1048576 1053270 1059234 1066440 1074381 1082792 1091576 1100425 1109288 1118946 1130423 1143871 1158686
62103A158686J5861J7165J8633J9962K1302K2851K4379K5805K7685L0471L3697
$$ 1158686 1174547 1191712 1210345 1230307 1251609 1274460 1298839 1324644 1352329 1382800 1416497
62092A416497L6595L9166M1965M5147M8190N0314N0804M9344M6519M3746M2211
$$ 1416497 1453092 1492258 1534223 1579370 1627560 1677874 1728678 1778022 1824541 1868287 1910498
62081A910498M2218M3652M6465N0120N2990N3135M9763M3858L7528L2781L0389
$$ 1910498 1952716 1996368 2042833 2092953 2145943 2199078 2248841 2292699 2330227 2363008 2393397
62070B393397K9734K9981L1320L4390L8625M2191M3812M3742M2592M0295L6811
$$ 2393397 2423131 2453112 2484432 2518822 2557447 2599638 2643450 2687192 2729784 2770079 2806890
62059B806890L2814K8945K5099K1153J7642J4963J2696J0437Q542P241N831L753
$$ 2806890 2839704 2868649 2893748 2914901 2932543 2947506 2960202 2970639 2979181 2986422 2992253 2996006
62047B996006J819J302K321M158O661J0216J4549J8749K2348K5514K8303L0567
$$ 2996006 2997825 2999127 3001448 3005606 3012267 3022483 3037032 3055781 3078129 3103643 3131946 3162513
62035C162513L2448L4164L5483L6173L6666L7467L8116L7709L6307L4824L3545
$$ 3162513 3194961 3229125 3264608 3300781 3337447 3374914 3413030 3450739 3487046 3521870 3555415
62024C555415L1751K8967K5662K2390J9013J5183J1096P406M593K486L04k725
$$ 3555415 3587166 3616133 3641795 3664185 3683198 3698381 3709477 3716883 3721476 3723962 3724266 3721541
62012C721541o419r618j1473j2489j3760j5405j6506j6447j5613j4649j3712j2579
$$ 3721541 3715122 3705504 3694031 3681542 3667782 3652377 3635871 3619424 3603811 3589162 3575450 3562871
62000C562871j1021q951o599m550l328k855k694k708l100l810m343m274l630k640
$$ 3562871 3551850 3542899 3536300 3531750 3528422 3525567 3522873 3520165 3517065 3513255 3508912 3504638 3501008 3498368
61986C498368j402J26J983M072O159Q030R630J0963J1877J2236J2195J1998J1489
$$ 3498368 3496966 3497092 3499075 3503147 3509306 3517336 3526966 3537929 3549806 3562042 3574237 3586235 3597724
61973C597724J0384Q882P439N922L712Q22j967m341o981j0409j4126j7351j9915
$$ 3597724 3608108 3616990 3624429 3630351 3634063 3634885 3632918 3628577 3621596 3611187 3597061 3579710 3559795
61960C559795k1942k3526k5191k7656l0546l2390l2673l2754l3718l4579l3937
$$ 3559795 3537853 3514327 3489136 3461480 3430934 3398544 3365871 3333117 3299399 3264820 3230883
61949C230883l2371l1404l0893k9407k6879k4781k3589k2007j9165j6016j3719
$$ 3230883 3198512 3167108 3136215 3106808 3079929 3055148 3031559 3009552 2990387 2974371 2960652
61938B960652j1987r799o837l494j92K682M855O723R237J2820J6918K0957K5027
$$ 2960652 2948665 2938866 2932029 2928535 2928343 2931025 2935880 2942603 2951840 2964660 2981578 3002535 3027562
61925C027562K9324L3592L7665M2055M7420N3822O0956O8805P7714Q8100J00329
$$ 3027562 3056886 3090478 3128143 3170198 3217618 3271440 3332396 3401201 3478915 3567015 3667344
61914C667344J14681J31245J50143J71925J97318K26468K58963K94949L35753
$$ 3667344 3782025 3913270 4063413 4235338 4432656 4659124 4918087 5213036 5548789
61905E548789L82889M36658M96111N60155O27872O97231P63326Q17748Q49419
$$ 5548789 5931678 6368336 6864447 7424602 8052474 8749705 9513031 10330779 11180198
61896A1180198Q45824P94432O85407N16224K95876M4858k10006m42735o33566
$$ 11180198 12026022 12820454 13505861 14022085 14317961 14362819 14152813 13710078 13076512
61887A3076512p71537q54795q88906q83528q49211p95688p31229o62200n93039
$$ 13076512 12304975 11450180 10561274 9677746 8828535 8032847 7301618 6639418 6046379
61878F046379n26948m66267m12044l63975l21416k84117k51730k23372j98363
$$ 6046379 5519431 5053164 4641120 4277145 3955729 3671612 3419882 3196510 2998147
61869B998147j76740j58308j41864j26299j11891r9509q9053p9714p1372o4467
$$ 2998147 2821407 2663099 2521235 2394936 2283045 2183536 2094483 2014769 1943397 1878930
61859A878930n8712n3189m7691m2794l8574l4370l0027k6279k3508k1035j8133
$$ 1878930 1820218 1767029 1719338 1676544 1637970 1603600 1573573 1547294 1523786 1502751 1484618
61848A484618j5020j2403j0539r154p914o662n445m381l433k399j312m49L30J694
$$ 1484618 1469598 1457195 1446656 1437502 1429588 1422926 1417481 1413100 1409667 1407268 1405956 1405507 1405837 1407531
61834A407531L704N189N060L886L218L642M365M500L892K860J991K051L207M501
$$ 1407531 1411235 1416424 1421484 1425370 1428588 1432230 1436595 1441095 1444987 1447847 1449838 1451889 1455096 1459597
61820A459597M955M881N266O208P104Q055R835J2504J5309J7991K0951K4159K7108
$$ 1459597 1464552 1469433 1474699 1480907 1488011 1496066 1505901 1518405 1533714 1551705 1572656 1596815 1623923
61807A623923K9944L3417L7459M1131M4230M7728N2330N7676O3305O9222P5250
$$ 1623923 1653867 1687284 1724743 1765874 1810104 1857832 1910162 1967838 2031143 2100365 2175615
61796B175615Q1039Q7059R4381J03067J12029J20909J30811J42654J56163J71126
$$ 2175615 2256654 2343713 2438094 2541161 2653190 2774099 2904910 3047564 3203727 3374853
61786C374853J88396K08796K32229K58671K88967L23755L62826M06475M56471
$$ 3374853 3563249 3772045 4004274 4262945 4551912 4875667 5238493 5644968 6101439
61777F101439N14581N81185O56353P41197Q36752R42165J055148J173138J292063
$$ 6101439 6616020 7197205 7853558 8594755 9431507 10373672 11428820 12601958 13894021
61768A3894021J403677J494663J547491J541125J452830J264142R69794N84019
$$ 13894021 15297698 16792361 18339852 19880977 21333807 22597949 23567743 24151762
61760B4151762J40120l16322p38033j087216j342874j501185j570619j566489
$$ 24151762 24291882 23975560 23237527 22150311 20807437 19306252 17735633 16169144
61752A6169144j507334j412026j296774j173453j050090r32151q23169p24905
$$ 16169144 14661810 13249784 11953010 10779557 9729467 8797316 7974147 7249242
61744G249242o37807n61633m95747m39112l90313l47788l10242k76982k47751
$$ 7249242 6611435 6049802 5554055 5114943 4724630 4376842 4066600 3789618 3541867
61735C541867k22210j99742j79769j61956j45928j31202j17611j05527r5320q6755
$$ 3541867 3319657 3119915 2940146 2778190 2632262 2501060 2383449 2277922 2182602 2095847
61725B095847p9190p2195o5740n9894n4595m9654m4924m0469l6479l2883k9200
$$ 2095847 2016657 1944462 1878722 1818828 1764233 1714579 1669655 1629186 1592707 1559824 1530624
61714A530624k5163k1171j7740j4686j1561q710o923n982m669k573r19r05k024
$$ 1530624 1505461 1484290 1466550 1451864 1440303 1431593 1424670 1418688 1414019 1411446 1410527 1409622 1407598
61701A407598k835k839k736l187m216n595p176q786j0322j1840j3215j3994j4048
$$ 1407598 1404763 1401924 1399188 1396001 1391785 1386190 1379014 1370228 1359906 1348066 1334851 1320857 1306809
61688A306809j4067j4853j6276j7535j8279j8855j9398j9406j8505j7141j6108
$$ 1306809 1292742 1277889 1261613 1244078 1225799 1206944 1187546 1168140 1149635 1132494 1116386
61677A116386j5512j4759j3547j2387j1778j1157r433o651m281l373l063j824
$$ 1116386 1100874 1086115 1072568 1060181 1048403 1037246 1027813 1021162 1016881 1013508 1010445 1008621
61665A008621K86J709J659J203J724L260M844N782O076O098O287O835P327P121
$$ 1008621 1008907 1010616 1012275 1013478 1015202 1018462 1023306 1029088 1035164 1041262 1047549 1054384 1061711 1068832
61651A068832O302N718N804N909N198L667J864Q3j656l186m307n129n836o289
$$ 1068832 1075134 1080852 1086656 1092565 1097763 1101430 1103294 1103377 1101721 1098535 1094228 1089099 1083263 1076974
61637A076974o193n569m833m467m650n067n097m410l376k575k025j295l06N04
$$ 1076974 1070781 1065212 1060379 1055912 1051262 1046195 1041098 1036688 1033312 1030737 1028712 1027417 1027111 1027615
61623A027615P89O36K99O2K38Q32J360J562K055L485N259O124N908N630N866O155
$$ 1027615 1028404 1029040 1029339 1029401 1029639 1030471 1031831 1033393 1035448 1038933 1044192 1050316 1056224 1061854 1067720 1073875
61607A073875O203O375O689O424N371M358L933L456K139J78j798l618n240o303
$$ 1073875 1080078 1086453 1093142 1099566 1104937 1109295 1113228 1116684 1118823 1119001 1117203 1113585 1108345 1102042
61593A102042o675o841p164p422p539p936q632q820q014o825n966n214m061k600
$$ 1102042 1095367 1088526 1081362 1073940 1066401 1058465 1049833 1041013 1032999 1026174 1020208 1014994 1010933 1008333
61579A008333j104N52K411M111N707P963J1089J4068J6124J7947K0541K3592K6123
$$ 1008333 1007229 1007781 1010192 1014303 1020010 1027973 1039062 1053130 1069254 1087201 1107742 1131334 1157457
61566A157457K8049K9972L1971L3677L5063L6116L6250L5091L3419L2312L1699
$$ 1157457 1185506 1215478 1247449 1281126 1316189 1352305 1388555 1423646 1457065 1489377 1521076
61555A521076L0782K9454K8245K7164K5687K3705K1541J9210J6540J3693J0674
$$ 1521076 1551858 1581312 1609557 1636721 1662408 1686113 1707654 1726864 1743404 1757097 1767771
61544A767771O792J620l833q116j1268j4523j8268k1482k3248k3714k3341k2261
$$ 1767771 1774563 1776183 1772350 1764234 1752966 1738443 1720175 1698693 1675445 1651731 1628390 1606129
61532A606129k0654j8954j7340j5725j4215j2976j1614r518o788m058j364J938
$$ 1606129 1585475 1566521 1549181 1533456 1519241 1506265 1494651 1485133 1478345 1474287 1472923 1474861
61520A474861N978J0022J3634J7438K2314K8339L4944M1745M8888N6851O6103
$$ 1474861 1480839 1490861 1504495 1521933 1544247 1572586 1607530 1649275 1698163 1755014 1821117
61509A821117P6756Q8497J00914J13881J27499J41983J57770J75462J95188K16186
$$ 1821117 1897873 1986370 2087284 2201165 2328664 2470647 2628417 2803879 2999067 3215253
61499C215253K37174K56815K73600K85656K90967K87333K72007K42423J98277
$$ 3215253 3452427 3709242 3982842 4268498 4559465 4846798 5118805 5361228 5559505
61490E559505J42681Q0775J7507m2991r7059j41917j76459k00880k15755k21996
$$ 5559505 5702186 5782961 5800468 5757477 5660418 5518501 5342042 5141162 4925407 4703411
61480D703411k21195k14999k04314j89776j72708j54821j37143j19913j03248
$$ 4703411 4482216 4267217 4062903 3873127 3700419 3545598 3408455 3288542 3185294
61471C185294q7220p1590n6145m1187k7111j3924j736Q856J7710K5907L4543M3158
$$ 3185294 3098074 3026484 2970339 2929152 2902041 2888117 2886381 2895237 2912947 2938854 2973397 3016555
61459C016555N0264N5143N8172N9719N9779N8495N6147N2691M8229M3623L9862
$$ 3016555 3066819 3121962 3180134 3239853 3299632 3358127 3414274 3466965 3515194 3558817 3598679
61448C598679L7041L4849L3634L3997L5728L8177M1322M5349M9488N2530N4283
$$ 3598679 3635720 3670569 3704203 3738200 3773928 3812105 3853427 3898776 3948264 4000794 4055077
61437D055077N5298N5386N3749N0397M6010M0438L2810K3247J3066L093o882j6790
$$ 4055077 4110375 4165761 4219510 4269907 4315917 4356355 4389165 4412412 4425478 4428571 4421689 4404899
61425D404899k5887l4020m1821m9126n4523n7116n7541n6545n3779m8913m2870
$$ 4404899 4379012 4344992 4303171 4254045 4199522 4142406 4084865 4028320 3974541 3925628 3882758
61414C882758l6930l1222k5006j8002j0742l988J731O283R970J2971J4641J3941
$$ 3882758 3845828 3814606 3789600 3771598 3760856 3756868 3758599 3764882 3774852 3787823 3802464 3816405
61402C816405J0754O144J132m012r124j3634j7121j9623k0948k0363j7313j1849
$$ 3816405 3827159 3833303 3834435 3830423 3821299 3807665 3790544 3770921 3749973 3729610 3712297 3700448
61390C700448m071O151J8541L2367M7502O4785Q4693J06340J28445J50822J74180
$$ 3700448 3696377 3702528 3721069 3753436 3800938 3865723 3950416 4056756 4185201 4336023 4510203
61379D510203J98803K24041K48881K72300K93041L09410L19368L20716L11296
$$ 4510203 4709006 4933047 5181928 5454228 5747269 6056679 6376047 6696763 7008059
61370G008059K89254K53492K04374J44640P9374J4495m5299r7490j41506j78152
$$ 7008059 7297313 7550805 7755179 7899819 7979193 7993688 7948389 7850899 7709393 7531241
61360G531241k08865k34622k55399k70911k81445k87485k88999k85957k79141
$$ 7531241 7322376 7087754 6832355 6561444 6279999 5992514 5703515 5417558 5138417
61351E138417k69613k57593k42872k26039k08382j90666j72992j55641j38974
$$ 5138417 4868804 4611211 4368339 4142300 3933918 3743252 3570260 3414619 3275645
61342C275645j22680j06301r0395p6033o3160n0731l8428k6899j6233n666M903
$$ 3275645 3152965 3046664 2956269 2880236 2817076 2766345 2727917 2701018 2684785 2679119 2684022
61331B684022J4567K2996L0880L8375M4535M9021N2824N6452N8819N8968N7736
$$ 2684022 2698589 2721585 2752465 2790840 2835375 2884396 2937220 2993672 3052491 3111459 3169195
61320C169195N6419N4885N2273M8751M5200M1683L7605L3155K9457K7151K5687
$$ 3169195 3225614 3280499 3332772 3381523 3426723 3468406 3506011 3539166 3568623 3595774 3621461
61309C621461K4038K1559J8158J3959Q964L036l537r716j4659j8887k3678k9201
$$ 3621461 3645499 3667058 3685216 3699175 3708139 3711175 3707638 3697922 3683263 3664376 3640698 3611497
61297C611497l4394l8826m3361m8490n3307n7040o0299o3637o5982o5844o3402
$$ 3611497 3577103 3538277 3494916 3446426 3393119 3336079 3275780 3212143 3146161 3080317 3016915
61286C016915o0053n6377n1867m6352m0319l3942k7025j9933j3619q548m500j502
$$ 3016915 2956862 2900485 2848618 2802266 2761947 2728005 2700980 2681047 2667428 2658880 2654380 2652878
61274B652878lO2n12j271k691n230q329j0923j2660j4090j5702j7194j7881j7492
$$ 2652878 2652875 2652937 2652425 2651154 2648463 2643233 2634904 2623981 2611321 2597231 2581529 2564335 2546454 2528962
61260B528962j6213j3932r972l819M120J3010K2557L3026M4406N6252O8385Q1077
$$ 2528962 2512749 2498817 2488845 2485026 2489146 2502156 2524713 2557739 2602145 2658397 2726782 2807859
61248B807859R4371J07804J20859J33128J43651J50696J52555J48176J36818J17647
$$ 2807859 2902230 3010034 3130893 3264021 3407672 3558368 3710923 3859099 3995917 4113564
61238D113564R0126N4700J3043l1965p6466j16473j49041j72659j86849j92043
$$ 4113564 4203690 4258390 4271433 4239468 4163002 4046529 3897488 3724829 3537980 3345937
61228C345937j89799j82319j71351j57923j43104j28233j14171j01020q8854p8163
$$ 3345937 3156138 2973819 2802468 2644545 2501441 2373208 2259037 2158017 2069163 1991000
61218A991000o9205o1553n4587m8077m2005l6322l1054k6197k1433j6430j1434
$$ 1991000 1921795 1860242 1805655 1757578 1715573 1679251 1648197 1622000 1600567 1584137 1572703
61207A572703o927k696J959O990J1459J4863J7728K0554K2883K3827K2931K0244
$$ 1572703 1565776 1563080 1565039 1572029 1583488 1598351 1616079 1636633 1659516 1683343 1706274 1726518
61195A726518J6268J2100Q782O246L585O11j741k928l751n241p364r490j1408
$$ 1726518 1742786 1754886 1763668 1769914 1773499 1774110 1772369 1769441 1765690 1760449 1753085 1743595 1732187
61182A732187j3223j4767j5792j6375j6757j7050j7326j7541j7317j6390j5318
$$ 1732187 1718964 1704197 1688405 1672030 1655273 1638223 1620897 1603356 1586039 1569649 1554331
61171A554331j5036j5613j6255j6642j7312j8628k0330k2282k4646k7011k8537
$$ 1554331 1539295 1523682 1507427 1490785 1473473 1454845 1434515 1412233 1387587 1360576 1332039
61160A332039k9223k9874l0453k9895k8082k6565k6392k6651k6254k5910k6964
$$ 1332039 1302816 1272942 1242489 1212594 1184512 1157947 1131555 1104904 1078650 1052740 1025776
61149A025776k9112l0665l0629k9369k7592k5645k3648k1484j8907j6024j3330
$$ 1025776 996664 965999 935370 906001 878409 852764 829116 807632 788725 772701 759371
61138G59371j0929q416n833l875k683j417M14K158L298M440O149P785Q556Q851
$$ 759371 748442 740026 734193 730318 727635 726218 726632 728790 732088 736528 742677 750462 759018 767869
61124G67869R448J0143J0299J0199J0672J1826J3152J4482J5934J7231J7977J8327
$$ 767869 777317 787460 797759 807958 818630 830456 843608 858090 874024 891255 909232 927559
61112I27559J8733J9328K0111K1145K2015K1713J9749J6845J3892J0930P780M755
$$ 927559 946292 965620 985731 1006876 1028891 1050604 1070353 1087198 1101090 1112020 1119800 1124555
61100A124555K071o73l514n464n869n649o177p490q659r355r967j0625j1183j1848
$$ 1124555 1126626 1125953 1122439 1116975 1111106 1105457 1099280 1091790 1083131 1073776 1063809 1053184 1042001 1030153
61086A030153j2871j3867j4223j3929j3388j2761j2058j1459j1020j0507r901
$$ 1030153 1017282 1003415 989192 975263 961875 949114 937056 925597 914577 904070 894169
61075H94169r474r001p803n986m692m508m720m696m830n371n619n269n319o411
$$ 894169 884695 875694 867891 861905 857213 852705 847985 843289 838459 833088 827469 822200 816881 810470
61061H10470p485p390o833p247q501r224q821p806o637n429m417l731l044k153
$$ 810470 802985 795595 788762 781515 773014 763790 754969 747163 740526 735097 730680 726949 723905 721752
61047G21752j301l93J202L336M784N081N414O653P920Q262Q369R220J0321J0850
$$ 721752 720451 720058 721260 724596 729380 734461 739875 746528 754448 762710 771079 780299 790620 801470
61033H01470J1278J2237J2980J2723J2363J3019J3904J3547J2285J1638J2020
$$ 801470 812748 824985 837965 850688 863051 876070 889974 903521 915806 927444 939464
61022I39464J2846J4089J5859J7283J7648J7915J9279K1090K2064K2663K4247
$$ 939464 952310 966399 982258 999541 1017189 1035104 1054383 1075473 1097537 1120200 1144447
61011A144447K6604K8422K9552L0920L2824L5143L8369M2639M6690M9748N3291
$$ 1144447 1171051 1199473 1229025 1259945 1292769 1327912 1366281 1408920 1455610 1505358 1558649
61000A558649N8844O5191O9996P2957P5075P6384P7245Q0349Q8184R9609J12083
$$ 1558649 1617493 1682684 1752680 1825637 1900712 1977096 2054341 2134690 2222874 2322483 2434566
60989B434566J25916J42762J61259J78346J94229K12173K34314K61967K99050
$$ 2434566 2560482 2703244 2864503 3042849 3237078 3449251 3683565 3945532 4244582
60980D244582L50293M16540M96740N93727P12666Q55157J022224J222968J472810
$$ 4244582 4594875 5011415 5508155 6101882 6814548 7669705 8691929 9914897 11387707
60971A1387707J783943K164282K612442L076392L398704L342724K746328J692174
$$ 11387707 13171650 15335932 17948374 21024766 24423470 27766194 30512522 32204696
60963C2204696N12391m08563q56132q38208m77189Q2286O50405R56346P44162
$$ 32204696 32717087 32308524 31452392 30614184 30136995 30219281 30869686 31826032 32570194
60954C2570194l7404j151093k209101k914595l192142l134329k875446k519941
$$ 32570194 32532790 31381697 29172596 26258001 23065859 19931530 17056084 14536143
60946A4536143k139296j781469j469152j204212r82616q02051o57805n41541m47468
$$ 14536143 12396847 10615378 9146226 7942014 6959398 6157347 5499542 4958001 4510533
60937D510533l74388l20176k79360k47483k23413k05716j90781j76159j62382
$$ 4510533 4136145 3815969 3536609 3289126 3065713 2859997 2669216 2493057 2330675
60928B330675j49934j37375j23718j09984r7101q4813p3797o6376o3550o3329
$$ 2330675 2180741 2043366 1919648 1809664 1712563 1627750 1553953 1487577 1424027 1360698
60918A360698o3222o2533o1126n7996n2665m6604m1700l8164l4921l1277k7306
$$ 1360698 1297476 1234943 1173817 1115821 1063156 1016552 974852 936688 901767 870490 843184
60907H43184k3424k0234j8179j6830j5225j3152j1296j0021q943p848p060o649
$$ 843184 819760 799526 781347 764517 749292 736140 724844 714823 705880 698032 690972 684323
60895F84323o222n739n522n293m290k566j200p59n48K56J529K685L511M100M476
$$ 684323 678101 672362 666840 661547 657257 654691 653491 652732 652184 652440 653969 656654 660165 664265 668741
60880F68741M637M597M334M067M436N791P504Q713R537J0747J2329J3329J3141
$$ 668741 673378 677975 682309 686376 690812 696603 704107 712820 722357 733104 745433 758762 771903
60867G71903J2095J0656Q931P050N312L628J478j330m370p116r336j1001j2250
$$ 771903 783998 794654 803585 810635 815947 819575 821053 819723 815353 808237 798901 787900 775650
60854G75650j3352j4212j4107j2511j0041p896o452n056l112p03J815M182O164
$$ 775650 762298 748086 733979 721468 711427 703531 697079 692023 688911 688208 690023 694205 700369
60841G00369P692R066J0552J1835J2317J1846J0713R181P525O341O176P020Q601
$$ 700369 708061 717127 727679 739514 751831 763677 774390 783571 791096 797437 803613 810633 819234
60828H19234J0913J3849J6603J8131J8150J7135J5632J4051J2868J2268J1803
$$ 819234 830147 843996 860599 878730 896880 914015 929647 943698 956566 968834 980637
60817I80637J0955R883Q999Q141O864N358M315L980L920L699L187K310J004o79
$$ 980637 991592 1001475 1010474 1018615 1025479 1030837 1035152 1039132 1043052 1046751 1049938 1052248 1053252 1052573
60803A052573k808n699r310j2831j5409j7060j8420j9840k1258k2606k3725k4077
$$ 1052573 1049765 1044066 1034756 1021925 1006516 989456 971036 951196 929938 907332 883607 859530
60791H59530k3141k1025j8315j5524j2972j0836q929o826m476k260k52J934M267
$$ 859530 836389 815364 797049 781525 768553 757717 748788 741962 737486 735226 734974 736908 741175
60778G41175O097P253Q465J0128J1574J2236J2580J3034J3021J2078J0962J0482
$$ 741175 747272 754525 762990 773118 784692 796928 809508 822542 835563 847641 858603 869085
60766H69085J0031Q618O655N262M348K876P60r39j515j125R6K072M188N834P450
$$ 869085 879116 887734 894389 899651 903999 906875 907635 906696 905181 904056 904152 906224 910412 916246 923696
60751I23696R923J2984J5449J6972J8388K0205K1820K2417K1661J9555J6403J2957
$$ 923696 933619 946603 962052 979024 997412 1017617 1039437 1061854 1083515 1103070 1119473 1132430
60739A132430R759O528L009R3j086r06q83j648k535l145m018n453o955q172r393
$$ 1132430 1142189 1148717 1151726 1151819 1150733 1149827 1148944 1147296 1144761 1141616 1137598 1132145 1125190 1117018 1107625
60724A107625j0737j1801j2386j2818j3228j3320j3064j2837j2730j2486j2260
$$ 1107625 1096888 1085087 1072701 1059883 1046655 1033335 1020271 1007434 994704 982218 969958
60713I69958j2614j3543j4279j4345j4156j4311j4828j5311j5363j4830j4002
$$ 969958 957344 943801 929522 915177 901021 886710 871882 856571 841208 826378 812376
60702H12376j3424j3074j2063r745o788m361k566n61J950M356O190P646R072J0702
$$ 812376 798952 785878 773815 764070 757282 752921 750355 749794 751744 756100 762290 769936 779008 789710
60688G89710J2776J5116J6767J6785J5294J3000J0074O372K339j329m657p946
$$ 789710 802486 817602 834369 851154 866448 879448 889522 895894 898233 896904 892247 884301
60676H84301j0851j3016j5184j8162k0972k1728k0288j8446j7282j5992j3744
$$ 884301 873450 860434 845250 827088 806116 784388 764100 745654 728372 712380 698636
60665F98636j1092q869p036n406m394m269m533m655m705m798m754m653m888n323
$$ 698636 687544 678675 671639 666233 661839 657570 653037 648382 643677 638879 634125 629472 624584 619261
60651F19261n223m347l277k310j026O94K105K518K022R57m93j894k591k525k197
$$ 619261 614038 609691 606414 604104 603078 603772 605877 608395 610417 611374 610881 608987 606396 603871 601674
60636F01674j585l6K422M657N782O165O567P216Q083R301J0751J1923J2638J3375
$$ 601674 600089 600053 602475 607132 612914 619079 625646 632862 640945 650246 660997 672920 685558 698933
60622F98933J4559J6172J8181K0584K2878K4361K5171K6139K7396K8155K8070
$$ 698933 713492 729664 747845 768429 791307 815668 840839 866978 894374 922529 950599
60611I50599K7709K7290K6116K3826K1107J8528J5663J2094Q312M845J289k927
$$ 950599 978308 1005598 1031714 1055540 1076647 1095175 1110838 1122932 1131244 1136089 1137378 1134451
60599A134451p576j2135j6557k0847k4431k6686k7580k7228k5513k2689j9759
$$ 1134451 1126875 1114740 1098183 1077336 1052905 1026219 998639 971411 945898 923209 903450
60588I03450j7446j5373j2868j0097p728n955m577l694l624m360n553o844p936
$$ 903450 886004 870631 857763 847666 839938 833983 829406 825712 822088 817728 812175 805331 797395
60575G97395q608q871q750p911o056l734j994j038m4J384K537K854K894L412M327
$$ 797395 788787 779916 771166 763255 757199 753465 751471 750433 750389 751773 754310 757164 760058 763470 767797
60560G67797N209O134P204P887P671O892O263N942N715N691O100O704P115P496
$$ 767797 773006 779140 786344 794231 801902 808794 815057 820999 826714 832405 838505 845209 852324 859820
60546H59820Q394R996J2036J4328J7039K0523K5018L0432L6335M2368M8428N3976
$$ 859820 868214 878210 890246 904574 921613 942136 967154 997586 1033921 1076289 1124717 1178693
60534A178693N7376N6701N1332M2055K9581J4047l673k1180l5800m6102n1889
$$ 1178693 1236069 1292770 1344102 1386157 1415738 1429785 1426112 1404932 1369132 1323030 1271141
60523A271141n3432n1314m6474l9787l1935k3851j6640j0608m996Q33O429J0871
$$ 1271141 1217709 1166395 1119921 1080134 1048199 1024348 1007708 997100 992104 992937 999366 1010237
60511A010237J3786J5347J5775J5367J4689J4351J4796J6365J9239K3293K8528
$$ 1010237 1024023 1039370 1055145 1070512 1085201 1099552 1114348 1130713 1149952 1173245 1201773
60500A201773L5513M4667N5300O6360P8160R2291J09661J29624J51277J74322
$$ 1201773 1237286 1281953 1337253 1403613 1481773 1574064 1683725 1813349 1964626 2138948
60490B138948J98300K22263K45845K69662K93976L17707L38647L52926L53628
$$ 2138948 2337248 2559511 2805356 3075018 3368994 3686701 4025348 4378274 4731902
60481D731902L32156K83133K07799J12151L372j10356k18214l08140l71202m04540
$$ 4731902 5064058 5347191 5554990 5667141 5670513 5560157 5341943 5033803 4662601 4258061
60471D258061m10701l95512l66188l29600k90866k53197k18518j87768j60947
$$ 4258061 3847360 3451848 3085660 2756060 2465194 2211997 1993479 1805711 1644764
60462A644764j37685j17802j01145q7285p5725o6010n7464m9487m2336l6779l2600
$$ 1644764 1507079 1389277 1288132 1200847 1125122 1059112 1001648 952161 909825 873046 840446
60451H40446k8505k4031k0384j8544j7677j6529j5289j4748j4522j3656j2385
$$ 840446 811941 787910 767526 748982 731305 714776 699487 684739 670217 656561 644176
60440F44176j1716j1643j1249j0338r484q629p211n619n017n387n258l831k120
$$ 644176 632460 620817 609568 599230 589746 581117 573906 568287 563270 557883 552625 548794 546674
60427E46674j315j134o13L64J157J488J599J622J507J477K014L228M536N126M697
$$ 546674 545359 544225 543612 543976 545133 546621 548220 549842 551349 552826 554840 558068 562604 567730 572427
60412E72427L740L056K960L013K582J565N39K74J164K863M477N293N391N349N481
$$ 572427 576167 579223 582183 585196 587778 589343 589882 590156 591320 594183 598660 603953 609344 614693 620174
60397F20174N682N941O456P236Q041Q814R611J0096R749Q654P390O071M307K228
$$ 620174 625856 631797 638253 645489 653530 662344 671955 682051 691800 700454 707844 713915 718222 720450
60383G20450N81m56j606l217m656n466o153p100p654p109n766m302k862j621j309
$$ 720450 721031 720575 718969 715752 711096 705630 699477 692377 684723 677614 671848 667546 664684 663063 661754
60368F61754k132k920k535j508j125j404j288n28k4k69o45m30L54J272J951K193
$$ 661754 659622 656702 654167 652659 651534 650130 648842 648314 648290 648021 647376 646946 647300 648572 650523 652716
60352F52716K211K642L785M986N490N615O283P548Q421Q164O969N378L772K563
$$ 652716 654927 657569 661354 666340 671830 677445 683728 691276 699697 707861 714830 720208 723980 726543
60338G26543K097K067J581K17j274j620l68J558K729K785K913M423O985Q950R396
$$ 726543 728640 730707 732288 732505 731231 729611 729243 730801 733530 736315 739228 743651 750636 759586 768982
60323G68982R012Q754Q475P457N565L205P36j532l223m304n144n785n754m965
$$ 768982 777994 786748 795223 802680 808245 811450 812186 810654 807431 803127 797983 792198 786444 781479
60309G81479m025l248k313j355j246k010k158p50Q98R29l62j069l83P09J219J283
$$ 781479 777454 774206 771893 770538 769292 767282 765124 764374 765272 766201 765839 764770 764387 765096 766315 767598
60293G67598J418J817K438L036L106K531J958J870J767J142P16J528L214M401
$$ 767598 769016 770833 773271 776307 779413 781944 783902 785772 787539 788681 789397 790925 794139 798540
60279G98540M691M962N762O604P005P248P811Q830J0195J1606J2576J2953J3350
$$ 798540 803231 808193 813955 820559 827564 834812 842623 851453 861648 873254 885830 898783 912133
60266I12133J4453J6197J8135K0240K2577K4753K6552K8670L1796L5404L8539
$$ 912133 926586 942783 960918 981158 1003735 1028488 1055040 1083710 1115506 1150910 1189449
60255A189449M1417M5044M9615N4472N9511O5315P2042P9280Q6939R5098J03112
$$ 1189449 1230866 1275910 1325525 1379997 1439508 1504823 1576865 1656145 1743084 1838182 1941294
60244A941294J10085J16171J22126J27615J31245J32307J31193J27932J21813
$$ 1941294 2051379 2167550 2289676 2417291 2548536 2680843 2812036 2939968 3061781
60235C061781J12799J02004R0186P6888O1631M5041K8274J2074l215j7411l0519
$$ 3061781 3174580 3276584 3366770 3443658 3505289 3550330 3578604 3590678 3587463 3570052 3539533
60224C539533m2251n1450n6865n8656n8208n6240n2056m4990l5497k4436j2204
$$ 3539533 3497282 3445832 3388967 3330311 3272103 3215863 3163807 3118817 3083320 3058884 3046680
60213C046680Q87J4252K7620M1403N5915P0765Q5316R9257J12350J24090J33838
$$ 3046680 3047567 3061819 3089439 3130842 3186757 3257522 3342838 3442095 3554445 3678535 3812373
60202C812373J40874J44289J43335J37981J28647J15532R8803P9299N8245L6285
$$ 3812373 3953247 4097536 4240871 4378852 4507499 4623031 4721834 4801133 4859378 4895663
60192D895663J3564r389l1713n2964p2888r0539j04674j14989j21807j24704j22731
$$ 4895663 4909227 4899838 4868125 4815161 4742273 4651734 4547060 4432071 4310264 4185560 4062829
60181D062829j16110j06310r4145p9244o1790m3242k4603n341J5045L5506N4457
$$ 4062829 3946719 3840409 3746264 3667020 3605230 3561988 3537385 3532044 3547089 3582595 3637052
60170C637052P1303Q5971R7751J05674J09301J08257J01780Q9883P4467N8033
$$ 3637052 3708355 3794326 3892077 3997751 4107052 4215309 4317089 4406972 4481439 4539472
60160D539472M1543K4506O934r938k4901l7765m8718n7266o2185o2381n7720m9105
$$ 4539472 4581015 4605521 4612455 4602517 4577616 4539851 4491133 4433867 4371682 4309301 4251581 4202476
60148D202476l7729k4167q402R315K8106M7259O7034Q8243J11155J35185J59558
$$ 4202476 4164747 4140580 4132178 4141493 4169599 4216858 4283892 4372135 4483290 4618475 4778033
60137D778033J84049K09104K35330K62762K90572L17553L42890L66253L87130
$$ 4778033 4962082 5171186 5406516 5669278 5959850 6277403 6620293 6986546 7373676
60128G373676M04312M16168M21388M19398M10093L93139L67777L33660K91896
$$ 7373676 7777988 8194156 8615544 9034942 9445035 9838174 10205951 10539611 10831507
60119A0831507K44717J93957J40374Q4530K7456l0046q7920j45722k01559k52959
$$ 10831507 11076224 11270181 11410555 11495085 11522541 11492495 11404575 11258853 11057294 10804335
60109A0804335k98272l36328l65383l83627l90639l87251l74242l52195l22535
$$ 10804335 10506063 10169735 9804352 9420725 9030086 8642835 8268593 7916398 7593863
60100G593863k87559k49258k08919j67669j26448q5450m4566m411L3920O9821
$$ 7593863 7306304 7057046 6848127 6680458 6554010 6468560 6423994 6419583 6453503 6523324
60090F523324J02910J31932J55089J71360J80412J81407J73270J56255J32034
$$ 6523324 6626234 6758166 6913255 7084615 7265027 7446434 7619704 7775959 7907993
60081G907993J02237O8235L2304k724l5480o6345r5437j21830j45205j66537j86179
$$ 7907993 8010230 8078465 8110769 8108045 8072565 8006220 7910783 7788953 7643748 7477211 7291032
60070G291032k02716k14777k22731k27324k27795k22698k12047j97415j80343
$$ 7291032 7088316 6873539 6650808 6423484 6195689 5972991 5760944 5563529 5383186
60061E383186j61616j41741j21090r9667p7405n4547l1422q180J4866L7150N8430
$$ 5383186 5221570 5079829 4958739 4859072 4781667 4727120 4695698 4687518 4702384 4739534 4797964
60050D797964P9054R9194J18169J34794J47848J56015J58158J54055J44341J29489
$$ 4797964 4877018 4976212 5094381 5229175 5377023 5533038 5691196 5845251 5989592 6119081
60040F119081J09614Q5515N8965L1365K855k6658n6256q4421j10055j32452j50754
$$ 6119081 6228695 6314210 6373175 6404540 6407395 6380737 6324481 6240060 6130005 5997553 5846799
60029E846799j64103j72076j74600j71869j64576j53758j40133j24098j06521
$$ 5846799 5682696 5510620 5336020 5164151 4999575 4845817 4705684 4581586 4475065
60020D475065q8788p1730n5181l8780k2428n704J2149L1216N0747P0508R1307
$$ 4475065 4386277 4314547 4259366 4220586 4198158 4192454 4204603 4235819 4286566 4357074 4448381
60009D448381J13516J35979J57161J76555J93924K07797K15822K16443K09479
$$ 4448381 4561897 4697876 4855037 5031592 5225516 5433313 5649135 5865578 6075057
60000F075057J95332J74479J47814J16880Q3511M9176J4535k0329n4962q7978
$$ 6075057 6270389 6444868 6592682 6709562 6793073 6842249 6856784 6836455 6781493 6693515
59990F693515j17880j44123j66489j83571j93227j94757j89508j79033j63898
$$ 6693515 6575635 6431512 6265023 6081452 5888225 5693468 5503960 5324927 5161029
59981E161029j44830j23627j01968q0205n8252l6692j6030M299K4959M5270O3808
$$ 5161029 5016199 4892572 4790604 4710399 4652147 4615455 4599425 4603724 4628683 4673953 4737761
59970D737761Q0070R4502J07171J17399J24589J28586J29223J26253J19768J10237
$$ 4737761 4817831 4912333 5019504 5136903 5261492 5390078 5519301 5645554 5765322 5875559
59960E875559R8139Q3880O7983N1104L4036J7805L457q441j7759k4139k6744k4812
$$ 5875559 5973698 6057578 6125561 6176665 6210701 6228506 6231963 6223522 6205763 6181624 6154880 6130068
59948F130068j7987o158J0459L1036N4690Q1428J11811J45694J82150K20790K61934
$$ 6130068 6112081 6105923 6116382 6147418 6202108 6283536 6395347 6541041 6723191 6943981 7205915
59937G205915L05152L48671L90778M30652M67110M97457N18284N26549N19127
$$ 7205915 7511067 7859738 8250516 8681168 9148278 9645735 10164019 10690568 11209695
59928A1209695M92411M43552L72041K79795J70630N0416p3068j91552k97836l86263
$$ 11209695 11702106 12145658 12517699 12797494 12968124 13018540 12945472 12753920 12456084 12069821
59918A2069821m53131m97521n21033n26029n14716m90151m56631m17893l75653
$$ 12069821 11616690 11119169 10598136 10072107 9557391 9067240 8610609 8192716 7817063
59909G817063l30810k85115k40465j97313j55016j13339p2555l2631O550M4429
$$ 7817063 7486253 7201138 6960673 6763360 6608344 6495005 6422450 6389819 6396369 6440798
59899F440798Q0293J14184J46378J76183K02183K23309K38642K46326K43723K28760
$$ 6440798 6521091 6635275 6781653 6957836 7160019 7383328 7621970 7868296 8112019 8340779
59889H340779K00591J59323J06097M3547k4617r4620j62853k25432k78480l19297
$$ 8340779 8541370 8700693 8806790 8850337 8825720 8731100 8568247 8342815 8064335 7745038
59879G745038l47075l62459l66693l61101l47168l26941l03046k77766k52070
$$ 7745038 7397963 7035504 6668811 6307710 5960542 5633601 5330555 5052789 4800719
59870D800719k25885j99266j72730j46803j22122j00002q1814o7625n6491m8263
$$ 4800719 4574834 4375568 4202838 4056035 3933913 3833911 3752097 3684472 3627981 3579718
59860C579718m3845m3331m5193m7988n1482n5312n7848n7566n4616m9908m3513
$$ 3579718 3535873 3492542 3447349 3399361 3347879 3292567 3234719 3177153 3122537 3072629 3029116
59849C029116l5101k5264j5246n924J977P217Q675O305P36p645j8371l0193m1388
$$ 3029116 2994015 2968751 2953505 2947581 2949558 2956775 2965450 2971755 2972491 2964846 2946475 2916282 2874894
59836B874894n0482n6276n8022n6283n2752m8424m2718l5065k6434j8232j0527
$$ 2874894 2824412 2768136 2710114 2653831 2601079 2552655 2509937 2474872 2448438 2430206 2419679
59825B419679k499O001J4447K2693L1085L9887M9262N9151O8387P4858P7544P7775
$$ 2419679 2417180 2423181 2437628 2460321 2491406 2531293 2580555 2639706 2708093 2782951 2860495 2938270
59813B938270P7576P7507P6973P5629P3200O8633O0886N0131L7160K2237N860
$$ 2938270 3015846 3093353 3170326 3245955 3319155 3387788 3448674 3498805 3535965 3558202 3564062
59802C564062r760k1485k7571k8500k5822k0928j4569o701L096J4623K7123M0670
$$ 3564062 3554302 3532817 3505246 3476746 3450924 3429996 3415427 3408726 3411822 3426445 3453568 3494238
59790C494238N6443P4898R4827J15253J37245J62668J92094K25144K61877L02373
$$ 3494238 3550681 3625579 3720406 3835659 3972904 4135572 4327666 4552810 4814687 5117060
59780E117060L45610L89799M32707M69795M92431M89486M51140L71950K53432
$$ 5117060 5462670 5852469 6285176 6754971 7247402 7736888 8188028 8559978 8813410
59771H813410J06732m8181j89347l00968l76234m15142m22368m06123l75441l36942
$$ 8813410 8920142 8871961 8682614 8381646 8005412 7590270 7167902 6761779 6386338 6049396
59761F049396k94551k51381k10077j71707j36310j04506p6973n2712k9820p989
$$ 6049396 5754845 5503464 5293387 5121680 4985370 4880864 4803891 4751179 4721359 4713370
59751D713370J1551K8562M4452O0258P5785R1018J06775J23494J40828J58777
$$ 4713370 4724921 4753483 4797935 4858193 4933978 5024996 5131771 5255265 5396093 5554870
59741E554870J77940J98464K19936K42536K67106K94036L23194L54949L89926
$$ 5554870 5732810 5931274 6151210 6393746 6660852 6954888 7278082 7633031 8022957
59732H022957M27855M67899N09918N53939N98452O40614O78034P08698P29359
$$ 8022957 8450812 8918711 9428629 9982568 10581020 11221634 11899668 12608366 13337725
59723A3337725P36003P26431P01070O61344O09424N50152M91334M40771M03753
$$ 13337725 14073728 14800159 15501229 16162573 16771997 17322149 17813483 18254254 18658007
59714A8658007L83430L81893L99607M34677M83454N41406O03091O62193P12181
$$ 18658007 19041437 19423330 19822937 20257614 20741068 21282474 21885565 22547758 23259939
59705B3259939P46727P59812P46508P03987O31523N30280M04352K61659J12422
$$ 23259939 24006666 24766478 25512986 26216973 26848496 27378776 27783128 28044787 28157209
59696B8157209l3394j66660k78551l62017m14245m36362m30660l99495l46481
$$ 28157209 28123815 27957155 27678604 27316587 26902342 26465980 26035320 25635825 25289344
59687B5289344k76525j93812j00944k0J07075K19754L38440M62659N90625P20726
$$ 25289344 25012819 24819007 24718063 24718043 24825118 25044872 25383312 25845971 26436596 27157322
59677B7157322Q51533R79589J098363J199620J274142J310632J295856J217537
$$ 27157322 28008855 28988444 30086807 31286427 32560569 33871201 35167057 36384594
59669C6384594J067545Q43693N51758K07621j63647n32768q71665j156757j371426
$$ 36384594 37452139 38295832 38847590 39055211 38891564 38358796 37487131 36330374 34958948
59660C4958948j508385j569745j564122j503537j402060j274608j135242r96798
$$ 34958948 33450563 31880818 30316696 28813159 27411099 26136491 25001249 24004451
59652B4004451q72486p76455p21284p13833p51782q22268r04383r76231j022694
$$ 24004451 23131965 22355510 21634226 20920393 20168611 19346343 18441960 17465729 16443035
59643A6443035j038126j023645r83846r25593q56717p83714p10796o40895n76061
$$ 16443035 15404909 14381264 13397418 12471825 11615108 10831394 10120598 9479703 8903642
59634H903642n16629m61692m11100l65802l26028k90700k59054k31154k06294
$$ 8903642 8387013 7925321 7514221 7148419 6822391 6531691 6272637 6041483 5835189
59625E835189j82626j59261j37267j17768j00439q4651p0633n8604m8119l9220
$$ 5835189 5652563 5493302 5356035 5238267 5137828 5053177 4982544 4923940 4875821 4836601
59615D836601l3038l0374l0771l3679l9325m7591n7285o7406p7909q8374r7151
$$ 4836601 4803563 4773189 4742418 4708739 4669414 4621823 4564538 4497132 4419223 4330849 4233698
59604D233698j02824j05542j06050j04461j00878r6151r0981q5065p8006p0212
$$ 4233698 4130874 4025332 3919282 3814821 3713943 3617792 3526811 3441746 3363740 3293528
59594C293528o2205n3854m5054l6292k8008k0123j2715o111JO417J2830J7729
$$ 3293528 3231323 3177469 3132415 3096123 3068115 3047992 3035277 3029166 3029167 3035584 3048414 3066143
59582C066143K0542K2556K4951K7104K7811K7097K5894K4923K4707K5828K8347
$$ 3066143 3086685 3109241 3134192 3161296 3189107 3216204 3242098 3267021 3291728 3317556 3345903
59571C345903L1782L6189M2291N0015N8146O6042P4488Q4151R4521J05214J17003
$$ 3345903 3377685 3413874 3456165 3506180 3564326 3630368 3704856 3789007 3883528 3988742 4105745
59560D105745J30447J44632J58445J72282J87535K05087K24967K46592K68617
$$ 4105745 4236192 4380824 4539269 4711551 4899086 5104173 5329140 5575732 5844349
59551E844349K89478L08640L26462L42381L54531L61660L64004L61738L54162
$$ 5844349 6133827 6442467 6768929 7111310 7465841 7827501 8191505 8553243 8907405
59542H907405L41403L25325L07569K88251K67816K48517K32080K16847J99272
$$ 8907405 9248808 9574133 9881702 10169953 10437769 10686286 10918366 11135213 11334485
59533A1334485J78133J56203J38109J27362J24679J27930J33706J39387J43191
$$ 11334485 11512618 11668821 11806930 11934292 12058971 12186901 12320607 12459994 12603185
59524A2603185J42193J31884J08647P1780K2484l7759j06777j80891k55836l27850
$$ 12603185 12745378 12877262 12985909 13057689 13080173 13042414 12935637 12754746 12498910 12171060
59514A2171060l93237m48196m90279n19196n35329n38554n29542n11047m86492
$$ 12171060 11777823 11329627 10839348 10320152 9784823 9246269 8716727 8205680 7719188
59505G719188m58034m26826l94084l60690l26688k92418k59422k29203k01963
$$ 7719188 7261154 6834328 6440244 6079554 5752866 5460448 5201026 4971823 4769860
59496D769860j77385j55595j36299j18117j00059q2770o7142n2651l8200k3644
$$ 4769860 4592475 4436880 4300581 4182464 4082405 3999635 3932493 3879842 3841642 3817998
59486C817998r269N243K0166L4951M9334O4288Q0629R7672J14592J32168J51635
$$ 3817998 3808729 3813972 3834138 3869089 3918423 3982711 4063340 4161012 4275604 4407772 4559407
59475D559407J72669J93933K14959K36022K56779K76391K94339L09671L19899
$$ 4559407 4732076 4926009 5140968 5376990 5633769 5910160 6204499 6514170 6834069
59466F834069L21985L14164K95820K66265K24959J72564J10868M2230l0015j01337
$$ 6834069 7156054 7470218 7766038 8032303 8257262 8429826 8540694 8582924 8552909 8451572
59456H451572j67485k25806k74509l11722l36457l49720l53505l49227l38078
$$ 8451572 8284087 8058281 7783772 7472050 7135593 6785873 6432368 6083141 5745063
59447E745063l21905l02638k81454k59470k38177k18246j98930j79834j62097
$$ 5745063 5423158 5120520 4839066 4579596 4341419 4123173 3924243 3744409 3582312
59438C582312j46586j32226j17693j03559r1060p9791o8549n7646m8314m0390
$$ 3582312 3435726 3303500 3185807 3082248 2991188 2911397 2842848 2785202 2736888 2696498
59428B696498l2558k4561j7298j0914m564J917P681J2264J6040J9287K2018K4658
$$ 2696498 2663940 2639379 2622081 2611167 2606603 2608520 2616201 2628465 2644505 2663792 2685810 2710468
59416B710468K7793L1357L5170L9947M6560N4132N9848O0929N6679M9190M2642
$$ 2710468 2738261 2769618 2804788 2844735 2891295 2945427 3005275 3066204 3122883 3172073 3214715
59405C214715M1171M6383N6929P0625Q6324J03696J22555J42672J62901J80266
$$ 3214715 3255886 3302269 3359198 3429823 3516147 3619843 3742398 3885070 4047971 4228237
59395D228237J92185K00772K12794K33686K63234K98453L38293L83103M31445
$$ 4228237 4420422 4621194 4833988 5067674 5330908 5629361 5967654 6350757 6782202
59386F782202M80579N29129N76368O19368O53404O74927O82008O72563O44985
$$ 6782202 7262781 7791910 8368278 8987646 9641050 10315977 10997985 11670548 12315533
59377A2315533O00790N44654M81587M15588L50436K89469K34275J85081J42074
$$ 12315533 12916323 13460977 13942564 14358152 14708588 14998057 15232332 15417413 15559487
59368A5559487J04631O9664L2841q413n4692j06664j65042k28287k92326l52749
$$ 15559487 15664118 15733782 15766623 15758210 15703518 15596854 15431812 15203525 14911199 14558450
59358A4558450m05635m46412m70365m75221m62250m34728l96807l53731l11227
$$ 14558450 14152815 13706403 13236038 12760817 12298567 11863839 11467032 11113301 10802074
59349A0802074k73836k44646k26347k20890k27875k44575k67786k94687l22074
$$ 10802074 10528238 10283592 10057245 9836355 9608480 9363905 9096119 8801432 8479358
59340H479358l46374l64819l75933l79069l74494l63623l47954l28023l04382
$$ 8479358 8132984 7768165 7392232 7013163 6638669 6275046 5927092 5599069 5294687
59331E294687k78998k54265k31014k08730j87255j66990j47959j30070j13850
$$ 5294687 5015689 4761424 4530410 4321680 4134425 3967435 3819476 3689406 3575556
59322C575556r9561q6177p2730n9883m8640l8374k7951j7971r721k542N418J4180
$$ 3575556 3475995 3389818 3317088 3257205 3208565 3170191 3142240 3124269 3114548 3112006 3117424 3131604
59310C131604K1977K8211L4119M0402M6462N2203N8554O5779P3129Q0535Q8943
$$ 3131604 3153581 3181792 3215911 3256313 3302775 3354978 3413532 3479311 3552440 3632975 3721918
59299C721918R8546J08299J17500J26351J34733J41853J47287J51071J52763J51719
$$ 3721918 3820464 3928763 4046263 4172614 4307347 4449200 4596487 4747558 4900321 5052040
59289E052040J48152J42618J34807J24435J12911J02446R3773Q6491Q1160P9056
$$ 5052040 5200192 5342810 5477617 5602052 5714963 5817409 5911182 5997673 6078833 6157889
59279F157889P9948Q2301Q5522Q9952R4522R6587R4367Q7738P6522N9956L8368
$$ 6157889 6237837 6320138 6405660 6495612 6590134 6686721 6781088 6868826 6945348 7005304 7043672
59268G043672J3571j2794m0073o7811r5680j23716j50733j72789j85454j87744
$$ 7043672 7057243 7044449 7004376 6936565 6840885 6717169 6566436 6393647 6208193 6020449
59258F020449j81994j70310j53449j32899j11098q8972o5670m1296j7671M315
$$ 6020449 5838455 5668145 5514696 5381797 5270699 5181727 5116057 5074761 5057090 5061405
59248E061405K5864M7993P0129R1622J12685J33116J51933J69094J85707K02025
$$ 5061405 5087269 5135262 5205391 5297013 5409698 5542814 5694747 5863841 6049548 6251573
59238F251573K16903K29971K42525K55692K69558K84693L02581L23628L46310
$$ 6251573 6468476 6698447 6940972 7196664 7466222 7750915 8053496 8377124 8723434
59229H723434L68836L89697M05853M12239M04348L80071L38516K78860K01515
$$ 8723434 9092270 9481967 9887820 10300059 10704407 11084478 11422994 11701854 11903369
59220A1903369J09223O063j03593k14668l21192m17353m98250n59875n99808o18278
$$ 11903369 12012592 12018655 11915062 11700394 11379202 10961849 10463599 9903724 9303916 8685638
59210H685638o17618o00783n71277n33672m92228m49116m05443l63234l24472
$$ 8685638 8068020 7467237 6895960 6362288 5870060 5420944 5015501 4652267 4327795
59201D327795k88911k55348k24525j98196j75809j55145j36149j20872j09377
$$ 4327795 4038884 3783536 3559011 3360815 3185006 3029861 2893712 2772840 2663463
59192B663463r8947q8165p8584p1373o5354n9555n4938n2039m9385m5727m1760
$$ 2663463 2564516 2476351 2397767 2326394 2261040 2201485 2146547 2094508 2045123 1999396 1957636
59181A957636l8378l5225l2091k9642k7718k4967k1136j7682j5230j2717r789
$$ 1957636 1919258 1884033 1851942 1822300 1794582 1769615 1748479 1730797 1715567 1702850 1693061
59170A693061p553n941k982J979O860J0045J2644J6081J9843K3185K6834L1288
$$ 1693061 1685508 1679567 1676585 1678564 1685424 1695469 1708113 1724194 1744037 1767222 1794056 1825344
59158A825344L5472L8706M1990M5902M9258N1368N3565N6947O0708O4150O8228
$$ 1825344 1860816 1899522 1941512 1987414 2036672 2088040 2141605 2198552 2259260 2323410 2391638
59147B391638P3513P8784Q3346Q8615R5604J02908J09089J14948J21466J27516
$$ 2391638 2465151 2543935 2627281 2715896 2811500 2914408 3023497 3138445 3259911 3387427
59137C387427J31742J34842J37722J39105J37237J32456J25890J17127J05484
$$ 3387427 3519169 3654011 3791733 3930838 4068075 4200531 4326421 4443548 4549032
59128D549032R2449Q0504P0387O1499N4187M9881M9617N3933O3329P7487R4848
$$ 4549032 4641481 4721985 4792372 4853871 4908058 4957939 5007556 5061489 5124818 5202305 5297153
59117E297153J14067J34960J57131J79116J99670K18213K32837K39654K35461
$$ 5297153 5411220 5546180 5703311 5882427 6082097 6300310 6533147 6772801 7008262
59108G008262K19371J90816J48285R2027K6320m2722j10078j71294k21399k56831
$$ 7008262 7227633 7418449 7566734 7658761 7685081 7642359 7532281 7360987 7139588 6882757
59098F882757k77360k84476k79412k64179k42573k17996j91618j64348j38623
$$ 6882757 6605397 6320921 6041509 5777330 5534757 5316761 5125143 4960795 4822172
59089D822172j16232r6168p6888n9271m5136l4402k6112k0894j9999k2980k8600
$$ 4822172 4705940 4609772 4532884 4473613 4428477 4394075 4367963 4347069 4327070 4304090 4275490
59078D275490l7023m8857o2999p7505r1744j05751j18413j28307j35487j40547
$$ 4275490 4238467 4189610 4126611 4049106 3957362 3851611 3733198 3604891 3469404 3328857
59068C328857j42914j41911j38614j34663j30067j23932j16568j09053j01557
$$ 3328857 3185943 3044032 2905418 2770755 2640688 2516756 2400188 2291135 2189578
59059B189578r3630q5505p7689p0216o3500n8702n5894n3286m9674m6177m3995
$$ 2189578 2095948 2010443 1932754 1862538 1799038 1740336 1684442 1631156 1581482 1535305 1491310
59048A491310m2159l9203l5478l1899k8132k3937k0666j9192j7912j5037j1495
$$ 1491310 1449151 1409948 1374470 1342571 1314439 1290502 1269836 1250644 1232732 1217695 1206200
59037A206200r180p796n806l314j448K7K053M207N593O868R117J1555J2526J1963
$$ 1206200 1197020 1189224 1183418 1180104 1178656 1178683 1180736 1184943 1190536 1197404 1206521 1218076 1230602 1242565
59023A242565J0847R245O909M810L925L438K211R75R95J719J966K277L841O133
$$ 1242565 1253412 1262657 1269566 1274376 1278301 1281739 1283950 1284925 1285920 1287639 1289605 1291882 1295723 1301856
59009A301856P917R522J1813J3984J4745J4666J4948J4897J3136J0404Q639Q010
$$ 1301856 1309773 1319295 1331108 1345092 1359837 1374503 1389451 1404348 1417484 1427888 1436527 1444537
58997A444537P327O587O691P361P650P899Q884R894R863R616J0624J2392J3359
$$ 1444537 1451864 1458451 1465142 1472503 1480153 1488052 1496936 1506830 1516693 1526309 1536933 1549325 1562684
58984A562684J3602J4269J5170J5304J5015J5343J5959J5987J5991J6946J8246
$$ 1562684 1576286 1590555 1605725 1621029 1636044 1651387 1667346 1683333 1699324 1716270 1734516
58973A734516J8991K0134K2954K6509K9108L1193L4167L7613M0315M2819M6158
$$ 1734516 1753507 1773641 1796595 1823104 1852212 1883405 1917572 1955185 1995500 2038319 2084477
58962B084477M9252N0520N0925N2289N3754N3270N1594N1305N2620N3738N4796
$$ 2084477 2133729 2184249 2235174 2287463 2341217 2394487 2446081 2497386 2550006 2603744 2658540
58951B658540N7826O3101O8971P5218Q3094R2202J00630J08370J17321J27915
$$ 2658540 2716366 2779467 2848438 2923656 3006750 3098952 3199582 3307952 3425273 3553188
58941C553188J38843J50161J63383J78386J93437K08635K26223K47121K70067
$$ 3553188 3692031 3842192 4005575 4183961 4377398 4586033 4812256 5059377 5329444
58932E329444K94485L21344L50880L82401M16589M55223M98309N44184N92501
$$ 5329444 5623929 5945273 6296153 6678554 7095143 7550366 8048675 8592859 9185360
58923I185360O44236O98590P52764Q04890Q54078Q97239R28782R43812R38723
$$ 9185360 9829596 10528186 11280950 12085840 12939918 13837157 14765939 15709751 16648474
58914A6648474R08557Q47216P51448O22441M63615K80146Q1120j21051l14734
$$ 16648474 17557031 18404247 19155695 19778136 20241751 20521897 20603017 20481966 20167232
58905B0167232m90866o41438p59984q44749q98642r25363r27784r10086q78034
$$ 20167232 19676366 19034928 18274944 17430195 16531553 15606190 14678406 13768320 12890286
58896A2890286q36107p86895p33653o80403o28791n77801n27380m79632m35759
$$ 12890286 12054179 11267284 10533631 9853228 9224437 8646636 8119256 7639624 7203865
58887G203865l94874l56733l22740k93219k66371k41118k18506j99354j82869
$$ 7203865 6808991 6452258 6129518 5836299 5569928 5328810 5110304 4910950 4728081
58878D728081j68430j56258j45615j34729j23374j13093j04312r5747q7192q0034
$$ 4728081 4559651 4403393 4257778 4123049 3999675 3886582 3782270 3686523 3599331 3519297
58868C519297p4278o7890o0099n2683m6909m1738l6062l0300k4838j9231j3869
$$ 3519297 3445019 3377129 3317030 3264347 3217438 3175700 3139638 3109338 3084500 3065269 3051400
58857C051400r906o738k065M644J1280J6629K2117K8992L6259M2768M9115N6199
$$ 3051400 3041494 3034756 3032691 3037335 3048615 3065244 3087361 3116353 3152612 3195380 3244495 3300694
58845C300694O3800P1591P9751Q7929R5479J03123J12338J22758J32608J41875
$$ 3300694 3364494 3436085 3515836 3603765 3699244 3802367 3914705 4037463 4170071 4311946
58835D311946J52491J65095J78451J92501K08973K28270K48793K70150K94126
$$ 4311946 4464437 4629532 4807983 5000484 5209457 5437727 5686520 5956670 6250796
58826F250796L21551L51279L83242M19456M60714N05229N51801O01447O54442
$$ 6250796 6572347 6923626 7306868 7726324 8187038 8692267 9244068 9845515 10499957
58817A0499957P08408P60685Q09828Q53169Q85418R01230Q96860Q68221Q09970
$$ 10499957 11208365 11969050 12778878 13632047 14517465 15418695 16315555 17183776 17993746
58808A7993746P18457N93905M39175K59143O2535j38301l31318n07145o57825
$$ 17993746 18712203 19306108 19745283 20004426 20066961 19928660 19597342 19090197 18432372
58799A8432372p76812q61950r15942r42444r43860r23665q87753q41675p88872
$$ 18432372 17655560 16793610 15877668 14935224 13991364 13067699 12179946 11338271 10549399
58790A0549399p32624o76926o23898n72878n23622m78022m37369m00473l65944
$$ 10549399 9816775 9139849 8515951 7943073 7419451 6941429 6504060 6103587 5737643
58781E737643l33991l04690k77012k50981k28309k09576j93121j77897j64874
$$ 5737643 5403652 5098962 4821950 4570969 4342660 4133084 3939963 3762066 3597192
58772C597192j54517j45527j37265j30676j25531j19543j11682j03611r6551q9428
$$ 3597192 3442675 3297148 3159883 3029207 2903676 2784133 2672451 2568840 2472289 2382861
58762B382861q1461p3710o6685n9243n1243m4353l8948l3269k7089k2845k1400
$$ 2382861 2301400 2227690 2161005 2101762 2050519 2006166 1967218 1933949 1906860 1884015 1862615
58751A862615k0163j7302j4576j3793j3715j2861j2370j3502j5051j5713j6500
$$ 1862615 1842452 1825150 1810574 1796781 1783066 1770205 1757835 1744333 1729282 1713569 1697069
58740A697069j8407k0160k0556k0660k1512k2118k1712k1542k2309k2428k0964
$$ 1697069 1678662 1658502 1637946 1617286 1595774 1573656 1551944 1530402 1508093 1485665 1464701
58729A464701j9724k0270k1404k1805k2475k4296k5831k5866k5648k6301k6533
$$ 1464701 1444977 1424707 1403303 1381498 1359023 1334727 1308896 1283030 1257382 1231081 1204548
58718A204548k5224k3657k2925k1706j9005j6482j5553j4791j2761j0799j0377
$$ 1204548 1179324 1155667 1132742 1111036 1092031 1075549 1059996 1045205 1032444 1021645 1011268
58707A011268j0210q752p156o956p124o165m968m774m511k885j144j043j915k248
$$ 1011268 1001058 992306 985150 978194 971070 964905 959937 955163 950652 947767 946623 945580 943665 941417
58693I41417k267k584k283p34O60P03L44K85r95m522q506j1005j2601j4177j4563
$$ 941417 939150 936566 934283 933549 934209 934912 935256 935541 934546 930024 921518 910513 897912 883735 869172
58678H69172j2810j0384q602o344k779K20R67P63J240J425J44j201j025k82q0
$$ 869172 856362 845978 837376 831032 828253 828473 829440 830203 831443 832868 833012 831811 830786 830504 830424
58663H30424Q25L402N677N613M328L697L225K030J373K392L779M417N694Q542
$$ 830424 831249 834651 840328 845941 850269 853966 857191 859221 860594 862986 866765 871182 876876 885418
58649H85418J0981J1552J2195J4735J7492J8647J9868K3134K6889K9016L0800
$$ 885418 896399 907951 920146 934881 952373 971020 990888 1014022 1040911 1069927 1100727
58638A100727L4243L8249M1243M4747N0398N6199N9916O3569P0314P9401Q8517
$$ 1100727 1134970 1173219 1214462 1259209 1309607 1365806 1425722 1489291 1559605 1639006 1727523
58627A727523R8678J12123J27595J42437J57599J75868J96755K17578K38010K59060
$$ 1727523 1826201 1938324 2065919 2208356 2365955 2541823 2738578 2956156 3194166 3453226
58617C453226K78782K93192L00197K98559K84548K53977K06776J46141P4929l151
$$ 3453226 3732008 4025200 4325397 4623956 4908504 5162481 5369257 5515398 5590327 5587176
58607E587176q0569j48941k04331k46324k73694k85239k83524k73484k57953k37996
$$ 5587176 5506607 5357666 5153335 4907011 4633317 4348078 4064554 3791070 3533117 3295121
58597C295121k16099j95114j75276j55858j38314j24220j11926r9143q7120p8192
$$ 3295121 3079022 2883908 2708632 2552774 2414460 2290240 2178314 2079171 1992051 1913859
58587A913859p0988o2342n2418m3646l6112k8330k1204j6713j3827j0112o340
$$ 1913859 1842871 1780529 1728111 1684465 1648353 1620023 1598819 1582106 1568279 1558167 1551827
58576A551827n337p188r609j2051j5562j9644k3060k6456l0592l3520l3286l1611
$$ 1551827 1546490 1539302 1529693 1517642 1502080 1482436 1459376 1432920 1402328 1368808 1335522 1303911
58564A303911l1020l0367k7448k3983k3178k4189k3828k2255k2022k2797k1973
$$ 1303911 1272891 1242524 1215076 1191093 1167915 1143726 1119898 1097643 1075621 1052824 1030851
58553A030851j9455j7153j4916j1495q359p894q909q445o874o660p482p144o100
$$ 1030851 1011396 994243 979327 967832 959473 951579 942670 934225 927351 920691 913209 906065 899965
58540H99965o351p211o593n157m675m012j385J321J458P70K461N101N079L257
$$ 899965 893614 886403 879810 874653 869978 865966 864581 865902 867360 868130 870591 875692 880771 884028
58526H84028L296M925M908L253K500K022q73n273q043r704j2920j6456j6958j5550
$$ 884028 887324 892249 897157 900410 902910 904932 904059 898786 890743 881039 868119 851663 834705 819155
58512H19155j6056j7704j6428j2668j0831j1380j0546p765o353o596n198k105
$$ 819155 803099 785395 768967 756299 745468 734088 723542 715777 709424 702828 697630 695525
58500F95525j020k404k594p28m1j361j701l67k68k016k691j585j305k279j907
$$ 695525 694505 692101 689507 688779 688738 687377 685676 685309 685041 683025 680334 678749 677444 675165 673258
58485F73258n4M26n83l7K203K821J285P80K078K439J428J879M039M695L117K205
$$ 673258 673204 673630 673047 673010 675213 678034 679319 680099 682177 684616 686044 687923 691962 696657 699774 701979
58469G01979K715K163L41J48K016L215L452N395Q986J1118J1650J3622J6861J7545
$$ 701979 704694 706857 707198 707346 709362 712577 716029 721424 730410 741528 753178 766800 783661 801206
58455H01206J4958J2473J0917P334J328l626o385r538j3597j5830j5859j6317
$$ 801206 816164 828637 839554 846888 848216 844590 838205 828667 815070 799240 783381 767064
58443G67064j7225j5851j2794j1733j2529j1196p455n402n870n159k415j201k451
$$ 767064 749839 733988 721194 709461 696932 685736 678281 672879 667009 661850 659435 658234 655783
58430F55783k862j588j641l332l248r36K64O8J731M912N520L673M030P101Q235
$$ 655783 652921 651333 649692 646360 643112 642176 642440 642508 644239 649151 654671 658344 662374 669475 677710
58415F77710O594O783R907J1390R783R375J1743J2978J1746J1978J4923J6533
$$ 677710 684304 691087 700994 712384 722167 731542 743285 756263 768009 779987 794910 811443
58403H11443J5399J5307J7343J7488J4626J2872J3286J1516O344K338J279p68
$$ 811443 826842 842149 859492 876980 891606 904478 917764 929280 935624 937962 939241 938473
58391I38473n003p103n766n536q010q813o336m817n691m701r01O12j710k690l81
$$ 938473 933470 926367 920601 915065 907055 898242 891906 887089 881398 876697 875796 876408 874698 872008 871627
58376H71627J56l164n106k838o45q37N65M748O341L397J706M370O484M986M201
$$ 871627 871783 868619 863513 860675 860030 859193 859758 864506 870847 874244 875950 880320 886804 891790 895991
58361H95991O553P369M292K374M436N738L582K652N422O949M716L744O306O748
$$ 895991 902544 909913 914205 916579 921015 926753 930335 932987 938409 945358 950074 953818 960124 966872
58347I66872K509rL074O007M395K994N596P434M961L245O151Q862P589O941J0289
$$ 966872 969381 969372 972446 978453 982848 985842 991438 998872 1003833 1007078 1013229 1022091 1029680 1036621 1046910
58332A046910J2591J0313Q595J1097J2646R627P558J0476J3065J1221J0078J3439
$$ 1046910 1059501 1069814 1078409 1089506 1102152 1111779 1119337 1129813 1142878 1154099 1164177 1177616
58320A177616J5862J3554J2330J6201J8890J5761J3018J5796J8195J4972J1978
$$ 1177616 1193478 1207032 1219362 1235563 1254453 1270214 1283232 1299028 1317223 1332195 1344173
58309A344173J4813J7962J5773J3451J6450J9580J7487J5456J8853K2337K0553
$$ 1344173 1358986 1376948 1392721 1406172 1422622 1442202 1459689 1475145 1493998 1516335 1536888
58298A536888J8940K2818K6416K4081K1605K4957K8555K6392K3838K6596K9028
$$ 1536888 1555828 1578646 1605062 1629143 1650748 1675705 1704260 1730652 1754490 1781086 1810114
58287A810114K5509K2153K5030K8179K5653K3695K8256L2447K9657K6843L1217
$$ 1810114 1835623 1857776 1882806 1910985 1936638 1960333 1988589 2021036 2050693 2077536 2108753
58276B108753L6163L4445L2784L8646M5194M4391M2464M7053N1801M9484M7376
$$ 2108753 2144916 2179361 2212145 2250791 2295985 2340376 2382840 2429893 2481694 2531178 2578554
58265B578554N3341N9722N7700N4490N9279O5574O4866O3993P0947P7669P5620
$$ 2578554 2631895 2691617 2749317 2803807 2863086 2928660 2993526 3057519 3128466 3206135 3281755
58254C281755P3979Q2876R3211R3273R0674R6891J04999J04522J03338J12346
$$ 3281755 3355734 3438610 3531821 3625094 3715768 3812659 3917658 4022180 4125518 4237864
58244D237864J23310J24890J25487J36583J49165J51075J51725J64231J79471
$$ 4237864 4361174 4486064 4611551 4748134 4897299 5048374 5200099 5364330 5543801
58235E543801J84093J87370K02898K21047K28107K34893K56507K81959K95006
$$ 5543801 5727894 5915264 6118162 6339209 6567316 6802209 7058716 7340675 7635681
58226G635681L06319L32466L62449L79510L96144M31220M72639N00774N28161
$$ 7635681 7942000 8274466 8636915 9016425 9412569 9843789 10316428 10817202 11345363
58217A1345363N75964O32550O77713P25945Q01080Q90784R73201J064893J192681
$$ 11345363 11921327 12553877 13231590 13957535 14758615 15649399 16622600 17687493 18880174
58208A8880174J343437J495149J670969J905265K184920K486393K840494L293201
$$ 18880174 20223611 21718760 23389729 25294994 27479914 29966307 32806801 36100002
58200C6100002L836274M452356N194214O137418P293305Q661814J0329690J2413928
$$ 36100002 39936276 44388632 49582846 55720264 63013569 71675383 82005073 94419001
58192I4419001J4955605J7990023K1676725K6235742L1792275L8280943M5064994
$$ 94419001 109374606 127364629 149041354 175277096 207069371 245350314 290415308
58185B90415308N0100406M9720349M0422433K1919207j528969k3350210l8604517
$$ 290415308 340515714 390236063 430658496 452577703 451048734 427698524 389094007
58178C89094007m6079357m7339717m4643702l9812237l4163967k8603548k3586955
$$ 389094007 343014650 295674933 251031231 211218994 177055027 148451479 124864524
58171A24864524j9241485j5600075j2664419j0336234q456417o922577n691560
$$ 124864524 105623039 90022964 77358545 67022311 58565894 51643317 45951757
58164D5951757m698128l857611l131317k517885j991503j504110j034609n86192
$$ 45951757 41253629 37396018 34264701 31746816 29755313 28251203 27216594 26630402
58156B6630402j43928L26510Q47408J430028K104188K913770L839913M674301
$$ 26630402 26486474 26812984 27660392 29090420 31194608 34108378 37948291 42622592
58148D2622592M961215M185723K195536n17106l057479m734741n429469n421086
$$ 42622592 47583807 51769530 53965066 53447960 50390481 45655740 40226271 34805185
58140C4805185n013842m395860l709838l074891k532185k062856j665833j361374
$$ 34805185 29791343 25395483 21685645 18610754 16078569 14015713 12349880 10988506
58132A0988506j135200r45530p80507o55522n62530m73986l90335l34833l05643
$$ 10988506 9853306 8907776 8127269 7471747 6909217 6435231 6044896 5710063 5404420
58123E404420k77475k46249k29887k28241k21927k08232k01017j97655j81507
$$ 5404420 5126945 4880696 4650809 4422568 4200641 3992409 3791392 3593737 3412230
58114C412230j55010j36714j27699j12739r2092q0762p8597p1729o1813o3970
$$ 3412230 3257220 3120506 2992807 2880068 2787976 2707214 2628617 2556888 2495075 2431105
58104B431105p6785q3042p9592p9045q2658p8578o7065o1235o2138n7718m7126
$$ 2431105 2354320 2271278 2191686 2112641 2029983 1951405 1884340 1823105 1760967 1703249 1656123
58093A656123m2241m4447m2855l6283l4801l8798l7973l1686k9658l2063k9424
$$ 1656123 1613882 1569435 1526580 1490297 1455496 1416698 1378725 1347039 1317381 1285318 1255894
58082A255894k2444k1717k7353k8613k4169k3323k6725k5248j8706j6725k0062
$$ 1255894 1233450 1211733 1184380 1155767 1131598 1108275 1081550 1056302 1037596 1020871 1000809
58071A000809j9423j3812j1990j4738j3588q172p159j0826j0093m329k765o663
$$ 1000809 981386 967574 955584 940846 927258 919086 911927 901101 891008 886679 883914 877251
58059H77251p102k451j277n643p774n709o445j1071j2208q713p924j0747r447
$$ 877251 870149 867698 866421 860778 853004 847295 840850 829779 817571 808858 800934 790187 780740
58046G80740k792J150j9M36M359N448K628K717O799P664L819K617O373Q441O288
$$ 780740 777948 779098 779079 779515 783874 789322 791950 794667 801466 809130 812949 815566 821939 830380 836668
58031H36668N571P922P318K073j673j718l215p451q959o818p147j1289j3054j0637
$$ 836668 842239 850161 857479 859552 857879 856161 852946 845495 836536 829718 822571 811282 798228 787591
58017G87591r773j2235j2626r621q802j1291j1028o630m603p260q695o425n780
$$ 787591 777818 765583 752957 743336 734534 723243 712215 705585 700982 693722 685027 678602 672822
58004F72822q926j0383p612n518o392n733k080o72l213m044p73J201q78j956J144
$$ 672822 663896 653513 645901 640383 633991 628258 626178 625506 622293 618249 617476 618677 617799 615843 616987
57989F16987M258M628N866R656J1511R367P816R331R714O562L906M163L774J049
$$ 616987 621245 625873 631739 641395 652906 662273 670089 679420 689134 695696 699602 703765 707539 708588
57975G08588n0J895K033j878n030m420m121p103r730r145q688j1022j2940j1729
$$ 708588 708538 710433 712466 710588 705558 701138 697017 689914 680184 671039 662351 651329 638389 626660
57961F26660j0020r956r023n824l521l742l467j379p56k733l524j626o39j811
$$ 626660 616640 606684 597661 591837 588316 584574 581107 579728 578972 576239 572715 571089 570450 568639
57947E68639j182K422M210K059N61K397L348M16k610k504k296m665o510n195l663
$$ 568639 567457 569879 574089 576148 576709 579106 582454 582870 580260 577756 575460 570795 564285 559090 555427
57932E55427m376m529k154p36k799m926m098k986m130m802k635m81p15l55L070
$$ 555427 551051 546522 544368 543632 540833 535907 531809 528823 524693 519891 517256 516775 516060 515705 518775
57917E18775O396O492N795P264R030Q922R090J1302J2741J1226R654J0525J1199
$$ 518775 525171 531663 537458 544722 553752 562674 571764 583066 595807 607033 616687 627212 638411
57904F38411R248P303P676P368L574p99k317k963n701q641q968q383r405j0366
$$ 638411 647659 654962 662638 670006 673580 672781 670464 667501 661800 653159 644191 635808 626403 616037
57890F16037r127p821q836r977q555o485o511p025n513l388k752j930R65L621
$$ 616037 606910 599089 590253 580276 571721 565236 558725 551700 546187 542799 540047 538117 539082 542703
57876E42703L393K218L012M545M454M073N659P933Q755R177J0623J1201R052O265
$$ 542703 546096 548314 551326 555871 560325 564398 570057 577990 586745 595922 606545 617746 626798 633063
57862F33063N453N535M667L945M323L489q3l541m229m191n995p885p571p040q785
$$ 633063 638516 644051 648718 652663 656986 660475 660392 656851 652622 648431 642436 634551 626980 619940 611155
57847F11155j0708r755p507p184p989p302n776n543n807m722l237k966k750j421
$$ 611155 600447 590692 583185 576001 568012 560710 554934 549391 543584 538862 535625 532659 529909 528488
57833E28488j011l117n064m134k526l646o295p299p117q008r143q437o982o995
$$ 528488 527477 524360 519296 515162 512636 508990 502695 495396 488279 480271 471128 462691 455709 448714
57819D48714p487o391m790m681m874l439j838k147k695j095Q47J31j812j541L39
$$ 448714 441227 434836 430046 425365 420491 417052 415214 413067 410372 409277 410124 410255 408443 406902 407241
57804D07241O88k83K83K600M408N376O885Q447Q587Q258R445J1544J2741J3496
$$ 407241 407929 407646 407929 410529 414937 420313 427198 435645 444232 452490 461935 473479 486220 499716
57790D99716J4852J5018J1762O669K995Q66j502l617l993l912n553p710p664n986
$$ 499716 514568 529586 541348 548017 551012 551878 550376 546759 542766 538854 533301 525591 517927 511941
57776E11941n265n414m535l194l389m317l447j086K46K54Q08K116K803L053M117
$$ 511941 506676 501262 496727 493533 490144 485827 482380 481294 481540 481794 482602 484718 487521 490574 494691
57761D94691N444N650N397O095O892O365N715O768Q284P927O384N820N732M371
$$ 494691 500135 505785 511182 517277 524169 530534 536249 543017 551301 559228 565612 571432 577164 581535
57747E81535K760L116M464M171K704K689M056M410L480L133L556L379L004L961
$$ 581535 584295 587411 591875 596046 598750 601439 605495 609905 613385 616518 620074 623453 626457 630418
57733F30418N586O027N874P094R215J0238J0485J1801J3772J4616J4906J6570
$$ 630418 636004 642031 647905 654999 664214 674452 684937 696738 710510 725126 740032 756602
57721G56602J8994K0001J9933K0817K2330K2627K2392K3939K6919K8932K9813
$$ 756602 775596 795597 815530 836347 858677 881304 903696 927635 954554 983486 1013299
57710A013299L1317L3248L4124L5020L8430M3783M8365N2307N8258O6392P4242
$$ 1013299 1044616 1077864 1111988 1147008 1185438 1229221 1277586 1329893 1388151 1454543 1528785
57699A528785Q1549R0766J02551J15026J27915J43253J61516J80902K00938K22949
$$ 1528785 1610334 1701100 1803651 1918677 2046592 2189845 2351361 2532263 2733201 2956150
57689B956150K46363K68169K86453L00874L09173L06705K90083K58415K11302
$$ 2956150 3202513 3470682 3757135 4058009 4367182 4673887 4963970 5222385 5433687
57680E433687J49510P8085N411o1436j17874j59342j81846j85447j73711j49391
$$ 5433687 5583197 5661282 5666693 5605257 5487383 5328041 5146195 4960748 4787037 4637646
57670D637646j13691o9884k4947J1605K7757J1129m1906j17972j92596k46375
$$ 4637646 4523955 4454071 4429124 4440729 4468486 4479615 4437709 4319737 4127141 3880766
57660C880766k73459k76624k60873k33054k01250j70427j41095j13516q9845p0996
$$ 3880766 3607307 3330683 3069810 2836756 2635506 2465079 2323984 2210468 2120623 2049627
57650B049627n5109m0800k8794j9124r979n56P952J5304K3125L1989M0690M9259
$$ 2049627 1994518 1953718 1924924 1905800 1895821 1895265 1903217 1918521 1941646 1973635 2014325 2063584
57638B063584N9484P1682Q4192R6851J11522J28387J45219J61361J78840J98322
$$ 2063584 2123068 2194750 2278942 2375793 2487315 2615702 2760921 2922282 3101122 3299444
57628C299444K17412K34075K48190K58212K59741K49060K25378J88486J37717
$$ 3299444 3516856 3750931 3999121 4257333 4517074 4766134 4991512 5179998 5317715
57619E317715P4944N724o3917j29410j85831k28075k54679k68615k72867k68061
$$ 5317715 5392659 5398383 5334466 5205056 5019225 4791150 4536471 4267856 3994989 3726928
57609C726928k55468k38745k20806k01816j81860j62693j45362j28961j13364
$$ 3726928 3471460 3232715 3011909 2810093 2628233 2465540 2320178 2191217 2077853
57600B077853j00328r0385q1498p2325o4042n7458n1333m5129m0400l7717l5038
$$ 2077853 1977525 1887140 1805642 1733317 1669275 1611817 1560484 1515355 1474955 1437238 1402200
57589A402200l1057k7322k5187k3345k0439j7499j5790j4593j2964j1413j0108
$$ 1402200 1371143 1343821 1318634 1295289 1274850 1257351 1241561 1226968 1214004 1202591 1192483
57578A192483p929m947l308l828m229k709p03p4L7J275L189M517N501O872Q258
$$ 1192483 1184554 1179607 1176299 1172471 1168242 1165533 1164830 1164756 1164793 1166068 1169257 1173774 1179275 1186147 1194405
57563A194405R441J1413J4444J6923J7786J8302J9868K1892K3416K4984K7275
$$ 1194405 1203846 1215259 1229703 1246626 1264412 1282714 1302582 1324474 1347890 1372874 1400149
57552A400149K9688L1738L4131L7145M0019M3064M8144N5618O3216O9544P6369
$$ 1400149 1429837 1461575 1495706 1532851 1572870 1615934 1664078 1719696 1782912 1852456 1928825
57541A928825Q5676R6765J08091J19804J32487J45456J58242J71802J86265J99295
$$ 1928825 2014501 2111266 2219357 2339161 2471648 2617104 2775346 2947148 3133413 3332708
57531C332708K08373K12738K11332K01012J78984J45311J01550M9151q639o5512
$$ 3332708 3541081 3753819 3965151 4166163 4345147 4490458 4592008 4641159 4632520 4567008
57521D567008j15364j55584j85600k04294k11234k08716k00146j87484j71946
$$ 4567008 4451644 4296060 4110460 3906166 3694932 3486216 3286070 3098586 2926640
57512B926640j55544j39740j24013j07806r2553p9890o9258n9185m9626m1299
$$ 2926640 2771096 2631356 2507343 2399537 2306984 2227094 2157836 2098651 2049025 2007726
57502B007726l4006k7310k1627j7021j2367p191k698N12L944Q744J3670J7358
$$ 2007726 1973720 1946410 1924783 1907762 1895395 1888204 1885506 1886018 1889962 1898706 1912376 1929734
57490A929734K0750K5190K9891L3600L7226M2457M9032N5562O1917O8861P6522
$$ 1929734 1950484 1975674 2005565 2039165 2076391 2118848 2167880 2223442 2285359 2354220 2430742
57479B430742Q5203R6304J10384J25529J39628J53121J67426J81810J93918K02244
$$ 2430742 2515945 2612249 2722633 2848162 2987790 3140911 3308337 3490147 3684065 3886309
57469C886309K05988K03178J90987J67497J32021Q5033K9418k9194q4967j34081
$$ 3886309 4092297 4295475 4486462 4653959 4785980 4871013 4900431 4871237 4786270 4652189
57459D652189j73778k01384k16123k20371k17196k07902j93435j76357j59311
$$ 4652189 4478411 4277027 4060904 3840533 3623337 3415435 3222000 3045643 2886332
57450B886332j42897j26923j12285r9633q7786p5665o4488n5899m9265m2912l6769
$$ 2886332 2743435 2616512 2504227 2404594 2316808 2241143 2176655 2120756 2071491 2028579 1991810
57439A991810l1655k7180k2580j8468j5666j3461j1011r125q534p843n558k789
$$ 1991810 1960155 1932975 1910395 1891927 1876261 1862800 1851789 1842664 1834130 1826287 1820729 1817940
57427A817940j457j105r7J166J113K83Q19L081N268O193O271O073N901O445P982
$$ 1817940 1816483 1815378 1815281 1816447 1817560 1817843 1818662 1821743 1827011 1833204 1839475 1845548 1851449 1857894 1865876
57412A865876R359R456Q951R081R602R803J0370J2136J4058J4636J4404J4737
$$ 1865876 1875235 1884691 1893642 1902723 1912325 1922128 1932498 1944634 1958692 1973328 1987732 2002469
57400B002469J5266J4805J3984J4356J5647J6297J6234J6624J7432J7668J7531
$$ 2002469 2017735 2032540 2046524 2060880 2076527 2092824 2109058 2125682 2143114 2160782 2178313
57389B178313J7946J8449J7949J7124J7596J9081J9807J9523J9541K0022J9715
$$ 2178313 2196259 2214708 2232657 2249781 2267377 2286458 2306265 2325788 2345329 2365351 2385066
57378B385066J8518J7885J8415J9110J9257J9215J9225J9173J9438K0357K1114
$$ 2385066 2403584 2421469 2439884 2458994 2478251 2497466 2516691 2535864 2555302 2575659 2596773
57367B596773K0858K0419K1093K2225K2190K1275K1308K2573K3493K3322K3060
$$ 2596773 2617631 2638050 2659143 2681368 2703558 2724833 2746141 2768714 2792207 2815529 2838589
57356B838589K3465K4182K4898K5581K5651K4625K3523K3755K4863K5219K4758
$$ 2838589 2862054 2886236 2911134 2936715 2962366 2986991 3010514 3034269 3059132 3084351 3109109
57345C109109K4981K6352K7754K8500K8950K9148K8704K8100K8300K9079K9367
$$ 3109109 3134090 3160442 3188196 3216696 3245646 3274794 3303498 3331598 3359898 3388977 3418344
57334C418344K9169K9357K9840K9693K8962K8557K8594K8508K8519K9209L0113
$$ 3418344 3447513 3476870 3506710 3536403 3565365 3593922 3622516 3651024 3679543 3708752 3738865
57323C738865L0463L0830L2078L3387L3499L3257L4470L6674L7683L7096L6642
$$ 3738865 3769328 3800158 3832236 3865623 3899122 3932379 3966849 4003523 4041206 4078302 4114944
57312D114944L7118L7640L8006L9148M0923M1951M2054M2550M3799M4744M5217
$$ 4114944 4152062 4189702 4227708 4266856 4307779 4349730 4391784 4434334 4478133 4522877 4568094
57301D568094M6304M8016M9021M9123M9747N1362N2770N3492N4641N6725N8766
$$ 4568094 4614398 4662414 4711435 4760558 4810305 4861667 4914437 4967929 5022570 5079295 5138061
57290E138061O0309O2260O4903O7094O8158O8822O9652P0294P0759P1595P2287
$$ 5138061 5198370 5260630 5325533 5392627 5460785 5529607 5599259 5669553 5740312 5811907 5884194
57279E884194P1378O8659O5393O1935N7129N0537M3277L6070K8479K0706J4157
$$ 5884194 5955572 6024231 6089624 6151559 6208688 6259225 6302502 6338572 6367051 6387757 6401914
57268F401914R519O173M052M067O104Q565J0659J3240J6637J9691K1707K3512
$$ 6401914 6411433 6417606 6421658 6425725 6431829 6440394 6451053 6464293 6480930 6500621 6522328 6545840
57256F545840K5764K7979K9958L2335L4987L6747L7396L8138L9507M0597M1014
$$ 6545840 6571604 6599583 6629541 6661876 6696863 6733610 6771006 6809144 6848651 6889248 6930262
57245F930262M1589M2568M3114M3228M4022M5416M5803M4907M4603M5875M7177
$$ 6930262 6971851 7014419 7057533 7100761 7144783 7190199 7236002 7280909 7325512 7371387 7418564
57234G418564M7117M6494M6339M6112M5316M4949M5641M6149M5240M3569M2165
$$ 7418564 7465681 7512175 7558514 7604626 7649942 7694891 7740532 7786681 7831921 7875490 7917655
57223G917655M0631L8330L5909L4131L2516L0531K8780K7778K6887K5721K5284
$$ 7917655 7958286 7996616 8032525 8066656 8099172 8129703 8158483 8186261 8213148 8238869 8264153
57212H264153K6472K8615L0796L3256L6462L9969M3320M6760N0161N2613N4012
$$ 8264153 8290625 8319240 8350036 8383292 8419754 8459723 8503043 8549803 8599964 8652577 8706589
57201H706589N5409N6871N6769N4300N0917M7973M4806M0704L6912L4843L3762
$$ 8706589 8761998 8818869 8875638 8929938 8980855 9028828 9073634 9114338 9151250 9186093 9219855
57190I219855L2098K9874K8068K6661K4954K2848K0368J7000J2803R117O827N040
$$ 9219855 9251953 9281827 9309895 9336556 9361510 9384358 9404726 9421726 9434529 9443646 9450473 9455513
57178I455513K764N60q53k308m865p943j0284j1669j2328j1915j0551r633r921
$$ 9455513 9458277 9458837 9457984 9455676 9450811 9442868 9432584 9420915 9408587 9396672 9386121 9376488 9366567
57165I366567j0001q327n511l010q04J694L718M307M502O121Q971J1283J2389
$$ 9366567 9356566 9348239 9342728 9339718 9338914 9340608 9344326 9348633 9353135 9359256 9368227 9379510 9391899
57152I391899J2901J2630J0363N760j24o268j2388j8555k5323l3702m3721n3447
$$ 9391899 9404800 9417430 9427793 9433553 9433429 9427161 9414773 9396218 9370895 9337193 9293472 9240025
57140I240025o0756o5527o8870p0885p0749o8429o4775o0210n4859m9607m5700
$$ 9240025 9179269 9113742 9044872 8973987 8903238 8834809 8770034 8709824 8654965 8605358 8559658
57129H559658m3554m3052m4542m8274n3460n9077o5069p1424p6896q0111q1285
$$ 8559658 8516104 8473052 8428510 8380236 8326776 8267699 8202630 8131206 8054310 7974199 7892914
57118G892914q1256p9689p6088p2070p0462p2100p5285p8307q0751q2254q1766
$$ 7892914 7811658 7731969 7655881 7583811 7513349 7441249 7365964 7287657 7206906 7124652 7042886
57107G042886p8434p1971o2028m8319l1205j0836J4094M5263Q2712J25616J74923
$$ 7042886 6964452 6892481 6830453 6782134 6750929 6740093 6754187 6799450 6882162 7007778 7182701
57096G182701K33288L02392L82353M74056N79495O98539Q26864R57702J083275
$$ 7182701 7415989 7718381 8100734 8574790 9154285 9852824 10679688 11637390 12720665
57087A2720665J193230J274313J314067J303074J231983J092737Q94362O81299
$$ 12720665 13913895 15188208 16502275 17805349 19037332 20130069 21024431 21705730
57079B1705730N24249M73999N13400N56606N03252L01539l0548m31506q35601
$$ 21705730 22229979 22703978 23217378 23773984 24277236 24578775 24548227 24116721 23281120
57070B3281120j194718j480746j681128j794661j827921j792753j704826j581064
$$ 23281120 22086402 20605656 18924528 17129867 15301946 13509193 11804367 10223303
57062A0223303j435810j279258j119391r63734q18405o86989n71427m72814l90612
$$ 10223303 8787493 7508235 6388844 5425110 4606705 3919716 3348289 2875475 2484863
57053B484863l22659k67022k22659j87647j58686j33630j12899r7060q4700p4122
$$ 2484863 2162204 1895182 1672523 1484876 1326190 1192560 1079661 982601 897901 823779
57043H23779o5433n9061n3718m7913m2321l8522l6168l3537l0182k7114k4755
$$ 823779 758346 699285 645567 597654 555333 516811 480643 447106 416924 389810 365055
57032C65055k2622k0674j9265j7974j6039j3774j2088j0841r054o500l830j327
$$ 365055 342433 321759 302494 284520 268481 254707 242619 231778 222724 216224 212394 211067
57020B11067J168L399M914N971P200Q569R640J0415J1151J1746J2138J2830J4277
$$ 211067 212235 215634 220548 226519 233719 242288 251928 262343 273494 285240 297378 310208 324485
57007C24485J6306J8794K2175K6541L1278L6348M3007N2501O4966Q0446J00158
$$ 324485 340791 359585 381760 408301 439579 475927 518934 571435 636401 716847 817005
56996H17005J26183J59862J98268K28754K28530J77730P9000l7919j35633j93619
$$ 817005 943188 1103050 1301318 1530072 1758602 1936332 2015332 1977413 1841780 1648161
56986A648161k13801k08078j86961j58329j28948j03235q2894o8953o1997o0021
$$ 1648161 1434360 1226282 1039321 880992 752044 648809 565915 496962 434965 374944
56976C74944n8867n5761n0634m3970l5781k6910j8904j2086n815n70K538M329
$$ 374944 316077 260316 209682 165712 129931 103021 84117 72031 66216 65646 68184 72513
56964G2513P042J0987J4329J6525J9255K3381K7692L1371L4929L7489L5832K7758
$$ 72513 79555 90542 104871 121396 140651 164032 191724 223095 258024 295513 331345 359103
56952C59103J4764L01j2815k2443k6950k6702k4205k1419j8151j3940r851p102
$$ 359103 373867 374168 361353 338910 311960 285258 261053 239634 221483 207543 197692 190590
56940A90590n230k941K25L989Q155J2447J6454K0468K5491L1820L8215M2451M1890
$$ 190590 185360 182419 182644 186633 194788 207235 223689 244157 269648 301468 339683 382134 424024
56927D24024L3975J8211j921k0494l3322l9748m0904l8223l3840k9997k7016k3386
$$ 424024 457999 476210 474289 453795 420473 380725 339821 301598 267758 237761 210745 187359
56915A87359j8501j3819j0675q652o934n638n040m776m527m208l202q73J838L072
$$ 187359 168858 155039 144364 135712 128778 123140 118100 113324 108797 104589 101387 100514 102352 105424
56901A05424K733K654L619M361M209M514O229Q154R057R800J1832J4964J8147
$$ 105424 108157 110811 114430 118791 123000 127514 133743 141897 150954 160754 172586 187550 205697
56888B05697K1262K4790K8666L2473L5563L6111L1428K0718O672o605j6475k2159
$$ 205697 226959 251749 280415 312888 348451 384562 415990 436708 443380 436775 420300 398141
56876C98141k3850k2651k0190j7157j3049p887k894J262N453J0396J5428K0110
$$ 398141 374291 351640 331450 314293 301244 293357 290463 291725 297178 307574 323002 343112
56864C43112K5511L2658M0993M9771N9680P1127Q1259Q4131P4228N0123J6060
$$ 343112 368623 401281 442274 492045 551725 622852 704111 788242 862470 912593 928653
56853I28653j9336m7362o3824o9708o7916o0729n0329l9264k8970j9051q997O95
$$ 928653 909317 861955 798131 728423 660507 599778 549449 510185 481215 462164 453167 453862
56841D53862R797J9170K9347L9865N0977O4336Q0778R8965J16862J32012J38547
$$ 453862 463659 482829 512176 552041 603018 667354 748132 847097 963959 1095971 1234518
56830A234518J26916R0848L5039k6022p7189j10259j24792j24932j16081j02638
$$ 1234518 1361434 1452282 1487321 1461299 1384110 1273851 1149059 1024127 908046 805408
56820H05408q7146p1037n5483m1163k8023j5973n177M781J5066K6324L8159N0453
$$ 805408 718262 647225 591742 550579 522556 506583 501406 506187 521253 547577 585736 636189
56808F36189O3936P8555R1815R9007R4313P2692L3966j3658n6683q5255r8446
$$ 636189 700125 778680 870495 969502 1063815 1136507 1170473 1156815 1100132 1014877 916431
56797I16431j00577r5223q4541p1458n8821m7153l5784k5406j7319j0955m528
$$ 916431 815854 720631 636090 564632 505811 458658 422874 397468 380149 369194 364666
56786C64666K330Q785J5077K2426L0901L9295M6648N1736N1336M1611K2126k729
$$ 364666 366996 375781 390858 413284 444185 483480 530128 581864 633200 674811 696937 694208
56774F94208k6660m4909n5435n8641n6692n2002m5924l9090l2420k6786k2123
$$ 694208 667548 622639 567204 508563 451871 399869 353945 314855 282435 255649 233526
56763B33526j7932j4365j1852j0121q582p239o298n350l947k541j863j800j801
$$ 233526 215594 201229 189377 179256 170674 163435 157137 151787 147840 145299 143436 141636 139835
56750A39835j836k067k148j804j474j568j760j795k120k853l138k522j904k086
$$ 139835 137999 135932 133784 131980 130506 128938 127178 125383 123263 120410 117272 114750 112846 110760
56736A10760k438k175j797j947j964j029K54R09J174J560J373j07j882k402j740
$$ 110760 108322 106147 104350 102403 100439 99410 99664 100573 101747 103307 104680 104573 102691 100289 98549
56721I8549j042n81jK96k76j182j513j389j182l77J278K458J911N11j46j53m71
$$ 98549 97507 96926 96925 97221 96945 95763 94250 92861 91679 91302 92580 95038 96949 97460 97314 97161 96690
56704I6690p99l47J94k98j143r43j54k17q25n15M67N59j92j35J087K091K214K106
$$ 96690 95891 95544 95738 95440 94297 93354 93200 92983 92158 91643 92110 92669 92477 92342 93429 95520 97734 99840
56686I9840J863R34K4O93K676L791L051J786J306J305J145Q90N43j89r65j046
$$ 99840 101703 102637 102661 103354 106030 109821 112872 114658 115964 117269 118414 119304 119847 119658 118693 117647
56670A17647n77k76jQ25J630J327L23J6M74O05M53J071K091J785j10j778k000
$$ 117647 117070 116794 116793 117618 119248 120575 120898 120914 121388 121993 122446 123517 125608 127393 127283 125505 123505
56653A23505j464j032o77n80j326k515k914k403k047k056j568o35l56o94l11R02
$$ 123505 122041 121009 120332 119752 118426 115911 112997 110594 108547 106491 104923 104288 103932 103238 102927 103829
56637A03829J303J64j083j118l82K96J026J908K302J886J185N59j15n24j07O23
$$ 103829 105132 105296 104213 103095 102713 103009 104035 105943 108245 110131 111316 111875 111760 111236 111129 111752
56621A11752N44k25n53m04p56j389q82P78J846J497R25J082J486J749K291K825
$$ 111752 112296 112071 111518 111114 110358 108969 108087 108865 110711 112208 113133 114215 115701 117450 119741 122566
56605A22566K242P70K17J213K187J872R65L63j93q86j021m96k93o57n33M09J013
$$ 122566 124808 125578 125795 127008 129195 131067 132032 132395 132202 131316 130295 129799 129506 128849 128316 128725 129738
56588A29738O70K92L45k1j013j324l35P18Q94J039J963K905L039K890L033K927
$$ 129738 130408 130700 131045 131024 130011 128687 128352 129070 129964 131003 132966 135871 138910 141800 144833 147760
56572A47760K203J591J621J864K290L618N530O353N571M761M989N320N009N132
$$ 147760 149963 151554 153175 155039 157329 160947 166477 172830 178401 183162 188151 193471 198480 203612
56558B03612O481P791P646O600N802N109M052L206L051K766J596K13n83j222k280
$$ 203612 210093 217884 225530 232130 237932 243041 247093 250299 253350 256116 257712 257925 257342 256120 253840
56543B53840l322l997m851n947o152n055m054m284m948m939m585m424l864k520
$$ 253840 250518 246521 241670 235723 229571 224516 220462 216178 211230 206291 201706 197282 193418 190898
56529A90898j506j818k685k896k586k391k073j290o43p14j065j252j647k429k926
$$ 190898 189392 187574 184889 181993 179407 177016 174943 173653 173010 172296 171231 169979 168332 165903 162977
56514A62977k795k522k194j324m63j003k576k919j300J15l48j471j533q48k73
$$ 162977 160182 157660 155466 154142 153679 152676 150100 147181 145881 145996 145648 144177 142644 141796 141523
56499A41523O01J925K315J097q1K18R26N76j27R8P21O81M19O01N39j94k27J331
$$ 141523 142124 144049 146364 147461 147380 147598 148524 149100 148973 149071 149792 150473 150892 151493 152032 151838 151611 152942
56481A52942K792K257N75k37LL89J140K677L866L542K599K404K414J530M85N95
$$ 152942 155734 157991 158566 158329 158332 158721 159861 162538 166404 169946 172545 174949 177363 178893 179378 179973
56465A79973J353J522J454K068K761K482J837J897K086J401M97L93M24k92o34
$$ 179973 181326 182848 184302 186370 189131 191613 193450 195347 197433 198834 199331 199724 200148 199856 199222
56450A99222Q00K926L636K957K415K286J878J529J937K360J770R04R42J183K93
$$ 199222 200022 202948 206584 209541 211956 214242 216120 217649 219586 221946 223716 224620 225562 226745 227038
56435B27038j213j952k092k532k819k234j785k721m132m389l841l751l794l084
$$ 227038 225825 223873 221781 219249 216430 214196 212411 209690 205558 201169 197328 193577 189783 186699
56421A86699k340k478k391q56P63N37o16n73K98K27l58K79J706K108J714K027
$$ 186699 184359 181881 179490 178634 179397 179934 179318 178745 179043 179270 178912 179191 180897 183005 184719 186746
56405A86746K419J146q08o78J456K593J529K49L31J043J519J965K196J504L30
$$ 186746 189165 190311 189503 188825 190281 192874 194403 194652 194983 196026 197545 199510 201706 203210 203540
56390B03540n6L39M98L96O21O37k58r40PJ578J854J289J671K701K745K195K694
$$ 203540 203484 203823 204321 204717 205338 205975 205717 204777 204784 206362 208216 209505 211176 213877 216622 218817 221511
56373B21511L666L159J672J560K860L269K258J646J955J731P25M23R85R11L5j35
$$ 221511 225177 228336 230008 231568 234428 237697 239955 241601 243556 245287 246012 246435 247420 248331 248366 248231
56357B48231N86Q02M10P25J604J518N72M12J079J058M89J039K561L157K750L201
$$ 248231 248817 249619 250029 250754 252358 253876 254448 254860 255939 256997 257486 258525 261086 264243 266993 270194
56341B70194M708N458N097N211O050O156N458N409N884N345M307M953P094Q191
$$ 270194 274902 280360 285457 290668 296718 302874 308332 313741 319625 324970 329277 334230 341324 349515
56327C49515P675P502Q091P692O292O057P193P379O172N929P367Q168P162N958
$$ 349515 357190 364692 372783 380475 386767 392824 400017 407396 413568 419497 426864 435032 442194 448152
56313D48152N268L567P87n98K18Q13k54j265q85l89p09o51L47R21P16J381L274
$$ 448152 453420 456987 457774 457176 457394 458207 457953 456688 455803 455414 454705 454054 454401 455322 456038 457419 460693
56296D60693M454M268M529N980P025P192Q201J0269J1152J0355J0460J2724J5118
$$ 460693 465147 469415 473944 479924 486949 494141 502342 512611 523763 534118 544578 557302 572420
56283E72420J6404J8186K1119K3085K3225K3984K6935L0202L2262L4652L8592
$$ 572420 588824 607010 628129 651214 674439 698423 725358 755560 787822 822474 861066
56272H61066M2513M5378M9020N4775O1099O6897P3890Q3302R3505J03317J14381
$$ 861066 903579 948957 997977 1052752 1113851 1180748 1254638 1337940 1431445 1534762 1649143
56261A649143J27800J41642J54323J67264J81694J95800K07576K17475K25884
$$ 1649143 1776943 1918585 2072908 2240172 2421866 2617666 2825242 3042717 3268601
56252C268601K30796K30476K25572K16433K01266J79140J51933J21331Q7042M9985
$$ 3268601 3499397 3729873 3955445 4171878 4373144 4552284 4704217 4825548 4912590 4962575
56242D962575J3862j8611m7771p3465r3204j06102j14836j21223j23722j21901
$$ 4962575 4976437 4957826 4910055 4836590 4743386 4637284 4522448 4401225 4277503 4155602
56232D155602j19297j18693j18336j16116j13947j14597j17424j20661j24695
$$ 4155602 4036305 3917612 3799276 3683160 3569213 3454616 3337192 3216531 3091836
56223C091836j29821j33745j34768j34629j35174j35011j32410j28441j24345
$$ 3091836 2962015 2828270 2693502 2558873 2423699 2288688 2156278 2027837 1903492
56214A903492j18916j11477j04218r8482r2039q3135p4007o7123o1288n4744m8758
$$ 1903492 1784576 1673099 1568881 1470399 1378360 1295225 1221218 1154095 1092807 1038063 989305
56203I89305m4680m0720l5208k9921k6739k4177k0694j8035j7664j7223j4388
$$ 989305 944625 903905 868697 838776 812037 787860 767166 749131 731467 714244 699856
56192F99856j1112j0098j0133q850p005o176n129k462k1J70l56N42J795J870K213
$$ 699856 688744 678646 668513 659663 652658 646482 641353 638891 638870 639040 638684 639226 641021 642891 645104
56177F45104M257O083N909N734P690R925R997R063Q926Q229N663L524L942M924
$$ 645104 649361 655444 661353 667087 674777 684702 694699 703762 712688 720917 726580 730104 734046 738970
56163G38970M214L462M355M496J817o98L37K915L550L458N474Q238Q957R024J1387
$$ 738970 743184 746646 751001 755497 757314 756616 756953 759868 763418 766876 772350 780588 789545 798569 809956
56148H09956J5060J7493J9793K4380L0101L4752L9812M7699N7051O5571P4719
$$ 809956 825016 842509 862302 886682 916783 951535 991347 1039046 1096097 1161668 1236387
56137A236387Q6666R9622J10887J21061J30225J33675J27230J13582R8146Q2273
$$ 1236387 1323053 1422675 1533562 1654623 1784848 1918523 2045753 2159335 2257481 2339754
56127B339754O6129N3985M9758N0137M8454M2598L3611K0468L009j3301k2671
$$ 2339754 2405883 2459868 2509626 2559763 2608217 2650815 2684426 2704894 2707903 2694602 2671931
56116B671931k6477k9578l2727l5207m1008n4494p2594q8498j00406j09743j14104
$$ 2671931 2645454 2615876 2583149 2547942 2506934 2452440 2379846 2291348 2190942 2081199 1967095
56105A967095j10061j00446r1119q2647p2295o1603n4355m9484m3475l7416l4260
$$ 1967095 1857034 1756588 1665469 1582822 1510527 1448924 1394569 1345085 1301610 1264194 1229934
56094A229934l1882k6526k0411j8025j7653j4655j0244q690q609n712j592q84
$$ 1229934 1198052 1171526 1151115 1133090 1115437 1100782 1090538 1081848 1073239 1067527 1065935 1065051
56082A065051k107l60L220L742K117L145O183O915O410Q951J2814J2728R814R614
$$ 1065051 1062944 1062584 1065804 1069546 1071663 1074808 1080991 1087906 1094316 1103267 1116081 1128809 1138623 1148237
56068A148237J1998J2489J1747J3959J7614J7800J5908J7158K0325K0048J7440
$$ 1148237 1160235 1172724 1184471 1198430 1216044 1233844 1249752 1266910 1287235 1307283 1324723
56057A324723J8028K0996K1104J9272K0540K3392K2359J9331K0739K5193K5788
$$ 1324723 1342751 1363747 1384851 1404123 1424663 1448055 1470414 1489745 1510484 1535677 1561465
56046A561465K3074K3646K7245K7635K5149K5849K9245K9385K7201K8988L3708
$$ 1561465 1584539 1608185 1635430 1663065 1688214 1714063 1743308 1772693 1799894 1828882 1862590
56035A862590L4801L3422L6481M2639M4191M1917M3817M9736N1861M9984N1458
$$ 1862590 1897391 1930813 1967294 2009933 2054124 2096041 2139858 2189594 2241455 2291439 2342897
56024B342897N6185N6883N4080N5575O0963O2307O0107O2692O9705P2553P1361
$$ 2342897 2399082 2455965 2510045 2565620 2626583 2688890 2748997 2811689 2881394 2953947 3025308
56013C025308P4640Q2052Q4798Q3388Q7180R5937J00098R9803J04753J14706J19709
$$ 3025308 3099948 3182000 3266798 3350186 3437366 3533303 3633401 3733204 3837957 3952663 4072372
56002D072372J20262J27001J39482J46332J47489J54628J68231J76795J80148
$$ 4072372 4192634 4319635 4459117 4605449 4752938 4907566 5075797 5252592 5432740
55993E432740J90205K06874K17467K21961K33790K53451K67617K76528K94701
$$ 5432740 5622945 5829819 6047286 6269247 6503037 6756488 7024105 7300633 7595334
55984G595334L21955L42764L57316L82743M20125M52388M78804N17781N70849
$$ 7595334 7917289 8260053 8617369 9000112 9420237 9872625 10351429 10869210 11440059
55975A1440059O19663O63980P25151Q05991Q87009R68972J076776J213846J358361
$$ 11440059 12059722 12723702 13448853 14254844 15141853 16110825 17187601 18401447 19759808
55966A9759808J513136J710585J958949K236359K549133K938847L419962L974055
$$ 19759808 21272944 22983529 24942478 27178837 29727970 32666817 36086779 40060834
55958D0060834M621120N428528O433706P634939R078038J0867054J3069121J5708274
$$ 40060834 44681954 50110482 56544188 64179127 73257165 84124219 97193340 112901614
55950A12901614J8882273K2783861K7582504L3339043L9800734M5722452M8222046
$$ 112901614 131783887 154567748 182150252 215489295 255290029 301012481 349234527
55943C49234527M3584744K9866343R194451j2838764l0517564m1042386m4861553
$$ 349234527 392819271 422685614 431880065 419041301 388523737 347481351 302619798
55936C02619798m3951038m0248107l5209971k9884667k4899333k0492140j6722897
$$ 302619798 258668760 218420653 183210682 153326015 128426682 107934542 91211645
55929I1211645j3620827j1143415r155396p535896o238668n220330m396557l706008
$$ 91211645 77590818 66447403 57292007 49756111 43517443 38297113 33900556 30194548
55921C0194548l145148k706258k342824k023036j758714j554301j379133j213632
$$ 30194548 27049400 24343142 22000318 19977282 18218568 16664267 15285134 14071502
55913A4071502j074162r69382q76355p80703o98674o39494n84708n23571m72153
$$ 14071502 12997340 12027958 11151603 10370900 9672226 9032732 8448024 7924453 7452300
55904G452300m39230m07707l67239l32571l12746k93158k64442k39847k27957
$$ 7452300 7013070 6605363 6238124 5905553 5592807 5299649 5035207 4795360 4567403
55895D567403k16002j95679j79001j73536j67083j51644j38483j35228j30962
$$ 4567403 4351401 4155722 3976721 3803185 3636102 3484458 3345975 3210747 3079785
55886C079785j18056j06694j04220j01136r0865q3006q3888q3615p5258o8024
$$ 3079785 2961729 2855035 2750815 2649679 2558814 2475808 2391920 2308305 2233047 2165023
55876B165023o8743o8490o0196n2085n1260n0544m3849l8415l9939m1021l6064
$$ 2165023 2096280 2027790 1967594 1915509 1864249 1813705 1769856 1731441 1691502 1650481 1614417
55865A614417l2588l6242l9127l4536k9191k9587k9702k3632j7361j6728j6047
$$ 1614417 1581829 1545587 1506460 1471924 1442733 1413146 1383444 1359812 1342451 1325723 1309676
55854A309676r631k881j298k8N166P627R76r816j8152k6230l6360m2474m0304
$$ 1309676 1300045 1297164 1295866 1295838 1301004 1308631 1309607 1299791 1281639 1255409 1219049 1176575 1136271
55841A136271l6309l6869l7822l3877k9069k8565k8916k5687k2388k3039k3849
$$ 1136271 1099962 1063093 1025271 991394 962325 933760 904844 879157 856769 833730 809881
55830H09881k0633j6710j5601j3899r013n751p518r210o511m059o577j0044r588
$$ 809881 789248 772538 756937 743038 734025 728274 720756 711546 705035 700976 694399 684355 674767
55817F74767q165r455r901n917j602j261j438J810M874L675J724L251M922K363
$$ 674767 666602 657147 647246 641329 639727 638466 637028 638838 643712 647387 649111 652362 657284 659647
55803F59647j541k554k941n896q281o644m499o219r303r936j0383j3671j6679
$$ 659647 658106 655552 652611 646715 638434 631790 627291 621072 611769 601833 591450 577779 561100
55790E61100j5794j3938j4821j5804j3396j0376j0325j0588p765m696m840n036
$$ 561100 545306 531368 516547 500743 487347 476971 466646 456058 448293 443597 438757 433721
55778D33721j362L000L005N3k117m857j0557j5854j6398j4286j3721j3446j0455
$$ 433721 432359 435359 438364 438417 436300 431443 420886 405032 388634 374348 360627 347181 336726
55765C36726o990o608p267n375k989l974o617o933n876o592p835o797n247o377
$$ 336726 329736 323128 315861 310486 307497 303523 296906 289973 284097 277505 269670 262873 257626 251249
55751B51249q549q344o752o376n815k847J78R4j238p18n4k097m722m613l506m468
$$ 251249 242700 234356 227604 221228 215413 212566 212744 212838 211600 210882 210828 208731 204009 199396 195890 191422
55735A91422n433k970Q49J957J486K951N162M607K164R36L5k957o015n680l684
$$ 191422 185989 183019 183868 185825 187311 190262 195424 200031 202195 203131 203166 200209 194194 188514 184830
55720A84830m049n874n448l383l025l789k569j45K23q19O2K535L520L200M374
$$ 184830 180781 174907 169459 166076 163051 159262 156693 156548 156771 155952 156014 158549 162069 165269 169643
55705A69643O882Q234Q627R993J1213R538N696K616M91k135m070l325j634k024
$$ 169643 176525 184759 193386 203379 214592 224130 229826 232442 232933 230798 226728 223403 221769 219745
55691B19745l520l276k157k956m749m427k310j034l09J954M752N507N136O470
$$ 219745 216225 212949 210792 207836 203087 198660 196350 195316 195007 196961 201713 207220 212356 218826
55677B18826Q921R714R056R017Q803O286K844J520J723P37r22q71R2m71j536m64
$$ 218826 227747 237461 246517 255534 264337 270623 273467 274987 276710 277447 276525 275654 275746 275275 273739 273275
55661B73275J555J368k45r7J279P97j077j228J2n10k713l647l289m351o727p747
$$ 273275 274830 276198 275953 275856 277135 277932 276855 275627 275639 275129 272416 268769 265480 261129 254402 246655
55645B46655p634r101j1720j2265j0548r542r759q857o868o397p438p217n432
$$ 246655 239021 229920 218200 205935 195387 185845 176086 167229 160361 153964 146526 139309 133877
55632A33877m627n117m601k998k696l703l447j706r36j453j116Mm29k139k273
$$ 133877 129250 124133 119532 116534 113838 110135 106688 104982 104046 102593 101477 101481 101052 98913 96640
55617I6640o53j97j567k235j433j275k278k435j433j324k337k379j334j405k699
$$ 96640 95987 95790 94223 91988 90555 89280 87002 84567 83134 81810 79473 77094 75760 74355 71656
55602G1656k845j545j097j820j449L17J152N37M68J157N88j005r11J017J680J50
$$ 71656 68811 67266 66169 64349 62900 63217 64369 64906 65374 66531 67119 66114 65203 66220 67900 68050
55586F8050q72p9M23n93j475j337j626k691k733j384n90q74n78L31k72k356l088
$$ 68050 67178 67099 67522 66929 65454 64117 62491 59800 57067 55683 55093 54219 53641 53972 53700 51344 48256
55569D8256j606l38l98J43K006K900J640K25J71L49q3n9O39N66j85M13K354K880
$$ 48256 46650 46312 45914 46057 48063 50963 52603 52828 52999 53348 53265 53206 53845 54411 54226 54639 56993 59873
55551E9873J130k68L75J404J451J788L274M381M050L511L643L524K883L010L989
$$ 59873 61003 60735 61110 62514 63965 65753 69027 73408 77458 80969 84612 88136 91019 94029 98018
55536I8018M164L370L500M798N059L616K626L088L187J944R42R30K79j638k999
$$ 98018 102182 105552 109052 113850 118909 122525 125151 128239 131426 133370 134312 135242 135521 133883 130884
55521A30884l077l721n685o864n928m390l424j999Q7Q17n34j741j436j311k625
$$ 130884 127807 124086 118401 111537 105609 101219 97795 95796 95883 96700 96166 94425 92989 91678 89053
55506H9053l813l619l462m462n163m369l498l907m508m107l560l698l621k811
$$ 89053 85240 81621 78159 73697 68534 64165 60667 56760 52252 48145 44585 40887 37266 34455
55492C4455k452k939k743j297k50l75j17J138J518J70p87R2J016K37r94r61k42
$$ 34455 32003 29064 26321 25024 24774 24399 24282 25420 26938 27108 26321 26413 27429 27666 26672 25711 25469
55475B5469J56Q32K005K170Q60J31J196K173J296k66r60j455k460k685j426n59
$$ 25469 25625 26457 28462 30632 31492 31623 32819 34992 36288 36022 35062 33607 31147 28462 27036 26477
55459B6477j424k202j087M19J65r31p68K70M84P5L31R71Q20J10k17l93j030j510
$$ 26477 25053 22851 21764 22183 22348 21417 20649 20919 21403 21478 21809 22780 23600 23710 23493 23100 22070 20560
55441B0560j048k42k6j68j25j24k54j5L08l44j573j479J32R92jj001n32J58j82
$$ 20560 19512 19270 19244 19076 18951 18827 18573 18558 18866 18522 16949 15470 15602 16594 16593 15592 15060 15218 15036
55422A5036m96K46Q77M02J02J096K102J777J092J211J209J15r12o49M7K65J043
$$ 15036 14540 14786 15663 16065 16167 17263 19365 21142 22234 23445 24654 24769 23857 23208 23255 23520 24563
55405B4563L082M581L773J740M10l69j474k226j866j524k311l087k387r46k32
$$ 24563 27645 32226 35999 37739 38149 37780 36306 34080 32214 30690 28379 25292 22905 21959 21727
55390B1727j16Nm23j535j800m65O71M0j126j140p19j182j801j427q43j094j240
$$ 21727 21611 21616 21193 19658 17858 17393 18064 18104 16978 15838 15119 13937 12136 10709 9866 8772 7532
55373G532k33Q19O32J17M27O42j63o50L56J257L43r53m73Q42P91j39J8R49Q20
$$ 7532 7299 8118 8750 8867 9294 9936 9773 9123 9479 10736 11079 10126 9653 10495 11286 11147 11165 12114 12934
55354A2934k07m71P3J28k84j44L53L97M56J170J483L23j048r13o1k83j174j196
$$ 12934 12727 12256 12329 12457 12173 12029 12382 12779 13235 14405 15888 16211 15163 14250 14189 13906 12732 11536
55336A1536o87r08j245l46R02N71q92j373n76L2J06M77R22N80L9M46J141O39o24
$$ 11536 10849 9941 8696 8350 9252 9823 8931 7558 6982 7014 7120 7597 8519 9099 9138 9584 10725 11364 10740
55317A0740j101r37j317j793r93N71J138P34Q55J567J593R46Q31J178P71k94p46
$$ 10740 9639 8702 7385 5592 4599 5170 6308 7042 7897 9464 11057 12003 12834 14012 14783 14489 13743
55300A3743m72m70p20l45M23O50O12J124J541P47m10j82J039J269J75p05p44p97
$$ 13743 13271 12801 12081 11736 12159 12809 13421 14545 16086 16833 16423 16241 17280 18549 18724 18019 17275 16478
55282A6478j119j045o89q27j197q83j72p5m27l48m3j67j29Q65J875J606R14J428
$$ 16478 15359 14314 13625 12798 11601 10718 10546 10471 10044 9696 9653 9486 9357 10222 12097 13703 14617 16045
55264A6045K449J998L74k20O89J337Q23J23o9j40j94l8k84j404k100r32R94J411
$$ 16045 18494 20492 20866 20646 21335 22672 23495 23618 23549 23409 23215 23177 22893 21489 19389 18457 19451 20862
55246B0862L58k76j54n07j226r15J22Q3j060j381l57M18K55L57J180J458N85l78
$$ 20862 21220 20944 20790 20283 19057 18142 18264 18347 17287 15906 15549 15967 16222 16579 17759 19217 19802 19424
55228A9424p17r72j296r57J8O89R47J561K334K183J174M31Q2o82j508j165J27
$$ 19424 18707 17735 16439 15482 15500 16189 17136 18697 21031 23214 24388 24819 24901 24219 22711 21546 21673
55211B1673Q74Q09R26J097K19j251j477l39K53m73j139q02k04J39Q13J882K469
$$ 21673 22547 23356 24282 25379 25598 24347 22870 22531 22784 22311 21172 20370 20166 20305 21118 23000 25469
55194B5469K365K128J472k82k089j989k62P47K09l22l3n1q82j270n84L3j50k89
$$ 25469 27834 29962 31434 31152 29063 27074 26812 27559 27768 27446 27413 27362 26480 25210 24626 24659 24509 24220
55176B4220J14K20m19r70r42q43p30k8Q63Q07J12L03J392J683P18m3M7r6q23j002
$$ 24220 24334 24554 24135 23165 22223 21380 20650 20622 21485 22292 22404 22707 24099 25782 26500 26457 26504 26408 25585 24583
55156B4583m32m88j474j797p78J37J4j30M44Q35N42N70J300J513P17K11O12N73
$$ 24583 24151 23663 22189 20392 19614 19751 19765 19635 20079 20914 21456 22026 23326 24839 25556 25767 26379 26952
55138B6952o62j670j306o42q51j127l92O92J068J046J193R78Q6l98L39J263J033
$$ 26952 26290 24620 23314 22672 21821 20694 20302 20994 22062 23108 24301 25279 25365 24967 25306 26569 27602
55121B7602Mo06m92o8M84J009J203J270J734K130J311m79j492j037l41k46P3J231
$$ 27602 27606 27000 26508 26440 26924 27933 29136 30406 32140 34270 35581 35102 33610 32573 32232 31986 32059 33290
55103C3290K242K181J552J059N03k00m59k81n07j052o95O85J491R00J10J72N27
$$ 33290 35532 37713 39265 40324 40827 40627 40168 39887 39380 38328 37633 38318 39809 40709 40819 40991 41518
55086D1518O24J037J842J873O97l80m43k00j73L25J302J357J22o78PQ28N54J80
$$ 41518 42142 43179 45021 46894 47591 47211 46768 46568 46395 46720 48022 49379 49501 48823 48830 49658 50212 50392
55068E0392P70J304O70j14K55R09L57r11j378r28m64j58K29L14r2k39J81J48q59
$$ 50392 51162 52466 53136 53022 53277 54186 54543 53632 52254 51326 50862 50704 50933 51247 51155 50916 51097 51245 50386
55049E0386j591j050k31k96n87j63K00m97j422j291o44p17j212j055l69J61Q50
$$ 50386 48795 47745 47514 47218 46631 46468 46668 46171 44749 43458 42814 42097 40885 39830 39461 39622 40472
55032D0472K036K628J647K89L62J526K051J658J496J819J724R86L24j2l56n53
$$ 40472 42508 45136 46783 47072 47434 48960 51011 52669 54165 55984 57708 58694 59018 59006 58650 58097
55016E8097j76M55P06P04Q22O25l73j505j789j434j257j164n77J22M8o88j154
$$ 58097 57921 58376 59082 59786 60608 61233 60860 59355 57566 56132 54875 53711 53134 53256 53304 52616 51462
54999E1462r79n22m0K81Mq63j417j049m38l90m88P0J023J575J709J842J806J273
$$ 51462 50483 49961 49921 50202 50206 49343 47926 46877 46439 46049 45561 45631 46654 48229 49938 51780 53586 54859
54981E4859O08K70k0n28o74O2J055J381J112R14J034J411K049K555K320J795K429
$$ 54859 55467 55737 55717 55189 54515 54577 55632 57013 58125 59039 60073 61484 63533 66088 68408 70203 72632
54964G2632M470O179O246N661O034P432R151J1236J3720J5610J6252J6634J7734
$$ 72632 77102 83281 89527 95188 101222 108654 117805 129041 142761 158371 174623 191257 208991
54951B08991J8649J7874J5426J2094P703J914m184r041j2535j5242j6794j6659
$$ 208991 227640 245514 260940 273034 280737 282651 278467 269426 256891 241649 224855 208196
54939B08196j5753j5401j5302j4271j2436j0871r577p706n445l917l332k800j834
$$ 208196 192443 177042 161740 147469 135033 124162 114585 106879 101434 97517 94185 91385 89551
54926H9551p60J99R80J190P43N23J268K389L040L707N313P454R063J0208J1698
$$ 89551 88791 88990 89970 91160 91903 92426 93694 96083 99123 102830 108143 115597 124660 134868 146566
54911A46566J3440J4685J5492J6376J6838J5765J3005R174M277j997q732j3982
$$ 146566 160006 174691 190183 206559 223397 239162 252167 261341 265618 263621 254889 240907
54899B40907j6639j7176j6707j6151j5943j5666j4326j1685q815o766n504m757
$$ 240907 224268 207092 190385 174234 158291 142625 128299 116614 107799 101033 95529 90772
54887I0772m718m990m271k276o56o62j234r17k58n13j238j260q98j125j456q44
$$ 90772 86054 81064 76793 74517 73861 73199 71965 71048 70790 70277 69039 67779 66881 65756 64300 63456
54871F3456O9k10j419k018j717j490j426p27L28N07k99r67j007r59j016q44o00
$$ 63456 63525 63315 61896 59878 58161 56671 55245 54518 54846 55353 55054 54087 53080 52121 51105 50261 49661
54854D9661o47n96o2J88n62j327p63M41N00o55j552j687j756j668o10R56J502
$$ 49661 49014 48418 48356 48544 47982 46655 45892 46333 46833 46178 44626 42939 41183 39515 38905 39861 41363
54837D1363P86J54L74Q87J205J394J221N12J60R95J991J480o0n46N06J451J264
$$ 41363 42149 42303 42677 43564 44769 46163 47384 47896 48056 49051 51042 52522 52462 51916 52422 53873 55137
54820E5137P33O40P54J005J817K881L275L013K977L264L215L067L740M975N650
$$ 55137 55870 56510 57264 58269 60086 62967 66242 69255 72232 75496 78711 81778 85518 90493 96143
54805I6143N969P322R777J1705J2332J2770J4055J5867J7641J9168J9672J7934
$$ 96143 102112 109434 119211 130916 143248 156018 170073 185940 203581 222749 242421 260355
54793B60355J3859Q593K936k921q156j1571j3228j4231j4809j4325j3023j1922
$$ 260355 274214 282807 285743 282822 274666 263095 249867 235636 220827 206502 193479 181557
54781A81557j0932r204p317o865p672p669o022m167l242k601j567n62J97J173
$$ 181557 170625 161421 154104 147239 139567 131898 125876 121709 118467 115866 114299 113737 113934 115107
54767A15107K117K067J361J618L206M808N983P877J0632J2578J2982J3417J5132
$$ 115107 117224 119291 120652 122270 125476 130284 136267 144144 154776 167354 180336 193753 208885
54754B08885J7173J8304J8672J8322J6154J1824O905K654j483n757q551q722p816
$$ 208885 226058 244362 263034 281356 297510 309334 316239 318893 317410 311653 303102 294380 286564
54741B86564p959q914r139q610q636r675j1055j2291j3212j3397j2733j1940j1511
$$ 286564 278605 269691 260552 251942 243306 233631 222576 210285 197073 183676 170943 159003 147492
54728A47492j0837r300p393n804m411l102k617l372m402m546l847k875j606n6
$$ 147492 136655 127355 119962 114158 109747 106645 104028 100656 96254 91708 87861 84986 83380 83324
54714H3324R49Q27K46R9J92j5k61n4L69O37R15J176P64l54r31j42J013J199O88
$$ 83324 84273 85100 85346 85445 85637 85622 85361 85307 85676 86313 87228 88404 89168 88814 87883 87741 88754 89953 90641
54695I0641N01N38K8p25o74J95P74N23P5P4L87N36L36k4j94%K75K39N0K16O93
$$ 90641 91142 91680 91708 90983 90309 90504 91278 91801 91876 91950 92337 92873 93209 93185 92991 92991 93266 93505 93555 93771 94464
54674I4464R17R02J362K416L191L139K837K975L402L732L995M211M158M073M662
$$ 94464 95381 96283 97645 100061 103252 106391 109228 112203 115605 119337 123332 127543 131701 135774 140436
54659A40436N935O971P276P395P656P432O293M867L823L040K347K063K100J694
$$ 140436 146371 153342 160618 168013 175669 183101 189394 194261 198084 201124 203471 205534 207634 209328
54645B09328Q26O83J872L292L819M035N127P030Q894J0606J2607J4655J5906J5900
$$ 209328 210154 210837 212709 216001 219820 223855 228982 236012 244906 255512 268119 282774 298680 314580
54631C14580J4621J2016Q122L280k289q509j4575j8930k0773k0905k0432j9456
$$ 314580 329201 341217 349339 352619 350330 341821 327246 308316 287543 266638 246206 226750
54619B26750j7685j5466j3350j1352r353p641o446n495m533l570k282j59K274
$$ 226750 209065 193599 180249 168897 159544 151903 145457 139962 135429 131859 129577 129418 131692
54606A31692L530L032J922J438J630K238L380M551M335K278j27j461k172l214
$$ 131692 135222 138254 140176 141614 143244 145482 148862 153413 157748 160026 159899 158438 156266 153052
54592A53052m135m030l393l421m107m535m484m398m190l439k536k361k986l672
$$ 153052 148917 144887 141494 138073 133966 129431 124947 120549 116359 112920 110384 108023 105037 101365
54578A01365l946l887l551k915k220j729j461j487j932k373k025j015m91r14j304
$$ 101365 97419 93532 89981 87066 84846 83117 81656 80169 78237 75864 73839 72824 72333 71419 70115
54563G0115q58k23k24m92l81k62o77j156j040o58n57k83O93J650J479L80n21p62
$$ 70115 69257 69034 68810 68318 67937 67675 66998 65842 64802 64144 63587 63304 63997 65647 67126 67506 66985 66223
54545F6223n98k5J046K059K369K198K132K119J925J961K618L328L318K856K810
$$ 66223 65625 65600 66646 68705 71074 73272 75404 77523 79448 81409 84027 87355 90673 93529 96339
54530I6339L410M349N570O985P955Q080Q002Q413Q826Q208O392L893R52k285n143
$$ 96339 99749 104098 109668 116653 124608 132688 140690 149103 157929 166137 172529 176422 177374 175089 169946
54515A69946p011q128q910r072q336p346o861o619n976n094m489l999l179k189
$$ 169946 162935 154807 145897 136825 128489 121143 114282 107663 101687 96593 92104 88105 84926 82737
54501H2737j378n82K79N95%q05j104j251j703j862j074K5M07J87P7R6K7L57J392
$$ 82737 81359 80777 81056 81651 81651 80846 79742 78491 76788 74926 73852 73877 74284 74471 74548 74644 74671 75028 76420
54482G6420K187J813Q69M01J04p63j508r30M48R82M57J26M48N98K89K43O49P22
$$ 76420 78607 80420 81289 81690 81794 81031 79523 78593 79041 80023 80480 80606 81054 81652 81941 82184 82833 83555
54464H3555J40m53o81r35j385j596j391j134j014q73p86r69j258j385j586k059
$$ 83555 83695 83242 82561 81626 80241 78645 77254 76120 75106 74233 73447 72478 71220 69835 68249 66190
54448F6190k254j673r45j032j704j856j050K63J632K632K571J307o3m78l51n33
$$ 66190 63936 62263 61318 60286 58582 56726 55676 55939 57571 60203 62774 64081 64018 63540 63189 62656
54432F2656o32J27J027O69o80j337p21J27M79O96R76R37O87Q97J550J908J756
$$ 62656 62024 62151 63178 63847 63167 61830 61109 61236 61715 62411 63387 64324 65011 65908 67458 69366 71122
54415G1122J551J336Q11L61O61J350J484J183J342J863J835J388J613K489K720
$$ 71122 72673 74009 74820 75181 75842 77192 78676 79859 81201 83064 84899 86287 87900 90389 93109
54400I3109J998J611K284L100L212L216L877M855N450N688N924O219O543O866
$$ 93109 95107 96718 99002 102102 105314 108530 112407 117262 122712 128400 134324 140543 147086 153952
54386A53952O750N725M194L016K191R80o13j770k328k992l881m320m317m803n891
$$ 153952 160702 166427 170621 173637 175828 176808 176195 174425 172097 169105 165224 160904 156587 151784 145893
54371A45893o400n685m673m342m425m327m161m084l576k313j011o13j163j998
$$ 145893 139493 133808 129135 124793 120368 116041 111880 107796 104220 101907 100896 100283 99120 97122
54357I7122k543k527j959j232p72n07j92q2m21n25M97K176L062K806K591L259
$$ 97122 94579 92052 90093 88861 88089 87582 87390 87308 86887 86362 86859 89035 92097 94903 97494 100753
54341A00753M287M982N397N650N517N183N318N904O043N395M696M445M173L482
$$ 100753 105040 110022 115419 121069 126586 131769 137087 142991 149034 154429 159125 163570 167743 171225
54327A71225K725K020P44j306l264m416n184o138o907o911o407o045n888n554
$$ 171225 173950 175970 176714 175408 172144 167728 162544 156406 149499 142588 136181 130136 124248 118694
54313A18694m909m116l396l096l501m243m436l699k559j692j311j328j534j515
$$ 118694 113785 109669 106273 103177 99676 95433 90997 87298 84739 83047 81736 80408 78874 77359
54299G7359j157j091j882k803k504r74K54J38o65j020o96j34L06L35k48j152j741
$$ 77359 76202 75111 73229 70426 67922 66948 67202 67340 66675 65655 64959 64825 65131 65466 65218 64066 62325
54282F2325j793j535j019j97N12O08M24O07Q72M85k11j96L18lj217j613k81J367
$$ 62325 60532 58997 57978 57781 58293 58901 59325 59932 60804 61289 61078 60882 61200 61197 59980 58367 58086 59453
54264E9453J637Q23L60O74J004P66J92r9K75J002J100N7j197j292l65J61k34n39
$$ 59453 61090 61913 62273 62947 63951 64717 64909 64810 65085 66087 67187 67244 66047 64755 64390 64551 64317 63778
54246F3778j2P96J244J512J653J044m28j690j770r45MP65J216J102N36L1l84j159
$$ 63778 63766 64562 65806 67318 68971 70015 69587 67897 66127 65182 65186 65951 67167 68269 68805 68836 68452 67293
54228F7293k114k387j800j114o40J24J096J261L57n40p20p69j035q14J45O72k9
$$ 67293 65179 62792 60992 59878 59238 59362 60458 61719 62076 61536 60816 60047 59012 58198 58343 59015 58986
54211E8986r66q46L8O12O70O07M51J92K85P52P25j50q26m33K45M6p01q83m70l20
$$ 58986 58020 57174 57212 57824 58494 59101 59552 59744 60029 60781 61506 61356 60530 60097 60342 60388 59687 58804 58334 58014
54191E8014o00o79l62j60l93q21r89n47M56J295J101K3q92j124j127j103n96K77
$$ 58014 57414 56735 56373 56213 55820 54999 54010 53463 53919 55214 56315 56338 55446 54322 53195 52092 51496 51773
54173E1773N54K8k05M15Q72L93j39K26Q06N76LJ61R07J353J363J258P38n10j793
$$ 51773 52327 52355 52150 52565 53437 53830 53691 53917 54723 55299 55302 55463 56370 57723 59086 60344 61082 60572 58779
54154E8779k218j908j381m96P93J614J400J050J506K017J388J25l97k64o38j490
$$ 58779 56561 54653 53272 52776 53569 55183 56583 57633 59139 61156 62544 62669 62272 62008 61370 59880
54138E9880j618p69N4L47N96R17P08q6p64j067j406j756j524o90O5N26J102J697
$$ 59880 58262 57493 57547 57894 58490 59407 60115 60029 59265 58198 56792 55036 53512 52822 52887 53413 54515 56212
54120E6212J540M89n72r08o69k01M09Q92P46P0k86J85R04R67K27o28q30k95K87
$$ 56212 57752 58241 57669 56761 56092 55891 56300 57192 57938 58008 57722 57907 58811 59778 60005 59377 58547 58252 58539
54101E8539J34o46j121p67j61m1j89O2O00O66L9o12o06JN46L25p46j822j774m35
$$ 58539 58673 58027 56906 56139 55978 55937 55748 55810 56410 57076 57115 56503 55897 55898 56444 56769 56023 54201 52427 51992
54081E1992J171K022K003J449N56k88m08K77Q40M93m36j150j418j360r01j13N13
$$ 51992 53163 55185 57188 58637 59193 58905 58497 58774 59614 60107 59671 58521 57103 55743 54842 54729 55242
54064E5242P12Q10R61P92L05K49R21J530J443J186J433J894K072K102K054J434
$$ 55242 55954 56764 57725 58517 58822 59071 59992 61522 62965 64151 65584 67478 69550 71652 73706 75140
54048G5140L27j42M55Q90K66k33P68K422K917K315K238L227M212M347L766K836
$$ 75140 75467 75325 75780 76670 76936 76703 77471 79893 82810 85125 87363 90590 94802 99149 102915 105751
54032A05751K102K604M660O712O960N779N030N359N891O184O618O957O412N141
$$ 105751 107853 110457 115117 121829 128789 134568 139598 144957 150848 157032 163650 170607 177019 182160
54018A82160M079L267K039Q25R31K320L390L254K606K033J219K69QK99k83k304
$$ 182160 186239 189506 191545 192370 193301 195621 199011 202265 204871 206904 208123 208392 208400 208699 208416 206112
54002B06112m351m999m634m496m930n441n638n304m302k951j951j497j145p64
$$ 206112 201761 196762 192128 187632 182702 177261 171623 166319 162017 159066 157115 155618 154473 153709
53988A53709q10j357j721j443q37k39M78J306J799J722J397J154J008R57R36N59
$$ 153709 152899 151542 149821 148378 147541 147302 147780 149086 150885 152607 154004 155158 156166 157123 158059 158618
53972A58618l33j062r20m46p21j653k206k270k745l648l817k883k001j923j869
$$ 158618 158285 157223 156303 155857 155136 153483 151277 149007 146262 142614 138797 135914 133913 131990 130121
53957A30121j157n67r53j627j374l05M72M77K48L75J040K182L472M320M472M306
$$ 130121 128964 128397 127444 125817 124443 124138 124610 125087 125335 125710 126750 128932 132404 136724 141196 145502
53941A45502M264M348M471M833N589O606P818R361J0995J1955J1736J0662R298
$$ 145502 149766 154114 158585 163418 169007 175613 183431 192792 203787 215742 227478 238140 247438
53928B47438P738N837L731J724j2j343j970j617l14J537L223M066L998L635L436
$$ 247438 255176 261013 264744 266468 266456 265113 263143 261526 261212 262749 265972 270038 274036 277671 281107
53913B81107L105K321J607J682K308K699K878L537M660N395N435N380N470N042
$$ 281107 284212 286533 288140 289822 292130 294829 297707 301244 305904 311299 316734 322114 327584 332626
53899C32626L746K326J577J250N65p02k157l383m134m311m087l835l834m204n046
$$ 332626 336372 338698 340275 341525 342090 341388 339231 335848 331714 327403 323316 319481 315647 311443 306397
53884C06397o262p371p960q219q531q823q864q875r065q937p949o603n875n730
$$ 306397 300135 292764 284804 276585 268054 259231 250367 241492 232427 223490 215541 208938 203063 197333
53870A97333n345m626m330m648m851m532m081l706l140k583k759l666m346m334
$$ 197333 191988 187362 183032 178384 173533 169001 164920 161214 158074 155491 152732 149066 144720 140386
53856A40386m248m536m604l856k655j730j304j303j688k150k190j896j834j951
$$ 140386 136138 131602 126998 123142 120487 118757 117453 116150 114462 112312 110122 108226 106392 104441
53842A04441j510n02p1q46j771j448n2R73P05m24j363j483r40l49p5J05M37N73
$$ 104441 102931 102429 102358 101512 99741 98293 98241 99214 99919 99495 98132 96649 95709 95360 95285 95390 95827 96400
53824I6400O1p51j022n31J48N32N72K91j32n9R08K020K085J072O6k39l4M98J369
$$ 96400 96461 95710 94688 94157 94305 94837 95409 95700 95568 95509 96417 98437 100522 101594 101660 101421 101387 101885 103254
53805A03254K082K014J539J617K210K422K310K966M560N813N946N719N876N996
$$ 103254 105336 107350 108889 110506 112716 115138 117448 120414 124974 130787 136733 142452 148328 154324
53791A54324N595N122M988M781M207L767L727L411K321J041L10O7O0M50J173J607
$$ 154324 159919 165041 170029 174810 179017 182784 186511 189922 192243 193284 193594 193661 193721 194171 195344 196951
53775A96951J460J090N32p31k498l572l471l234l814m746n199n214m982m174k915
$$ 196951 198411 199501 200033 199302 196804 193232 189761 186527 182713 177967 172768 167554 162572 158398 155483
53760A55483k289k798l296k619j353q64j373k098k516k462j735o61k92j028j785
$$ 155483 153194 150396 147100 144481 143128 142264 140891 138793 136277 133815 132080 131419 131127 130099 128314
53745A28314j510p64p02j241j542j585k016k783l132k727j782n00P96J388R35
$$ 128314 126804 126040 125338 124097 122555 120970 118954 116171 113039 110312 108530 108030 108826 110214 111149
53730A11149J51r8Q2J62K19O13J117J369J658K357L039L031K430J825J478J462
$$ 111149 111300 111202 111284 111446 111665 112278 113395 114764 116422 118779 121818 124849 127279 129104 130582 132044
53714A32044J990K829L061K322J548J662K235K448K555L216M058M271M060M235
$$ 132044 134034 136863 139924 142246 143794 145456 147691 150139 152694 155910 159968 164239 168299 172534
53700A72534M680M582L898L415L404L329K749J627k5j882l032k917k281k230k703
$$ 172534 177214 181796 185694 189109 192513 195842 198591 200218 200193 198311 195279 192362 190081 187851 185148
53685A85148k855k490k009j330j31J021J095J92m85l04J27J03l48r05j420j709
$$ 185148 182293 179803 177794 176464 176333 177354 178449 178641 178156 177852 177979 178082 177734 176829 175409 173700
53669A73700j561j059l90M72J400J790J368R47J487K593K973K181J043L81K62
$$ 173700 172139 171080 170690 171162 172562 174352 175720 176667 178154 180747 183720 185901 186944 187325 187587
53654A87587M92R50J409J682K021K690L342L470L306L500M059M344M009L246K203
$$ 187587 188079 189029 190438 192120 194141 196831 200173 203643 206949 210449 214508 218852 222861 226107 228310
53639B28310R33k74j165j941k749l117k765k501l229m325m286k985j987k293k962
$$ 228310 229243 228969 227804 225863 223114 219997 217232 214731 211502 207177 202891 199906 197919 195626 192664
53624A92664k555j036M28J006Q89O73O18N26K22k9K08Q73J390J548J832K568L226
$$ 192664 190109 189073 189501 190507 191396 192069 192687 193213 193435 193406 193614 194487 195877 197425 199257 201825 205051
53607B05051L159K613K330K518K775K765K437J891J532J970L231M457M921M821
$$ 205051 208210 210823 213153 215671 218446 221211 223648 225539 227071 229041 232272 236729 241650 246471
53593B46471M591M087L155K355K220K385K337K404L048L685L424K545K063K079
$$ 246471 251062 255149 258304 260659 262879 265264 267601 270005 273053 276738 280162 282707 284770 286849
53579B86849J791R72L02K12M02N27N31L65J15K24P82R07j06j414j477j14J363
$$ 286849 288640 289612 289914 290126 290528 291055 291586 291951 292066 292290 293072 293979 293873 292459 290982 290868 292231
53562B92231J983J948J705J408J333J757K255K070J273O44M27J85r0K02J194K332
$$ 292231 294214 296162 297867 299275 300608 302365 304620 306690 307963 308607 309034 309219 309129 309331 310525 312857
53546C12857L386M619N787O055N329M662M873N505N721N524N577O204P066P666
$$ 312857 316243 320862 326649 332704 338033 342695 347568 353073 358794 364318 369895 376099 383165 390831
53532C90831P950Q386R343J0318J0290R198Q368Q907J0161J0693J0215R607R527
$$ 390831 398781 407167 416510 426828 437118 446316 454684 463591 473752 484445 494660 504267 513794
53519E13794R938J0684J1450J1506J0629R900J0444J1686J2228J2051J2308J3101
$$ 513794 523732 534416 545866 557372 568001 577901 588345 600031 612259 624310 636618 649719
53507F49719J3308J2770J2869J4317J5947J6555J6624J7251J8422J9336J9776
$$ 649719 663027 675797 688666 702983 718930 735485 752109 769360 787782 807118 826894
53496H26894K0305K1386K2947K4520K5559K5870K5811K5758K5549K4979K4528
$$ 826894 847199 868585 891532 916052 941611 967481 993292 1019050 1044599 1069578 1094106
53485A094106K4743K5201K5051K4380K3942K3625K2582K0893J9728J9552J9389
$$ 1094106 1118849 1144050 1169101 1193481 1217423 1241048 1263630 1284523 1304251 1323803 1343192
53474A343192J8395J6977J5888J5250J4944J4990J5031J4395J3104J1963J1279
$$ 1343192 1361587 1378564 1394452 1409702 1424646 1439636 1454667 1469062 1482166 1494129 1505408
53463A505408J0484R295Q112O851M762K016J92J57N42n58l150n721p426q754j0279
$$ 1505408 1515892 1525187 1533299 1540150 1544912 1546928 1547120 1547277 1547819 1547261 1544111 1538390 1530964 1522210 1511931
53448A511931j1846j2962j3358j3132j2668j2416j2535j3036j4145j5998j7929
$$ 1511931 1500085 1487123 1473765 1460633 1447965 1435549 1423014 1409978 1395833 1379835 1361906
53437A361906j8876j8730j8589j9266k0292k0869k1040k1300k1629k1648k1312
$$ 1361906 1343030 1324300 1305711 1286445 1266153 1245284 1224244 1202944 1181315 1159667 1138355
53426A138355k0848k0220j9206j7808j6229j4561j2788j0974r336q156p612p507
$$ 1138355 1117507 1097287 1078081 1060273 1044044 1029483 1016695 1005721 996385 988229 980617 973110
53414I73110p352o964o643o371n296k825J21J974K516L034M514O663Q855J0956
$$ 973110 965758 958794 952151 945780 940484 937659 937780 939754 942270 945304 949818 956481 965336 976292
53400I76292J2875J4282J5203J6204J7672J9451K1273K2992K4317K5231K6441
$$ 976292 989167 1003449 1018652 1034856 1052528 1071979 1093252 1116244 1140561 1165792 1192233
53389A192233K8606L1182L3100L4477L6343L8706M0297M0618M0740M1593M2823
$$ 1192233 1220839 1252021 1285121 1319598 1355941 1394647 1434944 1475562 1516302 1557895 1600718
53378A600718M3904M5111M6502M7284M7009M6433M6257M5964M4801M3065M1493
$$ 1600718 1644622 1689733 1736235 1783519 1830528 1876961 1923218 1969182 2013983 2057048 2098541
53367B098541M0115L8574L6909L5239L3238L0580K7352K3597J9206J4676J0936
$$ 2098541 2138656 2177230 2214139 2249378 2282616 2313196 2340548 2364145 2383351 2398027 2408963
53356B408963P852L955j480p184j1680j5286j9155k3207k6416k8628l0702l3034
$$ 2408963 2416815 2420770 2419290 2412106 2400426 2385140 2365985 2342778 2316362 2287734 2257032 2223998
53344B223998l5151l6655l7680l8359l8709l8986l9462l9891l9710l8771l7441
$$ 2223998 2188847 2152192 2114512 2076153 2037444 1998458 1958996 1919105 1879395 1840624 1803183
53333A803183l6185l5333l5028l5009l4846l4653l5089l6241l7043l6370l4340
$$ 1803183 1766998 1731665 1696637 1661628 1626782 1592129 1557040 1520799 1483756 1447386 1413046
53322A413046l2006l0143k8805k7715k6582k5222k3712k2190k0472j8354j6309
$$ 1413046 1381040 1350897 1322092 1294377 1267795 1242573 1218861 1196671 1176199 1157845 1141536
53311A141536j5184j5054j5100j4890j4917j5445j5784j5246j4052j2678j0989
$$ 1141536 1126352 1111298 1096198 1081308 1066391 1050946 1035162 1019916 1005864 993186 982197
53300I82197q710o184m024k447j340l89J056L475O176P736P884Q037R376J1461
$$ 982197 973487 967303 963279 960832 959492 959103 960159 963634 969810 977546 985430 993467 1002843 1014304
53286A014304J3368J5120J7118J9098K0642K1979K3398K4579K5375K6481K8356
$$ 1014304 1027672 1042792 1059910 1079008 1099650 1121629 1145027 1169606 1194981 1221462 1249818
53275A249818L0180L0836L0328K9377K8328K7311K6771K6818K6651K5564K3916
$$ 1249818 1279998 1310834 1341162 1370539 1398867 1426178 1452949 1479767 1506418 1531982 1555898
53264A555898K2210K0086J7193J4290J2216J0420P839M689K023pk122m420o351
$$ 1555898 1578108 1598194 1615387 1629677 1641893 1652313 1660152 1664841 1666864 1666857 1664735 1660315 1653964
53251A653964p976j0045j2762j5488j7710j9324k0183k0252k0057k0106k0124
$$ 1653964 1645988 1635943 1623181 1607693 1589983 1570659 1550476 1530224 1510167 1490061 1469937
53240A469937j9680j9139j8940j8497j7044j5220j4355j4494j4502j4097j4144
$$ 1469937 1450257 1431118 1412178 1393681 1376637 1361417 1347062 1332568 1318066 1303969 1289825
53229A289825j4825j5093j4409j3700j3908j4670j5175j5352j5472j5237j4118
$$ 1289825 1275000 1259907 1245498 1231798 1217890 1203220 1188045 1172693 1157221 1141984 1127866
53218A127866j2257j0425r224q621q173p546o967p045p935q966r487r732j0280
$$ 1127866 1115609 1105184 1095960 1087339 1079166 1071620 1064653 1057608 1049673 1040707 1031220 1021488 1011208
53205A011208j0990j1334j1560j2597j4650j6756j7939j8115j7639j6663j5297
$$ 1011208 1000218 988884 977324 964727 950077 933321 915382 897267 879628 862965 847668
53194H47668j3876j2708j1886j1506j1643j1949j1704j0653r481r152r852j0851
$$ 847668 833792 821084 809198 797692 786049 774100 762396 751743 742262 733110 723258 712407
53182G12407j1364j1306j1142j1085j0861j0361j0095j0463j0928j0688j0038
$$ 712407 701043 689737 678595 667510 656649 646288 636193 625730 614802 604114 594076
53171E94076j0089j1059j1859j1761j1454j1813j2560j2931j2887j2800j2526
$$ 594076 583987 572928 561069 549308 537854 526041 513481 500550 487663 474863 462337
53160D62337j1768j0864j0365j0123r594q770q116p839p881q257q783q869q200
$$ 462337 450569 439705 429340 419217 409623 400853 392737 384898 377017 368760 359977 351108 342908
53147C42908p256o614o151n482m669l936l224k585k305k120j187L75J048P1r67
$$ 342908 335652 329038 322887 317405 312736 308800 305576 302991 300686 298566 297379 297754 298802 298873 297906
53132B97906j43K032L457L490L398L930M246L470J862K0j844l470m367m498m519
$$ 297906 297763 299795 303252 306742 310140 314070 318316 321786 323648 323668 321824 318354 313987 309489 304970
53117C04970n042o116p390q216p960o843o121o628p568p685p106o857o960o468
$$ 304970 299928 293812 286422 278206 270246 263403 257282 250654 243086 235401 228295 221438 214478 208010
53103B08010n185m025l537l384l392l820m403m340l566k939k865k792k374k065
$$ 208010 202825 198800 195263 191879 188487 184667 180264 175924 172358 169419 166554 163762 161388 159323
53089A59323k165k258k016j730j642j493j158r72j149j405j476j417j249r30p01
$$ 159323 157158 154900 152884 151154 149512 148019 146861 145889 144740 143335 141859 140442 139193 138263 137562
53074A37562r22j408j681j751j980k213j882j048l89j85l9K02J71k60p30j047
$$ 137562 136640 135232 133551 131800 129820 127607 125725 124677 124288 124103 124064 124266 124437 124177 123447 122400
53058A22400j347j515j202n78k86n27q73j044j142j123q03l61j71r2K92Q28R92
$$ 122400 121053 119538 118336 117758 117472 116945 116072 115028 113886 112763 111960 111599 111428 111336 111628 112456 113448
53041A13448P83N76K71m52j184j198o98n59q02n90K57R07Q96O62M95J19m58p45
$$ 113448 114231 114807 115078 114626 113442 112244 111546 110987 110185 109595 109852 110759 111655 112317 112812 112931 112473 111728
53023A11728o42m55N0J267K408K011K60q35j72R63R85K24n5L08N62N05N94R52
$$ 111728 111086 110631 110681 111948 114356 116367 116627 115792 115620 116583 117568 117792 117737 118045 118607 119112 119706 120658
53005A20658J234J259J135J033J194J787K459K564K138J994K580L402L850L930
$$ 120658 121892 123151 124286 125319 126513 128300 130759 133323 135461 137455 140035 143437 147287 151217
52991A51217L818L492L161L324M036M798N447O397P612Q299Q047P384O759N783
$$ 151217 155035 158527 161688 165012 169048 173846 179293 185690 193302 201601 209648 217032 223791 229574
52977B29574M177K574J636J039N0j360k595l214l205k860k737l223l957m212l950
$$ 229574 233751 236325 237961 239000 239050 237690 235095 231881 228676 225816 223079 219856 215899 211687 207737
52962B07737l794l800l318k331j894k608l624l847l298k550j670n60K51R7q17
$$ 207737 203943 200143 196825 194494 192600 189992 186368 182521 179223 176673 175003 174443 174694 174791 173974
52947A73974j631j765j229l29M55O36J89l94o67n78j99L02M48j13q21p05J76P37
$$ 173974 172343 170578 169349 169020 169475 170111 170300 169906 169239 168661 168462 168764 169212 169099 168278 167573 167749 168486
52929A68486M99K65P69J653K293K670K877K623J881J210R53P58M36M22Q30R86
$$ 168486 168985 169250 170019 171672 173965 176635 179512 182135 184016 185226 186179 186937 187373 187795 188625 189611
52913A89611M95k1M7L71M20L53M39M47K34K51P09J020P74M34M20L61J10M53J757
$$ 189611 190106 190085 190132 190503 190923 191276 191715 192162 192396 192647 193356 194376 195150 195584 196004 196365 196475 196928 198685
52894A98685K789K220O91J7O29J192O89k95o05J01J251K059K057J362N72J62N9
$$ 198685 201474 203694 204385 204402 205031 206223 206912 206617 206012 206113 207364 209423 211480 212842 213414 213576 213635
52877B13635r4m26p68q03k30Q75J837K018J755K009K961L701L531K825K279K141
$$ 213635 213541 213115 212347 211544 211314 212189 214026 216044 217799 219808 222769 226470 230001 232826 235105 237246
52861B37246K452L369M679N747O273O459O177M877K617L92j060j907k415k488
$$ 237246 239698 243067 247746 253493 259766 266225 272402 277279 279896 280288 279228 277321 274906 272418
52847B72418k397k840l762m174l742l398l764m135l821l282l097k929k464k187
$$ 272418 270021 267181 263419 259245 255503 252105 248341 244206 240385 237103 234006 231077 228613 226426
52833B26426k265j878q52o83k496m962n816m682k955j591o65m89j445k900l649
$$ 226426 224161 222283 221431 220748 218252 213290 207474 202792 199837 198246 197581 197092 195647 192747 189098
52818A89098l425k824k073j048k24k85r12j120p42n41r59j694k371k785k635j859
$$ 189098 185673 182849 180776 179728 179504 179219 178307 177187 176445 175904 174945 173251 170880 168095 165460 163601
52802A63601j056p80p48m54r0j13l54m74p23j309j583r92k40l75j121j412j130
$$ 163601 162545 161765 161017 160563 160473 160360 160006 159532 158809 157500 155917 154925 154685 154310 153189 151777 150647
52785A50647j055j339j419j291j559k218k532k225j791j559j361j120r91r33q76
$$ 150647 149592 148253 146834 145543 143984 141766 139234 137009 135218 133659 132298 131178 130187 129254 128378
52770A28378j093j679k022j572p17j28K26N49L46p30j819j889j359j380j928k087
$$ 128378 127285 125606 123584 122012 121295 121167 121393 121942 122288 121558 119739 117850 116491 115111 113183 111096
52754A11096j753j567j432p43L9k93j673k641k478j958j771j602j211j023j185
$$ 111096 109343 107776 106344 105601 105640 105347 103674 101033 98555 96597 94826 93224 92013 90990 89805
52739H9805j178q37o43o56k55O71J292J038L59r4j60J57Q45J496J571J281J320
$$ 89805 88627 87790 87147 86491 86236 86907 88199 89237 89596 89502 89342 89499 90344 91840 93411 94692 96012
52722I6012J693J773J595J844K450K383J333M74R53K498M097N206N783N749N032
$$ 96012 97705 99478 101073 102917 105367 107750 109083 109557 110510 113008 117105 122311 128094 133843 138875
52707A38875L740J993lj720k630k797k674k465k324k752l883m679l988k317j347
$$ 138875 142615 144608 144605 142885 140255 137458 134784 132319 129995 127243 123360 118681 114693 112376 111029
52692A11029j709k405k547k398k410k415k218k003j795j394j032j176j544j372
$$ 111029 109320 106915 104368 101970 99560 97145 94927 92924 91129 89735 88703 87527 85983 84611
52678H4611p83p12j316j663j328j044j287j470j120p24p47q75q29j025j685k200
$$ 84611 83828 83116 81800 80137 78809 77765 76478 75008 73888 73164 72417 71542 70713 69688 68003 65803
52662F5803j954j136k06O22J030N70m74j056o75N4N83J150J866K062J279J20o31
$$ 65803 63849 62713 62507 63129 64159 64729 64255 63199 62524 62578 63161 64311 66177 68239 69518 69638 69007
52645F9007j009j362j541j242o22j2M90P61O25L47N65J354K103K516K855K968
$$ 69007 67998 66636 65095 63853 63231 63219 63709 64470 65095 65442 66007 67361 69464 71980 74835 77803
52629G7803K086J33j775k639k558j986j067k35l34j367k111j758j030q73r82n82
$$ 77803 79889 80022 78247 75608 73050 71064 69997 69762 69428 68061 65950 64192 63162 62289 61307 60725
52613F0725K08P95J192J678J967J654R48J90p74j859k121r21Q49J763J672J421
$$ 60725 60933 61728 62920 64598 66565 68219 69167 69357 68583 66724 64603 63682 64531 66294 67966 69387
52597F9387J256O41m17j077q17lP82J250J204N45l32p27m17J24L66L46M73R46
$$ 69387 70643 71284 70867 69790 68973 68970 69752 71002 72206 72751 72419 71692 71275 71399 71765 72111 72584 73530
52579G3530J370J103R8o71j46J461K777K892K234J672J457J447J650J999K131
$$ 73530 74900 76003 76101 75430 75284 76745 79522 82414 84648 86320 87777 89224 90874 92873 95004
52564I5004J937J880K270K633K327J399M44m7R9O93J044M69o70j049K1J622K365
$$ 95004 96941 98821 101091 103724 106051 107450 107894 107847 107946 108639 109683 110152 109482 108433 108454 110076 112441
52547A12441K015J381J118J219J363J163M25m12m32P29K336L324L277K384J050
$$ 112441 114456 115837 116955 118174 119537 120700 121125 120713 120281 121010 123346 126670 129947 132331 133381
52532A33381o3k06P40K061L000L342L049K134J163J025J696K100J699J284J516
$$ 133381 133318 133112 133852 135913 138913 142255 145304 147438 148601 149626 151322 153422 155121 156405 157921
52517A57921J694R43j93n11J34Q77J217J275J037L90l43p19q45j012j030p14n34
$$ 157921 159615 160558 160365 159854 159988 160865 162082 163357 164394 164784 164441 163722 162877 161865 160835 160121 159587
52500A59587r45j469j422j108j229j470q97L97J286J264R32O94J83p49j493j656
$$ 159587 158642 157173 155751 154643 153414 151944 151047 151444 152730 153994 154926 155620 155803 155054 153561 151905
52484A51905j648j790j678r86k58k31p51j011o05J56Q42J275J369J055N33L03
$$ 151905 150257 148467 146789 145803 145545 145314 144563 143552 142947 143103 143945 145220 146589 147644 148177 148480
52468A48480P09J485J973J810J224O55K89J82M73J099J517J296Q35R11J481J674
$$ 148480 149189 150674 152647 154457 155681 156336 156625 156807 157280 158379 159896 161192 162027 162938 164419 166093
52452A66093J071K76n9m2J2J87N34O74M07K48O74J320J484J122P26N37M55M58
$$ 166093 167164 167440 167381 167339 167351 167538 168072 168746 169153 169401 170075 171395 172879 174001 174727 175264 175719 176177
52434A76177N56N36K78Q8K90O71P95O55O13Q05J047J130R69O48N07R30J813K628
$$ 176177 176733 177269 177547 177635 177925 178596 179391 180046 180659 181464 182511 183641 184610 185258 185765 186695 188508 191136
52416A91136L150L639M111M098L458K804K612K460J781Q02J44j43n31j306k472
$$ 191136 194286 197925 202036 206134 209592 212396 215008 217468 219249 220051 220195 220052 219521 218215 215743
52401B15743l902n129n425m667l803l815m610n316n357m678l448k147j485j625
$$ 215743 211841 206712 201287 196620 192817 189002 184392 179076 173719 169041 165593 163446 161961 160336
52387A60336j865j608j183j102j104p06j97j99n85p05m24j28Q3L85O36N24K73
$$ 160336 158471 156863 155680 154578 153474 152768 152571 152372 151787 151082 150658 150530 150613 150998 151634 152158 152431
52370A52431M88J283K087K287J647L85p07o23Q05K519L315L079K427J754J251
$$ 152431 152919 154202 156289 158576 160223 160608 159901 159278 160083 162602 165917 168996 171423 173177 174428
52355A74428J302K016K761K946K865K985K965K324J669J947K810K927J967J119
$$ 174428 175730 177746 180507 183453 186318 189303 192268 194592 196261 198208 201018 203945 205912 207031
52341B07031J390K394L181L443L524L719L962L917L353K611K433L020L592L411
$$ 207031 208421 210815 213996 217439 220963 224682 228644 232561 235914 238525 240958 243978 247570 250981
52327B50981K766K408K420K439K529K934L347L331L212L554M080M063L687L844
$$ 250981 253747 256155 258575 261014 263543 266477 269824 273155 276367 279921 284001 288064 291751 295595
52313B95595M673N410N691N937O354O640O870P572Q679R402R515R707J0305J0639
$$ 295595 300268 305678 311369 317306 323660 330300 337170 344742 353421 362823 372338 382045 392350 402989
52299D02989J0240R843J0425J1841J3078J3460J3141J2656J2459J2722J3273J3818
$$ 402989 413229 423072 433497 445338 458416 471876 485017 497673 510132 522854 536127 549945
52287E49945J4222J4425J4222J3584J3014J3116J3750J4231J4264J4163J4108
$$ 549945 564167 578592 592814 606398 619412 632528 646278 660509 674773 688936 703044
52276G03044J3857J3314J2772J2441J2140J1664J1045J0405R906R766R939R966
$$ 703044 716901 730215 742987 755428 767568 779232 790277 800682 810588 820354 830293 840259
52264H40259R589R233R279R179Q173O703O065O609P317P359P111P185P393P245
$$ 840259 849848 859081 868360 877539 885712 892415 898480 905089 912406 919765 926876 934061 941454 948699
52250I48699O778O331N936N476N013M579L962L108K435K326K584K746K730K859
$$ 948699 955477 961808 967744 973220 978233 982812 986774 989882 992317 994643 997227 999973 1002703 1005562
52236A005562L349M127N112O444Q235J0151J1429J1621J1180J1020J1490J2197
$$ 1005562 1008911 1013038 1018150 1024594 1032829 1042980 1054409 1066030 1077210 1088230 1099720 1111917
52224A111917J2864J3568J3987J3310J1527J0013R891J0453J0193Q960P939P776
$$ 1111917 1124781 1138349 1152336 1165646 1177173 1187186 1197077 1207530 1217723 1226683 1234622 1242398
52212A242398P841P390O375N040L643K721K742L265L194K030K43j633l385m562
$$ 1242398 1250239 1257629 1264004 1269044 1272687 1275408 1278150 1281415 1284609 1286639 1286882 1285249 1281864 1277302
52198A277302m510l385k367k349k964l301l177l175l734m524m722l857k363j161
$$ 1277302 1272792 1269407 1267040 1264691 1261727 1258426 1255249 1252074 1248340 1243816 1239094 1235237 1232874 1231713
52184A231713o22k60K61M38k29j252j728j616j640k195l033l809m255m060l355
$$ 1231713 1231091 1230831 1231092 1231530 1231301 1230049 1228321 1226705 1225065 1222870 1219837 1216028 1211773 1207713 1204358
52169A204358k924l236l608l263k729l094m222m924m823m708n083n543n773n947
$$ 1204358 1201434 1198198 1194590 1191327 1188598 1185504 1181282 1176358 1171535 1166827 1161744 1156201 1150428 1144481
52155A144481n983n475m673m413m806m938m245l237k622k477k548k621k437j950
$$ 1144481 1138498 1133023 1128350 1123937 1119131 1114193 1109948 1106711 1104089 1101612 1099064 1096443 1094006 1092056
52141A092056j733k307l088l001k046j281j279j666k208l143m270m932n145n649
$$ 1092056 1090323 1088016 1084928 1081927 1079881 1078600 1077321 1075655 1073447 1070304 1066034 1061102 1055957 1050308
$$ [...]
##END NTUPLES=NMR SPECTRUM
##END=
