
##TITLE=AC1289_SALAH11099_6534879_mr8djbPAXF
##JCAMPDX= 6.0         $$ Bruker NMR JCAMP-DX V2.0
##DATA TYPE= NMR SPECTRUM
##DATA CLASS= NTUPLES
##ORIGIN= BRUKER
##OWNER= Administrator
$$ 1.72 TOPSPIN		Version 2.1
$$ 2012-07-16 21:38:55.593 -0500  Administrator@TOPSPIN
$$ Compression mode = diff/dup
##.OBSERVE FREQUENCY= 400.02188249412
##.OBSERVE NUCLEUS= ^1H
##.ACQUISITION MODE= SIMULTANEOUS (DQD)
##.ACQUISITION SCHEME= undefined
##.AVERAGES= 64
##.DIGITISER RES= 22
##SPECTROMETER/DATA SYSTEM= spect
##.PULSE SEQUENCE= noesygpps1d.comp
##.SOLVENT NAME= COFFEE_meoh
##.SHIFT REFERENCE= INTERNAL, COFFEE_meoh, 1, 14.96066
##AUDIT TRAIL= $$ (NUMBER, WHEN, WHO, WHERE, PROCESS, VERSION, WHAT)
$$ ##TITLE= Audit trail, TOPSPIN		Version 2.1
$$ ##JCAMPDX= 5.01
$$ ##ORIGIN= Bruker BioSpin GmbH
$$ ##OWNER= Administrator
$$ $$ C:\Bruker\TOPSPIN/data/COFFEE/nmr/AC1289_SALAH11099_6534879_mr8djbPAXF/22/pdata/1/auditp.txt
$$ ##AUDIT TRAIL=  $$ (NUMBER, WHEN, WHO, WHERE, PROCESS, VERSION, WHAT)
(   1,<2012-07-16 21:38:50.625 -0500>,<Administrator>,<TOPSPIN>,<go>,<TOPSPIN 2.1>,
      <created by zg
	started at 2012-07-16 21:27:20.421 -0500,
	POWCHK enabled, PULCHK disabled,
       configuration hash MD5:
       6B 1B 68 BB D9 2E 58 E2 7F 35 AD 54 07 DF 0E 41
       data hash MD5: 64K
       02 58 30 28 98 F1 0F DB 90 4F 56 C0 80 E7 A3 E1>)
(   2,<2012-07-16 21:38:53.468 -0500>,<Administrator>,<TOPSPIN>,<proc1d>,<TOPSPIN 2.1>,
      <Start of raw data processing
       efp LB = 0.3 FT_mod = 6 PKNL = 1 PHC0 = 0 PHC1 = 0 SI = 128K 
       data hash MD5: 128K
       0F 06 D5 F3 49 85 DF 3E 90 26 00 0D A6 77 A4 AB>)
(   3,<2012-07-16 21:38:54.609 -0500>,<Administrator>,<TOPSPIN>,<proc1d>,<TOPSPIN 2.1>,
      <pk PHC0 = -0.3076172 PHC1 = 0 
       data hash MD5: 128K
       EB 0F CC A1 1F BA B2 D2 47 92 8B 94 CD B2 31 AB>)
(   4,<2012-07-16 21:38:55.234 -0500>,<Administrator>,<TOPSPIN>,<proc1d>,<TOPSPIN 2.1>,
      <abs ABSG = 1 
       data hash MD5: 128K
       2D CF 00 FC 49 00 8B CC 70 AC B9 8B 6F BE 07 AE>)
(   5,<2012-07-16 21:38:55.312 -0500>,<Administrator>,<TOPSPIN>,<proc1d>,<TOPSPIN 2.1>,
      <abs ABSG = 2 
       data hash MD5: 128K
       B2 F7 79 8D 87 D0 89 A1 52 DD 95 BF 7C DB DB EC>)
(   6,<2012-07-16 21:38:55.359 -0500>,<Administrator>,<TOPSPIN>,<proc1d>,<TOPSPIN 2.1>,
      <abs ABSG = 3 
       data hash MD5: 128K
       A5 6F 91 6B 06 BD AB EC B6 96 BF BB C6 AF 9C 38>)
(   7,<2012-07-16 21:38:55.421 -0500>,<Administrator>,<TOPSPIN>,<proc1d>,<TOPSPIN 2.1>,
      <abs ABSG = 4 
       data hash MD5: 128K
       E2 E3 52 38 01 D2 DC 57 38 F7 8C E1 97 74 6D 39>)
(   8,<2012-07-16 21:38:55.500 -0500>,<Administrator>,<TOPSPIN>,<proc1d>,<TOPSPIN 2.1>,
      <abs ABSG = 5 
       data hash MD5: 128K
       BC E4 6A 86 02 5B 35 08 1F 96 19 98 81 14 B6 26>)
$$ ##END=
$$ 
$$ $$ hash MD5
$$ $$ 9C 79 A8 20 6F 5F B6 61 77 BF 1D DA 25 82 B3 D6
##$RELAX= 
##$RELAX= 
##$RELAX= 
##$RELAX= 
##$RELAX= 
##$RELAX= 
##$RELAX= 
##$RELAX= 
$$ Bruker specific parameters
$$ [...]
##$TP07= 0
##$TPNAME0= <>
##$TPNAME1= <>
##$TPNAME2= <>
##$TPNAME3= <>
##$TPNAME4= <>
##$TPNAME5= <>
##$TPNAME6= <>
##$TPNAME7= <>
##$TPOAL= (0..7)
0.5 0.5 0.5 0.5 0.5 0.5 0.5 0.5
##$TPOFFS= (0..7)
0 0 0 0 0 0 0 0
##$TUNHIN= 0
##$TUNHOUT= 0
##$TUNXOUT= 0
##$USERA1= <user>
##$USERA2= <user>
##$USERA3= <user>
##$USERA4= <user>
##$USERA5= <user>
##$V9= 5
##$VALIST= <valist>
##$VCLIST= <CCCCCCCCCCCCCCC>
##$VD= 0
##$VDLIST= <DDDDDDDDDDDDDDD>
##$VPLIST= <PPPPPPPPPPPPPPP>
##$VTLIST= <TTTTTTTTTTTTTTT>
##$WBST= 2048
##$WBSW= 25
##$XGAIN= (0..3)
0 0 0 0
##$XL= 0
##$YL= 0
##$YMAX_a= 11801297
##$YMIN_a= -9440841
##$ZGOPTNS= <>
##$ZL1= 120
##$ZL2= 120
##$ZL3= 120
##$ZL4= 120
##$ABSF1= 14.96066
##$ABSF2= -5.597522
##$ABSG= 5
##$ABSL= 3
##$ALPHA= 0
##$AQORDER= 0
##$ASSFAC= 0
##$ASSFACI= 0
##$ASSFACX= 0
##$ASSWID= 0
##$AUNMP= <proc_prof1d_extract.lims>
##$AXLEFT= 0
##$AXNAME= <>
##$AXNUC= <1H>
##$AXRIGHT= 0
##$AXTYPE= 0
##$AXUNIT= <>
##$AZFE= 0.1
##$AZFW= 0.1
##$BCFW= 0
##$BC_mod= 0
##$BYTORDP= 0
##$COROFFS= 0
##$CY= 15
##$DATMOD= 1
##$DC= 0
##$DFILT= <>
##$DTYPP= 0
##$F1P= 0
##$F2P= 0
##$FCOR= 0.5
##$FTSIZE= 131072
##$FT_mod= 6
##$GAMMA= 0
##$GB= 0
##$INTBC= 1
##$INTSCL= 1
##$ISEN= 128
##$LB= 0.3
##$LEV0= 0
##$LPBIN= 0
##$MAXI= 10000
##$MC2= 0
##$MEAN= 0
##$ME_mod= 0
##$MI= 0
##$NCOEF= 0
##$NC_proc= -2
##$NLEV= 6
##$NOISF1= 0
##$NOISF2= 0
##$NSP= 0
##$NTH_PI= 0
##$NZP= 0
##$OFFSET= 14.96066
##$PC= 1
##$PHC0= -0.3076172
##$PHC1= 0
##$PH_mod= 1
##$PKNL= yes
##$PPARMOD= 0
##$PPDIAG= 0
##$PPIPTYP= 0
##$PPMPNUM= 2147483647
##$PPRESOL= 1
##$PSCAL= 4
##$PSIGN= 0
##$PYNMP= <proc.py>
##$REVERSE= no
##$SF= 400.020009771531
##$SI= 131072
##$SIGF1= 0
##$SIGF2= 0
##$SINO= 400
##$SIOLD= 131072
##$SPECTYP= <>
##$SREGLST= <1H.CDCl3>
##$SSB= 0
##$STSI= 131072
##$STSR= 0
##$SW_p= 8223.68421052631
##$SYMM= 0
##$S_DEV= 0
##$TDeff= 65536
##$TDoff= 0
##$TI= <>
##$TILT= no
##$TM1= 0
##$TM2= 0
##$TOPLEV= 0
##$USERP1= <user>
##$USERP2= <user>
##$USERP3= <user>
##$USERP4= <user>
##$USERP5= <user>
##$WDW= 1
##$XDIM= 131072
##$YMAX_p= 442608174
##$YMIN_p= -11986
##$CURPLOT= <Network HP LaserJet P1505>
##$CURPRIN= <$Network HP LaserJet P1505>
##$DFORMAT= <normdp>
##$LAYOUT= <+/1D_H.xwp>
##$LFORMAT= <normlp>
##$PFORMAT= <normpl>
##$SURQMSG= 1
$$ End of Bruker specific parameters
$$ ---------------------------------
##NTUPLES= NMR SPECTRUM
##VAR_NAME=  FREQUENCY,     SPECTRUM/REAL,   SPECTRUM/IMAG
##SYMBOL=    X,             R,               I
##VAR_TYPE=  INDEPENDENT,   DEPENDENT,       DEPENDENT
##VAR_FORM=  AFFN,          ASDF,            ASDF
##VAR_DIM=   131072,        131072,          131072
##UNITS=     HZ,            ARBITRARY UNITS, ARBITRARY UNITS
##FACTOR=    0.0627417313425164, 1,          1
##FIRST=     8223.62146879497, 4264,         -62379
##LAST=      0,             5502,            -61512
##MIN=       0,             -11986,          0
##MAX=       8223.62146879497, 442608174,    0
$$ Real data points
##PAGE= N=1
##DATA TABLE= (X++(R..R)), XYDATA
$$ [...]
63913B972626k11362k06785k00213j91813j81398j68484j53207j36791j20702
63904A401871j05623r1479p8272o6450n6450m8117m0759l3821k7434k2250j8698
63893H12518j6496j4949j3547j2169j0927j0074r889j0309j0719j0422r312p778
63881F75927o053m042j742O74L322O653J0729J4838J8214K0921K3672K6885L0349
63868H20347L3620L6499L8995M1176M3078M4612M5534M5615M4816M3182M0629
63857A278103L7084L2761K8062K3177J8002J2548P132J955l308r066j4999k0102
63845A391349k3737k6430k9253l2627l6131l9463m2966m6868n0477n2631n2913
63834I57853n1940n0490m8745m6529m3836m0818l7544l4107l0834k8092k5855
$$ plain form
63913 2972626 2761264 2554479 2354266 2162453 1981055 1812571 1659364 1522573 1401871
63904 1401871 1296248 1204769 1126497 1060047 1003597 955480 914721 880900 853466 831216 812518
63893 812518 796022 781073 767526 755357 744430 734356 724467 714158 703439 693017 683705 675927
63881 675927 669874 665832 664090 664764 668086 674739 685468 700306 718520 739441 763113 789998 820347
63868 820347 853967 890466 929461 970637 1013715 1058327 1103861 1149476 1194292 1237474 1278103
63857 1278103 1315187 1347948 1376010 1399187 1417189 1429737 1436869 1438824 1435516 1426450 1411451 1391349
63845 1391349 1367612 1341182 1311929 1279302 1243171 1203708 1160742 1113874 1063397 1010766 957853
63834 957853 905913 855423 806678 760149 716313 675495 637951 603844 573010 544918 519063
63823E19063k3763k1672j9928j8875j8199j7077j5076j2756j1109j0405r874q642
63811C31687o808n329m930n349n698n406m727m358m603m944m571l320j936j296
63797B68412j593k349l018l275k994k297j579j240j312j577j902k212k316k121
63783B38627j942k201k751k929k364j413o70l88m53o07n77k32J90K89M1j38LK18
63765B22703J73j45n49r18j059p15K7N92N19M6k61k84m00q62j435j640j230l80
63747B14182M60R78J276J569J644J029o0n53K55J627K159J493O64O78J449K234
63731B31084K612K646K509K374K446K755L050L176L372L891M492M724M613M600
63717B78344M774M642L882K889K188J673R13l3o45q47j202k081l103l681l696
$$ plain form
63823 519063 495300 473628 453700 434825 416626 399549 384473 371717 360608 350203 340329 331687
63811 331687 324879 319550 314620 309271 303573 298167 293440 289082 284479 279535 274964 271644 269708 268412
63797 268412 266819 264470 261452 258177 255183 252886 251307 250067 248755 247178 245276 243064 240748 238627
63783 238627 236685 234484 231733 228804 226440 225027 224357 223969 223516 222909 222332 222100 222290 222579 222620 222482 222485 222703
63765 222703 222876 222731 222182 221264 220205 219490 219517 220109 220628 220674 220413 220129 219729 218867 217432 215792 214562 214182
63747 214182 214642 215620 216896 218465 220109 221138 221078 220525 220780 222407 224566 226059 226723 227401 228850 231084
63731 231084 233696 236342 238851 241225 243671 246426 249476 252652 256024 259915 264407 269131 273744 278344
63717 278344 283118 287760 291642 294531 296719 298392 299305 299272 298627 297780 296578 294497 291394 287713 284017
63702B84017l328k636j703q63l51j3K70K56l8J38J369K973L729L533L412L794
63686B94559L979L555L240L605L916L228J945J249J345J328O84p1l71l83n00o04
63670C20704k35Q07K125K905K464J041j63j69N67P27j37j096j314j276k016l580
63654C21354m965n390n051m533m026l374k630k139k134k401k518k273j755j083
63640B77082k10Q96K008K776L097L276L669M269M673M520L955L526L621M096M673
63625C25927N496O938Q800J0126J0073Q777P229O512P283R552J2561J5090J6392
63612D50756J6872J7549J8914K0595K2118K3570K5414K7929L0919L3714L5351
63601G23701L5010L2425K7829K1579J4072O151p86n417p389p451o720n882n147
$$ plain form
63702 284017 280689 278053 276350 275487 275136 275123 275393 275649 275611 275749 277118 280091 283820 287353 290765 294559
63686 294559 298538 302093 305333 308938 312854 316082 318027 319276 320621 321949 322633 322562 322191 321808 321308 320704
63670 320704 320469 321276 323401 326306 328770 329811 329648 329479 330046 330773 330636 329540 328226 326950 324934 321354
63654 321354 316389 310999 305948 301415 297389 294015 291385 289246 287112 284711 282193 279920 278165 277082
63640 277082 276872 277768 279776 282552 285649 288925 292594 296863 301536 306056 310011 313537 317158 321254 325927
63625 325927 331423 338361 347161 357287 367360 376137 383366 389878 397161 406713 419274 434364 450756
63612 450756 467628 485177 504091 524686 546804 570374 595788 623717 654636 688350 723701
63601 723701 758711 791136 818965 840544 854616 860767 859981 854564 847175 839724 833004 827122 821975
63588H21975m825n613q049j1819j5913j9563k2736k5591k7814k8791k8269k6555
63576E96437k4122k1281j8235j5195j2389j0037q211o675m957k804m27J728L376
63563D77208M467N169N889P001Q269Q848Q298P315P080Q006R580J1312J3223J5381
63549E97046J7600J9871K2695K6668L1927L8210M5073N1549N5614N4505M6355
63538A007113L1965J5030J14j0043j5489j7669j7641j5800j2673r181o161m102
63526I45463l402m504p675j2825j9435k6426l2405l6462l8674l9468l8827l6675
63514F48685l3762l1229k9235k6860k3623k0284j7780j6022j4327j2521j1005
63503D12037j0029r471r145q845q265p205n848m534l426k576k098j987j946j712
$$ plain form
63588 821975 817150 811537 803488 791669 775756 756193 733457 707866 680052 651261 622992 596437
63576 596437 572315 551034 532799 517604 505215 495178 486967 480292 475335 472531 472104 473832 477208
63563 477208 481675 486844 492733 499734 508003 516851 525149 532464 539544 547550 557130 568442 581665 597046
63549 597046 614646 634517 657212 683880 715807 754017 799090 850639 906253 960758 1007113
63538 1007113 1039078 1054108 1054222 1044179 1028690 1011021 993380 977580 964907 955726 949565 945463
63526 945463 942061 937557 929882 917057 897622 871196 838791 802329 763655 724187 685360 648685
63514 648685 614923 583694 554459 527599 503976 483692 465912 449890 435563 423042 412037
63503 412037 402008 392537 383392 374547 366282 359077 353229 348695 345269 342693 340595 338608 336662 334950
63489C34950j382j138q93m84k1L65Q69J703K561K903K766K813L466M344M769M540
63473C62131M043L747L808L934L525K086k37k598m096m557m534m551m533m162
63459C54006l543l188l311l474l135k237j108m7P34J023R16R89J720K834L742
63444C45921M426N322O382P081P489Q471J0427J2558J4063J5449J7996K2301K8045
63431E05931L4619M0869M4354M2311L4164K2586J1510L311j815m406m589k395
63419G26450J550O233J1077J6254K2086K8263L3853L7987M0405M1195M0117L6383
63407A041853K9332J9403Q425j246q114j2098j3821j3582j1528q588o575o959
63395A016502r828j4327j9684k5381l0739l4999l7855l9377l9459l7920l5190
$$ plain form
63489 334950 333568 332430 331537 331053 331032 331397 332266 333969 336530 339433 342199 345012 348478 352822 357591 362131
63473 362131 366174 369921 373729 377663 381188 383274 383037 380439 376343 371786 367252 362701 358168 354006
63459 354006 350463 347275 343964 340490 337355 335118 334010 333963 334697 335720 336636 337625 339345 342179 345921
63444 345921 350347 355669 362051 369132 376621 385092 395519 408077 422140 437589 455585 477886 505931
63431 505931 540550 581419 625773 668084 702248 724834 736344 739655 737840 733434 728845 726450
63419 726450 728000 734233 745310 761564 783650 811913 845766 883753 924158 965353 1005470 1041853
63407 1041853 1071185 1090588 1099013 1097767 1089653 1077555 1063734 1050152 1038624 1030036 1023461 1016502
63395 1016502 1006674 992347 972663 947282 916543 881544 843689 804312 764853 726933 691743
63384F91743l2320k9969k7790k5076k1711j8186j4998j2418j0496q898o899m081
63372D78901r91J400K859M100N761P705R515J1199J2973J4748J6316J7853J9712
63359F02051K1861K4009K6235K8936L2068L4951L7105L8783M0316M1253M0550
63348I68118L7465L2006K4693J6287P695j57o477j0666j2456j2194j0772r091
63336A024451p752p422q962j2821j8463k4826l1043l6268l9344l9536l7623l5329
63324G25062l3387l0883k6852k1813j6957j2274o456R01P442R151L824o467j6701
63311E74590k2945k4921k4662k3556k1488j8396j5195j2801j1143r686q375p486
63299C73936p007o599n963m955l734k945l185m055m344l613k909l268m119m057
$$ plain form
63384 691743 659423 629454 601664 576588 554877 536691 521693 509275 498779 489881 482982 478901
63372 478901 477910 479310 482169 486269 492030 499735 509250 520449 533422 548170 564486 582339 602051
63359 602051 623912 647921 674156 703092 735160 770111 807216 845999 886315 927568 968118
63348 968118 1005583 1037589 1062282 1078569 1086264 1086107 1079630 1068964 1056508 1044314 1033542 1024451
63336 1024451 1016699 1009277 1000315 987494 969031 944205 913162 876894 837550 798014 760391 725062
63324 725062 691675 660792 633940 612127 595170 582896 576440 577341 584783 593934 597758 591291 574590
63311 574590 551645 526724 502062 478506 457018 438622 423427 410626 399483 389797 381422 373936
63299 373936 366929 360330 354367 349412 345678 342733 339548 335493 331149 327536 324627 321359 317240 313183
63285C13183k780j370p65q30j016j122j143j018p86o17m66r4M05N55J72k52j67
63268C01889L33P33P82O87O84P79R94J493K273K859K733K087J721K026K501K668
63252C27242K982M089N458N800M911M100M383N254N794O090O711P511Q030Q579
63238D06934R873J1730J3213J3940J4399J4947J5432J5861J6582J7597J8462J9007
63226E87977J9467J9788J9627J9120J8856J8865J8615J8273J8945K1015K3204
63215H03752K4010K3381K2122K0376J7694J4158J0333O219J302m352r887j4713
63203I14395j8961k2712k5472k6757k6669k5556k3568k0867j7962j5319j2830
63192F77722r889o032j322L669Q150J1564J4059J6391J9186K2290K5035K7011
$$ plain form
63285 313183 310403 309033 308268 307438 306422 305300 304157 303139 302353 301736 301270 301176 301581 302136 302308 302056 301889
63268 301889 302222 302955 303737 304424 305108 305887 306881 308374 310647 313506 316239 318326 320047 322073 324574 327242
63252 327242 330224 334313 339771 345571 350482 354582 358965 364219 370013 376103 382814 390325 398355 406934
63238 406934 416807 428537 441750 455690 470089 485036 500468 516329 532911 550508 568970 587977
63226 587977 607444 627232 646859 665979 684835 703700 722315 740588 759533 780548 803752
63215 803752 827762 851143 873265 893641 911335 925493 935826 942045 943347 938995 929108 914395
63203 914395 895434 872722 847250 820493 793824 768268 744700 723833 705871 690552 677722
63192 677722 667833 661801 660479 664148 672298 683862 697921 714312 733498 755788 780823 807834
63180H07834K8428K9706L0951L1920L2426L2577L2583L2420L1905L1122L0495
63169A152367L0274L0038K8964K6506K2567J7125J0164K093o256j4353k2364l0484
63157A246641l8206m4677m9552n2918n4586n4179n2068m9373m6733m3616l9463
63146G21270l4849l0861k7683k4584k1205j8057j5672j3980j2689j1626j0418
63135D99646q534o076m079l442l823m045l404k186j002j30M49P87R00R16J106
63120D67083J739K808L901M526M608M475M360M233M105M155M319M182L511K665
63106E20670K154K051K091K048J773J140L25j36nK43M3m44o50n00l62k26L80J440
63088E32035K073J488L4j109j167m37K04K56l8j17K81J019J921K918L849M481
$$ plain form
63180 807834 836262 865968 896919 928839 961265 993842 1026425 1058845 1090750 1121872 1152367
63169 1152367 1182641 1212679 1241643 1268149 1290716 1307841 1318005 1320098 1313842 1299489 1277125 1246641
63157 1246641 1208435 1163758 1114206 1061288 1006702 952523 900455 851082 804349 760733 721270
63146 721270 686421 655560 627877 603293 582088 564031 548359 534379 521690 510064 499646
63135 499646 491112 485036 480957 477515 473692 469647 466243 464057 463055 462925 463374 464161 465061 465977 467083
63120 467083 468822 471630 475531 480057 484665 489140 493500 497733 501838 505993 510312 514494 518005 520670
63106 520670 522824 524875 526966 529014 530787 531927 532252 532116 532111 532354 532397 531953 531303 530803 530441 530215 530595 532035
63088 532035 534108 535596 535630 534521 533354 532917 533121 533377 533339 533222 533503 534522 536443 539361 543210 547691
63072E47691M900N553O696P987Q888R265R433R788J0567J1690J2782J3580J4448
63059F73268J6021J8234K0246K1646K3068K5204K7834L0445L3119L6013L8564
63048I63662M0224M1605M3711M6258M7892M8132M7962M8284M8809M8898M8687
63037A474124M8823M9680N1116N2574N3268N2859N1860N0674M8282M3010L4731
63026B011001K5170J5522N047p135k0035l1703m1420m9711n6579o1073o2625o1745
63014A664714n9236n5388n0155m3560l5802k7381j9155j1689m643K790J0798J8807
63002A390100K6380L3605M0435M6297N0757N4117N6895N8966N9745N9207N8306
62991A934810N8168N9100O0493O1543O1740O0812N8513N4678M9160M1585L1402
$$ plain form
63072 547691 552591 558144 564840 572827 581715 590980 600413 610201 620768 632458 645240 658820 673268
63059 673268 689289 707523 727769 749415 772483 797687 825521 855966 889085 925098 963662
63048 963662 1003886 1045491 1089202 1135460 1183352 1231484 1279446 1327730 1376539 1425437 1474124
63037 1474124 1522947 1572627 1623743 1676317 1729585 1782444 1834304 1884978 1933260 1976270 2011001
63026 2011001 2036171 2051693 2056740 2049605 2029570 1997867 1956447 1906736 1850157 1789084 1726459 1664714
63014 1664714 1605478 1550090 1499935 1456375 1420573 1393192 1374037 1362348 1357705 1360495 1371293 1390100
63002 1390100 1416480 1450085 1490520 1536817 1587574 1641691 1698586 1757552 1817297 1876504 1934810
62991 1934810 1992978 2052078 2112571 2174114 2235854 2296666 2355179 2409857 2459017 2500602 2532004
62980B532004J8536L756j1857k7717m3641n9156p3343q5325r4501j00446j03160
62969A955150j03390j02080r9346r4549q7546p9349p1278o3977n7503n1794m6626
62958A097712m1649l6920l3108l0673k9165k7732k6100k4587k3411k2434k1465
62947G80468k0488j9516j8600j7889j7496j7360j7268j6904j5902j4144j2118
62936E92783j0590r819r391q924q449p941p081n836m750m235l968l394k509j682
62922E04214j064o15m05l99k60J54L74q6r68j581j685j550j357j068q13r02j388
62905D90601k066k794l571m294m746m791m352l443k361j526r92m03K53M01j70
62890D55746o80l29N51J007Q32O44P45P90N73M20O18J038J481J884K140K108J906
$$ plain form
62980 2532004 2550540 2554296 2542439 2514722 2471081 2411925 2338582 2253257 2158756 2058310 1955150
62969 1955150 1851760 1749680 1650334 1555785 1468239 1388890 1317612 1253635 1196132 1144338 1097712
62958 1097712 1056063 1019143 986035 955362 926197 898465 872365 847778 824367 801933 780468
62947 780468 759980 740464 721864 703975 686479 669119 651851 634947 619045 604901 592783
62936 592783 582193 572374 562983 554059 545610 537669 530588 524752 520002 515767 511799 508405 505896 504214
62922 504214 503150 502535 502130 501731 501471 501625 501999 501913 500945 499364 497679 496129 494772 493704 492891 491989 490601
62905 490601 488535 485741 482170 477876 473130 468339 463987 460544 458183 456657 455665 455262 455515 455916 455746
62890 455746 455066 454737 455288 456295 457127 457771 458516 459306 459879 460299 460917 461955 463436 465320 467460 469568 471474
62873D71474J780J612J036L8r72j741k395k965l183k932k548k456k656k725k297
62858D49070j485q03n39k59O31J841K338J786J120J172J465J140M33K26N03M47
62842D59086j50o10n98n74q74j236j482j749j860j317k69L74J59k92k69J24M58
62825D48921O74Q20P20M54N99J460K467K843K508J969J669J859K604L570M048
62810D77185L747L241L262L827M378M545M403M251M403N041O007O930P687Q451
62796E47358R235R799J0133J0579J1207J1663J1884J2468J3955J6225J8933K2065
62784G05504K5656K9445L3301L7592M2665M8258N3894N9461O5025P0398P5322
62773A246521P9701Q3127Q4588Q3200P8944P2270O3320N2132L9180K5112J0219
$$ plain form
62873 471474 473254 474866 475902 475940 474968 473227 470832 467867 464684 461752 459204 456748 454092 451367 449070
62858 449070 447585 446782 446243 445984 446615 448456 450794 452580 453700 454872 456337 457477 457910 458136 458639 459086
62842 459086 458936 458326 457728 457154 456280 455044 453562 451813 449953 448636 448367 448741 448900 448608 448339 448463 448921
62825 448921 449595 450415 451135 451589 452188 453648 456115 458958 461466 463435 465104 466963 469567 473137 477185
62810 477185 480932 484173 487435 491262 495640 500185 504588 508839 513242 518283 524290 531220 538907 547358
62796 547358 556593 566392 576525 587104 598311 609974 621858 634326 648281 664506 683439 705504
62784 705504 731160 760605 793906 831498 874163 922421 976315 1035776 1100801 1171199 1246521
62773 1246521 1326222 1409349 1493937 1577137 1656081 1728351 1791671 1843803 1882983 1908095 1918314
62762A918314n173k0060l3281m4568n4442o3108p0052p4633p6541p5880p3409
62751A327167p0534o8314o6422o3716n9783n5199n0449m5454m0372l5921l2463
62740G38540k9465k6269k2926j9859j7172j4777j2737j1132r789q501p230n923
62728E52760m454k989j960j403o83P27K566M221N463O393P042P518Q260R559J1115
62713F04135J2540J4070J6200J8785K1307K3868K7132L1177L5276L9144M3547
62702H87181M9173N5498O1545O7319P3734Q1214Q9078R6363J02740J08449J13634
62691A785928J17812J19769J18146J12400J03062R0713P5042N5498L2771Q816
62681B619957j4700l7261n8598p7738r3491j05342j13348j17669j18729j17453
$$ plain form
62762 1918314 1913141 1893081 1859800 1815232 1760790 1697682 1627630 1552997 1476456 1400576 1327167
62751 1327167 1256633 1188319 1121897 1058181 998398 943199 892750 847296 806924 771003 738540
62740 738540 709075 682806 659880 640021 622849 608072 595335 584203 574414 565913 558683 552760
62728 552760 548306 545317 543357 541954 541271 541998 544564 548785 554248 560641 567683 575201 583461 593020 604135
62713 604135 616675 630745 646945 665730 687037 710905 738037 769214 804490 843634 887181
62702 887181 936354 991852 1053397 1120716 1194450 1275664 1364742 1461105 1563845 1672294 1785928
62691 1785928 1903740 2023509 2141655 2254055 2357117 2447830 2522872 2578370 2611141 2619957
62681 2619957 2605257 2567996 2509398 2431660 2338169 2232827 2119479 2001810 1883081 1765628
62671A765628j14627j10296j04298r7134q9735q2510p5316o8198o1505n5376m9680
62660H56953m4488l9968l5892l1896k8223k5439k3312k0861j7789j5099j3788
62649E60198j3574j3484j3119j2746j2405j1666j0235q406o840o068o007n863
62637D39785m798k920j243m57j31M33J021P91m62j921k703k697k353k052j908
62622D18385j963k212k441k168j061N20J627J700J329J588K696L856M496M930
62608D31282N564O073N986N633N831O876Q365R870J1197J2246J3184J4752J7669
62595E54528K1642K5401K7988K9705L1665L4622L8258M1360M2626M1552L8588
62584I27935L4350K8957K2305J4776P119l28p764j5176k1911k7236l1029l3707
$$ plain form
62671 1765628 1651001 1540705 1436407 1339273 1249538 1167028 1091712 1023514 962009 906633 856953
62660 856953 812465 772497 736605 704709 676486 651047 627735 606874 589085 573986 560198
62649 560198 546624 533140 520021 507275 494870 483204 472969 464563 457723 451655 445648 439785
62637 439785 434987 432067 430824 430367 430236 430669 431690 432481 432019 430098 427395 424698 422345 420293 418385
62622 418385 416422 414210 411769 409601 408540 409060 410687 412387 413716 415304 418000 421856 426352 431282
62608 431282 436846 442919 448905 454538 460369 467245 475610 485480 496677 508923 522107 536859 554528
62595 554528 576170 601571 629559 659264 690929 725551 763809 805169 847795 889347 927935
62584 927935 962285 991242 1013547 1028323 1035442 1035114 1027350 1012174 990263 963027 931998 898291
62572H98291l5627l6818l7157l6606l5251l3178l0441k7329k4474k2395k0812
62561E58203j8862j6247j3806j2468j1984j1263r761p863n968m042k243j262j470
62548D40964k207k429j863j085o79o66o52k07Q34K156L075L165K748K524K799
62533D48477L252L420L155K651K378K971M724P055Q835R622J0266J1942J4792
62520E33540J8015K1130K4417K8079L1749L5262L9260M4359N0041N5132N9131
62509I40115O2448O5391O7610O8532O7639O4234N7736M8429L7370K5343J2497
62498A517344q04j3559k4900l4581m2322m7522n0185n1306n1484m9851m5375l8747
62486A066708l1898k5923k0497j5057r446l530K725Q601J3169J6627K0142K3910
$$ plain form
62572 898291 862664 825846 788689 752083 716832 683654 653213 625884 601410 579015 558203
62561 558203 539341 523094 509288 496820 484836 473573 463812 455949 449981 445939 443696 442434 440964
62548 440964 438757 436328 434465 433380 432701 432035 431383 431176 432010 434166 437241 440406 443154 445678 448477
62533 448477 451729 455149 458304 460955 463333 466304 471028 478083 486918 496540 506806 518748 533540
62520 533540 551555 572685 597102 625181 656930 692192 731452 775811 825852 880984 940115
62509 940115 1002563 1067954 1135564 1204096 1271735 1335969 1393705 1442134 1479504 1504847 1517344
62498 1517344 1516540 1502981 1478081 1443500 1401178 1353656 1303471 1252165 1200681 1150830 1105455 1066708
62486 1066708 1034810 1008887 988390 973333 963887 960357 963082 971683 984852 1001479 1021621 1045531
62474A045531K6377K5870K2262J6636J0147L790j620o138j0917j7011k4155l1172
62462A059600l7115m1508m4058m4892m4833m4606m3949m2048l8733l4631l0326
62451F12901k6069k2174j8946j6112j3037r707o934n303m407l356j689M33K479
62438D88079L819M164M061M573O066P620Q038P108N477L553J179j647m435o733
62424E30922q541r945j0767j0906j0649j0335r947r424r027q842q221o450m052
62411D13816k562k735l573l703l083k698k923l074k555j639r01m95l03k83k85
62396C83004N5Q20J491J593J500K052L377M544M580L510K201J382J110J121J362
62381D13702J953K828L686M409N258O408P505P977P813P657Q065Q946R872J0629
$$ plain form
62474 1045531 1071908 1097778 1120040 1136676 1146823 1150613 1148993 1142855 1131938 1114927 1090772 1059600
62462 1059600 1022485 980977 936919 892027 847194 802588 758639 716591 677858 643227 612901
62451 612901 586832 564658 545712 529600 516563 506856 499922 494619 490212 486856 485167 485600 488079
62438 488079 491898 496062 500123 504696 510762 518382 526420 533528 539005 542558 543737 542090 537655 530922
62424 530922 522381 512436 501669 490763 480114 469779 459832 450408 441381 432539 424318 417868 413816
62411 413816 411254 408519 404946 401243 398160 395462 392539 389465 386910 385271 384370 383875 383572 383289 383004
62396 383004 383059 383879 385370 386963 388463 390515 393892 398436 403016 406526 408727 410109 411219 412340 413702
62381 413702 415655 418483 422169 426578 431836 438244 445749 453726 461539 469196 477261 486207 496079 506708
62367E06708J1251J1779J2365J3407J5244J7646K0083K2456K5240K8681L2422
62356G17282L6199M0542M6089N2328N7645O0924O2514O3203O2627N9315N2331
62345A310999M2379L1240K0510J0963K628m887j2026j8963k5594l1817l7584m2659
62333A245189m6600m9041m9814m8702m5566m0951l6113l2025k8540k4984k1303
62322H21550j8188j6174j5181j4935j5385j6555j8316k0357k2168k3094k2815
62311F18382k1787k0765j9834j8369j6137j3867j2370j1521j0567r175p659o315
62299D50016n064l845k884k378k175j992j710j337p91k9P53J290J667K293L348
62284D37162M445M998M820M202L561L223L410M063M643M536L828L377L871N041
$$ plain form
62367 506708 517959 529738 542103 555510 570754 588400 608483 630939 656179 684860 717282
62356 717282 753481 794023 840112 892440 950085 1011009 1073523 1136726 1199353 1258668 1310999
62345 1310999 1353378 1384618 1405128 1416091 1418719 1413832 1401806 1382843 1357249 1325432 1287848 1245189
62333 1245189 1198589 1149548 1099734 1051032 1005466 964515 928402 896377 867837 842853 821550
62322 821550 803362 787188 772007 757072 741687 725132 706816 686459 664291 641197 618382
62311 618382 596595 575830 555996 537627 521490 507623 495253 483732 473165 463990 456331 450016
62299 450016 444952 441107 438223 435845 433670 431678 429968 428631 427840 427811 428564 429854 431521 433814 437162
62284 437162 441607 446605 451425 455627 459188 462411 465821 469884 474527 479063 482891 486268 490139 495180
62270D95180O009O289O171O282P016Q331R883J1441J3222J5741J9166K3062K6994
62257F54787L1083L5707M0869M6227N1621N7073O2305O6572O9052O9091O6211
62246A250598O0261N1714M1536L0728K0112J0350J668o465j4955k4157l3558m2410
62234A345422n0315n7029o2088o4971o5520o4022o0959n6780n1815m6310m0568
62223G25045l5059l0259k6386k3382k1057j9144j7351j5576j3934j2447j0888
62212D99562r260q079p741p748p245o239n658n946o302n632l867j922o69k18p7
62197D22959L00R97J560J641J636K326L790N202N990O603P742R209J0160J0257
62183D90372J0062J0245J0861J1485J1726J1462J0813R989R059P889O390M867
$$ plain form
62270 495180 501189 507478 513649 519931 526947 535278 545161 556602 569824 585565 604731 627793 654787
62257 654787 685870 721577 762446 808673 860294 917367 979672 1046244 1115296 1184387 1250598
62246 1250598 1310859 1362573 1404109 1434837 1454949 1465299 1466967 1460502 1445547 1421390 1387832 1345422
62234 1345422 1295107 1238078 1175990 1111019 1045499 981477 920518 863738 811923 765613 725045
62223 725045 689986 659727 633341 609959 588902 569758 552407 536831 522897 510450 499562
62212 499562 490302 482223 474482 466734 459489 453250 447592 441646 435344 429712 425845 423923 423254 423036 422959
62197 422959 423259 424256 425816 427457 429093 431419 435209 440411 446401 453004 460746 469955 480115 490372
62183 490372 500434 510679 521540 533025 544751 556213 567026 577015 586074 593963 600353 605220
62171F05220M042M630O827J0145J3845J7632K1863K6953L2686L8398M3685M8521
62159H74447N2654N5298N5544N2840M7104L8930K9794K1523J5022R766M805j56
62147A257571m995j0081j6131k3124k9844l4791l7390l8134l7769l6535l4220
62136I54557l0780k6671k2523j8700j5370j2773j1094j0137r506r105r019q990
62124G69889q453p200n477l354n37K950O421R174J0991J1618J0371O922K193k101
62110H03407m745n531m789l069j242l91j288l977p704j1169j3144j3206j1753
62097G21399r333o259k984j93J878L766N855P600Q283Q153Q114Q503Q958R355
62083G73095J0014J0943J1736J2386J3482J5363J7673K0000K2369K4800K6862
$$ plain form
62171 605220 609262 613892 620719 630864 644709 662341 684204 711157 743843 782241 825926 874447
62159 874447 927101 982399 1037943 1090783 1137887 1176817 1206611 1228134 1243156 1252922 1257727 1257571
62147 1257571 1252576 1242495 1226364 1203240 1173396 1138605 1101215 1063081 1025312 988777 954557
62136 954557 923777 897106 874583 855883 840513 827740 816646 806509 797003 787898 778879 769889
62124 769889 761436 754236 748759 745405 744868 747818 754239 763413 774404 786022 796393 803315 805508 803407
62110 803407 798662 793131 788342 785273 784031 783640 782352 778375 770671 759502 746358 733152 721399
62097 721399 712066 705807 702823 702630 704508 708274 714129 721729 730012 738165 746279 754782 763740 773095
62083 773095 783109 794052 805788 818174 831656 847019 864692 884692 907061 931861 958723
62072I58723K8116K8569K8382K7466K5773K3633K1523J9728J8505J8263J9196
62061A217877K0971K3153K5684K8522L0958L1726K9964K5794K0103J3949Q196
62050A476897L340n95l980p426j1650j7210k4082l1473l8257m3690m7641n0236
62038A203997n1580n1830n1333n0438m9185m7277m4407m0626l6385l2255k8580
62027G20101k5404k2643k0188j7878j5554j3331j1678j0977j0976j0951j0477
62016E50044r843r536r564r523r136q484p717o911o157n423m339k526l52J155
62002D61688J439J163J370K260L195L761M186M670M912M539L670K815K336K146
61988E04150J786Q23o94k243l419m353n292o039o283o332o801p569p716o716n127
$$ plain form
62072 958723 986839 1015408 1043790 1071256 1097029 1120662 1142185 1161913 1180418 1198681 1217877
62061 1217877 1238848 1262001 1287685 1316207 1347165 1378891 1408855 1434649 1454752 1468701 1476897
62050 1476897 1480237 1479642 1475662 1468236 1456586 1439376 1415294 1383821 1345564 1301874 1254233 1203997
62038 1203997 1152417 1100587 1049254 998816 949631 902354 857947 817321 780936 748681 720101
62027 720101 694697 672054 651866 633988 618434 605103 593425 582448 571472 560521 550044
62016 550044 540201 530665 521101 511578 502442 493958 486241 479330 473173 467750 463411 460885 460533 461688
62002 461688 463127 464290 465660 467920 471115 474876 479062 483732 488644 493183 496853 499668 502004 504150
61988 504150 505936 506759 506065 503822 500403 496050 490758 484719 478436 472104 465303 457734 450018 443302 438175
61973D38175l738k656j646q86q17j459k353l088l536l759l903m100m196l796k810
61958C95432j722j056q05o48m54k35J78Q91J558J632J048L49J73Q49K373M466
61942D04029O591Q241R317J0140J1111J2385J3769J4844J5273J5148J4918J4865
61930E50631J4775J4257J3258J2100J1042R944Q402O227L809J818M14j007l073
61917F42597n607p916r521j0124r240o691l421q23Q60K653N184P873J0116J2216
61903F28156J4513J6353J6822J5905J4193J1916Q979N562K040j419m662p320r210
61890G11828j0517j1237j1149j0683j0823j1524j1295r355p192o625p216p183
61878E97029o363o375q031j0280j1965j2993j3399j2740j1034r171p724o314m586
$$ plain form
61973 438175 434437 431781 430135 429249 428432 426973 424620 421532 417996 414237 410334 406234 402038 398242 395432
61958 395432 393710 392654 391849 391201 390747 390512 390690 391581 393139 394771 395819 396168 396341 397190 399563 404029
61942 404029 410620 418861 428178 438318 449429 461814 475583 490427 505700 520848 535766 550631
61930 550631 565406 579663 592921 605021 616063 626007 634409 640636 644445 646263 646677 645670 642597
61917 642597 636990 629074 619553 609429 600189 593498 590077 589254 590114 592767 597951 605824 615940 628156
61903 628156 642669 659022 675844 691749 705942 717858 726837 732399 734439 733020 728358 721038 711828
61890 711828 701311 690074 678925 668242 657419 645895 634600 625245 618053 611428 604212 597029
61878 597029 590666 584291 576260 565980 554015 541022 527623 514883 503849 494678 486954 480640 476054
61865D76054k911j612m19Q22J751K276K973M191N488O540P774R610J1713J3719
61851E37969J5991J8969K2173K4593K5831K6449K7240K8390K9203K8637K6462
61840H11907K3673K1140J8194J3531P412J686k627o313j0024j2800j3578j2906
61828H39295j1923j0486p756l957j46L425P275J1151J3821J4607J3983J2427R661
61815H91377N409O1n773j1711j7212k1444k4112k5942k7768k9319k9436k7503
61803F76627k4299k1279j9236j7904j6727j5605j4627j3467j1640r359p555o892
61791D98037p131p564p606o872n304l541k545k492k583k300k117k459k686j995
61777D40842q08k81o76j234j465j599j723j467p67j66L9K72R16J686K154K478
$$ plain form
61865 476054 473143 471531 471112 471934 473685 475961 478934 483125 488613 495153 502927 512537 524250 537969
61851 537969 553960 572929 595102 619695 645526 671975 699215 727605 756808 785445 811907
61840 811907 835580 856720 874914 888445 895857 897543 894916 888603 878579 865779 852201 839295
61828 839295 827372 816886 809130 805173 805027 808452 815727 826878 840699 855306 869289 881716 891377
61815 891377 896786 896847 891074 879363 862151 840707 816595 790653 762885 733566 704130 676627
61803 676627 652328 631049 611813 593909 577182 561577 546950 533483 521843 512484 504929 498037
61791 498037 490906 483342 475736 468864 463560 460019 457474 454982 452399 450099 447982 445523 442837 440842
61777 440842 440034 439753 439077 437843 436378 434779 433056 431589 430822 430656 430695 430967 431883 433569 435723 438201
61761D38201L102M013M748N007M951M961N314O015O791P208O926N926M474K952
61747E10589J608M00q15j835k149j599q39o82j112j399j235j214j953l127l795
61732D90843l492k648j901j366o91K98J316J935K053J919J839J917K065K087J812
61717D97986J296R03J031J696K489K957K892K298J306J61q18j411j568j352j011
61702E08855r67j534k570l553m044l925l378k764k457k475k418k069j847k255
61688D72599l045l533l595l665l771l372k407j706j976k915l717l914l361k066
61674D29556n45K59J3m72l46R4k2p34j210r69m69l67p74j287j448j100n25j59
61656D19495q0K5K35J72k82n75k06M74P83O85O41P99R03R14J097J548K096K607
$$ plain form
61761 438201 441303 445316 450064 455071 460022 464983 470297 476312 483103 490311 497237 503163 507637 510589
61747 510589 512197 512597 511782 509947 507798 506199 505360 504678 503566 502167 500932 499718 497765 494638 490843
61732 490843 487351 484703 482802 481436 480745 481043 482359 484294 486347 488266 490105 492022 494087 496174 497986
61717 497986 499282 500185 501216 502912 505401 508358 511250 513548 514854 515015 514197 512786 511218 509866 508855
61702 508855 507888 506354 503784 500231 496187 492262 488884 486120 483663 481188 478770 476701 474854 472599
61688 472599 469554 466021 462426 458761 454990 451618 449211 447505 445529 442614 438897 434983 431622 429556
61674 429556 429011 429270 429283 428811 428465 428559 428537 427803 426593 425624 425155 424788 424014 422727 421279 420179 419654 419495
61656 419495 419415 419440 419675 419847 419565 418990 418784 419258 420041 420726 421367 422166 423069 423983 425080 426628 428724 431331
61638D31331K967K900K261J381O48j7q33j568j874j991k459l212l660l642l582
61623D18650l635l391k594j613r55p25p12n61J10J243J971J356l68j844k149j747
61607D03036j641k153k943l804m789n754o225n821m693l458k703k493k433k280
61593C51846k286k712l282l540l518l549l564l188k462j855j524j272j319k230
61579C15545l815m829m353k886j572r00o72p28r55r95o59l90o16q20j69J030J437
61562B93653M62q19j060k96L72K67l11p65p91l39L89Q82P29K41J67O38R17M84
61544B94820j24J5R43J767J713Q37k08p23l59O67J639J906J431N96k07o33l45
61527C03735M96R74L13j056k038k325k570l055l196k624j871j431r58n3Q25R04
$$ plain form
61638 431331 434298 437198 439459 440840 441488 441471 440638 439070 437196 435205 432746 429534 425874 422232 418650
61623 418650 415015 411624 409030 407417 406462 405737 405025 404464 404574 405817 407788 409144 408776 406932 404783 403036
61607 403036 401395 399242 396299 392495 387706 381952 375727 369906 365213 361755 359052 356559 354126 351846
61593 351846 349560 346848 343566 340026 336508 332959 329395 326207 323745 321890 320366 319094 317775 315545
61579 315545 311730 306901 302548 299662 298090 297190 296518 295790 294835 293840 293181 292791 292175 291355 291186 292216 293653
61562 293653 294115 293296 292236 291940 292312 292579 292268 291503 290712 290373 290762 291644 292373 292614 292781 293419 294336 294820
61544 294820 294696 294711 295654 297421 299134 299971 299763 299040 298681 299348 300987 302893 304324 304920 304713 304080 303735
61527 303735 304231 305205 305518 304462 302424 300099 297529 294474 291278 288654 286783 285352 284394 284341 285166 286070
61511B86070K75k10J8P24J181P35o39k077k532j968j323j154j035o04k49j81J57
61494B77188R58J226K07j154j343l74M99P36P56O06j40j069j073q4O71N58M50
61477B78618J153K054K176J711J542J796J734Q83l38j160j238q77o46p10o41o5
61461B85992O98J067J005Q63O06r6j036j503j219n92M6P21J250J197O66L87O89
61444B90741J010P40J8o18p91k53J024K448L072K660K011J948K473L141L599L531
61428C16754K735J621J006J035R18J79n59n00J83P26Q21P19P25J055J771K452
61412C31641K399J554P75O68P56L57l19o45o81r71j619k236k652k948l038k855
61396C20186k687k682k294j052L50O94n9o23j83O04Q12N83O66J119J281R01N20
$$ plain form
61511 286070 286345 286135 286153 286877 288058 288793 288154 286077 283545 281577 280254 279100 278065 277461 277212 277031 277188
61494 277188 278146 279372 279579 278425 277082 276708 277207 277943 278699 279305 279165 278096 277023 276939 277610 278168 278618
61477 278618 279771 281825 284001 285712 287254 289050 290784 291667 291329 290169 288931 288054 287408 286698 286057 285992
61461 285992 286690 287757 288762 289625 290231 290135 289099 287596 286377 285785 285831 286552 287802 288999 289665 290052 290741
61444 290741 291751 292491 292509 291891 291100 290847 291871 294319 297391 300051 302062 304010 306483 309624 313223 316754
61428 316754 319489 321110 322116 323151 324069 324248 323689 323189 323372 324098 324919 325638 326363 327418 329189 331641
61412 331641 334040 335594 336369 337037 337793 338150 337831 337186 336505 335534 333915 331679 329027 326079 323041 320186
61396 320186 317499 314817 312523 311471 311821 312515 312456 311833 311650 312254 313066 313649 314315 315434 316715 317616 318136
61379C18136O48J073J215R44O38O24Q72J250J729K192K302J900J353J173J382
61364C37431J566J495J359J373J533J821K275K796L204L529L909M183M051L740
61350C74265L996N187O765P945Q501Q604Q218P161N644M319L711L766L997L954
61336D56033L589L186K914K580J965J200N82J32l35q08j122j339j683k073k176
61321D62645j935j653j555j572j576j377o30P53K144K814K994L652N151O808P993
61306D84656Q935J0152J1667J3187J4546J5655J6307J6267J5253J2891R285N529
61294F34330K875J283l96k641m661n834o684p816q854r226r249r534r979j0103
61280E53511r885r437q366o415m319l072k529j664j43J254J900K141K633L335
$$ plain form
61379 318136 318784 319857 321072 322016 322654 323278 324150 325400 327129 329321 331623 333523 334876 336049 337431
61364 337431 338997 340492 341851 343224 344757 346578 348853 351649 354853 358382 362291 366474 370525 374265
61350 374265 378261 383448 390213 398158 406659 415263 423481 430642 436286 440605 444316 448082 452079 456033
61336 456033 459622 462808 465722 468302 470267 471467 472049 472181 471846 471038 469916 468577 466894 464821 462645
61321 462645 460710 459057 457502 455930 454354 452977 452347 453100 455244 458058 461052 464704 469855 476663 484656
61306 484656 493591 503743 515410 528597 543143 558798 575105 591372 606625 619516 628801 634330
61294 634330 637205 638488 638092 635451 630790 624956 618272 610456 601602 592376 583127 573593 563614 553511
61280 553511 543626 534189 525823 519408 515089 512017 509488 507824 507681 508935 510835 512976 515609 518944
61266E18944L635L163K266J674J783K336K945L767N279P339R006R488Q893P848
61252E88366O799N913N214M550L729K941K574K491K024Q83m65j581k529l384l858
61237F13667l848l695l571l242k784k773l324l625l016j806n15R06K533L910M764
61222E93581N590O712P451P105O220O025P001Q649J0144J0623R568P692O669P103
61208G00133P511O347M254L012K975L000K539K205K428K923L619M786O177P196
61194G59105Q141J0053J3026J5803J7353J7896J7869J6816J4058R969O004L537
61182I09630K874L141L103K278J154J90q90k434m040n092n701o338o860o837o617
61167H77561p047q220r334r927j0428j1313j2439j3394j3967j4181j4195j4192
$$ plain form
61266 518944 522579 525742 528008 529682 531465 533801 536746 540513 545792 553131 562137 571625 580518 588366
61252 588366 595165 601078 606292 610842 614571 617512 620086 622577 624601 625484 625019 623438 620909 617525 613667
61237 613667 609819 606124 602553 599311 596527 593754 590430 586805 583789 581983 581468 582374 584907 588817 593581
61222 593581 599171 605883 613334 620439 626659 632684 639685 648334 658478 669101 678669 686361 693030 700133
61208 700133 707644 713991 718245 721257 724232 727232 729771 731976 734404 737327 740946 745732 751909 759105
61194 759105 767246 777299 790325 806128 823481 841377 859246 876062 890120 900089 906093 909630
61182 909630 912504 915645 918748 921026 922180 922370 921480 919046 915006 909914 904213 897875 891015 884178 877561
61167 877561 870514 862294 852960 843033 832605 821292 808853 795459 781492 767311 753116 738924
61155G38924j4084j3505j2410j1287j0376r232p539n774m348k807p90P93O61j157
61141F47069l559n917q255j0197j0946j0313q820o914m890l273k305j361J40J629
61127E72088K285K575L590N259O617P613R123J1308J3456J5430J7703K0016K1598
61114G08661K2849K5030K8083L0313L0792L0394L0052K9550K8632K7786K7144
61103A019286K5943K3866K1666J9759J7446J4195J0486O717K539j992n948r061
61091A144902j2407j6602k0555k3109k4803k6694k8458k8974k8141k6850k5636
61080H82673k4442k3316k2358k1285j9882j8536j7568j6456j4526j2086j0131
61069F82087r068q375p380n967m573l694l252k508r73P49J677J894K446L831N508
$$ plain form
61155 738924 724840 711335 698925 687638 677262 668030 660491 654717 650369 647562 646772 647565 648226 647069
61141 647069 643510 637593 629338 619141 608195 597882 589062 582148 577258 573985 571680 570319 570459 572088
61127 572088 574373 576948 580538 585797 592414 600027 609150 620458 633914 649344 667047 687063 708661
61114 708661 731510 756540 784623 814936 845728 876122 906174 935724 964356 992142 1019286
61103 1019286 1045229 1069095 1090761 1110520 1127966 1142161 1152647 1159364 1161903 1159911 1153963 1144902
61091 1144902 1132495 1115893 1095338 1072229 1047426 1020732 992274 963300 935159 908309 882673
61080 882673 858231 834915 812557 791272 771390 752854 735286 718830 704304 692218 682087
61069 682087 673019 664644 657264 651297 646724 643030 639778 637270 636297 637046 638723 640617 643063 646894 652402
61054F52402O962Q203R064R155Q806R028J0141J1478J2698J4331J6638J9071K1229
61041H09206K3317K5298K6725K7751K9156L1047L2719L4129L6192L9203M2335
61030A157078M5088M7843N0637N2759N3901N4257N3362N0762M8080M8285N2388
61019A714440N8901O6827P6565Q7341R6783J04188J11475J20099J30385J45093
61009B712097J69529K06146K53067L09996L80781M67666N69492O90471Q44875
61000F604120J048762J316106J666453K108116K572310K864147K738369K090424
60992B3008807J089086R3692n80667q22794o86525k69233L12411Q52639J062409
60983B4059825P33548q2485j083254j919395k399677k531127k420827k176128
$$ plain form
61054 652402 659364 667567 676631 685786 694592 703620 713761 725239 737937 752268 768906 787977 809206
61041 809206 832523 857821 884546 912297 941453 972500 1005219 1039348 1075540 1114743 1157078
61030 1157078 1202166 1250009 1300646 1353405 1407306 1461563 1514925 1565687 1613767 1662052 1714440
61019 1714440 1773341 1840168 1916733 2004074 2100857 2205045 2316520 2436619 2567004 2712097
61009 2712097 2881626 3087772 3340839 3650835 4031616 4499282 5068774 5759245 6604120
61000 6604120 7652882 8968988 10635441 12743557 15315867 18180014 20918383 23008807
60992 23008807 24097893 24191585 23610918 22788124 22101599 21832366 22144777 22997416 24059825
60983 24059825 24793373 24710888 23627634 21708239 19308562 16777435 14356608 12180480
60975A2180480j874737j571732j299935j068113q72581p10715n80730m76184l89342
60966C336411l17927k63069k22705j91809j67516j49333j35298j22213j09319
60957A657222r8177q9014q0159p0883o1968n3530m5021l7535l3505l3464l5119
60946A018847l6101l5911l4763l2458k9154k5866k3301k1130j8931j7018j5933
60935G28281j5692j5911j6105j5849j5143j4589j4665j4952j4646j3622j2346
60924E64761j1012r517q055p020o403n916n615n705n874n506m476l198j985r08
60910D83571p9M30P58Q97N14l13o82J28J521K264K013J385Q04J46n67j074j506
60893D90210k268l186l565l199k659k336j977j456j401k533m659o677p514o936
$$ plain form
60975 12180480 10305743 8734011 7434076 6365963 5493382 4782667 4201937 3725753 3336411
60966 3336411 3018484 2755415 2532710 2340901 2173385 2024052 1888754 1766541 1657222
60957 1657222 1559045 1470031 1389872 1318989 1257021 1203491 1158470 1120935 1087430 1053966 1018847
60946 1018847 982746 946835 912072 879614 850460 824594 801293 780163 761232 744214 728281
60935 728281 712589 696678 680573 664724 649581 634992 620327 605375 590729 577107 564761
60924 564761 553749 544232 536177 529157 522754 516838 511223 505518 499644 494138 489662 486464 484479 483571
60910 483571 483492 483922 484680 485577 486091 485778 485096 485224 486745 489009 491022 492407 493211 493357 492790 491716 490210
60893 490210 487942 484756 481191 477992 475333 472997 471020 469564 468163 465630 460971 454294 446780 439844
60879D39844n624m550m189m259m249l962l436k674j748r64m93M9J197K884M378
60864D12204N000M745M240M331N446P137Q356Q426P589O495N496M670M144L937
60850D92216L785L571L667M307M862M313K542N97l90k82J95K90k09j042j903k741
60834E13778l647m584n426o196o920p234o588n059l561k917l058l387l567l590
60820D48044l393k896k301j929j799j600j004J9J060J404P01l79o74J06J103J681
60804D38143K409M040O111P315P127O313N899O256P168Q225R037R481R827J0402
60790E37753J1189J1968J2731J3639J4694J5778J6958J8338J9741K0799K1361
60779G14949K1561K1576K1517K1442K1348K1218K1124K1056K0605J9250J7081
$$ plain form
60879 439844 434220 429670 425481 421222 416973 413011 409575 406901 405153 404189 403696 403745 404942 407826 412204
60864 412204 417204 421949 426189 430520 435966 443103 451459 459885 467474 473969 479465 484135 488279 492216
60850 492216 496001 499572 503239 507546 512408 516721 519263 519860 519470 519188 519383 519673 519464 518422 516519 513778
60834 513778 510131 505547 500121 493925 487005 479771 473183 468124 464563 461646 458588 455201 451634 448044
60820 448044 444651 441755 439454 437525 435726 434126 433122 433141 434201 435605 436306 435927 435253 435359 436462 438143
60804 438143 440552 444592 450703 458018 465145 471458 477357 483613 490781 499006 508043 517524 527351 537753
60790 537753 548942 560910 573641 587280 601974 617752 634710 653048 672789 693588 714949
60779 714949 736510 758086 779603 801045 822393 843611 864735 885791 906396 925646 942727
60768I42727J4826J2997J1419R791P986N526J640l531q467j1811j3817j5481j6898
60755I36907j7649j8297k0009k2665k4666k4988k4271k3449k2412k0702j8644
60744F99155j6925j5580j4315j3414j3509j4547j5662j6122j5880j5147j4021
60733E34033j2701j1606j0933j0336r397q310p653p513p212o144m591l310k526
60720D31801j806q30J83R50J446J579J078N7p86r97j025j570k522l174l244l156
60704D17984l366l918m648n327n580n184m539m354m756n083m775m048l510l344
60690C55552l289l152k987k740k110j066k86n54j557j819l70J806K772K042J153
60675C43395J577K848L408K715J711J479K116K890L000K199R50pm64q58j433j747
$$ plain form
60768 942727 957553 970550 981969 991760 999746 1005272 1006912 1003381 994914 983103 969286 953805 936907
60755 936907 919258 900961 880952 858287 833621 808633 784362 760913 738501 717799 699155
60744 699155 682230 666650 652335 638921 625412 610865 595203 579081 563201 548054 534033
60733 534033 521332 509726 498793 488457 479060 470750 463097 455584 448372 442228 437637 434327 431801
60720 431801 429995 429165 429348 430298 431744 433323 434401 434458 433672 432675 431650 430080 427558 424384 421140 417984
60704 417984 414618 410700 406052 400725 395145 389961 385422 381068 376312 371229 366454 362406 358896 355552
60690 355552 352263 349111 346124 343384 341274 340208 339922 339368 337811 335992 335622 337428 340200 342242 343395
60675 343395 344972 347820 351228 353943 355654 357133 359249 362139 365139 367338 368288 368281 367817 366959 365526 363779
60659C63779j391p05k24J65Q32J521J649J310J303K113L543N163O557P215O957
60644C99787O412O405O730O290M509K026j41j469j895j588j080j014j498k098
60630D21376k586l138l700l801l321k857k918l212l158k717k342k303k455k500
60616C80368k263j856j608j678j756j480j045r74j304j595j718k002k426k369
60602C56294j543n48j41l33o39p01l21N91J652K071J576R03Q36J159J183Q65O96
60585C63600P05M12k69p55o24q7N10J107J632J806J532J229J431K246L478N041
60569C82994O844Q467R350R498R637J0412J1550J2144J1638J0260Q440O205L384
60556E00823J04l199o096q169q931q214o564m809l238j597J82J706K715L470M353
$$ plain form
60659 363779 362388 361683 361459 361624 362456 363977 365626 366936 368239 370352 373895 379058 385615 392830 399787
60644 399787 406199 412604 419334 425624 430133 432159 432018 430549 428654 427066 425986 424972 423474 421376
60630 421376 418790 415652 411952 408151 404830 401973 399055 395843 392685 389968 387626 385323 382868 380368
60616 380368 378105 376249 374641 372963 371207 369727 368682 367708 366404 364809 363091 361089 358663 356294
60602 356294 354751 354203 354062 353729 353090 352389 352068 352659 354311 356382 357958 358861 359697 360856 362039 362904 363600
60585 363600 364305 364717 364448 363693 363069 362982 363492 364599 366231 368037 369569 370798 372229 374475 377953 382994
60569 382994 389838 398305 407655 417153 426790 437202 448752 460896 472534 482794 491234 497439 500823
60556 500823 500927 497728 491632 483463 474532 466318 459754 454945 451707 450110 450292 451998 454713 458183 462536
60541D62536N421O610Q049R916J2169J4486J6256J6575J4745J0957O263J708k195
60528E83496n130o725p016o674o348o011n326m283l181k269j805k072k800k951
60514E20905j752K12J591J883J740J730J675J400J411K194L423M558N914Q362
60500E55246J2039J6075J9787K3530K7913L2696L7093M0912M4538M7746M9323
60489I06898M8249M4594L8624K9750J7367K554j2189k5045l5837m4666n0722n3149
60477H66428n2441m9970m6536m2122l6906l1619k6925k3063k0160j8265j6978
60466E01443j5560j3636j1455r428p773o622o017n681n229m649m239l937l300
60453D03917k322j707j957k600k785k414k158k457k992l162k800k314k207k498
$$ plain form
60541 462536 467957 474567 482616 492532 504701 519187 535443 552018 566763 577720 583983 585691 583496
60528 583496 578366 571641 564625 557951 551603 545592 540266 535983 532802 530533 528728 526656 523856 520905
60514 520905 519153 519365 520956 522839 524579 526309 527984 529384 530795 532989 536412 540970 546884 555246
60500 555246 567285 583360 603147 626677 654590 687286 724379 765291 809829 857575 906898
60489 906898 955147 999741 1038365 1068115 1085482 1088036 1075847 1050802 1014965 970299 919577 866428
60477 866428 813987 764017 717481 675359 638453 606834 579909 556846 536686 518421 501443
60466 501443 485883 472247 460792 451364 443591 436969 430952 425271 420042 415393 411154 407217 403917
60453 403917 401595 399888 397931 395331 392546 390132 387974 385517 382525 379363 376563 374249 372042 369544
60439C69544k580j767j29J359J748J033Po47q21o71k98J68M63M48L13L23M13J86
60421C69092n29j306j387m48R69J908J870J201O10N26R01J448J832J762J160L22
60405C79931k52k32K83Q65J030O35R1Q5Q80J955K514K277J659J233J251J584J892
60388C97681J869J557J359J508J684J494J237J612K582L173K714J803J566K274
60374D24113L182L510L094K186J203O55Q19J322J404P54j44o32n67k86j51k54
60358D40208m79o53o71n51l22O1O17J276J954K619L126L294L283L612M467N274
60342D67115N413N063M798M497L404J313r92k672l637m170m396m430m547m754
60328D62005m608l908l220l212l748m085l797l084k311j696j332j196j053o33
$$ plain form
60439 369544 366964 365197 365068 366427 368175 369208 369215 368568 367747 367076 366778 366946 367409 367857 368170 368493 368906 369092
60421 369092 368563 367257 365870 365422 366391 368299 370169 371370 371980 372506 373407 374855 376687 378449 379609 379931
60405 379931 379679 379447 379730 380595 381625 382260 382351 382436 383316 385271 387785 390062 391721 392954 394205 395789 397681
60388 397681 399550 401107 402466 403974 405658 407152 408389 410001 412583 415756 418470 420273 421839 424113
60374 424113 427295 430805 433899 436085 437288 437943 438762 440084 441488 442242 442098 441466 440899 440613 440462 440208
60358 440208 439729 439076 438405 437854 437532 437593 438210 439486 441440 444059 447185 450479 453762 457374 461841 467115
60342 467115 472528 477591 482389 486886 490290 491603 490611 487939 484302 480132 475736 471306 466759 462005
60328 462005 457397 453489 450269 447057 443309 439224 435427 432343 430032 428336 427004 425808 424755 424122
60314D24122R0Q81J442J597J491J682K722M475O167P344Q546J0736J4208J8207
60300E03710K1356K2372K0869J7641J3857R728M529j817p912j2224j4643j5871
60288E61595j5811j3754j0162p097o286p333q339p979o565n297m771m516l860
60275D59825l006k745l261l835l985m122m586m758l991k868k525k990l237k733
60261D11183j936j250o36l61r86k173k598j630l15J8n61r64n98K22R83J386J331
60244D01115J098J279K062K744K482J336J36m86m72MP44J405J695J711J797K070
60228D20720K361K567K735K867K858K623K118J320M51M5M87J558K626L304L656
60213D52296L907M217M685N304N856O090N989N793N720N829O071O290O298O081
$$ plain form
60314 424122 424212 425093 426535 428132 429623 431305 434027 438502 444669 452013 460559 471295 485503 503710
60300 503710 525066 547438 568307 585948 599805 609533 614062 612245 604333 592109 577466 561595
60288 561595 545784 532030 521868 514771 508485 501152 492813 484834 478269 472972 468201 463685 459825
60275 459825 456819 454074 450813 446978 442993 438871 434285 429527 425536 422668 420143 417153 413916 411183
60261 411183 409247 407997 407361 407000 406014 403841 401243 399613 399298 399316 398755 397791 397193 397415 398398 399784 401115
60244 401115 402213 403492 405554 408298 410780 412116 412252 411766 411294 411298 412042 413447 415142 416853 418650 420720
60228 420720 423081 425648 428383 431250 434108 436731 438849 440169 440620 440665 441152 442710 445336 448640 452296
60213 452296 456203 460420 465105 470409 476265 482355 488344 494137 499857 505686 511757 518047 524345 530426
60199E30426N875N859N858N599N168M906M826M456L398J847L97m71o54l33J16
60184E77273K21l43j502k878m099m958n374n360n116m859m579m123l613l413l544
60169E23733l473k932k541l008l928m151l321k297j759j358o20J03L14L30P17
60154D95809J255J326R97Q27Q36N94K05J81L73J22m31k81Q13J749J742J603K407
60137E10127L689M039L198K472K985M355N389N473M848L920K769J396Q4o80o61
60122E53403p3O80J331J752J853J697J537J582J819K207K780L354L474L065K669
60107E83130K614K303J073o21j732k112k565l397l999l974l722l568l302k911
60093E57217k927l458l742l260k478j955j428n09M48R76J399K175K843K572J505
$$ plain form
60199 530426 536301 542160 548018 553617 558785 563691 568517 572973 576371 578218 578615 578144 577490 577157 577273
60184 577273 577494 577151 575649 572771 568672 563714 558340 552980 547864 543005 538426 534303 530690 527277 523733
60169 523733 520260 517328 514787 511779 507851 503700 500379 498082 496323 494965 494345 494448 494762 495092 495809
60154 495809 497064 498390 499387 500214 501050 501644 501849 502030 502403 502525 502094 501813 502626 504375 506117 507720 510127
60137 510127 513816 517855 521053 523525 526510 530865 536254 541727 546575 550495 553264 554660 554744 554064 553403
60122 553403 553330 554010 555341 557093 558946 560643 562180 563762 565581 567788 570568 573922 577396 580461 583130
60107 583130 585744 588047 589120 588499 586767 584655 582090 578693 574694 570720 566998 563430 560128 557217
60093 557217 554290 550832 547090 543830 541352 539397 537969 537460 537908 538884 540283 542458 545301 547873 549378
60078E49378O84O66J006J019N05k75r00j148j440k571m647o643p532p458p198
60063E13446o983o620o302o348o401n798m743m131m221m357m082l613l086k253
60049D44508j229o22n41j96R64K363L144L372L787M676N563N953N859N695N875
60034D89171O416O698N852L763J549O50J329K350K197N27j704l410m511n726p355
60019D97796q643q650p583o719o946p788q092p327n898m497l512l018k867k696
60005D13560k120j130j37M96Q31J161J568J928K205K436K475K122J591J406J667
59990D30059J844J636J573K244L299L914M027M293M839M991M479M001M044L957
59976D79200K874J086l50j047j580k401l226l623l621l485l249k795k235j887
$$ plain form
60078 549378 550062 550728 551734 552753 553258 552983 552083 550935 549495 546924 542277 535634 528102 520644 513446
60063 513446 506463 499843 493541 487193 480792 474994 470251 466120 461899 457542 453460 449847 446761 444508
60049 444508 443279 442657 442116 441920 442884 445247 448391 451763 455550 460226 465789 471742 477601 483296 489171
60034 489171 495587 502285 508137 511900 513449 514099 515428 517778 519975 520502 518798 515388 510877 505151 497796
60019 497796 489153 480503 472920 466201 459255 451467 443375 436048 430150 425653 422141 419123 416256 413560
60005 413560 411440 410310 410173 410669 411500 412661 414229 416157 418362 420798 423273 425395 426986 428392 430059
59990 430059 431903 433539 435112 437356 440655 444569 448596 452889 457728 462719 467198 471199 475243 479200
59976 479200 482074 483160 482810 481763 480183 477782 474556 470933 467312 463827 460578 457783 455548 453661
59962D53661j819j617q29L03R04M44n41j107j078r74r62o67j69k47j196k002j458
59945D40646L31K112K889K712K253K032J956J414R9j279j654j120r74j814k516
59930D47087j858l61N01M26L55O95P87K23l84m11r0P2J15L79Q43J147J106R32
59912D51564R87J402J863J930J635J474J610J529R18M53R54K087K696K351J808
59897D75261J871K459K992L035K476J526P18M48N21N80Q54J890L516M813N235
59882E08195N114M905M587M133L890M134M671N237N820O320O265N262L414J077
59868E73024j487l925n661o366o393o382o616o876o803o175m994l550k295j518
59854E03983j097o21K94J772L626N605P761J0284J2763J3977J2855R555N228R71
$$ plain form
59962 453661 451842 450225 449396 449699 450603 451047 450506 449399 448321 447347 446385 445718 445549 445302 444106 442104 440646
59945 440646 440977 443089 445978 448690 450943 452975 454931 456345 456444 455165 453511 452391 451417 449603 447087
59930 447087 445229 444868 445369 445795 446150 446845 447632 447855 447471 447060 446970 447042 447157 447536 448379 449526 450632 451564
59912 451564 452551 453953 455816 457746 459381 460855 462465 463994 464912 465365 466319 468406 471102 473453 475261
59897 475261 477132 479591 482583 485618 488094 489620 490338 490786 491307 491887 492741 494631 498147 502960 508195
59882 508195 513309 518214 522801 526934 530824 534958 539629 544866 550686 557006 563271 568533 571947 573024
59868 573024 571537 567612 561951 555585 549192 542810 536194 529318 522515 516340 511346 507796 505501 503983
59854 503983 502886 502265 502559 504331 507957 513562 521323 531607 544370 558347 571202 580757 585985 586956
59840E86956k443m143l398n97K579M343L978J842j199m175o302p433p986q249
59826E53773p902o467m184k141j459k288l687m656n146n768o598o894o241n248
59812D85094m575l894k634j227o89j191k009k661l161l263k584j570j272j809
59798D52555k098j490o98n55p47n84l06o99j838k974l510l485l223k966k802k599
59782D21981k127j444r35q13q22o85n32o30r52j223j206p24K91J563K513K814
59766D17069K648K381K175K066K063K021J754J401J411J954K684L188L401L455
59752D49671L522L832M456M985M876M313M161M779N389N001L675K396J939K160
59738E05155K288J765Q40L83R00J823K155J699J185J166J374J362J145R96J049
$$ plain form
59840 586956 584513 580370 576972 576375 578954 583297 587275 589117 587918 583743 577441 570008 562022 553773
59826 553773 545871 539404 535220 533079 531620 529332 525645 520989 515843 510075 503477 496583 490342 485094
59812 485094 480519 476625 473991 472764 472075 470884 468875 466214 463053 459790 457206 455636 454364 452555
59798 452555 450457 448967 448269 447714 446967 446383 446077 445378 443540 440566 437056 433571 430348 427382 424580 421981
59782 421981 419854 418410 417475 416662 415840 415155 414623 413993 413041 411818 410612 409888 410179 411742 414255 417069
59766 417069 419717 422098 424273 426339 428402 430423 432177 433578 434989 436943 439627 442815 446216 449671
59752 449671 453193 457025 461481 466466 471342 475655 479816 484595 489984 494985 498660 501056 502995 505155
59738 505155 507443 509208 510048 510431 511331 513154 515309 517008 518193 519359 520733 522095 523240 524236 525285
59723E25285J365J919K361K229J617J151J107J073P31L61K55K39K02N08J391K340
59707E44134K658K342J921J692J480J043L52k84l19N19J620J882J038J50M07J776
59691E62411L130L394K289L58j353j945j464q23p40j075j350j414j270p95j32
59676E59221L1q63k507m065n033n411n388n188n040m930m616m134l937m271m705
59661D99164m598l769k458r82K51Q30Q15Q18J295K045K689L250L866M326M266
59646E11808L617K496R75o57j824k201k179k435l197m189m969n178m712l885l095
59631D80375k257j029L44J118J107R36R47O65j56q22p22l19l57p41j021j438k448
59614D74182l630m096l818l613l800l709k688r30Q38J954K109J473O60K71L86
$$ plain form
59723 525285 526650 528569 530930 533159 534776 535927 537034 538107 538838 539199 539454 539693 539895 540403 541794 544134
59707 544134 546792 549134 551055 552747 554227 555270 555622 555338 555019 555538 557158 559040 560078 560228 560635 562411
59691 562411 565541 568935 571224 571582 570229 568284 566820 565997 565257 564182 562832 561418 560148 559353 559221
59676 559221 559252 558389 555882 551817 546784 541373 535985 530797 525757 520827 516211 512077 508140 503869 499164
59661 499164 494566 490797 488339 487357 487608 488438 489253 490071 491366 493411 496100 499350 503216 507542 511808
59646 511808 515425 517921 518896 518239 516415 514214 512035 509600 506403 502214 497245 492067 487355 483470 480375
59631 480375 478118 477089 477433 478551 479658 480594 481541 482206 482050 481228 480506 480187 479830 479089 478068 476630 474182
59614 474182 470552 466456 462638 459025 455225 451516 448828 447898 448736 450690 452799 454272 454932 455203 455589
59599D55589O43O23O9r54j863j967j305o87n57m37J60Q86J202J200J135O89m11
59582D54015j587k094k153k524l198l517l337l137l039k716k232k041k067j687
59568D18686q53l40n52q68n63J94P21P15M11J33R6M00R23J358J488J350J109R48
59550D25356J057J535K262K937L343L478L529L653L773L676L532M073N927R050
59536D77181J3329J9119K5819L0064K7244J6195J424j0418j5827j5752j2850r041
59524E46487n253j849J134L518M754M741M435M767N260M680K864Q31q27k512m575
59509E68455o633q181r083r353r153r056r570j0231r959q445o580n364m974m970
59495D56903m821m151l040k062j612j300n50M10Q91Q28P28P44O97R22K028L696
$$ plain form
59599 455589 456232 456855 456924 455970 454107 452140 450835 450148 449591 449154 449314 450200 451402 452602 453737 454426 454015
59582 454015 452428 450334 448181 445657 442459 438942 435605 432468 429429 426713 424481 422440 420373 418686
59568 418686 417833 417493 416941 416073 415510 415704 416425 417140 417551 417684 417780 418180 419103 420461 421949 423299 424408 425356
59550 425356 426413 427948 430210 433147 436490 439968 443497 447150 450923 454599 458131 462204 468131 477181
59536 477181 490510 509629 535448 565512 592756 608951 610375 599957 584130 568378 555528 546487
59524 546487 541234 539385 540519 544037 548791 553532 557967 562734 567994 572674 575538 576369 575542 573030 568455
59509 568455 561822 553641 544558 535205 526052 516996 507426 497195 487236 478791 472211 466847 461873 456903
59495 456903 452082 447931 444891 442829 441217 439917 439367 439777 440668 441496 442224 442968 443665 444587 446615 450311
59479D50311M735M614M120M200M869N642O256O531O096M832L258K108J660J553
59465E10785J150J47r52j204m12M45M86K19Q77K754N021O970Q501R570J0064J0332
59449E64753J0924J1798J2477J2950J3474J3554J2077Q688M193n01m975q747j1137
59436F39528j2050j2124j1766j0802r264p789o909o547o385o212n748m764l426
59423E35742j992k66K023M523O719Q797J1224J3698J5600J7228J9385K2207K5677
59410F80565L0587L6633L9651L3746J7742k344j8563k7377k9909k8222k3574j6929
59398F92006q707J439J2384J9445J7021M308j2958k7073l3979l4469l1465k7276
59386E70676k2822j8304j4046j0660q456p014n630m050k517j316n44j61j9J38
$$ plain form
59479 450311 455046 459660 463780 467980 472849 478491 484747 491278 497374 502206 505464 507572 509232 510785
59465 510785 511935 512082 511130 509926 509514 509959 510445 510664 511541 514295 519316 526286 534787 544357 554421 564753
59449 564753 575677 587475 599952 612902 626376 639930 652007 660695 664888 664387 659412 650665 639528
59436 639528 627478 615354 603588 592786 583522 575733 568824 562277 555892 549680 543932 539168 535742
59423 535742 533750 533484 535507 540030 546749 555546 566770 580468 596068 613296 632681 654888 680565
59410 680565 711152 747785 787436 821182 838924 836580 818017 790640 760731 732509 708935 692006
59398 692006 683299 684738 697122 716567 733588 737896 724938 697865 663886 629417 597952 570676
59386 570676 547854 529550 515504 504844 496388 489374 483744 479694 477177 475861 475317 475156 475137 475275
59372D75275M18P02R33J196J472J631J837K468L423L959L605K857K619L191M127
59357E09713M835N081N139N594O802Q428R849J1008J2374J4076J5611J6639J7402
59344F42551J8207J9014J9736K0308K0347J9384J7770J6514J5869J4763J2117
59333H36580Q066L476j021m982p889r648j0934j2383j3855j4922j5543j5781j5388
59320G25776j4361j3396j3124j3256j3028j2174j0879r217p372n986n533n508
59308F01942m889l340j409L32J843L387N253P692J0816J4453J8127K0913K1202
59295F96322J7351R177j217j0608j6721j9175j8875j6912j3970j0478p074m635
59283F03185l554l127k206m72J376K706L597M357N041N681O393P079P582Q230
$$ plain form
59372 475275 475693 476395 477328 478524 479996 481627 483464 485932 489355 493314 496919 499776 502395 505586 509713
59357 509713 514548 519629 524768 530362 537164 545592 555441 566449 578823 592899 608510 625149 642551
59344 642551 660758 679772 699508 719816 740163 759547 777317 793831 809700 824463 836580
59333 836580 844646 848122 847101 842119 834230 824582 813648 801265 787410 772488 756945 741164 725776
59320 725776 711415 698019 684895 671639 658611 646437 635558 626341 618969 612983 607450 601942
59308 601942 597053 593713 592304 592636 594479 597866 603119 610811 621627 636080 654207 675120 696322
59295 696322 713673 722850 721633 711025 694304 675129 656254 639342 625372 614894 607820 603185
59283 603185 599631 596504 594298 593826 595202 597908 601505 605862 610903 616584 622977 630056 637638 645868
59269F45868R600J1521J3061J3705J3842J3797J3138J1328Q431M850J004k469
59257G57676m985o837r002j1687j3848j4553j4143j3531j3060j2536j1776j0633
59245F21085r022p276n855m571k838q56M84J032J565K217K169J428J426K882M424
59230F08294M547L715L248L127K404R70n33k048l944n947p428q402r146r288q420
59215E71149p233o835p198p376p017o599o374o073n489m495k832o81R19J173O80
59200E05719O02J101J543J777K160K665K999L286L719L949L795L962M937N774
59186E47988N267L902L154L285L297K924L020L854M532M402L853L390L091L112
59172E99071L742M722N446N883O424O903O837O554O896P815Q453Q605Q875R285
$$ plain form
59269 645868 655468 666989 680050 693755 707597 721394 734532 745860 754291 759141 760145 757676
59257 757676 752691 745854 736852 725165 711317 696764 682621 669090 656030 643494 631718 621085
59245 621085 612063 604787 598932 594361 591523 590667 591151 592183 593748 595965 598134 599562 600988 603870 608294
59230 608294 612841 616556 619804 622931 625335 626305 625772 623724 619780 613833 606405 598003 588857 579569 571149
59215 571149 563916 557081 549883 542507 535490 528891 522517 516444 510955 506460 503628 502947 503866 505039 505719
59200 505719 506321 507422 508965 510742 512902 515567 518566 521852 525571 529520 533315 537277 542214 547988
59186 547988 553255 557157 560311 563596 566893 569817 572837 576691 581223 585625 589478 592868 595959 599071
59172 599071 602813 607535 612981 618864 625288 632191 639028 645582 652478 660293 668746 677351 686226 695511
59158F95511R069Q029O755N224K586j124m426o234p183q415r953j1058j1360j0933
59144F56488r873q472p322o705o368o085n979n942n520m637l859l539l337k882
59130E75968k243j458k99J105K009J961J501J496K226L415M706N789O382O500
59116F09058O480O615O953P490Q154Q650Q716Q486Q225P788O853N581M462L599
59102G07110K786K135J965K009J554L96r84k197l234l963m144m007m084m340m141
59087F86861l252k187j440r91p56r33j719l140n100p149q407q374p693p433p785
59072F20502q174q320q310p888o782n523m850m436l470k389k513l794m508l725
59058E45820k603k491k993k936k261j872k196k862l351l324k669j741j134q97
$$ plain form
59158 695511 704580 712609 719364 724588 727174 726050 721624 715390 708207 699792 689839 678781 667421 656488
59144 656488 646615 638143 630821 624116 617748 611663 605684 599742 594222 589585 585726 582187 578850 575968
59130 575968 573725 572267 571968 573073 575082 577043 578544 580040 582266 585681 590387 596176 602558 609058
59116 609058 615538 622153 629106 636596 644750 653400 662116 670602 678827 686615 693468 699049 703511 707110
59102 707110 709896 712031 713996 716005 717559 717955 716971 714774 711540 707577 703433 699426 695342 691002 686861
59087 686861 683609 681422 679982 678991 678235 677302 675583 672443 667343 660194 651787 643413 635720 628287 620502
59072 620502 612328 604008 595698 587810 581028 575505 570655 566219 562749 560360 557847 554053 549545 545820
59058 545820 543217 540726 537733 534797 532536 530664 528468 525606 522255 518931 516262 514521 513387 512490
59044E12490m76K91P78N81J95J77K99J05k51l18o5K63O83J324K052K575K759K676
59026E26138K625L108M320N638O220O167O499P789R518J0926J1684J1561J0260
59013F22453Q018N753M136K996J907P76l40j415k179k262j786j225o04M81K013
58998F38722L549N124P119R040R632Q630P309O625N998M661L213K713K965K772
58984G18072J517m28k463m135n038n100m785m422l563j625J073L538N248O587
58970G04476Q229J0407J2758J4515J5070J4574J3875J3735J4182J4667J4560J3549
58958H64597J1875J0177Q724O951M223Q81k233n089q456j2419j5928j8081j9037
58945H26185j9335j9159j8623j8022j7304j5967j3938j1904j0396r179p934o846
$$ plain form
59044 512490 512014 512305 513083 513664 513859 514036 514335 514440 514189 513871 513806 514069 514752 516076 518128 520703 523462 526138
59026 526138 528763 531871 536191 541829 548049 554216 560715 568504 578022 588948 600632 612193 622453
59013 622453 630471 636224 640360 643356 645263 646039 645699 644284 642105 639843 638057 636832 636228 636709 638722
58998 638722 642271 647395 654514 663554 673186 681816 689125 695750 701748 706409 709622 712335 715300 718072
58984 718072 719589 719161 716698 712563 707525 702425 697640 693218 689655 688030 689103 692641 697889 704476
58970 704476 712705 723112 735870 750385 765455 780029 793904 807639 821821 836488 851048 864597
58958 864597 876472 886649 895373 902324 906547 907428 905195 900106 891650 879231 863303 845222 826185
58945 826185 806850 787691 769068 751046 733742 717775 703837 691933 681537 672358 664424 657578
58933F57578o038n169m090l291l100k975k202r08J48M78J85k62l51O1M86L52j58
58916F30744l72k00j99n14o45m25k84k90J96J403K632L343L913M852O096P558
58900F57808R521J1826J3516J4000J3898J3982J4001J3331J2253J1739J2273J3566
58888H11714J5238J7222J9664K2619K5627K7570K7525K5811K3548K1078J7696
58877A055312J3124Q170L565q95n492r851j3713j7558k1628k5040k6661k6349
58865I32984k4747k2397j9671j7013j4615j2335j0302r043q629q382p893p595
58853G70362p844q293q664r305j0287j0751r972q474p350o967o939o899o692o344
58839F55581o279o972q011q224p166n788n084m917m649m124l449k575j738j492
$$ plain form
58933 657578 651540 646371 642281 638990 635890 632915 630713 629805 629953 630431 630616 630354 630003 630064 630550 630902 630744
58916 630744 630372 630172 629973 629459 628814 628389 628105 627815 628011 629414 632046 635389 639302 644154 650250 657808
58900 657808 667329 679155 692671 706671 720569 734551 748552 761883 774136 785875 798148 811714
58888 811714 826952 844174 863838 886457 912084 939654 967179 992990 1016538 1037616 1055312
58877 1055312 1068436 1076606 1080171 1079276 1073784 1063933 1050220 1032662 1011034 985994 959333 932984
58865 932984 908237 885840 866169 849156 834541 822206 811904 802861 794232 785850 777957 770362
58853 770362 762518 754225 745561 736256 725969 715218 705246 696772 689422 682455 675516 668617 661925 655581
58839 655581 649302 642330 634319 626095 618929 613141 608057 603140 598491 594367 590918 588343 586605 585113
58825E85113j713j415j26J358K286L025M050M907N118N316O318P719Q353P789
58811F38098O491N056L955L631L968M100L333J909M51q29j936k808l644m788n938
58796F51049o307n938n914o761p702q011p947p723o816n120l559k723j988q79
58782E73661pL24J076K860M565M945M459M120L683K462R93J69n35k236m590o164
58766E89785o480o299o205o202o390o719o505n306l856l037k482j391j14M55N45
58751E29799J147K290L082L229L239L331L260L122L305L804M376N105N971O428
58737E81488O224O063O592P291P347O962O783O667O098N161M215L238K416K480
58723F59025L375L645K306L79o88j042j428j363l6J874L114L796M692N430N227
$$ plain form
58825 585113 583400 581985 581859 583217 585503 588528 592578 597485 602603 607919 614237 621956 630309 638098
58811 638098 644589 649645 653600 657231 661199 665299 668632 670541 670992 670163 668227 665419 661775 656987 651049
58796 651049 644742 638804 632890 626129 618427 610416 602469 594746 587930 582810 579251 576528 574540 573661
58782 573661 573654 573978 575054 577914 582479 587424 591883 596003 599686 602148 603141 603310 602775 600539 595949 589785
58766 589785 583305 577006 570801 564599 558209 551490 544985 539679 535823 532786 530304 528913 528799 529254 529799
58751 529799 530946 533236 536318 539547 542786 546117 549377 552499 555804 559608 563984 569089 575060 581488
58737 581488 587712 593775 600367 607658 615005 621967 628750 635417 641515 646676 650891 654129 656545 659025
58723 659025 662400 666045 668351 668730 668042 667000 665572 664209 664173 666047 669161 672957 677649 683079 688306
58708F88306M732N060N571M680K491N15q91k713n082p034q433j0185j2330j3851
58694F50836j4522j5139j5748j5393j3853j1992j0222q225o377n680n961n792
58682E21932m622l554l473l853l861l445k879k265j827j756j652r68K5P34J396
58667D89932K692M414N808O894Q203R403R708R329R004Q275N978K395p19k417
58653E68899l279l801l666k949k504k705l021l146l416l856l993l769l543l194
58639E22057k240r11O7O59J450K482L298L892M537M986M948M872N050M570K649
58624E62366L19q49j069j542j976j063Q84K047J806J289J172J108J386K977N540
58609E74395P396P837P681P213N609K892N78k93l12l54n61r21j543k079k187k499
$$ plain form
58708 688306 693038 698098 703669 708349 710840 711355 710464 707751 702669 695635 687202 677017 664687 650836
58694 650836 636314 621175 605427 590034 576181 564189 553967 545742 539365 533685 527724 521932
58682 521932 517310 513756 510283 506430 502569 499124 496245 493980 492153 490397 488745 487777 487802 488536 489932
58667 489932 492624 497038 502846 509740 517943 527346 537054 546383 555387 563662 569640 572035 571316 568899
58653 568899 565620 561819 558153 555204 552700 549995 546974 543828 540412 536556 532563 528794 525251 522057
58639 522057 519817 518906 518973 519632 521082 523564 526862 530754 535291 540277 545225 550097 555147 559717 562366
58624 562366 562685 561836 560767 559225 557249 556186 557070 559117 560923 562212 563384 564492 565878 568855 574395
58609 574395 581791 589628 597309 604522 610131 613023 613601 613308 612996 612642 612081 611160 609617 607538 605351 602852
58593F02852l712m912m566k960j814j526q32P89K487L959N879Q118R534R910J0199
58578F33405J0580J0201R077Q232P685O340M274L035L253L962M663O021Q063R798
58564G28589J1090J2923J5411J7579J9435K2007K4934K6346K5695K4310K2621
58553I50940J9226J3659P671K821j083m254n916o050o055o522o318m827l285k913
58539I47094l642n424q831j3321j6917j8628j9506k0444k0761j9747j7771j5206
58527G66896j2087r291p998p469n654k521l59j16j36O88J248Q44O91J464J892
58512G28092J271R36J744K437K080J737K198K247Q44j046k333l485m845n443m887
58497G21547m407m556m073k470j463k194l303l322k815k439j260J137L060L235
$$ plain form
58593 602852 599140 594228 589662 586702 584888 583362 582530 583319 585806 589765 595644 603762 613296 623206 633405
58578 633405 643985 654186 663263 671495 679180 685520 689794 692829 696082 700044 704707 710728 718791 728589
58564 728589 739679 752602 768013 785592 805027 827034 851968 878314 904009 928319 950940
58553 950940 970166 983825 991496 994317 993234 988980 983064 977014 970959 964437 958119 953292 950007 947094
58539 947094 943452 938028 929197 915876 898959 880331 860825 840381 819620 799873 782102 766896
58527 766896 754809 745518 737520 730051 724397 721876 721517 721401 721265 721953 723201 724045 724736 726200 728092
58512 728092 729363 730299 732043 734480 736560 738297 740495 742742 743586 742540 740207 736722 731877 726434 721547
58497 721547 717140 712584 708511 706041 704578 702384 699081 695759 692944 690505 689245 690382 693442 696677
58483F96677K929L695N030O078P564J0084J2403J3544J4616J6636J8292J7914
58471H25462J5921J3392R973N190J71l825p016r594j0474r319p944p741p468n486
58457H01242k471J32K509N342P821Q901R225R947J0946J1646J2077J1652Q726
58444H97695L040k978p014r312j1015j1962j1674j0688r324o918l624j150l31
58431H14745J8P37J089J015J993M303O143O932Q492J1407J3340J2915J2014J2099
58417I07242J1468Q660N364L337J439j442l590l561l221m586o329o488o035o596
58403H95662p224o590n895o390o495m632k437j880j639K78K735L737M092N330
58389H68652O303N384L862L633L674K380J049J523K465J730K94J99P25K53j79
$$ plain form
58483 696677 699606 703301 708331 714409 721973 732057 744460 758004 772620 789256 807548 825462
58471 825462 841383 854775 864748 869938 870109 866284 859268 849674 839200 829881 821937 814196 806728 801242
58457 801242 798771 798903 801412 806754 814575 823476 832701 842648 853594 865240 877317 888969 897695
58444 897695 900735 897757 890743 881431 870416 858454 846780 836092 826768 819850 816226 815076 814745
58431 814745 814763 815500 816589 817604 819597 823900 830043 836975 845467 856874 870214 883129 895143 907242
58417 907242 918710 927370 932734 936071 937510 936068 932478 928917 925696 921110 914781 908293 902258 895662
58403 895662 888438 881848 875953 869563 863068 858436 855999 854119 852480 852758 855493 859230 863322 868652
58389 868652 874955 880339 884201 887834 891508 893888 894937 896460 898925 900655 900949 901148 901873 902126 901947
58374I01947J049K697K990L185N090P241P496P224Q834J1240J1884J1336J1751
58361I93964J2740J2787J2860J4554J6553J6898J6705J7592J7760J4923J0897
58350A158233Q833Q032O029L655L227L830L179K285L521N846O748O987Q710J0813
58336A239928J1087J0927J2872J5472J5743J4818J5812J8023J8630J8281J9408
58325A411001K0732J9146J5557J3233J1927R247O348O291Q110Q337P265P873R791
58312A554858J0043Q865R051J0639J1623J2647J5502J8449J8617J7469J8282K0063
58300A726108J9802J8752K0114K2541K2451K0949K1741K3989K4086K2766K3467
58289A966766K5426K5426K4684K6683K9961L0462K9386L1055L4749L6388L6556
$$ plain form
58374 901947 902996 905693 908683 911868 916958 924199 931695 938919 947753 958993 970877 982213 993964
58361 993964 1006704 1019491 1032351 1046905 1063458 1080356 1097061 1114653 1132413 1147336 1158233
58350 1158233 1167066 1175098 1181127 1184782 1188009 1191839 1195018 1197303 1200824 1206670 1213418 1220405 1229115 1239928
58336 1239928 1251015 1261942 1274814 1290286 1306029 1320847 1336659 1354682 1373312 1391593 1411001
58325 1411001 1431733 1450879 1466436 1479669 1491596 1500843 1507191 1513482 1521592 1529929 1537194 1545067 1554858
58312 1554858 1564901 1573766 1582817 1593456 1605079 1617726 1633228 1651677 1670294 1687763 1706045 1726108
58300 1726108 1745910 1764662 1784776 1807317 1829768 1850717 1872458 1896447 1920533 1943299 1966766
58289 1966766 1992192 2017618 2042302 2068985 2098946 2129408 2158794 2189849 2224598 2260986 2297542
58278B297542L8832M2003M2162M0850M2624M6284M7222M6652M9466N4612N7045
58267B805294N7621O1270O6834O8804O8035P0367P5621P8301P8528Q1591Q7254
58256C599520R0190R0528R3173R7246R7225R4174R4650R8905J01464J02689J08013
58245D667777J16401J21676J24749J32156J43270J51701J58373J69748J84088
58236E969939J93697J99944K11281K27101K38999K47479K61275K80465K96981
58227H127161L11615L33149L60678L84870M06715M36283M72983N06874N39520
58218A1879848N82570O35514O86991P38529Q03691Q83264R66004J054773J165574
58209A9396758J299756J445174J606172J802794K039003K303477K603665K965902
$$ plain form
58278 2297542 2336374 2378377 2420539 2461389 2504013 2550297 2597519 2644171 2693637 2748249 2805294
58267 2805294 2862915 2924185 2991019 3059823 3127858 3198225 3273846 3352147 3430675 3512266 3599520
58256 3599520 3689710 3780238 3873411 3970657 4067882 4162056 4256706 4355611 4457075 4559764 4667777
58245 4667777 4784178 4905854 5030603 5162759 5306029 5457730 5616103 5785851 5969939
58236 5969939 6163636 6363580 6574861 6801962 7040961 7288440 7549715 7830180 8127161
58227 8127161 8438776 8771925 9132603 9517473 9924188 10360471 10833454 11340328 11879848
58218 11879848 12462418 13097932 13784923 14523452 15327143 16210407 17176411 18231184 19396758
58209 19396758 20696514 22141688 23747860 25550654 27589657 29893134 32496799 35462701
58201C5462701L402292L915871M540087N333104O332882P560842R065842J0915427
58193H6529048J3156130J5851445J9155337K3274027K8341974L4316492M0729521
58186B61353974M6146759M7910273M3141741L0838981J3216446n328691k0855249
58179D16424234l1673004l8015409m0689182m0370499l7771306l3801871k9325347
58172A64777616k4904042k0838327j7295226j4324552j1865266r833999q183556
58165E7532648o863790n793629m907085m181190l595105l104957k680015k323760
58157B4083117k038192j800575j591943j416503j276445j155918j044204r48447
58149A2810890q70570p96241p18512o49019n94559n44439m91362m43650m06541
$$ plain form
58201 35462701 38864993 42780864 47320951 52654055 58986937 66547779 75613621 86529048
58193 86529048 99685178 115536623 134691960 157965987 186307961 220624453 261353974
58186 261353974 307500733 355411006 398552747 429391728 442608174 437279483 416424234
58179 416424234 384751230 346735821 306046639 265676140 227904834 194102963 164777616
58172 164777616 139873574 119035247 101740021 87415469 75550203 65716204 57532648
58165 57532648 50668858 44875229 39968144 35786954 32191849 29086892 26406877 24083117
58157 24083117 22044925 20244350 18652407 17235904 15959459 14803541 13759337 12810890
58149 12810890 11940320 11144079 10425567 9776548 9181989 8637550 8146188 7702538 7295997
58140G295997l71465l34155l04646k89143k78903k66137k54777k47080k35638
58131D714053k17292k00291j89551j78646j63576j50663j43626j36165j24533
58122C209710j14737j10490j06240r8628r2929r1719q8832q0892p3683p0926o7651
58111B212983o0742n5391n5020n4855n1421m8658m9017m8116m3820m1195m2907
58100A661841m3812m0501l7295l7414l6987l3235l0126l0465l0499k7638k5603
58089A288266k6762k7061k3765k0667k0667k0566j8103j6875j9222k1310k0215
58078A053053j9072k0433k1244j9231j7695j9143k0489j9153j7740j8243j7882
58067H42728j5116j3470j5012j6063j3914j1611j1701j1366q436o246p638r818
$$ plain form
58140 7295997 6924532 6590377 6285731 5996588 5717685 5451548 5196771 4949691 4714053
58131 4714053 4496761 4296470 4106919 3928273 3764697 3614034 3470408 3334243 3209710
58122 3209710 3094973 2984483 2878243 2779615 2686686 2594967 2506135 2425243 2351560 2280634 2212983
58111 2212983 2152241 2096850 2041830 1986975 1935554 1886896 1837879 1789763 1745943 1704748 1661841
58100 1661841 1618029 1577528 1540233 1502819 1465832 1432597 1402471 1372006 1341507 1313869 1288266
58089 1288266 1261504 1234443 1210678 1190011 1169344 1148778 1130675 1113800 1094578 1073268 1053053
58078 1053053 1033981 1013548 992304 973073 955378 936235 915746 896593 878853 860610 842728
58067 842728 827612 814142 799130 783067 769153 757542 745841 734475 726039 719793 712155 702337
58055G02337r845r726j1419j2318j0436q741r606j0126p695n128n413o304m988
58042E90592l416m129n240m339l167l834m518l397k692m398o090n400m566o133
58028E29273q125p885o951p621q468p594o721p708q561p177n572o089o904n579
58014D28318l707l708m231l136j937k860m336l742j995j376j381m96M12J96K13
57999C96234J555K275Q03p71l96J07j485l616m050m041n360o294m824k965l492
57984C63680m908m153j996j265j782j395l40l18p96k22N43j76j320p82P27J017
57968C46514K44Q3M84M78P62K309L812L634K800L160M136M124L508L355K884J082
57952C83369p83j153q63j218j337k74M43o24j810j088L49M89K96J592L175K806
$$ plain form
58055 702337 692492 682766 671347 659029 648593 639852 630246 620120 612425 607297 601884 595580 590592
58042 590592 587176 583047 577807 573468 570301 566467 561949 558552 555860 551462 545372 539972 535406 529273
58028 529273 521148 513263 506312 498691 490223 482629 475908 468200 459639 452462 446890 440801 433897 428318
58014 428318 424611 420903 416672 413536 411599 408739 404403 400661 398666 397290 395909 395413 395825 396021 396234
57999 396234 397789 400064 400867 400096 399700 399807 398322 394706 390656 386615 381255 374961 370137 367172 363680
57984 363680 358772 354619 352623 351358 349576 348181 347841 347523 346727 346505 347048 346872 345552 344770 345497 346514
57968 346514 346758 346841 347325 347803 348565 350874 354686 358320 361120 364280 368416 372540 376048 379403 382287 383369
57952 383369 382586 381433 380570 379352 378015 377741 378184 377560 375750 374662 375011 375500 375796 377388 380563 383369
57936C83369J381J438K909L931M505N787P059O791N613M980M149J685j312k731
57922D29554l038m080n585o060n985o844q003p768o560n979n764m670l252k775
57908C53191k470r22R89J515J199J515J709K03k022k838k628l208m215l976k949
57893C35093k853l227k403j048j219k485k589j450j007j486j248k01L3p29j082
57878C12099q64j159j640j006J4p55l280n139n133m358l736l068k569k750k818
57863B73838j637j03l5j020j015K28J025R26J264K511L649M281N005N752N935
57848C00604N998O591O722N072K682J699K023J844J016R78J657J449K80k12L46
57833C38749O34L15M09R18O67k28k67Q42J848K289K807L184K547J529J715K846
$$ plain form
57936 383369 384750 386188 389097 393028 397533 403320 410379 417170 422783 427763 431912 433597 432285 429554
57922 429554 426516 422436 416851 410791 404806 397962 389959 382191 375631 369652 363888 359218 355966 353191
57908 353191 350721 349799 350788 352303 353502 355017 356726 356929 354907 352069 349441 346233 342018 338042 335093
57893 335093 332240 329013 326610 325562 324343 321858 319269 317819 316812 315326 314078 313877 313910 313181 312099
57878 312099 311235 310076 308436 307430 307444 306689 303409 298270 293137 288779 285043 281975 279406 276656 273838
57863 273838 272201 272098 272063 271043 270028 270256 271281 272207 273471 275982 279631 283912 288917 294669 300604
57848 300604 306602 313193 319915 324987 327669 329368 331391 333235 334251 335229 336886 338335 338615 338403 338749
57833 338749 339383 339698 340107 341025 341692 341464 341197 342039 343887 346176 348983 352167 354714 356243 357958 360804
57817C60804L125K339K102K760K699J097j016k856m816o894q251q679q690q193
57803C25531o962o044o468o938n347k330o05r33j471j167r44j190r25m0K46k36
57787B84177j13J072K183K729L466M360M319L480L467M808O079O259N908N585
57773C37779N071M500M386M291L278J778J024Q13r6j616k597l298m952p097q042
57758C35222q013q998j1223j2633j2211j1043r666p272m104j828q06L60K057L062
57744B52904L212L787M698M222K339J198J475J343J40j78J345K689K187J097J063
57729B83521J599J831K313L291L483K389J635K261K847K118J257J637K284J717
57715C14183N08L3J19j16m18k58l04j318k644l186k939k356j410m01k67r67r49
$$ plain form
57817 360804 363929 366268 368370 371130 373829 374926 373910 371054 366238 359344 351093 342414 333724 325531
57803 325531 318569 312525 306057 299119 293772 291442 290837 289904 288433 287266 286322 285132 284207 284167 284413 284177
57787 284177 284064 285136 287319 290048 293514 297874 302193 305673 309140 313948 320027 326286 332194 337779
57773 337779 342850 347350 351736 356027 359305 361083 362107 362920 362824 361208 358611 355313 350361 343264 335222
57758 335222 327209 318211 306988 294355 282144 271101 261435 254163 250059 248231 247425 247785 249842 252904
57744 252904 256116 259903 264601 268823 271162 272360 273835 275178 275318 275140 276485 279174 281361 282458 283521
57729 283521 285120 286951 289264 292555 296038 298427 300062 302323 305170 307288 308545 310182 312466 314183
57715 314183 314691 314724 314843 314727 314309 314051 313747 312429 309785 306599 303660 301304 299894 299493 299226 298259 297310
57698B97310O14K432L057K819K685K641K330J952J449K09j498k340k009j738j917
57683C07996j229P79K446K744L131M989P269Q573R682J2008J5218J8538K2928
57670D15072K9703L8294M7619N8367P1102Q2327Q4861P2926M6381J0896k4653
57659I32895n2051o7381p1858o9043o1928n2722m3546l5665k8832k2631j7658
57648D09580j4395j1989r346o589m380k706j402q38j059j149n15K61P10J515L116
57633C60814M474M429L318K148J136K13j82L3r8j182k336k473j804j115o21m38
57617C66316r19j556r77R22K184J505K00Q7R12J461J814K561K934J816j35j195
57601C77930r32k77K18O23O80Qj044j878k455k773k377j435j215k278l232k633
$$ plain form
57698 297310 297924 300356 303413 306232 308917 311558 313888 315840 317289 317498 316000 313660 311651 309913 307996
57683 307996 306767 307546 309992 312736 315867 320856 328125 336698 346380 358388 373606 392144 415072
57670 415072 444775 483069 530688 589055 660157 742484 827345 900271 946652 957548 932895
57659 932895 880844 813463 741605 672562 610634 557912 514366 478701 449869 427238 409580
57648 409580 395185 383196 373850 367261 362881 360175 358773 357935 356876 355727 355212 355473 356183 357698 360814
57633 360814 365288 369717 373035 375183 376319 376532 376350 376383 376285 375103 372767 370294 368490 367375 366754 366316
57617 366316 365397 363841 362864 363786 365970 367475 367675 367762 368674 370135 371949 374510 377444 379260 379125 377930
57601 377930 376998 376721 376939 377562 378242 378250 377206 375328 372873 370100 367723 366288 365073 362795 359563 356930
57585C56930j120j70K40J077K149K319J365J45p47j232j102l74K68L83M90R53
57569C61574R99P6q66p13Q5M26L25M20N99N87J021K341L505L370K602K594L222
57552C82167L354K978L052L721M259M450M497M047K785J542J335J739J729J570
57538D23225K304L750M651M522L920L117J985R58O84R23R44O88M99J67m31m21
57522D51485R31K744L642L787M274N066N227M770M579M786M828M815N223N518
57508E11675M774L470K960L302L330K744K394K528K501K270K515L081K981K201
57494E52726J857K227K250J467R58J614K767L311L139K868K822K943L164L446
57480E87559L765M154M474M362L906L905M725N414M820L228J883J317J149J238
$$ plain form
57585 356930 355810 355640 355880 356957 359106 361425 362790 362935 362188 360956 359854 359480 359748 360131 360621 361574
57569 361574 362573 362649 361783 361070 361155 361581 361906 362326 362925 363512 364533 366874 370379 373749 376351 378945 382167
57552 382167 385521 388499 391551 395272 399531 403981 408478 412525 415310 416852 418187 419926 421655 423225
57538 423225 425529 429279 433930 438452 442372 445489 447474 448432 449116 450039 450983 451671 452170 452337 451906 451485
57522 451485 452416 455160 458802 462589 466863 471929 477156 481926 486505 491291 496119 500934 506157 511675
57508 511675 516449 519919 522879 526181 529511 532255 534649 537177 539678 541948 544463 547544 550525 552726
57494 552726 554583 556810 559060 560527 561485 563099 565866 569177 572316 575184 578006 580949 584113 587559
57480 587559 591324 595478 599952 604314 608220 612125 616850 622264 627084 630312 632195 633512 634661 635899
57466F35899J795K589L086L312L663M027M017L814L929M388M932N631O428O688
57452F94198O092N417N439N709N480N064N103N295N213N538O915Q304Q270P253
57438G79290O752O803O229N082M733N555O490O984P550Q224Q292P773P442P243
57424H74442O370N198N275O980Q770R370R120Q740Q243P693P603P900P757O998
57410I80459O584P116P948Q324Q415Q685R120R513R717R412Q363P086O448O619
57396A093809P181Q060R369J0544J0815J0371R975R697R233R117J0049J1364J1800
57383A221384J1684J2453J4035J4650J3577J2180J1647J1505J1027J0510J0333
57372A354985J0142R792R797J0278J0599J0615J1037J1956J2369J1819J1245J1518
$$ plain form
57466 635899 637694 640283 643369 646681 650344 654371 658388 662202 666131 670519 675451 681082 687510 694198
57452 694198 700290 705707 711146 716855 722335 727399 732502 737797 743010 748548 755463 763767 772037 779290
57438 779290 786042 792845 799074 804156 808889 814444 820934 827918 835468 843692 851984 859757 867199 874442
57424 874442 880812 886010 891285 898265 907035 916405 925525 934265 942508 950201 957804 965704 973461 980459
57410 980459 987043 994159 1002107 1010431 1018846 1027531 1036651 1046164 1055881 1065293 1073656 1080742 1087190 1093809
57396 1093809 1100990 1109050 1118419 1128963 1139778 1150149 1160124 1169821 1179054 1188171 1198220 1209584 1221384
57383 1221384 1233068 1245521 1259556 1274206 1287783 1299963 1311610 1323115 1334142 1344652 1354985
57372 1354985 1365127 1374919 1384716 1394994 1405593 1416208 1427245 1439201 1451570 1463389 1474634 1486152
57360A486152J2228J2652J2915J3420J4046J4506J4790J4821J4479J4195J4602
57349A638806J5494J6066J6255J6663J7136J6797J5669J4781J4464J4030J3432
57338A809593J3672J5003J6334J7002J7651J8658J9188J8636J7661J7055J6781
57327A997234J6788J7389J8163J7920J6563J5638J6191J7408J8197J8698J9323
57316B189512J9632J9351J9201J9617J9770J9000J8157J8258J8922J9245J9372
57305B400037J9968K0920K1699K2275K2686K2420K1299K0242K0207K0966K1832
57294B634551K2804K4025K4884K4744K4026K3652K3850K4248K4614K4740K4249
57283B900387K3278K2685K2863K3014K2329K1176K0353J9935J9750K0130K1291
$$ plain form
57360 1486152 1498380 1511032 1523947 1537367 1551413 1565919 1580709 1595530 1610009 1624204 1638806
57349 1638806 1654300 1670366 1686621 1703284 1720420 1737217 1752886 1767667 1782131 1796161 1809593
57338 1809593 1823265 1838268 1854602 1871604 1889255 1907913 1927101 1945737 1963398 1980453 1997234
57327 1997234 2014022 2031411 2049574 2067494 2084057 2099695 2115886 2133294 2151491 2170189 2189512
57316 2189512 2209144 2228495 2247696 2267313 2287083 2306083 2324240 2342498 2361420 2380665 2400037
57305 2400037 2420005 2440925 2462624 2484899 2507585 2530005 2551304 2571546 2591753 2612719 2634551
57294 2634551 2657355 2681380 2706264 2731008 2755034 2778686 2802536 2826784 2851398 2876138 2900387
57283 2900387 2923665 2946350 2969213 2992227 3014556 3035732 3056085 3076020 3095770 3115900 3137191
57272C137191K2560K3205K3500K4037K4616K4703K4576K4995K6039K7111K7829
57261C410362K8265K8591K9041K9894L1014L1732L1706L1433L1552L2090L2746
57250C748426L3331L3580L3227L2571L2369L2749L3005L2780L2591L2767L2869
57239D110265L2665L2702L3273L3725L3498L3021L2879L2903L2695L2340L1999
57228D471965L1561L1204L1410L1870L1465K9975K8735K8826K9627K9916K9452
57217D806006K8554K7127K5120K3096K1451J9854J8226J7228J6990J6430J4971
57206E035053J3786J4109J5232J5713J5687J6459J8272K0043K1127K1908K2662
57195E230051K2942K2386K1331K0486K0282K0462K0187J8960J7560J7224J7818
$$ plain form
57272 3137191 3159751 3182956 3206456 3230493 3255109 3279812 3304388 3329383 3355422 3382533 3410362
57261 3410362 3438627 3467218 3496259 3526153 3557167 3588899 3620605 3652038 3683590 3715680 3748426
57250 3748426 3781757 3815337 3848564 3881135 3913504 3946253 3979258 4012038 4044629 4077396 4110265
57239 4110265 4142930 4175632 4208905 4242630 4276128 4309149 4342028 4374931 4407626 4439966 4471965
57228 4471965 4503526 4534730 4566140 4598010 4629475 4659450 4688185 4717011 4746638 4776554 4806006
57217 4806006 4834560 4861687 4886807 4909903 4931354 4951208 4969434 4986662 5003652 5020082 5035053
57206 5035053 5048839 5062948 5078180 5093893 5109580 5126039 5144311 5164354 5185481 5207389 5230051
57195 5230051 5252993 5275379 5296710 5317196 5337478 5357940 5378127 5397087 5414647 5431871 5449689
57184E449689J7884J6801J5593J4961J4049J2138J0179R276Q832P620N788M297
57172E587107L139J526n91k577m168n300n454m351k822j873j412r32p11j211j957
57157E558413k314k744l921n219n515n021m869n301n672n963o793q156r464j0821
57143E476640j3002j6242k0104k4295k8612l2388l5188l7679m0662m3541m5020
57132E139907m5009m4496m3835m2573m0833l9400l8326l6793l4635l2796l1959
57121D709252l1604l0706k8724k5838k2882k0895k0008j8931j6201j1532n275
57110D476656K848J3386K6004L9852N4907P1955R1648J14791J43264J79289K23883
57099E438483K77213L40554M16802N09054O19622P50391R02727J076337J268463
$$ plain form
57184 5449689 5467573 5484374 5499967 5514928 5528977 5541115 5551294 5560570 5569402 5577022 5582810 5587107
57172 5587107 5590246 5591772 5591181 5588604 5584436 5579136 5573682 5569331 5566509 5564636 5563224 5562292 5561581 5560370 5558413
57157 5558413 5556099 5553355 5549434 5544215 5538700 5533679 5528810 5523509 5517837 5511874 5505081 5496925 5487461 5476640
57143 5476640 5463638 5447396 5427292 5402997 5374385 5341997 5306809 5269130 5228468 5184927 5139907
57132 5139907 5094898 5050402 5006567 4963994 4923161 4883761 4845435 4808642 4774007 4741211 4709252
57121 4709252 4677648 4646942 4618218 4592380 4569498 4548603 4528595 4509664 4493463 4481931 4476656
57110 4476656 4479504 4492890 4518894 4558746 4613653 4685608 4777256 4892047 5035311 5214600 5438483
57099 5438483 5715696 6056250 6473052 6982106 7601728 8352119 9254846 10331183 11599646
57090A1599646J474210J687286J900559K106023K293602K449846K558942K605698
57082B8675812K576819K459645K243309J924968J515254J036269N14705k2636
57074D0924145n50043j044927j490327j873626k182848k406787k539835k585059
57066B6250693k552182k454287k306620k125669j926782j722484j522693j334947
57058A0305029j163579j009932q74083p55839o54118n66938m92581m29809l76791
57049C981359l31142k91407k57342k28395k03199j80864j61493j45040j30815
57040B051662j18454j08032r8918q9756p9954p0061o0478n1049m1935l3295k4000
57029A275730j2275K386J9853M1156O5761Q5605Q6189N8241Q079m5994q7402j10307
$$ plain form
57090 11599646 13073856 14761142 16661701 18767724 21061326 23511172 26070114 28675812
57082 28675812 31252631 33712276 35955585 37880553 39395807 40432076 40946781 40924145
57074 40924145 40374102 39329175 37838848 35965222 33782374 31375587 28835752 26250693
57066 26250693 23698511 21244224 18937604 16811935 14885153 13162669 11639976 10305029
57058 10305029 9141450 8131518 7257435 6501596 5847478 5280540 4787959 4358150 3981359
57049 3981359 3650217 3358810 3101468 2873073 2669874 2489010 2327517 2182477 2051662
57040 2051662 1933208 1825176 1726258 1636502 1556548 1486487 1426009 1374960 1333025 1299730 1275730
57029 1275730 1263455 1265841 1285694 1326850 1392611 1478216 1564405 1622646 1630725 1584731 1497329 1387022
57017A387022j17566j14358j04993r2843q0329o8613n8003m8658m0815l4686l0275
57006E95883k7096k4234k0960j7370j4143j1806j0430r753r399r067q684q199
56994D24742p301n706l700j942o33O13K087L726N597P988J0771J3208J4513J4095
56980D78058J1277N671j839r193j4640j7734j8784j8099j6130j3674j1348r168
56968C64397o978m885k993j098J064L505O097Q751J1431J4299J7668K1321K3967
56955D56546K3831J9833J2067J660r222j7867k2641k4119k3898k2662k0263j7192
56943C56073j4471j2162r381n989k924n53K079N813J0333J5018J9842K4889K9699
56930D18266L3362L4482L1033K1642P614p230j9323k7339l1439l2006k9865k6566
$$ plain form
57017 1387022 1269456 1155098 1050105 957262 876933 808320 750317 701659 660844 626158 595883
57006 595883 568787 544553 523593 506223 492080 480274 469844 460091 450692 441625 432941 424742
56994 424742 417441 411735 408035 406093 405460 406073 408160 411886 417483 425471 436242 449450 463963 478058
56980 478058 489335 495006 493167 483974 469334 451600 432816 414717 398587 384913 373565 364397
56968 364397 357419 352534 349541 348443 349507 353012 359109 367860 379291 393590 411258 432579 456546
56955 456546 480377 500210 512277 513937 504715 486848 464207 440088 416190 393528 373265 356073
56943 356073 341602 329440 320059 314070 311146 310593 312672 318485 328818 343836 363678 388567 418266
56930 418266 451628 486110 517143 538785 546399 539169 519846 492507 461068 429062 399197 372631
56918C72631k3375k0454j7565j4903j2655j0521q296o449n490n241n132m811m182
56905B33557l325k583k255k048j421m57K95Q37J644K660L301L579M184N385O893
56890B50246Q877J1884J5556J8751K1209K3587K5324K4070J8205Q953q58r133
56878D16671j4990j8115j8733j7584j5174j1582p354l536m27K798O602J0357J3653
56865C42586J7247K1992K7801L4446M2207N0769N8170O1599N8588M7444K8265
56854G91114M538j7689l3699m2736m6287m5367m0648l3829k6831k0155j3266o053
56842D69092J268Q972J7232K5339L2916M1348N2540O6492Q1177R4097J02224J00802
56830A093499Q4849N3464J2318k8826o1280q0969q8610q7504q1040p1511o0453
$$ plain form
56918 372631 349256 328802 311237 296334 283679 273158 264862 258413 252923 247682 242550 237739 233557
56905 233557 230232 227649 225394 223346 221925 221468 221763 222600 224244 226904 230205 233784 237968 243353 250246
56890 250246 259123 271007 286563 305314 326523 350110 375434 399504 417709 426662 425804 416671
56878 416671 401681 383566 364833 347249 332075 320493 313139 309603 309176 311974 318576 328933 342586
56865 342586 359833 381825 409626 444072 486279 537048 595218 656817 715405 762849 791114
56854 791114 795652 777963 744264 701528 655241 609874 569226 535397 508566 488411 475145 469092
56842 469092 470360 479332 496564 521903 554819 596167 648707 715199 796376 890473 992697 1093499
56830 1093499 1178348 1231812 1244130 1215304 1154024 1073055 984445 896941 815901 744390 683937
56819F83937m9133l8421k8602j9702j1701m225L438J1726K0546K9830L9843N0664
56807F88200O1493P0163P2749O4506M3203J2369j9883m6052o3018p1213p2195
56796G40322o7924o0776n2603m4028l5368k7439k0827j5212j0071n272m62N082
56784D05422J1433J7865K4182L0791L6655L8629L4032K2987P613r578k5537l6857
56772E57637m2061m2853m1682l9091l4747k9712k5611k2423j9047j5530j2929
56761B31951j1357r922q402p364o752n865m676l880l683l618l477l380l144k561
56747A53870k017j890j732r39K27J150J735J912J091o58j849j336j11J41m70n89
56731A48535k2J89k60o37o49o99o59K6J072J567J465J567K047K242J888J374R08
$$ plain form
56819 683937 634804 596383 567781 548079 536378 532153 535591 547317 567863 597693 637536 688200
56807 688200 749693 819856 892605 957111 1000314 1012683 992800 946748 883730 812517 740322
56796 740322 672398 611622 559019 514991 479623 452184 431357 416145 406074 400802 400340 405422
56784 405422 416855 434720 458902 489693 526348 564977 599009 621996 629609 620031 594494 557637
56772 557637 515576 472723 431041 391950 357203 327491 301880 279457 260410 244880 231951
56761 231951 220594 210672 202270 194906 188154 182289 177613 173733 170050 166432 162955 159575 156431 153870
56747 153870 151853 149963 148231 147292 147519 148669 150404 152316 153407 152749 150900 149564 149453 149594 149124 148535
56731 148535 148513 148702 148442 147805 147156 146457 145798 145824 146896 148463 149928 151495 153542 155784 157672 159046 159954
56714A59954M27J73K79J06q30j686j276J18J259J823K371K825K518J627J057R64
56698A71709P40K72n6l58r16j182n48K53R2n26j94R30J228K88n15l27J06L3k00
56679A70829j94j76k12MK41j32r04j153q46r21j636k058j541m56O53J465J448
56662A64411L68p84p44R2K21n78j018n70j61l27m67l56o40j289j213j08R39J268
56644A59044J587K376K944K867K866L419L770L235K344J838J668J632J929K356
56630A93875K162J341Q93J136R75k51j457j356l11L29M8o24j101j202j082j134
56614A92241j532j749j243n49o37j220j017Q5O67l2j046j451j682k328k927k872
56598A72708k386j818r67P5N80L41J25K55l0r95j478o27N69P11J6k02N45J608
$$ plain form
56714 159954 160381 160554 160833 160939 160109 158423 157147 157265 158524 160347 162718 165543 168061 169688 170745 171709
56698 171709 172449 172721 172665 172307 171391 170209 169661 169914 170006 169480 169286 170216 171444 171732 171217 170890 170996 171029 170829
56679 170829 170635 170459 170247 170251 170492 170360 169456 168303 167457 166536 164900 162842 161301 160845 161498 162963 164411
56662 164411 164779 163995 163251 163343 163564 162986 161968 161398 161237 160910 160443 160087 159447 158158 156945 156837 157776 159044
56644 159044 160631 163007 165951 168818 171684 175103 178873 182108 184452 186290 187958 189590 191519 193875
56630 193875 196037 197378 198271 199407 200382 200131 198674 197318 197007 197336 197384 196760 195659 194457 193375 192241
56614 192241 190709 188960 187717 187168 186531 185311 184294 184379 185046 185014 183968 182517 180835 178507 175580 172708
56598 172708 170322 168504 167537 167612 168192 168533 168658 168913 168883 167888 166410 165783 166352 167063 167079 166877 167422 169030
56580A69030K335K499K135J626J510J651J199o2j057p57N23J813K677L103K986
56565A91211K526K554L656N299O468O921P374Q669J0834J2590J2049Q535L659
56552B82345k48k506l945m810m452l077k038j909j889j600j862k953l698l243
56538B44115k378k122k252k183k115k308k268j664j077j046j293j588k261l078
56524B16482k878j337J40K94k74l26K09O60R01J030O60l15j061r47n65o43q18
56507B11212m54J09J82r1j94j84l08l65k12k18m76m14O9P9q00j573j282m51o5
56488B04564o3Q5K40J06Q7N11Q02M58P0L32P53M83l11q42q82o04N4R71J498J381
56468B09693J288J651J837J343Q52J113J645J597J110Q09P07N89P70J506K298
$$ plain form
56580 169030 171365 173864 175999 177625 179135 180786 181985 181923 180866 180109 180632 182445 185122 188225 191211
56565 191211 193737 196291 199947 205246 211714 218635 226009 234678 245512 258102 270151 278686 282345
56552 282345 282097 279591 275646 270836 266384 263307 261269 259360 257471 255871 254009 251056 247358 244115
56538 244115 241737 239615 237363 235180 233065 230757 228489 226825 225748 224702 223409 221821 219560 216482
56524 216482 213604 212267 212407 212701 212427 212101 212310 212970 213871 214901 215561 215246 214185 213238 212673 212030 211212
56507 211212 210758 210867 211049 210958 210764 210580 210272 209907 209695 209477 209001 208587 208656 208735 207935 206362 205080 204629 204564
56488 204564 204501 204586 204826 204932 205019 205530 206332 206790 206860 207192 207945 208428 208117 207275 206393 205789 205843 206814 208312 209693
56468 209693 210981 212632 214469 215812 216664 217777 219422 221019 222129 222938 223645 224234 225004 226510 228808
56453B28808K519K142J276r3j374j526n93J63K00M28J292J813J440J127J308P29
56437B39659j228k748k041m6J160J315J328J037j24j219q99K21L54p03j565j546
56421B32955j117m95M87J349J429J087J099J297J132R54J300J656J366R44J014
56406B46457Q83j39r41j65J297J479M44L7Q94J845K138K231K408K392K336K585
56390B66181K667K011J355J804K851L036K192J355Q27J75k48L34J428J788J335
56375B89091Q34K0j890m121m922m221l653l812l563k310r91l57n0L06N52Q77J693
56358B63483K508K426J804J788K232J789K84p41k49J075K114K469K085J116L62
56343B84545N85J339J666J752K503L710M204L690K890K089J156P58J685L144L587
$$ plain form
56453 228808 231327 233469 234745 234652 233278 231752 231159 231322 231522 231950 233242 235055 236495 237622 238930 239659
56437 239659 238431 235683 233642 233596 234756 236071 237399 238436 238312 237093 236194 236415 236769 236066 234501 232955
56421 232955 231838 231343 231830 233179 234608 235695 236794 238091 239223 240177 241477 243133 244499 245443 246457
56406 246457 247340 247201 246260 246095 247392 248871 249315 249352 250246 252091 254229 256460 258868 261260 263596 266181
56390 266181 268848 270859 272214 274018 276869 279905 282097 283452 284279 284454 284206 284540 285968 287756 289091
56375 289091 289925 289945 288055 283934 279012 274791 271138 267326 263763 261453 260462 260105 260055 260361 260913 261790 263483
56358 263483 265991 268417 270221 272009 274241 276030 276314 275573 275324 276399 278513 280982 283067 284183 284545
56343 284545 285130 286469 288135 289887 292390 296100 300304 303994 306884 308973 310129 310887 312572 315716 319303
56328C19303L161L357M346M701L940L182K896K183Q63K59J047J985J712M72o56
56313C52751j050n67N90J598J654J090Q84J151J224J128J534K441L269M029N028
56298C76754N657N138M116L844M122L810L116L255M129M476M285M801O119O946
56284D40568O947P093P480P173O423O678P925Q440P795P759R358J1332J2428J3157
56270E60556J4226J5120J5384J5718J6786J8320K0086K2302K4595K6098K7129
56259G76320K9163L2723L6884M1214M6419N2742N9480O6570P4890Q4586R4920
56248A395911J05984J18615J32246J44906J55787J65718J74670J80971J83584
56239B758392J83041J79461J71695J59061J41846J19671R1661N8968K4880q279
$$ plain form
56328 319303 322464 325821 330167 334868 338808 341990 344886 347069 347932 348191 349238 351223 352935 353407 352751
56313 352751 351701 351134 351724 353322 354976 356066 356950 358101 359325 360453 361987 364428 367697 371726 376754
56298 376754 382411 387549 391665 395509 399631 403441 406557 409812 413941 418417 422702 427503 433622 440568
56284 440568 447515 454608 462088 469261 475684 482362 490287 498727 506522 514281 523639 534971 547399 560556
56270 560556 574782 589902 605286 621004 637790 656110 676196 698498 723093 749191 776320
56259 776320 805483 838206 875090 916304 962723 1015465 1074945 1141515 1216405 1300991 1395911
56248 1395911 1501895 1620510 1752756 1897662 2053449 2219167 2393837 2574808 2758392
56239 2758392 2941433 3120894 3292589 3451650 3593496 3713167 3804828 3863796 3888676 3880397
56229C880397m0206p0185r6195j17385j34888j49127j58711j63152j64267j63561
56219B622720j60443j54384j46660j38524j29568j19382j08992r9437r0513q2060
56209A392757p4739o8598o2602n6484n1238m7046m2729l7998l4113l1445k8661
56198H57104k5175k2134k0040j7838j5260j3625j3150j2109r897q326q428q543
56186F82579p162n280m299l771k925k273k190j906j254j295k000j654K13J769
56172F48552K031K394L625M103K835J498J608K193K122K286L519M774N197N680
56158F92417O649O891O247O691Q950J0826J0910J1019J2839J5120J6442J7864
56146H22865K0340K2556K3902K6687L2504L9341M5234N1953O1702P2788Q1926
$$ plain form
56229 3880397 3840191 3770006 3673811 3556426 3421538 3272411 3113700 2950548 2786281 2622720
56219 2622720 2462277 2307893 2161233 2022709 1893141 1773759 1664767 1565330 1474817 1392757
56209 1392757 1318018 1249420 1186818 1130334 1079096 1032050 989321 951323 917210 885765 857104
56198 857104 831929 809795 789755 771917 756657 743032 729882 717773 707876 699550 691122 682579
56186 682579 675417 670137 665838 662067 659142 656869 654679 652773 651519 650224 648224 646570 646783 648552
56172 648552 650583 652977 656602 660705 663540 665038 666646 668839 670961 673247 676766 681540 686737 692417
56158 692417 699066 705957 712204 718895 727845 738671 749581 760600 773439 788559 805001 822865
56146 822865 843205 865761 889663 916350 948854 988195 1033429 1085382 1147084 1219872 1301798
56135A301798Q8420R2584R2310Q5190P2614N8630M6108L6707L2415L3616L6940
56124A977332L8004L5180K8651J8203N010o579j2610j3813j3886j5405j9854k9159
56112A991074m3578n9576p2779q1753q6597q6253q0341p1534o2876n4347m4813
56101A246627l5339k7518k0679j3834q283n274l193k21K519L472L922N496O930
56088A154625O792O755Q502R982Q735O544O551Q045Q318P637Q078R326R847J0363
56074A270100J2170J3828J3595J3053J4363J6060J5870J5273J6787J8972J8944
56063A439015J7765J8440K0480K1348K1504K3029K4921K4703K3236K3145K4025
56052A681611K3839K3345K4352K5391K4062K1848K1779K3157K3565K3983K6718
$$ plain form
56135 1301798 1390218 1482802 1575112 1660302 1732916 1791546 1837654 1874361 1906776 1940392 1977332
56124 1977332 2015336 2050516 2079167 2097370 2102380 2095801 2083191 2069378 2055492 2040087 2020233 1991074
56112 1991074 1947496 1887920 1815141 1733388 1646791 1560538 1480197 1408663 1345787 1291440 1246627
56101 1246627 1211288 1183770 1163091 1149257 1140974 1135700 1132507 1132286 1134805 1138277 1142199 1147695 1154625
56088 1154625 1161417 1168172 1176674 1186656 1195391 1201935 1208486 1216531 1224849 1232486 1240564 1249890 1259737 1270100
56074 1270100 1282270 1296098 1309693 1322746 1337109 1353169 1369039 1384312 1401099 1420071 1439015
56063 1439015 1456780 1475220 1495700 1517048 1538552 1561581 1586502 1611205 1634441 1657586 1681611
56052 1681611 1705450 1728795 1753147 1778538 1802600 1824448 1846227 1869384 1892949 1916932 1943650
56041A943650L0240L1470L1273L2445L4263L4429L4260L6418L9640M1343M3073
56030B332504M7523N2550N4364N4275N5953N8490N8771N8264O0574O4465O6265
56019B963998O7016P0192P4694P7279P9540Q4929R1315R4197R4927R7881J02139
56008C898107J04154J05905J11661J19344J23991J27271J34244J43444J49784
55999E017905J54780J63707J75239J84189J91977K03641K17128K26866K35242
55990F770674K48912K66372K81340K95698L16182L41025L63338L85184M14246
55981I682971M49144M82616N16503N58329O05902O51628O99179P58948Q30021
55972A5235241R04654R87175J089190J209761J341062J489826J670993J884871
$$ plain form
56041 1943650 1973890 2005360 2036633 2069078 2103341 2137770 2172030 2208448 2248088 2289431 2332504
56030 2332504 2380027 2432577 2486941 2541216 2597169 2655659 2714430 2772694 2833268 2897733 2963998
56019 2963998 3031014 3101206 3175900 3253179 3332719 3417648 3508963 3603160 3698087 3795968 3898107
56008 3898107 4002261 4108166 4219827 4339171 4463162 4590433 4724677 4868121 5017905
55999 5017905 5172685 5336392 5511631 5695820 5887797 6091438 6308566 6535432 6770674
55990 6770674 7019586 7285958 7567298 7862996 8179178 8520203 8883541 9268725 9682971
55981 9682971 10132115 10614731 11131234 11689563 12295465 12947093 13646272 14405220 15235241
55972 15235241 16139895 17127070 18216260 19426021 20767083 22256909 23927902 25812773
55964B5812773K125230K405705K752087L174317L675983M286382N051755O002244
55956E5286476P162464Q583938J0326994J2429417J4950915J8038126K1886235
55949A48664565K6639636L2314923L8564016M4114717M6418423M2468998L0798437
55942D09983715J3062708o457980k3200371l4501554m0069889m1047129l8940379
55935B38829121l5103355l0583926k6063888k1895010j8232844j5135022j2575290
55928G9239786j0467556q731310p317417o174890n238433m460356l820859l298317
55920B9730648k859008k482217k167042j907365j684342j488156j323354j187450
55912A4631714j065966r53095q56583p77619p05282o35276n75700n29452m87892
$$ plain form
55964 25812773 27938003 30343708 33095795 36270112 39946095 44232477 49284232 55286476
55956 55286476 62448940 71032878 81359872 93789289 108740204 126778330 148664565
55949 148664565 175304201 207619124 246183140 290297857 336716280 379185278 409983715
55942 409983715 423046423 416588443 393388072 358886518 318816629 277769500 238829121
55935 238829121 203725766 173141840 147077952 125182942 106950098 91815076 79239786
55928 79239786 68772230 60040920 52723503 46548613 41310180 36849824 33028965 29730648
55920 29730648 26871640 24389423 22222381 20315016 18630674 17142518 15819164 14631714
55912 14631714 13565748 12612653 11756070 10978451 10273169 9637893 9062193 8532741 8044849
55903H044849m46569m11302l84152l58222l30743l07405k89756k71360k50160
55894D995180k31981k18475k03761j86277j72085j62983j52847j39167j27201
55885C400403j19212j10173r7802q7104q1582p9012p8714q3551r1720r5678r2410
55874B383445q6659q1670p5382o8027o4419o5487o5786o2590n9579n8791n6747
55863A638308n1625m6689m3617l9693l4450l1841l2776l2617k9173k6383k6915
55852A242529k7832k6724k5794k6469k6117k3499k1807k3025k4548k4265k3848
55841I68601k4316k3607k1160j9733k0161j9455j6592j4848j5869j6648j5129
55830G61083j3649j3975j3896j1789r846r829r966q906q510r969j1261j1054j1145
$$ plain form
55903 8044849 7598280 7186978 6802826 6444604 6113861 5806456 5516700 5245340 4995180
55894 4995180 4763199 4544724 4340963 4154686 3982601 3819618 3666771 3527604 3400403
55885 3400403 3281191 3171018 3073216 2986112 2904530 2825518 2746804 2663253 2571533 2475855 2383445
55874 2383445 2296786 2215116 2139734 2071707 2007288 1941801 1876015 1813425 1753846 1695055 1638308
55863 1638308 1586683 1539994 1496377 1456684 1422234 1390393 1357617 1325000 1295827 1269444 1242529
55852 1242529 1214697 1187973 1162179 1135710 1109593 1086094 1064287 1041262 1016714 992449 968601
55841 968601 944285 920678 899518 879785 859624 840169 823577 808729 792860 776212 761083
55830 761083 747434 733459 719563 707774 697928 688099 678133 669227 660717 650748 639487 628433 617288
55817F17288j2593j3389j2275j1023j0780j0081q489q019q984q699o328m659m926
55804D97043m487j930J45J00L61K648M530L961L036L926M939M037K644K566K472
55789E25991P41j272k012k656m191m582k193N86K82l334q371j3720j8242j9760
55775D47267j7714j4598j2454j0299o982l692j357J298M520N447K288k135m098
55762C87491l791l540l668l220k722l151l772l596l386m036m808n235o607r440
55748C26519j1739j1949j1350j1287j0593q195n814n261n366m341l036k947l120
55735B31521k048p40q96j660j170J29N37O0l03r35k588m293m693m344m423m497
55719A99657l716k836k775k661j497k95k35k93R82K868L923M535N639O476O076
$$ plain form
55817 617288 604695 591306 579031 568008 557228 547147 538658 530639 521655 512956 506628 501969 497043
55804 497043 492556 490626 490771 490871 491232 493880 498410 502371 505407 509333 514272 518309 520953 523519 525991
55789 525991 526732 525460 523448 520792 516601 512019 509826 510412 510694 507360 498989 485269 467027 447267
55775 447267 429553 414955 402501 392202 385220 381528 380171 381469 385989 391436 393724 391589 387491
55762 387491 383700 380160 376492 373272 370550 367399 363627 360031 356645 352609 347801 342566 335959 326519
55748 326519 314780 302831 291481 280194 269601 261406 255592 250331 244965 240624 237588 234641 231521
55735 231521 229473 228733 227837 226177 225007 225136 225673 225733 225430 224495 221907 217614 212921 208577 204154 199657
55719 199657 195941 193105 190330 187669 186172 185877 185642 185349 186331 189199 193122 197657 203296 209772 215848
55704B15848N417N511M922J930k226m955n945o538o790n994n053n336n989n097
55690A79705k927j407j050q91p92j331j921j434k46N61J335L079N234O420O645
55675A90980O638N867L566R27k22k76r21k073k263j487j081j112m57P19J058N11
55659B00374L43P64P79L67N75J398J679J240J065J293J020J75l30m12r50k022
55643B07358k760l065l675m504m651m130l884l992l583k713k593l623m700m911
55629A54574m530m099l662l223k948k737k422k191k050j348K16J646J847J203
55615A30276P72N05k83j344j867j927k168k488k462k518l149l483k313j87J173
55600A08537J185O86K60j41k89K6J30o54j643j748j280j232j367p69K50O21M98
$$ plain form
55704 215848 221265 226776 231698 233628 231402 226447 220502 213964 207174 201180 196127 190791 184802 179705
55690 179705 176778 175371 174321 173430 172638 171307 169386 167952 167706 168267 169602 172681 177915 184335 190980
55675 190980 197618 203485 207051 207978 207756 207480 206559 204486 202223 200736 199655 198543 198086 198805 199863 200374
55659 200374 200717 201481 202260 202627 203202 204600 206279 207519 208584 209877 210897 211072 210742 210330 209380 207358
55643 207358 204598 201533 197858 193354 188703 184573 180689 176697 173114 170401 167808 164185 159485 154574
55629 154574 150044 145945 142283 139060 136112 133375 130953 128762 126712 125364 125580 127226 129073 130276
55615 130276 131048 131553 131270 129926 128059 126132 123964 121476 119014 116496 113347 109864 107551 107364 108537
55600 108537 109722 110408 110668 110527 110238 110264 110394 109740 108097 106349 105069 103837 102470 101701 101951 102572 103070
55583A03070Q07J258Q16r0jJ062J598J213J242K429L951N025N841O509O713O682
55567A48125O988P182O132L857J592j12j786l432m175l866l525l885m710n641
55553A42744o397o229m687k866k285k571k013m42M12k88j265j324r05p63o29n7
55537A10435P24J448K208K717K386J516J209J700K061J876J781J896J343p3j140
55522A32087j086q44j516k631l000k599k602l875o068p934q338p242n698m556
55508G4098l516k105r82j126k121k591k139j550j197o90r4N4L1P63K112K842K547
55491F4336K177K282K228J599R72P31M60J07M03J467K141J545K46p24j110j095
55475G7765o56Q4O00O18M00J71j04l21l82o93j511k008j177L26P42k65j191j064
$$ plain form
55583 103070 103877 105135 105951 105861 105860 106922 108520 109733 110975 113404 117355 122380 128221 134730 141443 148125
55567 148125 155113 162295 168427 172284 173876 173764 171978 168546 164371 160505 156980 153095 148385 142744
55553 142744 136347 130118 125431 122565 120280 117709 115696 115254 115666 115378 114113 112789 111884 111121 110492 110435
55537 110435 111159 112607 114815 117532 119918 121434 122643 124343 126404 128280 130061 131957 133300 133227 132087
55522 132087 131001 130157 128641 126010 123010 120411 117809 113934 107866 99932 91594 84352 78654 74098
55508 74098 70582 68477 67495 66369 64248 61657 59518 57968 56771 56081 55987 56041 56072 56835 58947 61789 64336
55491 64336 66513 68795 71023 72622 73594 74325 74785 74892 75295 76762 78903 80448 80694 79970 78860 77765
55475 77765 77109 77193 77793 78411 78811 78982 78878 78557 78175 77482 75971 73963 72786 73112 73854 73589 72398 71334
55457G1334o79q98j250j035n28j71K88J053J575J393Q82N60L26q0n79j061j492
55440F9638j506p71J79M53K18M02R35O91m92j283q56J1M45P37J292J658J461J190
55422G4402J245J197P67M98P24R24Q06J007J841K394J769M13o71j181j315j116
55406H3704q36j047j645j634o50J69k42j291j600q86N4O43R30R97P45J92m91j014
55388G6098r98l74J60j62j024j353q39j63L25R74J684J734J147R19J335J425O95
55371H1583R3M04R73R44N93M66K11n89j408j577j389j415j500j310j145j286j277
55354G2371o82O1L60L58M22M19K17J25K96L81L21N28Q20L22q83j315k65Q95O50
55335G5401m94j108r97q50o50P5R82J309J124R99Q79M48M1P1J0q04j805j899j149
$$ plain form
55457 71334 70655 69757 68507 67472 66944 66773 67061 68114 69689 71082 71964 72524 72850 72770 72191 71130 69638
55440 69638 68132 67361 67540 67993 68211 68613 69548 70239 69747 68464 67608 67619 68064 68801 70093 71751 73212 74402
55422 74402 75647 76844 77611 78109 78833 79757 80563 81570 83411 85805 87574 87987 87316 86135 84820 83704
55406 83704 82868 81821 80176 78542 77892 78061 77819 76528 74928 74042 74096 74739 75669 76666 77411 77603 77112 76098
55388 76098 75100 74726 74886 74724 73700 72347 71508 71345 71670 72644 74328 76062 77209 78128 79463 80888 81583
55371 81583 81676 82080 83053 83997 84590 85056 85267 84678 83270 81693 80304 78889 77389 76079 74934 73648 72371
55354 72371 71689 71750 72110 72468 72890 73309 73526 73651 73947 74328 74649 75177 75997 76319 75436 74121 73856 74751 75401
55335 75401 74907 73799 72802 71952 71302 71377 72359 73668 74792 75791 76670 77118 77159 77230 77240 76436 74631 72732 71583
55316G1583n57m56l49j01p5j52K09R08J239J052J018J489J954J792J059K95j13
55299H0795k36m02o39m54M26J270J066J8o52n72o57j343j684r51J20N64N54O00
55281G7823N13K04L93J307J723P06o66q28j14On60n69L55J199J183N26l55j084
55263H1762r28N38K291K626J218n42j264p53L70J328J483Q02jl85p11j395j986
55246H4453j914j540j348q06O54K048J904N86k7P53J602J302K58n85j060j421
55230H4859j591j409r99n38m1M17P44J037J357J379P91j53r30j331j305p04J83
55213H1766M92n5n07p9N34L41j72J10R03Q81j54j031j099q24n30J3N47L66l14
55194H1188l87M14J047P87J42l05o81j040q98j69M49N62O93J254J753J610J023
$$ plain form
55316 71583 71026 70570 70221 70120 70045 69893 70102 71010 72249 73301 74319 75808 77762 79554 80613 80908 80795
55299 80795 80559 80157 79518 79064 79490 80760 81826 81844 81192 80620 79963 78620 76936 75985 76105 76669 77223 77823
55281 77823 78336 78540 78933 80240 81963 82669 82003 81175 81061 81067 80507 79938 80293 81492 82675 83201 82846 81762
55263 81762 80834 81372 83663 86289 87507 86965 85701 84948 85318 86646 88129 88931 88930 88545 87834 86439 84453
55246 84453 82539 80999 79651 78845 79499 81547 83451 84037 84010 84763 86365 87667 87925 87340 86280 84859
55230 84859 83268 81859 80860 80322 80281 80698 81442 82479 83836 85215 86006 85853 84923 83592 82287 81583 81766
55213 81766 82258 82203 81696 81617 82151 82492 82320 82430 83333 84214 84060 83029 81930 81106 80576 80589 81136 81502 81188
55194 81188 80801 81215 82262 83049 83191 82886 82205 81165 80267 80098 80547 81109 81802 83056 84809 86419 87442
55177H7442N18J62k45p83j462k193k526k055j194q05r44p65J03R73J198J024R54
55160G9402R46P58N12M69O47Q95J010O92p4o43l61L95N83nm59j48M29N26J49k23
55140H5500l20j33K14L29j54r12j126n32K00L65O9j16J26O59J049Q36N4n68l47
55121H5193M15P64L47k26l06L8K95Q1n43j017o86L54J147J060O37N94O13M2p04
55102H8098o51J17O23O40Q39J327J362P64L14M47O94P41R13J223J045K32m67n52
55084I7709l94l24r4K99L03j23j25P31J657J815J429J081O59j57j014j283r49
55067A01220n06l39n77j142j604j458q35l97l97m40l46l91m61J04J354K313K240
55050I8338J502O86k92j529k359k064r12K16P77O69m6q95j025j30R84J298P49
$$ plain form
55177 87442 87960 88122 87877 87094 85632 83439 80913 78858 77664 76859 75915 75150 75253 76226 77424 78448 79402
55160 79402 80348 81106 81618 82087 82734 83629 84639 85331 85257 84614 84253 84648 85231 85226 84767 84619 85048 85574 85723 85500
55140 85500 85180 85047 85261 85590 85436 84524 83398 82866 83066 83431 83500 83384 83510 84169 85218 86054 86108 85540 85193
55121 85193 85608 86372 86719 86493 86187 86225 86520 86601 86058 85041 84355 84709 85856 86916 87553 88147 88760 88802 88098
55102 88098 87447 87564 88187 88827 89666 90993 92355 93119 93433 93880 94574 95315 96228 97451 98496 98728 98261 97709
55084 97709 97315 96991 96897 97196 97499 97376 97251 97982 99639 101454 102883 103964 104623 104466 103452 102169 101220
55067 101220 100714 100375 99798 98656 97052 95594 94759 94362 93965 93525 93179 92788 92327 92431 93785 96098 98338
55050 98338 99840 100526 100234 98705 96346 94282 93370 93586 94363 95032 94986 94091 93066 92936 93920 95218 95967
55033I5967Q5p5L16Q66J008M92j80k67J52J82n83j459j689j356r47o19l35j05
55015I1453K01P50J224J045L67K9K95N09L18K53N93P02J20n44o08l59l75n54n99
54996I4820o90q85n46P13K126K698K467K045J533Q04L02M96R89J073Q03O11K61
54979A09620p07j819k060j392p58o25m95k2L58L47M51J266K463L004K284P60m88
54962A12187p71l48jj05l91n79p71j042j121q07l60j26m3J32L40L06k4l65l63
54943A05748P3N95O50J59k70j46J24n2l37K0P66Q83L09J20P13J103O58K11O57
54924A11984J440J568J220J321K077K996L891M959O110P008P511P534O853N587
54910A72059M351L366K020j20k461m200n364o282o720o371n715n471n574n389
$$ plain form
55033 95967 96052 95977 96293 97159 98167 98659 98479 98212 98364 98546 97963 96504 94815 93459 92512 91893 91558 91453
55015 91453 91654 92404 93628 94673 95040 95069 95364 95873 96191 96444 97037 97739 97859 97315 96707 96348 95973 95419 94820
54996 94820 94130 93245 92699 93412 95538 98236 100703 102748 104281 105085 105387 105883 106872 107945 108748 109359 109620
54979 109620 108913 107094 105034 103642 102884 102259 101764 101742 102100 102447 102898 104164 106627 109631 111915 112675 112187
54962 112187 111416 111068 111067 110962 110571 109992 109221 108179 107058 106251 105891 105765 105722 105854 106194 106500 106476 106111 105748
54943 105748 105821 106416 107066 107225 106955 106809 106933 106881 106544 106564 107330 108213 108522 108642 109355 110458 111116 111327 111984
54924 111984 113424 114992 116212 117533 119610 122606 126497 131456 137566 144574 152085 159619 166472 172059
54910 172059 176410 179776 181796 181676 179215 175015 169651 163369 156649 150278 144563 139092 133518 128129
54896A28129m633l427j952o58k37o70r41l88L32M33L23P29J188P15m26r16k12
54879A17389Q91J506J582J668K387M005N943P070P037O819P169P301O076L833
54865A80676J903O73o20k461m480o187p236p267o366n423n073m754l749k601k275
54850A24760k445k099j405j419k149k495k114j740j556r27j9lj092j915j526p30
54834A01126n83p64l93M50J009J073J010J039J044R17O41K84K1p6k89p82j066
54817A04661n95K55N54J49k54k65j74j08J60M59K96j85k84N1K31L15R86J976J931
54798A10159M88q38p04K23M62j90p69o59j1Q78J641J730R65%m13k85r5p7k55o26
54778A11624q66l45R24J894J735R69P68J456K395K970L052K815K688L197M318
$$ plain form
54896 128129 123496 120069 118117 117459 117222 116552 115611 115223 115555 115988 116311 117040 118228 118943 118517 117601 117389
54879 117389 118280 119786 121368 123036 125423 129428 135371 142441 149478 156297 163466 170767 176843 180676
54865 180676 182579 183252 182632 180171 175691 169504 162268 155001 148635 143212 138139 133385 129636 127035 124760
54850 124760 122315 120216 118811 117392 115243 112748 110634 108894 107338 106411 106392 106389 105297 103382 101856 101126
54834 101126 100543 99779 99386 99836 100845 101918 102928 103967 105011 105928 106569 106853 106874 106798 106509 105727 104661
54817 104661 104066 104321 104875 105024 104770 104505 104331 104223 104383 104842 105138 104953 104669 104720 104951 105266 106252 108228 110159
54798 110159 110647 109809 109105 109328 109790 109600 108831 108172 108161 109039 110680 112410 113375 113375 112962 112677 112582 112505 112250 111624
54778 111624 110758 110413 111337 113231 114966 115935 116703 118159 120554 123524 126576 129391 132079 135276 139594
54763A39594N282N568N713O555P929Q862Q820Q031O655M369J009k844o157q146
54749A91240q692q288p582o834n918m859m083l939m164m133l456k205q19R1R8
54734A26457n27r31n38L34R26Q78N29N16J184K203K747K378J700J759K834M307
54718A46756N679O977P987Q020O860N250L814K185j61k749m582n441n870o101
54704A68624n839n075m312l883l640l425l283l056k349j239n07p82j695k237j878
54689A25424j019l71k11l12m31n81q49j099j039n71M5M02L09n0l48m76o42r81
54671A17200j175p87RM02l7p46q75l14L82Q05R11O95K15j01J36N79M57l21r52
54652A16483q47l71j99l74l95K3O04Q43N09j24n02l21J99O08O60L02m00j055j008
$$ plain form
54763 139594 144876 150444 156157 162712 170641 179503 188323 196354 203009 207378 208387 205543 199386 191240
54749 191240 182548 174260 166678 159844 153926 149067 144984 141045 136881 132748 129292 127087 126268 126359 126457
54734 126457 125930 124999 124461 124795 125721 126599 127128 127644 128828 131031 133778 136156 137856 139615 142449 146756
54718 146756 152435 159412 167399 175419 182279 187529 191343 193528 193367 190618 186036 180595 174725 168624
54704 168624 162785 157710 153398 149515 145875 142450 139167 136111 133762 132523 132016 131234 129539 127302 125424
54689 125424 124405 124034 123823 123511 123080 122499 121650 120551 119512 118941 118986 119388 119697 119647 119299 118823 118181 117200
54671 117200 116025 115238 115247 115649 115612 114866 113991 113677 114059 114864 115775 116470 116685 116584 116720 117299 117756 117435 116483
54652 116483 115636 115265 115066 114692 114297 114320 114924 115767 116276 116152 115650 115329 115528 116136 116796 117098 116698 115643 114635
54633A14635j09Q51R71L38k69m61m27k92n4k8m71q55l61Q19J534J201M21p4k32
54614A17137j91J18M96M16j66n81l94J00O06J265J934J861O77r33k063k483k250
54597A15549j246K27J122P35l03q74p71n64m68j67M87J219J635J383L67q59j347
54580A16125r63p00j215j636p61J035K076J513J87o03m13L71J174J543J360R17
54564A20010N93M22K66K06L47M32J39l51n74n13n90r02r82m75L68J030J282J257
54546A21965J181J122R51N53R8k6L24Q65J284J541J696J702J643J778K070J961
54530A40708J018l81j433j771j593j179o64k16o3l03q84j605k022j631m98O07
54514A28090J006Q15N20J84l70r03r07m22p8k26m93m18p6K36N85J201J802J578
$$ plain form
54633 114635 114526 115377 116348 116686 116417 115956 115529 115237 115183 115155 114684 113829 113468 114287 115821 117022 117443 117369 117137
54614 117137 116946 117064 117560 117976 117810 117229 116835 116935 117541 118806 120740 122601 123278 122345 120282 117799 115549
54597 115549 114303 114530 115652 116387 116084 115210 114439 113875 113407 113240 113727 114946 116581 117964 118331 117472 116125
54580 116125 115162 114462 113247 111611 110850 111885 113961 115474 115661 115058 114645 115016 116190 117733 119093 120010
54564 120010 120603 121025 121291 121497 121844 122276 122415 122064 121490 120977 120387 119485 118503 118028 118396 119426 120708 121965
54546 121965 123146 124268 125219 125772 125870 125844 126168 127033 128317 129858 131554 133256 134899 136677 138747 140708
54530 140708 141726 141345 139912 138141 136548 135369 134705 134489 134426 134123 133239 131634 129612 127981 127483 128090
54514 128090 129096 129911 130431 130615 130245 129342 128435 128013 127935 127709 127216 126798 126722 126958 127543 128744 130546 132124
54496A32124J30j792k898k636j603n98J93Q45J095O85jl11j99o5L1K86M70J80
54478A25936k31L4R28J517J455J379J585J411N03m17p74j027j523j456j20J614
54462A30814K271J697Q87L72p7m26l52o1r9l23q2N85R53Q22P37Q71O85n8p58q85
54442A37573o87n96n60l62j18o0j52k19k64l67m89n76o39o67n82l51m9K11L88
54423A31434N80R64J453J483O66m36o88J74J171J472J398J532J624J144L75K1
54407A44367J11K19L22N74N45k28j119r33M09J689J997J617J169Q34O39P42R94
54390A53948Q90L29j82k53q9l6j59m73r80j366j181n36j46m17r34j061o70j48
54372A46536K7l49r37r78j02J055J497J037L55NJ1K55N84M82m77j705j972r12
$$ plain form
54496 132124 132254 130462 127564 124928 123325 122727 122920 123765 124860 125545 125544 125233 125034 124969 125000 125286 125756 125936
54478 125936 125705 125739 126667 128184 129639 131018 132603 134014 134517 134100 133326 132299 130776 129320 129200 130814
54462 130814 133085 134782 135669 136041 135964 135538 135186 135125 135026 134703 134621 135206 136159 136981 137718 138589 139274 139216 138458 137573
54442 137573 136886 136290 135730 135368 135250 135190 135038 134819 134555 134188 133699 133123 132484 131817 131235 130884 130835 131046 131434
54423 131434 132014 132978 134431 135914 136580 136144 135456 135630 136801 138273 139671 141203 142827 143971 144346 144367
54407 144367 144478 144697 145019 145593 146138 145910 144791 143858 144267 145956 147953 149570 150739 151573 152212 152954 153948
54390 153948 154838 155167 154985 154732 154643 154607 154448 153975 152995 151629 150448 149912 149766 149349 148415 147354 146684 146536
54372 146536 146563 146214 145277 144299 144197 145252 146749 147786 148141 148146 148157 148412 148996 149478 149001 147296 145324 144412
54354A44412M42R66N99k0l96k76M67J480J930J330J41p84j049p78j97M55R05J001
54336A50628Q82P78Q01R37J082J119J193J727K866M056M640M770N155N980O624
54321A93238O545N833M816L542J816n57l465o131p374o838n682n291n558n327
54307A69567m287l274k683j931q37k75q09j684j887j371o16K17R24R08M0p70p21
54290A50511k79l13o62n27J27O82J074J786K606K502J104n28j169q35n26q64j450
54273A53239j542r52j60L14L73J70k01n68n04J70P80M05p73j396n97Q75J713J672
54255A53018J524J732J964J778J183L87m32j024j170r45o35l10K15R21J364J094
54239A60664K09o70r62o99m70p52j345j658j467j109r08p39l70Q3K89J67o3k00
$$ plain form
54354 144412 144854 145820 146419 146399 146003 145727 146194 147674 149604 150934 151075 150291 149242 148464 148267 148722 149627 150628
54336 150628 151510 152288 153089 154026 155108 156227 157420 159147 162013 166069 170709 175479 180634 186614 193238
54321 193238 199783 205616 210432 213974 215790 215233 211768 205637 198263 191425 185743 180452 174894 169567
54307 169567 165280 162006 159323 157392 156555 156280 155471 153787 151900 150529 149913 150130 151054 151962 152002 151232 150511
54290 150511 150232 149919 149257 148730 148857 149539 150613 152399 155005 157507 158611 158083 156914 156079 155553 154689 153239
54273 153239 151697 150745 150585 150899 151272 151442 151241 150673 150169 150339 151119 151524 150751 149355 148758 149633 151346 153018
54255 153018 154542 156274 158238 160016 161199 161586 161154 160130 158960 158015 157380 157070 157285 158206 159570 160664
54239 160664 160873 160203 159241 158542 158072 157320 155975 154317 152850 151741 150833 150094 149724 149807 150096 150263 150200 150000
54221A50000k74m47p87j116j171r64q21q92q01j69O93J099R37P41P94P51L40r6
54203A47817j20J41K68J91J42J51Ll24m43Q1J137J897J536K64o33j60J183K032
54185A55163J776R84L83R8l9j36l89r36j485j566j304j289j615j764j582j559
54169A44740j813j707q83P3M66L65J28k21n81m62K14O65L14k30r6N01O81K97q
54150A42443Q0K66L54M59N61N23N45R26J406J395Q12J62k25m69o11m44M3N49R19
54131A49694J267J546J381N80m64j068q35M8R21J149O47q0m87l75K56J298K245
54114A57723K275J118m52j372j332o99J69R74J188M47p61j445j155l00M97R16
54098A57791Q93N62K98L44M85M10L09O20J225J494J177P11N17M45K14o1j14m3
$$ plain form
54221 150000 149726 149279 148492 147376 146205 145241 144420 143528 142727 142558 143251 144350 145287 146028 146822 147573 147913 147817
54203 147817 147697 147838 148106 148297 148439 148590 148593 148269 147826 147907 149044 150941 152477 152741 152108 151948 153131 155163
54185 155163 156939 157923 158306 158404 158365 158229 157840 156904 155419 153853 152549 151260 149645 147881 146299 144740
54169 144740 142927 141220 140337 140410 140876 141241 141369 141148 140567 140105 140319 140984 141298 141068 140972 141473 142154 142451 142443
54150 142443 142523 142789 143143 143602 144163 144686 145231 146157 147563 148958 149770 149932 149707 149238 148627 148183 148226 148775 149694
54131 149694 150961 152507 153888 154468 154004 152936 152101 152149 153070 154219 154866 154786 154299 153924 154180 155478 157723
54114 157723 159998 161116 160664 159292 157960 157261 157430 158404 159592 160039 159278 157833 156678 156378 156875 157791
54098 157791 158684 159246 159544 159888 160373 160783 161092 161712 162937 164431 165608 166319 166836 167281 167495 167434 167320 167277
54080A67277k33p90j289j135j89J002J606J206J11r26j190l96R81J846J419K23
54064A69523m02J09R55J225J007Q49P32L82J11M36J082J234P45L55O66J478K253
54047A82740K682K706K472K370K752L514M310N025N733O300O533O600O774O920
54033B47431O787O691P178Q017Q300P659O726O111N557M504K970J489N81N06J178
54018C21685K007K218J614P88L49L26M75P34J097J474K100L604O101Q431Q893
54003C61896O753K736j931o457j0456j3566j5427j5901j5069j3187j0755q499
53991B60137o923n889m900l864l251l310l523l223k550k258k610k979k700j803
53977B10354p75k0J95j99p65p70j56J49n53j599j756q87n9l7m37n11q5N54J193
$$ plain form
54080 167277 167044 166254 164965 163830 163641 164643 166249 167455 167566 166640 165450 165054 166035 167881 169300 169523
54064 169523 169121 169230 170185 171410 172417 173266 173998 174380 174491 174927 176009 177243 177988 178343 179009 180487 182740
54047 182740 185422 188128 190600 192970 195722 199236 203546 208571 214304 220604 227137 233737 240511 247431
54033 247431 254218 260909 268087 276104 284404 292063 298789 304900 310457 314961 317931 319420 320001 320507 321685
54018 321685 323692 325910 327524 328312 328661 328987 329462 330196 331293 332767 334867 338471 344572 353003 361896
54003 361896 368649 371385 369454 362997 352541 338975 323548 307647 292578 279391 268636 260137
53991 260137 253214 247325 242425 238561 235310 232000 228477 225254 222704 220446 217836 214857 212157 210354
53977 210354 209579 209559 209754 209555 208790 208020 207864 208013 207460 205861 204105 203218 203159 203122 202685 202174 202089 202643 203836
53958B03836J738K044K086K041K023J920J714J657J933K235K089J493R91J048
53944B28848J559K127K646L342M226M823M684M096L934M765O223P341P361O334
53930B92309N031M265M123M006L545L137L216L483L476L593M562O034O782O519
53916C54081O350P025P824P890P655Q024Q885R386R198Q505P212N091K546L60
53902D50032j124j982k229k084k259l170m190m579m706n409o569p368p773q456
53888C88134r392r707r189q742r057r714r909r297p938o164m665l962l665l029
53874B83704k246k196k880l205k621j967k154k985l746m130m058l400k410j734
53860B43972j544j315r02r44j595j768n12J507K840L139L343M230N652P121Q579
$$ plain form
53958 203836 205574 207618 209704 211745 213768 215688 217402 219059 220992 223227 225316 226809 227800 228848
53944 228848 230407 232534 235180 238522 242748 247571 252255 256351 260285 265050 271273 278614 285975 292309
53930 292309 297340 301605 305728 309734 313279 316416 319632 323115 326591 330184 334746 340780 347562 354081
53916 354081 360431 367456 375280 383170 390825 398849 407734 417120 426318 434823 442035 447126 449672 450032
53902 450032 448908 446926 444697 442613 440354 437184 432994 428415 423709 418300 411731 404363 396590 388134
53888 388134 378742 369035 359846 351104 342047 332333 322424 313127 305189 299025 294360 290398 286733 283704
53874 283704 281458 279262 276382 273177 270556 268589 266435 263450 259704 255574 251516 248116 245706 243972
53860 243972 242428 241113 240211 239267 237672 235904 235392 236899 239739 242878 246221 250451 256103 263224 271803
53845B71803J0508J3395J6775J8642J6476R630M99p244j1475j2560j2028j1023
53833C03398r842q254o024l362r23P04J439J605J595J632J588R38o95k872m615
53818B76312n427n602n484n050m384l855l459k657j268O7Q00J223J811K346K444
53803B47817K432K977M039N009N646O274P060P728P992P789P078N789M091K433
53789C24154J251O97N71M76K02mJ62M06R9p69j539j944k517l625m816n632o284
53772C00888o945p024o073m802m258m322m072l338k885l056l372l538l878m388
53758B38937m309l139j490l58l8k07o75j465k297k636k292j672j311j305j329
53743B14414j105p05l51j00J40L40L17L0k89m45m93n38n08k77J36N74Q82R62Q54
$$ plain form
53845 271803 282311 295706 312481 331123 347599 357229 357728 350484 339009 326449 314421 303398
53833 303398 293556 285302 279278 275916 274993 275697 277136 278741 280336 281968 283556 284494 283799 280927 276312
53818 276312 270885 265283 259799 254749 250365 246510 243051 240394 239126 239193 239993 241216 243027 245373 247817
53803 247817 250249 253226 257265 262274 267920 274194 281254 288982 296974 304763 311841 317630 321721 324154
53789 324154 325405 326102 326673 327149 327351 327347 327509 327915 328014 327245 325706 323762 321245 317620 312804 307172 300888
53772 300888 293943 286919 280846 276044 271786 267464 263392 260054 257169 254113 250741 247203 243325 238937
53758 238937 234628 231489 229999 229641 229603 229396 228721 227256 224959 222323 220031 218359 217048 215743 214414
53743 214414 213309 212604 212253 212153 212293 212633 212950 212980 212691 212246 211753 211215 210707 210430 210566 211140 212022 212984 213838
53724B13838Q16J084J575J987K271K589K814K544J758J038Q62J077J305J453J534
53709B38545J414J119J057J490K116K497K683K959L261L286K968K508K120K044
53695B70067K538L480M222M240L645K803J801O87j41l44k01k60o04r48j100r91
53679B88894n09J21J85o56j640j778j196q62j102j280r81o76q78j319j371q33
53663B74119m6N25O70N84O95J051J073K65r46j611j440j008p92o65m18j32K00
53646B72124Q22J649K090J755R78L31oj00J12O75J347J868K247K549K521J886
53630B92848Q61P8o7K80P42J110J462J986K796L784M559M673M000L028K580L075
53614C27795M059M629M367L668L200L250L674M127M235L827L223K963L094L059
$$ plain form
53724 213838 214654 215738 217313 219300 221571 224160 226974 229518 231276 232314 233176 234253 235558 237011 238545
53709 238545 239959 241078 242135 243625 245741 248238 250921 253880 257141 260427 263395 265903 268023 270067
53695 270067 272605 276085 280307 284547 288192 290995 292796 293483 293342 292998 292797 292537 291933 290985 289885 288894
53679 288894 288385 288506 288691 288035 286395 284617 283421 282559 281457 280177 279196 278520 277642 276323 274952 274119
53663 274119 274073 274598 275268 275852 276547 277598 278671 278936 277990 276379 274939 273931 273139 272474 272056 271924 272124
53646 272124 272946 274595 276685 278440 279418 279749 279743 279643 279755 280430 281777 283645 285892 288441 290962 292848
53630 292848 293709 293787 293720 294000 294742 295852 297314 299300 302096 305880 310439 315112 319112 322140 324720 327795
53614 327795 331854 336483 340850 344518 347718 350968 354642 358769 363004 366831 370054 373017 376111 379170
53600C79170K511J840J568J597J485J127O70N4q40j720k075j758r83j0P65P18
53584C84119l32j640k308k407k589k821k381j153K4M90M50K37k70j099j698j558
53568C65064q32J8P78J317J407J135J098J753K854L896M765N553O087O125N731
53553D06749N054L964K293L07j500k848l648l754l136k073q79L64J491K031J806
53538D06221J481J944L181M410N154N696O366P103P826Q690R695J0511J1004J1522
53524E00804J2356J3266J3897J4301J4668J4878J4780J4729J5261J6404J7842
53513F63186J9618K1950K4283K5427K5076K4475K4910K6040K6528K6015K5499
53502I33007K5707K5997K5381K3902K2505K1834K1679K1489K0985K0239J9468
$$ plain form
53600 379170 381681 383521 385089 386686 388171 389298 389968 390022 389182 387462 385387 383629 382646 382636 383401 384119
53584 384119 383787 382147 379839 377432 374843 372022 369641 368488 368512 369002 369452 369689 369419 368320 366622 365064
53568 365064 364232 364250 365028 366345 367752 368887 369985 371738 374592 378488 383253 388806 394893 401018 406749
53553 406749 411803 415767 418060 418367 416867 414019 410371 406617 403481 401408 400529 400893 402384 404415 406221
53538 406221 407702 409646 412827 417237 422391 428087 434453 441556 449382 458072 467767 478278 489282 500804
53524 500804 513160 526426 540323 554624 569292 584170 598950 613679 628940 645344 663186
53513 663186 682804 704754 729037 754464 779540 804015 828925 854965 881493 907508 933007
53502 933007 958714 984711 1010092 1033994 1056499 1078333 1100012 1121501 1142486 1162725 1182193
53491A182193J8790J8139J7489J7111J7374J8199J9019J9393J9452J9529J9671
53480A386359J9731J9588J9012J7602J5258J2540J0093P860N295K301n62k815
53468A512262m660o641r058j1788j4411j6352j7130j6808j6091j5775j6061j6564
53456A350923j6997j7665j9036k0922k2426k2872k2536k2197k2109k1822k0981
53445A121360j9845j8879j8125j7180j5640j3429j0831q237n823l603j879j252
53433I86637j753k375k044r04J55R76K178L784N040N921P507J0214J2791J4013
53419A042140J4436J5420J7175J8991K0697K2608K4401K5464K6236K7862L0468
53408A285898L2939L4594L5928L7458L8973M0386M2321M5198M8450N1181N3123
$$ plain form
53491 1182193 1200983 1219122 1236611 1253722 1271096 1289295 1308314 1327707 1347159 1366688 1386359
53480 1386359 1406090 1425678 1444690 1462292 1477550 1490090 1500183 1508043 1513338 1515639 1515077 1512262
53468 1512262 1507602 1500961 1491903 1480115 1465704 1449352 1432222 1415414 1399323 1383548 1367487 1350923
53456 1350923 1333926 1316261 1297225 1276303 1253877 1231005 1208469 1186272 1164163 1142341 1121360
53445 1121360 1101515 1082636 1064511 1047331 1031691 1018262 1007431 999194 993371 989768 987889 986637
53433 986637 984884 982509 980465 979561 979716 980692 982870 986654 991694 997615 1005122 1015336 1028127 1042140
53419 1042140 1056576 1071996 1089171 1108162 1128859 1151467 1175868 1201332 1227568 1255430 1285898
53408 1285898 1318837 1353431 1389359 1426817 1465790 1506176 1548497 1593695 1642145 1693326 1746449
53397A746449N4428N5128N5310N5486N6138N7140N7921N8133N7902N7580N7329
53386B368944N6820N5391N2802M9762M7219M5212M2879L9593L5459L0684K5217
53375B849982J9313J3771R107M941N95m052q815j3958k0138k7516l5347m2462
53363B745421m8101n2233n5205n7183n8069n7985n7498n7107n6622n5398n3134
53352B136886n0185m7214m4757m3007m1786m0935m0860m2172m4420m5864m5199
53341A650487m3083m1057l9388l7084l3835l0586k8036k5791k3472k1550k0340
53330A306265j9160j7312j5335j4401j4862j6021j7086j7670j7546j6612j5166
53319A125094j3774j2706j1713j0369q566o620m870l239j390O42K321L436M633
$$ plain form
53397 1746449 1800877 1856005 1911315 1966801 2022939 2080079 2138000 2196133 2254035 2311615 2368944
53386 2368944 2425764 2481155 2533957 2583719 2630938 2676150 2719029 2758622 2794081 2824765 2849982
53375 2849982 2869295 2883066 2892173 2897114 2897709 2893657 2884842 2870884 2850746 2823230 2787883 2745421
53363 2745421 2697320 2645087 2589882 2532699 2474630 2416645 2359147 2302040 2245418 2190020 2136886
53352 2136886 2086701 2039487 1994730 1951723 1909937 1869002 1828142 1785970 1741550 1695686 1650487
53341 1650487 1607404 1566347 1526959 1489875 1456040 1425454 1397418 1371627 1348155 1326605 1306265
53330 1306265 1287105 1269793 1254458 1240057 1225195 1209174 1192088 1174418 1156872 1140260 1125094
53319 1125094 1111320 1098614 1086901 1076532 1067966 1061346 1056476 1053237 1051847 1052489 1054810 1058246 1062879
53306A062879O533Q723J0291J1205J2313J4042J5933J7519J8835J9956K0884K2089
53294A241202K4245K7105K9447L0507L0747L0781L0406K9210K7445K5666K4029
53283A550790K2446K0980J9527J7524J4446J0333N573O50l712o812q723j0315
53271A632707j2218j4293j6326j8408k0433k1965k3150k4747k6736k7861k7315
53260A399255k6101k5746k6377k7090k7552k8107k8641k8545k7787k7030k6644
53249A099635k6363k5914k5338k4771k4450k4786k5847k6864k6909k5908k4497
53238H17988k3036k1465j9909j8689j7688j6399j4630j2678j0749q821p162o415
53226F40347o956q368r787j0564j0669j0632j1066j2119j3439j4561j5089j4624
$$ plain form
53306 1062879 1069412 1078135 1088426 1099631 1111944 1125986 1141919 1159438 1178273 1198229 1219113 1241202
53294 1241202 1265447 1292552 1321999 1352506 1383253 1414034 1444440 1473650 1501095 1526761 1550790
53283 1550790 1573236 1594216 1613743 1631267 1645713 1656046 1661619 1662269 1658557 1651745 1643022 1632707
53271 1632707 1620489 1606196 1589870 1571462 1551029 1529064 1505914 1481167 1454431 1426570 1399255
53260 1399255 1373154 1347408 1321031 1293941 1266389 1238282 1209641 1181096 1153309 1126279 1099635
53249 1099635 1073272 1047358 1022020 997249 972799 948013 922166 895302 868393 842485 817988
53238 817988 794952 773487 753578 734889 717201 700802 686172 673494 662745 653924 646762 640347
53226 640347 633391 625023 615236 604672 594003 583371 572305 560186 546747 532186 517097 502473
53214E02473j3130j1420j0519j0282r485p720o300o480p608q073p514o979p132
53201C89831p494p386o738n838n056m833n223n528n011l916l127k953k990l074
53187C20664l411l739l309k032r17r47j978l050l380k862j960j319j204j248j022
53172B88286o97p97j332j687j436q31m18m98j007j609j922j876j724j505r16p
53156B70024M55j2o84n33K18L38o48j855k269j836j068l12K69N04L38j35q12j414
53138B60568j340k52J255K103J905J188N54J72O4J73J16m45j111j167p29p10j424
53121B60920k028j721p85J1M37P26R69J048Q73L43n90j550j856j318n64k64l13
53104B54338j81J90K64m21j657k650k672j776q58p24j170j324q79m43n61r52j012
$$ plain form
53214 502473 489343 477923 467404 457122 447637 439917 433617 427137 419529 411456 403942 396963 389831
53201 389831 382337 374951 368213 362375 357319 352486 347263 341735 336724 332808 329681 326728 323738 320664
53187 320664 317253 313514 310205 308173 307256 306309 304331 301281 297901 295039 293079 291760 290556 289308 288286
53172 288286 287589 286792 285460 283773 282337 281506 281088 280590 279583 277974 276052 274176 272452 270947 270031 270024
53156 270024 270479 270467 269783 269250 269468 269806 269158 267303 265034 263198 262130 261818 262087 262591 262929 262794 261982 260568
53138 260568 259228 258976 260231 262334 264239 265427 265981 266153 266217 266390 266506 266061 264950 263783 263054 262344 260920
53121 260920 258892 257171 256386 256397 256834 257560 258529 259577 260450 260793 260203 258653 256797 255479 254915 254651 254338
53104 254338 254157 254347 254611 254190 252533 249883 247211 245435 244577 243853 242683 241359 240480 240037 239476 238524 237512
53087B37512o83m19m87o54n27k5N30P52O46N73P18Q21O15K56j6l31q73j369j357
53068B35682q10l2P93J440J362L10r64j372p94J0N99J103J412J217R36J454K609
53051B44955L006J935M50q0L49Q77J093R74J66j508l176l585k704j752j565j658
53035B37777j183j61O42P18K79j98n58j022j704k275k192j263R7J159J413R71
53019B32500N10O42J186J281M90m97o76PP33R81R84J051J017N94j34p58p97k4
53001B39090J099J505O28p17j187n65J53L20L41O69R99R23O62N82N11J34l60m41
52983B44346J15J076J923K061J316L83L06J220K111K056J267N96N21R27J438J622
52967B63284J281Q30R85J829K614K744K412K065J789J515J242P28m17j966k961
$$ plain form
53087 237512 236829 236410 235923 235269 234742 234717 235247 235999 236645 237218 237936 238757 239372 239628 239612 239281 238408 237039 235682
53068 235682 234872 234840 235633 237073 238435 238745 237781 236409 235615 235625 236224 237327 238739 239956 240892 242346 244955
53051 244955 247961 249896 250346 250266 250615 251492 252585 253559 253725 252217 249041 245456 242752 241000 239435 237777
53035 237777 236594 236433 237075 237793 238072 237874 237316 236294 234590 232315 230123 228860 228957 230116 231529 232500
53019 232500 233010 233652 234838 236119 236609 236112 235436 235443 236176 237157 238141 239192 240209 240803 240669 239911 239114 239090
53001 239090 240189 241694 242322 241605 240418 239853 240006 240326 240667 241336 242335 243258 243920 244502 245013 245147 244787 244346
52983 244346 244461 245537 247460 249521 250837 251220 251526 252746 254857 256913 258180 258776 259297 260224 261662 263284
52967 263284 264565 265395 266380 268209 270823 273567 275979 278044 279833 281348 282590 283318 282901 280935 277974
52952B77974k802j955j211q24p87j260k113k625k310j631j311j349j307j137j106
52937B54246j187j166j050r12o40k71j45l15l34j20l34j232j793j031L93R10J63
52920B45182p47r40o19k43N7N6n62j405j484n69L21L26q1Q3P75R82J86r38j391
52901B38989r47j39M79P79Q73Q70R29J206J528J380N63l31o18m82o66j238j432
52884B41743q96k86k31m31l33j20k81o70o63j30M23N44K62l1J48R43J767J748
52866B43506R27M30R75J850K051J817K020K528K284R62n49j438j786j867j625
52851B52085j137r00j144j447j480j640k419l480l839k967j383k10k16j213k274
52836B26336k594k127j373p33k81lP4L3J21N74J428K367K754K048M59j077j812
$$ plain form
52952 277974 275172 273217 272006 271182 270395 269135 267022 264397 262087 260456 259145 257796 256489 255352 254246
52937 254246 253059 251893 250843 249931 249291 249020 248875 248560 248226 248106 247772 246540 244747 243716 244109 245019 245182
52920 245182 244435 243495 242876 242633 242690 242746 242184 240779 239295 238726 239047 239373 239292 239375 240150 241132 241318 240380 238989
52901 238989 238042 237903 238382 239161 240034 240904 241833 243039 244567 245947 246510 246179 245561 245079 244413 243175 241743
52884 241743 240847 240561 240330 239899 239566 239446 239165 238495 237832 237702 238125 238669 238931 238900 239048 239991 241758 243506
52866 243506 244433 244863 245838 247688 249739 251556 253576 256104 258388 259350 258801 257363 255577 253710 252085
52851 252085 250948 250048 248904 247457 245977 244337 241918 238438 234599 231632 230249 230039 229823 228610 226336
52836 226336 223742 221615 220242 219509 219228 219225 219299 219332 219453 220027 221455 223822 226576 228624 229083 228006 226194
52819B26194j878j857j937j813j277m93K11N95O75P63J095J377J112N83Q41K296
52803B26487L888M230L143J445k56j721k539k416j899j851k229k216j631j232
52789B21203j464j763j492q35k83J57P21J186J044K31o78j011o29K9M39N02M93
52772B17850N83O79P50R18J045P43N5l47j23K07J63J73P45J353J115K94m2L09
52754B26470M53n6n24l01K85N63L97P7j12N2N46Q66N38KK42J367K331K361J898
52735B37455J745J977K147J972J410N79j3K07J047J585J397J060J068R73K31q23
52719B54017j517j782j867j621r04l20o32j605k226k008j350o61O5P25Q89M47
52703B39650m7n3K51K51k71q79r49l64L90P75Q58J132J704J955J347L18j52K63
$$ plain form
52819 226194 224316 222459 220522 218709 217432 216939 217150 217745 218420 219183 220278 221655 222767 223350 224191 226487
52803 226487 230375 234605 237748 239193 238937 237216 234677 232261 230362 228511 226282 224066 222435 221203
52789 221203 219739 217976 216484 215649 215366 215523 216244 217430 218474 218705 218027 217016 216387 216416 216855 217357 217850
52772 217850 218433 219112 219862 220780 221825 222568 222623 222276 222153 222360 222523 222696 223441 224794 225909 226203 226161 226470
52754 226470 226923 226867 226343 226042 226327 226890 227287 227364 227252 227304 227850 228716 229254 229256 229498 230865 233196 235557 237455
52735 237455 239200 241177 243324 245296 246706 247285 247272 247479 248526 250111 251508 252568 253636 254609 254840 254017
52719 254017 252500 250718 248851 247230 246326 246006 245374 243769 241543 239535 238185 237524 237589 238314 239203 239650
52703 239650 239603 239550 239801 240052 239781 238902 237953 237589 237979 238754 239612 240744 242448 244403 245750 246068 245916 246179
52685B46179R21J175J193J497K067K309J868J017J92n23j203j650j574j094o66
52670B51708m35r2M53P42M31j13l11k03k35m01k59K25M46Oo85q81l31O34J626
52651B52325K563L495M158L866K165l28k149k480k036k040k562k599j642m24J17
52636B52429r0m82p05q42j007j072p62M7J082J879K343K790L295L352K628J536
52620B66421M87q21k580l770l193j401l20p63j569j582j176j111j115n33L97R68
52604B48339J152J390J666J678J606J838K128J841R51J01k67k45M6O41J380J833
52588B66078J739J250O96L02R2r9l74n07j39N92J077J058R18R42Q06K65k65l88
52570B74043m67r61j472j261n05r0k45l17QJ20n30j461j749j227o46p36j383j792
$$ plain form
52685 246179 247100 248275 249468 250965 253032 255341 257209 258226 258418 257895 256692 255042 253468 252374 251708
52670 251708 251273 251181 251634 252376 252807 252694 252383 252180 251945 251544 251285 251510 251956 251962 251277 250396 250065 250699 252325
52651 252325 254888 258383 262541 266407 268572 268244 266095 263615 261579 259539 256977 254378 252736 252312 252429
52636 252429 252339 251857 251152 250310 249303 248231 247469 247516 248598 250477 252820 255610 258905 262257 264885 266421
52620 266421 266908 266087 263507 259737 256544 255143 254823 254060 252491 250909 249733 248622 247507 246974 247371 248339
52604 248339 249491 250881 252547 254225 255831 257669 259797 261638 262589 262690 262423 262178 262224 262865 264245 266078
52588 266078 267817 269067 269763 270065 270157 270058 269684 269177 269038 269630 270707 271765 272683 273625 274431 274696 274431 274043
52570 274043 273576 272615 271143 269882 269377 269287 269042 268725 268733 268853 268323 266862 265113 263886 263240 262504 261121 259329
52552B59329j395n04L3j81o71p65l47K83Q93J361J494J250R02O64L50j94o17n36
52534B61349j92o3m4L30R07R23J64o05o06L0O11O61J44o84j309j221m74K73N57
52515B60751O23Q92J274J457J561K016K800L424L730M150M822M940L562J007j243
52500B95766k170k291k690l459l716l032k064j634j729j795j594j311j111j024
52486B66146j155j503j671j181j52O93Q70O41N68Q22J175J438J605J605J263O64
52470B71828L22O27J236J354P79K73P11K058L506M374M482L945L082K456K362
52455C03395K223J047j305l747n046m908l887k754k182k526l437l995l600k557
52441B66721j589j071r12q57o35j29L66M28K27M46J173J499P34n13j124r11n59
$$ plain form
52552 259329 257934 257430 257463 257282 256611 255846 255499 255782 256675 258036 259530 260780 261682 262346 262696 262502 261885 261349
52534 261349 261157 261094 261050 261380 262287 263210 263374 262769 262163 262193 262804 263465 263609 262925 261616 260395 259921 260194 260751
52515 260751 261374 262266 263540 264997 266558 268574 271374 274798 278528 282678 287500 292440 296002 297009 295766
52500 295766 293596 291305 288615 285156 281440 278408 276344 274710 272981 271186 269592 268281 267170 266146
52486 266146 264991 263488 261817 260636 260484 261177 262047 262688 263256 264078 265253 266691 268296 269901 271164 271828
52470 271828 272150 272777 274013 275367 276146 276419 277130 279188 282694 287068 291550 295495 298577 301033 303395
52455 303395 305618 306665 305360 301613 296567 291659 287772 285018 282836 280310 276873 272878 269278 266721
52441 266721 265132 264061 263149 262292 261657 261528 261894 262322 262549 262995 264168 265667 266401 265888 264764 263853 263294
52424B63294l93j10M11Q09R06R97J265J495J509J465J491J437J267J298J844K793
52408B81778L799M709N701P098R157J1765J4187J5235J3897R936M084k224p369
52395C71753j0239j0739r731q403p438o680n542l865k253j396j244j177q52m70
52381C01724k18M5L59N15N72J017K035L109L735M078M530N055N536O270P389Q085
52365C53836P287N015K400L57r91j670j490o60j8j29n24l73L77R61Q33L03J16
52348C65630O14J511K284K604K432J987J776K354L666M819M986M471M405N303
52334D08842O621P810R056J0539J1763J2301J2684J3740J5383J6839J7813J8726
52322E62117J9862K1038K2063K2829K2969K2041K0253J8441J7277J6846J6938
$$ plain form
52424 263294 262901 262791 263202 264011 264917 265914 267179 268674 270183 271648 273139 274576 275843 277141 278985 281778
52408 281778 285577 290286 295987 303085 312242 324007 338194 353429 367326 377262 381346 379122 371753
52395 371753 361514 350775 341044 332641 325203 318523 312981 309116 306863 305467 304223 303046 302194 301724
52381 301724 301506 301551 301910 302425 302997 304014 306049 309158 312893 316971 321501 326556 332092 338362 345751 353836
52365 353836 361123 366138 368538 368895 367904 366234 364744 364084 364066 363937 363413 363040 363417 364378 365211 365514 365630
52348 365630 366244 367755 370039 372643 375075 377062 378838 381192 384858 389677 394663 399134 403539 408842
52334 408842 415463 423273 432329 442868 454631 466932 479616 493356 508739 525578 543391 562117
52322 562117 581979 603017 625080 647909 670878 692919 713172 731613 748890 765736 782674
52311G82674J7235J7242J6679J5946J5677J5762J5409J4268J2870J1761J0835
52300I46358R839R006Q694Q713Q439P510O074M373K337l38l665p016r539j0986
52286I79799j1810j2206j1620r655p132n404m732m061k483k30J969L878N754P795
52272I29862R862J1559J2467J2620J2770J3764J5561J7253J8041J7761J6506J4417
52260A102443J2088J0515J0201J0629J1046J1316J1699J2091J2041J1357J0352
52249A225778R435Q684P745O048L224m76m223p064q420q350p542o867o618o247
52235A205107n186l811l092l301l602l111j865n70K56N61N51M24K85P8j71j06
52219A182447O83K093L504M423M869N086N262N666O572P825Q844R297R529J0067
$$ plain form
52311 782674 799909 817151 833830 849776 865453 881215 896624 910892 923762 935523 946358
52300 946358 956197 965203 973897 982610 991049 998559 1004633 1009006 1011343 1011005 1007340 1000324 990785 979799
52286 979799 967989 955783 944163 934508 927376 921972 917240 913179 910696 910466 912435 916313 922067 929862
52272 929862 939724 951283 963750 976370 989140 1002904 1018465 1035718 1053759 1071520 1088026 1102443
52260 1102443 1114531 1125046 1135247 1145876 1156922 1168238 1179937 1192028 1204069 1215426 1225778
52249 1225778 1235213 1243897 1251642 1257690 1260914 1260438 1256215 1249151 1240731 1232381 1224839 1217972 1211354 1205107
52235 1205107 1199921 1196110 1193018 1189717 1186115 1183004 1181139 1180569 1180825 1181386 1181937 1182361 1182646 1182724 1182553 1182447
52219 1182447 1183130 1185223 1188727 1193150 1198019 1203105 1208367 1214033 1220605 1228430 1237274 1246571 1256100 1266167
52205A266167J0840J1153J0449Q952P561O971O871O269M864L737M120N727P002
52192A360683O943N960M878L958L249L074L509L880L398K036K81j620l696n792
52178A390741p665r398j1181j2697j3262j2731j1805j1222j0843r837p749n193
52166A267158l258k372j957j233r7J029J883K516K988L331L736M236M233K947
52152A285140N40j736k794k786k595k658k665k231j534j141j346j750j687j130
52138A259627r23j717k988l616l316k821k586k084o35J705M482P496J0672J3672
52124A276968J6244J8598K1102K3749K6335K8848L1248L3063L3696L3154L2069
$$ plain form
52205 1266167 1277007 1288160 1298609 1307561 1315122 1322093 1328964 1335233 1340097 1343834 1347954 1353681 1360683
52192 1360683 1367626 1373586 1378464 1382422 1385671 1388745 1392254 1396134 1399532 1401568 1401849 1400229 1396533 1390741
52178 1390741 1383076 1373678 1362497 1349800 1336538 1323807 1312002 1300780 1289937 1280100 1272351 1267158
52166 1267158 1263900 1261528 1259571 1258338 1258241 1259270 1261153 1263669 1266657 1269988 1273724 1277960 1282193 1285140
52152 1285140 1285680 1283944 1281150 1278364 1275769 1273111 1270446 1268215 1266681 1265540 1264194 1262444 1260757 1259627
52138 1259627 1258704 1256987 1253999 1250383 1247067 1244246 1241660 1239576 1238941 1240646 1245128 1252624 1263296 1276968
52124 1276968 1293212 1311810 1332912 1356661 1382996 1411844 1443092 1476155 1509851 1543005 1575074
$$ [...]
##END NTUPLES=NMR SPECTRUM
##END=
