
##TITLE=AC1290_VIERS11100_6528458_WgZoH42hia
##JCAMPDX= 6.0         $$ Bruker NMR JCAMP-DX V2.0
##DATA TYPE= NMR SPECTRUM
##DATA CLASS= NTUPLES
##ORIGIN= BRUKER
##OWNER= Administrator
$$ 1.72 TOPSPIN		Version 2.1
$$ 2012-07-15 14:49:54.093 -0500  Administrator@TOPSPIN
$$ Compression mode = diff/dup
##.OBSERVE FREQUENCY= 400.02188249412
##.OBSERVE NUCLEUS= ^1H
##.ACQUISITION MODE= SIMULTANEOUS (DQD)
##.ACQUISITION SCHEME= undefined
##.AVERAGES= 8
##.DIGITISER RES= 22
##SPECTROMETER/DATA SYSTEM= spect
##.PULSE SEQUENCE= zg30
##.SOLVENT NAME= COFFEE_meoh
##.SHIFT REFERENCE= INTERNAL, COFFEE_meoh, 1, 14.98509
##AUDIT TRAIL= $$ (NUMBER, WHEN, WHO, WHERE, PROCESS, VERSION, WHAT)
$$ ##TITLE= Audit trail, TOPSPIN		Version 2.1
$$ ##JCAMPDX= 5.01
$$ ##ORIGIN= Bruker BioSpin GmbH
$$ ##OWNER= Administrator
$$ $$ C:\Bruker\TOPSPIN/data/COFFEE/nmr/AC1290_VIERS11100_6528458_WgZoH42hia/10/pdata/1/auditp.txt
$$ ##AUDIT TRAIL=  $$ (NUMBER, WHEN, WHO, WHERE, PROCESS, VERSION, WHAT)
(   1,<2012-07-15 14:49:47.078 -0500>,<Administrator>,<TOPSPIN>,<go>,<TOPSPIN 2.1>,
      <created by zg
	started at 2012-07-15 14:48:40.281 -0500,
	POWCHK enabled, PULCHK disabled,
       configuration hash MD5:
       6B 1B 68 BB D9 2E 58 E2 7F 35 AD 54 07 DF 0E 41
       data hash MD5: 64K
       20 24 BC DA 2D AD A2 9B 30 04 08 47 0C 45 4D 15>)
(   2,<2012-07-15 14:49:49.937 -0500>,<Administrator>,<TOPSPIN>,<proc1d>,<TOPSPIN 2.1>,
      <Start of raw data processing
       efp LB = 0 FT_mod = 6 PKNL = 1 PHC0 = 0 PHC1 = 0 SI = 32K 
       data hash MD5: 32K
       14 FA 20 D8 2E 42 FA 57 B7 57 F7 9C 45 08 F4 CE>)
(   3,<2012-07-15 14:49:50.234 -0500>,<Administrator>,<TOPSPIN>,<proc1d>,<TOPSPIN 2.1>,
      <pk PHC0 = 176.792 PHC1 = 0 
       data hash MD5: 32K
       40 35 AE 95 1D 97 A8 B7 37 38 04 83 25 AA C8 61>)
(   4,<2012-07-15 14:49:50.296 -0500>,<Administrator>,<TOPSPIN>,<proc1d>,<TOPSPIN 2.1>,
      <abs ABSG = 1 
       data hash MD5: 32K
       3C C7 78 D4 50 E5 6B 43 FE 67 1C 7A DE 18 3E D1>)
(   5,<2012-07-15 14:49:50.343 -0500>,<Administrator>,<TOPSPIN>,<proc1d>,<TOPSPIN 2.1>,
      <abs ABSG = 2 
       data hash MD5: 32K
       B0 BC 4C 9A 6C A9 CC 77 57 81 3D EC 7E C9 80 AA>)
(   6,<2012-07-15 14:49:50.390 -0500>,<Administrator>,<TOPSPIN>,<proc1d>,<TOPSPIN 2.1>,
      <abs ABSG = 3 
       data hash MD5: 32K
       07 0A D9 40 79 DA B6 9F A5 C4 2A 49 EA B5 F8 C3>)
(   7,<2012-07-15 14:49:50.421 -0500>,<Administrator>,<TOPSPIN>,<proc1d>,<TOPSPIN 2.1>,
      <abs ABSG = 4 
       data hash MD5: 32K
       4D 1D DD B5 40 3D 42 54 A3 B8 DC A9 1E 3B C6 DD>)
(   8,<2012-07-15 14:49:50.437 -0500>,<Administrator>,<TOPSPIN>,<proc1d>,<TOPSPIN 2.1>,
      <abs ABSG = 5 
       data hash MD5: 32K
       FF F4 60 89 C0 A6 A9 C7 8E 6C F7 0F F6 6A 50 79>)
$$ ##END=
$$ 
$$ $$ hash MD5
$$ $$ FD 70 BE 9A EC 84 E9 75 78 BB 7C 6D C8 F6 6A 9A
##$RELAX= 
##$RELAX= 
##$RELAX= 
##$RELAX= 
##$RELAX= 
##$RELAX= 
##$RELAX= 
$$ Bruker specific parameters
$$ --------------------------
$$ [...]
##$TP= (0..7)
150 150 150 150 150 150 150 150
##$TP07= 0
##$TPNAME0= <>
##$TPNAME1= <>
##$TPNAME2= <>
##$TPNAME3= <>
##$TPNAME4= <>
##$TPNAME5= <>
##$TPNAME6= <>
##$TPNAME7= <>
##$TPOAL= (0..7)
0.5 0.5 0.5 0.5 0.5 0.5 0.5 0.5
##$TPOFFS= (0..7)
0 0 0 0 0 0 0 0
##$TUNHIN= 0
##$TUNHOUT= 0
##$TUNXOUT= 0
##$USERA1= <user>
##$USERA2= <user>
##$USERA3= <user>
##$USERA4= <user>
##$USERA5= <user>
##$V9= 5
##$VALIST= <valist>
##$VCLIST= <CCCCCCCCCCCCCCC>
##$VD= 0
##$VDLIST= <DDDDDDDDDDDDDDD>
##$VPLIST= <PPPPPPPPPPPPPPP>
##$VTLIST= <TTTTTTTTTTTTTTT>
##$WBST= 2048
##$WBSW= 25
##$XGAIN= (0..3)
0 0 0 0
##$XL= 0
##$YL= 0
##$YMAX_a= 507620
##$YMIN_a= -649462
##$ZGOPTNS= <>
##$ZL1= 120
##$ZL2= 120
##$ZL3= 120
##$ZL4= 120
##$ABSF1= 14.98509
##$ABSF2= -5.573092
##$ABSG= 5
##$ABSL= 3
##$ALPHA= 0
##$AQORDER= 0
##$ASSFAC= 0
##$ASSFACI= 0
##$ASSFACX= 0
##$ASSWID= 0
##$AUNMP= <proc_prof1d_extract_pilot.lims>
##$AXLEFT= 0
##$AXNAME= <>
##$AXNUC= <1H>
##$AXRIGHT= 0
##$AXTYPE= 0
##$AXUNIT= <>
##$AZFE= 0.1
##$AZFW= 0.1
##$BCFW= 0
##$BC_mod= 0
##$BYTORDP= 0
##$COROFFS= 0
##$CY= 15
##$DATMOD= 1
##$DC= 0
##$DFILT= <>
##$DTYPP= 0
##$F1P= 0
##$F2P= 0
##$FCOR= 0.5
##$FTSIZE= 32768
##$FT_mod= 6
##$GAMMA= 0
##$GB= 0
##$INTBC= 1
##$INTSCL= 1
##$ISEN= 128
##$LB= 0
##$LEV0= 0
##$LPBIN= 0
##$MAXI= 10000
##$MC2= 0
##$MEAN= 0
##$ME_mod= 0
##$MI= 0
##$NCOEF= 0
##$NC_proc= -8
##$NLEV= 6
##$NOISF1= 0
##$NOISF2= 0
##$NSP= 0
##$NTH_PI= 0
##$NZP= 0
##$OFFSET= 14.98509
##$PC= 1
##$PHC0= 176.792
##$PHC1= 0
##$PH_mod= 1
##$PKNL= yes
##$PPARMOD= 0
##$PPDIAG= 0
##$PPIPTYP= 0
##$PPMPNUM= 2147483647
##$PPRESOL= 1
##$PSCAL= 4
##$PSIGN= 0
##$PYNMP= <proc.py>
##$REVERSE= no
##$SF= 400.02
##$SI= 32768
##$SIGF1= 0
##$SIGF2= 0
##$SINO= 400
##$SIOLD= 32768
##$SPECTYP= <>
##$SREGLST= <1H.CDCl3>
##$SSB= 0
##$STSI= 32768
##$STSR= 0
##$SW_p= 8223.68421052631
##$SYMM= 0
##$S_DEV= 0
##$TDeff= 65536
##$TDoff= 0
##$TI= <>
##$TILT= no
##$TM1= 0
##$TM2= 0
##$TOPLEV= 0
##$USERP1= <user>
##$USERP2= <user>
##$USERP3= <user>
##$USERP4= <user>
##$USERP5= <user>
##$WDW= 1
##$XDIM= 32768
##$YMAX_p= 472581599
##$YMIN_p= -743200
##$CURPLOT= <Network HP LaserJet P1505>
##$CURPRIN= <$Network HP LaserJet P1505>
##$DFORMAT= <normdp>
##$LAYOUT= <+/1D_H.xwp>
##$LFORMAT= <normlp>
##$PFORMAT= <normpl>
##$SURQMSG= 1
$$ End of Bruker specific parameters
$$ ---------------------------------
##NTUPLES= NMR SPECTRUM
##VAR_NAME=  FREQUENCY,     SPECTRUM/REAL,   SPECTRUM/IMAG
##SYMBOL=    X,             R,               I
##VAR_TYPE=  INDEPENDENT,   DEPENDENT,       DEPENDENT
##VAR_FORM=  AFFN,          ASDF,            ASDF
##VAR_DIM=   32768,         32768,           32768
##UNITS=     HZ,            ARBITRARY UNITS, ARBITRARY UNITS
##FACTOR=    0.250966925370066, 1,           1
##FIRST=     8223.43324360094, -29761,       -58751
##LAST=      0,             -31783,          -35737
##MIN=       0,             -743200,         0
##MAX=       8223.43324360094, 472581599,    0
$$ Real data points
##PAGE= N=1
##DATA TABLE= (X++(R..R)), XYDATA
$$ [...]
23850 205673 74738 -7659 135939 -150114 109516 -107552 -194019 -82898 -349253 -5103 -251653
23839 -251653 35219 -233951 233468 54176 356304 21112 -60474 90244 31741 -1564 200987
23827 199545 166393 -270109 -14584 153550 -5467 269760 2431 -196537 157772 150350 -102837
23815 -32937 263903 200841 -58127 75258 -168858 -377184 -258228 -124640 -21042 86887 214851
23804 214851 124683 159861 -182863 117397 -154615 -172967 129446 22429 -91848 110416
23793 137021 -176113 -30705 -1531 -28076 -206249 110563 110990 140660 -192924 -21536 18640
23781 31107 -126237 -11666 9345 152550 66923 257225 51305 -104543 -175211 197310 127395
23770 127395 -497503 134696 -135637 35741 -208679 -10631 43269 -4229 130320 -35888 102025
23758 211228 -409561 12702 246087 90085 204606 -38968 382149 -118373 -225236 158490
23747 190887 168290 39944 -134860 -67509 300235 -132390 140333 -12286 13999 108572 -21740
23735 -210020 -114510 -134283 29295 -145220 -139803 -173982 107699 97082 -86011 -121712 143754
23723 -20168 67450 -74658 -224472 41920 59982 218226 -216278 -94567 -27094 116946 -263107
23711 228542 -114566 4278 11071 96575 -217190 -351696 220286 238860 -50352 -130572 10322
23699 -95914 114553 69220 168354 -116469 -112726 -189365 178343 210264 -341120 96036 86491
23688 86491 213287 142257 99456 94406 -21351 -42096 123839 -108627 -38508 213708 79905
23676 136034 83717 -66060 14869 41962 -187811 3984 195291 314678 199997 -9765 -14721
23665 -14721 -193950 -206077 111033 4246 -113094 -150594 -63051 -22342 52040 44802 -13716
23653 87319 -39169 -243221 359864 79179 -48956 122403 -78649 10312 166471 -499580 68588
23641 149534 -30823 82263 -56769 -103007 210121 -69934 -111281 -149585 141384 -85359 243196
23629 265089 -238006 111514 -149015 -66545 -171847 -333377 146346 -114607 -176512 -70043
23618 26265 16833 -54020 -294612 -47263 -42737 -264089 281828 459691 -234646 2001 -44525
23606 95406 -335179 11587 76988 -168796 -150725 -159501 -41801 -237415 77778 -67256 -253078
23595 -253078 -342846 -40390 179247 -130018 347184 75680 176531 -45443 -24691 -69679 179976
23583 159431 88641 163393 -77404 251802 235200 239376 -171607 -255810 -61113 -17564 -250305
23572 -250305 -133192 106240 -162598 -108747 67321 -97731 -80277 -258836 75759 -243740
23561 -7350 -23290 162280 -126343 -298568 42493 -189343 -153634 174316 -182503 -245299 -126558
23550 -126558 -28983 20483 -94487 164174 -231076 64559 -169990 106126 226510 97504
23539 135774 128569 203636 110780 -74360 -252380 1478 -127876 265127 -49150 116964 43171
23527 -92286 124147 195743 -16612 -667664 -531018 -19960 36998 131495 -321076 -233565 32732
23515 85433 -281072 -167823 -207274 -188982 -75289 -141751 -122577 -332075 201949 165798 447563
23504 447563 -80560 6860 -145708 2258 40469 -60691 24910 97020 178031 11805 -277576
23492 -190814 281253 -109077 65934 -158605 1244 135790 -86359 -4784 10677 -59391 208128
23480 -194948 -32941 67294 27863 268660 -405857 -304370 -278218 -109968 -321416 -137320
23469 26482 61298 26212 133119 36629 16913 -82032 -152841 91069 -51975 206204 34303
23457 -190532 111090 -98888 192331 -328502 43978 -284234 144679 18978 225300 -393164
23446 65232 -144895 -320954 60396 -46013 5660 21296 -140541 37520 130993 -10743 32815
23434 -93963 -165392 -17662 -190725 -133575 115308 279838 -55878 -80073 36617 -90305 236775
23422 95285 -181963 42625 -110832 19089 -243506 19451 -144110 208757 -89875 -108915 -193063
23411 -193063 155637 -84662 -143505 185583 61506 -129477 -67415 51904 -36078 -202366 102244
23399 -167270 -19161 -25812 -6784 3500 33946 -10532 337729 162867 -261099 38360 30494 142707
23387 142707 178315 -102403 10530 -255044 -14272 -55945 164593 23756 248476 60704 -42563
23375 8685 91948 27518 -249382 105656 -27114 -260860 87965 27849 -129585 -154839 -170301
23364 -170301 105013 244156 -28414 59985 217462 373333 43384 -106815 -41023 28803
23353 -529033 -325922 54673 388534 -128641 -249902 -95439 92298 -154846 -178812 77157
23342 170948 34180 -4069 -62187 205592 -53682 355885 -33928 -3806 -62360 -105891 -143588
23331 -143588 -29801 -247824 -74754 -311861 120072 173059 280016 86937 141703 -106842
23320 -47481 -128306 -49764 -145277 -223544 224015 -114397 116997 -270764 -166450 -82119 -99302
23309 -99302 7210 30704 -162991 -40325 95473 135663 190378 339282 127134 -130077 -222028
23298 -222028 -50146 107599 238772 249272 123302 -102634 -31488 139005 74528 -108049
23287 -168216 53977 -350956 -8357 35760 -3078 82848 158641 -232537 -182471 -22627 288425
23275 124983 -126661 121080 177559 -110646 -177300 58131 60030 44040 157868 187272 319537
23264 319537 -54477 -364960 -279486 -131759 168901 197285 31463 -147208 -24661 -195467
23254 -195467 63384 164243 132913 -120626 -108585 76147 142366 -244046 180966 101643 -41732
23242 291394 -89324 -222995 34271 -163809 124024 -46752 9376 67732 -94599 61438 -324191
23230 -529159 212858 200999 -238198 12973 -74394 -66806 93927 141876 61860 -58808 70865
23218 331158 -168361 -68095 5574 -55318 -167169 -75602 129155 204562 -404064 -66119 -25852
23206 -252303 -153679 45925 274184 84036 38538 -259592 -169472 -205102 -67597 45751 76565
23195 76565 83614 168959 -127234 92443 40741 -78490 156981 18631 -119839 40005 101030
23184 101030 -177839 -162620 -211514 569270 87464 241837 -420534 43373 -333862 -398204
23174 -398204 -395585 55345 -232626 -184493 -128642 -121073 -463886 -6597 264756 -271956 55502
23162 27588 126920 -52337 -70935 -121872 -139161 -219262 213299 55628 -123315 99386 -175221
23150 156461 427238 -202795 -73985 -180171 -410190 -275088 173501 -288196 170943 -79641
23139 -309345 58404 68659 31354 -51878 -86060 -9797 -213327 7777 -35470 -141106 71665
23127 -62358 38285 -284868 132190 87598 39730 96293 302247 -78050 -26561 -272805 61778
23115 320990 -171326 275617 -157790 12152 -62143 -24953 -165074 94840 -75286 -96834 -133770
23104 -133770 61028 -16578 -120978 376732 -104409 361945 -220176 -397 22755 115545 -49617
23092 -104157 -60715 82092 230878 84810 -45131 83112 109196 -49332 -321792 -77073 127124
23080 -80153 81760 -32760 63612 175479 -31758 -350730 -81214 -446999 224245 -223496 182291
23068 273721 -66886 -143587 -97451 -244058 200958 -291620 -46695 6870 127663 361538 -211048
23056 23020 183334 -245720 -26464 -146869 242088 37213 -99609 -200445 -52707 284048
23045 29371 51965 -130359 26710 -120140 124313 143528 -39424 11020 115218 60488 234349
23034 234349 126209 22408 6016 200313 264558 -363175 34873 52419 -139213 -148924 62395
23022 -150274 239457 62883 96228 240249 64059 159473 -70669 -126629 140778 49554 228885
23011 228885 -77614 149367 406486 -125297 416634 24838 86661 -36088 230598 -499997
23000 -138055 140345 -93256 -139902 268063 131874 -86482 251394 95445 3401 67111 -15068
22988 67800 199299 -83935 -68016 -151757 -219467 -38676 -121537 -210953 1359 9438 -62250 -165631
22976 -165631 -62493 90858 -138837 89310 307070 -142415 55114 131093 259811 241396 -254657
22964 105285 46279 -176620 182250 75893 27637 -144422 -238603 -126746 50304 230631
22954 230631 -279701 -112062 -88767 75272 -8843 -118877 -93660 -44524 275878 62462 -208193
22942 90316 -116297 235670 -252411 348255 76231 -171948 -182431 -289495 302107 6497
22931 -161418 87354 123072 -255561 -138465 83267 299427 393076 254418 -111181 -141194
22921 -141194 -140649 73406 -35825 -34028 -6757 12438 83964 293824 288349 361069 -47923 -77115
22909 -77115 -274886 -266842 -161394 -100902 -231198 -18371 164372 122407 -266774 -401788 57754
22897 34440 1 60972 -376322 -14874 92141 -82354 21256 -88715 -326167 -73567 109792 -124564
22884 -77478 -35845 -344335 182907 102977 -498109 123936 -170451 -195636 -66340 -51717 88914
22872 149497 102429 -214099 448852 91135 -117984 -186973 -300906 -205452 34917 -122786
22861 -31002 -356464 -135908 -188086 -3163 184579 125939 120412 -29817 309140 279446 -212021
22849 -50949 -42901 -130081 -122596 143511 72289 106211 60218 321047 -183947 -49226 17013
22837 -132855 27322 9789 127529 -38981 -165928 -312270 516078 -91757 150912 10731 219507
22826 219507 92351 -151128 -40110 -87898 -88945 -354577 -52078 168237 288780 127438 131199
22815 131199 234896 -199042 230430 -197506 -39559 73643 -48439 190485 2361 -202161
22804 -127017 -9061 -242306 -311192 -129782 131321 247799 -104137 25392 -252 -132059 -263673
22793 -263673 -25829 -372461 -39334 120698 356356 -169720 -56901 -49129 -44512 60498 -201829
22781 -139265 198238 -221703 325966 16219 -236330 -73031 -223697 18089 -115830 68503
22770 166098 319505 -171367 -108383 -113283 175731 95391 9375 -261407 70528 -38662 148840
22758 188691 -143956 28070 -74780 -48660 31648 -116983 -82045 -203054 3227 -57669 -244642
22747 -244642 -341267 -2551 4734 195439 -358811 140887 -134694 48633 -337839 -112356 -137933
22736 -137933 28067 -143684 -69565 60431 -10705 181905 -229936 -147506 -73748 -136776 160369
22724 -38892 40145 194060 -156743 -229571 23159 98991 -116189 388667 -202077 -83902 -194262
22713 -194262 56071 47727 49197 142333 -4842 179780 140954 172259 40217 -265384 351685
22701 -2695 166834 -1561 93278 -206148 -121152 -109096 276995 -118655 154644 37473 -73 13698
22688 74566 135094 123955 -65283 -33680 163016 138600 -249681 -265997 -9824 33155 -507686
22676 242938 149692 -29078 -39015 -14018 121412 319906 -276166 -72128 32017 126129 40536
22664 79121 -168121 -25162 99053 -419515 191873 -79994 206267 -224603 -3589 -66393 107173
22652 90667 52611 -88645 141460 51869 -41131 45766 -76916 -422153 -210180 -161564 -130861
22641 -130861 98829 -91000 4063 42519 -166667 -123261 -85767 -137645 211133 -279050 -40978
22629 -44438 -84558 3730 265973 -144395 151142 -200076 23802 -36633 221928 185649 -60554
22617 -120919 162145 93370 -57433 55702 -184419 -57428 -120822 -128872 -69088 -150853 -21546
22605 -220810 195827 -234664 -72715 -124498 119772 -83711 -217797 -146439 -202533 -46730 165942
22593 -31842 -74475 -57033 171561 -205870 -235641 258160 -39209 355980 11411 48096 123886
22582 123886 -230697 -194693 -99366 -156406 -240246 270579 -276655 -61839 -100554 -99605 292534
22570 -154726 391342 395401 -124511 -229902 91372 7604 63639 -35374 -127439 106807 -197653
22558 -73614 -128214 -55855 -59560 -144712 -178529 263266 -146019 -5557 -53283 161673 -82273
22546 -3360 119499 164457 -38885 -433905 10612 -292287 315876 73231 -42551 2512 -252724
22534 65529 -161307 -151478 64590 -94792 -190249 -380498 -80959 214453 23525 85305 -64395
22522 -486020 -141361 -70651 -90265 -213373 106113 -34682 17784 120717 18396 -381388
22511 162743 -38651 -122131 57112 454775 208907 -59110 -256353 96949 73142 86010 -64568
22499 -20300 -351284 26087 109627 153764 -27158 64573 120661 130780 209385 -403722 -220449
22488 -220449 -89616 61177 108274 138360 84115 -35907 161308 -156334 -316723 24235 -17755
22476 -23625 286917 -13424 -203525 142540 62613 -130001 128497 7875 -225519 144448
22465 20310 -249403 -78913 31833 169721 -175667 -26774 195658 -170346 -90236 -107776 140838
22453 -44061 -218180 116743 8639 247742 128909 -282779 -189740 86076 -145754 80187 -192269
22441 221808 -58557 528385 227422 193132 80155 55519 37532 150570 38555 25162 7533
22429 50917 110977 -126483 77623 23768 123141 88526 151753 -19264 101884 -352103 16715
22417 -97186 270556 59538 -184793 -5432 -27382 -126849 49371 -209637 314383 -31170 448
22405 -65913 64530 -63929 135475 418068 -62705 -81549 20000 -5873 -170233 38524 -216244
22393 -296772 204675 87500 -65772 -194435 -89589 -12054 10205 -90441 -137586 36861 -291671
22381 -119581 91064 177599 3915 453577 205912 72019 -184451 162080 158623 155120 -203472
22369 -307237 -91388 107432 -31790 122448 -74073 -68522 -216558 189313 -450476 -244061
22359 -244061 -124915 -436708 61918 150762 -3353 70556 -104261 -3903 151320 -71189 118779
22347 88403 110904 184336 238416 -28475 59999 23657 -62824 -192576 89244 -123236 -184765
22336 -184765 -122241 53803 51694 197237 -12748 -54931 84582 -73644 -200512 -131150 26097
22324 128387 123164 285913 333139 232427 -167799 -305390 -86185 167428 -400161 33804
22313 64082 157352 -238741 -342912 -88609 -172361 -73407 -228945 -39841 34389 71187 250440
22302 250440 -117364 17497 110676 -214063 13509 -500375 -272685 144467 141410 -87262 232223
22290 -47245 -154335 70946 121528 -59520 209483 34424 18402 -126821 -111998 30361 -60542
22278 -94208 -66505 -190023 -132741 207372 144170 -228469 -213653 -44391 -29708 -485176 49250
22266 180224 167266 -128785 -203676 -416985 59897 -93830 -244514 -44912 -7320 -29404 4194
22254 -188666 142156 -56437 142838 -303687 -245951 -217467 -219671 -134266 260063 -10313 -28042
22243 -28042 -208572 -14579 -251678 -114013 78458 -176859 -98833 -198618 -119120 21267 -182237
22231 93784 -75436 -79587 -113244 -120658 12790 377107 26523 -138925 -124833 96475 145394 54906
22218 96988 -13796 -158800 46329 -219270 -9301 112507 -233751 392159 -190602 -76449 169729
22206 -253460 190769 -86281 177230 -128745 228845 87883 -5462 110711 162687 -890 -73132
22195 -73132 193964 -253454 122312 -40036 -249114 -2473 -285320 -179414 -66269 -158098 -206426
22184 -206426 -393406 123614 -259316 -154211 -165782 21185 -62299 42337 -11265 -180427
22174 -180427 242880 282551 -223661 -407721 134338 128724 -222248 -77048 -109583 10849 86272
22163 86272 -104643 -361920 -6397 308060 235345 -239295 -13055 -231214 239635 -121700
22152 -109746 -488967 -121785 187622 -408055 -97979 65348 11491 -42583 -82501 21324 -148205
22140 -65094 -113025 -116397 77326 -89532 -180303 105302 10348 51745 -12409 158147 95998
22129 95998 -33089 -84962 285659 103319 76885 -38057 -106000 -50978 47294 -70017 -200416
22118 -200416 25732 -264534 -253696 -320888 305326 14620 -791 -74449 -300000 105391 156918
22107 156918 -60923 -176093 79097 -244585 -167136 -250536 225189 -133605 -53719 275555
22096 -78078 36603 -328244 1818 -376936 95608 75945 29144 -3644 106416 -5932 -216112
22085 -216112 190670 -32386 -96721 -41297 -110715 -84343 -226419 -52974 -60617 -284498 -110698
22073 67528 74153 -247717 -113596 102091 49526 -130414 70679 223347 226505 -72206 -228146
22062 -228146 -286225 27348 -109530 -175272 -126567 -120467 -119143 172339 -86277 438220 117848
22050 254549 65465 -251257 -145231 47901 -80925 347832 186835 -25872 155276 189723
22040 189723 297506 26378 -270026 14909 -65948 38191 13408 -214325 -41811 40071 -70211
22028 -163190 227012 174322 -116698 72388 -113296 -76753 256333 93025 54863 -400302
22017 -327274 -68619 225445 184375 -114958 -131099 -323387 -45820 -97852 -233557 -320855 170867
22005 55238 -426948 -216128 34591 -26112 222381 -40121 156043 121032 46684 -271247 -113546
21993 315808 101271 7010 -99725 -55557 48825 247070 -44798 -233272 61440 -149486 39339
21981 -33735 -187546 153445 55397 -205744 138608 -187236 -60531 -182172 -71961 -186525
21971 -186525 -53348 -311151 -249245 -124320 329079 -204739 271101 -172632 144008 -504107
21960 35303 -194740 -276169 138404 -29459 185496 98245 117694 -250114 220410 169714 50740
21948 -171501 -76757 127499 282567 -120023 -339254 115637 -438214 -129725 70081 -349188
21937 -30489 -3850 104334 53456 -306176 -225600 28947 -275431 -65996 136749 -257937 -198197
21926 -198197 2786 -11451 162081 -192786 159773 254919 -212591 -247195 27944 -103222 169751
21914 -185185 102500 57512 -100953 -9183 132494 -175933 47077 63590 -118472 -152720 -90273
21903 -90273 30240 65673 -31217 -301230 -198750 117923 -28424 99745 114463 -285342 -215978
21892 -215978 21671 -30942 -173052 234364 -207317 249781 109525 -230026 3680 159382
21882 159382 -164694 -35685 -106813 68049 -285525 72494 464415 -11790 -50646 -126050 139887
21870 -227578 65453 215275 -142731 -311171 -77350 -217939 -7877 289719 167712 -265711
21859 -261771 -68025 122619 -332556 -337573 275880 49819 33823 -220206 -131953 -109766 101781
21847 94751 -58420 -120552 209448 -96225 150656 -32730 326445 -27408 -231139 255562 -102263
21835 190835 -149875 -17876 -100890 117030 -22696 -94067 -89902 28188 66566 112303 -278725
21823 -90120 -459744 -243559 -119896 45710 -150882 153872 398041 -82680 197290 -56325
21812 471497 -43665 -100632 -180203 -64421 -205649 108686 95978 -65438 -464525 5133 121179
21801 121179 123232 180012 323552 -88715 -67650 -312310 -94364 29326 61429 -208461 85278
21789 316969 97762 44885 59639 350826 154784 -119875 127816 -239509 -375436 118726
21778 -513829 241833 130676 87039 -144882 -208436 -92979 251271 68244 330951 -13232
21767 9421 -66559 38861 38028 -55252 173284 -304095 -405984 -463613 -242650 24946 -313246
21755 -203086 51336 -44224 33527 -136331 -198102 34161 -286008 -51415 136515 78641 -191222
21743 -75235 327182 -100714 278190 -54561 260510 115846 -126820 -131566 80375 -187480
21732 -319689 -26961 56764 -204086 -275636 -94994 79815 16803 17639 -50393 6618 -26841 19153
21719 199543 107081 -202682 65630 -173377 108182 -169032 -90700 -75285 -87969 -35605 -62801
21708 -62801 426925 -51913 -177945 34227 120077 143725 48167 8396 -64237 251805 -175111
21696 -133038 78208 -272167 111906 -14856 -496499 -64352 -164103 16822 -354828 -116759
21685 -179127 -12179 -295612 289612 90296 -109944 40851 231605 -63461 67302 -35680 -422149
21674 -422149 -311822 157858 -139990 177523 278140 -297686 4033 -144522 -163827 -146548
21664 -146548 170387 -169704 -251857 -156255 323113 -96523 17714 117241 -392021 183623
21653 183356 -104246 40779 133291 140935 -235602 -73327 -130328 37585 -123522 -54061 -106474
21642 -106474 -92095 -66658 -128157 396340 -143226 -6738 76984 -8043 41227 -53905 107583
21630 -98647 -271438 162446 -59384 -134683 -41944 -247339 75727 3909 -213493 -41235 -46099
21619 -46099 -34280 -70027 -76609 -282558 -49004 1579 -7036 -110470 -3659 -123442 -98093 -184028
21607 -184028 -10468 -35665 137623 -252916 -187186 -301320 -133385 408070 191054 -29063
21596 -187690 127009 -190355 -66782 -315652 -141179 -102749 -155554 -288269 91339 205283
21586 205283 -48677 235734 -244197 57873 3426 -293145 204764 -210946 -17469 -346095
21576 -346095 142641 198230 -45992 76869 32764 232122 -33306 -171240 -279664 53096 -88361
21564 -375417 14196 -62685 -116571 45550 -168716 37572 -300089 46076 -394258 -161978 27965
21552 146739 60313 -200984 23361 98847 289000 -267609 76270 -335572 -57301 19562 -214154
21540 87697 -333036 -98872 179698 155739 -220004 101110 185528 -239631 -258205 5855 109552
21529 109552 -99902 -121270 -79302 -92160 183684 -199705 -192936 -276940 -260384 110179 98111
21518 98111 18291 -32288 311442 299368 -176037 -185712 -41694 -4203 -88688 -523377 102357
21506 265626 -7687 -86187 -205973 107318 33383 100864 -388852 159478 250179 -243445 66625
21494 -9953 49417 36159 342068 -93 -173703 -20259 -147335 -150339 -122122 275293 -110383 -105915
21482 -105915 32097 -337115 86635 178518 79679 -220935 -59400 39408 156989 -104681 -22552
21470 100387 -323978 -200740 -45906 12179 -120408 -32989 -228826 -157523 -95438 -146254 -196001
21459 -196001 -2774 -166818 -15389 -59275 57546 -266632 -9181 37873 -266479 63724 -349777
21447 -260667 199400 243905 218827 128971 -89191 -43362 234569 -124680 238219 82327 376530
21436 376530 528189 511221 463787 394210 244540 81444 483 -229297 43575 73869 -83668
21424 -197024 56558 -181728 -164877 -200516 116349 138767 -131624 -32103 4045 -458878 138238
21412 -12656 243809 -162842 -470476 -427521 -157714 -75008 -233419 91703 44321 58634 -183876
21400 397675 -325389 -145487 8341 179391 -134471 -104173 -304561 -21842 173084 201365
21390 201365 -188746 -114445 -168674 -99089 -24922 -153836 -311586 57340 -168092 125057
21379 -227849 -296236 -80737 -17526 -81720 -299134 101453 -70359 -21229 -211767 -28274 -251074
21368 -251074 -282041 -13997 51289 -42255 -289812 75296 141961 210869 35913 51135 -11683
21356 -24687 -12975 -358799 -134360 -71591 -62842 101021 -295795 -185635 -52768 -75287 -233730
21345 -233730 -52161 94400 145592 58736 -169459 -3713 107242 -68667 -100398 79799 130743
21334 130743 58818 -43492 -254269 -179976 56431 -276303 -134340 269987 -105383 -567783
21324 -567783 -18721 153129 -54245 96329 31628 -39812 -112834 -7314 -56966 44755 225626
21313 225626 58721 -92052 -100670 -192943 29561 25490 -229021 170189 -207547 -308064 34090
21301 -4527 112332 46212 6926 -394042 -43103 171671 45566 -191680 43352 140291 147980
21290 147980 -152391 -104149 -90977 294487 56933 -292380 -506037 -45965 127828 241299
21280 241299 -76942 369609 -176434 -51604 -297319 -124301 -6471 47971 -103741 -59493 190874
21268 -159191 85219 -157736 38669 30880 -59173 62799 74192 -195747 -3023 373183 182618
21256 -201464 238243 125303 -95613 -122435 54945 32729 -203391 -127576 195452 -53204 159919
21244 -57154 -257078 -24612 -42755 210897 -176279 -211720 187749 -21955 -16613 -47895 38341
21232 130500 -16144 174366 -196710 22309 83084 176000 -129014 -71406 -110172 -365998 110365
21220 -108312 -123073 92682 16711 34599 174782 95829 -222124 -280308 -68437 -407281 -247650
21209 -247650 -459668 -105786 100449 -175305 -136290 -106563 160738 107190 195127 -330234
21198 -137266 73292 -147458 443422 -6196 -23714 154002 -180013 -139844 -184326 -739 -62895
21187 -62895 -58268 -42223 -96104 -379711 -311177 -236311 -163808 117681 202678 -169342 -486220
21176 -486220 -276656 -137725 -8294 -108880 -137380 9768 13210 -102946 -8194 -138224 130225
21164 -2096 -130381 -54747 -32610 89567 -361599 -23673 -15467 215067 -33612 46115 -268898
21152 -68597 -154162 -72644 20894 7913 -205360 -76964 -96399 -84599 -164781 -60509 -386782
21141 -386782 -357787 156840 -363216 30651 -93099 239612 -108138 39398 310309 234191
21131 234191 -130042 -34345 -334791 -25425 -223231 -7571 -195830 -304300 -66816 -122227 -316367
21120 -316367 -168423 -28696 -403372 -168133 -1681 322914 -22963 -206065 62061 -131992
21109 -193700 168046 435350 60485 -328788 125322 -149467 -384219 50114 -283524 -112291
21098 25443 44678 -374633 243351 120620 -197669 -301844 -145370 7104 -11054 65424 8579
21086 -134777 155519 -28598 -148087 -82592 -117494 -65025 -290825 -174570 4840 63275 -294776
21074 70784 192476 4968 -137496 -79648 30357 359703 -198174 17201 235606 302356 449649
21063 449649 -20372 125577 180900 159320 -102781 -23200 -107362 87563 -60617 139226 352187
21052 352187 -8130 40427 -619987 -197604 -5516 -338023 -66574 -75359 33971 -221525 -150746
21041 -150746 -92010 -77531 -205807 109568 -6947 -123165 -18477 94602 -50152 3811 -248980
21029 -117152 -129694 -54596 26175 -284158 -114393 -110419 95395 127930 -122490 153641 52622
21017 25209 155438 6016 -282203 -259589 52398 -249072 -231051 -68513 -5651 -355377 213919
21005 -9427 216295 -20157 -149119 -68955 102947 329057 -372808 -5865 -102445 -115336 -138316
20994 -138316 -133604 -224075 -227208 86245 -174398 -366601 -46851 83118 -31854 -18329 -217611
20983 -217611 -108508 -33357 195189 -155760 -100300 -75867 225481 103887 78628 559 -178606
20971 -8662 -53305 -215901 -245600 232593 79112 -406210 -409775 -78643 56743 -80969 -152132
20960 -152132 -9560 -48396 -99730 208547 -110927 -168488 260934 38750 -98966 29958 -86004
20948 181880 94421 87800 -128656 -301533 77334 -252612 -312843 -348702 285318 30838 276984
20937 276984 -114434 -77772 -116524 1925 6846 -265934 -170996 209999 266711 -88897 57868
20925 541492 -71749 -65046 -284555 -28400 123868 -54620 -20627 -210036 460095 -91415 -59521
20914 -59521 -110124 204882 -148180 17155 90153 -195627 -151236 -180601 -74641 -196917 15264
20902 -286086 -28009 -209232 -34799 84645 -171295 225273 342931 -57719 46028 -77107 54613
20890 157963 -114349 -122356 -274416 61621 -234364 -82840 -96752 -66016 34969 -219066 -281968
20879 -281968 127513 -12931 -29143 -146151 37474 -84121 -55359 -26730 53225 36958 8998
20867 -24062 -255257 30703 89871 -314068 -170033 -113857 -214338 161577 -536044 -246269
20856 227487 -12123 170809 -175990 48811 -369478 -49129 -125099 51297 79994 -269094 55706
20844 -112730 23738 -241702 -25686 -218724 -256728 -320654 -109624 180032 87673 -25616 -328055
20833 -328055 279138 5499 334732 3963 -57590 -51962 -21865 -80321 -170663 -40539 226761
20821 -321031 76890 5613 41663 -204185 -141454 311711 -56648 -96502 -11448 -71248 107 -88253
20808 -185452 77945 -16052 391052 201336 314474 69649 219525 82369 -204939 -292146
20798 -292146 -418465 -186684 112366 30926 -298695 -271857 2083 153967 -61263 -139576 -176467
20787 -176467 186212 -59132 281772 -165497 -308441 -302813 -42311 -98628 -236956 -141049 -48845
20775 -33286 -102252 50414 -101352 12177 -16038 -302126 -275267 -245728 150127 -202301 156163
20763 -223908 -83298 -26877 -159385 107529 -52949 196314 -268844 39848 -267277 -60798
20752 -215411 -34057 327940 -156364 -137147 140852 -90781 -152802 125454 -38106 -332789
20742 -332789 -72237 -237826 -35806 -33247 -126967 20592 103843 -215272 -83716 -44523 27740
20730 -12976 -167780 132997 78051 -37374 -15428 -84652 -116875 -129533 111305 -16745 -93087
20719 -93087 88548 -237210 -195807 111739 222123 -74470 -76109 -275806 -56819 -139267 3997
20707 -333416 -278636 -151566 243953 61065 -141445 59697 488367 32257 154002 -174449
20696 155733 39114 -98271 -79224 -328643 -88944 70004 -248369 -166449 156081 48232 -52235
20684 -14432 -415511 -219085 182365 -226119 10062 17427 10557 252493 -102881 47769 -95952
20672 168199 -169708 -452534 54851 -300892 -115823 175055 193527 -95481 -138653 -153006
20662 -153006 76178 -169021 -4556 151055 -75531 -61585 210768 -40580 82343 313449 -93020
20650 -294300 -189506 39545 -114735 101058 -236404 -133677 -401127 -304660 -104968 -331375
20640 -331375 -188165 -1931 232325 -140539 43359 -14307 -171433 100412 158159 142252 -100734
20628 -65467 95122 -169157 47699 -138862 -174364 -155009 -148026 93060 191374 -39443 267312
20616 -95873 -60402 -332913 -31846 -201549 -165566 5151 -60978 -17494 92379 -104659 -374610
20605 -374610 -143109 -58375 157047 -163769 118405 -17358 -301487 -114066 -156791 -76909
20594 190057 12964 -17175 120092 371812 -69874 122341 -97993 -64001 21964 45138 -17587
20582 -219259 -351634 -89134 -73809 125415 164474 -8689 215212 141354 222702 -57384 181803
20570 -7342 -114717 64012 -168655 -86059 -55033 196848 94245 22328 -204383 -339717 208109
20558 160255 107776 -157466 -148760 -105757 21562 -79258 1887 48881 -7707 -3836 81719 -15338
20545 -76255 45094 -511369 -278803 -465219 161129 -68440 -337819 -32926 81492 194785
20535 194785 -214711 7858 232282 155279 -3971 -255213 158281 -11760 -130222 -122016 -74634
20524 -74634 -40369 180350 -278500 6939 -78735 -163514 132100 -494338 -235182 184088 33598
20512 24150 -133107 -79811 227745 4471 74851 -170279 -141051 -208774 27610 195917 -49519
20500 8978 -269359 -53995 -447395 -228840 -170861 6699 -311204 -76029 -101314 -74128 93668
20488 8061 -227454 75631 -89290 -38458 225077 -105830 -24010 -109593 138563 14303 334062
20477 334062 331890 287329 112623 240812 -164752 -85184 -216861 66440 -241486 28263 236031
20466 236031 -156390 -48591 -27876 104079 209340 -444267 396605 -44048 -216632 -299202
20456 -299202 -102812 -180628 27173 -31863 96827 -390980 126122 -33365 176178 -117272
20445 31839 -262610 -271831 198049 -47393 -301043 -119079 56848 -67924 -85935 -14425 186052
20433 -88863 -54258 -68219 66630 100000 -199576 -26777 -40030 117409 223198 -118706 -257859
20422 -257859 -318566 -58082 10849 -256216 72019 80821 14155 -63817 165203 -80256 -96306
20411 -96306 -10414 214071 -48426 -436965 200355 60573 -11540 91979 -4935 -15100 152820
20399 -86662 304 140113 98235 100058 42901 -266578 -89835 66138 -64226 -116150 26930 -319077
20386 -301478 108164 87865 -14164 -144189 -108429 -156143 -157502 -4845 -17294 -225817 -287835
20375 -287835 66129 -297379 -163947 -49386 -152394 76523 -39750 439518 279132 -158028
20364 -135986 -57574 35338 75327 -57426 110686 106147 -319626 141930 -42368 -205153 310156
20352 -44383 -269039 -263221 7505 58719 -54929 -85279 -254213 95465 -105540 42701 -28132
20340 39606 -92515 123056 -320371 -189298 51660 10372 -20846 125371 -171192 -71525 -112884
20329 -112884 336026 -271002 -283863 -75140 -126493 28097 5634 19024 140702 -32955 27559
20317 -145923 -212493 55680 -338559 30759 130934 41556 -94148 -53369 128879 60466 23672
20305 -5714 -203465 -27482 -176078 -85654 -136401 18979 113805 -258447 -261737 -141766 85655
20293 63611 -255117 -246907 -114196 97915 -226721 -206078 -108200 11568 -47074 -2691 191133
20281 72381 126977 227676 -236510 58520 -11708 123767 -154764 120322 -77295 -340476
20271 -340476 23098 -394828 -236233 46337 -32109 -30730 -74823 -167902 -263723 -33901 -7773
20259 209230 96992 -95185 -184114 -214686 160167 254705 46315 96673 -175365 -7176 -402087
20248 -402087 48621 -77434 -200644 -131894 -140913 -101489 -185788 8338 297224 -81846 -342633
20237 -342633 13075 -353754 -132597 -126503 155868 -315810 -435713 -209427 -135739 -21023
20226 -107659 307032 -9665 -272387 -116694 45573 207136 -115037 47866 311933 -61584
20215 -50761 89939 25514 236354 310486 -312299 107365 95860 -145550 41957 -134399 -233665
20204 -233665 125610 -131087 10644 -114979 -33359 126893 -98414 -395500 39880 -258051
20193 23427 168020 -242336 -108412 97297 -206297 -385979 -106074 -98103 -19402 -107931 -159278
20182 -159278 215384 -233513 149512 -115022 76387 274380 -37610 180869 -74651 22247
20171 -253184 -163952 -197216 21974 -411509 -92331 -32212 166414 -188960 198914 -11130 325144
20159 -93761 -168171 100483 224186 17768 -131519 70410 -105972 66467 -131386 -437970
20149 -437970 -102235 -39231 341223 -274867 -59569 5272 7778 -289885 85938 -225238 21758
20137 -227104 116632 -46021 24284 -60540 62174 -83719 -14596 -376236 190925 -295589 -238799
20126 -238799 95931 -271629 137647 -161418 -181290 156733 -219374 19473 213527 119676
20116 119676 -311359 -264586 165733 -197031 185270 197193 108027 -215604 -211730 -193189 -296242
20105 -296242 115567 -185112 1024 67347 -39895 -163522 22002 545338 -83920 -191217 16812
20093 -274854 67746 15917 -318302 -342649 148402 266852 78714 -86816 143471 26315 -240525
20081 37208 -73915 -129545 44460 -263906 -162311 60129 213154 -26255 -143011 84347 51717
20070 51717 293804 -183398 41603 -165787 1704 -165212 206932 -116592 106411 89540
20060 89540 -20388 143961 -62378 -55010 113898 -185668 118854 6428 -521080 144282 -402285
20048 -143457 5554 -122899 176072 4284 -136016 43802 -242196 47496 187458 -229277 -282227
20037 -282227 -53583 -196918 -189295 -75271 -12249 217709 135704 129845 -64579 -336 -312306 -304907
20025 -304907 -353953 243044 49235 -130240 -73215 -286133 239463 -236581 188964 -500460
20014 -225269 -23056 491409 -223561 227058 -170606 -293510 -42610 80426 365719 -254240
20003 -183716 -449412 304310 -174089 -130295 -306046 1484 -73756 66784 -275429 399432
19992 -93019 -453818 -9881 -306448 -186372 -327868 -56631 -190964 265089 110239 89864
19982 89864 25439 -40181 -44697 18595 -235372 -124336 141014 -93567 3915 147672 -24452
19970 -31203 280 152775 -27457 -137592 -109263 113008 -291307 -213957 -8723 253115 341842
19959 341842 -31814 151644 147164 350611 -128004 -199655 -181829 -80594 289092 -68394 259575
19947 28412 -96827 136432 -100525 -78322 250046 117480 3693 -234854 347053 -246744
19936 -189924 -181349 -14639 136712 202841 79021 -414793 113894 -255315 192552 -259036
19925 -123548 166279 -156761 -211356 -146345 2910 88898 -186282 100420 155180 192957 -106619
19913 -10589 15516 -60865 -74895 56248 62393 -157789 -132823 -153189 -42065 -231392 -115045
19901 -236393 -149641 140412 -198332 132541 272694 -209982 -153996 -81740 -106532 99050
19890 -26411 -227183 -280700 130586 -274915 57091 -142883 -262019 -296798 -131728 178482
19879 -103789 378240 -78683 -59691 -101692 -85705 -40041 -129666 -61490 -184775 182052 209000
19868 209000 -152654 -110057 86012 132514 -372257 -230907 -186635 -16069 -258257 -100871
19857 -43197 121962 -118367 182846 107244 -435254 -66554 -133250 192032 58836 -90379 -61860
19846 -61860 215735 5114 -20432 -20553 152291 -174124 -254858 -3726 75422 -146391 -157672 -120292
19834 -120292 -80253 -195102 -265748 -154366 -258694 102483 -122810 95496 -222545 165736
19823 -234620 -190634 -35096 -252665 48672 54694 43916 -88204 214616 -121524 -129904 -89841
19812 -89841 -116081 90691 -196517 -47297 -288442 -75682 -198651 -88672 366385 -110050 -35524
19800 -62844 -240721 -271718 -319426 70837 -77414 -10866 72642 -87949 -8662 101790 -165827
19788 135031 1319 -118117 -368105 93010 -164735 -298395 -150320 26733 -61574 129177
19777 -58558 -144248 -26322 47227 -207676 -69829 -156410 191414 -42065 -135227 -128639 72478
19765 44900 -74213 -263997 -73922 -54862 -190573 149923 12874 103606 -121469 -373603 90025
19753 119599 -27369 -398014 -67722 12706 11105 -156261 139743 -442453 185708 20214 -149155
19741 -104288 130579 330250 -173082 72206 -158862 -47768 104644 -64276 229461 -161380
19730 -306083 -9093 -236108 130784 -307265 141898 48095 105412 232 -132713 -278523 -108069
19718 -188691 -108220 -126272 -125004 166801 44757 -115643 -151714 6462 -154421 -207556 298451
19706 205261 -179798 -72574 -169845 -86052 -176466 -9820 -103147 -251729 -273334 -402456 68388
19694 -451657 78639 207594 -198245 69988 -76653 128793 23874 -151900 161784 13273
19683 -90227 29216 -301765 -9085 -118532 212836 -139849 190865 -374132 -28752 53309 189986
19672 189986 -188291 -36034 213266 -256910 18620 55607 146624 -54794 124540 -297763
19661 244997 -99706 315478 46958 -164364 -155843 -26065 77026 -301394 -92164 130547 26176
19649 -323391 -30969 203185 227705 -24602 -29490 -414919 -269857 -244935 141892 28375 -106277
19637 -219476 137271 -286350 112666 -296001 -132741 12216 -307368 -206649 164084 -62337
19626 -186587 -167148 9454 -112924 381434 144587 -128034 81596 -126827 -158162 210563
19615 -266576 10025 114955 -149892 121202 -115903 318559 -303338 -12046 -132277 15508
19604 -100197 -246660 175170 -506754 -67828 -28325 95054 -168241 -186654 -205076 -42107 -18589
19592 -257633 54862 63788 -6882 -87071 -13850 -87310 48002 -461556 -182374 -93230 -126021
19581 -126021 -51372 -260702 102222 3358 -80266 -174758 53854 119403 250358 -186986 -136463
19570 -136463 -253214 130828 -63500 -137010 -95719 -130421 57187 -9808 -195569 -384137 -356652
19559 -356652 -284505 -89410 -226588 268017 -177508 94491 26694 58322 -6449 -406542 -70093
19547 -14626 162294 118633 153179 -360533 -257801 87177 -85752 -327569 -191184 -63660 2613
19535 68203 136298 32432 129471 -209077 -7910 -47684 -284634 -6350 -175358 -49252 -88638
19524 -88638 -286117 -81094 98839 -217190 -253839 -102935 -12154 -255440 -56683 10715 36267
19513 36267 108567 6239 343407 -94323 -26090 -386182 -8324 46951 -325877 -326109 100762 -142102
19500 -292518 -232976 -170641 68863 322916 -3137 -236858 -283236 -166765 -48815 -59613 307568
19488 -232669 13516 147526 -3837 244397 45513 -98931 99523 218812 -6058 325795 -17116
19476 -163651 172727 151918 177886 -44777 274917 1519 -128069 -353730 182853 -1014 210643
19464 -58505 64531 -132021 3118 -57591 -646987 -126485 -33029 -117259 106530 -281683 347967
19452 -205027 -301309 65422 258478 -82569 11453 -56883 -55565 -85659 -49521 -77155 42456
19440 -81369 24498 14828 -182076 -28278 -94594 -327858 204152 -71547 -2851 -9946 10079 -22278
19427 -21841 -412336 -99539 -123188 112488 -123732 83540 255701 -84537 35965 77695 -14768
19415 -221369 -277895 47089 -99118 169328 352347 119626 -196124 -270145 -100302 -179060
19405 -179060 -36185 -90406 -123249 252335 -243383 -189340 -304778 -30159 36823 303058 -116931
19393 -92407 -203136 -105538 -9311 -41656 141129 -75902 21263 -157142 -68804 -261498 -126345
19381 219480 98890 -125857 -219340 -515975 44965 150305 -245852 -39791 -248364 5135 -184874
19369 -110806 49750 458067 61119 -36387 101616 -30609 -187625 -92089 -159165 -48770 -223777
19358 -223777 -302562 154163 -86202 234773 79101 68196 109156 -231655 -48283 77240 -274431
19346 -157509 -56459 2554 -55347 -137344 -259413 32549 413506 -180846 5411 130659 -241367
19334 64133 -129996 -49892 247947 260588 121925 -55050 -55400 -52841 40651 44148 -32559 -113325
19322 -113325 238382 -235448 -43464 -216317 -8657 151049 -49585 -193445 -129572 -35533 -180245
19311 -180245 -206139 1788 -329613 -191746 -40626 -24299 -151854 -229883 380592 -155471 144688
19299 -76480 -115259 -492433 -138958 -127610 -13866 11426 -60109 -486274 -108292 4156 -72389
19287 -130920 73954 -70962 105381 182938 -29699 -67591 -382867 -73417 -200412 -49336 -84673
19276 -84673 33700 -72791 -356895 -303832 -71751 -255625 236338 306840 -229771 -70295 -144036
19265 -144036 -151317 -217568 -115146 -379404 -104511 -267775 264061 -241610 -99591 33319
19254 -340122 -234872 -195019 -243386 2121 1407 257918 -341798 -31883 -165872 281800 9358
19242 72365 59790 -111540 -143935 183788 267818 -87779 -292803 75475 14407 167852 21481
19230 -193826 100985 -120701 89352 94647 -10279 217270 303971 -123352 46903 -7376 -12177
19219 -12177 -234624 -279747 -75318 77951 13435 -30781 -32647 -65950 -123118 -17046 -190788
19208 -190788 6093 -250349 -18950 205475 -102765 105700 -166062 114040 223389 278026
19198 278026 149316 -15672 -142961 -130628 83044 -332624 137342 -129874 -132217 -91708 -152521
19187 -152521 -123954 -161288 -199077 22243 574021 -10344 55230 -54154 -215825 81636 -109557
19175 -2743 -22126 244072 -224485 -291064 -539474 -192699 -61055 -113767 -116557 -192995 -238637
19164 -238637 183735 85253 -383276 78093 -44759 2248 -314046 -205747 176878 -171831
19153 -96114 -206113 204405 -31084 74634 -263974 43680 20716 -3455 58343 -307070 83190
19141 -29853 241413 -248596 291328 78976 219640 -19691 -133839 119867 -68759 110161
19130 -279136 94919 -103708 17767 285080 -9558 173108 193172 -159 94275 -290255 -362125
19119 -362125 -63786 47713 60464 -69040 -373476 -133349 -262981 -88510 10360 -291625 183507
19107 2382 149249 192312 -173525 -154338 -31302 -74063 59256 -45652 -5474 105040 9126 -291770
19094 -139618 181463 -89374 124085 28835 -124904 -107042 -247450 45374 92968 -96488 -100393
19083 -100393 116263 -51567 -115654 -205502 139724 20126 -55424 -156110 68423 -359230 -359149
19072 -359149 255898 -235098 -129799 -358685 244570 -209206 86183 -180073 60820 -95135
19061 141893 -149956 -67250 -152690 -48421 237431 14526 148464 -11383 -201236 211603
19050 26401 37901 43120 -184822 -119347 -10572 174433 74444 -184265 -56912 -188633 370162
19038 -188149 -10533 424632 104597 -246777 -272976 -336748 8311 11564 -36671 -275371 -230214
19027 -230214 -37951 -106139 180182 -93766 -59295 44298 116287 -180633 4924 -336518 23714
19015 210948 -158044 213396 -30367 -8803 -2921 41048 25984 38353 -131068 182355 -279784
19003 -275989 -41744 -173110 -145144 -98283 -208188 125742 -115779 -144370 -107703 209240
18992 -329536 551 -306497 -367998 -2144 -9137 239718 -325184 -19763 -541407 -51707 191233
18980 -80131 97281 -248850 -120000 -115442 120259 122076 -137195 -358392 -17239 1872 70392
18969 70392 355991 16185 -292802 -187320 -257099 -136916 163615 96355 -209323 -117463
18959 -117463 90358 -196958 -185064 -294684 -36800 134382 -147948 -88347 105238 -125476
18948 48251 295088 81773 -273213 86779 -7244 -203844 -36566 53626 -156268 -174762 -58231
18936 195638 116006 41868 -170619 -103068 -92140 -64704 24525 72978 15814 -22217 72831
18924 -105826 -7673 -91155 161551 230428 -39157 -126200 276849 -124850 -284530 4089 32654
18913 32654 -93560 -52646 -123659 -385065 -148011 -113452 299503 -73980 26087 16007 -143463
18901 -221211 -38232 -80488 277097 -134204 -3022 66469 -231008 193687 12499 51669 -366470
18889 -89489 -97720 -90454 -41244 12641 -263163 -111724 -11028 -81318 -438608 -150442 63451
18877 242196 -178172 232531 39265 -8871 215974 -172320 113905 26988 -221882 -191822
18867 -191822 111885 101408 421771 -42083 -210767 50070 -72509 246357 264665 -232451
18856 -7406 51409 379973 -65330 50005 -230115 -66921 32203 -69757 56311 3404 58054 277674
18844 277674 -69466 240740 -141497 -163129 351689 86932 -187939 -193605 53614 -52503 -24508
18832 -269670 -269586 162975 -53020 21559 208472 433897 389744 256 -153023 -293342 -131343
18820 47853 -34702 -109358 50948 -108738 179153 164560 -4919 -16994 8473 57355 174341
18809 174341 298548 156503 -180519 -153744 -145577 190720 1282 -325258 199619 31966 -167158
18797 -175676 282642 -111114 -121209 -432096 154601 -45435 18858 113136 -266574 -52242
18786 118589 161197 161276 158606 -78541 -147487 -140241 -66118 -184518 -223809 -69199 -95147 -64648
18774 -64648 344845 -365967 89841 -64165 -212292 -197942 -287210 -343465 -184905 -18454 -106363
18763 -106363 -91083 88759 -4413 -21251 73188 -37222 138084 -77880 -419248 -38261 -461273
18752 -461273 -191629 -38018 65997 92776 -98427 -349354 26010 -2694 83899 216758 342876
18741 342876 -178221 25480 -288693 68559 291069 -202959 -253132 -475341 109521 88255
18731 88255 -47254 65576 -3055 -63037 -352778 -143935 -57325 164827 -62345 -22745 410645
18719 100242 -52574 107632 -53860 269439 1904 -285722 62195 -271612 172353 161944 -316995
18707 -148231 -135826 -198599 61709 -248248 115685 -413495 -37040 177851 -143960 -77190
18697 -77190 -128045 -64426 34745 158597 147178 -231674 -45921 -293350 -209521 -269099 -117062
18685 195389 98277 210902 -137857 49902 39429 237157 -137203 -151776 308028 76505
18674 39354 83981 -175670 -96067 163851 99617 7812 -193755 -217484 114766 60275 -235736
18662 65882 -264906 -88288 251492 151323 -158496 -349054 -49038 -124748 -32998 -28806 97078
18650 -74840 -256163 -203031 290672 -220007 -279804 -446061 -106769 -182045 226219 111720
18639 -118953 168639 96119 48923 -146612 319781 161624 -59401 42083 -10945 46150 48348
18628 48348 -147896 -290231 9758 27351 160821 25833 -115702 -111814 -249793 -5067 -218191
18617 -218191 -441456 -305846 91790 156744 -186450 -25491 -22045 -26663 -304449 -124520 -298448
18606 -298448 239433 -92701 -447492 -159894 81492 -207251 -232202 -230126 -152671 -242029 -119247
18594 -88760 73230 123799 25102 -164931 133473 -238562 116164 -140136 -164122 1683 173034
18583 173034 -81288 -361048 -72171 124312 -260559 6093 -36778 -173691 13956 -86242 80863
18571 262234 -206835 194583 15474 -278581 248433 -121185 -110019 180664 -156431 -7640
18560 198185 158483 127063 176161 -267619 -37524 -306855 -22711 -144002 133867 429236
18550 429236 -151661 -206330 -200698 -328387 -215194 202406 308724 -11765 -43071 -196134
18540 -196134 -65589 90370 283647 136003 258742 197308 -41801 -119766 -188589 -341282 3555
18528 118030 -151942 -233452 -142643 48544 138390 -111501 -190920 67717 1033 -43745 136191
18516 44248 -24502 357904 -66951 -158266 88822 -74287 -32588 49433 69188 -29364 116654
18504 68172 -85155 66054 122228 -8079 104700 -180288 -6340 -444979 -132607 115297 19139
18492 -211425 -421666 312629 -115998 383285 -41946 -252251 -73537 316323 -251595 -330105
18482 -330105 -46972 95269 -27222 -202850 -169103 -2812 166913 -188007 -29094 -19473 -109572
18471 -109572 64657 95748 -325315 -183584 39224 -370691 -438191 -342458 -21777 20042 -326522
18459 380336 -165708 -217281 19327 133054 -215325 -44988 -19263 -253628 -139674 -428929
18449 -428929 980 92217 7976 -32619 93221 -76 -287169 65236 63074 164891 -232327 -90530
18436 226402 -214109 -70466 -5328 -290854 -80604 -219161 115110 330773 50976 -260812
18425 -29343 98633 -97975 -291109 52098 -50712 -217736 197306 -102977 434530 93300 14018
18413 163527 -30142 97290 108483 111646 -137076 184028 -242311 66621 -99667 83588 212708
18402 212708 373305 -222048 -1843 68845 -75962 -12371 108350 154411 -101857 41587 -208609
18390 -109405 -219333 -66842 -100155 148676 -75578 -281273 -125429 239901 -33369 39013
18379 -117395 54560 -280322 139640 162753 -115405 264703 -302828 -95965 114050 -70945
18368 30156 173782 -81380 -222267 -33278 -36267 -316791 -1571 -269404 -34808 -234827 -210524
18357 -210524 43357 -46906 -156749 23278 -316652 -27489 94256 135839 -310372 152 134923
18346 134923 -314624 -211531 -228141 328658 126023 163004 158535 118753 178357 -446647 -1397
18334 -97044 157278 -261469 78979 33033 -90680 135357 -237917 83418 200519 -221114
18323 -348329 -117919 -241728 -209652 35359 -110008 -206031 -196767 -141038 -134187 -42186 269515
18311 127527 88011 -290854 -259689 51133 -169128 5010 -112990 187801 -134407 252799
18300 -96416 -200035 -219292 -77830 145340 -198692 -279010 62062 262971 -125511 -22377 -248132
18289 -248132 -154016 59247 -131289 -26290 221283 146696 95123 -216234 75689 -338744 -413884
18278 -413884 -101849 159736 -93194 -136580 76996 -131732 -6983 -25705 132799 -361144 -85575
18266 315475 -434634 245361 -124781 184968 151747 -27272 -333214 -71887 -258758 -113362
18255 58871 163135 -3409 -189837 284859 -182344 243776 87446 135419 86041 25597 -106322
18243 34779 -160982 -314745 -253404 -14580 -339894 -41874 -139105 -69754 -275332 -277042 294588
18231 -224949 -120670 -243800 23049 -232733 67972 17241 -56528 -198438 -48962 21234 32172
18220 32172 -140879 -84860 -329691 84737 -4439 -241641 141038 185748 -191737 -65625 -117806
18209 -117806 322564 -44848 20888 -56261 20833 -16049 123427 47229 -13885 -234838 -18219
18197 332344 -82066 -356540 -77168 -90093 38053 -137335 93353 -109284 65280 88420 46672
18186 46672 -33077 9076 -15325 236694 -251460 8707 62878 -21 118569 99198 111046 2126
18173 -180906 -80740 106683 21306 -185402 433535 52322 -3999 -147337 -9449 134743 -81189
18161 130474 100581 90943 -81807 -2852 233521 102531 9413 189513 -71745 166145 72008
18149 8321 62162 103323 90242 -56730 -362256 67157 -21227 -275429 28627 -278292 179108
18137 86404 -120599 21998 94980 218935 46347 154376 266403 97236 -218368 -202811 72011
18125 166089 21379 199110 26324 78461 98608 -138841 -20515 -106147 -190544 197660 112779
18114 112779 102958 227532 35770 -391550 8413 -114926 220102 -182953 -31045 153419 2877
18102 8240 -64079 12903 7767 625459 -340981 -91239 -103541 7089 -93371 143489 122965 223365
18090 223365 -63531 -4216 125106 135185 -206778 -306250 -178601 2679 177101 141416 -21630
18078 184643 -208144 20069 -324372 108064 -204980 -103047 34202 -10883 207496 -8339
18067 -252719 -189653 337422 170964 -203328 279515 94729 -105310 -44866 -111128 -316976
18057 -316976 33146 -80314 -263256 139130 104424 -118038 267309 -300626 119139 -68403
18046 88419 78623 173549 287773 142931 -54503 60570 -11877 31267 -347095 -194214 134608
18034 -278395 48783 94605 179323 179632 -204121 -55262 274970 87811 174573 13948 11134 -201298
18021 -115692 183621 150639 48142 -69450 40419 -220741 304729 -126579 -100142 -156628 181643
18009 -54832 -36147 34043 -66684 82912 -103374 -185543 94793 -126183 175068 -345849 -56608
17997 95406 -68650 -239256 239411 -425973 8942 68551 -216290 -96944 20041 151313 -352308
17985 4533 -125438 24571 -77952 6101 87433 -61882 -68541 -314296 202420 -66006 -271211
17974 -271211 -178228 -296235 -81612 5932 -207493 204841 54149 7891 72833 58819 -140200
17962 -27130 100580 133547 150036 158044 109912 88525 3413 -119366 -101459 63859 -54276 -11970
17949 117123 108753 -15010 -345320 156572 -118819 -204618 -423188 -87281 80684 -228561 -143604
17938 -143604 190228 82949 181213 -4909 -324960 145793 97455 -243201 82496 63072 -110423
17926 54782 -256856 291283 -11910 -141877 -88182 172282 -130323 -75857 2265 212763 -37043
17914 -256767 -60138 6706 62945 68153 47626 -64617 31472 70304 -50939 -250665 -138782
17903 -138782 -351947 -237670 -207912 -148629 166224 -93194 -151502 -31289 46699 117602 36314
17891 89721 -89820 -92810 -440366 172026 78578 -35388 -288993 -116047 337048 -76080 -16750
17879 -44592 115691 194367 -97014 -115679 -128909 51640 -91029 75420 313925 -145332 117016
17867 24614 321160 121527 18659 87546 77006 101772 68492 5142 63981 -24184 73524
17855 306768 254857 33804 -25306 -38623 53415 -27151 49634 -138568 188087 121244 -18296
17843 19548 -36071 -269920 62094 -115421 -138573 -105284 116923 79955 -43418 -21028 -271427
17832 -271427 -69187 300935 -164606 103013 260078 238609 35955 -102439 -115898 -78290
17822 -78290 86995 161674 153987 -26660 60740 12632 -77936 -51200 -53377 80819 110435 -223158
17809 -124702 -131413 198575 36159 -61711 -425656 369813 -134925 -8075 -228883 108388 -304959
17797 -147793 198059 171006 -53507 146045 -87120 -52346 418271 213615 -239865 80955
17786 180851 166565 115033 -296610 247186 -227223 -297096 -76107 26517 -102928 -98735 -70278
17775 -70278 110218 -197622 -10021 119957 -200451 -59546 -97382 -45601 18749 25985 -133045
17763 225180 202337 -282227 226350 170542 -89561 106996 36163 -90866 233198 1837 -62428
17751 -160524 197580 -26764 386707 174242 -224808 -171906 -17582 195391 358089 282920
17741 282920 63950 211921 285585 -104657 -77117 -289959 -381160 187547 -132585 121764
17730 -17977 -346008 12886 -299140 -26425 42860 268423 77784 55745 -22121 241756 41204
17718 139958 -293062 -16885 130654 144203 111581 67623 45602 -184440 33801 45518 114231
17707 114231 -346925 -29753 -199316 64667 98819 229768 154329 132823 465308 -35922 -211761
17696 -211761 12397 239413 -101284 -120480 -21587 -1941 -47246 213025 -98708 48313 -113502
17684 415449 -26448 -81627 133093 140406 91284 4505 -92424 73753 -80810 -122088 18735 328714
17672 328714 -105953 14829 39298 -177962 282893 -213118 -248952 217468 67811 -3020 300755
17660 319547 -204595 140658 405333 -231786 226641 227820 -77122 165399 -102255 -8324
17649 165132 -6300 194196 -134600 213916 130649 -18170 53937 -280052 -149555 -98460 321221
17637 223951 175595 -149233 188010 58641 143051 -152146 524118 71437 1167 -178828 175915
17625 154729 -181711 267119 166273 -1068 -49640 200650 150456 -31483 261918 330589 76979
17613 225600 119523 265384 155761 25806 316293 -197419 28503 -269069 -5590 107973
17602 48926 -137179 151863 -133245 147409 -29057 25921 10059 -24170 321480 28467 84536
17591 84536 163696 49653 39697 483281 -245644 -164382 120176 -168956 75397 141165 269763
17580 269763 -75276 163902 85375 -89479 -148752 -201964 126308 198051 145757 60687 -165505
17568 -104167 -295472 -126999 -407439 220062 323417 137538 204758 128623 -109745 278332
17557 188059 -180601 5716 472372 28085 -106716 155976 -130203 -47993 83084 -57769 25590
17545 -358935 143679 413586 -65156 194196 349910 292264 49889 101937 -275100 207838
17534 264658 -6349 -98927 153814 -173497 49492 -46461 151124 40798 -76948 373691 265297
17523 265297 -14246 123356 251088 294415 195677 298765 88353 -203325 366707 35461
17512 -1939 198334 -24893 268072 166169 -41871 -157677 -119132 -144667 99626 165790 -122592
17500 268858 -44717 40540 197396 194835 171411 155764 228746 -48474 271703 277422 -28757
17488 198461 53044 11023 246188 319579 -54409 -181431 -122832 -34813 116656 65391 473861
17477 473861 21749 112483 237940 66837 278741 342127 -318681 -130453 163326 84664
17467 84664 -10934 204181 10182 309394 102472 196206 166361 69356 -14831 103273 -95613
17455 234924 169334 257383 296338 204051 150897 312856 361747 580996 218248 264608 184277
17444 184277 224965 -156820 310384 431364 251021 279352 217625 101536 223856 507356
17434 507356 126276 145195 265651 381241 102940 198259 308923 486276 237847 375150
17424 375150 382781 88798 162671 310343 302891 274448 335688 480513 308230 273458 5993
17412 123724 274624 -137987 339396 -193511 214538 -62491 -45672 -36131 150842 -133209
17401 -38871 138883 146836 269263 193214 -118075 150333 306354 68159 173438 161683 302485
17390 302485 232574 50411 100071 270652 281687 3590 320309 30840 148946 205463 -32297
17378 267100 226881 457736 104647 293519 21148 104149 306993 33642 -42871 350471
17367 159017 391705 -38428 -353219 160807 297458 357138 185148 -180470 -153932 61283
17356 271772 167894 225354 34645 -57794 393789 240055 301541 201217 145453 -1167 324200
17344 189379 334361 121424 6147 110355 -17782 26992 11353 -29170 74464 360382 -59763
17332 161823 30957 86185 -4345 -70771 149845 149267 32209 153654 38048 165509 299485
17321 299485 306066 63724 95031 32042 -70690 239847 246314 148754 4655 269042 298161 -114937
17308 173955 112487 405078 117103 98268 251390 298161 265130 19289 125745 74358 291998
17297 291998 386966 227739 -10281 276711 323956 -29767 245081 615745 410272 258754
17287 258754 -103152 249304 16511 -138045 -3950 253349 394603 320523 -78074 402976
17276 -30771 134313 312801 11974 -129921 247399 -35213 222733 135603 81211 337911
17266 337911 -61424 149550 -23749 281499 -177888 463912 195682 67384 68648 398208
17256 398208 218398 40214 429908 97129 561580 269752 136263 257945 57054 -58515
17245 400240 137975 181093 435358 487802 345594 309098 23536 30869 242141 252573 203047
17234 203047 -4801 392825 342131 132563 -131547 208635 38918 168090 100408 163804 464789
17223 464789 231049 114348 216223 -147061 100700 132098 51757 159470 153345 157049 -7570
17211 338165 529952 -22885 496070 435742 190625 371768 306255 234136 355845 312853
17201 312853 369972 -140464 252331 241844 69018 111352 653374 109354 307686 228429
17191 228429 -113588 239756 469916 232837 324444 370847 175401 102751 134537 205368
17181 205368 232779 367174 351489 477198 86084 364745 164494 280275 395150 254057
17171 254057 236763 364440 -127827 478478 243247 283482 204301 248334 450232 403646
17161 403646 172715 234839 450612 172594 406360 94397 -130327 -107864 408003 234646
17151 234646 360847 -183391 197822 500040 375558 474841 552032 324461 513050 108116
17140 531520 283566 673221 403191 424570 482387 360896 575265 351728 452391 304134
17130 304134 291089 266967 525538 410564 358658 344788 585778 314414 401249 533716
17120 533716 374576 581935 517622 677900 376662 553562 334233 376981 659143 213430
17109 246397 252272 413439 361684 139468 147089 533146 492950 534265 488247 174662 491167
17098 491167 292800 507166 168975 509531 326637 406297 332950 704451 326291 541584
17088 541584 405521 312684 625493 464296 252212 504568 676733 247998 606266 450483
17078 450483 248020 646737 715805 541494 540983 469999 765873 412905 272330 535147
17068 535147 447787 491587 531271 399847 373988 388170 517148 516476 556563 409872 562805
17057 562805 602992 330802 665704 308820 596383 852928 502786 268653 370687 597034
17047 597034 273785 359193 250353 467005 660357 411316 775501 483615 419330 489137
17037 489137 1056527 680358 871190 538655 599298 593575 398937 468642 865656 584158
17027 584158 478548 593015 484081 580318 952246 747197 434392 539316 736075 644814
17017 644814 800488 383588 490443 558192 843257 711500 540243 858833 941781 853670
17007 853670 491814 684824 721074 498721 916619 622410 1262836 710549 641050 483055
16997 483055 1007421 775603 657657 1114557 648510 455260 676831 659058 1253875 450261
16986 719766 722584 890388 1045296 799903 794293 725970 1173691 643424 894975 957949 870763
16975 870763 958293 732103 917624 1028987 921976 869363 890186 862525 865510 819645 751319
16964 751319 1106076 1018660 1083461 843281 1058850 971363 1241663 1096211 1067759 712635
16954 712635 782873 1031971 1148366 1072387 953368 942978 991833 859781 1577172 1235381
16944 1235381 1138870 1112519 1150760 1129017 1112503 1209451 1226024 1183251 1652421 1189850 1050847
16933 1050847 1029598 1312504 1423424 1195486 1212175 1443904 1495726 1132225 1412878 1054729
16923 1054729 1626016 1303920 1433570 1810055 1705087 1744052 1499152 1443588 1288129 1701922
16913 1701922 1285834 1311010 1550291 1760815 1391779 1557295 1654569 1343226 1602075 1829518
16903 1829518 1758930 1890046 1519555 1524125 1803667 1457612 1622337 2127671 1754299 1884168
16893 1884168 2192809 1697772 2316200 2032778 2040878 2262050 2028676 1939871 2042884 1959500
16883 1959500 2491542 2256071 2181423 2332858 2020810 2517801 2251352 2421168 2000524 2442408
16873 2442408 2252688 2648802 2445823 2579273 2410757 2769660 2526911 2740276 3202269
16864 3202269 2966815 2973565 3016627 2751090 2899450 2855855 3102958 3053293 3010639 3434106
16854 3434106 3354213 3333436 3239069 3598383 3123573 3525291 3307419 3837431 3632783 3838953
16844 3838953 3998034 3575805 3761463 3412777 3769916 4150833 4414008 4240388 3929012
16835 3929012 4423430 4682966 4347339 4581491 4515047 4469920 4449648 4283314 4971504 4620238
16825 4620238 5034609 4826213 4988184 5330092 4983257 5521470 5756319 5829333 5631526 6132281
16815 6132281 5766814 6204840 6042923 6261569 6408972 6563881 6826540 6800937 6817497 7168498
16805 7168498 7140475 7405171 7580930 7780672 8047498 8459286 8566196 8641713 8689111 9208563
16795 9208563 9373508 9832671 9786729 9734557 10361230 10331951 10582347 11303715 11559201 11676130
16785 11676130 11652474 12681697 12522692 13073872 13432655 13524580 14391056 15093541 15048540 15499217
16775 15499217 16270194 16531100 16868941 18022249 18561700 18978632 19354784 20246475 20697395
16766 20697395 21973192 22543570 23317585 24557472 25333612 26472714 27411163 28505620 29656187
16757 29656187 30622967 32048187 33878723 35231161 36663424 38303607 40517743 42289496
16749 42289496 44600125 46642137 48888304 51489229 54542941 57151733 60363263 63962537
16741 63962537 67362902 71192622 75399784 79885748 84664535 89731612 95065464 100907600
16733 100907600 107255171 113771962 120490471 127929429 135407778 143234626 150858470 159159889
16725 159159889 166800923 174852688 181671853 188207224 194212713 198928934 202710837 205072568
16717 205072568 205705985 205424154 203314548 200175821 195302072 189724666 183217378 175999964
16709 175999964 168143572 160248094 151748207 143839920 135969037 128104260 120618732 113193358
16701 113193358 106568243 100292019 94119521 88642385 83179140 78232133 73817040 69489913
16693 69489913 65389523 61956710 58157839 55314458 52146515 49436592 47096523 44558488
16685 44558488 42364942 40469617 38452154 36880079 34771583 33398778 31586315 30370670
16677 30370670 29091535 27878313 26678166 25371471 24508778 23641910 22365128 21614699
16669 21614699 20460543 20192122 19428564 18494321 17983349 17624523 16915335 16140752 15566175
16660 15566175 15167561 14657662 14104988 14011015 13453450 12684278 12421410 11822100 11714535
16651 11714535 11393581 11016958 10766135 10355770 10043921 9755657 9806654 9194438 8888325
16642 8888325 8713723 8480271 8404829 8218419 8332472 7922933 7473399 7337362 7393119 6921733
16632 6921733 6868156 6613273 6763980 6213095 6537003 6234563 6031868 5971161 5522496 5947343
16622 5947343 5495633 5344792 5217083 4982748 5193178 5401832 4832051 4798478 4607870 4283703
16612 4283703 4120862 4219510 4331558 4293254 3979901 4006302 3892973 3595037 3801404 3897860
16602 3897860 3758195 3646123 3699316 3692350 3485404 3513454 3390143 3395141 3230815 2853419
16592 2853419 2816880 2957154 2951385 2834185 2884762 2691006 2835055 2947949 3056148 2765021
16582 2765021 2622529 2753442 2508204 2269677 2658934 2305285 2094535 2250154 2228446 2074810
16572 2074810 1924121 2402235 2199860 2438703 2039188 2204746 2147392 2231054 2191573 2188515
16562 2188515 2031954 2217821 1864594 2106379 1988648 1829887 1876074 1872570 1625933 1833815
16552 1833815 1834158 1832188 1783401 1981536 1837076 1637393 1587371 1446625 1508868 1416028 1184027
16541 1184027 1691363 1452872 1523668 1365814 1673649 1397092 1699678 1547403 1506867 1225405
16531 1225405 1428926 1499875 1410901 1323872 1239037 1090205 1455315 1323305 1163086 1346725
16521 1346725 1410981 1092038 1156497 878778 797920 957114 975281 1027261 1233490 1184877
16511 1184877 1406626 1256955 1145259 1192005 713745 1329208 1440184 665846 1150506 1137895
16501 1137895 997062 1022218 988352 1030387 752027 944338 1049672 1045521 823948 887941
16491 887941 1146034 917150 823549 982381 1073058 824148 711242 862542 693971 876172
16481 876172 851214 943421 727149 963934 373713 958014 882365 512425 667977 1007697
16471 1007697 315190 357797 359069 893873 1091433 693723 654034 637205 357525 528888
16461 528888 526498 1040656 463009 631580 847212 519544 642757 765802 347800 624028
16451 624028 444788 831445 580115 429639 590522 452863 414358 589125 352520 927595
16441 927595 550215 877301 901964 655881 413257 751500 425301 611170 567241 615326
16431 615326 569642 713927 590909 532495 303312 606962 625622 504064 677201 559773
16421 559773 452087 561591 449092 733125 515101 747864 461559 717873 362826 503550
16411 503550 686842 543224 219071 264050 465603 350019 561673 491683 428018 580946
16401 580946 355576 267220 480622 593057 578186 249914 405667 451067 522047 614342
16391 614342 489054 699062 234117 403190 477014 350158 334177 358741 174660 225116
16381 225116 130902 492309 207682 234159 -34149 720660 180376 97857 325069 423023
16371 423023 485160 389064 455671 406824 232801 283492 327696 200968 -214443 408423 555922
16360 555922 85006 332146 318191 250775 284956 519535 104950 395712 491688 167967
16349 228870 179576 300032 370536 318874 342864 225714 383252 116095 336396 298240
16339 298240 -143032 207822 454916 353247 290616 474812 359921 122226 38002 288942
16329 288942 538637 276685 302023 282683 284950 358975 372585 220573 466784 448597 324265
16318 324265 343520 411903 337895 353162 91273 242172 -143949 448105 445386 123475 151307
16307 151307 203872 12454 -77207 209708 -30410 387058 263186 178592 190832 29042 121351
16296 121351 -115385 314351 161480 319319 -208270 739739 -50170 207127 225385 125180
16286 125180 481010 282644 402209 112020 153482 257414 159734 309574 135220 362822
16276 362822 -137170 108582 125949 233032 241575 210054 6916 103730 210702 133368 271461
16265 271461 279281 279855 -60430 153023 145702 239406 96201 472535 235865 34993 137800
16254 137800 315909 -61791 -310670 106979 56313 -205676 98807 284090 36104 329190
16244 329190 148161 -165771 -160640 373953 30845 167601 161363 193466 258217 227241 47390
16232 284875 421400 234282 90997 269696 59332 135961 70186 60028 106327 -22100 417542
16220 152561 -127627 231375 359358 101048 31873 -57574 329441 249604 391876 152414
16209 194273 -42695 147952 -128864 225802 11269 180095 298453 211970 -73292 289369
16198 241483 153119 141235 132750 -113676 84475 114990 192807 244493 14183 3938 -53909 -18849
16185 -51371 81117 -13083 -117492 -271786 -45401 -224982 229518 -79710 15022 -271078 428473
16173 434746 18664 67109 87608 -30879 231518 128701 125878 192149 279349 -43770 240678
16161 -177753 119775 214441 -55057 -159589 -35520 73685 175225 -126321 173570 179156 369463
16150 369463 123820 57915 -122315 206267 12464 249451 40179 69245 -42523 -72382 180825
16138 183403 90130 116486 -24683 -7452 27458 -49892 -137093 70863 180297 -22441 43218
16126 -41112 -1773 -145326 -255563 187686 110237 266082 -206791 141023 118752 -33505 133215
16114 -74100 34532 391699 -147451 -54382 30692 466274 -338835 264634 -149873 158880
16103 -105016 310705 -61950 -196535 163144 -3846 129438 205223 89739 -170721 91544 -57122
16091 -84312 16478 206933 -185965 229897 94467 27448 38063 -18164 197591 -41258 -111634
16080 -111634 55174 9304 144436 112444 77225 164670 -12235 -120835 -120651 244334 -126312
16068 139025 81388 126321 234743 -92156 82479 112311 78019 146641 391425 -159680 -231962
16057 -231962 79743 92419 -235608 -160595 -20379 224944 101292 93264 86764 102960 -32082
16045 -117617 26545 -61646 236577 67606 233668 -196541 -193160 -39099 179644 24328 -39454
16033 -333864 -179457 -80314 -376448 59048 50322 -312130 -113064 -70746 201532 -34159 -33239
16022 -33239 -160790 206076 281623 -225959 84398 187221 -210309 -104590 89445 291580
16012 291580 -251035 -130048 151817 -454564 21626 -145368 30246 -104653 146923 -63516
16001 -2643 -380596 -189806 -23733 158201 -344285 -23598 -504815 28346 -227273 2857 -280701
15989 284249 236552 -63619 178066 -290056 -118202 -46220 114111 367336 -21535 201421
15978 58164 207711 278270 43829 51227 -64211 110177 12936 -178067 -34530 -126483 -188446
15967 -188446 -68771 -263251 15708 152166 309213 -234655 -155888 -110511 76905 56273 -4492
15955 449577 -77351 -214459 -222352 -94550 -63030 -464254 22469 -133723 54142 -71852 -279435
15944 -279435 -103041 60644 -153621 -131975 -50981 63025 28456 -40428 -199431 -172126 -14455
15932 49936 -178469 -149492 165442 218572 281159 -268652 -67875 -5619 -167093 224753 -530028
15920 -227403 33524 181311 77130 -9077 -52516 4797 -59278 -131471 -147469 -196438 83050 -73890
15907 -46411 -124077 318925 -249880 185229 39467 90878 -202186 -305835 67919 -295743
15896 41130 -160872 -45767 -144913 -14194 -175377 -189659 -67034 -9218 343500 -202043 -243590
15885 -243590 -66741 314686 -103738 204005 -135430 -249457 300780 -71239 33233 -264648
15874 -372039 -122638 15845 220121 25656 -205892 -140032 473472 -27968 64051 -22530 -13656
15863 -13656 -3078 45941 172728 -110144 -169516 211735 -200117 -91648 -95641 6595 -173411
15851 -116415 -6798 254131 198547 -123389 -41628 -173860 48588 114780 -54143 348827 193355
15840 193355 276420 246422 261806 -37808 -83318 -363761 -40757 47279 197059 -135938 -193408
15829 -193408 316483 -426196 44115 -77776 183053 38701 -181069 177400 -290516 -80241
15818 -99765 -296754 -279154 -233880 200440 -45494 -1154 -131700 -456542 -28948 -183526 142198
15806 31339 -173053 -103563 286974 272420 40853 447935 -421 -34177 -129144 -155196 -28729
15794 -390901 -179672 248304 -177138 -44390 319253 129613 35690 111935 440051 -226316
15783 162663 -61318 -266110 372 174355 237802 -46767 -96981 -326851 -354494 -183393 -106297
15772 -106297 -68537 -179923 21289 -223319 127728 -113846 119035 96155 73339 37906
15762 37906 -212249 -131524 -96197 159539 -182146 64670 54767 183615 -70775 14284 -116362
15750 139838 56780 238948 -54333 -166408 -142437 63587 177213 59678 69026 -113368 226816
15738 -222671 -116503 -841 11455 -31461 -424877 31071 -91268 16947 133623 139451 -201371
15726 -47350 -281567 63429 91232 182978 136371 16855 108384 -35259 105604 -440579 -60427
15714 -16334 -103781 -137821 103400 -48826 -184230 217730 3981 -84066 -17873 26228 -57455
15702 -224796 -116005 -252798 -214110 -311812 60364 -191785 138819 347923 61095 96290
15692 96290 -103654 -154855 20874 -190091 21168 -147548 -178792 -120989 67347 -301765 182845
15680 -116240 -185826 40124 -259981 -335482 40258 -327773 260267 -139478 -119132 78390 -16321
15668 46401 -217788 -239796 50997 -364634 -170707 153735 130915 6001 -226672 63119 -61147
15656 64418 -120075 -9528 -103705 37736 314917 101350 -100005 75423 -31104 144648 -21282
15644 149783 -29629 -46305 -71536 66273 -94149 -129275 183179 200523 -211153 -503334 -276643
15633 -276643 2970 -237200 -47557 410088 -161027 -100997 87652 176340 55139 59812 -7800
15621 121508 553909 353755 183908 192527 -52722 -139226 251081 106065 15071 -226636
15610 72930 73048 -238175 -288712 -144981 32177 -88122 -6613 28624 -55220 454513 -22463 -109619
15598 -109619 -32819 -94384 -131325 23776 -180263 -295143 5376 -202672 -136579 407269 128836
15586 129621 2182 -271855 127865 52891 14432 172684 -190461 198872 -43692 -252616
15576 -252616 -181786 67725 65091 -119674 14045 25842 -187018 34358 -152485 -98789 238367
15564 -105951 -50951 -173141 65827 -146605 146059 -103175 48742 -69394 -108801 217642
15553 222125 74839 -40957 72689 -269330 -356216 -145499 -5646 110311 -19073 -313763 -59772
15541 -402136 -10113 -327544 87696 -27687 356740 -55848 -40555 126873 -176188 156519
15530 -87572 22739 85241 1668 -139293 102411 27290 30163 93781 32191 46084 144918 55503
15517 34620 327071 17456 389198 -85515 91683 118300 242757 109497 -251526 365756
15506 -200688 -39077 35932 -286327 -91525 -119173 85038 246565 -14927 23313 202467 105433
15495 105433 144682 62361 279645 -220940 -22123 228137 137638 -217102 -91878 181593
15484 -3143 -77476 -150118 -86102 -97323 -104723 16787 -11928 49188 2228 319538 -57353 242447
15471 131868 89501 -225339 65536 6092 120028 -173423 398159 35793 -173765 -128032 121543
15459 11711 -340091 -70560 -287580 16380 258123 -72719 -83545 -117260 -51759 310494 42150
15447 -5892 165736 130595 -29527 25621 -202548 -344840 75250 -106289 -98993 -59638 -121828
15436 -121828 -17291 62687 86677 310405 43261 1411 -423695 -21151 4004 -201102 -238476
15425 -238476 6153 -109420 -142538 470568 -61286 -164965 -21666 -231081 -46457 -241006 -295909
15414 -295909 137374 -93525 -174870 55833 -76295 71239 126835 162006 277631 -167407 120427
15402 -65554 72323 -95469 350792 73997 -253778 -301499 -34182 80649 165060 268669 1453
15390 310051 -32080 -58485 66387 4088 437 -20150 365925 16779 -40081 224921 -3204 89238
15377 13677 147446 43226 -288880 146325 -106582 74160 174272 190378 118717 -197277
15366 -68153 -111623 -279702 132496 167798 294419 -19320 -81375 167113 150997 225012 -116859
15354 -366325 108906 -34241 -11614 111347 -64321 105559 -84570 182870 68155 40802 -23158
15342 385307 33661 243421 108299 -245572 191715 -136257 183796 291030 -64759 -107625
15332 -107625 -165967 306669 486026 122512 2290 306310 13293 -102934 89885 -163837
15321 -86227 222422 57408 35653 -49327 28965 -111341 10868 -153316 124535 -164235 166316
15309 117103 55840 -39330 319843 -117361 34810 238894 101032 122439 428184 74659
15298 -113631 -54050 192640 227854 -3591 256663 -46967 92139 -33630 -118446 -92731 191356
15286 -136017 119580 19398 -455235 143676 57122 -1633 308346 115864 -66594 87545 76532
15275 76532 40199 286331 158508 435906 50271 346718 -190806 -35148 -74917 135590
15264 -215345 154388 -903 122163 -44874 69279 -23820 -140724 -3699 372079 485557 318680
15253 318680 344520 92988 414012 118335 603377 600970 1494722 2634844 1491688 1911478
15243 1911478 1507535 349882 176041 298109 47049 251286 -28423 -49518 80824 67474
15233 67474 -16147 -73905 -186657 -21288 -95702 388849 -327447 23688 76832 65514 192231
15222 192231 114084 -363581 134881 -68559 366698 -96176 34377 -366174 -36907 -158895
15212 -158895 161664 -21159 208311 67568 195104 209583 131004 -151812 196149 -151409
15201 24049 -7122 -2479 -104220 136768 13117 -119427 81120 -69112 141746 -50622 28043
15189 46662 41359 -198374 253652 4458 377113 183594 -378058 163368 97372 163565 301457
15178 301457 234190 45348 -113835 -95181 -319201 199926 -30636 24775 401105 180142
15167 315995 -103814 52951 71641 -84652 475980 43149 52886 16713 196205 179798 313418
15156 313418 139572 158943 -38259 48526 116337 338949 -137123 -1988 -66233 475282 -95853
15144 72362 129584 205088 -244381 353627 -53433 205563 56770 1617 7045 -168939 272420
15132 -154 42724 186822 -98576 152031 -215345 -12884 202410 84423 -143491 -37819 460657
15120 179611 119154 -80794 246794 387372 210040 118465 148756 434522 -541 -131569 -70087
15109 -70087 117333 324572 495800 -26860 215371 129014 372959 125645 343194 129126
15098 190758 207064 162661 162749 -138609 -79121 453956 546603 57975 213625 244182 221194
15087 221194 98228 224865 355460 -19184 177006 523316 -70268 -31213 60512 325705
15077 325705 191832 123200 43921 116769 140287 455146 -25799 522020 81117 226200 -33313
15065 -126031 477723 307179 239451 314717 266648 135150 43148 101949 195347 -61949 244528
15053 264094 188648 -52352 177810 196135 208101 -43423 367104 287680 170756 36019 96454
15042 96454 14489 55731 95388 226843 240099 394139 245984 224087 -181812 376585 271054
15031 271054 230210 4113 324367 134403 621267 202858 264506 88253 61701 346812 209215
15020 209215 -109238 80199 355739 125482 320973 390507 78704 215756 198542 413221
15010 413221 142057 594838 150391 501504 -108969 221617 250501 -12436 160031 290044
15000 290044 592624 403477 89110 248312 84693 43822 250391 12241 13585 240479 424600
14989 424600 379529 23184 312473 109353 180427 -39206 233072 314264 323634 144179 155177
14978 155177 331322 206247 539180 -84683 191937 20853 430228 78273 321762 50950
14967 333755 501630 233274 333672 103491 446984 -21678 586194 132919 383840 243645
14957 243645 27630 352479 292782 128325 555187 242184 58221 251084 172844 265812
14947 265812 181628 343796 524480 343745 36016 386606 361469 332038 250938 404610
14937 404610 173143 409050 189231 72182 -220441 435737 157227 230285 548846 601067
14927 601067 313560 105891 217971 385504 184916 475913 514776 419833 511652 140260
14916 430032 315831 248222 304739 498422 -17176 303959 568644 568955 313767 375349 626247
14905 626247 440404 238283 43136 116845 409387 530613 471165 423106 176450 495063
14895 495063 259366 322901 350599 376005 486998 538992 526854 300581 587510 203463
14884 377878 400733 649721 754898 239476 73732 499317 307835 459718 590604 322468
14874 322468 214210 379889 856653 366537 614618 428361 446914 224397 512313 574594
14864 574594 506711 340775 309341 474653 521921 598692 289359 803404 277774 390985
14854 390985 618498 465111 187339 493124 346264 402289 600656 482981 327407 492715
14844 492715 606633 398310 563867 605826 737683 353113 581344 674954 535142 105006
14833 598046 395480 368719 361541 544856 386864 409451 674684 597694 643710 580851 333469
14822 333469 635635 805668 386517 832250 500248 440826 642048 557651 433823 857714
14812 857714 447866 594740 528491 510915 310531 263096 565142 510499 594761 607373 243404
14800 756925 585046 725580 692082 427779 528201 520181 678957 784411 975122 483242
14789 696359 559579 783987 232854 1013032 738133 398002 623011 762232 443758 890286
14779 890286 782483 646790 659961 709634 452992 407081 731057 595417 996913 885466
14769 885466 947370 407452 433533 395766 561964 761955 622274 756202 421775 780036
14759 780036 967240 740012 786322 1119160 695981 811851 703349 855496 407283 886992
14749 886992 451593 391319 662223 727548 371806 920499 1181378 983707 703583 589101
14739 589101 817520 665330 1037701 1010716 1122075 711774 854919 984889 718156 698232
14729 698232 521200 670513 800744 1171704 931786 774762 863852 740394 1055764 926242
14719 926242 791969 1001759 794022 961194 856215 724972 1188381 742907 953579 1099535
14709 1099535 898354 979830 807073 974363 1329861 1368984 912213 986235 1019036 1334618
14699 1334618 968154 1136866 1015339 1046799 790461 1154204 988545 974212 1256845 968913
14689 968913 1069984 1149293 762403 998947 1301341 1347130 747553 1253139 1193080 1008215
14679 1008215 1035416 1076355 953177 1132492 863414 1104436 906278 1211196 1230219 1140821
14669 1140821 661575 1022542 1390662 1537730 1274667 1263505 1369107 1201879 904445 1168759
14659 1168759 1298438 1265038 1014575 1229932 1207798 1081938 1120885 1107633 1777348 1579724
14649 1579724 1086292 1305887 1358858 1293480 1376804 1336647 1412363 1487993 1486922 1423713 1092390
14638 1092390 1569745 1320126 1001986 1461555 1454679 1467018 1355799 1926066 1564059 1508611
14628 1508611 1318384 1746858 1721734 1787010 1817177 1982516 1385704 1337925 1793922 1607018
14618 1607018 1661592 1375440 1522882 1771740 1581028 1570290 1683292 1338670 1781515 1728116
14608 1728116 1783138 1616768 1479309 1728176 1986254 1756121 1734308 1814638 1824442 1749274
14598 1749274 1983259 1861216 1932914 2021953 1837167 2052689 1896424 1952943 1765640 1979305
14588 1979305 2198644 2178711 1992772 2204392 2157059 2136367 2338907 1767115 2014275 2029419
14578 2029419 2440964 2148331 2252950 2209485 2486621 2217941 2551926 2189890 2024450 2418588
14568 2418588 2472501 2565379 2616739 2491369 2933954 2938648 2878547 3148142 2936056 3234633
14558 3234633 2926233 3203318 3252405 3749351 4129390 4416587 4607077 5395359 6342673 8303300
14548 8303300 12939651 23378641 40005938 42946839 21773748 11463201 9600886 5093401
14540 5093401 3291298 2983285 2367760 2450301 2434876 2214437 2180802 2432155 2391366 2116293
14530 2116293 2596103 2266299 2519883 2763189 2489693 2400897 2533375 2387039 2695178 2746309
14520 2746309 2719125 2708855 2964578 2612831 2929565 3126213 3158983 3021369 3030063 3312838
14510 3312838 3237466 3406967 3034142 3459240 3385055 3429844 3150356 2999820 3320244 3535262
14500 3535262 3447731 3644579 3327718 3724621 3705652 3603731 3633299 3683148 3799415 3854982
14490 3854982 3888658 3838600 4522602 4007783 3891235 4253391 4374667 4165052 4166068 4371564
14480 4371564 3990547 4493252 4298431 3859995 4188810 4559887 4506868 4699514 4794759 4898937
14470 4898937 4783283 4762409 4965266 4795498 4855013 4946863 5048514 4924639 5348133 5596575
14460 5596575 5272531 5439497 5361059 5507727 5789413 5805467 5360945 5709031 5884125 6052474
14450 6052474 6010583 6121414 6155154 5870872 6544608 6364713 6214641 6635965 6173582 6580445
14440 6580445 6795596 6717234 7240260 7148691 7204120 7281549 7370837 7350590 7400307 7455661 7668011
14429 7668011 8029606 7584208 8062873 8083037 8139293 8176823 8696261 8222859 8592448 8767456
14419 8767456 9149651 9219607 9188071 9098689 9495684 9617585 9583644 10046827 9960551 9870163
14409 9870163 10357695 10534591 10739092 10576521 11085123 11284649 11267913 11405793 11384917 12003380
14399 12003380 12199703 12057007 12274072 12707455 12487590 13203624 13148002 13126804 13452652 13917483
14389 13917483 13607856 13880692 14513138 14752666 14939829 15078188 15551300 15877278 15958156
14380 15958156 16506053 16488332 17342000 17277222 17915331 17998130 18495735 18973080 19358667 19499252
14370 19499252 19689249 20207719 20299828 20913253 21389112 21966638 22367481 22713729 23228975
14361 23228975 23704839 24195771 24555438 25463999 25767833 26785248 27134252 27883296 28246445
14352 28246445 29194261 29679535 30539975 31253406 32075283 32777554 33609111 34631161 35369946
14343 35369946 36518153 37306277 38604025 39078512 40434960 41788791 42819079 43868509
14335 43868509 45126015 46383927 47869333 48959222 50931767 52326853 54054344 55712323
14327 55712323 57305317 59351425 61377030 63403599 65363512 67630470 70119253 72775330
14319 72775330 75135683 77454886 80824913 83724921 86762733 89980578 93401460 97517286
14311 97517286 100947013 105164900 109603706 114217667 118912447 124099023 129257481 134966945
14303 134966945 141368966 147645586 154386641 161475273 169177897 177218530 185184348 194314796
14295 194314796 203711111 213509102 223702572 234843966 246322755 258669040 270992672
14288 270992672 284271263 297809972 311482418 326178020 340589953 355527368 370303080
14281 370303080 385354111 400011659 414202154 427400782 440028648 451401410 460691160
14274 460691160 468102091 472136649 472581599 470890879 468931310 468143789 464461877 458653842
14266 458653842 450815059 441610418 430309783 417608040 404459548 389853052 374739347
14259 374739347 359090081 343326600 328114406 312891359 297649858 283119883 270587538
14252 270587538 257999675 245364022 233166353 221954389 211245201 200837197 191265349
14245 191265349 182225358 174016460 165916632 158093836 151038364 144140049 137852603 132021353
14237 132021353 126146861 121105995 115976970 110938330 106457398 102361173 98472545 94782244
14229 94782244 90961659 87393224 84189227 81155682 78231656 75287515 72375816 69864053
14221 69864053 67746513 65577978 63282409 61154324 58950680 57158475 55316624 54129638
14213 54129638 52456834 50898481 49068367 47741043 46124033 45021779 44338871 42960333
14205 42960333 41336838 40454873 39218967 37889986 37579362 36808064 35545635 34549620 33715538
14196 33715538 32491807 32049214 31380172 30602651 29565305 28760900 28116945 27621079 27103148
14187 27103148 26471033 25931968 25269667 24439307 23849186 23292120 23158137 22434599 22082548
14178 22082548 21825371 21328660 20426432 20335343 19878951 19688053 18969364 18898133 18574551 18079754
14168 18079754 17688628 17484840 17085939 16989877 16476833 16271908 15752506 15193444 15269788 14971219
14158 14971219 14522474 14334169 14210790 14040396 13442527 13587214 13346088 13039071 12957855
14149 12957855 12648489 12449744 11852151 12084556 11733980 11479877 11648634 11277783 11114237
14140 11114237 10862765 10818369 10741364 10632266 10496124 10052193 9714669 9485724 9667204 9574124
14130 9574124 9187105 9653285 9228949 8704561 8883646 8819257 8810845 8588231 8437553 8290667
14120 8290667 8498245 8404764 8247720 7738818 8002586 7800260 7649239 7869745 7683661 7016503
14110 7016503 7306205 7166854 6874440 7322508 6808622 6811633 6292293 6704539 6735190 6377809
14100 6377809 6427296 6412881 6433273 6223108 6113559 6094581 5844914 5722378 6069421 5827016
14090 5827016 5522998 5811417 5391777 5690041 5530665 5592166 5490871 5041955 5469475 5586122
14080 5586122 5302474 4915687 5050604 4765664 4666443 5152768 4786299 4532436 4878792 4628681
14070 4628681 4729339 4481215 4461801 4461170 4552150 4153615 4616211 4123637 4271453 4369918
14060 4369918 4325219 4432626 4192710 4299698 4119955 4146884 3912964 3673696 4091698 4113775
14050 4113775 3562118 3474495 3897479 3761651 3812424 3634687 3770028 3332719 3560714 3409402
14040 3409402 3467021 3778331 3200309 3243527 3317889 3307521 3322569 3210045 2948060 3208314
14030 3208314 3377259 3152192 3118831 3136520 3268473 3056822 2931867 2827849 3080769 2754499
14020 2754499 2604526 2570712 2737704 3186995 2573958 2633778 2582613 2527403 2693633 2556362
14010 2556362 2540272 2467525 2524369 2469639 2560792 2485879 2437401 2619692 2499492 2329579 2298458
13999 2298458 2297571 2091603 2125435 2084676 2264117 2152117 2209263 2384535 2496942 3175090
13989 3175090 3935977 7476802 15525145 33584404 44852434 26459315 14068104 8780628
13981 8780628 6374649 4790125 4229258 4300647 3667846 3577436 3291092 3032920 3146928
13972 3146928 2976996 2862309 2582772 2918662 2573005 2663349 2814970 2468788 2768783 2236954
13962 2236954 2429272 2408831 2331120 1887793 2191284 2150937 2078245 1800408 2295363 1990213
13952 1990213 2120658 2050072 2140229 2130278 2079266 1980931 2029396 1983583 2072307 1725527 1978815
13941 1978815 2077359 1647868 1861506 1766101 1903489 1766769 1429366 1563753 1660340 1535762
13931 1535762 1668233 1701373 1507935 1731467 1648110 1964233 1634425 1448205 1573521 1741653
13921 1741653 1415834 1607229 1662670 1616483 1589637 1425538 1633285 1602794 1479423 1536192
13911 1536192 1598279 1333749 1556134 1497641 1392041 1631771 1223003 1643900 1430973 1663364
13901 1663364 1536261 1360560 991047 1658821 1757014 1088197 1650094 1216251 1492238 1254370
13891 1254370 1305160 1232449 1523950 1399226 1440607 1256119 1377598 1151748 1283582 1116049
13881 1116049 972196 1317582 1425836 1282124 1325726 1290008 1491381 1157836 1338708 1139043
13871 1139043 931420 1407369 1386200 876737 1068724 1330336 1042861 866182 1277119 1209859
13861 1209859 1393884 1066475 855393 1113849 769955 1035688 1159090 1119526 1018130 868188
13851 868188 806226 1226657 1231713 788208 975132 1538017 1037494 794838 1107550 1124910
13841 1124910 1020334 895178 959366 1119193 1039094 1145381 1004861 987672 1076703 1202796
13831 1202796 861778 905921 705423 872121 874381 740422 1059133 797742 1032138 550821
13821 550821 776972 989784 749100 973435 767326 1108514 1009656 705557 964048 734787
13811 734787 1008683 980023 1088976 904931 1152203 1124705 577381 1052635 826443 805977
13801 805977 642581 769735 961230 657316 909595 768815 642330 881781 959586 985442
13791 985442 590224 859870 773850 578743 694953 553865 750234 705508 808576 896899
13781 896899 793476 860190 524190 722249 510720 755137 899689 460299 691028 406801
13771 406801 614000 952197 404774 653274 667215 259125 1157844 695965 754777 897119
13761 897119 742217 428181 796800 400369 678972 479908 612008 737786 798728 275421
13750 765712 806614 658929 545996 500478 506298 606553 427322 644052 1027588 909678
13740 909678 692223 920151 310060 427388 516939 767643 751495 686001 820769 287934
13729 1095920 778412 445620 647307 591147 763073 446056 771727 364005 616279 571659
13719 571659 826255 802025 537462 478706 582502 486209 846384 198845 658366 691274
13709 691274 581732 371507 581289 842245 444210 439266 765009 690148 944503 876084
13699 876084 608095 520226 609981 634201 421383 514136 522014 448770 821814 606633 276013
13687 268023 702264 317706 531349 670845 517361 369142 531197 643688 458001 593745
13677 593745 573283 781407 278176 165191 572428 293980 239305 435483 570754 813775
13667 813775 248451 473584 433735 488721 352724 511171 571697 388774 432968 555820
13657 555820 763253 663580 366637 191675 244026 605634 436507 377370 487544 635126
13647 635126 512096 831421 51254 405397 256014 364879 480715 582374 260085 347164
13637 347164 858969 667553 381432 439880 327330 342739 701180 709861 466617 345941
13627 345941 49861 319130 539768 663690 50053 67553 321361 499853 731464 329209
13616 390914 151842 173177 584450 145799 492319 186225 471240 422235 639787 288426
13605 285496 838486 374221 275017 97768 369444 383226 430387 396719 562590 262537
13594 266238 442314 318322 364741 498558 463995 145673 12298 512816 529023 314518
13584 314518 279054 280613 301584 295564 523770 508531 400834 -21807 161740 95765 361911
13573 361911 73521 526077 630368 298451 393012 245212 403923 145319 104265 62849
13563 62849 232911 291930 382191 506675 77203 432968 166261 272915 439715 240381
13553 240381 320991 437033 240503 239172 162265 254900 180104 -150935 584761 596489 279097
13541 310721 490272 656251 223072 281278 -118866 301071 464162 298455 322170 576753
13531 576753 194403 409255 266735 285729 321167 329445 296709 486522 485642 113104 434787
13520 434787 453390 239715 275152 159050 713722 274410 320911 265988 118169 418325
13510 418325 13142 208847 318470 304214 103187 265025 492128 -30534 627253 319500
13500 319500 140756 381577 457750 115363 646530 158786 172783 -53147 47797 161508
13490 161508 142587 354607 395549 199672 64804 786029 74464 251944 91015 239081
13480 239081 95734 54413 -40607 331746 184866 -96056 274753 335599 618934 241378
13469 141437 250487 466455 172839 74296 127865 213461 185521 461113 183507 142332
13459 142332 8240 241712 -57142 47052 295975 92642 198032 -118426 189405 346365
13449 346365 423588 104297 163552 334804 161623 260927 342318 397335 82440 49268 338995
13438 338995 313357 118115 11019 237838 383357 318890 351485 402612 419911 260597 395045
13427 395045 213284 62473 200774 493303 394219 593076 326138 333918 239911 358810
13417 358810 -30767 333962 241934 243261 -4786 620249 471072 -38604 424310 366906 307251
13406 307251 303109 99203 388624 -145966 -18053 400690 -83505 105796 -144885 229578
13395 315807 133259 111676 32659 431903 181103 156176 306130 204180 -35911 195042
13384 268999 9137 341555 255991 183453 367862 -121494 123686 16413 199424 91002 -160865
13372 120810 281575 395106 268831 216199 382518 350455 280681 308373 86366 286372
13362 286372 319133 170567 163447 46404 236991 -156247 351581 173385 424866 401575
13352 401575 -106631 419427 426780 468721 152790 -127157 229684 383489 735375 158809
13341 50076 226516 285910 447584 79470 390262 -60849 339576 -4437 110902 -134776 186278
13329 78331 95789 17120 302254 -22985 21193 85057 310160 360709 133176 517173 248013
13317 138022 150961 28264 558546 146919 589144 495253 138226 261148 -77683 229800
13306 228247 -188114 -60347 100094 479659 274762 214172 215235 411147 17605 414952
13296 414952 110725 -279239 147541 81725 180522 120413 417392 -90462 -134657 303416
13285 134953 -59634 141632 50748 75702 -229029 32449 38408 -84455 296945 156514 65039
13273 81757 237972 259915 -102122 23463 -144870 205036 153947 227596 -159997 187794
13262 126189 23384 329600 -27977 149847 2534 275272 51969 192386 181615 80345 229852
13251 229852 248547 -203058 -184961 21079 120049 -193559 311807 88475 -111760 203762
13240 130940 -24605 86275 94563 128282 154912 346420 212741 345404 144048 123150 36715
13228 316440 171967 72251 166267 786 289073 162329 -47053 -58339 26690 229820 141049
13217 141049 162640 132938 75978 208894 114226 -169707 -55907 228371 232094 97222 52469
13206 52469 -212531 -64718 408783 92225 69958 -4232 384761 -193035 80649 -10358 197163
13194 77563 243678 429539 81819 85342 7604 -102161 -9524 52598 119556 266938 109196
13182 436086 111463 42842 -83363 -39512 428557 100815 739554 22479 221993 220248 43083
13170 -124426 -85018 157303 69185 197670 178152 248139 198407 37478 270197 -10384 499825
13158 52673 149877 316781 -4464 137535 -144907 58075 48056 144146 257689 39979 68194
13147 68194 133567 -348854 84522 -385617 -40259 10906 21793 226658 271642 195398 -227594
13135 -175792 69495 -131303 286165 -146580 314596 109647 -3004 283107 161898 -218703
13124 -87177 126522 144955 415961 -218831 446122 -847 147873 222388 248264 132053 37367
13112 100812 33591 -192128 50118 -47665 459033 208924 248699 14323 117550 119668 173705
13101 173705 1558 81467 179419 -427422 29293 116076 -172452 112925 -34309 -208718 -77970
13089 -217640 179083 -92998 10959 -142951 209814 -9846 92674 -15173 -209423 269848 154353
13078 154353 135872 -296914 253504 127428 -76890 241621 162753 197369 -47187 -21230 50106
13066 -53795 137583 367057 41630 220612 -54297 -24227 6511 -190990 -96882 340307 157038
13054 181887 273867 24254 209853 93743 -63686 -142497 296115 236839 253751 107576 -2261
13042 188699 -37237 -149379 311809 82002 39368 254529 165301 -48409 132194 59547 -160265
13030 380511 -15321 243631 158487 293790 304425 2521 122217 92561 34745 11893 -73175
13018 -32191 -54879 -19214 474297 122915 -181060 37944 216522 -115816 70180 122216 47404
13006 209131 324691 52594 -66397 321215 -56432 210936 -83396 281642 131072 -145166
12995 -67212 -256830 145969 279412 27897 -53278 109223 -234588 336491 -182674 136264
12984 369479 139446 -82932 -46934 -106122 57163 222997 -18960 -229980 -29804 -4936 -82570
12973 -82570 -75209 -76740 -6012 140937 -93966 -386722 429673 24643 298850 -265086 36368
12961 292794 471486 301112 144731 16604 149109 283347 -22604 -67559 39056 346905
12951 346905 -19199 248936 198369 61815 189073 137947 -236841 10613 117124 -22958 -182037
12940 -182037 300751 -328250 225600 -383730 -21700 19729 -76065 -142732 458637 317528
12930 317528 77127 135331 -225346 -48100 -126082 226746 77164 238813 -317765 212920
12919 86183 -100755 -158043 78423 -220873 66135 164216 183390 202861 -441194 -102880 -275710
12908 -275710 52935 254677 293716 -148175 92090 -58605 -7971 93721 -99135 210060 -101955
12896 -146019 -117596 -33033 -67755 -198039 170542 296204 40080 -125059 -72676 -77396 -38082
12884 152663 169549 192713 11032 41897 -247150 328194 -18928 75695 -174239 24163 -130025
12872 -135269 -189706 -22636 -68375 -57522 -35594 311830 3543 -75305 20104 180053 -79555
12860 -176336 -139242 223052 -284998 312853 -72826 -37427 162863 -130273 202635 377703
12850 377703 -353497 -55859 126614 85753 22199 87074 131028 51438 135492 58312 -970
12838 -201537 -22416 -142180 -7968 284746 -55083 285815 225645 52063 -177489 189718 -153883
12826 -49084 -92229 259312 91956 396049 103861 31553 270738 -225390 65408 24014 73970
12815 73970 278218 191966 134050 206158 -90499 -144672 119437 -155595 38170 -12437 10026
12803 134396 102391 -68396 -88877 288544 -22836 132388 -232567 -191128 263048 72525 136430
12792 136430 105835 79683 71036 86426 33711 30468 -309906 103280 -587675 -48544 -233072
12781 -233072 -83376 -210658 -84441 -73186 54335 -46443 -90065 -55618 46802 -50155 31347
12769 -237790 -54388 139313 123030 90426 178199 262870 55786 339328 95065 200205 112565
12758 112565 281702 -230258 -11403 64519 -160055 -155742 -162327 -92079 318626 102030 -375564
12746 132172 -9325 -108803 2376 189494 -171133 168871 98594 -87774 -127403 31623 8125
12734 199866 147706 -318594 71952 -43715 -54239 307763 -388017 146243 28566 43862 -114411
12722 63544 -67324 17896 21208 264527 -158080 -73763 341419 -104937 -88099 -315620 305148
12710 -209168 -18307 -84231 659804 -279194 -146853 171083 279055 -144952 110706 53223
12699 213295 -94628 65902 -97075 75459 -91074 -216596 257453 37480 22275 5567 305366
12688 305366 26866 5304 -197136 140812 114717 65602 181465 14706 141127 15097 139488
12677 139488 383281 -8938 -97799 119487 21456 -86135 29813 150770 158267 -77752 140992
12665 339647 52380 84806 151373 -11947 -103147 212072 237700 152442 239382 -44764 482661
12653 -34653 -162856 211708 80349 -95405 216738 -432782 126316 -8656 115017 -104199
12642 448385 -87397 119189 -85561 252078 -302066 -44727 33370 -57560 4718 -8334 -68267
12631 -68267 177522 169250 111415 89079 312674 -170121 183095 -27289 83813 -177782 277562
12619 86647 -17246 145282 106255 43614 122442 83313 -100688 -118724 -200461 167183 228995
12608 228995 112250 -43278 30648 115484 76825 -125355 2768 296162 -162329 193080 -138297
12596 -177388 122370 146707 -291293 176536 363630 44552 -20158 25066 -172289 298254
12585 130776 70037 276308 200622 167937 -210409 106195 -24212 -103290 35965 -203970 128913
12573 24911 -65616 398462 226817 11590 90181 61941 9601 -321499 168611 110678 -88201
12561 24398 -301939 365414 -105010 -204034 135763 272317 265118 -46224 217018 -127157
12550 -288571 136463 -124451 -61431 -62263 -378649 299032 -266869 -145509 -46029 -104333 273939
12538 25083 142833 -187790 -101831 -47233 216918 91413 190946 230731 19758 -38331 96284
12526 -36396 209314 -29431 176998 269410 -32389 -382940 -97473 -119222 -172505 -53345 164714
12514 206536 248037 -212049 445356 -90551 60352 104213 -219061 57283 25303 -98328 311336
12502 10106 -345698 475569 -136097 254798 -333314 -107888 276886 -44368 373702 -62456
12491 4750 131448 41634 185240 -93429 -48213 95495 -295881 31122 170139 115446 68806
12480 68806 745 -164920 171323 93585 -100989 174331 -26995 378953 -104424 -18322 200332
12468 188570 188016 92317 -9925 -3065 13718 -292055 -1155 268407 -126946 132928 -183829
12456 -99981 55855 -162288 -220561 -305477 -144380 -130098 78315 -219092 -175029 -464326 15642
12444 22779 -376184 -80876 -220879 344464 104817 -198161 6996 -98617 -78623 156835 -340784
12432 23835 -292698 78433 -203842 -47134 -141870 275392 54670 144198 -60453 144902 -67663
12420 -12899 -40703 -211999 -80162 15234 -131990 -229429 -323009 -4373 152409 -278370 -77793
12408 506811 62607 132912 -14469 -134410 25607 69575 120639 -306524 -85429 304260 29469
12396 -201413 -98589 -94511 -165516 39100 -239922 112022 -42444 -10062 -165811 31001 273618
12385 273618 -125220 165336 127215 126698 158851 343989 140817 -227798 178005 163581 17308
12373 89809 29020 298485 -95912 83971 -8951 -130145 186046 -36849 -346926 264972 -318244
12361 -25738 89481 21128 130586 -131666 -8263 -120585 209864 219782 10305 -32443 -11380
12349 -393724 78389 310290 356941 37925 223085 -60208 70235 214147 115437 -145033 -123059
12338 -123059 158518 -15272 121239 -116237 -370554 -99601 -290390 -151313 11614 -47623
12327 -359968 -318256 -63827 -61571 -54138 50308 -84132 -49037 143227 -52599 17977 32652 -103032
12314 78879 195807 -161779 73706 190968 46798 136140 -74515 -367722 233742 89624 57293
12303 57293 60103 -33500 129958 -295276 10182 -14668 146298 -21812 104722 -243373 240213
12291 106864 -280851 127696 192750 -91446 -97450 51236 -64198 -95061 -158758 -90055 225147
12279 -43439 80338 255856 -31301 86061 281415 60349 277453 172741 255622 18601 44493
12268 44493 52125 97875 395504 105106 -270448 -71862 67095 611921 -264369 77222 -405559
12256 276976 -1406 150228 -161358 132027 321523 72111 -122461 -71188 -103651 4601 -359035
12244 -98765 199576 95736 107090 66142 377509 -95477 -133811 -132404 171410 134297 -211817
12232 -104508 284787 100805 214149 413655 125693 67135 63596 90795 -66547 144006
12221 210046 -76391 667160 406698 168166 301653 146688 220309 61751 146769 216229
12211 216229 332390 48548 137392 -39539 81976 81153 -160068 114155 192183 -77754 9919
12199 61948 333042 174355 52808 259028 -193888 182132 47593 273378 142186 209693
12189 209693 32450 360036 351227 29605 216317 96812 267696 -249354 135973 512020
12179 512020 213146 -30967 24952 32601 -111376 239809 -10588 64257 400524 40459 87632
12168 87632 228461 136729 235233 187156 -411189 273891 321999 169557 -56711 111528 -77294
12156 100152 165751 -170769 49569 169201 -109977 156892 -163399 88572 -94012 -125943
12146 -125943 -178557 99546 285339 -323339 78106 -64218 -102310 -202373 -330820 146742
12135 -171667 36530 103197 -45716 172022 -82502 -93995 -34042 -67918 142279 -278831 -41810
12123 -258804 -142615 -443649 82573 1451 33837 230579 -110695 68631 150634 243898 99948
12111 308880 -62790 153713 98555 217456 170568 -157661 320261 -48027 69316 -379883
12100 -194555 2552 42668 30571 74660 -114337 142256 312127 -43228 174842 -25806 -302374
12089 -302374 231012 244452 -253213 99704 -182133 39453 100683 -118178 -222802 -195704
12079 -195704 -187097 189431 121529 29924 101647 114685 -97787 -79494 281538 198392 109143
12068 109143 -88288 78888 -275302 -132892 -33832 -175780 1851 -112057 340758 -46578 108900
12056 -158707 118162 154220 254103 426668 1235421 988370 581881 -34068 289288 -332007
12045 -136420 -3924 121822 -209749 -66593 -378067 -117176 -245025 -137135 -129310 -49367 -27413
12034 -27413 -417427 -81782 163560 88838 -207209 157294 360633 239734 35268 -48638
12023 106938 -99132 75522 -115703 54732 188747 -34785 -77932 131709 -8870 130919 88146
12012 88146 207666 -92395 258671 -230688 249161 -164997 36989 161157 245843 219942
12002 219942 -75800 36528 -337733 -231441 -144477 65059 99674 13005 -30287 57459 -198646
11990 111766 -171133 110275 304542 -30510 -158687 -334784 -172705 -26065 -269152 -82023
11979 -156685 4265 10633 -165242 -2397 38557 52761 -47589 179452 166530 -403427 -53611
11967 231333 13910 -65287 -51265 -136661 38128 -184710 52890 9864 207011 47350 52741
11956 52741 -166217 33350 17203 72130 -32985 407792 -160860 159238 58632 -59210 203359
11944 243452 185206 -19559 -206415 -69859 -362473 144164 -354652 256055 -52563 21172
11933 -75806 -10545 10795 60026 -27349 -64195 -109803 -129468 -208241 267600 213919 -27775
11921 -91450 -130084 402833 441270 -74024 1239 68578 -26551 59201 28930 1757 237346 237536
11909 237536 -46573 -91741 -141362 24435 71609 54530 142763 -173463 87077 -45631 -50789
11898 -50789 -91905 146045 200263 -149414 -92001 -167079 -257560 -324969 171006 -402433 37192
11886 -146353 200859 -273316 205587 -174888 -32010 208431 171563 -23240 -241496 75659
11875 8641 -29286 -61964 -314503 37797 163258 42768 -233733 -70289 -85508 365051 -70108
11863 -281586 106812 -39713 241278 -214598 -129822 -140853 -127490 -57625 -1574 -293963 36159
11851 -156708 191679 200840 -15136 -243370 -164409 321153 -139544 267572 81144 137586 -284589
11839 -122211 -128092 -29692 -76448 -127577 -96162 -194566 78881 113123 -295745 155677 49046
11827 -128984 107628 -164536 10620 180426 12790 2086 -186351 -252184 -297911 -212072 200524
11815 -147113 -110019 -174999 -213537 27698 1398 75492 -142092 -218221 172988 -284385 -183548
11804 -183548 153000 63625 90074 -57 -293619 296109 79302 284776 26554 57930 178262
11793 178262 -164630 -215219 -213490 -222344 -21717 -73802 110047 193860 -89544 -101235 -62225
11782 -62225 -84496 69141 272116 44055 -363357 -5958 -46214 -161062 136381 193128 10730
11770 122445 137789 -149467 -177034 190774 73994 -144998 -338943 -38049 141884 252249
11760 252249 117143 122000 -116949 -50406 -186256 102125 267515 -142348 -135890 303675
11749 -123259 -75383 -9711 -39949 -380212 -41024 -331026 92606 -152665 -229336 -219819 -112647
11738 -112647 49676 38219 -63462 31811 108680 -173046 -157805 49241 -167007 -201447 4044
11726 180199 -200975 -185422 128824 216270 212624 107863 -219646 -224124 -76638 124519 -376278
11714 112069 13974 29702 186673 -256949 79870 82920 38281 -83698 322550 24307 -183692
11702 295634 -3694 -196380 82706 181454 -326983 335297 -291683 24610 -116240 -123488 278183
11690 156214 153117 133688 -86516 322012 67253 -100671 43312 -131530 -61993 -109339 82599
11678 119758 -38819 259054 -442 261046 -97410 -98403 171842 -106600 -162964 97511 111834
11667 111834 -105783 11471 -87729 -330815 -58903 217271 -48837 -111188 -360057 -143775
11656 -242121 185070 -252682 159356 15798 60512 -140798 -251306 35944 -200135 57062
11645 -282571 125883 306597 32172 -6496 -117355 -124040 -6799 383987 -306786 -77836 46201
11633 -257126 -176143 27721 182549 -103867 -237959 154608 54246 284066 172133 67341
11622 160553 -268652 221893 -19158 132335 31519 366857 130541 -279272 -154061 -61927
11611 50843 111237 -308109 96733 124920 -78134 -218558 -86369 -409780 -207514 221192 264082
11600 264082 -27377 -105858 191336 173475 -168402 24731 -178251 9628 253201 12919 15761
11589 15761 95208 -304089 197996 556677 -86750 184683 43174 -58840 -293298 29473 -8197
11577 -112106 50494 230729 132235 -89859 270134 191491 70257 -286460 -1038 -156820 -83936
11566 -83936 -51597 28639 -115429 -280278 120145 -151615 119599 282585 96855 -2970 -168673
11555 -168673 -162542 -150853 92167 3411 204401 -211465 264540 138268 270817 59302 -99744
11543 -91248 200457 208470 4695 -448703 -16225 -247994 48645 29624 273660 104223 -192073
11531 -138369 345022 21649 -46717 261498 -50888 -84681 -113012 74845 197886 -124383 -193959
11520 -193959 228471 182977 74756 -107475 -537419 138691 -27664 -31490 -309077 141428
11509 98816 98670 132702 340244 181721 434326 418689 352833 13145 -59011 115397 230250
11498 230250 47498 -50296 -88514 212487 279780 35822 64955 180702 147761 249040 -223976
11486 200671 -157150 1227 247061 167673 22421 136526 384765 353281 193374 90973 22891
11474 160698 115627 90825 -227160 148621 12714 -25028 39800 -52935 97657 -160467 -60590
11462 286551 84124 112714 55452 196323 -7630 -11130 103527 359264 -2749 -53230 -209204
11451 -209204 67196 13960 -38545 182610 -165661 -90919 68141 -21671 -110250 -58539 34032
11439 220095 179191 -24514 -381959 270182 -6826 161440 559549 247564 -102729 319244
11428 -171864 -201560 -62818 280012 -5132 -120736 -83751 -319058 228510 37739 79410 -327073
11416 67040 -61013 70972 118247 42900 -88076 146057 10991 -293430 297642 -12479 32651
11404 -217168 151767 -14240 -21924 170424 -407554 -158603 204612 444473 48783 -30011
11393 22544 -211889 -2588 -91997 52601 -262577 -119129 -6869 29959 68250 -353436 148272
11381 195423 259962 65115 -128932 214414 125061 305845 -35222 -27629 -185631 -37915 -209789
11370 -209789 71963 -210536 -205466 -150628 90754 181926 64467 18200 -190952 155005 275539
11359 275539 293977 122289 -48677 -276207 80178 -116493 16635 -62437 107950 138640 230034
11348 230034 -174857 -7458 78704 -164281 310336 5059 -203394 -92575 -183576 77594 230274
11337 230274 28084 92378 -56912 172410 123770 52223 -70451 -425754 -185036 122609 -135032
11325 99943 22028 -287899 -180919 -287494 -126982 -123500 -89695 366380 -9996 -138276 131759
11313 137691 -209442 -40253 47831 -81844 5953 -188172 -121383 -35170 227010 -19330 -32415
11302 -32415 133423 208939 -167117 -111945 -209586 -32194 -165937 175972 -191482 72955 -434556
11290 22175 -114668 413178 -293200 -364226 164083 282156 -184036 -9671 -151855 50706
11279 -214313 37137 78870 385641 -6517 -163301 -86911 -64246 -339617 -192491 -70544 174152
11267 84365 95538 115732 -186315 229548 -194428 -210950 -299504 -35197 103691 -260764 -19499
11255 164689 -155818 -108777 24733 15221 58988 108552 171551 35571 49159 -113149 -85841
11244 -85841 -266191 -125296 -170378 -131465 66630 385601 258349 160634 -76583 -36614 121780
11232 -20270 -119814 163758 -212466 40253 -128524 -23469 -38106 -19892 -190060 173572 -199087
11220 -105196 14505 -121651 -285275 -17430 -65675 209157 -140005 242291 -76803 -271810
11210 -271810 -302081 -173263 -54548 -230186 166150 -15280 9150 -56248 -160934 -58804 -108011
11199 -108011 -131843 112608 5884 -106114 -98275 94353 -3965 -82925 -70194 -351633 -110429
11187 44474 -183811 -278326 351751 76088 -75154 -13451 -188833 -205176 -185090 39476 -112561
11175 -161619 166612 -213015 -139958 276986 -417059 104119 -114944 -163603 -323313 142064
11164 194262 -65659 417895 -196419 83212 50352 -43164 -225349 125120 154921 134974 -171550
11152 44947 -161866 -159527 -310675 -262024 -24282 -83615 -257082 14711 52764 128701 -77409
11140 -95339 229029 194968 -22683 -62672 128788 -32651 70201 -29564 -233232 -24688 116225
11128 -28366 -268213 131756 -136974 113270 -8606 -357366 87802 7126 -31505 37335 161653
11117 161653 -59904 63403 -125976 15004 278798 37983 153234 496408 92040 384532
11107 384532 273201 171800 194619 26578 -24574 -99921 136015 38611 20520 32099 28177
11096 28177 -30734 122307 47364 338428 629201 -18117 682050 92363 192118 132076 -107338
11084 48823 -34309 155403 326755 94687 -48900 91859 416617 191175 123932 594 238213
11073 238213 262861 237096 271288 2040 299017 214021 76443 428804 515883 -56363 250565
11061 226987 672079 312923 303533 276113 736957 622766 430453 633395 649532 721167
11051 721167 634960 598117 872056 469168 402086 662936 553265 775227 897684 387599
11040 996336 681628 623657 781379 354592 220257 663011 439418 370537 1090984 649281
11030 649281 597164 491608 920183 851424 841167 630015 435392 391900 562025 568830 638952
11019 638952 503886 554104 822319 604809 580537 584500 288122 788146 543748 692708
11009 692708 475058 460319 785105 222589 622947 102327 571263 427545 545269 634967
10999 634967 433489 432727 670285 865601 514615 533969 572315 559709 786629 825024 826233
10988 826233 642392 694396 827507 875498 690737 713390 1248495 1064496 1051170 1260327
10978 1260327 1287598 1630942 1680095 1834603 2418109 2480140 2632966 3022899 2527747 2604260
10968 2604260 2495897 1764036 1418513 1310570 1449358 1166308 1130815 1180342 1317112 1289325
10958 1289325 1352591 819084 900140 994337 1024341 503359 775195 475423 524260 160297
10947 154069 517651 179092 83120 73953 52135 22903 228827 82259 186495 -24941 125336
10935 238470 -88464 107422 -5300 149180 173188 15764 11086 404594 -68830 -19950 66321
10923 75113 -102710 97708 -4779 304154 244807 360532 -98738 -73036 -101505 -206902 161234
10911 -156109 -75182 130738 12136 194181 166803 -465272 -113309 5340 207645 83173 15636
10899 -274107 -108029 22320 476608 -13755 231008 -15549 123438 -160492 -140488 -155818
10889 -155818 70374 -81659 15420 -228341 1414 -120859 -186595 -123836 -290302 186878 244205
10878 244205 -307625 -171569 108137 301818 -177738 107540 -129746 158556 5711 -38519
10867 79487 203966 -198572 -44782 -191380 93981 4053 -180719 -161477 -290027 -102551 106718
10855 -326292 103298 -151683 173455 -94763 -477959 -121147 234246 -211670 123552 -346711
10844 -35020 28066 61956 -156873 178064 108126 42709 2799 -361331 156979 -130341 -163711
10833 -163711 110048 53244 -67786 -743200 -374058 -52964 97397 132968 -46734 -77203 143917
10821 -132952 -121655 119952 -11691 -246661 352541 -88874 -51581 -380321 -29876 161047
10810 53911 -105356 -10260 -194585 -250151 -45069 -133272 -34014 406138 -474967 49002 -193778
10798 165672 171901 -213462 12792 13819 -1933 97617 50084 -29921 -109454 -139173 14772 -279220
10785 71917 36344 -27194 9641 126820 110332 180454 273765 29835 -55883 -163419 -155007 -748
10772 -22735 227330 29924 -191174 -35618 -131601 -32747 277229 287660 -127782 159146 -165725
10760 31208 -253514 -254514 -224717 137325 124706 -145054 58495 91496 36193 38186 -166832
10748 -457098 -543048 74768 -584063 -59039 204227 188614 72379 12926 86469 -29280 113065
10736 -177768 -219540 208360 -270356 -76546 -193549 -183872 -102810 -130906 14112 37217 -61464
10724 -33370 -67141 -232320 48948 -50494 -134697 -65910 -159477 155374 24970 -317528 -374804
10713 -374804 300591 123780 211761 23806 54817 75122 -59721 -109930 194925 163678 -175738
10701 -140767 -188130 207938 35264 -205654 14973 -45665 146582 -300778 -123248 180329
10690 -91759 -58324 -376856 -257958 215552 -150861 149782 -24588 4126 -215193 -178174 -187140
10679 -187140 -85040 133070 174697 182886 46853 116989 -236100 35735 -72962 -81769 -297433
10668 -297433 78651 362016 -151240 -193993 117368 -90465 103407 124487 97259 -432670
10657 -106546 -100727 -167784 -124936 -197214 -508663 -250428 72210 -43571 -36795 -267149 -108794
10645 80540 -144382 216399 -417166 -58626 76499 49865 -352030 38918 -239979 -119032
10634 -498207 -87517 -380754 -109706 -254835 211899 193296 -223541 -271088 -28236 -246617
10624 -246617 -90601 -29463 97297 24124 -36990 -241215 12367 -304338 -76728 -40343 632244
10612 94885 -241330 -195738 5232 -416566 -114732 -329667 -130780 64431 119371 64899 85285
10601 85285 -17445 -54863 -124085 264747 -207110 -184611 -532070 -24608 -527388 -110858 306221
10589 -209807 8377 -126014 220993 2432 101063 -25579 -144607 96502 -136292 -189593 -37735
10577 -125076 2916 -63751 -24434 164244 -229458 -35992 -68925 -299094 26830 -257783 -84026
10565 -131984 -113100 -77760 -65223 -204125 -127347 -45897 314165 250551 -28864 -229139 -30329
10553 -36599 -16535 283215 37933 -44478 15925 73093 -79649 284461 -16960 -174999 57965
10541 -329794 -364358 -20958 188322 144538 -300297 -29399 24741 224172 -245016 -387008
10531 -387008 304663 -106772 -24336 246700 292210 -273207 -15391 -235599 162271 -98190
10520 -184668 -154268 169348 -113213 244954 -117418 -250814 8847 116776 -13620 -232494
10510 -232494 -10950 178833 72098 294556 -17052 -261722 -102873 -151797 -250228 29932 64260
10499 64260 179176 -142490 83190 -210492 -58207 -44105 -174792 -64172 -141610 142490 167939
10488 167939 434987 203026 152039 -253011 119424 91287 -4927 74910 31981 212345 95591
10476 31221 -58065 64736 -51257 298740 210203 -246844 376220 -274159 146087 -138389
10465 142551 303846 -161023 -194533 -143361 315366 42858 -93708 -10839 -368142 -161519
10454 -171012 -26868 -39013 -29546 -4094 62467 37150 -590883 9564 -182392 -25343 -198228
10443 -198228 -57437 10268 -85904 2914 -209121 134188 -99351 150733 127788 5679 101171
10432 101171 120698 185160 -343899 -58502 44349 -183060 14741 97551 226329 61096 -108787
10420 164112 119244 124458 41383 -76617 281821 34778 81844 -121399 42399 -243345 -173464
10409 -173464 -38682 315614 49939 -171387 75623 -332642 -178323 -2548 -122844 110051
10398 67958 138489 135329 199390 110194 92792 55963 140663 -42933 214782 -154427 61462
10386 444133 87064 76179 223334 213840 -84060 1549 54595 247365 76838 165368 149796
10375 149796 -18950 175698 661 319534 208298 144204 -20025 345326 -51630 254834 359628
10364 359628 206979 99643 510191 -49829 370725 31920 76506 395883 401085 -136542 71625
10352 560483 424178 574284 478480 632042 319892 277054 -201968 -78284 116880 82791
10342 82791 280236 81677 63271 197784 -250139 -87049 47493 -100778 201128 -112181
10331 66785 260164 -199984 132126 233131 -216938 193295 123443 406118 -103054 -130772
10321 -130772 87636 204138 125045 182524 -388433 252117 36329 -41629 232200 -226957
10310 60585 -139686 45375 165806 171599 221145 246216 86013 55881 247301 -178857 102776
10298 -103622 -204842 42554 -302006 -4700 -216259 -205967 -429270 97777 43878 -103848 3107
10286 -138907 -187985 290719 -154764 -215155 101822 9650 -209175 27930 -287746 -299718 62609
10274 -290863 12503 53121 115654 195599 -337484 26189 -19221 -293975 61381 -156030 135123
10262 31788 29860 -185532 322150 135839 10075 375672 184636 427664 74728 290546
10252 290546 109027 3218 -288456 138027 -292658 -318773 40220 -30548 140513 -51487 -137560
10241 -137560 2645 -223353 136890 -577160 132736 53303 -249276 126375 -119665 183429
10230 46550 7313 -6809 261690 271991 23756 37555 290172 -216594 -258815 161557 -80327
10218 -124909 -270015 -90132 -52114 86454 160653 -18849 -68467 -194204 33926 95326 151511
10207 151511 -203199 -75931 130359 -400912 61254 -352940 43449 281998 -11271 350513
10196 -159354 -269683 40782 49730 -141777 -20287 -378013 124731 -171608 -204406 258395
10185 199734 32051 64487 95790 -40023 -26402 -112475 87858 -35506 -95994 -91833 -153439 -265538
10173 -265538 -231565 -121490 -44793 29413 190520 -332838 25054 125266 75394 -37255 -82412
10162 -82412 -214253 -82123 128479 -486998 253071 -318637 -149161 -264994 6314 42349
10152 42349 -365415 144366 146893 335511 -440834 -225231 59252 -137374 -170414 -367492
10142 -367492 63407 17030 -183612 -37446 -231545 -40506 28681 77260 -63879 162243 166215
10131 166215 87092 21612 11121 -179843 -196361 183817 159463 -14875 -54789 164047 -34333
10119 -216109 86203 -111690 68785 -8839 -342830 -223651 132873 -255528 -120419 65513
10108 160046 -241924 27904 -30559 325500 94851 -6682 33568 -72741 -98470 143688 -103652
10096 -16622 117750 -2632 -49328 -6732 53280 -15755 -138446 -34353 -241733 -297483 -158577
10085 -158577 -264209 -213770 50195 -171769 -153429 -243496 -187491 -311032 -146974 -48495 -297668
10074 -297668 61151 66578 -169781 -70129 -284520 -57592 -316964 298110 80025 114701 20903
10062 148579 -412860 252122 -404019 -19262 29042 -4137 -103490 -88173 193734 -59302 -50987
10051 -50987 -155580 -93471 74641 -158623 -28887 263896 60807 590281 -287368 68584 176461
10040 176461 57779 -203696 19904 117816 -312085 49550 -110367 -439951 144333 -259375
10029 -355712 42316 175049 -301414 -20820 -156784 -122630 84224 -92615 -311694 -7918 -166406
10018 -166406 -191920 -496924 -285311 345089 341087 -234886 12541 24441 -209361 -21447 -214534
10007 -214534 51445 -68973 187086 50736 -386504 -223312 93110 10676 28986 -324022 14201
9995 160448 -97141 -216421 -78806 87528 -287579 -158639 162017 -49126 -217761 -198260 -137995
9984 -137995 -233214 -103361 162835 -30638 279489 -46679 -210547 -31400 -133221 -173408 5861
9972 -237737 -107968 38909 -413708 260707 -416294 -76989 -287128 106906 144542 -126864
9961 64445 -174070 -202623 -27474 13460 -42503 91550 -359228 -142301 -56256 -188854 -24832
9949 -69741 -322319 -101917 41906 229133 -107362 69492 240529 20862 -289209 -98612 -87009
9938 -87009 57855 -484516 -31897 -57304 -108864 -113076 -5278 -122156 183697 44454 144112 -202038
9925 107047 349847 -118539 -188553 -345034 24646 -9720 65081 -309730 -165244 346201 -191846
9913 -202861 203686 -93128 -137079 -248952 -133042 -242996 68688 245556 -195490 149614
9902 37912 -137347 221995 183171 188568 25223 107660 -146778 -157052 213304 5241 55723
9891 55723 297922 205178 -327810 -1348 -111916 -237112 -241317 171108 -256722 126477 194377
9880 194377 -15760 217917 -53111 -76365 -111233 -192888 413247 -220317 54834 94794 120918
9869 120918 -359829 -84698 -61222 12100 111324 -83245 -41034 -80040 -331976 81788 -52410
9857 -72436 -19948 -277220 -268822 168830 -256926 -57268 -272115 22709 120752 -117183 90054
9845 -44208 141024 -22150 133663 -167174 -97591 286098 170018 -115228 -391054 -18265
9834 28250 -319180 -53776 135445 -279253 153136 31508 -19847 -128963 -90254 68882 -89503
9822 -52091 -254053 -365967 82101 -144133 12264 137453 -277847 -109662 89868 264340
9812 264340 23612 -93913 77681 -471729 33418 107863 94285 -241816 17439 85265 137338
9801 137338 -89168 -228421 37300 -84768 -196222 -12512 -124190 202381 -211004 -264827 211377
9789 328146 -2424 185957 -18132 89481 -298719 -53550 -205382 25595 -288581 -143095 -131514
9778 -131514 -79465 -81 -308036 -187721 8147 160306 -115510 -202751 -120480 -42166 -177094
9767 -177094 -57254 108197 -24762 73367 -17324 -166135 60430 -121385 306051 365977 -68597
9755 -101188 -57214 -476254 -234557 97128 -193378 -140834 -137432 -189556 -449139 143690 -251649
9743 -37377 73228 -24023 -475528 72474 -109841 -222323 67631 -45481 95488 332242 -81967
9731 207573 -9398 360700 -115643 -244428 -523955 41238 189564 148455 -194980 195754
9720 -164479 -55024 55184 -197825 -245232 -221423 -43402 236883 -180582 33069 -142778 2636
9708 -155086 50362 88119 74597 36865 62753 345013 205772 -171272 37959 72628 -63720
9696 154705 99458 26505 -310318 -7584 -389397 105992 81056 -73390 -138120 -141056 -363444
9685 -363444 21060 -10943 -217285 91 135868 -167587 -277208 157387 -66505 -314581 7853
9673 182968 94787 -278489 152142 -154569 -235894 141038 -207858 56469 -25515 93759 -90508
9661 -111776 -269786 -471892 18171 -130262 57967 -27198 14357 79334 -138042 219535 -90931
9649 -96238 -274757 -61516 161455 -38788 197288 -165881 -394159 143860 11539 -124279
9638 14582 -287677 -322339 -142945 -141250 108653 -413820 -366160 -189091 -176743 -108764 -195233
9627 -195233 379006 69120 -214617 -249756 -393800 47391 -99696 -108717 161131 -175706 -213380
9616 -213380 -344984 -5468 321909 9931 -27453 35754 121452 179069 82253 -77382 -109292 105094
9603 -211670 112175 -79543 213317 -19066 32251 161432 -129717 -418895 -132262 16524
9592 -198017 -78941 278599 -304410 136007 -200735 8538 117781 130726 -165453 -20326 49944
9580 -64865 328081 -50094 -112492 164363 -107376 83369 53114 -210370 43494 -83097 -47392
9569 -47392 175118 -278285 -150631 -324972 -59659 90072 25140 22826 64591 192335 -584180
9557 -165337 -152103 87828 107626 -52825 -129123 91020 94474 -150073 118867 102977 135046
9546 135046 -87663 -312813 -38664 -129826 -133772 -384681 -263497 -82193 126300 -136047 101070
9534 279262 146408 116070 267770 -122135 35660 41617 -84388 -224930 -240061 27780 -111916
9522 -31552 -3517 -61757 -106003 158119 105491 -335291 99312 184004 -245881 41587 -3254 56498
9509 132740 -85841 75359 160603 -181308 -207096 9370 158272 -161399 -262064 -128837 47333
9497 61220 -104718 -133598 -235170 9350 137092 -185754 21077 -7877 -409371 -169988 76729
9485 191266 -131377 164601 -122897 7932 -152066 -254075 -198304 -103231 23147 -170559 -189956
9474 -189956 45163 -31453 -126911 59430 -190979 -229315 -73868 -92828 -174826 108060 -191965
9462 -348284 -210508 28562 75489 368057 -180049 -297217 -39084 -154950 81090 -115736
9451 6275 34104 -81551 312895 81010 -63103 -371560 -69576 -291396 -256051 339902 -314094
9439 -250206 -71942 78726 -65994 -131171 -216918 -24300 87509 -84365 51312 148525 -119226
9427 164073 40895 251687 -8115 -8047 -116219 -199131 -58193 -80940 -127117 16261 21179 113928
9415 113928 1424 -167249 -61049 -292528 141472 -2746 89135 -36961 -188534 -36183 1152
9403 36157 389915 -138400 -270586 132520 -1919 241943 -41368 -182813 315812 182615
9393 182615 67836 -223614 -33042 -362336 108674 -322041 -108625 53342 -179832 -154044
9383 -154044 -220853 -183419 -202708 -58160 -231947 -51479 -14107 150238 25741 -58342 -72420
9372 -72420 45113 111214 45395 111201 -90615 194465 -114349 -3537 -195504 -360455 -272483
9361 -272483 112246 -46523 105725 -192293 -71820 -203948 -70909 -110311 -190599 10471 -80357
9349 -129235 -65044 -290345 161001 -44329 -301054 -47408 -156882 -100666 -57414 -128972 -202685
9338 -202685 -26624 -197571 -384970 -16700 71011 169931 313595 -293562 642 -83907 -63538
9327 -63538 -92390 -395698 -98318 93379 -129596 207211 81862 2668 -186195 -259941 -318407
9316 -318407 233042 -75285 44573 159109 78580 -33669 -350844 -143281 -62875 -222578 -356971
9305 -356971 -188657 -536155 -75612 -15366 6847 -91116 -285791 -360412 28504 50471 -311952
9293 -226913 -10859 294489 85020 -99596 -243536 37254 -3114 -228410 -162822 -22274 -232035
9282 -232035 -87050 -89027 289562 179570 -217651 -79718 128163 -99455 269115 -191102 -255745
9271 -255745 146930 60044 -194843 -7154 -375754 -143628 192730 298293 -142644 -302060
9261 -302060 -129106 -142966 -55729 -52273 87019 105763 -197070 -98 -196978 -140875 -188463 214689
9248 -26357 198226 76906 -76488 307267 -221219 -305890 216873 -552602 -192500 -48890 -301
9236 146829 175699 25690 -321296 -183194 -480362 271566 -197156 -75452 -44039 -138705 -222174
9225 -222174 48706 -97441 -113803 -80677 -189613 -235606 -109403 -137773 53654 -165871 232180
9213 581 64459 -202766 -77391 -53908 -95658 -355510 -73984 -197574 -107643 44159 64154 55587
9201 55587 -151145 -274896 -1738 -111526 -85022 -187997 25839 13367 -12606 63122 -319827
9189 -122881 -436462 -189880 37816 -105499 -120088 -22896 67213 187004 99349 -1276 -138815
9178 -138815 -332781 112596 90672 62950 -141938 119963 -166964 -279759 -124202 3300
9167 265738 62179 194843 -146468 16984 23275 99375 -27114 -166972 -181942 64366 -76598
9155 -335148 -91179 -91567 -25542 -273175 -366502 32525 -305597 72225 76682 59300 -29622 -173506
9143 -173506 17243 -43683 56789 -172636 45413 54610 -274146 16579 160964 -207535 -86596
9131 362131 34415 55808 -160905 -224713 -127303 -177233 -335716 232322 -131133 125799 102213
9120 102213 -316275 337700 369204 -218996 -424504 -90459 101123 -170823 -28544 44146
9109 -40327 -220949 -291680 252926 -28198 -229184 -21371 -158850 -481006 43146 75778 31587
9097 -324732 97003 -354959 84074 157657 97366 -154775 -205325 183693 71416 152645 167204
9086 167204 -8694 -189441 -298481 -27256 -72068 88110 -50354 -77421 -115218 107408 -34009
9074 402933 -64878 -14444 110557 55334 -1834 -296576 -138794 27186 66861 -136087 -76464
9063 -76464 88997 -146384 -245309 -284339 150827 -91573 102742 99547 -95386 238323 70060
9051 268047 -259089 -112608 31761 110600 26864 102354 -502419 -260750 -128506 76273 -19568
9039 255484 -61551 -44408 -125027 -315925 74788 8445 -112648 -164196 -46415 195092 -163936
9027 -272553 -172159 148209 112599 164072 -249111 -264354 -79631 -96834 -83323 47810 -150549
9015 -17556 -88709 -279803 129729 -348014 -263165 -260873 -221915 -216976 -231236 -88251 141315
9003 213911 45123 -98778 -122661 72069 -70799 -161542 -403654 -348355 -104946 190070 -422543
8991 98159 -45519 158918 -219707 13247 -160495 17582 -91288 -423632 51596 152768 -64655
8979 -116926 -52880 120118 281710 -114871 -215958 -117432 -29287 -22176 -29418 -148479 -162381
8968 -162381 -24812 130657 194065 240167 -28516 -203937 -38274 19918 -241872 -48715 133803
8956 -109370 -231075 -58233 -26267 -65093 -302463 -59467 -82020 187876 -153866 -62712 54554
8944 -420678 -65725 120810 132153 -254018 -165814 -49106 -80769 -314170 -60800 186263 54440
8932 -106665 191940 -160149 90592 -176559 256498 -110564 30417 325705 995527 2923385
8922 2923385 7815674 7927187 2118002 696947 -16751 92133 240432 -30786 161968 223087
8912 223087 62455 -5624 -61670 10466 273257 -83554 10506 70592 13759 187209 -22664
8900 82703 -232256 -157571 1519 -88366 91282 -77466 -173053 89501 -212277 -126439 151465
8888 -8433 -281032 -41727 -434049 136118 -208362 158023 -113299 142086 -495149 -108628
8877 467866 -9212 -168635 -243042 74138 -55199 67766 -334163 80289 -318423 151744 153874
8866 153874 10570 -80241 22246 -108963 67345 -66090 21158 -37643 -117926 120403 120142 -154108
8853 -249357 -27261 -163790 -46443 338588 -304890 -33348 -132082 -166548 -262862 -158370 -66426
8841 -59453 102865 7135 292033 -88434 -244408 -262091 -77409 -184731 -19471 90514 -123172
8829 183148 289882 108660 -151480 -25744 -173927 -67123 80284 -132499 114036 -455953
8818 -281213 -183123 42504 110381 -167658 -316429 193188 -273639 -131997 90627 166451 -228222
8806 -85561 95481 -35158 -216518 41688 -28640 -439998 -57604 232903 207096 189151 87473
8794 -171470 124656 146719 -6995 230654 196328 -49581 -200272 -137849 -315001 149569 -97930
8782 43116 77797 -2680 -45501 -164927 -121592 -162953 -283075 -55786 -153865 -5929 -213105 111658
8769 -139262 -207728 -342593 105352 -244939 123149 -113236 -166840 -224269 172918 -57650
8758 388852 434645 541794 -90767 -280112 -27609 -68612 68326 -317687 -211223 -184704 -14424
8746 91989 -66515 -36679 204708 -157975 6343 -96612 -152867 194586 -101395 -189109 -63667
8734 -250739 -84934 18877 -466463 -44128 94158 -40768 -157440 74643 -44491 122377 -32222
8722 -277705 -243958 -70609 -149709 54243 -99923 92349 -36341 302661 -221447 -12009 191349
8710 -215604 -288791 -275817 40880 98853 -351745 -56905 154804 -211149 1219 -94758 167762
8698 -70312 -126363 -152192 -86601 -53428 -184907 -28904 -71826 231043 -319440 -19157 -52179
8687 -52179 -80278 142946 -108634 -41589 10053 18862 -68795 -89516 50033 -26120 26642 165255
8675 165255 -105533 -3848 -38669 32849 41845 68212 -211945 -239148 -239455 -155708 168112 -141866
8662 -24364 -56273 105535 15536 196861 -120817 -50948 -196538 -227582 -178024 -106149 -286168
8651 -286168 -42242 -21548 -117241 80718 -265211 -210109 71809 -166586 -78471 -152940 -204774
8640 -204774 -264151 -34156 6926 -439888 -83773 -232190 45790 -173216 17482 -382082 -39254
8628 -85308 7462 306377 -123957 -192198 -48477 -261972 -131676 -205196 116988 -77503 -257713
8617 -257713 32560 -27443 -233198 154230 -138779 -151014 70793 -349847 -163103 78178 405
8605 -222677 101343 50220 -6167 -256309 -14190 -99232 -26756 -390449 -1541 -22892 28036
8593 -248034 133130 -112768 -108240 209548 57534 -44671 -194670 -324299 212957 16017 81231
8582 81231 -214950 -128045 313936 -419932 320289 311956 -123750 -19548 -166837 -150523 255772
8570 -272291 -237630 34347 -243896 73197 -10380 -162899 -111170 -169032 -708583 -185552 -441517
8559 -441517 -88458 -187052 -184662 -393329 52365 39254 -39074 100683 -183144 -87539 -294684
8548 -294684 -4767 24958 38575 361974 -87721 -37403 223878 -237923 92386 83470 -349059
8536 -187442 109069 279137 117727 162857 -170739 112730 130467 -193342 -198775 -34586 -103029
8525 -103029 119862 18835 102800 -1325 -165737 -31592 -123267 -241644 -8952 46200 -110995
8513 -20078 106634 -139779 307022 -68799 -210202 74230 -274272 -74796 111032 -308547
8502 174116 -12459 -206050 112080 -131972 -162131 -589408 112861 -199601 -33716 385672
8491 125458 -115030 -88232 102086 -71110 77646 106099 -19236 -106773 -89859 -273451 48117
8479 119262 -3506 355050 50010 -167453 -89424 198563 -53483 43420 62952 -210330 -82185
8467 171008 126420 -112047 320919 -262657 68955 277632 -380349 -211125 208613 14950
8456 -418494 -294768 28211 132125 145311 -66088 -95386 -193196 -136604 -261853 2312 -131221
8444 -201048 163049 -90033 -214820 -295298 -204046 -185460 195383 -222247 159884 -140138
8433 5488 -177742 -39329 -47164 -138052 205462 -183803 -94455 368194 -144836 -64818 20934
8421 86694 -230498 217961 93376 -4214 -107975 9160 -189466 43305 157567 -56035 -121871
8410 -121871 94928 -261905 -74620 32084 128082 -99387 216517 -85359 -135937 20700 -79622
8398 8800 -78211 63603 224716 -174052 31099 104758 -187586 138015 -183674 -547901 -199298
8386 -203636 -321351 -11754 -19407 77946 -180466 161139 -335660 -41906 6362 -260264 -106801
8374 -177812 -115477 -4667 -124043 -76652 368757 -180188 -248064 -37170 26744 -6602 -65634
8363 -65634 31230 20575 176724 -270094 85345 192191 -277929 -135647 -259831 162258
8352 87284 -160577 206453 124662 176904 -339286 257269 -227859 -458550 56562 44062 -18827
8340 -195446 126376 -187246 -81304 120150 -147271 -244974 -67969 194223 -52180 164038
8329 -417419 40904 -50502 -167686 -316231 -168720 -250400 50795 -160918 -64800 -16007 20266
8317 114309 69234 197861 -164558 107484 -109108 -91398 -89013 -125218 101160 -169357 144372
8305 140642 50931 -240662 239027 72382 11915 -210671 122298 -99603 -49327 -592359 228279
8293 -199875 -26021 -227080 -44319 73593 -196120 -112256 103908 92188 187658 177549 49629
8281 -226858 -245472 -71207 -204299 -70435 102680 48997 -278982 56016 -62170 -90668 -88137
8270 -88137 -81595 257612 -102971 6099 260623 -139417 -243339 113710 -144714 -516282 97665
8258 -59115 -151827 33618 -120217 -169098 -208897 76328 -126955 114110 46330 -4546 -277478
8247 -277478 -376382 8791 -267924 70679 362433 131375 -153924 -161174 144955 -129633 197913
8235 -140178 93786 -130937 164460 -39438 -125821 53723 -142908 3812 -134567 35676 380989
8224 380989 139008 -27301 49216 -176839 -85661 -169912 -198505 -266269 -190048 305164 -15696
8212 123016 -128500 -208228 -172389 -73977 -19277 -96704 245172 -250736 113285 18523 -16037
8200 -30527 18007 -27889 -300744 263542 158318 163968 -114963 -128447 -8411 -193986 -192455
8189 -192455 -219979 109877 -115386 -156969 -283630 84067 52936 -127683 -35495 56177 214292
8178 214292 -78879 -205208 40808 -152408 188163 126283 -280135 26266 224276 -18158 -160048
8167 -160048 -423631 164297 -72392 -147645 180060 380525 -176073 -251978 117853 125418 93824
8156 93824 -91859 124372 85042 122289 -124758 -355350 10172 177864 -276862 -123859 -236985
8145 -236985 -62712 -147638 150312 1631 -230857 38218 152056 200633 -232934 257004 -16652
8133 7285 -262632 63705 -3415 -269536 -135845 117748 88726 -200531 -239262 -108850 -136290
8122 -136290 78137 -40117 64256 41754 -201387 -42624 47767 265331 -332790 -36635 -103501
8111 -103501 -54714 2495 -154007 -43343 186722 4787 -102031 -248936 -376525 -54045 126134
8099 55188 245 -160284 -295439 -351095 -38949 -5304 -254635 -56989 127293 55195 -63551 -252320
8087 -252320 -46679 91915 53652 -118503 -75855 -234744 146032 200702 -70010 -110061 18526
8075 434805 -326385 -28 74936 8721 -136914 -66076 30916 -99880 -101179 98401 -106511 -374687
8063 -374687 174224 -135998 -71789 -67220 184464 -361659 -93318 -4182 -12947 222576 -238194
8051 -23168 -56751 -329283 -75197 89630 -23369 186851 26187 -380772 -50561 -252715 55806
8039 127749 -144242 62490 163787 -113495 48235 -68146 -97671 90282 57063 -128973 -153532
8028 -153532 -330391 -272558 -83282 -232819 317274 -148948 94522 -347951 115808 -6876 -112840
8017 -112840 -101181 211328 -149267 -78721 138749 -126149 -241023 -189188 -117138 323656
8006 3163 -187353 -22959 74727 -80717 -78595 128376 -115532 31314 -80959 223118 -38342
7994 -130886 -261326 -110287 -66279 -326220 132121 183002 33560 -149097 -5245 -172068 -72167
7982 -315249 154292 10760 111884 -31799 -95096 29841 -98883 -245512 -50721 35824 -176617
7970 35243 -225388 1752 -87183 -347155 -27165 -104152 223790 -1 208310 52235 124556 141096
7958 141096 434229 -290163 -140102 -85581 -80353 -266088 94996 -136833 112515 -88138 -143366
7947 -143366 -145820 184087 67971 148624 88640 -280749 -380955 32648 14128 -49611 388512
7935 -187382 98767 -71561 171247 121176 -228742 18436 -127798 -272500 -167703 -157793 -228540
7924 -228540 -113624 188955 145236 52322 -232212 405086 -6185 -122907 -9865 2889 45313
7913 45313 -157621 -258283 -277106 113549 -336078 -111956 -147398 120403 228732 81197
7902 -258361 -220895 -2676 -16765 -126561 307676 42751 22103 268671 -201220 -150068 103904
7890 144872 71211 104424 362384 -143078 261190 90925 -248451 81195 -207006 -8175 -29635
7879 -29635 -19027 -301801 99624 55211 -48025 228660 145563 -127170 -203892 -147623 382323
7867 211433 -78862 -256115 36646 -59029 -117304 -272214 -137803 -220065 -190158 394085 -219780
7855 -136785 -32595 184716 38082 -6574 213333 -61788 -74049 115648 203706 -155787 -168692
7844 -168692 5808 127870 151813 209337 127646 -129278 -6640 -14095 -106333 -10084 -442030 -21886
7831 -336452 321765 -120391 -115726 -47988 285443 11097 244391 259575 81849 100337 -282215
7819 -251642 -233217 -34632 -136958 -454301 83850 7791 58493 188203 162493 176006 -271961
7807 54487 -331941 -165583 157870 17078 135839 315614 188145 -201112 88627 -77544
7796 -336548 -54296 -4274 -139285 463575 26454 115317 129755 -110382 371870 -305953 281577
7784 -191366 -323301 222780 -494739 86665 2004 17963 -381289 38868 -354366 -244467 -422735
7773 -422735 -133854 -82008 -14732 -79008 -31984 -291629 4513 32533 294612 -377791 -20882
7761 81410 148283 -108814 168665 197263 43808 -12810 87925 -58597 -314794 -40501 73410
7749 47093 32268 239859 142930 102469 -416645 161496 -139360 -172941 -109397 111896 -21399
7737 -184628 -104548 -65677 -106058 28521 -82615 -178600 -148572 -120986 73950 79425 267918 226235
7725 226235 76853 -95050 326722 34289 -255882 -212230 157851 76141 -382499 -116712 198005
7713 -94495 -76714 74324 -69679 -56412 247485 53461 269415 40444 -27985 3465 -140526
7701 -70191 250723 -919 -157423 125695 231705 -3153 -83652 23137 98353 -183977 455406
7689 -46691 169128 -166075 -243531 37597 46920 -180684 90618 -28734 -182304 64134 -146289
7677 -27404 -361036 207964 8059 21724 393528 -144291 -14516 -252731 -37186 -2417 28102
7665 -28270 48851 2339 117853 -210702 191042 -48133 -196945 -221270 136484 149388 -76363
7653 25790 12516 38695 -62631 -22559 109579 -62304 13003 331152 35602 20717 -175296
7641 -108772 203528 -59195 246330 292085 -225353 -138864 -110965 118333 225397 -254180
7630 -79583 138669 -29926 -221228 -211614 -242477 -219296 -274951 148789 -146157 -109345 147773
7618 -86958 93518 -134804 -133576 202264 -29746 7731 -137052 54990 -52321 38263 -138672
7606 -150915 -280213 6985 -232594 -277853 -171999 8854 -362561 88052 -153000 -39651 -289283
7595 -289283 81470 -288333 585389 -104889 2847 -114296 -171666 59981 -323638 -118591 52856
7583 -183668 -25314 268703 182633 -29191 209358 67012 142261 127934 -153279 -81444 -429665
7572 -429665 52041 -78207 73789 58746 -146286 428340 -7966 138779 118745 -265789 187330
7560 -87624 -204261 -134030 7890 16961 29872 -25648 -93008 192041 250621 -198503 106334
7548 -45044 -21904 -286718 -57415 -195101 9082 -148878 55195 -142520 99070 -226085 -230215
7537 -230215 -307043 -196616 277645 -44813 -193905 23803 -224751 447475 136306 230754
7527 230754 -197208 -58979 -149199 -171495 -62762 66759 -15957 -81001 5217 -98921 -7929 184445
7514 -127956 103764 -60496 206598 -86924 -101408 -610564 -163038 71322 -143319 -120070 148632
7502 83612 -73540 139497 -130653 -7597 -34603 15411 82734 47823 -117484 170218 29624
7490 205237 -251339 -205951 -166526 23757 -174041 131104 2727 -32944 -43908 -138964 -38221
7478 -121898 -311982 41536 17157 -3129 -260741 334856 -384967 24637 -91252 -182764 -88880
7466 154590 -157736 -61302 562781 53287 146726 -8751 99678 95722 -155590 -124960 116929
7454 281733 93472 -105154 -105807 2221 -108523 40053 124815 -47991 284182 -308816 -173224
7443 -173224 134293 320553 -57185 -74141 205823 123185 -216379 100247 -122237 14744
7432 -400487 184488 165203 -7760 -28647 -90937 224840 -348469 -94823 219230 53473 -277088
7420 -78982 108634 -29119 -57103 -97362 -7063 -89376 130724 20936 23520 -250596 -16614 -130064
7408 -130064 -258794 -408373 -226360 -2243 -64467 38407 -469875 10512 -38551 236527 20844
7396 347346 314479 112370 9923 -165004 117574 45969 -321642 -117125 -124288 147865 38651
7384 -112198 116626 -175614 -466140 24715 -242028 101690 178713 -11991 -383302 -137630
7373 144484 -68777 45093 -187017 106650 -68282 -419849 -8960 -133471 54718 38270 131294
7362 131294 -259066 -204726 23584 -104448 -13740 43726 -347647 -267916 162205 39231 -327722
7350 121324 -191973 117610 -98626 -121098 304929 -123051 321874 -87675 -346981 -303248
7340 -303248 -120482 -17493 -81913 -36838 -6739 -22502 -76106 94561 -45155 44736 -278609
7328 94410 -143405 -45808 220825 -113441 -171023 117691 -125296 35702 182920 -247811
7317 31407 134571 41373 -181199 144379 -157691 25360 -212239 -335342 3281 270604 309192
7306 309192 -76494 199126 43143 -29030 123711 -10944 200927 -18146 -162836 30041 -37512
7294 -42871 -26292 -43589 169902 87950 -175812 197883 118801 123906 9736 41619 -189286
7282 -112298 -13277 35800 -44346 136118 252386 -264090 80151 -96938 -114906 -158571 -268792
7271 -268792 57043 -120903 -122878 46423 167700 -114699 -32989 86368 4533 45392 23259
7260 23259 -429450 130455 -65108 -135031 86236 -18556 -111783 -66954 25408 4348 -176300
7248 210711 64809 -48047 -133087 60840 -64298 -169380 163632 115993 86962 90974 130006
7237 130006 -36109 -43456 62853 -88096 -247024 157259 -183424 -176557 136659 98562 53370
7226 53370 458938 -18527 70730 -133774 -3279 -24551 -154745 -49967 257367 -79428 -66420
7215 -66420 73982 -162959 219698 139418 -17288 389760 129321 99123 -131204 23139 222899
7204 222899 -213561 -160966 157147 82578 -17874 92656 -1196 -94077 -76679 -115306 -265393
7193 -265393 373368 87872 75401 173116 273 6549 -123923 -122528 -51736 -235029 130941 -34355
7180 249070 -144711 -55154 -112777 -279056 104960 2606 85787 19569 41667 -94821 101414
7168 -286537 -54707 -127105 111522 119553 97682 -40796 -21383 -11628 -273137 -77903 -299035
7157 -299035 45559 -6019 -46213 -11474 -144711 -110035 -110080 -303628 147290 -41190 -122872 213308
7144 -10799 25939 -161271 -96216 -132682 40909 -222030 -131121 67189 4732 -217403 -213445 -9513
7131 -63053 93727 30670 101821 -67525 -252905 -222494 127872 -26930 -40990 -27390 168805
7119 -215403 -218438 -184681 -84086 101852 -52315 -495053 37451 256614 87940 473836 -147636
7107 119474 33645 -72866 233760 -214409 -63017 -89902 -423148 -39581 -31523 -121643 269294
7095 58063 -18641 168723 119712 21874 200200 139003 312420 -315800 -332538 126913 -23325
7083 -38743 33008 60234 88178 64052 -403285 -48492 -120646 205187 -182900 -481638 -56745
7071 81193 88564 -211108 92219 147446 174397 -116900 14882 133902 -436013 -69693 -19974
7059 48238 -171892 -42940 135345 111115 172614 -122282 99016 -302454 -163311 -49344 -23855
7047 -145853 18326 -200670 103039 -11525 162618 -207269 10729 164079 -79425 215303
7036 50057 100372 86599 -208272 -128286 48986 -240781 -307992 267322 259729 84204 -258717
7024 72103 -130286 117880 101279 -263611 -41756 18407 -227862 100980 -136888 4855 -192320
7012 -8233 -32892 -345188 -339366 373954 -112693 -174576 -69580 -42200 167591 -63165 -286859
7001 -286859 21790 287778 127036 -49489 160969 150733 84197 -21269 -81447 29737 100625
6990 100625 -321960 -5005 -76968 193977 -119444 -136645 212077 61744 -40499 -200411 297814
6978 -43230 398062 -265455 3597 148246 336994 -23606 -298649 -419763 239386 361269
6968 361269 -181429 -157722 -163647 -437427 -207302 -156200 438905 -161855 -90545 -229391 73331
6956 -165031 -223085 -277722 141269 -181053 111200 267381 -51625 71683 -240195 -35375 121955
6944 -117313 34808 -18312 -46213 -12717 67609 -108708 228870 -107021 112364 160509 -96625
6932 -41755 18785 -25153 -251061 179362 -180671 -129646 -105512 -258423 -17075 -11149 -372238
6921 -372238 -101431 -296590 87102 -219028 -278743 107544 -168449 41011 74405 282398
6911 282398 -95522 -53027 87157 -100852 -299796 -108572 96544 -51331 -228281 40002 36769
6900 36769 -243615 257778 -371650 177408 -107847 -49760 -199675 -471895 225079 300361
6890 300361 59548 -123893 -109179 142924 5983 240724 -17128 20639 -69370 -81268 89056
6878 -89923 -120354 59293 304298 118392 61672 198416 -31728 10115 95412 162343 -202815
6866 130405 -86893 98020 -173615 -78366 18265 -309970 -32002 90377 287895 127169 129074
6855 129074 -200844 -105067 106904 -340834 -35461 333902 -79388 1309 124828 -274525 139230
6843 -131101 -227877 -198679 256418 -406190 -409238 147889 135504 172144 -22651 -67400 -215923
6832 -215923 148235 -177427 131989 -482195 44340 25912 -402546 -427411 -51775 194607
6821 -132607 54849 -108192 -96543 100975 97488 167593 -74900 -65895 -85434 -146508 103693
6809 183272 296345 -144639 -13453 -92890 122254 -167232 -380744 -66541 149328 -15693
6798 28609 256712 409478 -453691 -49201 161586 -99366 -348511 85686 79324 73694 -66761
6786 144363 -190486 43154 151597 228424 244955 83556 134277 63680 -88286 269608 -68374
6774 88425 -49129 -233487 -47068 -10061 -162252 120654 -7848 240676 -146673 -260246 -62917
6762 50521 -57097 219902 -66332 -17625 166569 9991 75060 267139 21541 16800 72236 95446
6750 95446 -112401 -229547 127608 -144936 -186695 -116423 -156327 121585 160756 -70469 -367196
6739 -367196 76504 -94385 -150506 174066 89518 105188 -218696 -7010 -13969 -267197 -102358
6727 221273 2656 318958 -209132 -9770 -69862 -261423 -135788 191821 99529 18724 91092
6716 91092 -57979 59344 -236594 306623 134440 214594 -84075 155076 -105354 -86042 -241320
6705 -241320 -338767 -55469 -267103 -153739 -337153 156470 -127909 -29886 121251 -22722
6694 -24091 -154062 -113323 24999 17907 -209227 19015 -24406 -20665 -40251 31122 -87327 -97552
6682 -97552 -404606 12851 17531 -120488 90339 62855 217974 -195918 -8473 -146941 61184
6670 29953 -76804 37026 20043 77149 -227140 12378 -113903 -253625 115191 32409 -91152
6658 -130737 -167261 181417 -100844 -149288 -93299 -123395 124765 267734 -52461 23537 1361
6646 317411 -198863 57356 31787 148127 -62864 45588 260724 -282669 -74014 -121496 -32197
6634 77899 972 -90338 71590 -109557 -129943 130966 106134 90148 -137678 88534 39788 283426
6622 283426 -43851 100525 100176 9673 -256760 68886 -239439 -73479 -175892 -21813 256447
6610 2646 -142764 -51827 -64035 219117 87145 -18542 113121 -67248 -174572 -174384 201335
6598 73418 -80963 170982 -144781 70263 -391950 10409 -394320 -39640 83145 -83003 -227345
6587 -227345 -168586 -10092 146848 147244 -146445 157652 -31495 -100220 -160063 -360208 -42704
6575 14873 119552 -132307 79156 -150709 396823 -41398 216563 -241576 -264220 -198277 -53498
6563 53997 -236241 -149729 227692 -50853 15766 -72000 11975 -183511 -112 -59107 250173
6551 165685 169658 -101180 -70326 -73387 -108009 -272984 -126787 177355 162529 -9490 204394
6539 156734 155394 140231 -235879 -289583 -226008 -268554 65998 -83577 278531 203259 41320
6527 206343 69918 67107 -335080 -100741 -174642 63635 -134095 207775 366322 -64868 53488
6515 177285 134725 -173730 -102918 267232 67726 -14186 84291 174976 -335336 125816 -295960
6503 70378 -235508 23341 -75981 105975 175552 -162835 63584 -213710 -110339 306534 -36821
6491 35941 85701 -120542 -19373 59319 -163360 114420 15996 -22548 45411 128409 -231990
6479 124391 362068 8999 162542 264364 228820 -82728 -24626 -94556 203617 69040 95799
6468 95799 80561 385578 -152064 118724 -63652 145789 -128351 162066 323345 -103360
6457 -112608 -176848 -55113 -85568 -137076 -119534 48850 -75626 -144208 -28606 94804 134704 -223630
6444 106181 -95822 160526 -120214 -239927 -40902 -59508 179976 -303661 -24111 -88246 -230312
6433 -230312 182121 22712 -133013 43478 296979 29100 -313158 -278693 88573 14761 310361
6422 310361 115040 -114366 293815 -62673 164663 -130913 138000 -131535 -236827 69458
6411 -161869 -41168 11392 40231 116149 -7808 -140814 -146130 -114020 -180824 -188394 58111 -139595
6398 -361704 -345130 193025 -104988 -120842 -52233 202176 -11655 205510 -71911 128907 37237
6386 104741 37441 191174 37856 19028 -120476 199572 -41106 78386 36716 -396181 163856
6374 -81770 46678 91201 -195713 265641 43776 -87506 175995 229395 139206 183630 -227107
6362 327528 -5362 287468 -88583 180427 -177967 -216284 287640 68797 -222084 -261002 39213
6350 -194017 -165710 -149822 194024 110108 46308 -175382 -208290 124977 -32204 -352731 133353
6338 -211997 469406 -413834 -133157 -284533 1992 -67673 -237437 178667 -236633 155693
6327 -99450 101667 -326327 -309270 63281 37489 53880 -64940 70178 -326938 -50828 42354
6315 -169627 34721 114708 94945 -74022 238179 -301831 101177 -159069 380435 -134360
6304 197295 101273 157762 -12526 -150440 -362186 56033 -157153 -236694 39642 -22997 213734
6292 -235910 -33396 53706 78988 -48347 110190 -95260 -219042 -120079 -348369 11153 120698
6281 120698 -66341 -116148 85091 193853 -23132 -120278 37336 -147814 53164 -63844 -8247
6269 -383649 10849 251511 109699 -143976 -54824 -180269 101369 209057 -65890 172077
6258 83305 -19456 189973 -324950 -3349 168408 -15282 526536 -18350 -124020 -30520 -144924
6247 -144924 -228180 184510 -95909 -90049 -27650 266281 320978 32321 103789 138624 108456
6236 108456 -235155 -152721 -139379 -97632 -386784 204444 90936 376747 -50252 -141354 -19023
6224 -209929 110568 287757 -204443 -29364 192178 107680 153914 116064 -511228 -173720
6213 127433 -42920 -152070 -173004 -24606 186162 -183571 -303914 137440 -4366 -175308 -133786
6202 -133786 94800 -88108 -7937 31385 284479 342361 21899 43810 -110466 -99392 -74025
6191 -74025 26570 135173 48656 -113077 128887 164665 205093 197774 183186 -82015 46390
6179 -143962 -295803 91341 -36062 -66756 313844 -210481 306858 -63007 83015 -39818 -101460
6168 -101460 -70359 153287 -57901 176963 -165130 -1491 142515 -250558 209826 65306 -240614
6156 -115957 -126288 -49458 -5949 27531 110530 -89613 -352450 47465 -143027 20382 330029
6145 330029 -112283 -165496 149634 -37398 -102822 -145121 -32080 -91154 -268538 -298714 -915
6133 57459 176149 47875 -259729 -27915 72444 -242888 -56325 110817 -31789 151996 49581
6121 -123367 391322 69681 41537 27753 -99347 -98279 11662 1518 161851 273805 42983
6109 -70591 -94902 66781 -35923 -313075 -184699 -27529 -197665 61354 175030 172597 53280
6097 263628 -31146 -257801 265571 -107561 -160132 -112013 61085 220591 24855 48409 -393860
6085 -175522 95147 -34628 -335695 154470 -159030 234592 151103 -85548 99250 -33456 389764
6073 -46164 -39733 90801 -518580 192146 -210697 -15545 -193388 -70515 -85484 -257875 51972
6061 228992 -155131 -309035 -153718 -144420 -142846 -187491 -267005 50320 169594 -280068 47102
6049 -226499 -13777 -86957 -113914 -116919 -9119 -136181 155520 121167 387294 -202987 -257064
6038 -257064 13687 250734 -325991 144959 33407 78330 67158 -134077 155837 -268514
6027 -62317 -48054 96057 111428 17547 -297243 -117429 199010 101346 57692 -88008 -253890
6016 -253890 171901 254586 -130040 -132621 -469701 137793 -330828 108381 -432372 72755
6005 -25399 -95943 -173104 -262980 25850 26394 -97008 188397 199636 -26034 245167 -67372 162628
5992 361725 69817 -236874 -54322 1148 217019 -98039 62767 105394 17939 1362 -11469 -59397
5980 -59397 -159020 -343518 139020 -20121 118915 -141224 -211618 60901 -48256 -135098 -11011
5968 -77530 -117204 -272883 -64555 -350377 41879 152477 18037 133104 -67534 336051 -30574
5956 -67292 -115595 61023 191614 -217001 236236 -186149 79165 59143 82723 -162781 -171146
5945 -171146 -176285 88013 -79322 -136029 -72543 7244 -301810 226479 -3254 -85845 333369 -79269
5932 178443 30257 318491 -283608 211019 -81133 105645 -160146 79217 -136763 126526
5921 136650 180280 26600 48348 179084 12537 -2833 -44366 165110 -120380 44301 -229849
5909 -112785 -185303 296104 377300 -476285 -193272 67251 -105391 57156 238483 -66420 -293582
5898 -293582 -48203 -378544 119880 -47774 -24223 517989 66172 -75033 206934 -4117 340844
5886 -149916 -136283 296242 -117539 90729 150783 -206066 173418 166258 -59042 83933 140068
5875 140068 186373 174141 37651 61769 204800 -301485 -62268 98379 -95553 188326 18988
5863 155849 8363 -103164 85271 -146965 108854 185982 -431863 -99719 -300467 -80689 60562
5851 293470 147346 -53172 203942 43190 121231 49541 165114 203006 231320 -19158 167002
5839 -134271 -115167 21681 263059 74773 138871 -31454 125824 -18586 -119973 -276088 36815
5827 -154038 233199 225107 -66940 121405 -162134 -98224 106049 -164882 222767 -57446 -31577
5816 -31577 47897 11904 -71936 -260483 122405 -104879 -74486 122027 346579 120832 128963
5805 128963 -165346 373208 33724 -16833 208427 -135307 -156839 189337 -19322 -379581
5795 -379581 -115097 13319 61965 -233261 134346 -79356 -78101 103671 183150 58597 57386
5784 57386 -97947 214273 -84929 -65052 -22941 162042 21117 -26294 -30485 -126588 -87220 125801
5771 -229028 -65438 68434 17729 -104943 189880 -67722 -66774 53424 32152 62831 37094 139940
5759 139940 149409 -358981 184954 6029 -381487 32382 185930 288345 237726 -14534 -391810
5748 -391810 -116805 2263 333984 -31752 5068 91377 -197158 84050 -26333 331890 -94123
5736 276700 -97784 28714 -215637 142681 -71536 -184461 -64893 18090 -86802 -63825 -157264
5725 -157264 105732 -215925 -333422 177955 -142210 147704 38158 -299173 -83183 -102304
5715 -102304 19872 -165503 -33071 -25141 -126496 -45225 -6005 -22475 -8426 -95469 -192461 14015
5702 -133312 114940 103118 101949 -138773 53270 -34237 366221 230752 78842 -61093 172878
5690 197562 221155 -141961 156465 -473654 105935 277736 177053 69133 3905 106914
5680 106914 42389 130111 209066 -140624 142511 -194940 -39068 15486 -58411 176893 5358
5668 201249 -84828 -78365 156385 -162307 194747 -5738 15889 -303275 -237461 305762 6904
5656 236322 -6390 319803 144315 -131011 -69641 -9567 75626 -21420 157781 -240452 -236646
5645 -236646 87789 78155 -325158 -43620 -115375 -169081 -358358 90508 50619 20904 -45846
5633 -155487 -64503 -183821 -453078 -101206 -112561 -151532 161350 -218505 -53062 -64550 28559
5621 290092 58236 6402 29416 31276 -114419 83740 -254385 179862 -364354 -40594 -1134
5609 -89504 220248 46861 135375 316930 39860 -284983 302820 -19042 -19469 -10889 15149 -258990
5596 -301446 -155760 -476143 -204857 81226 -185268 58886 85274 130075 227054 223574 277620
5585 277620 28375 -264949 2838 73789 -270076 108369 -272186 245369 -100636 -361367
5575 -361367 -71549 81989 7976 34800 96559 -130216 47640 -457521 88242 -153524 327811
5563 48771 -66257 262493 121719 133666 3895 -28427 -145160 -54720 12978 -16624 78443
5551 90769 44318 66336 -241983 -95474 -176019 213621 -166534 195439 6130 150090 95996
5540 95996 -2292 -33998 -119299 124317 -33934 144856 -24728 11856 -13045 -308029 -48840
5528 12454 -241246 150713 105360 229277 -131571 8593 -64133 -107501 47196 163809 78787
5516 70205 78945 -70846 330056 -304778 -65079 95521 -250489 -216443 -135970 98656 -95668
5504 -129983 173481 54127 -39453 9708 36427 -178330 254379 -117418 -97095 366272 101059
5492 -247440 -94977 61633 -230836 249439 350477 126073 -31449 -30363 -67108 39392 -383207
5480 -235761 -170336 244954 -4037 150874 219952 -174050 4447 -254149 -127290 -12798 -11569
5469 -11569 -95745 -176909 -30512 -200995 14970 91413 -67091 -309223 -225763 65890 -37208
5457 -51857 228946 -87333 -219341 -33002 71338 144290 39700 -209914 191711 -79378 -173693
5446 -173693 276146 46468 -86861 253938 -50913 -84182 35434 -129179 -222628 -6655 -210595
5435 -210595 -245593 -181372 -52373 98464 266824 -65936 -81904 347281 96653 -370665 -76336
5423 30338 -251919 111483 -15467 -122590 -7258 27438 36934 -228253 -123408 -29854 148495
5411 160155 300302 172621 14098 68172 -103167 21580 -161780 208217 -100361 -27565
5400 14401 92150 39971 74956 -190824 -83991 -280319 -16226 258152 -101496 -160987 418800
5388 -192498 94624 119297 241079 255070 21737 38032 -201135 -277197 94675 61630 -204541
5376 30841 178595 248294 -216552 180533 159710 -48376 71142 431220 181850 -368134 -187816
5365 -187816 260022 90817 46876 8356 60613 -387740 -178565 366 -6768 116137 60589 111610
5353 111610 -164997 -285276 -134398 -1070 122881 -134296 -46843 -128091 -36973 -129763 39586
5341 -187759 246127 129950 -202325 -109440 -186725 -187097 -66668 -89631 -87482 -20317 147883
5329 351899 -9740 -154132 -137011 125465 120749 29742 114516 56036 -67967 106531 157373
5318 157373 -23264 -84974 -112326 16531 138160 27485 457430 403288 -191325 -84384 188863
5306 40179 192065 -51306 -81068 -69834 -157826 188912 -120620 -213444 -105345 -227385 152587
5294 -127138 197515 -432509 -70674 84242 274345 27247 -120873 124444 -99200 -224904
5284 -224904 158860 -94190 124811 26219 -144779 -70064 2118 -104802 185936 84304 -114801
5272 14915 295271 -27017 49828 -243244 -231280 -202237 109920 117454 294334 160177 103784
5261 103784 -156589 88594 -329850 -39526 178465 99135 139906 36725 -225799 -208273 285932
5249 167170 293435 329448 89960 -173096 228609 -143503 77256 212133 -155548 96608
5238 -425512 106084 122672 -80785 88484 105818 179586 -102967 93370 47289 103072 -245547
5226 -214851 371 -169565 -155042 262503 173027 -183282 -69245 -87001 -67084 327809 164856
5215 164856 -8675 307614 -127303 -21836 92791 -111424 -91701 -170995 -197211 85962 -58733
5203 206816 -380795 -298568 -156208 237009 100509 -122864 75266 -330568 48679 29814
5193 29814 232170 80330 -155694 204582 -279396 130172 62331 12383 53612 -287806 2559
5181 -102480 111475 459906 -275929 366784 -131644 320556 -88671 231946 139921 -204036
5170 262705 -46485 -78604 29197 103538 173011 -111988 97995 148619 -29272 36507 -8102 14944
5157 -364071 233755 -27957 -39341 80341 -132067 -111684 -39756 -199102 -189206 -210262 -57184
5145 -181639 -249908 -98792 -148891 -294935 -144417 268585 -19363 -202521 -191681 -24776 -230758
5134 -230758 40082 -90706 -368127 44020 -333818 210583 -7 -60286 360912 50760 -156410
5122 15726 -335335 223767 164895 -80677 -205716 -77512 -37922 309003 -14629 46629 141368
5111 141368 -70519 91729 91727 -2547 -63060 -137987 136849 72600 -134535 135406 -258872 207428
5098 40537 -186883 2975 -233928 -30062 -95750 -185668 -54205 213988 160742 62285 -111802
5086 -72264 -222041 92846 -14233 96576 89226 174034 -373234 68593 -55219 35862 118449 169581
5074 169581 -203891 2410 362357 256118 33132 -261368 -15221 324873 -84050 62402 -231314
5062 -22581 -246822 30037 302265 18923 178352 241547 -273921 58260 83593 243043 116195
5050 150449 -72283 148518 218271 58966 -357164 -168710 -88553 131483 149134 87990 223849
5039 223849 257621 -288180 284887 190269 -23697 88600 193637 -199323 -314453 363912
5028 51406 27829 -58738 -132741 307574 32973 -90995 -488169 -92100 -190249 -53137 5696 215841
5016 215841 -72240 112266 -154952 -117724 205260 -71888 -111014 333443 -93429 -65740 -285342
5005 -285342 356776 -50041 86582 76961 -327527 -330482 147690 -223071 73611 -5465 62049
4993 106071 151655 365476 140396 435555 261417 -348805 148846 -294096 -207622 354420
4982 66234 253141 95846 -86094 181718 304028 -135864 -140799 -91560 -68488 166209 205062
4971 205062 30624 -132493 -179682 -52811 152961 81282 -51938 118644 -167502 32692 80109
4960 80109 97772 -117513 88120 -272426 115790 -996 6789 273547 71892 86044 -115058
4948 -81005 -174460 5002 94023 369012 203540 -93501 -206877 35165 86476 90358 186699 245952
4936 245952 66742 -82495 38484 -13908 477273 -100562 158806 -181608 81385 -160998 106904
4924 -139157 76079 214816 -166911 144789 119857 -174860 139210 -134937 115870 185995
4914 185995 42193 119103 -76303 -297876 -147486 11550 41582 -346381 -13112 165308 160661
4903 160661 128470 85469 -85303 120738 -258386 -239150 150895 101095 -223288 200190 -178730
4891 21665 -25983 211040 273824 -207977 -254714 4709 237960 -288008 75729 273615 -29835
4879 -289308 -56218 93792 131194 -183152 230070 -17789 88204 15213 -273839 122687 78653
4868 78653 350113 -192603 -106902 -104004 170331 22012 58211 62581 -178271 -86516 89714
4856 48090 -317813 -79216 -129855 79391 70885 210074 4985 -299458 -126927 163776 31689
4844 12764 214422 -100438 358523 148101 69660 -73653 29292 165647 -42596 131787 83180
4833 83180 -206618 193149 68796 177635 8035 -97302 58395 -17460 -403955 237323 -349962
4821 17143 13398 -95568 -187149 346357 -140490 -448296 -68956 -141183 134625 -318290 325037
4809 312965 23290 50841 266802 -85900 304281 48251 58020 188666 131671 145726 -172471
4797 -90720 -235315 105613 45545 185288 -139319 -13776 81416 339242 32767 146384 418260
4786 418260 39950 261669 160200 -181206 188157 24072 -166867 336183 169360 169319 176965
4775 176965 -996 -74698 -127866 -372655 -23373 9246 -192816 -198665 -19176 -105441 -139843 -64046
4762 -253610 -314883 5318 177015 16010 -157046 90331 -158121 -187165 -262171 11263 47836
4751 47836 -158196 -3880 -117558 -286679 -340869 287844 -129442 145685 18531 -173391 248739
4739 -162013 8365 81482 122916 -80045 28003 -7111 71087 49766 -259199 -20130 263712 75789
4726 -394131 79912 38110 151379 -169577 -76319 104792 3956 -100544 58340 -172325 256899
4714 -208726 -81209 146193 65442 -285574 153714 236711 264637 -270003 -41976 -279309 -109717
4702 -32529 -132307 131743 54500 236054 126836 39429 20121 -188656 -134788 -108304 -96774
4691 -96774 50729 -140442 -37666 -193302 -91053 -52633 59117 68432 -288911 -50257 139980
4679 18659 -346498 247260 47627 56883 176487 -147582 -70237 12979 -50539 -22011 5049
4667 317683 -70803 82193 134870 -203256 -468010 -383971 135287 -39963 18351 105561 161677
4656 161677 -386676 -83878 -67098 -204951 239866 -67437 -48191 -59818 -14519 -139980 -45378
4644 280550 18851 -57778 49775 -110839 -224211 65027 -90078 -100745 -22956 174471 109331
4633 109331 -51626 261639 -273736 385172 320388 165539 80206 155995 -357203 276455
4622 315355 202530 176644 -219562 78877 -247796 84143 -36981 137753 80544 145300 -73969
4610 -143650 15937 162084 102070 31222 21998 -64487 -43197 51234 86579 58337 -58073 36929
4597 -168273 81596 369484 62077 -154983 -76983 -79799 -104158 289282 -287282 -131505 -205112
4586 -205112 -63744 286703 371883 118479 -168941 44970 307997 -151316 -114182 55313 106510
4575 106510 128089 -25377 121281 -28637 -352534 -50850 -76815 90090 -238281 -95573 126060
4563 -209706 -156904 -111246 230173 241014 53743 -17384 -80512 -240295 -22330 90441 184060
4552 184060 145089 -169710 52076 82836 164505 9352 -168799 194225 2762 -218274 -92210
4540 -52009 115852 -248800 -16513 -149461 -53895 -231746 38979 227623 157391 108121 -52481
4528 -207242 -276532 142970 341772 88267 -115400 -71545 202837 -104848 -152387 109779
4517 74560 189144 42575 -27710 -155084 -8968 112633 -207278 -11725 -84095 123994 -407999
4505 -2749 -117121 60367 -115451 193345 235359 26500 -15567 287986 87485 -22793 321044
4493 -158169 97821 -46578 453993 80325 197898 275449 23509 122915 174981 -184367 -100627
$$ [...]
##END NTUPLES=NMR SPECTRUM
##END=
