
##TITLE=AC1290_VIERS11100_6528458_WgZoH42hia
##JCAMPDX= 6.0         $$ Bruker NMR JCAMP-DX V2.0
##DATA TYPE= NMR SPECTRUM
##DATA CLASS= NTUPLES
##ORIGIN= BRUKER
##OWNER= Administrator
$$ 1.72 TOPSPIN		Version 2.1
$$ 2012-12-04 20:23:23.559 -0500  Administrator@X
$$ Compression mode = diff/dup
##.OBSERVE FREQUENCY= 400.02188249412
##.OBSERVE NUCLEUS= ^1H
##.ACQUISITION MODE= SIMULTANEOUS (DQD)
##.ACQUISITION SCHEME= undefined
##.AVERAGES= 8
##.DIGITISER RES= 22
##SPECTROMETER/DATA SYSTEM= spect
##.PULSE SEQUENCE= zg30
##.SOLVENT NAME= COFFEE_meoh
##.SHIFT REFERENCE= INTERNAL, COFFEE_meoh, 1, 14.98509
##AUDIT TRAIL= $$ (NUMBER, WHEN, WHO, WHERE, PROCESS, VERSION, WHAT)
$$ ##TITLE= Audit trail, TOPSPIN		Version 2.1
$$ ##JCAMPDX= 5.01
$$ ##ORIGIN= Bruker BioSpin GmbH
$$ ##OWNER= Administrator
$$ $$ E:\/data/COFFEE/nmr/AC1290_VIERS11100_6528458_WgZoH42hia/20/pdata/1/auditp.txt
$$ ##AUDIT TRAIL=  $$ (NUMBER, WHEN, WHO, WHERE, PROCESS, VERSION, WHAT)
(   1,<2012-12-04 20:23:15.356 -0500>,<Administrator>,<X>,<go>,<TOPSPIN 2.1>,
      <created by zg
	started at 2012-12-04 20:22:09.418 -0500,
	POWCHK enabled, PULCHK disabled,
       configuration hash MD5:
       86 BA 57 50 F2 9D 5C 9B 26 00 A9 28 5F 66 2E 89
       data hash MD5: 64K
       DE C7 AB A8 96 B0 26 5D 21 2D AC 7B F5 58 52 AB>)
(   2,<2012-12-04 20:23:18.481 -0500>,<Administrator>,<X>,<proc1d>,<TOPSPIN 2.1>,
      <Start of raw data processing
       efp LB = 0 FT_mod = 6 PKNL = 1 PHC0 = 0 PHC1 = 0 SI = 32K 
       data hash MD5: 32K
       D2 9F EA CF 8B DD 9A 0C B7 B9 07 8C 6B 17 7C 4A>)
(   3,<2012-12-04 20:23:18.950 -0500>,<Administrator>,<X>,<proc1d>,<TOPSPIN 2.1>,
      <pk PHC0 = 100.4755 PHC1 = 0 
       data hash MD5: 32K
       9D 4F 82 E6 D8 D8 BE 67 81 AA BC 45 9A BB 84 D4>)
(   4,<2012-12-04 20:23:19.168 -0500>,<Administrator>,<X>,<proc1d>,<TOPSPIN 2.1>,
      <abs ABSG = 1 
       data hash MD5: 32K
       D4 41 08 A7 F4 62 43 8A 03 B1 73 A5 0E 14 EE CB>)
(   5,<2012-12-04 20:23:19.325 -0500>,<Administrator>,<X>,<proc1d>,<TOPSPIN 2.1>,
      <abs ABSG = 2 
       data hash MD5: 32K
       92 E2 1D A0 79 9A 1A 8D F3 DA 77 01 F6 47 19 76>)
(   6,<2012-12-04 20:23:19.465 -0500>,<Administrator>,<X>,<proc1d>,<TOPSPIN 2.1>,
      <abs ABSG = 3 
       data hash MD5: 32K
       DF 48 DE 71 DB 8B 7A 51 4B 2B 8D 4E 9C FA 79 43>)
(   7,<2012-12-04 20:23:19.606 -0500>,<Administrator>,<X>,<proc1d>,<TOPSPIN 2.1>,
      <abs ABSG = 4 
       data hash MD5: 32K
       7E 73 34 5C 2D 6E 4E 82 19 2B E0 1C AC 6A E1 49>)
(   8,<2012-12-04 20:23:19.762 -0500>,<Administrator>,<X>,<proc1d>,<TOPSPIN 2.1>,
      <abs ABSG = 5 
       data hash MD5: 32K
       52 1B 17 46 A7 F8 32 38 56 13 04 4B FC F6 CC 3E>)
$$ ##END=
$$ 
$$ $$ hash MD5
$$ $$ D5 92 69 7E A6 2E D7 24 88 89 2C 05 45 46 B9 B5
##$RELAX= 
##$RELAX= 
##$RELAX= 
##$RELAX= 
##$RELAX= 
##$RELAX= 
##$RELAX= 
$$ Bruker specific parameters
$$ --------------------------
##$DU= <E:\>
##$EXPNO= 20
##$NAME= <AC1290_VIERS11100_6528458_WgZoH42hia>
$$ [...]
##$TP= (0..7)
150 150 150 150 150 150 150 150
##$TP07= 0
##$TPNAME0= <>
##$TPNAME1= <>
##$TPNAME2= <>
##$TPNAME3= <>
##$TPNAME4= <>
##$TPNAME5= <>
##$TPNAME6= <>
##$TPNAME7= <>
##$TPOAL= (0..7)
0.5 0.5 0.5 0.5 0.5 0.5 0.5 0.5
##$TPOFFS= (0..7)
0 0 0 0 0 0 0 0
##$TUNHIN= 0
##$TUNHOUT= 0
##$TUNXOUT= 0
##$USERA1= <user>
##$USERA2= <user>
##$USERA3= <user>
##$USERA4= <user>
##$USERA5= <user>
##$V9= 5
##$VALIST= <valist>
##$VCLIST= <CCCCCCCCCCCCCCC>
##$VD= 0
##$VDLIST= <DDDDDDDDDDDDDDD>
##$VPLIST= <PPPPPPPPPPPPPPP>
##$VTLIST= <TTTTTTTTTTTTTTT>
##$WBST= 2048
##$WBSW= 25
##$XGAIN= (0..3)
0 0 0 0
##$XL= 0
##$YL= 0
##$YMAX_a= 635903
##$YMIN_a= -542949
##$ZGOPTNS= <>
##$ZL1= 120
##$ZL2= 120
##$ZL3= 120
##$ZL4= 120
##$ABSF1= 14.98509
##$ABSF2= -5.573092
##$ABSG= 5
##$ABSL= 3
##$ALPHA= 0
##$AQORDER= 0
##$ASSFAC= 0
##$ASSFACI= 0
##$ASSFACX= 0
##$ASSWID= 0
##$AUNMP= <proc_prof1d_extract_pilot.lims>
##$AXLEFT= 0
##$AXNAME= <>
##$AXNUC= <1H>
##$AXRIGHT= 0
##$AXTYPE= 0
##$AXUNIT= <>
##$AZFE= 0.1
##$AZFW= 0.1
##$BCFW= 0
##$BC_mod= 0
##$BYTORDP= 0
##$COROFFS= 0
##$CY= 15
##$DATMOD= 1
##$DC= 0
##$DFILT= <>
##$DTYPP= 0
##$F1P= 0
##$F2P= 0
##$FCOR= 0.5
##$FTSIZE= 32768
##$FT_mod= 6
##$GAMMA= 0
##$GB= 0
##$INTBC= 1
##$INTSCL= 1
##$ISEN= 128
##$LB= 0
##$LEV0= 0
##$LPBIN= 0
##$MAXI= 10000
##$MC2= 0
##$MEAN= 0
##$ME_mod= 0
##$MI= 0
##$NCOEF= 0
##$NC_proc= -8
##$NLEV= 6
##$NOISF1= 0
##$NOISF2= 0
##$NSP= 0
##$NTH_PI= 0
##$NZP= 0
##$OFFSET= 14.98509
##$PC= 1
##$PHC0= 100.4755
##$PHC1= 0
##$PH_mod= 1
##$PKNL= yes
##$PPARMOD= 0
##$PPDIAG= 0
##$PPIPTYP= 0
##$PPMPNUM= 2147483647
##$PPRESOL= 1
##$PSCAL= 4
##$PSIGN= 0
##$PYNMP= <proc.py>
##$REVERSE= no
##$SF= 400.02
##$SI= 32768
##$SIGF1= 0
##$SIGF2= 0
##$SINO= 400
##$SIOLD= 32768
##$SPECTYP= <>
##$SREGLST= <1H.CDCl3>
##$SSB= 0
##$STSI= 32768
##$STSR= 0
##$SW_p= 8223.68421052631
##$SYMM= 0
##$S_DEV= 0
##$TDeff= 65536
##$TDoff= 0
##$TI= <>
##$TILT= no
##$TM1= 0
##$TM2= 0
##$TOPLEV= 0
##$USERP1= <user>
##$USERP2= <user>
##$USERP3= <user>
##$USERP4= <user>
##$USERP5= <user>
##$WDW= 1
##$XDIM= 32768
##$YMAX_p= 441977349
##$YMIN_p= -701472
##$CURPLOT= <Network HP LaserJet P1505>
##$CURPRIN= <$Network HP LaserJet P1505>
##$DFORMAT= <normdp>
##$LAYOUT= <+/1D_H.xwp>
##$LFORMAT= <normlp>
##$PFORMAT= <normpl>
##$SURQMSG= 1
$$ End of Bruker specific parameters
$$ ---------------------------------
##NTUPLES= NMR SPECTRUM
##VAR_NAME=  FREQUENCY,     SPECTRUM/REAL,   SPECTRUM/IMAG
##SYMBOL=    X,             R,               I
##VAR_TYPE=  INDEPENDENT,   DEPENDENT,       DEPENDENT
##VAR_FORM=  AFFN,          ASDF,            ASDF
##VAR_DIM=   32768,         32768,           32768
##UNITS=     HZ,            ARBITRARY UNITS, ARBITRARY UNITS
##FACTOR=    0.250966925370066, 1,           1
##FIRST=     8223.43324360094, -60485,       54849
##LAST=      0,             -199918,         109136
##MIN=       0,             -701472,         0
##MAX=       8223.43324360094, 441977349,    0
$$ Real data points
##PAGE= N=1
##DATA TABLE= (X++(R..R)), XYDATA
$$ [...]
$$ plain form
19540 56075 -346072 125689 -202202 -168215 335458 -130292 -50983 22643 -158747 -275679
19530 -275679 -122747 -78489 -258715 -176676 126548 -218925 29559 -344856 -271753 -213197
19520 -213197 -51314 34202 77594 77264 -85879 -64850 75250 209410 59991 -58292 -89044 -106404
19508 -106404 -31756 608 118241 52667 16221 -11189 -65088 -213820 -1656 122838 79035
19497 79035 59409 93750 270346 156020 -49979 -20097 107417 171421 -212785 -77134 -108438
19486 -108438 87373 -76 20911 42989 -5811 101741 242445 -113358 -215101 138412 -40879
19474 181678 -369501 50326 -364650 -49398 113034 229572 -4807 91543 135907 -220698 72590
19462 -37687 168676 30258 9066 296801 -183793 -110682 -46440 -130786 -53686 -257924 -53190
$$ packed form
19540E6075c46072A25689b02202L3987C35458a30292e0983B2643a58747j16932
19530b75679a22747M4258j80226Q2039A26548b18925B9559c44856P3103N8556
19520b13197e1314C4202M3392l30h5879K1029G5250J34160E9991e8292l0752j7360
19508a06404c1756F08J17633E2667A6221a1189n3899j48732a656A22838m3803
19497G9035j9626L4341J76596j14326d9979b0097A07417O4004b12785g7134l1304
19486a08438H7373g6B0911K2078e811A01741J40704a13358j01743A38412d0879
19474A81678c69501E0326c64650d9398A13034J16538d807I1543M4364b20698G2590
19462c7687A68676C0258I066K87735a83793P3111d6440q4346e3686k04238e3190
$$ plain form
19450 73082 134907 11729 -240493 -117932 171375 -304059 -104496 -171801 -50655 -201804
19440 -201804 -9854 -226066 -169106 -531098 -137440 -116301 -21223 -26776 73896 252029 260474
19429 260474 -58019 -134466 35758 -74175 -300150 47514 -32847 -100110 48586 30304 -232549
19417 -185139 50000 100621 -101375 69663 143834 -193145 88893 -72233 14275 -99794 -169080
19406 -169080 -71819 29226 -237033 -72593 -113674 30250 -20156 178082 106690 -117336 -199523
19395 -199523 147637 -36580 -237781 89362 -66301 -59350 4129 18197 -145191 -35056 -124551
19384 -124551 224510 -44630 -238492 -265199 177512 -176317 17351 142148 159264 -370744
19373 -123019 110738 -75141 -226846 -78928 33866 184807 -38297 -100822 67286 -304642 69005
$$ packed form
19450G3082O1825A1729b40493a17932A71375c04059a04496o7305e0655j51149
19440b01804i854k16212N6960l61992a37440K1139b1223n553G3896J78133Q445
19429B60474e8019p6447C5758g4175k25975D7514c2847o7263D8586j8282b32549
19417a85139E0000N0621a01375F9663P4171a93145H8893g2233A4275i9794o9286
19406a69080g1819B9226b37033g2593m1081C0250b0156A78082p1392a17336q2187
19395a99523A47637c6580k01201H9362f6301O951D129J4068a45191c5056q9495
19384a24551B24510d4630j93862k6707A77512a76317A7351J24797J7116c70744
19373a23019A10738g5141j51705g8928C3866J50941c8297o2525F7286c04642F9005
$$ plain form
19361 61246 -65648 -193782 202740 -54424 -359460 -105033 -131019 -124530 -261529 -217115 472770
19349 -94260 -64509 120533 -64018 -42584 182611 -272807 117326 -176091 395546 -79725
19338 -130125 -157380 -420409 -303433 121428 -111854 -215438 -537464 -230472 46351 -73511
19327 233678 38077 -245856 147957 -204082 -19464 55222 -228196 177564 -494389 3517
19316 -214934 -171739 -214202 76189 -320834 -649692 -345062 -149465 -274687 -11814 111499
19305 -131496 -508925 51792 -67098 -60196 -42191 27033 -85808 -258155 -322239 30381 -344053
19293 -410605 7531 -124086 188527 -118065 -72215 -126604 -98014 -204833 -171271 -506776 63214
19281 32880 -229025 -92279 100870 105690 -5997 -127557 -41290 150228 -163382 -214322 -186622
$$ packed form
19361F1246f5648j28134B02740e4424l05036a05033k5986O489j36999M4414D72770
19349i4260K9751A20533f4018K1434A82611b72807A17326a76091C95546g9725
19338a30125k7255k63029J16976A21428a11854j03584l22026b30472D6351g3511
19327B33678C8077b45856A47957b04082a9464E5222b28196A77564d94389C517
19316b14934M3195m2463G6189c20834l28858L04630a49465j25222a1814A11499
19305a31496l77429E1792f7098O902J8005B7033h5808j72347o4084C0381c44053
19293d10605G531a24086A88527a18065M5850n4389K8590j06819L3562l35505F3214
19281C2880b29025i2279A00870M820e997j21560d1290A50228a63382n0940K7700
$$ plain form
19270 -186622 -174520 -34378 -57397 -446897 -157443 -50226 -134899 -29999 149705 190845 -297277
19258 -337470 -126890 397568 148018 -14389 -60659 241303 -169958 -196288 -247327 -300425
19248 -300425 -54878 -240328 -333654 -51229 -199989 -105846 -305165 22861 -122212 -322936
19238 -322936 -82397 90533 -129632 -291578 -108744 45236 -177732 -68811 3562 275091 94279
19226 -171643 -80960 78460 -165078 -222092 63546 -40608 -267350 -333150 -64980 15430 -172238
19214 81045 -182503 -31313 -146082 -250676 -146487 80647 -76552 -28584 -39944 103596 281454
19203 281454 -174069 -329839 -211067 -238051 -192186 -217980 217320 -165509 -84265 140841
19192 68211 -129781 -90843 24466 14700 -238824 -137606 79106 -147434 104117 272557 -200454
$$ packed form
19270a86622J2102c4378k3019l89500a57443e0226q4673b9999A49705M1140b97277
19258c37470a26890C97568A48018a4389m6270B41303a69958k6330n1039n3098
19248c00425e4878j85450r3326e1229j48760R4143j99319B2861a22212k00724
19238c22936h2397I0533a29632j61946a08744D5236a77732f8811C562K71529I4279
19226a71643h0960G8460a65078n7014F3546d0608k26742o5800f4980A5430a72238
19214H1045a82503c1313j14769j04594J04189H0647g6552b8584j1360A03596J77858
19203B81454a74069j55770J18772k6984M5865k5794B17320a65509Q1244A40841
19192F8211a29781L8938B4466r766b38824J01218G9106a47434A04117J68440b00454
$$ plain form
19180 163853 17028 -2039 46927 -34942 16024 167612 3464 -48483 -115805 -187409 -225944 44333
19167 -40053 -124072 -278722 -489551 -164424 -21206 54674 -56833 -123524 -2215 -14072 222472
19155 -101778 -92629 -52734 -43199 67777 80987 -208275 -430197 -2164 57671 -404910 35952
19143 58640 -211344 -298556 172777 69836 -200189 354868 -462218 179101 90202 265862
19133 265862 -116753 56570 -128623 -473581 168672 -15549 -60937 -173381 -22793 -385520
19123 -385520 -241583 12358 -119256 -294636 -110171 -167426 -276129 297904 180880 -106052
19112 -292938 104137 -77917 -166332 -43178 -14267 -111980 -189457 -74046 44304 -142185 -208186
19101 -208186 176685 173416 103644 -4536 -148545 24503 -27054 -294896 136591 -138351 -144006
$$ packed form
19180A63853A7028b039D6927c4942A6024J51588C464d8483o7322p1604l8535D4333
19167d0053q4019j54650k10829a64424b1206E4674e6833o6691b215j1857B22472
19155a01778R149L9895R535F7777J3210b08275k21922b164E7671d04910C5952
19143E8640b11344q7212A72777F9836b00189C54868d62218A79101q8899J75660
19133B65862a16753E6570a28623l44958A68672a5549m5388j12444b2793l62727
19123c85520J43937A2358a19256j75380a10171n7255j08703B97904j17024a06052
19112b92938A04137g7917q8415d3178a4267r7713p7477g4046D4304a42185o6001
19101b08186A76685l269o9772d536j44009B4503b7054k67842A36591a38351n655
$$ plain form
19090 -144006 89229 115557 107496 -253413 -355545 85356 20859 -227703 49774 -153749 -102171
19079 -102171 -328533 -62835 99545 -4216 -32884 -43552 -32853 343762 118518 35991 -23342
19067 -96158 45081 -198799 45330 -178787 -38968 -18247 -207994 -469660 67910 -58257 233411
19055 54634 -20367 144041 90266 -151747 -149275 40492 33349 289595 -236667 79538 -215125
19043 23020 -13288 -57986 108179 77378 -26002 -360945 71392 -183205 4618 -210627 -284632
19032 -284632 42165 -107766 -118814 -202656 -158930 -47206 -30496 20873 88294 60344 1503
19020 170911 -152317 -165225 59628 -112453 -43154 326621 -134793 74129 -373845 -258152
19010 -258152 213097 90212 -45090 -340285 27628 196602 110022 202294 26869 30766 76845
$$ packed form
19090a44006H9229K6328q061b53413j02132H5356B0859b27703D9774a53749N1578
19079a02171k26362f2835I9545d216k8668j0668J0699C43762A18518C5991b3342
19067i6158D5081a98799D5330a78787c8968a8247j89747k61666F7910e8257B33411
19055E4634b0367A44041n3775a51747K472D0492p143K56246b36667G9538b15125
19043B3020a3288m4698A08179l0801b6002l34943G1392a83205D618b10627p4005
19032b84632D2165a07766j1048q3842M3726d7206J6710B0873O7421k7950A503
19020A70911a52317j2908E9628a12453d3154C26621a34793G4129c73845J15693
19010b58152B13097I0212d5090k95195B7628J68974q6580R2272B6869L897M6079
$$ plain form
18999 76845 372491 -279813 -12662 139517 168800 -290071 25244 -2730 18723 214745 233125
18988 233125 249005 -146816 58156 -146223 -115617 -26989 -327163 17120 -78110 -49132 158293
18976 115498 91417 -38555 -455704 -329817 -64652 -345711 -171012 66162 -378335 135722
18965 -238584 18286 -146153 -158420 -63720 96409 -376521 65742 65628 -27691 132951 -124805
18953 -23545 -444718 -53235 150313 -15084 -222545 -162572 6502 289597 65193 -36672 23299
18941 -171006 280856 -265896 29720 220422 178128 102894 -244387 -199760 28687 -160619
18930 438030 69307 -106325 196849 102837 -236134 -94031 -90500 368468 173805 -153206
18919 49572 52904 -205160 111687 -49836 156001 -296897 -71273 -207352 157239 -14693 -38688
$$ packed form
18999G6845K95646b79813a2662A39517K9283b90071B5244b730A8723J96022J8380
18988B33125J5880a46816E8156a46223L0606b6989l00174A7120g8110K8978A58293
18976A15498k4081c8555m17149J25887f4652k81059a71012F6162c78335A35722
18965b38584A8286a46153j2267f3720I6409c76521F5742j14b7691A32951a24805
18953b3545m21173e3235A50313a5084k07461N9973F502K83095F5193c6672B3299
18941a71006B80856b65896B9720J90702m2294p5234b44387M4627B8687a60619
18930D38030F9307a06325A96849r4012b36134i4031L531C68468A73805a53206
18919D9572L332b05160A11687d9836A56001b96897g1273j36079A57239a4693k3995
$$ plain form
18908 -38688 -35320 -71709 -100769 31004 37952 258820 -359491 -42606 -88006 -124379 85232 96189
18896 96189 -185927 -96276 -146251 -43116 -269497 113609 -74447 -180109 73762 281223 21494
18884 -199634 15809 -98182 63257 -12825 168028 -32069 115963 -62175 -139517 -137846 -54072
18872 49545 -213816 -194463 -227143 -173933 -167307 -34159 -241700 30529 42825 -202906 54682
18860 265850 246198 -35631 -300042 367517 -334240 -336816 168144 -224914 -261470 -3327 132364
18848 8945 35774 -209758 -200334 87173 -180713 -93433 -378323 -32875 14513 -12973 170174
18836 206504 -10615 -50327 17250 -278583 -167542 -38528 102204 -172057 -42554 -178029
18826 -178029 -158171 -50174 124409 -332730 -65272 -110781 -294590 -156410 13931 211564
$$ packed form
18908c8688L368l6389k9060C1004O948K20868c59491d2606m5400l6373H5232J0957
18896I6189a85927Q9651m9975d3116k26381A13609g4447j05662G3762K07461B1494
18884a99634A5809i8182F3257a2825A68028c2069A15963f2175p7342J671e4072
18872D9545b13816J9353l2680N3210O626c4159k07541C0529J2296b02906E4682
18860B65850j9652c5631k64411C67517c34240k576A68144b24914l6556c327A32364
18848H945K6829b09758R424H7173a80713Q7280k84890c2875A4513a2973A70174
18836B06504a0615l9712A7250b78583J11041c8528A02204a72057d2554j35475
18826a78029J9858e0174A24409c32730f5272m5509j83809J38180A3931J97633
$$ plain form
18816 211564 243880 217158 -4180 -106330 56207 194895 94304 -134155 48234 -213832 156440
18804 225889 192210 38873 142092 -220277 -260026 136851 -212159 -135855 -21531 115083
18793 3414 -95046 -83652 124712 294373 -5917 -212367 23623 -349326 43313 -242101 -214609
18782 -214609 -181887 -36013 -144987 -142817 -115392 134129 30532 120111 -92192 -262271 6120
18770 -20815 -24751 9421 -75390 -111037 143872 -205404 -131040 -63533 -362809 210808 -239330
18758 -103611 296492 -357599 11187 -62180 -242018 -373995 121049 -127426 -199722 -140184
18748 -140184 -325911 -27850 -180039 -180607 -148988 290569 -159355 -69152 -261298 -72300 -111537
18737 -111537 45608 -329641 -268511 -343071 -134813 -179287 -313652 -224143 198547 -243883
$$ packed form
18816B11564L2316k6722d180j02150E6207J38688I4304a34155D8234b13832A56440
18804B25889l3679C8873J03219b20277l9749A36851b12159P6304b1531A15083
18793C414i5046J1394A24712J69661e917k06450B3623c49326D3313b42101K7492
18782b14609L2722c6013j08974K170K7425A34129C0532Q9579i2192j70079F120
18770b0815l936I421g5390l5647A43872b05404P4364f3533k99276B10808b39330
18758a03611B96492c57599A1187f2180j79838j31977A21049a27426p2296N9538
18748a40184j85727b7850j52189n68L1619B90569a59355f9152j92146g2300l9237
18737a11537D5608c29641O1130p4560a34813m4474j34365Q9509A98547b43883
$$ plain form
18726 -192162 -15634 -367570 83079 -75262 -18688 -169182 45276 12376 -236429 -137072 445198
18714 67799 -407334 -216910 11757 -83503 88738 187132 -230383 -236180 -497084 85498 47279
18703 47279 -43868 51291 520690 122280 -94888 -16704 -234481 -114433 -349059 -9960 79005
18691 219090 31444 41453 -72972 -43306 319236 47248 137082 223470 -285790 -74083 -429
18679 -61934 327686 -158144 5305 -148029 -67213 -111593 -57786 -493514 -209873 -46 155467
18667 6938 -319303 -215533 11112 -186241 324427 -1446 5588 392350 -260095 258134 289368
18656 289368 -153015 -47932 28805 -116957 -15623 263833 4199 177707 -447946 409113
18645 -312153 276843 -158729 -180398 -271355 83313 -236851 -36834 341211 -231197 -211826
$$ packed form
18726a92162a5634l51936H3079g5262a8688j50494D5276A2376b36429R9357D45198
18714F7799d07334J90424A1757h3503H8738R8394b30383n797k60904H5498l8219
18703D7279d3868E1291M69399A22280i4888a6704k17777a14433k34626i960G9005
18691B19090C1444J0009g2972K9666C19236D7248Q9834Q6388b85790g4083d29
18679f1934C27686a58144E305a48029f7213m4380N3807m35728b09873d6A55467
18667F938c19303J03770A1112a86241C24427a446E588L86762b60095B58134L1234
18656B89368a53015d7932B8805a16957a5623B63833D199J73508d47946D09113
18645c12153B76843a58729k1669r0957H3313b36851c6834C41211b31197J9371
$$ plain form
18635 -211826 -309579 -403096 -107509 -15559 -145570 49539 -240603 151469 419197 -202308
18624 -21494 -183394 -56696 -316271 -78634 180668 -138543 9462 -43576 -267715 -159797 -262471
18613 -262471 -133066 106817 -4567 42293 265064 49027 -172930 59981 245187 -212419
18602 107629 218398 -45743 -55832 3431 -32030 -213551 -68374 -5832 92227 -179878 -67452
18590 143693 202941 7927 -137420 9084 -40083 -147025 271364 -17390 7975 -277784 408012
18578 -72429 -36685 -54919 119771 -610984 -285980 -124337 286803 20946 -66137 -314927
18568 -314927 -234134 61527 -30777 139900 -257263 -186634 -200994 -30595 -149869 207522 22340
18556 -262991 -59557 191972 -116543 -176301 207545 -80876 -63598 119717 -31358 -109512 -161330
$$ packed form
18635b11826r7753r3517a07509a5559j30011D9539b40603A51469K67728b02308
18624b1494j61900e6696k59575g8634A80668a38543I462d3576k24139J07918j02674
18613b62471J29405A06817d567D2293K22771D9027a72930E9981J85206b12419
18602A07629J10769d5743j0089C431c2030j81521f8374e832I2227a79878f7452
18590A43693N9248G927a37420I084d0083j06942B71364a7390G975b77784D08012
18578g2429L5744j8234A19771f10984b85980a24337B86803B0946f6137k48790
18568c14927Q0793F1527c0777A39900b57263P0629j4360c0595j19274B07522B2340
18556b62991e9557A91972a16543n9758B07545h0876J7278A19717c1358p8154n1818
$$ plain form
18545 -161330 34503 -91760 -32416 130474 114306 177586 195014 201617 -78225 313616 -10509
18533 -4606 130923 115801 118557 -18154 -89438 -285084 144811 -19676 13814 7431 121697
18522 121697 -141496 150381 9271 -69904 -57175 -204294 -202353 -378787 -126216 -586545 -115939
18510 -30616 -58019 -171964 -29590 -107163 -272902 163204 50770 161201 -275928 73144 -89640
18498 25869 119422 -33799 -86930 -191005 81553 -224949 -345302 -36187 -113617 -8154 -242328
18487 -242328 -293864 -242299 -38074 -272487 200207 -105474 -114125 -26845 61575 172793 -111557
18475 -239051 193360 273266 -329748 -224048 -10180 134720 -213586 26800 -287308 -134906
18464 -64082 -213528 -148821 26821 -224916 85747 16050 -165414 20887 -125964 -28595 -255186
$$ packed form
18545a61330C4503i1760c2416A30474j6168O3280J7428O603g8225C13616a0509
18533d606A30923j5122K756a8154p1284j95646A44811a9676A3814o383J14266
18522A21697a41496A50381I271f9904J2729j47119J941j76434a26216m60329a15939
18510c0616k7403j13945b9590p7573j65739A63204E0770J10431b75928G3144h9640
18498B5869R3553c3799n3131j04075H1553b24949j20353c6187p7430h154k34174
18487b42328n1536N1565c8074k34413B00207a05474q651b6845F1575J11218a11557
18475b39051A93360P9906c29748J05700a0180A34720b13586B6800b87308a34906
18464f4082j49446O4707B6821b24916H5747A6050a65414B0887a25964b8595k26591
$$ plain form
18453 -255186 -24136 43286 285863 55207 -193029 -265318 -163575 6745 72572 117820 -30391
18441 200378 136498 -82241 -230714 41199 44010 -64433 36839 -106041 -3640 13217 -102838
18429 -85825 196227 -289852 -71157 127242 -208163 -16780 -371993 80680 -128850 21097
18418 363971 125409 45843 -246427 182781 -95909 -93063 125284 -64112 -53071 -197021 -129344
18407 -129344 171717 -149202 -225450 -46392 -78219 -86508 142163 -64877 -241771 -282029 -144631
18396 -144631 -55399 120389 -164031 -42111 309101 21498 211068 -281030 248554 -184088
18385 290349 -165511 -68684 24147 -199197 -299978 -224937 -103492 379959 -191615 -289626
18375 -289626 -43223 -349650 -67069 63292 -112784 15715 64558 43990 -73886 151198 -66763
$$ packed form
18453b55186b4136D3286K42577E5207a93029p2289J01743F745O5827M5248c0391
18441B00378o3880h2241j48473D1199K811f4433C6839a06041c640A3217a02838
18429h5825A96227b89852g1157A27242b08163a6780l55213H0680a28850B1097
18418C63971A25409D5843b46427A82781i5909K846A25284f4112J1041j43950O7677
18407a29344A71717a49202p6248d6392l1827q289A42163f4877j76894m0258J37398
18396a44631e5399A20389a64031d2111C09101B1498J89570b81030B48554a84088
18385B90349a65511f8684B4147a99197j00781P5041a03492C79959a91615r8011
18375b89626d3223l06427f7069F3292a12784A5715M8843k0568g3886A51198f6763
$$ plain form
18363 249963 110694 184896 -404050 -146850 -84070 96554 -75526 276480 -325571 187683
18352 59829 -167520 -70282 353492 198376 301825 -63819 -76062 -149067 -57818 193322 -295190
18340 74373 -92580 -50840 -265255 -216346 -25279 -139607 -61713 338 -2419 -200914 -50531 -500363
18328 -500363 -339842 -138153 -77975 2446 -236685 -151000 -131591 -224001 -154786 27008 194067
18317 194067 157583 -429928 -162427 -80335 139680 91758 -179977 -364970 -55101 202684
18306 48417 -53216 7998 177116 -44658 74384 -330465 -157312 30220 -167555 86279 -10821
18294 -186189 49220 9364 238792 53935 -99833 2129 52119 -218727 88092 -183788 78607
18282 -389062 -280472 96474 -157771 -317411 47127 -214316 147072 144890 -200950 -435086
$$ packed form
18363B49963A10694P4202d04050a46850O2780I6554g5526B76480c25571A87683
18352E9829a67520g0282C53492j55116J03449f3819j2243p3005e7818A93322b95190
18340G4373i2580M1740k14415M8909b5279j14328f1713C38b419j98495e0531m49832
18328e00363J60521a38153O0178B446b36685Q5685J9409r2410O9215B7008J67059
18317A94067l6484d29928a62427h0335A39680m7922a79977j84993e5101B02684
18306D8417e3216G998J69118d4658G4384c30465a57312C0220a67555H6279a0821
18294a86189D9220I364K29428E3935i9833B129M9990b18727H8092a83788G8607
18282c89062J08590I6474a57771j59640D7127b14316A47072k182b00950k34136
$$ plain form
18272 -435086 -43544 -306082 188677 -75957 84302 -145105 99057 -179732 -25869 188154
18261 17633 69683 110877 -231806 272339 -16229 137778 -2280 209520 -66765 161672 207984
18250 207984 -250419 -264395 -188283 -47215 -84575 260772 -85151 147748 -208004 -216732 60610
18238 -54947 -175128 321130 221136 -91989 73907 -95332 -7989 -393759 162697 -28351 54764
18226 -215069 265435 167892 -76137 -9794 277182 4103 194997 -88518 -126920 29796 -147919
18214 299817 -119825 57527 204262 52811 -108988 -325027 11611 -61317 97241 -95511 140594
18202 -20136 120987 19514 256184 92327 -125468 85688 27759 40225 -46687 115250 98985
18191 98985 226528 28070 74861 -219344 140857 267776 118013 -115778 -29851 -257079
$$ packed form
18272d35086d3544k62538A88677g5957H4302a45105I9057a79732b5869A88154
18261A7633N2050M1194b31806B72339a6229A37778b280B09520f6765A61672M6312
18250B07984b50419j3976P6112d7215l7360B60772h5151A47748b08004q728F0610
18238e4947j20181C21130r9994i1989G3907i5332g989l85770A62697b8351E4764
18226b15069B65435r7543g6137i794B77182D103J90894h8518l8402B9796a47919
18214B99817a19825E7527J46735E2811a08988k16039A1611f1317I7241i5511A40594
18202b0136A20987A9514K36670I2327a25468H5688B7759J2466d6687A15250j6265
18191I8985J27543B8070M6791b19344A40857J26919A18013a15778b9851k27228
$$ plain form
18181 -257079 -149748 -123159 -41575 55324 -178306 81587 -143150 -243334 -104925 102173
18170 -5862 -8415 -255974 -13626 -219065 -133168 -25926 118084 28105 206114 158294 -175339
18158 -161902 181846 -145528 4339 -312296 269010 -29710 -155512 -82258 60309 -27496 16904
18146 -259830 -105515 -246657 49613 -12647 -216576 -796 -172341 43511 -93997 69941 13994
18134 626 -209505 -205413 50802 -93459 -376373 -244801 102322 146984 -89006 -229165 24200
18122 37576 -35204 -195644 -279359 28823 147435 144003 -30069 -61057 -105271 190009 110978
18111 110978 -178947 -168594 -52799 -258374 78413 -257931 26746 -99041 17359 225912 40769
18099 249697 -187138 -113954 -5005 322339 16033 -143791 -37630 -30118 -206077 -18955 -263256
$$ packed form
18181b57079J07331K6589d1575E5324a78306H1587a43150j00184a04925A02173
18170e862k553k47559a3626k05439Q5897b5926A18084B8105J78009m7820a75339
18158a61902A81846a45528D339c12296B69010b9710j25802P3254F0309b7496A6904
18146b59830a05515j41142D9613a2647k03929g96j71545D3511i3997F9941A3994
18134F26b09505M092E0802i3459k82914J31572A02322M4662h9006j40159B4200
18122C7576c5204j60440q3715B8823J18612l432c0069l0988m4214A90009p9031
18111A10978a78947J0353e2799k05575G8413b57931B6746i9041A7359K08553D0769
18099B49697a87138P3184e005C22339A6033a43791c7630P512j75959a8955k44301
$$ plain form
18088 -263256 160195 -105382 -16487 -222390 -204296 49856 -291398 216710 -225605 13250
18077 27154 82914 -296973 60464 -143211 -52499 -59919 -135352 -311460 -42122 226774 156337
18066 156337 52684 91669 138347 -112234 -52598 -12863 -60205 190303 -195521 192855 28002
18054 -144051 -226306 7388 115009 444574 12293 -38728 171881 106726 118179 -280873 -564618
18043 -564618 18256 -227 9767 -322602 69252 -117415 -149901 271923 -93049 -79947 158304
18031 -103786 -326863 235086 -216005 -7948 -157597 -142004 73245 44822 12809 -131154 140743
18019 277982 -45648 163543 -49063 -430465 174601 -139495 156345 123481 151077 -32193
18008 54580 -225586 -170384 225387 120148 30651 101629 36368 -36222 -255636 4834 -4447
$$ packed form
18088b63256A60195a05382a6487k05903J8094D9856b91398B16710b25605A3250
18077B7154N5760b96973F0464a43211e2499p420p5433j76108d2122B26774p0437
18066A56337E2684L8985M6678a12234e2598a2863m7342A90303a95521A92855B8002
18054a44051q2255G388J07621L29565A2293c8728A71881o5155J1453b80873k83745
18043e64618A8256b27I767c22602F9252a17415l2486B71923i3049J3102A58304
18031a03786k23077B35086b16005g948j49649J5593G3245k8423A2809a31154A40743
18019B77982d5648A63543d9063l81402A74601a39495A56345l2864K7596c2193
18008E4580b25586N5202B25387j05239C0651P0978C6368c6222k19414D834d447
$$ plain form
17996 7497 70652 -271553 42066 -428668 105496 -69006 -233538 80033 -55411 -37788 -46294
17985 -46294 -176869 106766 -46281 -233798 -20764 81345 -136229 27467 -223006 -38196 180376
17973 248411 -14467 104437 -121428 -361443 -34560 -44101 -94512 -87438 -111053 33309 114058
17962 114058 -232742 335475 -359979 -149492 23764 27709 8643 -172429 -398454 -2629 247240
17950 84230 410383 -119164 262660 -133866 136929 6089 -250899 127834 -170233 287473
17939 -16755 -309986 -324684 48005 -270689 -18715 90377 -49919 286540 190564 -129257 73871
17927 301669 201373 -40679 89546 211011 134570 -259353 21237 51367 -3460 281425 162420
17916 162420 -246605 81847 -287456 -88073 122862 -147394 79621 111541 -51809 9653 -41497
$$ packed form
17996G497O3155b71553D2066d28668A05496f9006j64532H0033e5411J7623q506
17985d6294j30575A06766d6281j87517b0764H1345a36229B7467b23006c8196A80376
17973B48411a4467A04437a21428k40015c4560r541n0411P074k3615C3309Q0749
17962A14058b32742C35475c59979a49492B3764L945H643a72429k26025b629B47240
17950H4230L26153a19164B62660a33866A36929F089b50899A27834a70233B87473
17939a6755k93231j4698D8005b70689a8715I0377d9919B86540r5976a29257G3871
17927C01669j00296d0679H9546J21465p6441b59353B1237L0130c460B81425j19005
17916A62420b46605H1847b87456h8073A22862a47394G9621L1920e1809I653d1497
$$ plain form
17904 259703 -178670 -326943 -417546 -268374 145764 -154720 33054 75251 285497 27231
17893 -162966 263255 -106550 -259927 57717 -433247 331391 76842 157813 -191976 -1277
17882 -61443 373856 -43080 279809 -72734 -74634 26189 150882 270721 -123479 152088 37754
17870 -489615 121456 -263533 -187444 -159371 -250215 -284317 -164053 -3138 84296 -69658 -120403
17859 -120403 151784 30486 -17863 145964 -10040 -155841 99082 43569 -89572 -10933 4249
17847 -173965 336864 -167073 -221052 172379 41050 -243455 -188031 -315048 88055 -17166
17836 128113 -49829 -145826 -131975 -2537 159235 82426 -168222 -70291 53189 242559 143588
17825 143588 226744 52108 -96386 147412 -21868 -118377 172609 54481 174990 -34227 -301511
$$ packed form
17904B59703a78670j48273r0603J49172A45764a54720C3054M2197K10246B7231
17893a62966B63255a06550j53377E7717d33247C31391G6842Q0971a91976a277
17882f1443C73856d3080B79809g2734j900B6189J24693J19839a23479A52088C7754
17870d89615A21456b63533P6089K8073r0844l4102J20264c138H4296f9658n0745
17859a20403A51784C0486a7863A45964a0040j45801I9082D3569h9572a0933D249
17847a73965C36864a67073n3979A72379D1050b43455N5424j27017H8055a7166
17836A28113d9829r5997J3851b537A59235p6809a68222g0291E3189J89370r8971
17825A43588Q3156E2108i6386A47412b1868r6509A72609E4481J20509c4227k67284
$$ plain form
17814 -301511 -130077 235559 204931 -73906 133912 133728 66793 169341 239194 -121706 267110
17802 103019 -365163 9804 -129128 -86912 150714 182228 214088 31165 170003 200987 -47296
17790 290514 -55036 -272952 -185315 -170492 -114865 -199618 144206 256036 -162494 240773
17779 -148326 126171 -244258 47641 47941 -134911 -277897 -19012 51739 -73008 -226095 -80976
17767 52360 114674 -256699 27221 -145429 -118982 15572 -299256 100198 -118284 320579
17756 216861 -63684 -86974 -386821 134365 97731 239276 16649 64030 -325916 91073 -82568
17744 -43372 -110251 -115146 233360 12291 55606 115263 -179834 149824 78547 -142985 106064
17732 80231 44557 111238 355542 -161671 110873 34706 30991 -131746 -66036 222948 183085
$$ packed form
17814c01511a30077B35559l0628g3906A33912j84F6793J02548O9853a21706B67110
17802A03019c65163I804a29128M2216A50714L1514L1860C1165J38838L0984d7296
17790B90514e5036k17916Q7637J4823N5627q4753A44206J11830a62494B40773
17779a48326A26171b44258D7641L00a34911j42986a9012E1739g3008j53087h0976
17767E2360O2314b56699B7221a45429K6447A5572b99256A00198a18284C20579
17756B16861f3684k3290k99847A34365l6634J41545A6649M7381c25916I1073h2568
17744d3372o6879m895B33360A2291M3315N9657a79834A49824p1277a42985A06064
17732H0231l5674O6681K44304a61671A10873C4706l715a31746O5710B22948l9863
$$ plain form
17721 183085 -436562 38033 -32762 13371 76315 27590 -156045 73677 -53736 -78257 40532
17709 -169661 85426 -234 41746 -83014 67572 -9848 64450 -137547 178708 -80574 -99610 -220016
17697 -220016 14466 296088 -24114 51871 -26940 -195228 164293 65687 41993 200219 507328
17686 507328 -127004 142933 300867 -126036 -10757 154088 244373 165729 291575 188361
17676 188361 -39415 123509 -121701 -47117 338204 26137 106601 -83322 68749 -259579 -268633
17665 -268633 143380 -189902 193862 -57997 -59340 81743 -271726 215296 182716 -346213
17654 135283 33628 14494 -47652 45163 -295024 109503 -30534 17237 179248 248198 -12752
17642 159884 69515 81450 21036 -177687 252493 -118183 124020 -34337 -188734 -237611
$$ packed form
17721A83085d36562C8033c2762A3371O2944B7590a56045G3677e3736k4521D0532
17709a69661H5426b34D1746h3014F7572i848F4450a37547A78708h0574j9036j20406
17697b20016A4466K81622b4114E1871b6940j68288A64293F5687k3694J58226L07109
17686E07328a27004A42933J57934a26036a0757A54088R0285p8644J25846j03214
17676A88361c9415A23509a21701d7117C38204B6137Q0464h3322F8749b59579r054
17665b68633A43380a89902A93862e7997j343H1743b71726B15296l2580c46213
17654A35283C3628A4494d7652D5163b95024A09503c0534A7237J62011O8950a2752
17642A59884F9515J1935B1036a77687B52493a18183A24020c4337j54397m8877
$$ plain form
17632 -237611 -36686 137214 69075 28868 -360787 106038 109791 12890 91409 322723 170369
17621 170369 -171314 16478 -189994 53637 -143894 -5475 215550 119027 82780 -17173 340396
17609 -63228 -179931 -68102 230700 245274 286119 -103694 197722 -32545 84046 -5943 253500
17597 154445 81639 26906 -209771 -209894 -125335 109912 -19685 -118716 32713 86839 -268781
17585 35851 146904 50082 112364 59290 192402 -374999 -25852 -33536 384904 -127592 -139059
17574 -139059 -105317 23016 -115678 -10558 306407 173890 163729 41696 281433 96964 -220721
17562 199543 -251884 -263820 74854 414391 200593 -214659 59469 147619 50502 238538
17552 238538 -39688 455587 98321 149212 -27467 44120 -149848 146744 229331 -40607 202597
$$ packed form
17632b37611c6686A37214o8139B8868c60787A06038L753A2890P8519K31314j52354
17621A70369a71314A6478a89994E3637a43894e475B15550r6523l6247a7173C40396
17609f3228j16703f8102B30700J4574M0845a03694A97722c2545H4046e943B53500
17597A54445p2806B6906b09771j23Q4559A09912a9685r9031C2713N4126b68781
17585C5851J11053E0082O2282n3074J33112c74999b5852p684C84904a27592j1467
17574a39059L3742B3016a15678a0558C06407j32517j0161D1696K39737I6964b20721
17562A99543b51884j1936G4854L39537B00593b14659E9469Q8150E0502J88036
17552B38538c9688D55587I8321N0891b7467D4120a49848A46744Q2587d0607B02597
$$ plain form
17540 -95033 32482 -922 -195716 221742 28821 40587 27552 133213 -14421 15777 -63290
17528 173097 212704 -13964 -250286 64027 43186 158841 192439 54409 -84030 108069 252454
17517 252454 79652 123616 533281 65295 58397 347388 44558 -36247 33614 -100757 -66644
17506 -66644 152244 -20399 -94749 157170 -26717 131895 25277 -197109 -83488 251051 -81371
17494 371053 374740 -103956 142451 24350 -39188 134328 331873 -163187 487672 397738
17484 397738 -238679 220400 425431 43945 608786 210841 -90393 254085 391282 277084
17474 277084 -72597 -93866 32074 15322 8517 437897 14646 234378 333773 -13167 223149
17462 -35829 -66151 -124643 -69833 14751 156894 73034 346518 299291 162433 210241 471585
$$ packed form
17540i5033C2482i22j94794B21742B8821J1766j3035J05661a4421A5777f3290
17528A73097L9607a3964k36322F4027k0841J15655L3598E4409h4030A08069J44385
17517B52454G9652M3964M09665F5295o898K88991D4558c6247C3614a00757L4113
17506f6644A52244b0399p4350A57170b6717A31895B5277a97109h3488B51051h1371
17494C71053L687a03956A42451B4350c9188A34328J97545a63187D87672q9934
17484C97738b38679B20400K05031D3945N64841B10841i0393B54085J37197j14198
17474B77084g2597k1269C2074A5322o805M29380A4646K19732R9395a3167B23149
17462c5829l0322n8492N4810A4751J42143G3034K73484m7227j36858M7808K61344
$$ plain form
17451 471585 103337 140815 288376 386202 139959 120938 349450 230013 30248 -76400
17440 140569 -73703 372769 157644 291419 -186951 243865 208005 429240 381455 67915
17429 349430 50967 147507 298170 178621 199054 183805 333209 79975 433297 -5639 76843
17417 278392 125960 240965 419180 41035 199604 255077 487260 -188356 -59481 -111708
17407 -111708 -46000 53819 404196 425354 89423 300883 142253 234999 -126783 272713
17396 127689 406314 192861 151234 327639 57482 -169843 27777 -68606 -184019 169996
17385 236279 -83384 170981 155701 -110317 14821 189308 334691 302699 260212 349926 411548
17374 411548 155719 164136 117889 196004 198937 44566 269071 159840 -8730 197871 28132
$$ packed form
17451D71585A03337L7478J47561R7826A39959j9021K28512j19437C0248g6400
17440A40569g3703C72769A57644J33775a86951B43865l5860K21235m7785F7915
17429C49430E0967R6540J50663j19549K0433j5249J49404G9975L53322e639G6843
17417B78392A25960J15005J78215D1035J58569N5473K32183a88356e9481n2227
17407a11708d6000E3819L50377K1158H9423K11460A42253R2746a26783B72713
17396A27689K78625A92861m1627J76405E7482a69843B7777f8606j15413A69996
17385B36279h3384A70981j5280a10317A4821J74487J45383l1992m2487Q9714O1622
17374D11548A55719Q417m6247P8115K933D4566K24505j09231h730A97871B8132
$$ plain form
17362 78002 227451 -258375 229896 68304 53151 -14256 4964 130008 158360 -49514 427770
17350 443957 -46 9897 217449 -2225 398661 392386 -249608 390876 230436 221763 290457 505464
17338 505464 370171 -35212 -170518 -129836 314531 23375 138740 380057 63592 90029
17328 90029 299320 90754 16433 206371 113808 281641 151749 90327 -183273 101126
17317 -68059 254744 -15771 203232 -109055 311488 121045 -46681 420058 707266 49218
17306 -1548 247793 51956 198744 325921 312497 256944 331292 282352 -126372 557335 418964
17295 418964 -150578 163410 54099 250724 206017 -46705 78026 157282 90176 -46219 241856
17283 312409 232912 368653 -55612 -116017 -59371 33867 163420 244776 -7366 171458 16006
$$ packed form
17362G8002J49449b58375B29896F8304j5153a4256D964J25044K8352d9514D27770
17350D43957d6I897K07552b225C98661o275b49608C90876j60440q673O8694K15007
17338E05464j35293c5212j35306M0682C14531B3375J15365K41317F3592K6437
17328I0029K09291I0754A6433J89938r2563J67833j29892o1422a83273A01126
17317f8059B54744a5771B03232a09055C11488A21045d6681D20058K87208D9218
17306a548B47793E1956J46788J27177j3424n5553P4348m8940a26372E57335j38371
17295D18964a50578A63410E4099J96625m4707d6705G8026P9256o7106d6219B41856
17283C12409p9497J35741e5612o0405N6646C3867J29553Q1356g366A71458A6006
$$ plain form
17271 37208 324614 166098 17336 43392 136836 135284 265945 302556 16981 302237 168882
17260 168882 -130374 432479 220787 -176057 339569 256377 216298 699353 145865 -17533
17249 363920 433974 242651 374726 152971 -21896 307423 250176 25737 188774 302229
17239 302229 -91145 186445 217092 -154209 114382 -40819 -2438 -304344 306735 250717 160566
17228 160566 403205 2067 374977 241013 475258 107189 436383 428245 -81326 39123 236828
17217 236828 238071 -236014 379273 372479 470047 348039 241763 214250 205957 -214689 264939
17205 218254 95390 499126 306427 164593 352243 214984 -84444 276005 204040 218657
17195 218657 38569 428139 217980 364228 340507 199007 438095 107950 97757 131735
$$ packed form
17271C7208K87406j58516A7336K6056R3444j552J30661L6611A6981K85256j33355
17260A68882a30374D32479k11692a76057C39569q3192m0079M83055A45865a7533
17249C63920P0054j91323J32075A52971b1896C07423n7247B5737J63037J13455
17239C02229i1145A86445L0647a54209A14382d0819b438l01906C06735n6018r0151
17228A60566K42639B067L72910j33964K34245A07189L29194q138h1326C9123J97705
17217B36828J243b36014C79273o794R7568j22008j06276k7513q293b14689B64939
17205B18254I5390M03736j92699j41834J87650j37259h4444B76005p1965J4617
17195B18657C8569L89570k10159J46248k3721j41500K39088A07950j0193L3978
$$ plain form
17185 131735 449721 409450 458637 151373 516288 385723 416227 121963 194985 236853
17175 236853 -10850 303152 102742 437476 378106 256570 94331 302373 187847 205975
17165 205975 172787 556457 476944 256371 276347 115076 187416 654474 353717 309721
17155 309721 335002 439254 89691 141950 347082 400020 456496 189646 380552 415634 545952
17144 545952 552029 274065 392960 194911 284212 38288 306263 569915 452262 32939
17133 364823 316168 609254 78104 347715 705936 438974 298093 121322 461258 179367
17122 -50358 175127 336492 346982 494424 437723 415367 232040 336121 113781 444595
17112 444595 300191 206124 356954 300530 649863 452365 251905 358264 487325 351327
$$ packed form
17185A31735L17986m0271M9187A51373L64915j30565L0504A21963P3022M1868
17175B36853a0850C03152A02742L34734n9370j21536I4331K08042j14526J8128
17165B05975l3188L83670p9513k20573J9976A15076P2340M67058l00757m3996
17155C09721K5281J04252H9691N2259K05132N2938N6476A89646J90906L5082J30318
17144E45952O077B74065J18895A94911Q9301C8288K67975K63652j17653C2939
17133C64823m8655K93086G8104K69611L58221k66962j40881A21322L39936A79367
17122e0358A75127J61365J0490J47442n6701k2356j83327J04081A13781L30814
17112D44595j44404r4067J50830n6424L49333j97498k00460J06359J29061j35998
$$ plain form
17102 351327 321060 390937 339658 524978 542365 692542 151933 337465 284254 599241
17092 599241 442558 340108 309155 344018 211914 402241 223408 277015 414520 310464
17082 310464 501467 27162 591940 726618 652668 206529 177930 432905 253999 163079
17072 163079 -100655 807597 367363 220606 599448 435267 538850 552884 236182 289585
17062 289585 326028 508559 320176 464409 794900 526290 225229 572940 474054 439677
17052 439677 517842 592549 679874 325893 497154 622754 636778 345210 816360 687277
17042 687277 486418 374105 372175 617337 654577 361555 761590 736391 436279 369207
17032 369207 373496 426901 368392 404771 891033 520819 762835 426821 603837 363324
$$ packed form
17102C51327l0267O9877n1279J85320J7387J50177A51933J85532n3211L14987
17092E99241j56683j02450l0953L4863j32104J90327j78833N3607J37505j04056
17082C10464J91003B7162N64778J34678p3950B06529k8599K54975j78906r0920
17072A63079a00655H07597C67363j46757L78842j64181J03583J4034B36182N3403
17062B89585L6443J82531j88383J44233L30491k68610B25229L47711r8886l4377
17052D39677P8165P4707Q7325C25893J71261J25600J4024k91568M71150j29083
17042F87277k00859j12313j930K45162L7240k93022M00035k5199l00112o7072
17032C69207M289N3405n8509L6379M86262l70214K42016l36014J77016k40513
$$ plain form
17022 363324 712607 433458 431503 873928 824053 514360 593698 608249 617314 314865 573697
17011 573697 637574 803120 745888 395038 1120395 641031 739940 979895 371319 396224
17001 396224 750834 872826 712295 313465 700643 714076 647755 512846 787867 1011348
16991 1011348 570509 680283 562623 600397 740915 856267 703321 972178 970253 611715
16981 611715 579157 468257 640591 700873 865736 884714 796362 1025906 788462 788272 866175
16970 866175 928804 752459 963026 902695 480243 1009554 900198 677062 861116 1069777
16960 1069777 797826 838539 941025 1198357 1163198 521153 994232 1145050 1175795 962305
16950 962305 971349 871462 639586 778800 1005057 878859 1389274 1294333 1067061 786121
$$ packed form
17022C63324L49283k79149j955M42425m9875l09693P9338J4551R065l02449K58832
17011E73697O3877J65546n7232l50850P25357m79364R8909K39955C71319K4905
17001C96224L54610J21992j60531C13465L87178J3433o6321j34909K75021K23481
16991A011348m40839J09774j17660L7774J40518J15352j52946K68857j925l58538
16981F11715l2558j10900J72334O0282J64863J8978q8352K29544k37444j90P7903
16970H66175O2629j76345K10567o0331m22452N29311j09356k23136J84054K08661
16960A069777k71951M0713J02486K57332l5159E21153M73079J50818L0745k13490
16950I62305R044r9887k31876J39214K26257j26198N10415r4941k27272k80940
$$ plain form
16940 786121 881370 1124733 808611 984926 1315475 1138154 1126051 1299539 1122994 926693
16930 926693 1302132 1253095 1159278 1199054 999690 1201933 1429475 1154586 1102751 962359
16920 962359 1411340 1152441 1761859 1279301 1491661 1210385 1328664 1490074 1436643 1448763
16910 1448763 1428118 1552384 1640206 1248843 1472966 1412345 1386251 1579427 1327212 1593648
16900 1593648 1363895 1753708 1391107 1559899 1659329 1578414 1951045 1571055 1849122 1806556
16890 1806556 1725630 1669271 1663539 1618508 1681155 1903152 1967616 2101055 1644004 2077201 1936308
16879 1936308 1790993 2358099 2000314 2184842 1801493 2457004 2269130 2392998 2077486
16870 2077486 2293492 2215553 2153229 2624341 2145209 2252544 2353196 2552884 2612733 2308177
$$ packed form
16940G86121R5249K43363l16122J76315L30549j77321j2103J73488j76545j96301
16930I26693L75439m9037r3817L9776j99364K02243K27542k74889n1835j40392
16920I62359M48981k58899O09418m82558K12360k81276J18279J61410n3431J2120
16910A448763k0645J24266Q7822l91363K24123o0621k6094J93176k52215K66436
16900A593648k29753L89813l62601J68792R9430q0915L72631l79990K78067m2566
16890A806556q0926n6359n732m5031O2647K21997O4464J33439m57051M33197j40893
16879A936308j45315N67106l57785J84528l83349O55511j87874J23868l15512
16870B077486K16006p7939o2324M71112m79132J07335J00652J99688N9849l04556
$$ plain form
16860 2308177 2627225 2685826 3059385 2520875 2369854 2621100 2437556 2891191 2800303 2613058
16850 2613058 2719831 2892074 3034559 3243487 2971272 3189667 3294887 3331825 3293482 3513529
16840 3513529 3411748 3485476 3644321 3808018 3823370 3546709 3851202 3703658 3609552 3925694
16830 3925694 3807252 4151190 3698834 3928523 4268039 4188937 4410130 4671745 4472347 4777289
16820 4777289 5010444 4623107 4789204 4854464 5093454 5474253 5393934 5763373 5404262 5704321
16810 5704321 5937746 5716824 6143650 6314701 6045096 6210874 6435244 6375989 6933968 6961196
16800 6961196 6998774 7012757 7541657 8024758 7987558 7859828 8520067 8547897 8945232 8948279
16790 8948279 9519352 9025262 9662574 10249191 10219194 10098029 10837663 10703381 11319358 11815354
$$ packed form
16860B308177L19048N8601L73559n38510j51021K51246j83544M53635r0888j87245
16850B613058J06773J72243J42485K08928k72215K18395J05220L6938l8343K20047
16840C513529j01781P3728J58845J63697J5352k76661L04493j47544r4106L16142
16830C925694j18442L43938m52356K29689L39516p9102K21193K61615j99398L04942
16820D777289K33155l87337J66097O5260K38990L80799q0319L69439l59111L00059
16810E704321K33425k20922M26826J71051k69605J65778K24370n9255N57979K7228
16800F961196L7578J3983N28900M83101l7200j27730O60239K7830L97335L047
16790H948279N71073m94090O37312N86617k9997j21165P39634j34282O15977M95996
$$ plain form
16780 11815354 12289150 12548766 12930816 13175798 13507453 14119820 14329956 14687726 15204873
16771 15204873 16272607 16626225 16947840 17659328 18185831 19300236 19908850 20737670 21560684
16762 21560684 22180685 23033549 24155893 25009300 25955886 26689371 28196750 29596837 31091433
16753 31091433 32167052 33500996 35583941 37540626 39327976 41136081 43260110 45289980
16745 45289980 48084273 50736316 53271081 56300615 59669835 63151604 66660981 70708396
16737 70708396 74723568 79604998 84509079 89472555 95491506 101683704 107479734 114408775
16729 114408775 121110477 128313173 136130120 143769551 151343863 158941901 166511529 173389782
16721 173389782 179538412 185200140 189609393 192956965 195082377 195557513 194886065 192750347
$$ packed form
16780A1815354M73796K59616L82050K44982L31655O12367K10136L57770N17147
16771A5204873J067734L53618L21615P11488N26503J114405O08614Q28820Q23014
16762B1560684O20001Q52864J122344Q53407R46586P33485J507379J400087J494596
16753C1091433J075619J333944K082945J956685J787350J808105K124029K029870
16745D5289980K794293K652043K534765L029534L369220L481769L509377M047415
16737G0708396M015172M881430M904081M963476O018951O192198N796030O929041
16729A14408775O701702P202696P816947P639431P574312P598038P569628O878253
16721A73389782O148630N661728M409253L347572K125412M75136o71448k135718
$$ plain form
16713 192750347 189253061 184653099 178583298 172467959 165198563 157870466 149585229 142062878
16705 142062878 134132603 126494235 119256057 111671463 105212041 99120607 92792448 87060730
16697 87060730 81985114 77024765 72475045 68213583 64090835 61070040 56977399 54102912
16689 54102912 50963166 48097457 45830389 43105428 41211005 39044007 37071565 35513942
16681 35513942 33508308 32198816 30847670 29452489 27983306 26974858 25707915 24392284
16673 24392284 23697967 22475083 22112113 20759939 19806955 19033645 18636584 17957201 17005505
16664 17005505 16706212 16023210 15265959 15570229 14597231 13902466 13401362 13270197 12715637
16655 12715637 12362927 11735434 11353824 11352621 10662822 10471882 10279106 9758917 9849854 9111980
$$ packed form
16713A92750347l497286m599962o069801o115339p269396p328097q285237p522351
16705A42062878p930275p638368p238178p584594o459422o091434o328159n731718
16697H7060730n075616m960349m549720m261462m122748l020795m092641k874487
16689E4102912l139746k865709k267068k724961j894423k166998j972442j557623
16681C5513942k005634j309492j351146j395181j469183j008448j266943j315631
16673B4392284o94317j222884l62970j352174r52984p73310l97061o79383r51696
16664A7005505k99293o83002p57251L04270r72998o94765n01104j31165n54560
16655A2715637l52710o27493l81610j203o89799j90940j92776n20189R0937p37874
$$ plain form
16645 9111980 8946456 8619354 8381858 8355083 8200353 7843161 7878009 7214640 7096671 7198433
16635 7198433 7111123 6983887 6651456 6350389 6429792 6216515 5807170 5837426 5767428 5964862
16625 5964862 5475572 5202550 5248710 5201622 5036053 4978493 5121473 4864470 4674902 4705565
16615 4705565 4336563 4216256 4067078 4382934 3956525 3960019 3755157 3970282 3867376 4212053
16605 4212053 3834483 3557243 3456586 3342064 3502078 3246965 3133076 3093601 2873451 3276225
16595 3276225 3005098 2824844 2826364 3048528 3000789 2656494 2822877 2844326 2478139 2765953
16585 2765953 2508792 2683420 2543228 2485754 2498991 2462800 2412419 2230851 2489278 2655953
16575 2655953 2287641 2393520 2134081 2096999 2115771 1536711 2225938 2013355 1987910 2030696
$$ packed form
16645I111980j65524l27102k37496k6775j54730l57192L4848o63369j17969J01762
16635G198433q7310j27236l32431l01067P9403k13277m09345L0256o9998J97434
16625E964862m89290k73022M6160m7088j65569n7560J42980k57003j89568L0663
16615D705565l69002j20307j49178L15856m26409L494k04862K15125j02906L44677
16605D212053l77570k77240j00657j14522J60014k55113j13889l9475k20150M02774
16595C276225k71127j80254J520K22164m7739l44295J66383K1449l66187K87814
16585B765953k57161J74628j40192n7474J3237l6191n0381j81568K58427J66675
16575B655953l68312J05879k59439l7082J8772n79060O89227k12583k5445M2786
$$ plain form
16565 2030696 1862225 1967121 1805153 1523170 1683334 1740129 2000232 1584822 1631528 1403646
16555 1403646 1801157 1799612 1553503 1436779 1527085 1468639 1695944 1593077 1466442 1838984
16545 1838984 1764459 1139832 1839996 1417430 1786558 1350449 1274218 1157386 1387262 1122896
16535 1122896 1173176 964966 1426090 1214979 1220450 1454115 1063522 1063963 1281041 1125471
16525 1125471 1049396 1027525 1472049 1443898 1157293 926626 1143486 974088 1290888 1228936
16515 1228936 968917 953072 1168097 798519 1186246 710405 907791 804747 1031650 982438
16505 982438 884336 1051808 1258410 940374 783188 763695 893592 917027 719182 692101
16495 692101 643836 736312 840504 980673 878569 743832 1062946 435062 835515 446824
$$ packed form
16565B030696j68471J04896j61968k81983J60164N6795K60103m15410M6706k27882
16555A403646L97511j545k46109j16724R0306n8446K27305j02867j26635L72542
16545A838984p4525o24627P00164m22566L69128m36109p6231j16832K29876k64366
16535A122896N0280k08210M61124k11111N471K33665l90593M41K17078j55570
16525A125471p6075k1871M44524k8151k86605k30667K16860j69398L16800o1952
16515A228936k60019j5845K15025l69578L87727m75841J97386j03044K26903m9212
16505I82438r8102J67472K06602l18036j57186j9493J29897K3435j97845k7081
16495F92101m8265R2476J04192J40169j02104j34737L19114D35062M00453l88691
$$ plain form
16485 446824 525467 760938 851977 1076605 761435 177831 766841 641245 732521 436944
16475 436944 398487 641193 857246 978690 605714 506045 1018252 607718 765164 883185
16465 883185 865734 830198 678166 524262 606324 548805 471563 351983 694766 864876
16455 864876 753694 581371 511613 395979 573216 759017 759979 628557 659177 617497 810556
16444 810556 1004001 648841 558848 304011 522205 387213 378694 773024 253280 296872
16434 296872 426767 447683 349774 228064 411197 498756 614365 827620 139905 684905
16424 684905 788039 267584 392988 302660 517121 687836 458471 542893 539890 529305
16414 529305 564550 447443 383681 532942 451734 451042 270904 589547 449941 567854 603208
$$ packed form
16485D46824P8643K35471R1039K24628l15170A77831N89010j25596R1276k95577
16475D36944l8457K42706K16053J21444l72976r9669N12207m10534J57446J18021
16465H83185j7451l5536j52032j53904Q2062n7519p7242j19580L42783J70110
16455H64876j11182j72323o9758j15634J77237J85801R62j31422L0620m1680J93059
16444H10556J93445l55160q9993k54837K18194j34992q519L94330B53280M3592
16434B96872J29895K0916r7909j21710J83133Q7559J15609K13255A39905N45000
16424F84905J03134B67584J25404r0328K14461J70715k29365Q4422l003j0585
16414E29305L5245j17107o3762J49261q1208o92j80138L18643j39606J17913L5354
$$ plain form
16403 603208 369566 536950 618615 685373 350315 655685 388415 176024 157326 278650
16393 278650 149174 78480 92831 203758 659388 514720 516663 212329 345023 194562
16383 194562 420678 369243 29369 303279 537839 559169 305972 584040 49812 619233
16373 619233 535505 341966 -141965 249756 215836 291391 334299 419118 265293 233245 289367
16362 289367 454316 593203 189054 88057 502765 377937 536526 88153 268960 441389
16352 441389 486875 269269 437691 -17823 255648 319210 435288 498002 466481 498504 379810
16341 379810 492718 139584 151323 349941 -39897 154128 166083 -108966 68632 152899
16331 152899 351565 -30915 -12788 132568 196731 140182 385973 207543 177098 150543 563807
$$ packed form
16403F03208k33642J67384Q1665O6758l35058L05370k67270A76024j8698J21324
16393B78650j29476p0694J4351J10927M55630j44668J943B12329J32694j50461
16383A94562K26116n1435B9369K73910K34560K1330k53197K78068D9812N69421
16373F19233q3728j93539a41965B49756l3920P5555M2908Q4819j53825l2048N6122
16362B89367J64949J38887A89054H8057M14708j24828J58589H8153J80807J72429
16352D41389M5486k17606J68422a7823B55648O3562J16078O2714l1521L2023j18694
16341C79810J12908A39584J1739J98618c9897A54128J1955a08966F8632Q4267
16331A52899J98666c0915a2788A32568O4163n6549K45791j78430l0445k6555M13264
$$ plain form
16320 563807 97727 -192716 292306 190420 3638 134642 111773 234091 303836 -103873
16309 274248 492816 355468 421489 457077 -27660 -48494 223536 -72865 147095 251214
16299 251214 470452 539480 212456 -251602 341104 23955 -4908 359363 -52940 215294
16288 296452 679311 227995 146675 -2646 99674 284024 231257 638404 283702 442836
16278 442836 -53965 192636 329842 182615 -74853 301780 61657 134017 194871 -80108 162143
16266 597036 453685 100148 540225 199186 37359 173549 198929 40122 284712 -11412
16255 38263 -36348 10517 383894 -30943 122442 87738 142686 415770 -26167 195348 71129
16243 388942 154885 156000 143618 216327 122436 109659 457765 -16271 256305 18565 10603
$$ packed form
16320E63807I7727a92716B92306j01886C638J31004k2869J22318O9745a03873
16309B74248K18568j37348O6021L5588b7660k0834B23536g2865A47095J04119
16299B51214K19238O9028B12456b51602C41104B3955d908C59363e2940B15294
16288B96452L82859B27995q1320b646I9674J84350n2767M07147B83702J59134
16278D42836e3965A92636J37206j47227g4853C01780F1657P2360O0854h0108A62143
16266E97036j43351A00148M40077A99186C7359J36190K5380D0122K44590a1412
16255C8263c6348A0517L73377c0943A22442l4704N4948K73084b6167A95348G1129
16243C88942A54885J115j2382P2709r3891j2777L48106a6271B56305A8565p962
$$ plain form
16232 10603 -40079 95397 1111 437035 195103 -59226 19990 -152231 54183 344986 161325
16220 166306 23382 332697 6688 217399 -56876 111727 -157622 348802 386516 12060 335555
16209 335555 176917 32618 -80211 138837 -54973 50695 -110020 -139335 137756 -126129
16198 37667 -42136 147299 -63081 111309 -204217 319006 -47332 131512 208723 60037 112697
16187 112697 98910 129199 227626 226662 352440 31642 182327 214756 313882 -16580 141124
16175 208813 10133 44574 -142734 64611 86804 414184 314522 207063 490077 16552 28567
16164 28567 361646 129837 125053 66963 179623 476526 -207865 8266 154378 43403 133328
16153 133328 139845 163270 -163588 148915 -12793 26920 -326365 326006 135529 -179765
$$ packed form
16232A0603d0079I5397A111M35924A95103e9226A9990a52231E4183K90803A61325
16220A66306B3382L09315F688K10711e6876A11727a57622C48802L7714A2060L23495
16209C35555j58638C2618h0211A38837e4973E0695a10020k9315A37756a26129
16198C7667d2136A47299f3081A11309b04217C19006d7332A31512P7211F0037N2660
16187A12697j3787L0289R8427r64J25778C1642J50685L2429R9126a6580A41124
16175B08813A0133L4441a42734F4611K2193L27380r9662j07459K83014A6552J2015
16164B8567L33079A29837m784n8090J12660K96903b07865H266J46112D3403Q9925
16153A33328O517K3425a63588A48915a2793B6920c26365C26006A35529a79765
$$ plain form
16142 171690 24207 221263 -161763 70131 107630 72713 3732 291182 -148559 -13422 132870
16130 72518 465801 114600 31546 197070 46752 160414 -11122 -12623 87607 67856 195063
16119 195063 204642 187238 -268845 97838 25109 166462 -135064 176579 -139836 112458
16108 117381 7839 -14321 74737 -452659 25629 22210 73292 130871 166744 219729 86754 65344
16096 65344 8913 -186539 -175645 9043 219187 -197655 177029 -83348 126512 -9720 50049
16084 -3659 -377006 -56281 8754 -3892 -221902 4223 -23843 420124 -21517 399276 -133500
16072 -343238 26015 129812 24529 114568 -66028 299630 -30916 -23542 8746 -110053 -151198
16061 -151198 -127089 -104410 -17737 -197917 -232322 -109753 -168583 48152 -33333 36695 -80593
$$ packed form
16142A71690B4207J97056a61763G0131L7499l4917C732K87450a48559a3422A32870
16130G2518L93283A14600C1546J65524D6752J13662a1122j501H7607j9751J27207
16119A95063R579j7404b68845I7838B5109J41353a35064A76579a39836A12458
16108A17381G839a4321G4737d52659B5629l419N1082N7579L5873N2985H6754k1410
16096F5344H913a86539J0894I043K10144a97655A77029h3348A26512i720E0049
16084c659l73347e6281H754c892k18010D223b3843D20124b1517C99276a33500
16072c43238B6015J03797B4529R0039f6028B99630c0916P374H746a10053m1145
16061a51198K4109K2679a7737j80180l4405a09753n8830D8152c3333C6695h0593
$$ plain form
16049 723 97600 -10503 -21792 -146636 149235 260401 -73897 -198532 -83787 -239780 -80975
16037 -39827 -62018 96163 -2139 162767 28624 20654 -129296 36238 -74467 134674 44783
16025 -83476 -270303 -173994 160019 -272081 -436317 -172206 -14914 -234678 -286796 41332
16014 -379380 49557 -213583 -290686 109368 -84159 -26583 -106972 -111309 -125853 -223362 -42136
16002 63353 -227231 -10932 220656 33457 -185031 -172168 175528 -218712 -61651 -97751 20303
15990 -30047 72344 -228539 -81559 64120 84595 47816 282293 -23529 85702 60259 199046
15979 199046 45231 250943 39526 102640 -47825 -17311 -110446 -125548 -50604 -47534 -117370
15968 -117370 -124779 -118860 -71840 300686 -42014 365223 157633 -215949 86474 -26866 95691
$$ packed form
16049G23R6877a0503j1289j24844A49235J11166g3897j24635h3787j55993h0975
16037c9827k2191I6163b139A62767B8624p970a29296C6238g4467A34674D4783
16025h3476j86827R6309A60019b72081j64236a72206a4914k19764n2118D1332
16014c79380D9557b13583p7103A09368h4159b6583q0389m337j4544r7509d2136
16002F3353b27231a0932B20656C3457a85031J2863A75528b18712f1651l6100B0303
15990c0047G2344b28539h1559F4120K0475l6779K34477b3529H5702k5443J38787
15979A99046D5231K05712C9526O3114d7825a7311r3135j5102e0604L070o9836
15968a17370p409N919M7020C00686d2014C65223A57633b15949H6474b6866I5691
$$ plain form
15956 329155 131996 -142760 -136693 -267334 12758 -270878 -9783 -164486 33653 44627 12004
15944 424189 -168165 104473 -219874 370430 -388872 8910 -268360 56718 -185741 130012
15933 -27164 380726 -418189 -519391 6510 -276518 185763 3060 33376 167726 -45015 -302042
15922 -302042 30497 192280 -339561 -414440 6482 -352506 -228884 165617 -49513 -57723 100813
15910 68483 189412 -127704 153812 -82938 63704 237194 -26239 33977 294594 -169379
15899 -20567 257677 518928 -65402 -23401 165061 -129502 -170001 79313 44339 -66093 -252676
15888 -252676 73779 129176 -57235 36085 27688 171321 184766 -155849 -114164 -45832 76044
15876 -227412 -189263 -118050 9871 -139280 -51612 -46908 -132295 46950 -24382 -423990 -56862
$$ packed form
15956C29155A31996a42760O067j30641A2758b70878i783j54703C3653J0974A2004
15944D24189a68165A04473b19874C70430c88872H910b68360E6718a85741A30012
15933b7164C80726d18189j01202F510b76518A85763C060L0316J34350d5015k57027
15922c02042C0497J61783c39561p4879F482c52506J23622A65617d9513q210A00813
15910F8483J20929a27704A53812h2938F3704J73490b6239C3977K60617a69379
15899b0567B57677K61251f5402b3401A65061a29502m0499G9313l4974f6093j86583
15888b52676G3779N5397e7235C6085q397J43633J3445a55849M1685d5832G6044
15876b27412L8149P1213I871a39280e1612M704q5387D6950b4382l99608e6862
$$ plain form
15864 224167 204951 23408 -210346 -154809 -433429 182843 -35273 -411189 -84713 89964 -235586
15852 56285 -12002 37168 -106601 -148568 -39332 -198450 129136 2138 -99068 501217 113422
15840 257931 50637 -65514 -1373 152162 175781 -241666 204932 203584 131462 198625 59711
15828 -163381 233611 -106986 100204 -178402 -2369 -151174 -172380 -335935 -17018 -178424
15818 -178424 47304 -52447 -308263 106851 -276483 6409 -500408 -22971 107157 -102295
15807 -218920 -19685 119092 261480 -17434 -159731 177007 -226114 -173432 -7480 -61863 292148
15795 303990 -48391 48999 -11983 -293664 -140874 91607 -6802 67043 2663 7457 -2210 -112845
15783 -112845 -241022 -106561 63871 -337614 313822 -239583 73368 -218776 59575 -185110
$$ packed form
15864B24167j9216B3408b10346N5537k78620A82843c5273l75916h4713H9964b35586
15852E6285a2002C7168a06601m1967c9332j59118A29136B138i9068E01217A13422
15840B57931E0637f5514a373A52162K3619b41666B04932j348p2122O7163E9711
15828a63381B33611a06986A00204a78402b369j48805k1206j63555a7018j61406
15818a78424D7304e2447k55816A06851b76483F409e00408b2971A07157a02295
15807b18920a9685A19092J42388a7434j42297A77007b26114N2682g480n4383B92148
15795C03990d8391D8999a1983k81681a40874I1607f802F7043B663M794b210j10635
15783a12845j28177a06561F3871c37614C13822b39583G3368b18776E9575a85110
$$ plain form
15772 52130 -3161 85588 130926 166302 180990 69294 -188900 -100595 -33758 -144617 -102540
15761 -102540 210170 -183414 90710 -91609 82108 -337222 320975 146740 -37372 -312928
15751 -312928 -138373 -12193 -42182 -66089 156116 -243465 32663 123349 -298659 360083
15740 -109942 -137766 65716 -97565 -99706 -138788 83825 -239232 -119397 -430270 -153603 -52853
15728 -205147 -70091 -388996 -228486 83021 -253201 -349835 113582 -119511 155639 126094
15718 126094 -89038 -132027 60083 -88568 -286217 64879 -112700 -246283 -241372 22811 -126631
15706 -67108 -90168 382 78195 -199602 -47083 -17832 96710 212814 -183279 -116536 -204392
15695 -204392 25292 126493 -238782 22143 -67741 175326 -182005 -74045 -164509 -240676 66698
$$ packed form
15772E2130c161H5588M5338L5376J4688F9294a88900Q8305c3758j10859M2077
15761a02540B10170a83414I0710i1609H2108c37222C20975A46740c7372k75556
15751c12928a38373a2193k9989k3907A56116b43465C2663R0686b98659C60083
15740a09942k7824F5716i7565k141l9082H3825b39232a19397l10873a53603e2853
15728b05147g0091l18905J60510H3021b53201r6634A13582a19511A55639k9545
15718A26094h9038m2989F0083h8568j97649F4879a12700j33583M911B2811a26631
15706f7108k3060C82P7813a99602d7083a7832I6710J16104a83279O6743q7856
15695b04392B5292J01201b38782B2143f7741A75326a82005g4045r0464p6167F6698
$$ plain form
15683 17569 143203 243301 279172 -166609 73907 160047 -280470 -185317 336143 -29616 -59877
15672 -59877 171939 -98817 -134636 -167453 -385126 141657 252014 -202315 318750 -138849
15661 124941 49747 -402845 -145318 163385 -196419 241012 -69144 -279399 -161921 33010
15650 -236701 40830 40516 351346 35280 -279922 -291307 -158229 -97163 42144 -403206 -426187
15639 -426187 227376 -64388 -197091 -177188 54386 209117 202862 -232290 -53043 -204711 -139619
15628 -139619 210872 -155988 139183 2101 108639 287100 -63106 -14950 -116350 -30331
15617 147072 171101 64620 -140971 178580 171721 45233 92588 61664 253364 -235853 17967
15605 153929 195756 -222506 25501 -212016 -41379 126482 255130 -21551 93049 -10719 125190
$$ packed form
15683A7569J25634J00098L5871a66609G3907Q6140b80470R5153C36143b9616l0261
15672e9877A71939i8817l5819l2817k17673A41657J10357b02315C18750a38849
15661A24941D9747d02845a45318A63385a96419B41012f9144k10255J17478C3010
15650b36701D0830l14L10830C5280b79922j1385J33078O1066D2144d03206k2981
15639d26187B27376f4388j32703J9903E4386J54731o255b32290e3043j51668O5092
15628a39619B10872a55988A39183B101J06538J78461f3106a4950j01400c0331
15617A47072K4029F4620a40971A78580o859D5233M7355l0924J91700b35853A7967
15605A53929M1827b22506B5501b12016d1379A26482J28648b1551I3049a0719A25190
$$ plain form
15593 199692 -54085 38354 -117156 -125099 132 -227384 -75917 255954 368314 -58193 -91564
15582 -91564 58030 -58094 -47666 -115307 -274583 47984 -100304 -153003 -89799 67229 -221306
15570 142995 -183302 87708 -26514 -63341 77885 -102401 -124937 -194856 199768 -440748 168681
15558 -140394 7542 287701 210004 155781 -41641 452301 174420 130384 -201669 -74427 -247192
15547 -247192 104113 128945 -88451 -8293 -136931 113330 217660 160382 -80488 -47708 130757
15535 88046 -257782 98754 -105364 89311 -282816 -10423 -34903 112606 -266401 -175355 83916
15523 82859 115084 -191039 -309631 -71139 119891 306800 -149970 21969 358285 110275
15512 270138 -64303 433111 67344 -135830 -148840 -231651 147898 -219043 30849 69299 155381
$$ packed form
15593A99692e4085C8354a17156p943A32b27384g5917B55954J12360e8193l3371
15582i1564E8030e8094J0428o7641j59276D7984a00304n2699O3204F7229b21306
15570A42995a83302H7708b6514l6827G7885a02401k2536o9919A99768d40748A68681
15558a40394G542K80159p7697n4223d1641D52301A74420m4036b01669g4427j72765
15547b47192A04113K4832h8451h293j28638A13330J04330n7278h0488L2780A30757
15535H8046b57782I8754a05364H9311b82816a0423k4480A12606b66401R1046H3916
15523H2859L2225a91039j18592g1139A19891J86909a49970B1969L36316A10275
15512B70138f4303D33111F7344a35830j3010q2811A47898b19043C0849L8450Q6082
$$ plain form
15501 155381 281841 -103175 -43667 34984 -177011 45554 -242222 -160242 200638 21273
15490 162518 233789 -71755 -260630 -84256 78352 -58533 -90035 -66269 -112523 194533 483898
15479 483898 -49969 -26822 -298131 280412 -79047 -63089 55621 -80598 22442 -154079 -68569
15467 -113188 303334 -137792 -17490 -325914 171463 38362 -5842 11974 29603 -48622 -123116
15456 -123116 -27905 27203 140559 -3046 292107 -204048 23469 379526 -43797 91976 -96754
15444 -204985 -974 203143 -143544 -141883 -25403 -221134 -569 103470 126194 -102969 270206
15432 284865 -284736 -261942 2353 -152917 154708 -18355 -53370 -118751 -133379 -256102 92572
15420 188418 -133242 135918 46669 -84656 6536 244032 -205497 -116521 -145044 185941 -52895
$$ packed form
15501A55381J26460a03175d3667C4984a77011D5554b42222Q1980B00638B1273
15490A62518P1271g1755j88875h4256G8352e8533l1502K3766m6254A94533K89365
15479D83898d9969K3147k71309B80412g9047J5958E5621h0598B2442a54079f8569
15467a13188C03334a37792a7490l08424A71463C8362e842A1974J7629d8622p4494
15456a23116b7905B7203J13356c046B92107b04048B3469L56057d3797I1976i6754
15444b04985i74B03143a43544J661b5403j95731e69A03470K2724a02969B70206
15432B84865b84736K2794B353a52917A54708a8355l5015o5381j4628j22723I2572
15420A88418a33242A35918D6669h4656F536K37496b05497Q8976k8523A85941e2895
$$ plain form
15408 -238923 371225 122777 59106 326974 299026 -179459 322032 271581 5307 249171
15398 249171 170247 18801 -212957 113242 196153 222444 86542 162807 348565 -43811 -262143
15387 -262143 255328 -147469 -180341 147708 179583 -121167 46191 76208 336196 -76955
15376 -32275 113196 -170605 -129552 21505 -7943 -41007 50666 28145 76892 125816 135151 24577
15363 78674 238306 -36714 90834 304999 103482 -86686 -33450 26770 -66169 201542 245884
15352 245884 -208676 -43382 -8856 -128442 116718 92556 -328942 695 86235 -353293 57918
15340 94482 -174906 71444 -178907 125774 -36267 46091 40526 -60383 203788 -1078 68799
15328 -98764 796 243029 9871 64013 -151927 -45115 -82 206958 -17850 -77712 136134 -86607
$$ packed form
15408b38923C71225A22777E9106K67868k7948a79459C22032n0451E307K43864
15398B49171p8924A8801b12957A13242Q2911K6291H6542P6265J85758d3811k18332
15387b62143B55328a47469l2872A47708L1875a21167D6191L0017K59988g6955
15376c2275A13196a70605M1053B1505g943l3064E0666k2521M8747M8924R335B4577
15363G8674J59632c6714I0834K14165A03482h6686c3450B6770f6169B01542M4342
15352B45884b08676d3382h856j19586A16718k4162c28942F95Q5540c53293E7918
15340I4482a74906G1444a78907A25774c6267D6091n565f0383B03788a078F8799
15328i8764G96K42233I871N4142a51927d5115h2B06958a7850n9862A36134h6607
$$ plain form
15315 -55534 24325 289291 244309 -189109 165131 -86907 91690 -100516 204097 -164003
15304 118827 201844 325664 -29317 -117166 27356 92504 17146 70543 -23864 4374 6280 -57796
15291 114654 71224 9129 19998 -42873 401300 -66171 -41140 -190406 34780 157337 110547
15280 110547 172142 387336 -40453 113848 165154 161735 166258 161856 -171980 491049 61215
15268 54554 141070 114563 9817 46271 128342 160370 111993 36204 250284 154759 208320 79781
15255 60578 -252852 126843 337091 -189779 336791 464478 448303 1106238 1757779 1915364
15245 1915364 1693498 1853002 1055287 299550 277276 464761 129683 -36766 178428 -60874
15234 10878 157442 205079 344060 -3187 -62484 267383 -156443 194741 -12953 -69104 109253
$$ packed form
15315e5534B4325K64966m4982a89109A65131h6907I1690a00516B04097a64003
15304A18827Q3017J23820b9317q7849B7356O5148A7146N3397b3864D374J906e7796
15291A14654m3430I129J0869d2873D01300f6171K5031j49266C4780J22557m6790
15280A10547O1595K15194d0453A13848N1306l419M523m402a71980D91049F1215
15268E4554Q6516k6507I817L6454Q2071L2028m8377C6204K14080r5525N3561G9781
15255F0578b52852A26843K10248a89779C36791J27687j6175O57935O51541J57585
15245A915364k21866J59504p97715B99550k2274J87485A29683c6766A78428f0874
15234A0878J46564M7637J38981c187n9297B67383a56443A94741a2953n6151A09253
$$ plain form
15222 -1504 102726 186926 -202118 11340 83583 -118011 100409 -42673 51496 79926 244957
15211 244957 -71047 -28241 163665 92558 -143066 -28899 12721 405084 75357 -307699 234901
15199 65295 -155755 19420 335978 295448 72231 -153977 21012 115689 253846 173409 259455
15188 259455 4587 -229133 -35269 -143632 46122 169720 201192 -54052 -104284 285069 153669
15177 153669 163146 -48359 -216987 31567 196663 179284 308748 209555 -39333 86973 62143
15166 62143 122754 119065 166566 173135 101088 -71259 40875 25414 40025 196402 -45858 10724
15153 260901 178360 281750 31504 -12352 155321 -125564 235095 378325 311061 100183
15142 68344 -29436 109091 254836 -150966 103901 44856 379570 295581 217526 40447 339279
$$ packed form
15222a504A02726Q4200b02118A1340P2243a18011A00409d2673E1496K8430J65031
15211B44957g1047b8241A63665p1107a43066b8899A2721L92363G5357c07699B34901
15199F5295a55755A9420L16558m0530G2231a53977B1012R4677J38157q0437Q6046
15188B59455D587b29133c5269j08363D6122J23598L1472e4052n0232B85069j31400
15177A53669R477d8359j68628C1567J65096j7379J29464r9193c9333H6973k4830
15166F2143O0611l689M7501O569p2047g1259D0875j5461J4611J56377d5858A0724
15153B60901q2541J03390C1504a2352A55321a25564B35095J43230o7264A00183
15142F8344b9436A09091J45745a50966A03901D4856L34714q3989p8055D0447K98832
$$ plain form
15131 339279 369786 294108 -126218 -219486 -274788 279149 140584 341898 -6405 246532 115710
15119 119893 -74869 277093 111668 247901 267226 154668 387736 306537 -203009 -229530
15109 -229530 239172 55698 -868 35541 -44306 426511 454652 261285 228031 -31534 232808
15097 13917 17379 -88056 190692 -109693 28842 166598 216041 234713 123149 346928 -18272
15085 90529 242214 221998 393367 20375 -165921 207539 -73915 235739 419334 -117114
15074 139229 236742 208322 -86956 290349 -84870 -17341 227771 180898 472156 136077 311351
15063 311351 479889 55061 165674 112415 -30621 568292 19802 439180 351065 191297
15053 191297 22820 158166 346567 250943 229002 193302 230760 74061 85072 -9533 288744
$$ packed form
15131C39279L0507p5678a26218r3268n5302B79149j38565K01314f405B46532A15710
15119A19893g4869B77093A11668J36233J9325j12558K33068q1199b03009k6521
15109b29530B39172E5698h68C5541d4306D26511K8141j93367l3254c1534B32808
15097A3917L462h8056A90692a09693B8842J37756M9443J8672j11564K23779a8272
15085I0529J51685k0216J71369B0375a65921B07539g3915B35739J83595a17114
15074A39229R7513k8420h6956B90349h4870a7341B27771m6873K91258A36077J75274
15063C11351J68538E5061J10613n3259c0621E68292A9802M19378q8115j59768
15053A91297B2820J35346J88401r5624k1941l5700L7458G4061J1011i533B88744
$$ plain form
15041 -63476 250573 62859 -148617 157782 -138657 -9717 128900 170563 260004 206827 10967
15029 355839 166706 -16666 -299324 202330 144103 -45620 293678 -23017 118014 405339
15019 405339 -9156 199355 334609 196380 135300 -19661 208988 164966 156207 315217 273983
15008 273983 -17827 752014 292151 475732 308307 93033 532296 291611 249647 246085
14998 246085 -208428 79250 237938 321759 -123304 998 140370 -8475 -32487 355176 70332
14986 403528 484156 280943 341700 415826 125786 411238 235550 189290 278477 445580
14976 445580 490137 220618 529141 216917 253327 113499 218856 366045 228128 463743
14966 463743 492775 -73432 300842 344498 185677 119541 69444 126034 398068 538807 366487
$$ packed form
15041f3476B50573F2859a48617A57782a38657i717A28900M1663Q9441n3177A0967
15029C55839A66706a6666k82658B02330n8227d5620B93678b3017A18014K87325
15019D05339i156A99355J35254j38229o1080a9661B08988m4022q759J59010m1234
15008B73983a7827G52014B92151J83581j67425I3033M39263k40685m1964l562
14998B46085b08428G9250J58688Q3821a23304I98J39372h475k4012C55176G0332
14986D03528Q0628k03213O0757P4126A25786K85452j75688m6260Q9187J67103
14976D45580M4557B20618L08523B16917L6410A13499J05357J47189j37917K35615
14966D63743K9032g3432C00842M3656j58821o6136n0097N6590K72034J40739j72320
$$ plain form
14955 366487 514408 -4215 450159 148240 292948 169712 537081 55179 515583 438352
14945 438352 -171612 290092 31604 316640 14806 331428 351050 227366 317559 87487
14934 201623 482619 191272 646189 516163 301699 278925 36760 204347 356487 360082
14924 360082 361432 389555 -4961 413508 110013 327642 152740 187048 411276 388492 438311
14913 438311 294660 279579 393355 9264 384476 310762 275614 70116 654084 587887 120084
14901 229360 265352 376719 238403 223334 279451 256883 421035 250655 345000 270020 253330
14890 253330 361721 480022 75825 219257 351410 342808 417316 313243 239136 174726 297105
14879 297105 294384 370636 1008870 160572 525589 300571 296328 185985 185586 277619 336512
$$ packed form
14955C66487J47921d215D50159A48240J44708j23236L67369E5179M60404p7231
14945D38352a71612B90092C1604K85036A4806L16622J9622j23684R0193H7487
14934B01623K80996A91272M54917j30026k14464k2774C6760J67587J52140L595
14924C60082J350K8123d961D13508A10013K17629A52740L4308K24228k2784M9819
14913D38311j43651j5081J13776I264L75212p3714l5148G0116N83968o6197A20084
14901B29360L5992J11367j38316j5069N6117k2568J64152j70380R4345p4980j6690
14890B53330J08391J18301G5825J43432J32153q602P4508j04073p4107o4410J22379
14879B97105k721P6252O38234A60572L65017k25018m243j10343l99R2033N8893
$$ plain form
14868 336512 598323 328423 228329 192888 253308 197085 537884 478331 367301 457235
14858 457235 768071 447203 403644 282502 425842 332516 797708 546878 295197 227149
14848 227149 452272 439893 -17406 529256 292671 655907 437651 352623 415152 333178
14838 333178 229772 548157 348486 752296 386257 565561 324589 207158 424504 695908
14828 695908 854871 683705 398021 669984 90288 423497 353323 326002 470605 513236
14818 513236 447697 487800 252360 -2456 694883 501882 531271 310005 441411 330477
14808 330477 101992 459824 375281 701934 364863 452479 517551 386183 625605 681572
14798 681572 538402 526688 519965 1008440 537026 595939 825090 400233 418479 479541 513606
$$ packed form
14868C36512K61811k69900j00094l5441O0420n6223L40799n9553j11030Q9934
14858D57235L10836l20868m3559j21142J43340r3326M65192k50830k51681o8048
14848B27149K25123j2379a7406E29256k36585L63236k18256q5028O2529q1974
14838C33178j03406L18385j99671M03810l66039J79304k40972j17431K17346K71404
14828F95908J58963j71166k85684K71963I0288L33209p0174k7321J44603M2631
14818E13236o5539M0103k35440b456F94883j93001K9389k21266J31406j10934
14808C30477A01992L57832q4543L26653l37071Q7616O5072j31368K39422N5967
14798F81572j43170j1714o723M88475m71414N8913K29151D00233J8246O1062L4065
$$ plain form
14787 513606 490886 379247 652250 655864 328011 757619 622183 283031 586929 572228
14777 572228 669203 489737 341720 909565 376195 622046 660806 554095 167836 496305
14767 496305 498205 775547 768093 869461 518837 662139 271646 736428 661773 723810 749560
14756 749560 420987 772878 694552 706335 655930 839546 639310 1010451 872006 545703
14746 545703 643759 837173 615819 494417 778038 724769 628267 573318 535959 836726
14736 836726 1017029 677730 770555 728644 330206 289240 765945 647415 631012 722697
14726 722697 820503 640290 791395 727093 888720 825858 842958 739763 1018676 710754
14716 710754 1102412 704297 884775 843218 1029522 768116 981392 955230 945612 1027482
$$ packed form
14787E13606k2720j11639K73003L614l27853M29608j35436B83031L03898j4701
14777E72228R6975j79466j48017N67845C76195K45851L8760j06711A67836L28469
14767D96305J900K77342p454J01368l50624J43302B71646M64782p4655O2037K5750
14756G49560l28573L51891p8326J1783n0405J83616k00236L71141j38445l26303
14746E45703R8056J93414k21354j21402K83621n3269r6502n4949l7359L00767
14736H36726J80303l39299R2825m1911C30206m0966M76705j18530j6403R1685
14726G22697R7806j80213J51105o4302J61627o2862J7100j03195K78913l07922
14716G10754L91658l98115J80478m1557J86304k61406K13276k6162r618Q1870
$$ plain form
14706 1027482 690495 879122 967313 1228397 478628 1021662 573132 802028 692418 968052
14696 968052 873916 1097819 1025892 1002211 850321 936524 864711 1011592 988918 589186 660406
14685 660406 998841 1214063 950277 950572 1061628 980688 823134 854518 786097 1008500 1023647
14674 1023647 899789 1127051 948358 1028494 1035929 1327818 1146572 1106130 1235271 846194
14664 846194 976892 897168 1269778 1195533 1146226 1212039 1093485 916445 1512362 1407784
14654 1407784 864908 959951 1164515 1260437 1230711 1139886 1207767 1119861 1209263 1237470 943924
14643 943924 1375501 1176442 1469362 914485 1420569 1157074 1184264 1366390 1385347 1635690
14633 1635690 1472830 1333871 1112058 1233072 1688322 1439618 1266844 1490308 1344352
$$ packed form
14706A027482l36987J88627Q8191K61084D78628N43034m48530K28896j09610K75634
14696I68052r4136K23903p1927k3681j51890Q6203p1813J46881k2674l99732P1220
14685F60406L38435K15222k63786K95J11056q0940j57554L1384o8421K22403J5147
14674A023647j23858K27262j78693Q0136P435K91889j81246m0442J29141l89077
14664H46194J30698p9724L72610p4245m9307O5813j18554j77040N95917j04578
14654A407784n42876R5043K04564R5922k9726r0825O7881q7906Q9402K8207k93546
14643I43924M31577j99059K92920n54877N06084k63495K7190J82126J8957K50343
14633A635690j62860j38959k21813J21014M55250k48704j72774K23464j45956
$$ plain form
14624 1344352 1449299 1651926 1595136 1373926 1436084 1316029 1018800 1321825 1190362 1744701
14614 1744701 1295332 1453780 1420954 1464706 1419230 1474119 1490187 1541751 1548694 1647944 1706586
14603 1706586 1615689 1771404 1229826 1842156 1653869 1640176 1435520 1796207 1659882 1802038
14593 1802038 1436156 1744950 1686553 1807771 2114332 1664821 1997775 1650807 2008247 1901437
14583 1901437 2133971 1782139 2007131 2148072 1999212 2070233 1868736 2419906 1969106 1932929
14573 1932929 1947515 2339179 2512590 2346596 2324668 2476308 2012825 2492124 2402221 2344033
14563 2344033 2683087 2861044 2754958 2689124 2757020 3009709 3407849 3104792 3605189 3850352
14553 3850352 3987713 4222221 4999136 5880076 7840635 11713519 19858325 33311365 37107944
$$ packed form
14624A344352J04947K02627n6790k21210O2158j20055k97229L03025j31463N54339
14614A744701m49369J58448l2826M3752m5476N4889J6068N1564O943R9250N8642
14603A706586r0897J55715n41578O12330j88287j3693k04656L60687j36325J42156
14593A802038l65882L08794n8397J21218L06561m49511L32954l46968L57440j06810
14583A901437K32534l51832K24992J40941j48860P1021k01497N51170m50800l6177
14573A932929J4586L91664J73411j65994k1928J51640m63483M79299q9903n8188
14563B344033L39054J77957j06086o5834O7896K52689L98140l03057N00397K45163
14553C850352J37361K34508P76915Q80940J960559L872884Q144806J3453040L796579
$$ plain form
14544 37107944 22686862 12563068 8472275 4747415 3324179 2735708 2289070 2185251
14536 2185251 2470835 2389120 1956989 1908619 2099029 2112840 2204194 2302621 2300804 1927633 2280077
14525 2280077 2267005 2163979 2636842 2478991 2577266 2465425 2398013 2695239 2196354 2298855
14515 2298855 2784959 2672866 2498308 2948917 2642467 2958254 2913221 3272546 2884193 2872901
14505 2872901 2898926 2908398 3074770 2824838 2927962 3092121 2935938 3075206 3226853 3028554
14495 3028554 3179393 3344712 3234767 3405287 3505539 3399365 3695077 3416056 3296950
14486 3296950 3786926 3674345 3864448 3759320 3596439 3988404 3911525 3722551 4028300 3749507
14476 3749507 3703796 4200999 3893803 4371960 4177071 4157995 4195714 4389866 4059791 4281275
$$ packed form
14544C7107944j4421082j0123794m090793l724860j423236n88471m46638j03819
14536B185251K85584q1715m32131m8370J90410J3811R1354R8427j817l73171L52444
14525B280077j3072j03026M72863j57851R8275j11841o7412K97226m98885J02501
14515B298855M86104j12093j74558M50609l06450L15787m5033L59325l88353j1292
14505B872901K6025R472J66372k49932J03124J64159j56183J39268J51647j98299
14495C028554J50839J65319j09945J70520J00252j06174K95712k79021j19106
14486C296950M89976j12581J90103j05128j62881L91965p6879j88974L05749k78793
14476C749507m5711M97203l07196M78157j94889j9076L7719J94152l30075K21484
$$ plain form
14466 4281275 4689656 4512607 4811635 4682994 4803576 4920792 4653878 5097484 4994913
14457 4994913 5007314 5117070 5060907 4905908 5023109 5236864 4941706 5277310 5294354 5515081
14447 5515081 5467482 5602523 5687883 5918478 5845911 5840006 5887513 6306950 6063779 5909113
14437 5909113 6593239 6284336 6448576 6549470 6474609 6870003 6987925 6857646 6764336 7012060
14427 7012060 7131263 6982207 7065638 7690737 7209709 7587389 7619988 7382349 7441157 8158720
14417 8158720 8107016 8183834 8387522 8468944 8221748 8419288 8933038 9099419 9305942 8987686
14407 8987686 9077575 9478596 9738441 9793548 9722520 9906430 10188815 10383799 10526854 10305259
14397 10305259 11066973 11059936 11182490 11425509 11471511 11691749 11956233 12229439 12528968 12368006
$$ packed form
14466D281275M08381j77049K99028j28641J20582J17216k66914M43606j02571
14457D994913J2401J09756n6163j54999J17201K13755k95158L35604J7044K20727
14447E515081m7599J35041Q5360K30595p2567n905M7507M19437k43171j54666
14437E909113O84126l08903J64240J00894p4861L95394J17922j30279r3310K47724
14427G012060J19203j49056Q3431O25099m81028L77680L2599k37639N8808P17563
14417H158720n1704P6818K03688Q1422k47196J97540N13750J66381K06523l18256
14407H987686Q9889M01021K59845N5107p1028J83910K82385J94984J43055k21595
14397A0305259P61714p037J22554K43019M6002K20238K64484K73206K99529j60962
$$ plain form
14387 12368006 12765211 13036153 13404586 13695171 13814094 13999810 14003504 14171742 15153354 14790575
14377 14790575 15661693 16038129 15926549 16303510 16558165 16831811 17351889 17995233 17836742
14368 17836742 18107035 18723968 19009580 19240210 19570155 20342484 20704866 21081474 21517104
14359 21517104 21925748 22621478 23055223 23646334 23990093 24884584 25429478 25712876 26480742
14350 26480742 27086050 27355586 28389845 28915838 29689531 30594608 31358999 32110810 33156919
14341 33156919 33627554 34648563 35463554 36868872 37477161 38729629 39986802 41048860
14333 41048860 42561275 43628812 44885525 46295722 47522807 49275459 50833145 52298498
14325 52298498 54069429 55960469 57817221 59510987 62012047 64201436 66694007 68700640
$$ packed form
14387A2368006L97205K70942L68433K90585J18923J85716L694J68238R81612l62779
14377A4790575Q71118L76436j11580L76961K54655K73646N20078O43344j58491
14368A7836742K70293O16933K85612K30630L29945P72329L62382L76608M35630
14359B1517104M08644O95730M33745N91111L43759Q94491N44894K83398P67866
14350B6480742O05308K69536J034259N25993P73693R05077P64391P51811J046109
14341C3156919M70635J021009Q14991J405318O08289J252468J257173J062058
14333D1048860J512415J067537J256713J410197J227085J752652J557686J465353
14325E2298498J770931J891040J856752J693766K501060K189389K492571K006633
$$ plain form
14317 68700640 71173829 74078776 76671548 79541607 82907152 85984324 89401672 93337253
14309 93337253 96946829 101136490 105613066 109836342 114666854 119949416 125310700 130898229
14301 130898229 137321651 143390288 150213640 157092815 165004957 172915083 181197743 190247434
14293 190247434 199607557 209260254 219664512 230582906 241881406 253771608 266110874
14286 266110874 278979502 291890746 305668675 319315059 333148291 346802580 360701339
14279 360701339 374070489 387271693 399336042 411041587 421286116 429996496 436266180
14272 436266180 440464478 441618318 441642473 441977349 439911846 437050258 431375871 424449673
14264 424449673 415641370 404819744 393104569 379976860 366418498 352160579 337630847
$$ packed form
14317F8700640K473189K904947K592772K870059L365545L077172L417348L935581
14309I3337253L609576M189661M476576M223276M830512N282562N361284N587529
14301A30898229O423422O068637O823352O879175P912142P910126Q282660R049691
14293A90247434R360123R652697J0404258J0918394J1298500J1890202J2339266
14286B66110874J2868628J2911244J3777929J3646384J3833232J3654289J3898759
14279C60701339J3369150J3201204J2064349J1705545J0244529Q710380O269684
14272D36266180M198298J153840K4155L34876k065503k861588n674387o926198
14264D24449673q808303j0821626j1715175j3127709j3558362j4257919j4529732
$$ plain form
14257 337630847 323150803 308936760 294386883 280719061 268532274 255981627 243446681
14250 243446681 231741649 220545638 209878329 199737029 190227929 181052796 172938191
14243 172938191 164856446 156950173 149773010 142843266 136415379 130699091 125438813 119610414
14235 119610414 114533386 109600484 105110120 101006717 97068860 93445251 89390506 86101579
14227 86101579 82909654 79827948 76843809 73758066 71201993 68520974 66458405 64389449
14219 64389449 62341968 59404126 57873311 55870331 54149736 52668972 51552960 50022880
14211 50022880 47849204 46743424 45150998 44158206 43086516 42273023 40556989 39452174
14203 39452174 37799478 37246018 36359591 35639130 34676856 33182542 32728827 31860190 30974009
$$ packed form
14257C37630847j4480044j4214043j4549877j3667822j2186787j2550647j2534946
14250B43446681j1705032j1196011j0667309j0141300r509100r175133q114605
14243A72938191q081745p906273p177163o929744o427887n716288n260278n828399
14235A19610414n077028m932902m490364m103403l937857l623609m054745l288927
14227H6101579l191925l081706k984139l085743k556073k681019k062569k068956
14219F4389449k047481k937842j530815k002980j720595j480764j116012j530080
14211E0022880k173676j105780j592426r92792j071690q13493j716034j104815
14203C9452174j652696n53460q86427p20461r62274j494314m53715q68637q86181
$$ plain form
14194 30974009 30078253 29724884 28879871 28062348 27346321 26659613 26170105 25466644 24879839
14185 24879839 24317314 23621931 23276755 22703670 21999703 22118180 21183160 20746406 20342416
14176 20342416 19859436 19627142 19013801 18762367 18456601 17860674 17576625 16853101 17136779
14167 17136779 16803392 16215006 16165096 15714448 15681850 15101438 14981015 14810103 14451584 14454224
14157 14454224 13712195 13900724 13313630 13366141 12516761 12784047 12806987 12501594 11958474 12002480
14147 12002480 11969422 11977460 11588907 11428749 11247430 10914647 10859112 10687532 10153204 10397600
14137 10397600 10039480 9895131 9768390 9625338 9535045 9495292 9434271 9106418 8750898 8807337
14127 8807337 8787829 8565511 8431380 8256883 8024806 7845118 7880869 7847437 7698970 7999014
$$ packed form
14194C0974009q95756l53369q45013q17523p16027o86708m89508p03461n86805
14185B4879839n62525o95383l45176n73085p03967J18477r35020m36754m03990
14176B0342416m82980k32294o13341k51434l05766n95927k84049p23524K83678
14167A7136779l33387n88386m9910m50648l2598n80412j20423j70912l58519K640
14157A4454224p42029J88529n87094N2511q49380K67286K2940l05393n43120M4006
14147A2002480l3058Q038l88553j60158j81319l32783n5535j71580n34328K44396
14137A0397600l58120j44349j26741j43052r0293l9753o1021l27853l55520N6439
14127H807337j9508k22318j34131j74497k32077j79688L5751l3432j48467L00044
$$ plain form
14117 7999014 7740552 7635448 7493450 7329581 7806568 7057269 7231145 6781158 7046881
14108 7046881 6684138 6411357 6396830 6583339 6450140 6055147 6426163 6100532 6284191 6131004
14098 6131004 6108198 6182927 6148770 5913418 5923180 5804736 5528864 5404156 5430511 5476553 5317422
14087 5317422 4980743 5312448 5247491 5194628 4990426 5276841 5146429 4843970 5175412 4959491
14077 4959491 4592083 4582354 4626602 4595717 4527521 4380562 4765669 4622355 4511208 4134580
14067 4134580 4534410 4210208 4311424 4125458 4357100 4073477 3979422 4063434 4292538 3813336
14057 3813336 3865388 4084117 4012137 3813244 3613600 3629016 3820411 3427950 3608617 3459634
14047 3459634 3426193 3169660 3599294 3373201 3377942 3059176 3335407 3339292 3093338 3066537
$$ packed form
14117G999014k58462j05104j41998j63869M76987p49299J73876m49987K65723
14108G046881l62743k72781j4527J86509j33199l94993L71016l25631J83659j53187
14098F131004k2806P4729l4157k35352R762j18444k75872j24708K6355M6042j59131
14087E317422l36679L31705o4957n2863k04202K86415j30412l02459L31442k15921
14077D959491l67408r729M4248l0885o8196j46959L85107j43314j11147l76628
14067D134580L99830l24202J01216j85966K31642k83623r4055Q4012K29104m79202
14057C813336N2052K18729p1980j98893j99644J5416J91395l92461J80667j48983
14047C459634l3441k56533M29634k26093M741l18766K76231L885k45954k6801
$$ plain form
14037 3066537 3123599 3003771 2968795 2968900 3062080 3406383 2897716 2943359 2769388 3154018 3029651
14026 3029651 3056502 2723893 2633930 2995639 2587188 2669134 2724994 2492315 2478764 2256615
14016 2256615 2456267 2666232 2339066 2806796 2658491 2829607 2580988 2218981 2467532
14007 2467532 2767801 2399227 2267825 2438755 2728582 2643639 2343524 2154304 2044030 2282146
13997 2282146 2701546 2185077 2229253 2195608 2093398 2169635 2979667 3298900 4718629 7139633
13987 7139633 14559018 28093355 37667863 26055151 14351518 9062953 6664697 5171710
13979 5171710 4685714 3564012 3421044 3074958 3098433 3052227 2744354 2776361 2568137 2777538
13969 2777538 2495746 2572534 2215909 2703426 2427076 2332993 2399243 2062949 2007088 1800295
$$ packed form
14037C066537N7062j19828l4976J05R3180L44303n08667M5643j73971L84630j24367
14026C029651K6851l32609q9963L61709m08451Q1946N5860k32679j3551k22149
14016B256615J99652K09965l27166M67730j48305J71116k48619l62007K48551
14007B467532L00269l68574j31402J70930K89827q4943l00115j89220j10274K38116
13997B282146M19400n16469M4176l3645j02210P6237Q10032L19233J419729K421004
13987G139633P419385J3534337R574508j1612712j1703633n288565k398256j492987
13979E171710m85996j121702j42968l46086K3475m6206l07873L2007k08224K09401
13969B777538k81792P6788l56625M87517k76350r4083O6250l36294n5861k06793
$$ plain form
13959 1800295 1932078 2288623 1915011 2105806 1948432 2332177 2190464 1575630 1746107
13950 1746107 1862016 1995063 1877582 2119794 2003474 2181772 1867082 1573472 1836767
13941 1836767 1634258 1750067 2025854 1852326 1714456 1438192 1692742 1754503 2030381 2033143
13931 2033143 1554800 1427900 1908618 1591876 1577812 1405201 1513292 1804974 1507481 1592033
13921 1592033 1533944 1543527 1288275 1376589 1278533 1235204 1749099 1311189 1723021 1548990
13911 1548990 1447580 1170439 1367952 1182591 1350229 1402061 1252178 1023318 1418833 1366600
13901 1366600 1395033 1180680 1307570 1474692 1091333 1269282 1423808 1270339 1455421 1308405
13891 1308405 1353425 1326424 1115843 1339519 1256802 1407484 1502970 1156359 1058082 1088377
$$ packed form
13959A800295J31783L56545l73612J90795j57374L83745j41713o14834J70477
13950A746107J15909J33047j17481K42212j16320J78298l14690k93610K63295
13941A836767k02509J15809K75787j73528j37870k76264K54550O1761K75878K762
13931B033143m78343j26900M80718l16742j4064j72611J08091K91682k97493Q4552
13921A592033n8089R583k55252Q8314r8056m3329N13895m37910M11832j74031
13911A548990j01410k77141J97513j85361J67638N1832j49883k28860L95515n2233
13901A366600K8433k14353J26890J67122l83359J77949J54526j53469J85082j47016
13891A308405M5020k7001k10581K23676q2717J50682R5486l46611r8277L0295
$$ plain form
13881 1088377 1186487 1374785 1322836 1496757 1178504 1093953 1343099 1147534 1448478 1344437
13871 1344437 1040449 1272213 983537 1166926 1020323 1291539 1289628 782038 1170201 1136667
13861 1136667 1235415 784300 1021151 885554 1208730 1088508 890741 945322 1247517 1049859
13851 1049859 1239127 1201144 805612 943045 1283511 1090905 1045994 613049 909270 928140
13841 928140 801976 1047045 1294534 860839 851994 934657 873590 831341 873365 1041978 697391
13830 697391 1085099 845055 833963 1072992 1203183 816760 774957 1054438 774509 810228
13820 810228 658685 928309 611422 821159 767996 855359 507968 785448 956869 804464
13810 804464 842678 888919 901232 619855 999160 824578 818707 415791 999227 894215
$$ packed form
13881A088377R8110J88298n1949J73921l18253q4551K49146j95565L00944j04041
13871A344437l03988K31764k88676J83389j46603K71216j911n07590L88163l3534
13861A136667R8748m51115K36851j35597L23176j20222j97767N4581L02195j97658
13851A049859J89268l7983l95532J37433L40466j92606m4911m32945K96221J8870
13841I28140j26164K45069K47489m33695q845Q2663o1067m2249M2024J68613l44587
13830F97391L87708k40044j1092K39029J30191l86423m1803K79481k79929L5719
13820H10228j51543K69624l16887K09737n3163Q7363l47391K77480J71421j52405
13810H04464L8214M6241J2313k81377L79305j74582n871m02916N83436j05012
$$ plain form
13800 894215 746067 811315 778943 924702 624848 868687 775644 1028604 564586 398017
13790 398017 1018462 851175 833780 453782 708967 1058664 655879 440628 612895 704360
13780 704360 838500 1015414 665163 742314 721558 763507 714796 884124 596861 866513
13770 866513 563040 925415 848679 530663 697273 500177 701304 821850 781022 828603
13760 828603 645967 816901 699336 953580 725546 494244 705646 703975 797708 649455
13750 649455 741962 651285 225458 607454 716853 543972 632595 591191 612975 548297 516005
13739 516005 523695 334830 741604 1040080 443008 491606 322619 514639 458273 771550
13729 771550 703758 628738 438254 782938 511039 456235 616453 792673 330507 626188
$$ packed form
13800H94215j48148O5248l2372J45759k99854K43839r3043K52960m64018j66569
13790C98017O20445j67287j7395l79998K55185L49697m02785k15251J72267R1465
13780G04360J34140J76914l50251P7151k0756M1949m8711J69328k87263K69652
13770H66513l03473L62375p6736l18016J66610j97096K01127J20546m0828M7581
13760H28603j82636J70934j17565K54244k28034k31302K11402j671R3733j48253
13750F49455R2507r0677B25458L81996J09399j72881Q8623m1404K1784o4678l2292
13739E16005P690j88865M06774K98476D43008M8598j68987J92020n6366L13277
13729G71550o7792p5020j90484L44684k71899n4804J60218J76220C30507K95681
$$ plain form
13719 626188 282274 463973 548253 405401 408126 477066 490522 610598 660507 470823 279847
13708 279847 817695 643154 575209 629099 413302 300810 252345 268496 761257 715164
13698 715164 397637 738487 709981 242807 737861 624338 409455 171498 526253 464014
13688 464014 343839 838948 504117 665145 730781 432793 540343 444144 428162 656303
13678 656303 297983 396584 330970 371809 153647 548583 496442 597559 720558 378929
13668 378929 629748 847699 409873 458974 659225 521719 619652 455356 529590 514337
13658 514337 805434 591955 541600 376146 304348 707815 577628 360238 66606 465962
13648 465962 558603 550797 576152 102681 631270 592943 433964 403651 85126 512465 391761
$$ packed form
13719F26188B82274J81699Q4280j42852K725O8940J3456J20076M9909j89684j90976
13708B79847N37848j74541o7945N3890k15797j12492m8465J6151M92761m6093
13698G15164l17527L40850k8506B42807M95054j13523k14883A71498L54755o2239
13688D64014j20175M95109l34831J61028O5636k97988J07550r6199j5982K28141
13678F56303B97983R8601o5614M0839A53647L94936n2141J01117J22999l41629
13668C78929K50819K17951D09873M9101K00251j37506R7933j64296P4234j5253
13658E14337K91097k13479n0355j65454p1798M03467j30187k17390F6606L99356
13648D65962R2641p806K5355A02681N28589l8327j58979l0313H5126M27339j20704
$$ plain form
13637 391761 461077 424038 311950 359181 320896 529369 447145 409717 391557 529571 630244
13626 630244 492159 950514 175227 300325 610601 407611 444575 238196 388101 613386
13616 613386 504063 212079 492208 629639 574887 170296 404446 430038 413006 570712
13606 570712 228818 682268 580917 435143 395425 633716 295587 384219 606878 98972
13595 421627 257531 449171 358720 10503 209748 401121 209434 326778 484867 149557
13584 325129 264073 -155212 190121 419514 154457 298210 596088 341287 355118 145919
13573 251743 393175 367314 385352 485305 182342 53483 521503 184647 337629 521807
13563 521807 551204 574049 605782 247506 75637 85206 117285 409950 511136 400544 376345
$$ packed form
13637C91761O9316l7039j12088M7231l8285K08473q2224l7428j8160J38014J00673
13626F30244j38085M58355A75227J25098L10276k02990L6964k06379J49905K25285
13616F13386j09323B12079K80129J37431n4752A70296K34150K5592j7032J57706
13606E70712B28818M53450j01351j45774l9718K38291B95587Q8632K22659I8972
13595D21627j64096J91640r0451A0503J99245J91373j91687J17344J58089A49557
13584C25129o1056a55212A90121K29393A54457J43753K97878k54801J3831A45919
13573B51743J41432k5861J8038R9953A82342E3483M68020A84647J52982J84178
13563E21807K9397K2845L1733B47506G5637R569L2079K92665J01186j10592k4199
$$ plain form
13552 376345 371261 170119 365591 68466 141218 349521 380583 -4667 229207 201906 221155
13541 221155 301647 179657 124853 157362 369136 98528 154785 348414 404297 26640 327428
13530 327428 494357 442419 76506 297300 786879 69185 528143 186243 340538 317905
13520 317905 700523 96744 151080 452597 396347 210094 224167 -47208 -65413 440001 271120
13509 271120 231747 280304 170982 5788 352656 313903 295343 127576 231688 246 121082
13498 121082 421130 81378 290754 345896 137288 427054 80446 158779 235415 102976
13487 318875 150998 74918 163713 111174 122138 398609 435291 -2319 132710 506578 247811
13475 282090 236389 185419 476739 -65463 430351 27563 229680 485444 238694 568174
$$ packed form
13552C76345n084A70119J95472F8466P2752K08303L1062d667B29207k7301J9249
13541B21155Q0492j21990n4804L2509K11774I8528N6257J93629N5883B6640L00788
13530C27428J66929n1938G6506K20794M89579F9185M58958A86243J54295k2633
13520C17905L82618I6744N4336L01517n6250j86253J4073d7208j8205D40001j68881
13509B71120l9373M8557j09322E788L46868l8753j8560A27576J04112B46J20836
13498A21082L00048H1378K09376N5142A37288K89766H0446P8333P6636A02976
13487C18875A50998G4918Q8795n2539J0964K76471L6682b319A32710L73868B47811
13475B82090m5701n0970K91320f5463D30351B7563K02117K55764B38694L29480
$$ plain form
13465 568174 551504 -86132 395330 215204 236018 335459 23461 303743 267082 217099 551395
13454 551395 284920 201567 208969 334182 262559 202981 269377 138871 116230 348359 151988
13442 509744 477618 397449 356610 393682 456579 93923 -84654 382582 -46317 341256 85279
13430 336973 481270 426860 381802 -8324 484805 360383 189303 281667 -115797 55306 209724
13419 209724 573929 386329 224026 103969 155674 -80883 216155 172861 224448 84101
13408 75424 118818 144665 248110 359843 437518 585254 414751 239118 105032 54852
13398 54852 208575 46455 167203 6926 369006 335123 205712 69160 29597 115243 66535
13387 66535 497293 43102 -7331 -472885 323662 -79030 385215 75916 172350 276508 264331
$$ packed form
13465E68174j6670h6132C95330j80126K0814R9441B3461K80282l6661m9983L34296
13454E51395k66475q3353P402J25213p1623n9578O6396j30506k2641K32129A51988
13442E09744l2126q0169m0839L7072O2897I3923h4654C82582d6317C41256H5279
13430C36973J44297n4410m5058h324D84805j24422j71080R2364a15797E5306J54418
13419B09724L64205j87600j62303A03969N1705h0883B16155m3294N1587H4101
13408G5424M3394K5847J03445J11733P7675J47736j70503j75633A05032n0180
13398E4852J53723D6455J20748F926L62080l3883j29411F9160B9597Q5646m8708
13387F6535M30758D3102g331m65554C23662g9030C85215G5916R6434J04158j2177
$$ plain form
13376 264331 434634 108900 42888 229882 154790 279621 153362 -13779 -174583 -131261
13366 -131261 15524 272324 379136 23863 -217257 174615 488941 215394 287699 162629
13356 162629 145756 415433 -37411 104333 403003 -14450 140101 193447 280586 156963
13346 156963 429591 417527 338658 456570 601530 306135 242260 169576 438529 515277
13336 515277 337911 357243 -124652 350301 39492 210484 425951 324733 -71581 -38820
13326 -38820 35437 167983 467389 16399 304908 66186 100673 161420 68815 21713 72883
13315 72883 86980 69680 -207131 114605 371160 424644 248672 306764 -18 -70427 302612
13303 238364 121985 331861 131405 155761 174230 57069 463505 416075 439873 6854 187369
$$ packed form
13376B64331J70303A08900D2888J86994p5092J24831j26259a3779j60804M3322
13366a31261A5524K56800J06812B3863b17257A74615L14326B15394P2305j25070
13356A62629j6873K69677c7411A04333K98670a4450A40101N3346Q7139j23623
13346A56963K72628j2064p8869J17912J44960k95395o3875p2684K68953P6748
13336E15277j77366J9332a24652C50301C9492J70992K15467j01218g1581L2761
13326c8820C5437J32546K99406A6399K88509F6186L4487O0747F8815B1713N1170
13315G2883J4097j7300b07131A14605K56555N3484j75972N8092a8p0409C02612
13303B38364j16379K09876A31405K4356J8469E7069M06436m7430K3798F854J80515
$$ plain form
13292 187369 -143333 72452 469538 -82554 170560 186868 147006 -8205 251390 238902 -250317
13280 66219 139338 30379 191267 -45145 323833 159940 130749 173711 235161 56857 487900
13269 487900 154645 148717 -47898 16766 49575 1839 395364 32953 303773 157540 -57916
13257 62349 231843 64967 -80335 345168 81108 487893 184866 261346 16609 -74888 -21447
13245 60608 267044 382105 12679 -179937 269530 196724 308736 200825 241696 147887
13235 147887 95261 67803 -36627 -153962 -175209 -183891 132802 205492 968 85653 80866 181578
13223 181578 222196 -346545 166919 -149038 273124 162152 286467 -105651 214297 72203
13212 -175738 12018 218206 -124211 191236 -139552 124226 135985 108275 81748 355264
$$ packed form
13292A87369a43333G2452L97086h2554A70560J6308l9862h205B51390j2488b50317
13280F6219P3119C0379J60888d5145C23833A59940k9191M2962O1450E6857M31043
13269D87900A54645n928d7898A6766L2809A839L93525C2953K70820j46233e7916
13257F2349J69494F4967h0335C45168H1108M06785A84866P6480A6609g4888b1447
13245F0608K06436J15061A2679a79937B69530p2806J12012j07911M0871r3809
13235A47887n2626k7458c6627j17335k1247q682A32802P2690I68Q4685m787J00712
13223A81578M0618c46545A66919a49038B73124j10972J24315a05651B14297G2203
13212a75738A2018K06188a24211A91236a39552A24226J1759k7710k6527K73516
$$ plain form
13202 355264 -15933 375675 68860 -79677 -20416 -78984 193132 10455 -13455 18897 46684
13191 46684 24169 70668 -148815 365410 180582 236769 406323 -198753 475012 267254
13181 267254 126761 59884 21737 275798 226918 -140133 -99573 22480 14455 -4508 77776
13169 97210 398002 433120 348716 -52837 -167184 282665 -37473 -169748 114176 274212
13159 274212 176978 -149382 374715 72467 342432 78880 -59441 311389 -110488 -243441
13149 -243441 -14799 99860 46516 48915 101337 324486 -140619 65520 7383 10925 72791 200166
13137 200166 -140056 3110 -184947 144674 -631300 201766 258699 133032 60735 283468
13127 283468 -98479 199429 130296 -69872 84790 -239077 310422 169204 -225309 -219258 192352
$$ packed form
13202C55264a5933C75675F8860g9677b0416n8568A93132A0455a3455A8897K7787
13191D6684k2515M6499a48815C65410A80582N6187J69554a98753D75012k07758
13181B67254A26761E9884B1737K54061m8880a40133M0560B2480q025d508G7776
13169I7210L00792L5118q4404e2837j14347B82665c7473j32275A14176J60036
13159B74212r7234a49382C74715G2467K69965G8880e9441C11389a10488j32953
13149b43441a4799I9860D6516K399N2422K23149a40619F5520G383L542O1866J27375
13137B00166a40056C110a84947A44674f31300B01766N6933j25667F0735K22733
13127B83468i8479A99429o9133f9872H4790b39077C10422j41218b25309O051A92352
$$ plain form
13115 184611 160360 -11333 217804 277961 191680 -192117 194462 -123423 -116719 207269 1419
13103 152089 -280385 -4507 -273778 -23035 -72255 217378 -222076 -368495 354844 164233
13092 -207063 17518 -135182 -26747 -186472 -436238 -43458 -292676 254152 -268505 -93164
13081 495157 126615 -117348 112477 430125 -69999 52641 -160636 72951 53869 -105529
13070 364857 233822 227306 -1274 75831 240746 122186 295373 -54318 81000 2013 221795
13059 221795 -105746 -12358 165714 152949 144620 44417 -36319 142018 -70510 59359 309589
13048 309589 -252658 109686 -91975 268069 209592 -68873 137844 78027 195625 -213082
13037 42661 82223 -221334 120972 223328 -76807 356100 -88271 24665 87064 56047 14034
$$ packed form
13115A84611k4251a1333B17804O0157q6281a92117A94462a23423O704B07269A419
13103A52089b80385d507k69271b3035m9220B17378b22076j46419C54844A64233
13092b07063A7518a35182b6747j59725k49766d3458k49218B54152b68505i3164
13081D95157A26615a17348A12477L17648f9999E2641a60636G2951j9082a05529
13070C64857j31035o516a274G5831J64915j18560J73187e4318H1000B013K19782
13059B21795a05746a2358A65714j2765q329D4417c6319A42018g0510E9359K50230
13048C09589b52658A09686i1975B68069n8477f8873A37844n9817J17598b13082
13037D2661L9562b21334A20972J02356g6807C56100h8271B4665O2399l1017A4034
$$ plain form
13025 6433 237622 257090 -62205 -199296 23162 332340 -13006 28023 424814 3536 88489
13014 88489 -195026 123421 -35904 297816 203034 -69468 -24051 -13091 -80346 159985 46602
13002 -98710 173399 -195293 -60062 -175941 253229 65346 286851 -64648 -28509 336 338714
12991 338714 -119167 141247 316618 182637 -6330 1364 -38341 68042 231888 103886 397957
12980 397957 -170076 -21674 -13381 -48216 -38872 228129 160433 236004 173727 -145249 209213
12968 144845 -169802 122655 510220 170758 570454 -197231 395646 10772 34965 76637
12958 76637 -268396 -97856 53580 -7828 -187550 -23027 295189 -117557 -202226 -74862 -4849
12946 -187691 189864 -102900 144976 -28469 33378 435021 -132604 106675 114968 -243584
$$ packed form
13025F433K31189J9468f2205j37091B3162L09178a3006B8023L96791C536Q4953
13014H8489a95026A23421c5904B97816r4782f9468b4051J0960o7255A59985D6602
13002i8710A73399a95293f0062j15879B53229F5346K21505f4648b8509C36L38378
12991C38714a19167A41247J75371j33981f330A364c8341F8042J63846A03886K94071
12980C97957a70076b1674Q293l4835R344B28129o7696P5571o2277a45249B09213
12968A44845a69802A22655L87565A70758L99696a97231C95646A0772K4193M1672
12958G6637b68396i7856E3580g828j79722b3027B95189a17557q4669g4862d849
12946a87691A89864a02900A44976b8469C3378M01643a32604A06675Q293b43584
$$ plain form
12935 -337467 280473 21456 71165 232901 -205477 -63391 169762 203496 207506 134211 170175
12924 170175 -95655 -230808 28727 220192 -57842 97413 68389 -45259 175623 114672 96634
12913 96634 100493 309652 218733 228124 2997 -115833 235434 -153064 138952 -37848 -95281
12902 -95281 74560 -16441 -53847 138326 -35807 46174 -165392 -40295 235244 -35365 -114001
12891 -114001 -126829 23817 320028 -154396 131298 389729 -200825 14815 160385 289138
12881 289138 -411192 45245 -109073 -162373 232759 -30844 80753 -163780 176171 50571
12870 296147 -187404 63177 -103624 237893 30674 -228606 -220935 -14756 -36216 -104454 216314
12858 19157 233249 -387483 196548 117798 -40675 17987 -53472 270176 156028 46356 -100379
$$ packed form
12935c37467B80473B1456M9709J61736b05477f3391A69762L3734M010p3295L5964
12924A70175i5655j35153B8727J91465e7842I7413k9024d5259A75623o0951j8038
12913I6634L859K09159r0919R391B997a15833B35434a53064A38952c7848n7433
12902i5281G4560a6441l7406A38326c5807D6174a65392d0295B35244c5365p8636
12891a14001j2828B3817K96211a54396A31298K58431b00825A4815J45570J28753
12881B89138d11192D5245a09073n3300B32759c0844H0753a63780A76171E0571
12870B96147a87404F3177a03624B37893C0674b28606P671a4756k1460o8238B16314
12858A9157K14092c87483A96548p8750d0675A7987e3472B70176j14148D6356a00379
$$ plain form
12846 114725 -8003 -176552 264345 93961 170055 73505 209011 94661 8108 140027 -156709
12834 248002 -7238 -80997 -251591 -396843 -94763 54222 36627 -163390 54599 93061 5186
12822 -188037 217164 -125643 -60316 108308 -180089 186254 12477 114698 -238252 -97101
12811 225820 -87003 -249070 -8306 65744 -140966 -55376 -60089 316314 135473 -130888 -121131
12800 -121131 6880 137479 -30072 179263 -72390 48358 13570 -55596 340667 -87073 63935
12788 502535 -245305 118402 180023 -14644 10483 109123 8266 -424042 -241011 -175312 -91353
12777 -91353 229774 -136605 426172 -115945 -21132 6254 191234 132473 186376 158898 62771
12765 -85735 -333965 -79674 60834 125965 6923 411388 357286 -137885 24790 303946 10284
$$ packed form
12846A14725h003j68549B64345I3961P6094G3505J35506I4661H108J31919a56709
12834B48002g238p3759j70594j45252i4763E4222j7595a63390E4599L8462E186
12822a88037B17164a25643f0316A08308a80089A86254A2477J02221b38252i7101
12811B25820h7003j62067h306F5744a40966e5376m713C16314A35473a30888R757
12800a21131F880J30599c0072A79263g2390D8358A3570e5596C40667h7073F3935
12788E02535b45305A18402O1621a4644A0483R8640H266d24042J83031O5699Q3959
12777i1353B29774a36605D26172a15945b1132F254J84980n8761N3903k7478F2771
12765h5735k48230g9674F0834O5131F923M04465n4102a37885B4790K79156A0284
$$ plain form
12753 -88682 -129356 176940 -137273 -26751 -51796 -238156 15550 30923 75040 -69551 -190130
12742 -190130 -59360 26165 6014 112916 -8745 35568 -171450 -24552 296825 -152769 113134
12730 -89959 -521976 195972 3176 272947 -145745 -144433 14523 -227180 -136565 102118 -65139
12718 23178 -119081 78983 242075 131019 6104 436289 -101606 -42031 -14662 252337 132230
12707 132230 69899 39252 191989 129732 220339 366938 204083 359462 19176 311168
12697 311168 35343 -41733 -96977 182907 400963 -30075 184236 17516 -171570 -235622 26779
12685 -62872 133699 -162741 -289974 64305 120527 100218 2038 -58588 -116761 -9446 231585
12673 289032 -148001 45398 7081 26290 -18550 -124554 -194913 -226915 139170 155010 -282162
$$ packed form
12753h8682m0674A76940a37273b6751k5045j86360A5550J5373M4117f9551j20579
12742a90130e9360B6165F014J06902h745C5568a71450b4552B96825a52769A13134
12730h9959m32017A95972C176K69771a45745J312A4523b27180R0615A02118f5139
12718B3178a19081G8983J63092j11056F104M30185a01606d2031a4662B52337j20107
12707A32230o2331l0647J52737o2257R0607J46599j62855J55379A9176K91992
12697C11168C5343d1733n5244A82907K18056c0075A84236A7516a71570o4052B6779
12685f2872A33699a62741j27233F4305N6222k0309B038e8588n8173i446B31585
12673B89032a48001D5398G081J9209a8550j06004p0359l2002A39170J5840b82162
$$ plain form
12661 374075 205418 319213 -289435 -157742 211211 233756 286958 428509 221740 248736
12651 248736 243541 78637 240790 -174268 -181015 -164987 -65786 13820 120808 113324 134307
12640 134307 348984 6837 52021 -84162 -46473 237974 -28121 132586 -70697 188066 -7518
12628 -56685 -1857 469728 81332 92226 244593 171683 103220 192445 104739 56640 178669
12617 178669 -87192 -112729 78469 152851 -219387 -298334 -142233 70773 91516 207332 -110173
12605 107721 90609 216665 150115 124796 218997 114258 169060 214812 -4444 26350 265412
12594 265412 10876 -3700 134101 119782 -128721 132356 188542 -27792 218223 -53921 -24192
12582 -270420 -34302 -14126 -115517 27661 44350 -166779 -223832 116502 -53306 42019 58180
$$ packed form
12661C74075j68657J13795b89435J31693B11211K2545N3202J41551k06769K6996
12651B48736n195G8637J62153a74268o747J6028f5786A3820J06988p484K0983
12640A34307K14677F837M5184h4162L7689B37974b8121A32586g0697A88066g518
12628e6685a857D69728H1332J0894J52367p2910o8463Q9225q7706m8099J22029
12617A78669h7192k5537G8469P4382b19387p8947a42233G0773K0743J15816a10173
12605A07721j7112J26056o6550k5319R4201j04739N4802M5752d444B6350K39062
12594B65412A0876c700A34101j4319a28721A32356N6186b7792B18223e3921b4192
12582b70420c4302a4126j01391B7661J6689a66779n7053A16502e3306D2019J6161
$$ plain form
12571 58180 63927 -4605 224621 -8942 130101 -182656 293809 142411 39520 147084 -292014
12559 -278017 168847 61757 163262 86997 152118 -91100 -144811 -122118 99410 124527 148975
12548 148975 -42648 8109 136041 173778 -95767 292070 86643 -75182 130999 53030 169836
12537 169836 53274 110928 -105081 -171417 26671 -32238 155785 70397 -160183 117024 113225
12526 113225 -135965 101814 222636 -86962 -271406 -171614 305707 -65783 120091 -38843
12515 141611 38384 -15563 206886 239199 158287 155155 31261 368462 -51467 363056 31504
12503 380863 -107137 -161676 33164 -63911 246211 151285 16277 -20627 -87534 -65635 103152
12491 59361 -314903 -205008 138957 -65084 216416 12827 176613 261826 22867 152815
$$ packed form
12571E8180N747d605B24621h942A30101a82656B93809A42411C9520J07564b92014
12559b78017A68847F1757J01505p6265O5121i1100n3711K2693I9410K5117K4448
12548A48975d2648H109J27932L7737i5767B92070H6643g5182A30999E3030J16806
12537A69836E3274N7654a05081o6336B6671c2238A55785G0397a60183A17024l799
12526A13225a35965A01814J20822h6962j84444R9792C05707f5783A20091c8843
12515A41611C8384a5563B06886L2313q0912l132C1261L37201e1467C63056C1504
12503C80863a07137n4539C3164f3911B46211r4926A6277b0627o6907K1899A03152
12491E9361c14903J09895A38957f5084B16416A2827J63786Q5213B2867J29948
$$ plain form
12481 152815 -138204 79517 -81029 8161 -88527 -210529 -85306 127796 72946 -97533 105267
12469 113782 439725 -228026 -177410 444228 -92290 56145 -47440 -76269 260201 134449
12459 134449 491 -83977 75657 155346 -303657 138485 -364024 353460 45647 203614 -32887
12447 -123171 -84305 48258 209505 286527 302835 153496 97133 164307 355703 89990 -123970
12435 302415 -101662 -164363 -108808 -176520 -150019 127158 121833 594998 217525 130853 197429
12424 197429 -204438 229472 137377 69199 98871 -165268 41127 -167006 -277274 263375
12413 127353 -391479 83344 51617 -397 193240 194949 -750 143454 -31909 32940 -91644 162396
12400 -58449 -334650 -122215 199091 48900 -90074 -197796 -167412 141454 -357987 -198345
$$ packed form
12481A52815a38204G9517h1029H161h8527j22002h5306A27796n4850i7533A05267
12469A13782L25943b28026N0616D44228i2290E6145d7440k8829B60201j25752
12459A34449D91h3977G5657P9689c03657A38485c64024C53460D5647J57967c2887
12447a23171L8866D8258J61247P7022J6308j49339n6363O7174J91396H9990a23970
12435C02415a01662o2701N5555o7712K6501A27158n325M73165B17525q6672O6576
12424A97429b04438B29472r2095o8178K9672a65268D1127a67006j10268B63375
12413A27353c91479H3344l1727c97A93240J709g50A43454c1909C2940i1644A62396
12400e8449k76201a22215A99091D8900i0074j07722L0384A41454c57987J59642
$$ plain form
12390 -198345 30052 -4508 19496 -287797 -13288 339477 -258986 -83609 23625 383118 72929
12378 -49526 215810 -280912 101642 30267 123170 -279162 377562 -150531 -116495 -120683 -253474
12367 -253474 -99577 -156975 -12293 13101 62521 -71223 -200144 -14770 -95828 -313540 -65310
12355 -280056 64719 13573 -124849 251877 115569 -9382 -162439 -75947 246379 -122590
12344 243765 68364 -349796 238897 322580 -155774 -898 51395 84337 303410 -257638 -233638
12333 -233638 28779 -25820 188354 107149 -36811 -262885 125560 151075 123754 -36231 -43503
12322 -43503 -83645 131359 -242632 59276 117372 42251 -80709 -131431 -30172 -194924 -57627
12310 -35544 51858 241550 -139196 -113379 179505 47539 19440 -4248 -87087 -39113 -37601
$$ packed form
12390a98345C0052d508A9496b87797a3288C39477b58986h3609B3625L59493G2929
12378d9526B15810b80912A01642C0267R2903b79162C77562a50531L4036m188j32791
12367b53474i9577n7398a2293A3101M9420g1223j28921a4770q1058k17712f5310
12355b80056F4719A3573a24849B51877A15569i382j53057g5947B46379a22590
12344B43765F8364c49796B38897Q3683a55774h98E1395L2942K19073b57638K4000
12333b33638B8779b5820A88354q1205c6811k26074A25560K5515k7321c6231p272
12322d3503m0142A31359b42632E9276N8096D2251h0709n0722c0172j64752e7627
12310c5544E1858J89692a39196K5817A79505D7539A9440d248q2839c9113J512
$$ plain form
12299 -37601 -71725 58667 152609 -20330 74335 173959 -79922 -38220 -229613 252764 -225904
12287 47307 -125227 -342138 91926 434607 -284172 -58591 -88366 -23687 -7192 -125552 -331735
12276 -331735 322277 -126524 296840 -9271 -214360 -36849 -96960 -32492 -67638 -127721 -47083
12264 -64244 309640 -161148 -214044 80599 23586 -93597 -56148 -88355 -62102 53397 43093
12253 43093 -71299 35129 388795 141427 128228 -295107 -256646 316918 379790 54887 338025
12242 338025 -138711 -2730 9870 -9487 96153 94865 94994 152883 224695 -7739 132865 118810
12230 118810 185033 246864 140138 15028 -6047 559234 -36967 242183 314504 212877 54106
12218 211676 289206 -5802 -157282 86467 322365 220302 -25027 -229054 75471 184335 448358
$$ packed form
12299c7601l4124E8667R3942b0330G4335R9624g9922c8220j91393B52764b25904
12287D7307a25227k16911I1926L42681b84172e8591k9775b3687g192j18360k06183
12276c31735C22277a26524B96840i271k05089c6849o0111c2492l5146o0083d7083
12264f4244C09640a61148n2896H0599B3586i3597L7449l2207K6253E3397j0304
12253D3093g1299C5129L53666A41427j3199b95107L8461C16918O2872E4887K83138
12242C38025a38711b730I870i487I6153j288J29N7889P1812g739A32865j4055
12230A18810O6223O1831j06726A5028f047E59234c6967B42183P2321j01627E4106
12218B11676P7530e802j51480H6467K35898j02063b5027k04027G5471J08864K64023
$$ plain form
12207 448358 124008 284304 204220 199367 88834 349302 113904 576707 98801 103383 502269
12196 502269 34604 80081 185065 -144087 522303 55041 97370 1345 63776 138920 42407
12184 221569 180401 167155 152909 99412 182861 -327100 168168 -5731 175105 -48343 239450
12172 94853 -4999 4930 -165745 -172159 210416 -33837 -4011 336893 257746 61410 186675 291116
12160 291116 182223 227192 -96493 -171040 525871 -333033 -12590 295604 167870 210801
12150 210801 -36432 -292637 -42485 12487 -125000 530339 149292 -157987 31863 91515
12140 91515 -154273 26456 -117726 242483 -129044 266619 267304 41370 94015 -350894 78199
12128 36246 30638 40244 -49409 121734 124353 64215 -295650 390369 -94391 -111133 18658 180671
$$ packed form
12207D48358A24008J60296q0084m853H8834K60468A13904M62803I8801M582L98886
12196E02269C4604M5477J04984a44087E22303E5041M2329A345O2431P5144D2407
12184B21569m1168j3246j4246n3497Q3449c27100A68168e731A75105d8343B39450
12172I4853d999D930a65745o414B10416c3837d011C36893p9147F1410J25265J04441
12160B91116j08893M4969i6493p4547E25871c33033a2590B95604j27734M2931
12150B10801c6432k56205d2485A2487a25000E30339A49292a57987C1863N9652
12140I1515a54273B6456a17726B42483a29044B66619O85D1370N2645c50894G8199
12128C6246n608R606d9409A21734K619o0138b95650C90369i4391j6742A8658J62013
$$ plain form
12116 180671 75013 90614 6773 90489 181301 -118837 155191 319657 -54506 -277688 -50181
12104 95363 17569 196432 -146785 -86363 260230 312262 -202491 -81740 253 39865 217640
12093 217640 340574 -77119 189146 163086 164563 98803 117846 -116766 -146573 45021 -222321
12081 -144075 110075 183231 -437142 -21040 126919 -151292 178108 -186229 -123402 23930
12070 -7284 58056 109668 141043 158443 17437 -5868 -8632 -103582 -317984 357414 -200616 146451
12057 -297436 191572 221424 78330 436313 1007675 877194 427526 151244 -320414 113534
12046 56299 -206249 237974 -277980 107286 57744 -221862 -344894 10481 166904 -156852
12035 -191472 -18914 -317401 -2259 -168017 52455 -123091 -94397 153723 41629 12534 37778
$$ packed form
12116A80671G5013J5601F773Q3716R0812a18837A55191J64466e4506k23182e0181
12104I5363A7569J78863a46785O0422B60230N2032b02491h1740B53L9612J77775
12093B17640J22934g7119A89146k6060J477o5760J9043a16766k9807D5021b22321
12081a44075A10075P3156d37142b1040A26919a51292A78108a86229O2827B3930
12070g284E8056N1612L1375J7400A7437e868k764r4950k14402C57414b00616A46451
12057b97436A91572K9852G8330L57983N71362j30481D27526A51244c20414A13534
12046E6299b06249B37974b77980A07286m9542b21862j23032A0481J56423a56852
12035a91472a8914k98487b259j65758E2455a23091K8694A53723D1629A2534K5244
$$ plain form
12024 37778 -98326 -205547 -29121 263088 -75547 -271822 196927 -430729 -234284 143101
12013 222689 -235864 158121 -11704 -221005 160913 -3705 -49795 252620 -144555 -64608
12002 -69791 276961 -206817 183874 22277 -83110 79329 109177 -142477 68095 -2342 140432
11990 61707 -275662 -72333 -101600 144947 1088 97632 -164906 238821 67688 -76755 -107412
11979 -107412 119513 -39836 -19521 69577 -195940 -39806 -127465 -50898 107674 -315754 -41186
11967 176958 196517 94717 -118582 -304915 -7116 -127639 -174315 50748 -5544 137787 21185
11955 -19798 -97344 -229504 -306494 154921 10304 56365 499927 -125731 -118980 -133016 -27110
11943 -160686 135260 -229255 -57966 -25079 -7485 -109511 -91138 -17342 -408087 -299268 -291470
$$ packed form
12024C7778i8326j07221b9121B63088g5547j96275A96927d30729J96445A43101
12013B22689b35864A58121a1704k09301A60913c705m6090B52620a44555f4608
12002f9791B76961b06817A83874B2277h3110G9329K9848a42477F8095b342A40432
11990F1707b75662g2333k9267A44947A088R6544a64906B38821F7688g6755l0657
11979a07412A19513c9836a9521F9577a95940c9806q7659e0898A07674c15754d1186
11967A76958J9559I4717a18582j86333g116j20523m6676E0748e544A37787B1185
11955a9798p7546j32160p6990A54921A0304M6061M43562a25731O751j4036b7110
11943a60686A35260b29255e7966b5079g485j02026J8373a7342l90745J08819P798
$$ plain form
11932 -291470 263293 210918 -25378 70012 -71058 -6131 269102 -103284 -252934 -81950 -370545
11921 -370545 -31016 50073 -61601 32095 -244110 -22931 -340566 444378 -209165 -213043 37335
11909 24875 -107949 -46463 197425 -49028 -80943 81253 9559 153780 351518 80184 -76639
11897 -136526 35027 -78356 21783 -152826 -426121 -278185 211566 -163947 202421 79463
11886 42976 -10831 -86048 92214 -102036 158975 6418 -30963 -379331 -129355 -183326 -41613
11874 18572 133039 -298578 58647 216065 -142077 -164289 35188 75665 -64610 -140794 54071
11862 -194248 -64874 4928 13253 -51020 -36712 -61829 44650 128448 -276328 70237 14238 39783
11850 39783 60668 108185 -231205 74473 -214062 55394 -46229 -123486 -72519 -215718 -21781
$$ packed form
11932b91470B63293n2375b5378G0012g1058f131B69102a03284j49650h1950k88595
11921c70545c1016E0073f1601C2095b44110b2931l17635D44378b09165l878C7335
11909B4875a07949d6463A97425d9028l1915H1253I559J44221J97738H0184g6639
11897a36526C5027g8356B1783a52826k73295J47936B11566a63947B02421G9463
11886D2976a0831p5217I2214a02036A58975F418c0963l48368a29355n3971d1613
11874A8572J14467b98578E8647J57418a42077k2212C5188M0477f4610p6184E4071
11862a94248f4874D928Q325e1020J4308k5117D4650Q3798b76328G0237A4238K5545
11850C9783K0885M7517b31205G4473b14062E5394d6229p7257N0967j43199b1781
$$ plain form
11838 -223923 71843 112039 -18219 -139075 -120283 125798 68250 -132991 -262298 -121086
11827 44631 -161330 -316863 -71317 -34566 -71768 199568 3084 189620 -4828 -29332 133530
11815 -29598 167496 206423 45672 -407212 -4777 82158 -60974 154307 -37137 162883 198280
11804 198280 14875 110910 -55887 25971 284897 -206842 -176103 251388 85609 44362 155268
11793 155268 -86620 34194 -420427 187866 95781 -144760 -931 242280 -28400 100521 -231868
11781 292396 79738 53721 349270 16151 147845 178342 -199315 65209 -139903 -52698 -355197
11770 -355197 170803 -140428 -62946 135652 125604 -28101 104203 -70021 62411 91290 184278
11759 184278 248957 -33727 -133300 -14652 -88055 -140818 156473 61113 38857 -172747 169843
$$ packed form
11838b23923G1843M0196a8219j20856J8792A25798n7548a32991j29307a21086
11827D4631a61330j55533g1317c4566l7202A99568C084J86536d828k4504A33530
11815b9598A67496L8927D5672d07212d777H2158f0974A54307c7137A62883L5397
11804A98280A4875R6035e5887B5971K58926b06842L0739B51388H5609m1247J10906
11793A55268h6620C4194d20427A87866r2085a44760i31B42280b8400A00521b31868
11781B92396G9738k6017K95549A6151J31694L0497a99315F5209a39903e2698l02499
11770c55197A70803a40428f2946A35652j0048b8101A04203g0021F2411K8879R2988
11759A84278O4679c3727r9573a4652p3403n2763A56473F1113k2256a72747A69843
$$ plain form
11747 37517 -117355 -73351 -13081 99138 -248168 -216405 -203725 -274574 -2364 155556 -71232
11735 -74126 -147902 -337337 -73079 53391 195992 -123184 247117 215607 -43309 240867 92782
11723 236205 -212579 -39466 -91408 103940 -60187 -75990 74611 140646 -322206 -17356 -129668
11712 -129668 262248 -122427 -90856 -170565 -52824 112891 -520498 -17168 -198826 -97938
11701 -55048 102720 -204467 -209456 -578 260720 339791 219427 -251980 -181140 -23472 -358440
11690 -358440 -31293 -34201 172412 -160980 -113810 90950 -89812 358108 201885 -39824 97678
11678 -86848 -57972 -167461 -47310 389612 26520 -153981 41550 151474 415562 -60531 194338
11666 -153538 90186 29282 -29810 126494 84448 113410 -121961 243036 -41596 227034 106079
$$ packed form
11747C7517a17355M4004a3081I9138b48168L1763J2680p0849b364A55556g1232
11735g4126p3776j89435g3079E3391J42601a23184B47117l1510d3309B40867I2782
11723B36205b12579c9466n1942A03940f0187j5803G4611O6035c22206a7356j12312
11712a29668B62248a22427L1571p9709e2824A12891e20498a7168j81658i7938
11701e5048A02720b04467m989e78B60720P9071j20364b51980P0840b3472l34968
11690c58440c1293k908A72412a60980M7170I0950h9812C58108j56223c9824I7678
11678h6848K8876j09489d7310C89612B6520a53981D1550J09924K64088f0531A94338
11666a53538I0186B9282b9810A26494m2046K8962a21961B43036d1596B27034A06079
$$ plain form
11654 38648 31486 -61583 -61255 157938 -171510 13291 147247 -14235 219679 -172841 -163661
11643 -163661 -29790 -6432 -236183 175818 -83175 -29186 -9141 -81099 -166745 46432 -22850
11631 -161372 -155940 -54065 -322832 -252116 33493 211379 -150611 162724 70544 226516 53592
11619 -275620 119924 136534 57802 117952 -242722 -284876 -329775 462765 -12494 -18743 -98712
11608 -98712 118368 207673 -328138 345251 -82850 21021 -144143 48438 -122928 46249 287193
11597 287193 141557 -102403 -281926 272607 65569 -325061 235928 -124726 522 190327
11587 190327 49083 54288 478971 -303736 174798 -200717 6333 51638 -115309 83660 -300480
11575 114450 44870 -187271 -159379 -72204 196741 -36885 -380140 -3164 282962 152069 7216
$$ packed form
11654C8648p162f1583L28A57938a71510A3291J33956a4235B19679a72841R180
11643a63661b9790f432k29751A75818h3175b9186i141p1958q5646D6432b2850
11631a61372N432e4065k68767P0716C3493J77886a50611A62724G0544J55972E3592
11619b75620A19924J6610E7802O0150b42722m2154m4899D62765a2494o249p9969
11608i8712A18368Q9305c28138C45251h2850B1021a44143D8438a22928D6249K40944
11597B87193A41557a02403j79523B72607F5569c25061B35928a24726E22J89805
11587A90327D9083N205M24683c03736A74798b00717F333M5305a15309H3660c00480
11575A14450D4870a87271K7892g2204A96741c6885l43255c164B82962j30893G216
$$ plain form
11563 172639 110674 218301 257812 483303 -53964 -11549 97507 -280879 -39278 -168628 46846
11551 -10014 -85579 -76802 -24040 108316 -276244 128360 107163 -17737 -28076 153022 152030
11540 152030 -74907 -15280 206608 43384 -1087 -62951 3291 257013 66182 18602 170642
11529 170642 203462 -100265 -124292 278566 37840 -156877 287332 121603 119183 54915 -49969
11517 21635 -307621 -119456 -208759 1328 149249 234699 104758 -197592 208618 163400 -187072
11505 89195 63914 360600 6817 219540 366913 317807 77270 191685 255391 20576 111234
11494 111234 62539 -429215 -203074 25184 94993 179444 87149 284634 189691 70019 179548
11483 179548 144690 178394 -32479 209663 115944 96668 198770 -84023 -7100 138742 -328152
$$ packed form
11563A72639o1965J07627L9511K25491e3964a1549I7507b80879c9278j29350D6846
11551a0014p5565Q777b4040A08316b76244A28360k1197a7737j0339A53022r92
11540A52030g4907a5280B06608D3384a087o1864C291K53722F6182A8602J52040
11529A70642L2820a00265k4027B78566C7840a56877B87332A21603k420E4915d9969
11517B1635c07621a19456q9303A328J47921Q5450A04758a97592B08618m5218a87072
11505H9195k5281K96686F817K12723J47373m9106G7270J14415O3706B0576R0658
11494A11234m8695d29215b03074B5184O9809Q4451H7149J97485r4943G0019J09529
11483A79548l4858L3704c2479B09663r3719j9276J02102h4023g100A38742c28152
$$ plain form
11471 140356 297921 353910 194502 241115 263160 -100840 96789 185901 51667 180134 107866
11460 107866 115909 215070 47071 141351 -198895 159191 -136609 -49190 88181 -10232 253340
11448 447846 -278893 -232270 24786 -184069 8834 81512 86474 -52852 202674 87594 -207133
11436 -58439 -67769 -35498 162525 110613 6975 32514 9723 -196855 -113190 -141057 134038 137028
11424 137028 157237 -225586 102857 -193000 55295 75656 -359558 88441 -34441 246453
11413 -390650 12630 -16167 84200 77409 48566 -266375 -38581 12277 -90153 -351106 -95811
11401 -158611 -121625 9659 -66433 -171522 28953 118375 148015 10366 63128 -59238 9164 -267176
11388 139999 52198 323068 -263735 206009 -28334 246046 -279410 -152996 27276 -295434
$$ packed form
11471A40356J57565N5989j59408M6613K2045a00840I6789Q9112E1667J28467p2268
11460A07866Q043R9161D7071R4280a98895A59191a36609d9190H8181a0232B53340
11448D47846b78893M6623B4786a84069H834P2678M962e2852B02674H7594b07133
11436e8439r330L2271A62525n1912F975K5539I723a96855Q3665k7867A34038K990
11424A37028K0209b25586A02857a93000E5295K0361c59558H8441c4441B46453
11413c90650A2630a6167H4200o791k8843b66375c8581A2277i0153k60953i5811
11401a58611L6986I659f6433j05089B8953Q9422K9640A0366N2762e9238I164b67176
11388A39999E2198K70870b63735B06009b8334B46046b79410J26414B7276b95434
$$ plain form
11377 32480 -98356 398979 -133341 -183811 65245 -172378 -92385 -309091 -5919 86965 -119375
11365 -28379 -28580 41982 46143 -189045 -53009 -51946 -187590 -353876 -204466 -206776 5981 146036
11353 146036 145873 -55164 40477 -70881 -468751 22280 -204516 107962 -209396 62299 69454
11342 69454 11643 -272436 -45544 177827 -53938 -202010 2217 -35386 -182043 -327110 -139530
11330 80465 454651 -312511 60973 93658 384050 12469 -69706 -1294 156881 -215145 -76610
11318 198058 -195301 119613 110352 -61989 -188576 145434 332136 284880 121905 -66123
11307 -138348 -4912 -55800 -186113 -88120 -11589 -46825 113225 -133249 -139339 -99445 -130115
11296 -130115 -155709 -14584 30802 57448 -54663 -198511 100819 -273081 -258585 5224 -160220
$$ packed form
11377C2480i8356C98979a33341n0470F5245a72378P9993k16706e919H6965a19375
11365b8379k01D1982M161a89045e3009J063j35644j66286J49410k310E981J40055
11353A46036j63e5164D0477g0881l97870B2280b04516A07962b09396F2299P155
11342F9454A1643b72436d5544A77827e3938j48072B217c5386j46657j45067a39530
11330H0465L74186c12511F0973L2685K90392A2469f9706a294A56881b15145g6610
11318A98058a95301A19613r261f1989j26587A45434J86702m7256A21905f6123
11307a38348d912n0888j30313h8120a1589l5236A13225a33249o090L9894l0670
11296a30115k5594a4584C0802K6646e4663j43848A00819b73081J4496E224a60220
$$ plain form
11284 -284623 327660 209258 68845 64565 261519 -61181 -128786 63440 119116 258234 -7830
11272 -157538 -157694 44009 -375129 -201585 154692 -291716 -21569 131998 86459 209175 -276184
11260 -177967 -32690 78315 56560 -450494 70521 497323 125039 -29048 58948 101591 393053
11249 393053 69914 -134812 -162233 -264066 -104569 156730 -128699 -240821 -71296 24330
11238 -171201 -267586 -164617 4407 127086 -96386 -56012 -12663 -151977 259363 68094 -56986
11226 1757 -472042 2046 137599 -58807 60719 421253 69406 -377958 -154266 333406 -70572
11214 -3469 60572 132959 -9469 221376 -292781 45544 -102460 101906 -89454 -175863 -78226
11202 182947 -196669 -178757 -112383 -367221 58395 -331678 -64672 -113276 -61005 145783 -79283
$$ packed form
11284b84623C27660j18402F8845m280J96954f1181o7605F3440N5676J39118g830
11272a57538j56D4009c75129J73544A54692b91716b1569A31998m5539J22716b76184
11260a77967c2690G8315k1755d50494G0521M26802A25039b9048E8948M2643K91462
11249C93053F9914a34812k7421j01833a04569A56730a28699j12122g1296B4330
11238a71201r6385J02969D407J22679i6386M0374a2663j39314B59363F8094e6986
11226A757d72042B046J35553e8807F0719L60534F9406c77958a54266C33406g0572
11214c469F0572P2387i469B21376b92781D5544a02460A01906h9454q6409g8226
11202A82947a96669J7912O6374k54838E8395c31678f4672m8604N2271A45783g9283
$$ plain form
11190 167378 -138184 4326 -339200 31304 -198389 -158053 -71436 -65843 -135544 -15827 -5158
11178 -63265 95154 13769 37471 34760 -90695 133689 52344 7445 -154006 -75904 -301378
11167 -301378 -325272 -185249 -31611 -448629 121222 64020 -15928 242402 -281135 27589
11156 -211448 -30833 -151132 238161 -185150 -188104 -344314 26679 -67105 251207 53306 -58386
11144 -30605 -111474 -10497 572455 -27610 188971 -334583 51208 23466 52867 -56790 117342
11132 106317 180104 83222 146866 -97628 238164 -56087 -149881 -202043 -68480 -314096 276484
11120 -73584 -228844 163697 366411 90849 69572 -164158 -923 -139634 14776 -232331 42566
11108 41550 81742 -78528 -157342 154858 -76228 52282 231152 64280 45143 206796 296099
$$ packed form
11190A67378a38184D326c39200C1304a98389M0336g1436N593o9701a5827e158
11178f3265I5154A3769K3702k711i0695A33689E2344G445a54006g5904k25474
11167c01378k3894J40023c1611m17018A21222n7202a5928B42402b81135B7589
11156b11448c0833j20299B38161a85150k954j56210B6679f7105B51207E3306e8386
11144c0605q0869a0497E72455b7610A88971c34583E1208B3466K9401e6790A17342
11132A06317P3787H3222O3644i7628B38164e6087r3794n2162f8480k45616B76484
11120g3584j55260A63697K02714I0849k1277a64158i23j38711A4776b32331D2566
11108D1550M0192g8528p8814A54858g6228E2282J78870F4280j9137J61653Q9303
$$ plain form
11097 296099 46846 -126299 200196 -205578 58290 324215 124967 234489 264065 27710
11086 448262 290757 343413 156752 251697 297610 307191 315585 43914 -18254 -44833 458965
11074 56930 -147598 427611 385483 118992 159619 218756 347944 329255 289873 397695 311918
11063 311918 276899 40968 335880 417785 541550 242186 508161 557882 304749 834492
11053 834492 514859 693065 826079 636172 574201 635301 556038 383360 615126 645469
11043 645469 647696 692047 590740 466586 382701 542791 773440 635544 553509 713632
11033 713632 631640 511136 656661 285176 584767 597948 667500 749946 563159 748903
11023 748903 609372 483995 491471 577115 527613 531906 674459 119479 437718 215795 528534
$$ packed form
11097B96099D6846a26299B00196b05578E8290K65925A24967J09522K9576B7710
11086D48262j57505N2656A56752R4945M5913R581Q394D3914a8254k6579D58965
11074E6930a47598D27611m2128A18992M0627N9137J29188j8689l9382J07822q5777
11063C11918l5019D0968K94912Q1905J23765B42186K65975M9721k53133N29743
11053H34492l19633J78206J33014j89907o1971O1100p9263j72678K31766L0343
11043F45469K227M4351j01307j24154q3885J60090K30649j37896q2035J60123
11033G13632q1992j20504J45525B85176K99591J3181O9552Q2446j86787J85744
11023G48903j39531j25377P476Q5644m9502M293J42553A19479L18239B15795L12739
$$ plain form
11012 528534 276196 387492 567598 582097 629813 180248 612513 405426 602427 901725
11002 901725 837238 594554 727511 561003 563408 464166 754681 618428 683671 841203
10992 841203 875494 489660 606644 412141 722199 910631 663415 834812 1088432 981865
10982 981865 1191633 914276 832617 1123584 1423976 1560908 1567853 1683506 1808644 2190538
10972 2190538 2266566 2532901 2311731 2479400 2403096 1852104 1566012 1604914 1376173 1192873
10962 1192873 1289505 909928 910595 977840 1130486 1000397 931314 1074298 837040 775991 1064139
10951 1064139 334372 485297 305726 419198 230639 380176 368912 236464 -233462 494959
10940 54067 125707 881 206752 231265 162107 273382 299241 27772 213469 145473 97711
$$ packed form
11012E28534k52338J11296J80106J4499M7716A80248M32265k07087J97001K99298
11002I01725o4487k42684J32957j66508K405r9242K90515j36253O5243J57532
10992H41203L4291l85834J16984j94503L10058J88432k47216J71397K53620j06567
10982I81865K09768k77357q1659K90967L00392J36932O945J15653J25138L81894
10972B190538P6028K66335k21170J67669p6304n50992k86092L8902k28741j83300
10962A192873R6632l79577O67O7245J52646j30089o9083J42984k37258o1049K88148
10951A064139C34372J50925j79571J13472j88559J49537j1264j32448b33462D94959
10940E4067P1640H81K05871K4513o9158J11275K5859B7772J85697o7996m7762
$$ plain form
10929 97711 -104506 -62715 70544 -173713 -208243 -211071 -110520 300457 1734 -35612 -175630
10918 -175630 296209 96033 19534 264798 81620 -167113 -39276 -354161 84838 302500
10908 302500 -295140 -181875 101950 540029 180995 -22500 311326 -125013 -11074 -145393
10898 -145393 -252545 -40670 -72603 194979 12221 -207601 -203030 -234737 13918 -216749 -53247
10886 -42287 -325857 28211 -141063 -105646 132840 226017 -203323 193418 267281 -300795
10875 -160345 -266018 256808 -25409 -242210 -134732 -126790 -209271 -95639 -27107 -27494 53366
10863 -256198 358768 261460 38534 -48401 57546 -125631 -82919 -128767 82139 62081 192398
10852 192398 -254212 11368 -69254 -200768 -5421 -38417 248202 68777 -186981 -41527 -145628
$$ packed form
10929I7711a04506M1791G0544a73713l4530k828J00551C00457A734c5612j40018
10918a75630B96209I6033A9534K45264H1620a67113c9276l14885H4838K17662
10908C02500b95140J13265A01950M38079A80995b2500C11326a25013a1074j34319
10898a45393j07152d0670l1933A94979A2221b07601M571l1707A3918b16749e3247
10886d2287k83570B8211a41063L5417A32840R3177b03323A93418P3863c00795
10875a60345j05673B56808b5409k16801J07478P942q2481i5639b7107l87E3366
10863b56198C58768r7308C8534d8401E7546a25631M2712m5848H2139k0058J30317
10852A92398b54212A1368f9254j31514e421l2996B48202F8777a86981d1527j04101
$$ plain form
10841 -145628 61363 -213280 184347 -425451 -235754 -240089 253429 -352331 -176869 80611
10830 24631 112032 43980 91335 354037 93233 -43187 60725 218228 10597 -162080 -76925
10818 -360346 204282 -241683 199959 -3371 237678 -181995 45055 211857 -600738 198214
10807 -32620 -473683 236443 30014 -310460 -8017 30026 -83331 -36571 -26128 -45460 87439
10795 16744 -115907 -8131 -108155 75072 -291944 35779 18644 -25455 213082 -85898 -301069
10784 -301069 87965 -45422 -121566 40699 -251267 -19974 -15531 -494405 165732 -220271 11739
10772 28639 114353 -393975 -142600 -30442 45914 10930 -121326 -41942 -113045 -230232 362419
10760 -27723 -53636 -141653 144248 -140314 -53338 -2460 105711 -423196 332312 -98647 50969
$$ packed form
10841a45628F1363b13280A84347d25451J89697m335B53429c52331J75462H0611
10830B4631Q7401D3980M7355K62702I3233d3187F0725J57503A0597a62080g6925
10818c60346B04282b41683A99959c371B37678a81995D5055J66802f00738A98214
10807c2620m41063B36443C0014c10460h017C0026h3331c6571J0443j9332H7439
10795A6744a15907h131j00024G5072b91944C5779j7135b5455B13082h5898k15171
10784c01069H7965d5422p6144D0699b51267a9974M443m78874A65732b20271A1739
10772B8639Q5714c93975a42600c0442D5914A0930a21326d1942p1103j17187C62419
10760b7723k5913q8017A44248a40314e3338b460A05711d23196C32312i8647E0969
$$ plain form
10748 50854 -87464 -78130 246008 -223335 -66929 -141554 -33173 152859 220677 201619 -130056
10736 108860 164532 43203 -134046 -155521 -312647 114021 218228 21150 -309460 -255024
10726 -255024 -29912 -456452 -70431 -127463 -557337 123676 309404 -68693 -418873 -172455
10715 -9126 60097 -40419 302458 153870 161696 -26942 232816 -425595 -295910 -275233 421618
10703 -259324 91034 281580 -36436 3232 247733 -16688 -39534 -104256 200926 -187762 7893
10691 135515 233048 201485 -368690 -156357 -18797 -326 -112106 78453 -19249 -133442 -42976
10679 158835 32276 24893 97837 -29611 200311 333942 25388 20076 -243970 -31674 115531
10667 -185902 9840 -289282 -430459 163065 -114285 -5664 -403570 -177020 -90834 -295438
$$ packed form
10748E0854h7464R334B46008b23335f6929p4625c3173A52859O7818j9058a30056
10736A08860N5672D3203a34046k1475j57126A14021J04207B1150c09460N4436
10726b55024b9912m26540g0431n7032m29874A23676J85728f8693l50180a72455
10715i126F0097d0419C02458j48588P826b6942B32816d25595J29685K0677D21618
10703b59324I1034J90546c6436C232K44501a6688k2846o4722B00926a87762G893
10691A35515R7533l1563c68690a56357a8797c26j11780G8453a9249j14193d2976
10679A58835C2276p383P2944b9611B00311J33631B5388n312b43970c1674A15531
10667a85902I840b89282j41177A63065a14285e664l97906a77020Q6186k04604
$$ plain form
10657 -295438 -368332 -143257 -68592 -17129 86088 13766 99675 -127695 129975 126985 241942
10646 241942 173727 -191129 -257071 74718 165099 -22956 5484 314784 -64551 -121107 -55488
10634 287724 -44646 51843 -178276 -48175 -155200 -184139 48638 -14268 -318924 -207661 -157374
10623 -157374 -765 9687 100826 91820 -154021 12838 -10328 -54312 -102351 -124094 23546 -1539
10610 -30116 -20795 -139583 -76113 121666 164963 -25911 220868 -580603 48453 -131529 -84563
10599 -84563 118734 41986 91451 15608 -320933 132828 -64204 -277150 156169 -411859
10588 -148730 -251554 196625 -33203 -50354 272835 -66007 -54583 -76081 -70328 -145424 129507
10576 91234 -146864 -26484 147391 -227606 -396062 -170436 19587 99444 149101 -49623 84283
$$ packed form
10657b95438p2894a43257f8592a7129H6088A3766Q5909a27695A29975k990J14957
10646B41942o8215a91129o5942G4718R0381b2956E484L09300f4551n6556e5488
10634B87724d4646E1843a78276d8175j07025k8939D8638a4268l04656J11263N0287
10623a57374g65I687R1139r006a54021A2838a0328m3984m8039k1743B3546a539
10610c0116R321j18788O3470A21666M3297b5911B20868e80603D8453a31529M6966
10599h4563A18734D1986M9465A5608c20933A32828f4204k12946A56169d11859
10588a48730j02824A96625c3203j7151B72835f6007J1424k1498N753p5096A29507
10576I1234a46864b6484A47391b27606j68456a70436A9587P9857M9657d9623H4283
$$ plain form
10564 -194206 222940 -30657 -327194 -286116 92584 80641 160540 -58564 -269437 -167628 90925
10552 -180111 -39809 -310723 -182508 11870 -195257 100885 -338143 -94033 156853 60911
10541 236102 -68280 174915 70443 -313094 -21432 38241 -16377 80446 32398 -217679 186596
10529 46017 -111227 -318812 146182 30908 -65717 -81635 -131078 104263 90594 97856 -183581
10517 -248677 31902 2584 346620 -189218 -37039 133024 163863 -31891 79128 -233485 60412
10505 -107164 -141598 -167792 2293 -326506 59350 -38725 147481 -36779 102415 48712 -170587
10493 -203261 -94299 16630 -89038 -451561 -167128 -2764 -7472 -596 267159 -136889 -142427 -225933
10481 -225933 88512 460951 277416 376472 151551 295058 -114620 -79277 29302 86134
$$ packed form
10564a94206B22940c0657k96537M1078I2584j1943P9899e8564k10873J01809I0925
10552a80111c9809k70914J28215A1870a95257A00885c38143i4033A56853F0911
10541B36102f8280A74915G0443c13094b1432C8241a6377H0446C2398b17679A86596
10529D6017a11227k07585A46182C0908f5717j5918m9443A04263j3669P262a83581
10517b48677C1902B584L44036a89218c7039A33024L0839c1891G9128b33485F0412
10505a07164l4434k6194B293c26506E9350c8725A47481c6779A02415D8712a70587
10493b03261i4299A6630h9038l62523a67128b764m708e96B67159a36889n538q3506
10481b25933H8512L72439j83535R9056A51551J43507a14620L5343B9302N6832
$$ plain form
10471 86134 -11080 155539 -116385 133339 -198687 -192029 6727 109993 -293210 152178 53843
10459 -60615 39469 -328053 -220224 -377746 107305 193744 -4000 51596 -146699 -19133 -208436
10448 -208436 -241399 252241 -114391 -202151 2400 192209 79563 72752 129957 274448 -177289
10436 -104985 -114156 -145365 108148 -58189 69755 169696 366280 17943 132703 -192835 11558
10424 -96743 -14696 -150413 317523 168774 -86175 -190574 -28440 -79603 331598 -8692 212433
10412 -86971 112669 -202889 -144203 -219348 -151513 106435 126166 -90410 -125995 31532 -25926
10400 -87209 -78217 137460 -356674 86868 71457 -226194 288566 177202 -75327 132911 99119
10389 99119 231427 98275 -74936 356308 53095 48080 -136908 -156487 -277470 -10733 118332
$$ packed form
10471H6134a1080A55539a16385A33339a98687O658F727J03266b93210A52178E3843
10459f0615C9469c28053J07829j57522A07305Q6439d000E1596a46699a9133j89303
10448b08436l2963B52241a14391q7760B400J89809G9563o811N7205J44491a77289
10436a04985r171l1209A08148e8189F9755R9941J96584A7943J14760a92835A1558
10424i6743a4696j35717C17523j48749h6175j04399b8440n1163C31598h692B12433
10412h6971A12669b02889N8686p5145O7835A06435J9731i0410l5585C1532b5926
10400h7209Q992A37460c56674H6868j5411b26194B88566j11364g5327A32911l3792
10389I9119J32308I8275g4936C56308E3095n015a36908j9579j20983a0733A18332
$$ plain form
10377 -65491 243633 360976 330877 219472 80932 257246 213851 536236 319117 134075
10366 416870 318002 456556 318536 194773 541256 71257 -29840 -43583 284463 -137207
10355 139570 215548 152556 119582 103358 352334 642293 518067 16254 292515 -142066
10344 206517 91926 32958 224006 18920 89532 -84389 223547 148810 127498 153956 33651
10332 -90499 191529 -140088 133997 -87925 75260 33753 136811 198803 -22107 4156 273566
10321 273566 179087 168673 308652 -73928 39761 -59851 107078 310144 21016 109332 139017
10310 139017 81397 170214 -254911 -119513 31019 -142686 -19061 -9981 -329615 -198239 60930
10298 -222493 34829 -334839 -510189 224533 -62521 -109276 122698 -248465 193677 -43347
$$ packed form
10377f5491B43633J17343l0099j11405H0932J76314m3395L22385k17119A34075
10366D16870r8868J38554j38020j23763L46483G1257b9840j3743B84463a37207
10355A39570P5978o2992l2974j6224K48976K89959j24226A6254K76261a42066
10344B06517I1926C2958J91048A8920P0612h4389B23547p4737k1312K6458C3651
10332i0499A91529a40088A33997h7925G5260C3753J03058O1992b2107D156K69410
10321B73566r4479j0414J39979g3928C9761e9851A07078K03066B1016Q8316K9685
10310A39017n7620Q8817b54911a19513C1019a42686a9061R080l19634J31376F0930
10298b22493C4829c34839j75350B24533f2521m6755A22698b48465A93677d3347
$$ plain form
10287 23367 346295 -70837 184343 -65584 -177 64214 -195374 -69209 -334672 244656 -213085
10275 -209709 -203475 136046 -48666 12238 -104539 169687 28305 64437 -159486 77333 110639
10264 110639 129956 -86380 199440 76942 -27420 6798 213940 29833 26117 -85587 -122584
10253 -122584 203304 54384 497848 60063 155533 -83967 220298 -104956 -22049 -50559 -33048
10242 -33048 81769 -54502 -128841 212444 -128739 -76676 -51820 50734 -309728 -128285 165150
10230 -254382 -122497 16487 -17823 213846 189893 185920 280687 -5974 79335 -12297 203051
10218 7717 -251150 256326 37032 -345924 -91260 -215510 -8441 88644 -204980 246969 -213938
10206 -195279 -38947 -112596 40823 -81392 -190721 -76546 -32556 -98319 -351805 52558 -35864
$$ packed form
10287B3367L22928g0837A84343f5584a77F4214a95374f9209k65463B44656b13085
10275b09709O234A36046d8666A2238a04539A69687B8305L6132a59486G7333L3306
10264A10639J9317h6380A99440G6942b7420F798K07142B9833l716h5587l6997
10253a22584B03304E4384M43464F0063R5470h3967B20298a04956b2049k8510J7511
10242c3048H1769e4502p4339B12444a28739N2063K4856E0734c09728a28285A65150
10230b54382a22497A6487a7823B13846k3953l973R4767e974G9335a2297B03051
10218G717b51150B56326C7032c45924i1260j24250h441H8644b04980B46969b13938
10206a95279c8947p3649D0823h1392j09329g6546c2556o5763k53486E2558c5864
$$ plain form
10194 108054 214742 -219400 -126998 133487 89601 45131 153884 -201896 -223735 -98173
10183 -171705 99409 34321 -135340 161058 -81616 -270890 4123 -54154 159812 190219 -56185
10171 66604 61535 -87416 -197634 139516 -212666 128405 -118688 -232588 -123828 -207479
10161 -207479 -150152 -78198 -9652 82334 -196600 -93122 269337 198191 -305669 113764 -212451
10149 79670 -123575 -219134 178748 -93329 -29308 62413 -155133 -276408 -100645 -38797 -110160
10138 -110160 64489 43531 75251 -333067 -79985 -211831 -15938 50393 -2448 104571 -278911
10126 -160809 298483 -200597 65043 50460 -25225 -43879 -132158 80028 335799 -129418 -104177
10115 -104177 -71917 5213 -341732 -242625 -204611 -307130 96517 9316 267754 375909 7020
$$ packed form
10194A08054J06688b19400R2402A33487m3886m4470J08753b01896k1839i8173
10183a71705I9409C4321a35340A61058h1616j89274D123e4154A59812L0407e6185
10171F6604n069h7416j10218A39516b12666A28405a18688j13900J08760q3651
10161b07479N7327P1954i652H2334a96600i3122B69337p1146c05669A13764b12451
10149G9670a23575r5559A78748i3329b9308F2413a55133j21275a00645c8797p1363
10138a10160F4489k0958L1720c33067g9985j31846a5938E0393b448A04571b78911
10126a60809B98483b00597F5043j4583b5225j8654q8279H0028K55771a29418K5241
10115a04177L2260E213c41732R9107L8014j02519I6517I316K58438J08155G020
$$ plain form
10103 -118068 -289134 -218154 -235552 70377 -223949 88461 111854 -104675 -215389 39282 -49896
10091 -382555 -64211 6979 38017 -54035 -127792 -162956 -199388 -285250 52183 -73978 -358359
10080 -358359 116943 9808 -242267 -59609 97445 -183159 16973 -12601 96610 -134461 144009
10068 53870 -16715 -260891 82147 -210069 -175360 122483 -129013 -144015 -19340 115911 -111084
10056 -2040 -139413 -55954 -97131 -137584 -88212 40601 -145632 -59867 -128859 -318114 45743
10044 -437 -18570 55271 -78247 -29674 -244816 -51926 -147975 -168954 80480 -22763 2375 -167491
10031 104259 22611 -168365 133118 7366 141772 -33172 -143840 -130600 -295390 177658
10020 -117651 -119165 -62735 -9041 -238551 -50476 27468 -183503 -146329 105624 -159105 200223
$$ packed form
10103a18068j71066P0980j7398G0377b23949H8461K3393a04675j10714C9282d9896
10091c82555f4211F979L1038e4035p3757l5164l6432q5862E2183g3978k84381
10080c58359A16943I808b42267e9609I7445a83159A6973a2601I6610a34461A44009
10068E3870a6715k44176H2147b10069L4709A22483a29013j5002a9340A15911a11084
10056b040j37373e5954m1177m0453M9372D0601a45632e9867o8992j89255D5743
10044d37j8133E5271g8247b9674k15142e1926r6049k0979H0480b2763B375a67491
10031A04259B2611a68365A33118G366J34406c3172j10668J3240j64790A77658
10020a17651j514N6430i041k29510e0476B7468a83503L7174A05624a59105B00223
$$ plain form
10008 -121527 -147619 95016 -204668 -166274 200817 70363 -306241 -53941 -16648 41304 -19025
9996 -244499 7827 -104840 -209530 -147577 -248066 -165258 94755 -42742 168544 -136565 55684
9984 244764 89793 -142797 -182018 -172837 111735 -100001 -244880 109031 205280 142181 32138
9972 -110463 -204381 -447563 8110 -164671 -1254 20943 133745 35732 -100795 176343 -34800
9960 -18660 -13377 -327068 -44278 -23368 -156782 -253860 -59500 -92994 118589 7812 -7904 -67974
9948 -67974 -191563 -40846 -214981 -49609 -76483 504015 149120 129429 57834 36423 -11209
9936 152592 -37378 69005 -25414 59809 61558 343219 -42569 -255186 -143575 -34354 10940
9924 263084 142965 38437 -4344 -39724 53196 -390412 49453 -44217 162255 -198410 -86849
$$ packed form
10008a21527k6092I5016b04668L8394B00817G0363c06241e3941a6648D1304a9025
9996b44499G827a04840j04690O1953j00489Q2808I4755d2742A68544a36565E5684
9984B44764H9793a42797l9221R181A11735a00001j44879A09031R6249o3099C2138
9972a10463r3918k43182H110a64671a254B0943J12802C5732a00795A76343c4800
9960a8660N283l13691d4278K0910j33414r7078e9500l3494A18589G812g904o0070
9948f7974j23589d0846j74135d9609k6874E04015A49120j9691E7834k1411a1209
9936A52592c7378F9005b5414E9809J749K81661d2569k12617J11611c4354A0940
9924B63084j20119C8437d344l5380E3196c90412D9453d4217A62255a98410h6849
$$ plain form
9912 -113094 -168299 217605 -263152 -17345 -173374 -210018 115095 -240254 401346 297993
9902 297993 351804 171291 88326 -11329 -95785 -112779 78559 154029 -133324 -130239 -54323
9890 11342 -25056 -28182 139399 -176517 -184009 51709 -2151 156436 -338328 -264326 -32079 -71848
9878 -71848 97234 223968 -495228 -50436 -15298 -191990 82863 23534 -538790 -302161 136835
9866 193820 -76041 -165409 103684 -46046 -64860 185878 16638 106798 -236072 -207631 -143859
9855 -143859 -61341 -179942 37259 -43513 113948 9815 16136 -200145 242604 49394 -379799
9843 -235756 178333 -25367 -337966 -248301 -15029 -245874 -199231 -266533 -118496 -135021 -271745
9832 -271745 -103767 -74388 -336417 -306120 -420648 229569 192840 -18215 258669 -87739 222930
$$ packed form
9912a13094n5205B17605b63152a7345j56029l6644A15095b40254D01346j03353
9902B97993N3811A71291q2965a1329q4456j6994G8559P5470a33324L085e4323
9890A1342b5056l126A39399a76517p492E1709b151A56436c38328P4002c2079l9769
9878g1848I7234J26734d95228e0436a5298j76692H2863B3534e38790K36629A36835
9866A93820g6041q9368A03684d6046j8814A85878A6638R0160b36072K8441O3772
9855a43859f1341j18601C7259d3513A13948I815O321b00145B42604D9394c79799
9843b35756A78333b5367l12599Q9665a5029k30845M6643o7302a18496j6525j36724
9832b71745a03767K9379k62029L0297j14528B29569l6729a8215B58669h7739B22930
$$ plain form
9820 95872 50469 -46159 -195023 -79871 38166 -69991 -179881 -317350 145367 -312193 -194889
9809 -194889 -130768 -265375 170525 84546 -153384 -94257 -8814 -41480 15484 -286401 -52251
9797 96269 197600 135235 -162559 -97165 366381 70128 -131702 364587 268412 -196313 18231
9785 -7213 -37102 5507 25813 228190 -23487 -227890 -272565 -158989 -2209 35315 -182830 -188058
9773 -188058 -26098 29991 51386 -9358 202613 161424 -131504 -33790 -342232 -138777 -288086
9762 -288086 31476 -190018 226567 -142938 276813 155213 112677 -183552 -7015 -76596 -354641
9751 -354641 -101479 -403289 -200984 257180 123894 -161811 24679 -241637 102219 -139307
9740 197634 68215 -193295 -97768 -150117 -42104 79185 -323850 -176582 -228447 -94211 124788
$$ packed form
9820I5872m5403d6159j48864g9871C8166f9991j09890j37469A45367c12193J17304
9809a94889O4121j34607A70525H4546a53384N9127h814l2666A5484b86401e2251
9797I6269J01331o2365a62559O5394C66381G0128a31702C64587r6175a96313A8231
9785g213k9889E507K0306K02377b3487k04403m4675J13576b209C5315a82830n228
9773a88058b6098B9991K1395i358B02613m1189a31504c3790l08442a38777j49309
9762b88086C1476a90018B26567a42938B76813j21600m2536a83552g015o9581k78045
9751c54641a01479l01810b00984B57180A23894a61811B4679b41637A02219a39307
9740A97634F8215a93295R5527n2349d2104G9185c23850J47268n1865i4211A24788
$$ plain form
9728 -272659 47269 -304790 62826 -149025 -269534 115867 309909 -288437 -88823 63424
9717 -205461 27674 -59810 -283675 -150458 -131357 -56645 -32630 -190338 -129023 -218035 207172
9705 -41058 89492 138363 -365203 -31085 -339696 107614 -4947 -94709 126575 27432 -29646
9693 -306410 -231066 86844 55505 -73139 -154097 102251 -94076 -246333 118312 -223094 130735
9681 -191693 -181996 -69270 -88486 -38496 -187131 68509 -325119 -159342 67026 238025 184585
9670 184585 -59106 -38078 -92029 216123 -180712 -234037 -11728 89968 -294257 97906 -84269
9658 -10227 -20159 54831 -75614 127992 -160594 -3070 -170499 89557 -144682 -14214 -121431
9647 -121431 -220541 -158424 88146 21555 317503 171389 400974 -308539 14132 -184546 163959
$$ packed form
9728b72659D7269c04790F2826a49025j20509A15867J94042b88437h8823F3424
9717b05461B7674e9810k23865J33217J9101e6645K4015j57708O1315q9012B07172
9705d1058H9492M8871c65203c1085l08611A07614d947q9762A26575B7432b9646
9693c06410P5344H6844l1339g3139q0958A02251i4076j52257A18312b23094A30735
9681a91693R697f9270j9216c8496j48635F8509c25119a59342F7026J70999n3440
9670A84585e9106K1028n3951B16123a80712n3325a1728H9968b94257I7906h4269
9658a0227r932E4831g5614A27992a60594c070j67429H9557a44682a4214j07217
9647a21431r9110O2117H8146B1555K95948j46114K29585c08539A4132a84546A63959
$$ plain form
9635 -102696 -101640 -233163 -81988 189131 -126262 27928 16716 -303741 -186869 -256174 -340751
9624 -340751 -212477 49625 -106207 -314129 211236 159969 -455375 57080 -105224 -5291 146188
9612 340725 -123755 -354487 49972 43369 8289 235488 -230968 -545744 -304332 -8480 -240569
9601 -240569 109873 -348854 47972 142460 -324249 -96003 -168030 -121791 1234 -147840 24597
9589 -191278 -178268 -30200 -193479 -27843 69275 417314 -249651 -44957 -103668 -224027 28422
9577 130942 192421 80442 -20546 64248 -45794 -10239 -141271 -83396 55373 10601 -41570
9565 -138092 -2100 -194054 -167273 213196 174777 142834 231613 -80418 296279 -89235 -178937
9554 -178937 1382 -131904 -256620 -115523 -62757 -50768 40654 -58684 -31837 90896 -230591
$$ packed form
9635a02696J056j31523h1988A89131a26262B7928j1212c03741J16872o9305q4577
9624c40751J28274D9625a06207k07922B11236n1267d55375E7080a05224e291A46188
9612C40725a23755k30732D9972o603H289K27199b30968l14776K41412h480k32089
9601b40569A09873c48854D7972R4488c24249i6003p2027M6239A234a47840B4597
9589a91278J3010c0200j63279b7843F9275L48039b49651d4957n8711j20359B8422
9577A30942O1479H0442b0546F4248d5794a0239j31032N7875E5373A0601d1570
9565a38092b100j91954K6781B13196l8419l1943Q8779h0418B96279h9235q9702
9554a78937A382a31904j24716a15523N2766J1989D0654e8684K6847I0896b30591
$$ plain form
9542 9430 -280859 -61782 -138494 -89544 -247963 59898 122476 -171030 -319030 -19788 66425
9530 -173627 -201256 41633 -137415 -133537 349290 64434 -44828 81671 -181235 -24057 -466903
9519 -466903 -132764 -117851 -222852 -222275 -258171 -126836 -224468 -164197 -98442 -207931 -89918
9507 -182764 -264862 157917 -91734 95241 -84387 198173 -153900 -21755 125816 88342 -122213
9495 -33336 -18359 -335287 28204 -363904 82273 144619 112910 -43007 -149719 78213 -51559
9483 98265 235810 299234 119470 -101729 30821 80939 9279 -22627 94856 168245 22067
9471 -174929 9212 -315610 -105345 457225 -39409 -223007 -119795 -20969 14001 28035 -67319
9459 55231 -220836 -41579 47668 -22573 127918 -123843 -46091 -73529 -152240 -268255 -84732
$$ packed form
9542I430b80859f1782p6712M8950j58419E9898O2578a71030j48000a9788F6425
9530a73627k7629D1633a37415L878C49290F4434d4828H1671a81235b4057m42846
9519d66903a32764J4913j05001N77l5896a26836r7632O0271O5755j09489h9918
9507a82764q2098A57917i1734I5241h4387A98173a53900b1755A25816l7474a22213
9495c3336J4977l16928B8204c63904H2273O2346l1709d3007j06712G8213e1559
9483I8265J37545O3424A19470a01729C0821N0118I279b2627I4856P3389B2067
9471a74929I212c15610a05345D57225c9409j83598J03212b0969A4001J4034f7319
9459E5231b20836d1579D7668b2573A27918a23843d6091k7438p8711j16015h4732
$$ plain form
9447 -3588 -33201 -139420 -176482 -396166 64080 -171003 -251086 -133690 -187004 83160 147561
9436 147561 69331 -73489 -98767 -189022 -397334 -24905 120320 -34274 -175124 125224 61754
9424 -414916 -44132 -56236 -160004 64486 299338 17506 -56985 60984 32074 183782 5590
9412 -133760 -99928 62441 342350 -129641 144965 -497640 31407 -185864 4741 -104616 75290
9400 242432 -20493 59381 -66804 71477 -150117 -90825 23736 33103 230409 -113726 -385331
9389 -385331 -203946 86413 -88243 -186230 -97392 67579 271774 46874 207905 -259091 -161001
9378 -161001 -120400 35147 65017 -23440 -214762 -58692 -209902 -256353 -4329 -385291 217282
9366 333992 59585 -10802 -80537 -189198 -118203 226114 100084 -301609 -254775 31715 215150
$$ packed form
9447c588k9613j06219l7062k19684F4080a71003q0083J17396n3314H3160O4401
9436A47561F9331g3489k5278r0255k08312b4905A20320c4274j40850A25224F1754
9424d14916d4132j2104j03768F4486K34852A7506e6985F0984k8910J51708E590
9412a33760L3832F2441K79909a29641A44965d97640C1407a85864D741a04616G5290
9400B42432b0493E9381f6804G1477a50117N9292B3736R367J97306a13726k71605
9389c85331J81385H6413h8243r7987Q8838F7579K04195D6874J61031b59091R8090
9378a61001M0601C5147K9870b3440j91322e8692j51210m6451d329l80962B17282
9366C33992E9585a0802o9735j08661P0995B26114A00084c01609M6834C1715J83435
$$ plain form
9355 215150 -509568 -50426 79909 46353 -117526 -96407 -60522 98843 7413 -108341 41061
9343 451773 -210987 -414924 60445 278768 -60818 -163981 -190700 -102585 -116034 322648 -117379
9331 -114186 -346180 -214513 -76265 -50936 -228593 -22233 -211901 333050 -229124 78181
9320 203493 27965 -98688 -428622 -203374 73528 -61198 -107600 -163298 -43580 36320 -143646
9308 254491 107089 142515 207959 312431 -258879 -281437 -78819 56695 -2517 -177421 -73338
9296 -365104 232377 -175519 -109979 -150214 216681 119309 -40745 -187499 -168314 -369037 -98029
9284 -45947 -183769 38971 172568 -167242 -267459 2171 212488 213046 -51179 -105673 -318721
9273 -318721 -133731 -282292 -117439 -156325 19891 -233668 -244603 -152110 -181851 -180177 -43050
$$ packed form
9355B15150e09568e0426G9909l3556a17526K1119L5885I8843G413a08341D1061
9343D51773b10987k03937F0445K18323f0818j03163k6719Q8115j3449C22648a17379
9331a14186k31994J31667g6265K5329j77657b2233j89668C33050b29124G8181
9320B03493B7965i8688l29934b03374G3528f1198m6402n5698d3580C6320a43646
9308B54491A07089L5426O5444J04472b58879k2558g8819E6695b517j74904g3338
9296c65104B32377a75519O5540m0235B16681r7372d0745j46754J9185k00723i8029
9284d5947j37822C8971J33597a67242j00217B171K10317N58e1179n4494k13048
9273c18721a33731j48561a17439l8886A9891b33668j0935R2493k9741J674d3050
$$ plain form
9261 -262543 -227405 126578 50157 -183938 -231601 -330776 -351089 71463 -105794 -13733 -249855
9250 -249855 -310576 209 -188391 209751 9332 67226 24372 -72709 -158432 -53778 112486 -45250
9237 54684 31897 -58183 -41500 6154 -104713 -165161 198381 -65283 -385643 -167454 -105720
9226 -105720 588 -19170 -210884 -173784 191901 -35657 8008 -218109 109059 85906 -124386
9214 181051 -192063 -30116 241357 -19856 52255 -110582 178855 -80883 -41888 -12087 158068
9202 -83276 13125 14261 -420342 54152 -15896 -160070 81637 -118954 402302 -93451 -195753
9191 -195753 -252211 -172105 11892 -234562 -90740 55357 41706 296383 -237895 115773 -175203
9179 136262 9899 -157496 263994 -15333 -497506 232764 144267 -25145 138754 -206624 -48902
$$ packed form
9261b62543L5138A26578E0157a83938m7663r9175k0313G1463a05794a3733k36122
9250b49855o0721B09a88391B09751I332N7894B4372g2709q5723e3778A12486d5250
9237E4684k2787e8183J6683F154a04713o0448A98381f5283l20360a67454O1734
9226a05720E88a9170j91714L7100A91901c5657H008b18109A09059k3153a24386
9214A81051a92063c0116B41357a9856E2255a10582A78855h0883L8995a2087A58068
9202h3276A3125J136d20342E4152a5896j44174H1637a18954D02302i3451j02302
9191a95753n6458Q0106A1892b34562i0740E5357j3651K54677b37895A15773a75203
9179A36262I899a57496B63994a5333m82173B32764q8497b5145A38754b06624d8902
$$ plain form
9167 7475 -274584 265815 -65352 7064 213668 93101 69409 -173617 -150683 -156340 -270738
9156 -270738 100094 183239 -265366 -25468 -18273 -297396 -61784 37359 -238747 -73073 -25717
9144 -10988 -31974 24820 -236502 139860 29027 27456 107939 -114535 -22022 -291277 -102558
9132 -3190 72471 122281 -6423 -181082 -72524 129981 -146790 -29235 -38866 108866 -21527 -54288
9120 -54288 -420323 -172908 146727 -52537 137805 75725 -25127 374576 37170 -28426 202093
9108 190415 14533 -428787 -102656 -245038 -130989 -508234 -183559 57154 -210176 -196092
9098 -196092 81835 -83606 -110683 62069 -25305 66123 -136590 -201858 278871 -128173 -34489
9086 -214633 -175316 -591156 3131 97028 254163 -22698 255986 -216331 3050 201538 -46721
$$ packed form
9167G475b74584B65815f5352G064K06604I3101k3692a73617K2934n657j14398
9156b70738A00094Q3145b65366b5468P195k79123f1784C7359b38747g3073b5717
9144a0988k0986B4820b36502A39860B9027j571Q0483a14535b2022k69255a02558
9132c190G2471M9810f423j74659g2524A29981a46790b9235r631A08866b1527l2761
9120e4288l66035a72908A46727e2537A37805o2080b5127C74576C7170b8426B02093
9108A90415A4533d28787a02656j42382J14049l77245a83559E7154b10176J4084
9098a96092H1835h3606k7077F2069b5305F6123a36590o5268B78871a28173c4489
9086b14633L9317m15840C131R3897J57135b2698B55986b16331C050J98488d6721
$$ plain form
9074 -82242 -197263 -114726 -40585 -165380 136776 76229 -73081 127056 -183675 -269018 262043
9062 -129855 -80145 -44344 28824 -75816 -114003 39552 -378676 -406448 148135 -2577 -206638
9051 -206638 -199551 -180629 -134850 89968 -160533 85957 -201926 -332714 -35754 -170431 17649
9039 -20960 -88848 72197 -80698 115587 50868 -45241 -367326 -63258 137025 -163782 -295861
9028 -295861 71729 -79345 -39559 -325926 81511 221494 42333 -74541 96908 -292828 -139762
9016 52547 15687 -29033 -247195 -271467 -81182 138746 169214 -114564 278392 -183618 -56118
9004 325843 -468844 -4244 174913 121558 -84183 -97200 -255640 -160508 -61415 -194956 -342651
8993 -342651 73291 115657 1690 -45628 -12988 -22266 -90673 -333044 -548141 -278239 -55314
$$ packed form
9074h2242j15021Q2537d0585j24795A36776o0547g3081A27056a83675q5343B62043
9062a29855M9710L5801B8824g5816l8187C9552c78676k7772A48135b577k04061
9051b06638P087J8922M5779H9968a60533H5957b01926j30788c5754j34677A7649
9039b0960o7888G2197h0698A15587E0868d5241l22085f3258A37025a63782j32079
9028b95861G1729g9345c9559k86367H1511J39983D2333g4541I6908b92828a39762
9016E2547A5687b9033k18162k4272h1182A38746L0468a14564B78392a83618e6118
9004C25843d68844d244A74913n3355h4183j3017j58440R5132f1415j33541j47695
8993c42651G3291M2366A690d5628a2988r278o8407k42371k15097K69902e5314
$$ plain form
8981 -339214 -136781 17446 -80654 -334669 -180765 58348 67182 7757 -216041 -314471 16387
8969 -138783 -125041 115996 -125008 -181319 -134968 -27198 -168063 -11757 -139576 -79068 -181471
8958 -181471 13349 -162246 156058 -147401 -128120 43746 -13346 68765 223400 -134441 6905
8946 30616 -294044 96660 -51632 -215909 29243 145274 12026 -119520 -96236 -20795 306124
8934 391391 14641 -174848 -38875 -47666 -266615 -33819 50263 56852 285571 419586 840232
8923 840232 2892056 8650123 7749890 1998554 832709 415349 250561 110392 198024
8914 198024 27242 -11022 -72583 -89486 123747 -56217 -27337 110968 160306 105804 291399
8903 291399 -138124 299504 56277 -143323 -9694 -891 -71175 -179693 91981 132083 163241
$$ packed form
8981c39214a36781A7446h0654k54015J53904E8348Q834G757b16041r8430A6387
8969a38783J3742A15996a25008n6311M6351b7198j40865a1757j27819O0508j02403
8958a81471A3349a62246A56058a47401J9281D3746a3346F8765J54635a34441F905
8946C0616b94044I6660e1632j64277B9243J16031A2026a19520K3284b0795C06124
8934C91391A4641a74848c8875q791k18949c3819E0263O589K28719J34015M20646
8923H40232K051824N758067r00233A998554H32709D15349j64788A10392Q7632
8914A98024B7242a1022o1561j6903A23747e6217b7337A10968M9338n4502J85595
8903B91399a38124B99504E6277a43323i694h91p0284j08518I1981M0102L1158
$$ plain form
8892 163241 335175 -164109 -384124 -23584 6670 79654 246358 -124123 -122603 -6259 30284
8880 -76847 -178792 223656 -397659 -252609 -120115 77386 284919 -239521 -27253 -284495
8870 -284495 -383906 -64667 -52270 -178014 253333 -110517 73186 -1301 -129629 -120575 272305
8858 -140352 -116796 -270476 11456 -20625 -46909 -67042 -206463 -164690 -62771 137944 -147461
8846 113240 -170278 -89663 -24869 207310 -13015 242892 -58437 50387 -280986 14704 -179703
$$ packed form
8892A63241J71934a64109k20015b3584F670P2984J66704a24123J520f259C0284
8880g6847j01945B23656c97659J45050a20115G7386K07533b39521b7253k57242
8870b84495r9411f4667J2397j25744B53333a10517G3186a301j28328R054B72305
8858a40352K3556j53680A1456b0625k6284k0133j39421M1773f2771A37944a47461
8846A13240a70278Q0615b4869B07310a3015B42892e8437E0387b80986A4704a79703
$$ [...]
##END NTUPLES=NMR SPECTRUM
##END=
