
##TITLE=AC1290_VIERS11100_6528458_WgZoH42hia
##JCAMPDX= 6.0         $$ Bruker NMR JCAMP-DX V2.0
##DATA TYPE= NMR SPECTRUM
##DATA CLASS= NTUPLES
##ORIGIN= BRUKER
##OWNER= Administrator
$$ 1.72 TOPSPIN		Version 2.1
$$ 2012-12-04 20:36:26.404 -0500  Administrator@X
$$ Compression mode = diff/dup
##.OBSERVE FREQUENCY= 400.02188249412
##.OBSERVE NUCLEUS= ^1H
##.ACQUISITION MODE= SIMULTANEOUS (DQD)
##.ACQUISITION SCHEME= undefined
##.AVERAGES= 64
##.DIGITISER RES= 22
##SPECTROMETER/DATA SYSTEM= spect
##.PULSE SEQUENCE= noesygpps1d.comp
##.SOLVENT NAME= COFFEE_meoh
##.SHIFT REFERENCE= INTERNAL, COFFEE_meoh, 1, 14.96084
##AUDIT TRAIL= $$ (NUMBER, WHEN, WHO, WHERE, PROCESS, VERSION, WHAT)
$$ ##TITLE= Audit trail, TOPSPIN		Version 2.1
$$ ##JCAMPDX= 5.01
$$ ##ORIGIN= Bruker BioSpin GmbH
$$ ##OWNER= Administrator
$$ $$ E:\/data/COFFEE/nmr/AC1290_VIERS11100_6528458_WgZoH42hia/22/pdata/1/auditp.txt
$$ ##AUDIT TRAIL=  $$ (NUMBER, WHEN, WHO, WHERE, PROCESS, VERSION, WHAT)
(   1,<2012-12-04 20:36:20.451 -0500>,<Administrator>,<X>,<go>,<TOPSPIN 2.1>,
      <created by zg
	started at 2012-12-04 20:24:50.340 -0500,
	POWCHK enabled, PULCHK disabled,
       configuration hash MD5:
       86 BA 57 50 F2 9D 5C 9B 26 00 A9 28 5F 66 2E 89
       data hash MD5: 64K
       31 35 12 3A 5F 27 B6 20 5E 0E 29 8C 0A A9 3B 07>)
(   2,<2012-12-04 20:36:23.514 -0500>,<Administrator>,<X>,<proc1d>,<TOPSPIN 2.1>,
      <Start of raw data processing
       efp LB = 0.3 FT_mod = 6 PKNL = 1 PHC0 = 0 PHC1 = 0 SI = 128K 
       data hash MD5: 128K
       01 E4 15 ED 08 7D AF 27 D4 41 00 93 BE 98 27 B2>)
(   3,<2012-12-04 20:36:24.576 -0500>,<Administrator>,<X>,<proc1d>,<TOPSPIN 2.1>,
      <pk PHC0 = -76.2561 PHC1 = 0 
       data hash MD5: 128K
       CE 1C 2E 19 B1 56 EE F1 9D 18 6B 7F 6C EE B5 31>)
(   4,<2012-12-04 20:36:25.264 -0500>,<Administrator>,<X>,<proc1d>,<TOPSPIN 2.1>,
      <abs ABSG = 1 
       data hash MD5: 128K
       A9 19 53 A1 B3 2E C0 54 FB C1 82 64 8E 2E ED 8B>)
(   5,<2012-12-04 20:36:25.514 -0500>,<Administrator>,<X>,<proc1d>,<TOPSPIN 2.1>,
      <abs ABSG = 2 
       data hash MD5: 128K
       43 AB 71 29 63 19 E7 3E C6 75 6F 1F 07 C1 A2 99>)
(   6,<2012-12-04 20:36:25.686 -0500>,<Administrator>,<X>,<proc1d>,<TOPSPIN 2.1>,
      <abs ABSG = 3 
       data hash MD5: 128K
       4E 2C 6F DB 63 19 A6 A7 E8 78 46 CD BF 2F C0 28>)
(   7,<2012-12-04 20:36:25.858 -0500>,<Administrator>,<X>,<proc1d>,<TOPSPIN 2.1>,
      <abs ABSG = 4 
       data hash MD5: 128K
       FC 72 C5 A6 AF 2C 69 47 66 C2 99 44 A3 EB 26 40>)
(   8,<2012-12-04 20:36:26.045 -0500>,<Administrator>,<X>,<proc1d>,<TOPSPIN 2.1>,
      <abs ABSG = 5 
       data hash MD5: 128K
       A3 39 60 B4 6B 07 1C F6 1C 2E 13 16 5E DE 80 77>)
$$ ##END=
$$ 
$$ $$ hash MD5
$$ $$ 38 B0 E5 FB BC AD 7F 68 43 5F 8C 17 4A 1A 1E C7
##$RELAX= 
##$RELAX= 
##$RELAX= 
##$RELAX= 
##$RELAX= 
##$RELAX= 
##$RELAX= 
##$RELAX= 
$$ Bruker specific parameters
$$ --------------------------
##$DU= <E:\>
##$EXPNO= 22
$$ [...]
##$TP07= 0
##$TPNAME0= <>
##$TPNAME1= <>
##$TPNAME2= <>
##$TPNAME3= <>
##$TPNAME4= <>
##$TPNAME5= <>
##$TPNAME6= <>
##$TPNAME7= <>
##$TPOAL= (0..7)
0.5 0.5 0.5 0.5 0.5 0.5 0.5 0.5
##$TPOFFS= (0..7)
0 0 0 0 0 0 0 0
##$TUNHIN= 0
##$TUNHOUT= 0
##$TUNXOUT= 0
##$USERA1= <user>
##$USERA2= <user>
##$USERA3= <user>
##$USERA4= <user>
##$USERA5= <user>
##$V9= 5
##$VALIST= <valist>
##$VCLIST= <CCCCCCCCCCCCCCC>
##$VD= 0
##$VDLIST= <DDDDDDDDDDDDDDD>
##$VPLIST= <PPPPPPPPPPPPPPP>
##$VTLIST= <TTTTTTTTTTTTTTT>
##$WBST= 2048
##$WBSW= 25
##$XGAIN= (0..3)
0 0 0 0
##$XL= 0
##$YL= 0
##$YMAX_a= 6052929
##$YMIN_a= -12319658
##$ZGOPTNS= <>
##$ZL1= 120
##$ZL2= 120
##$ZL3= 120
##$ZL4= 120
##$ABSF1= 14.96084
##$ABSF2= -5.597342
##$ABSG= 5
##$ABSL= 3
##$ALPHA= 0
##$AQORDER= 0
##$ASSFAC= 0
##$ASSFACI= 0
##$ASSFACX= 0
##$ASSWID= 0
##$AUNMP= <proc_prof1d_extract.lims>
##$AXLEFT= 0
##$AXNAME= <>
##$AXNUC= <1H>
##$AXRIGHT= 0
##$AXTYPE= 0
##$AXUNIT= <>
##$AZFE= 0.1
##$AZFW= 0.1
##$BCFW= 0
##$BC_mod= 0
##$BYTORDP= 0
##$COROFFS= 0
##$CY= 15
##$DATMOD= 1
##$DC= 0
##$DFILT= <>
##$DTYPP= 0
##$F1P= 0
##$F2P= 0
##$FCOR= 0.5
##$FTSIZE= 131072
##$FT_mod= 6
##$GAMMA= 0
##$GB= 0
##$INTBC= 1
##$INTSCL= 1
##$ISEN= 128
##$LB= 0.3
##$LEV0= 0
##$LPBIN= 0
##$MAXI= 10000
##$MC2= 0
##$MEAN= 0
##$ME_mod= 0
##$MI= 0
##$NCOEF= 0
##$NC_proc= -2
##$NLEV= 6
##$NOISF1= 0
##$NOISF2= 0
##$NSP= 0
##$NTH_PI= 0
##$NZP= 0
##$OFFSET= 14.96084
##$PC= 1
##$PHC0= -76.2561
##$PHC1= 0
##$PH_mod= 1
##$PKNL= yes
##$PPARMOD= 0
##$PPDIAG= 0
##$PPIPTYP= 0
##$PPMPNUM= 2147483647
##$PPRESOL= 1
##$PSCAL= 4
##$PSIGN= 0
##$PYNMP= <proc.py>
##$REVERSE= no
##$SF= 400.020009699966
##$SI= 131072
##$SIGF1= 0
##$SIGF2= 0
##$SINO= 400
##$SIOLD= 131072
##$SPECTYP= <>
##$SREGLST= <1H.CDCl3>
##$SSB= 0
##$STSI= 131072
##$STSR= 0
##$SW_p= 8223.68421052631
##$SYMM= 0
##$S_DEV= 0
##$TDeff= 65536
##$TDoff= 0
##$TI= <>
##$TILT= no
##$TM1= 0
##$TM2= 0
##$TOPLEV= 0
##$USERP1= <user>
##$USERP2= <user>
##$USERP3= <user>
##$USERP4= <user>
##$USERP5= <user>
##$WDW= 1
##$XDIM= 131072
##$YMAX_p= 387209761
##$YMIN_p= -13348
##$CURPLOT= <Network HP LaserJet P1505>
##$CURPRIN= <$Network HP LaserJet P1505>
##$DFORMAT= <normdp>
##$LAYOUT= <+/1D_H.xwp>
##$LFORMAT= <normlp>
##$PFORMAT= <normpl>
##$SURQMSG= 1
$$ End of Bruker specific parameters
$$ ---------------------------------
##NTUPLES= NMR SPECTRUM
##VAR_NAME=  FREQUENCY,     SPECTRUM/REAL,   SPECTRUM/IMAG
##SYMBOL=    X,             R,               I
##VAR_TYPE=  INDEPENDENT,   DEPENDENT,       DEPENDENT
##VAR_FORM=  AFFN,          ASDF,            ASDF
##VAR_DIM=   131072,        131072,          131072
##UNITS=     HZ,            ARBITRARY UNITS, ARBITRARY UNITS
##FACTOR=    0.0627417313425164, 1,          1
##FIRST=     8223.62146879497, 1433,         -55781
##LAST=      0,             3503,            -55416
##MIN=       0,             -13348,          0
##MAX=       8223.62146879497, 387209761,    0
$$ Real data points
##PAGE= N=1
##DATA TABLE= (X++(R..R)), XYDATA
$$ [...]
63893G25662k8002k3191j9569j7551j6321j5064j3912j3162j2370j0961r236p980
$$ 725662 697660 674469 654900 637349 621028 605964 592052 578890 566520 555559 546323 538343
63881E38343p307o546n158l260j234O40K201L449M600N876P272Q815J0821J3450
$$ 538343 531036 524490 519332 516072 514838 515478 517679 521128 525728 531604 538876 547691 558512 571962
63867E71962J6223J8447K0129K1992K4521K7446L0264L2860L5371L7816M0068
$$ 571962 588185 606632 626761 648753 673274 700720 730984 763844 799215 837031 877099
63856H77099M2023M3533M4378M4535M4322M4075M3650M2462M0044L6498L2297
$$ 877099 919122 962655 1007033 1051568 1095890 1139965 1183615 1226077 1266121 1302619 1334916
63845A334916K7671K2405J6307R762L502k191p737j3617j9785k5912l1806l7208
$$ 1334916 1362587 1384992 1401299 1411061 1414563 1412372 1404635 1391018 1371233 1345321 1313515 1276307
63833A276307m1495m4125m5371m6082m6708m7049m6936m6586m6043m4825m2582
$$ 1276307 1234812 1190687 1145316 1099234 1052526 1005477 958541 911955 865912 821087 778505
63822G78505l9742l7121l5013l3064l0843k8199k5170k1991j9138j6961j5252
$$ 778505 738763 701642 666629 633565 602722 574523 549353 527362 508224 491263 476011
63811D76011j3478j1514r744q411p315o359n992o579p685q461q717r044r777j0325
$$ 476011 462533 451019 441275 432864 425549 419190 413198 406619 398934 390473 381756 372712 362935 352610
63797C52610r851q338o659n721n808o546p219p180o298n069m101l512l059k716
$$ 352610 342759 334421 327762 322041 316233 309687 302468 295288 288990 283921 279820 276308 273249 270533
63783B70533k788l267l521k978j941j346j646k250k233j397m30k7j69m43p15j116
$$ 270533 267745 264478 260957 257979 256038 254692 253046 250796 248563 247166 246736 246709 246540 246097 245382 244266
63767B44266j438j129j61O07M05l84o95j78M62N01k9p50j508k164k314j672n44
$$ 244266 242828 241699 241538 242145 242550 242166 241471 241293 241755 242256 242227 241477 239969 237805 235491 233819 233275
63750B33275M77J066J231J061P46O29Q26R59O24Jl27j15M07R85J506J788J637
$$ 233275 233752 234818 236049 237110 237856 238485 239311 240270 240894 240895 240568 240453 240860 241845 243351 245139 246776
63733B46776J215J002J247J750K316L073M107N037N244M515L346K595K805L775
$$ 246776 247991 248993 250240 251990 254306 257379 261486 266523 271767 276282 279628 282223 285028 288803
63719B88803M726N049M825M529M308L870L078K239J607Q80m00k105l507m052l899
$$ 288803 293529 298578 303403 307932 312240 316110 319188 321427 323034 323914 323514 321409 317902 313850 309951
63704C09951l602l490l467l302k940k443j800r04J79J058J303R46N69P31J392
$$ 309951 306349 302859 299392 296090 293150 290707 288907 288003 288182 289240 290543 291489 292058 292789 294181
63689B94181J996K103J786J403J236J396J941K726L256K968J844N73k9K64J009
$$ 294181 296177 298280 300066 301469 302705 304101 306042 308768 312024 314992 316836 317409 317380 317644 318653
63674C18653J574J566J019L90L11J051K201L095L504L645L580K992J794N87J28
$$ 318653 320227 321793 322812 323202 323513 324564 326765 329860 333364 337009 340589 343581 345375 345962 346090
63659C46090M37P41L03q85k212l083l383l485l850m555n180n243m691l904l195
$$ 346090 346527 347268 347571 346686 344474 341391 338008 334523 330673 326118 320938 315695 311004 307100 303905
63644C03905k510j667p66j61L1J99Q38J921K850L167L087L185L693M315M705M889
$$ 303905 301395 299728 298962 298801 298832 299031 299869 301790 304640 307807 310894 314079 317772 322087 326792 331681
63628C31681N128N532N963O244O376O554O926P431P963Q751J0218J2329J4291
$$ 331681 336809 342341 348304 354548 360924 367478 374404 381835 389798 398549 408767 421096 435387
63615D35387J5329J5637J6173J7570J9610K1712K3529K4983K6188K7464K9053
$$ 435387 450716 466353 482526 500096 519706 541418 564947 589930 616118 643582 672635
63604F72635L0670L1651L1593L0527K8439K5131K0815J6200J1727P090K007k924
$$ 672635 703305 734956 766549 797076 825515 850646 871461 887661 899388 906478 908485 905561
63592I05561o569q313q577q477r187j1150j3650j5484j6394j7351j9095k1028
$$ 905561 898992 890679 882102 873625 864438 853288 839638 824154 807760 790409 771314 750286
63580G50286k2096k2239k2201k2235k1815k0436j8052j4912j1674r363q318p416
$$ 750286 728190 705951 683750 661515 639700 619264 601212 586300 574626 565263 556945 549529
63568E49529n273k238l0O86J200K778M929O348O789P067P703Q501R168R681J0108
$$ 549529 544256 542018 541988 542674 543874 546652 551581 557929 564718 571785 579488 587989 597157 606838 616946
63553F16946J0625J1607J3281J5472J8024K1179K5049K9035L2459L5598L9248
$$ 616946 627571 639178 652459 667931 685955 707134 732183 761218 793677 829275 868523
63542H68523M3131M5410M4197L9190L1587K2695J3150L389n599j2368j5980j6779
$$ 868523 911654 957064 1001261 1040451 1072038 1094733 1107883 1111272 1105673 1093305 1077325 1060546
63530A060546j6065j4991j3867j2604j1574j1642j3331j6246j9503k2608k5672
$$ 1060546 1044481 1029490 1015623 1003019 991445 979803 966472 950226 930723 908115 882443
63519H82443k8791l1418l2719l2399l0996k9254k7505k5775k4168k2736k1160
$$ 882443 853652 822234 789515 757116 726120 696866 669361 643586 619418 596682 575522
63508E75522j9080j6693j4599j3023j1628j0215r114q605q345p787o845n844n005
$$ 575522 556442 539749 525150 512127 500499 490284 481170 472565 464220 456433 449588 443744 438739
63495D38739m377m052m036l967l400k418j677j716k412l149l376k953k094j105
$$ 438739 434362 430310 426274 422307 418907 416489 414812 413096 410684 407535 404159 401206 399112 398007
63481C98007j64O81J388J956K486L074L607L894M000M152M208L671K403J011J58
$$ 398007 397843 398524 399912 401868 404354 407428 411035 414929 418929 423081 427289 430960 433363 434374 434532
63466D34532j98n59j168k022l263m921o337o533n425m084l506l533l307k463j400
$$ 434532 434334 433775 432607 430585 427322 422401 416064 409531 404106 400022 396516 392983 389676 387213 385813
63451C85813n87k8N88J473K552L475L905L962M241N202O638Q060R502J1505J4230
$$ 385813 385226 385198 385786 387259 389811 393286 397191 401153 405394 410596 417234 425294 434796 446301 460531
63436D60531J7097J9537K1785K4570K8221L2394L6342L9017L9183L6167L0618
$$ 460531 477628 497165 518950 543520 571741 604135 640477 679494 718677 754844 785462
63425G85462K3977J7085R978L218j461k565m44L315P708J2701J8049K2838K6525
$$ 785462 809439 826524 836502 839720 838259 835694 835250 838565 846273 858974 877023 899861 926386
63412I26386K9464L1911L3163L2282K9197K4564J8889J2475N940J15m614q348
$$ 926386 955850 987761 1020924 1053206 1082403 1106967 1125856 1138331 1144271 1144386 1139772 1131424
63400A131424j1151j2924j3851j4512j5470j7042j9398k2505k5903k8968l1413
$$ 1131424 1120273 1107349 1093498 1078986 1063516 1046474 1027076 1004571 978668 949700 918287
63389I18287l3223l4098l3575l1849k9891k8289k6504k3826k0620j7949j6067
$$ 918287 885064 850966 817391 785542 755651 727362 700858 677032 656412 638463 622396
63378F22396j4120j1503q749o674n178l474j237J043K846M251N737P615R769J1735
$$ 622396 608276 596773 588024 581350 576172 572698 571461 572504 575350 579601 585338 592953 602722 614457
63364F14457J3065J3814J4656J6259J8586K1058K3307K5475K7752L0108L2432
$$ 614457 627522 641336 655992 672251 690837 711895 735202 760677 788429 818537 850969
63353H50969L4599L6223L6817L6255L4712L2055K7848K2207J6010R986M227j075
$$ 850969 885568 921791 958608 994863 1029575 1061630 1089478 1111685 1127695 1137681 1141908 1140833
63341A140833n170p759r716j1970j4160j5386j5875j6795j8617k0838k3246k6247
$$ 1140833 1135663 1127904 1118188 1106218 1092058 1076672 1060797 1044002 1025385 1004547 981301 955054
63329I55054k9654l2325l3460l3310l2214k9917k6371k2366j8610j4849j0600
$$ 955054 925400 893075 859615 826305 794091 764174 737803 715437 696827 681978 671378
63318F71378o219k617l49M03n40l197p172j1935j6922k1056k3061k2785k1525
$$ 671378 665159 662542 662193 662596 662056 658859 651687 639752 622830 601774 578713 555928 534403
63305E34403k0364j8893j6422j3565j1535j0391r269q024p366p451p566p289o899
$$ 534403 514039 495146 478724 465159 453624 443233 433964 425940 418574 411123 403557 396268 389369
63292C89369o490n764m900m595m862m809l967l017k659k606k352k182k621l362
$$ 389369 382879 377115 372215 367620 362758 357949 353982 350965 348306 345700 343348 341166 338545 335183
63278C35183l543k927k123j673j386p48K59R14M27j097k541k873k161j210m15
$$ 335183 331640 328713 326590 324917 323531 322783 323042 323956 324383 323286 320745 317872 315711 314501 314086
63263C14086L19P74M24n28r73k28J038J705J530J051P00M97M17M97O64Q56J165
$$ 314086 314405 315179 315603 315075 314102 313874 314912 316617 318147 319198 319898 320395 320812 321309 321973 322829 323994
63246C23994J636K095K363K429K299K007J936K609L907M953N151M900M891N182
$$ 323994 325630 327725 330088 332517 334816 336823 338759 341368 345275 350228 355379 360279 365170 370352
63232C70352N487N909O645P314P390P104P195P737P971P390O376N547N143N253
$$ 370352 375839 381748 388393 395707 403097 410201 417396 425133 433104 440494 446870 452417 457560 462813
63218D62813O098P635R189R916R534Q402P039N734M526L332K178J286Q09M32m85
$$ 462813 468911 476546 485735 495651 505185 513587 520626 526360 530886 534218 536396 537682 538491 538923 538438
63203E38438k228m342o064p017p343p347p208p014o792o453n815m747l234j375
$$ 538438 536210 531868 525804 518787 511444 504097 496889 489875 483083 476630 470815 466068 462834 461459
63189D61459O42K529M043N138N942O492O694O725P180Q492J0236J1482J1878J1928
$$ 461459 462101 464630 468673 473811 479753 486245 492939 499664 506844 515336 525572 537054 548932 560860
63175E60860J2098J2185J1946J1685J1637J1274J0073Q647Q084Q240P809O208
$$ 560860 572958 585143 597089 608774 620411 631685 641758 650405 658489 666729 674538 680746
63163F80746M314K882J297j314m665p862j0729j3614j6315j8192j9112j9362j8910
$$ 680746 685060 687942 689239 687925 683260 675398 664669 651055 634740 616548 597436 578074 559164
63150E59164j7627j6114j5231j4870j4117j2735j1475j0726r905q586p261o316
$$ 559164 541537 525423 510192 495322 481205 468470 456995 446269 436364 427778 420517 414201
63138D14201n202l377j497p47j261k007k068j405m89K00L72J81K79J164K436L191
$$ 414201 408999 405622 404125 403378 402117 400110 398042 396637 396148 396348 396720 396901 397180 398344 400780 403971
63122D03971L128K879L161L983M802N105M776M202M077M760N768O197N745N006
$$ 403971 407099 409978 413139 417122 421924 427029 431805 436007 440084 444844 450612 456809 462554 467560
63108D67560M650M681M744M708M679M645M541M489M693N113N553N979O487O983
$$ 467560 472210 476891 481635 486343 491022 495667 500208 504697 509390 514503 520056 526035 532522 539505
63094E39505P236P245P233P225O978O442N979N817N633M943L778K495J098p75
$$ 539505 546741 553986 561219 568444 575422 581864 587843 593660 599293 604236 608014 610509 611607 610832
63080F10832l013m801n551n716o161o964p404p038o216n356m377l224k338k099
$$ 610832 607819 603018 597467 591751 585590 578626 571222 564184 557968 552612 548235 545011 542673 540574
63066E40574k086j599p14j26N3N27J666K919L807M795O515Q573R976J0526J1009
$$ 540574 538488 536889 536175 536049 536102 536629 538295 541214 545021 549816 556331 564904 574880 585406 596415
63051E96415J1995J3269J4556J6029J7782J9336K0181K0370K0283K0120J9985
$$ 596415 608410 621679 636235 652264 670046 689382 709563 729933 750216 770336 790321
63040G90321K0125K0670K1336K1760K1938K2063K2158K2140K1996K1580K0530
$$ 790321 810446 831116 852452 874212 896150 918213 940371 962511 984507 1006087 1026617
63029A026617J8703J6449J4096J1475Q365N014J710j848o092j0661j4642j7662
$$ 1026617 1045320 1061769 1075865 1087340 1095705 1100719 1102429 1100581 1094489 1083828 1069186 1051524
63017A051524k0001k1772k2721k2945k2912k2605k1436j9353j7155j5229j2764
$$ 1051524 1031523 1009751 987030 964085 941173 918568 897132 877779 860624 845395 832631
63006H32631q975m543r55J338L280N785Q639J0982J2319J2959J3626J4786J6214
$$ 832631 823656 819113 818158 819496 822776 828561 837200 848182 860501 873460 887086 901872 918086
62993I18086J7269J7702J7924J8311J8575J8232J7446J6782J6251J5162J3130
$$ 918086 935355 953057 970981 989292 1007867 1026099 1043545 1060327 1076578 1091740 1104870
62982A104870J0714Q732P136M932J220l820r074j3555j7197k0530k3807k6729
$$ 1104870 1115584 1124316 1131452 1136384 1137604 1133784 1124710 1111155 1093958 1073428 1049621 1022892
62970A022892k8958l0488l1413l1648l1092k9763k7721k5144k2597k0742j9536
$$ 1022892 993934 963446 932033 900385 869293 839530 811809 786665 764068 743326 723790
62959G23790j8212j6343j4535j3542j3180j2696j1888j1206j0899j0733j0528
$$ 723790 705578 689235 674700 661158 647978 635282 623394 612188 601289 590556 580028
62948E80028j0385j0324j0205j0083j0126j0175r807q988q256q071q342q633q558
$$ 580028 569643 559319 549114 539031 528905 518730 508923 499935 491679 483608 475266 466633 458075
62935D58075p895o632n128l951l429l424l515l312k745k183k129k591l004k966
$$ 458075 450180 443548 438420 434469 431040 427616 424101 420789 418044 415861 413732 411141 408137 405171
62921D05171k648k250j577o38j13m71j006p05K19O85M77N13J267K043K134J677
$$ 405171 402523 400273 398696 398058 397945 397474 396468 395763 395982 396667 397144 397657 398924 400967 403101 404778
62905D04778J025K69k25K06J412K298K420K765M080N475N703N130N111N959O771
$$ 404778 405803 406072 405847 406053 407465 409763 412183 414948 419028 424503 430206 435336 440447 446406 453177
62890D53177P002O943O698N881M549L351K523J550K06r27j332j303j429j869k499
$$ 453177 460179 467122 473820 479701 484250 487601 490124 491674 491880 490953 489621 488318 486889 485020 482521
62875D82521l293m221n048n508n457m825l847l309l983n585o841o811n761m535
$$ 482521 479228 475007 469959 464451 458994 454169 450322 447013 443030 437445 430604 423793 418032 413497
62861D13497l640l174l017k703j675j85N71j61j600k360k182j943k180k349j712
$$ 413497 409857 406683 403666 400963 399288 399103 399674 399513 397913 395553 393371 391428 389248 386899 385187
62846C85187l07J234K296K504J783N55l96n62j11M94J030J473J625J220L67l55
$$ 385187 384880 386114 388410 390914 392697 393252 392856 392294 392183 392677 393707 395180 396805 398025 398392 398037
62830C98037m45j2L77L63J90L21P98J189J234J168J291J389J054M82L90J017J641
$$ 398037 397592 397580 397957 398320 398510 398831 399629 400818 402052 403220 404511 405900 406954 407436 407826 408843 410484
62813D10484J450N81j52l01j40k9QK7NJ22P53J860K772K950K678K601K824K993
$$ 410484 411934 412515 412363 412062 411922 411893 411901 411928 411933 412055 412808 414668 417440 420390 423068 425669 428493 431486
62795D31486L089L479M179M700M823M984N548O200O503O635P136Q138R411J0925
$$ 431486 434575 438054 442233 446933 451756 456740 462288 468488 474991 481626 488762 496900 506311 517236
62781E17236J2858J5010J6884J8454K0383K3211K6625K9748L1898L2848L2692
$$ 517236 530094 545104 561988 580442 600825 624036 650661 680409 712307 745155 777847
62770G77847L1763L0495K8980K6760K3329J8812J3909R146M469l49n195r719j3792
$$ 777847 809610 840105 869085 895845 919174 937986 951895 961041 965510 965161 959966 950247 936455
62757I36455j7551k0983k3733k5500k6448k6969k7148k6810k6113k5698k5883
$$ 936455 918904 897921 874188 848688 822240 795271 768123 741313 715200 689502 663619
62746F63619k5997k4961k2571j9807j7761j6609j5766j4718j3401j1968j0596
$$ 663619 637622 612661 590090 570283 552522 535913 520147 505429 492028 480060 469464
62735D69464r500q787q220p388o177m873l761k830j998j397j163j077p12M6Q66
$$ 469464 459964 451177 442957 435569 429392 424519 420758 417928 415930 414533 413370 412293 411581 411627 412493
62720D12493J361J495J533J767K330L138L889M273M346M515N085N886O625P449
$$ 412493 413854 415349 416882 418649 420979 424117 428006 432279 436625 441140 446225 452111 458736 466185
62706D66185Q873J1081J3581J5702J7253J8535J9911K1542K3497K5793K8235L0431
$$ 466185 475058 486139 499720 515422 532675 551210 571121 592663 616160 641953 670188 700619
62694G00619L2161L3636L5170L6634L7494L7525L7107L6515L5112L1910K6912
$$ 700619 732780 766416 801586 838220 875714 913239 950346 986861 1021973 1053883 1080795
62683A080795K1235J5643R628K527n029j1702j7193k2364k7587l2015l4903l6690
$$ 1080795 1102030 1117673 1127301 1129828 1124799 1113097 1095904 1073540 1045953 1013938 979035 942345
62671I42345l8111l8976l8690l7442l5914l4096l1439k8178k5551k4258k3497
$$ 942345 904234 865258 826568 789126 753212 719116 687677 659499 633948 609690 586193
62660E86193k2013j9635j7227j5477j4249j3112j1926j0782r668q506p487p026
$$ 586193 564180 544545 527318 511841 497592 484480 472554 461772 452104 443598 436111 429085
62648D29085p230p532p209o199n111m317l542k539j738j637j917j801j143n09
$$ 429085 421855 414323 407114 400915 395804 391487 387945 385406 383668 382031 380114 378313 377170 376661
62634C76661j66K22Q15J182R80M91L5n99j581k338k123j103k71k24n17m10J46
$$ 376661 376495 376717 377532 378714 379694 380185 380220 379621 378040 375702 373579 372476 372205 371981 371464 371054 371200
62617C71200N46L45k61p13p02l30K28R68J829K431K392J924J726K215L110L925
$$ 371200 371746 372091 371830 371117 370415 370085 370313 371281 373110 375541 377933 379857 381583 383798 386908 390833
62601C90833M530N053N489N712N755N875O378P395Q731R904J0570J0939J1519
$$ 390833 395363 400416 405905 411617 417372 423247 429625 437020 445751 455655 466225 477164 488683
62588D88683J2410J3178J3525J3538J3165J2031J0112Q054O278M281J456j727
$$ 488683 501093 514271 527796 541334 554499 566530 576642 584696 590974 595255 596711 594984
62576E94984m206n782p320r405j1527j2790j2897j2317j1846j2092j2894j3252
$$ 594984 590778 584996 577676 568271 556744 543954 531057 518740 506894 494802 481908 468656
62564D68656j2349j0655r427r036q611p488o232n618n360m601l268k193j963k313
$$ 468656 456307 445652 436225 427189 418578 411090 404858 399240 393880 389279 386011 383818 381855 379542
62550C79542k592k391j761j151j009j187r57m3P21L85o54r74kJ178J265L58l24
$$ 379542 376950 374559 372798 371647 370638 369451 368494 368451 369172 369557 368903 367929 367927 369105 370370 370728 370404
62533C70404J6J011J804J982J763J579J622J791K001K404L185M247N293O290P469
$$ 370404 370420 371431 373235 375217 376980 378559 380181 381972 383973 386377 389562 393809 399102 405392 412861
62518D12861Q851J0084J0943J1698J2719J3963J5220J6677J8753K1256K3221K3841
$$ 412861 421712 431796 442739 454437 467156 481119 496339 513016 531769 553025 576246 600087
62506F00087K3357K2691K2318K1792K0486J8398J6050J3687J0983P574L611l85
$$ 600087 623444 646135 668453 690245 710731 729129 745179 758866 769849 777423 781034 780649
62494G80649m001o994q996r621r000p913p076o430n330l368p76J954M549O957
$$ 780649 776648 769654 760658 751037 742037 734124 727048 720618 715288 711920 711144 713098 717647 724604
62480G24604R103J0936J2617J4404J6217J7541J7877J7245J5960J4030J1062O882
$$ 724604 733707 744643 757260 771664 787881 805422 823299 840544 856504 870534 881596 888478
62468H88478J993k841p256j1349j5312j9244k3177k6833k9509l0637l0530l0082
$$ 888478 890471 887630 880374 869025 853713 834469 811292 784459 754950 724313 693783 663701
62456F63701k9671k8843k7229k5156k3027k0717j8100j5656j3852j2297j0312
$$ 663701 634030 605187 577958 552802 529775 509058 490958 475302 461450 449153 438841
62445D38841q119o546n646m573k996j655j100p58J00J140J542J327J268J665J981
$$ 438841 430722 424176 418530 413957 410961 409306 408206 407448 407548 408688 410230 411557 412825 414490 416471
62430D16471J706R42O4o44r94j020j103j597k276k609k537k507k714k877k865
$$ 416471 418177 419119 419183 418539 417545 416525 415422 413825 411549 408940 406403 403896 401182 398305 395440
62415C95440k909l013k726j896j127j083j706k433k841k700j858n60M12N28J78
$$ 395440 392531 389518 386792 384896 383769 382686 380980 378547 375706 373006 371148 370588 371000 371528 371706
62400C71706R3L28M57N35J068K002K556K350K029K330L083L644L896M192M508
$$ 371706 371799 372127 372584 373119 374187 376189 378745 381095 383124 385454 388537 392181 396077 400269 404777
62385D04777M400L853L586M236N511O542O853O754O820P283P988Q715R385J0015
$$ 404777 409177 413030 416616 420852 426363 432905 439758 446512 453332 460615 468603 477318 486703 496718
62371D96718J0689J1531J2559J3521J4079J4254J4605J5744J7680J9841K1816
$$ 496718 507407 518938 531497 545018 559097 573351 587956 603700 621380 641221 663037
62360F63037K3983K7175L1701L6836M1484M5272M8729N2263N5377N7229N7722
$$ 663037 687020 714195 745896 782732 824216 869488 918217 970480 1025857 1083086 1140808
62349A140808N7381N6103N2783M6625L8338K9502K0985J2568L898m847j3275k1060
$$ 1140808 1198189 1254292 1307075 1353700 1392038 1421540 1442525 1455093 1458991 1454144 1440869 1419809
62337A419809k7765l2908l6538l9347m1891m3932m4834m4338m2708m0342l7549
$$ 1419809 1392044 1359136 1322598 1283251 1241360 1197428 1152594 1108256 1065548 1025206 987657
62326I87657l4599l1702k8942k6386k4172k2374k0941j9918j9478j9570j9694
$$ 987657 953058 921356 892414 866028 841856 819482 798541 778623 759145 739575 719881
62315G19881j9361j8669j8138j8048j8204j8252j7899j6890j5122j2995j1270
$$ 719881 700520 681851 663713 645665 627461 609209 591310 574420 559298 546303 535033
62304E35033j0333r728q693p039n342m226l746l520l278k993k578j818p41J95
$$ 535033 524700 514972 506279 499240 493898 489672 485926 482406 479128 476135 473557 471739 470998 471193
62290D71193N68N39O64J272K193L071L653L844L789L892M350M745M514L883L757
$$ 471193 471761 472300 472964 474236 476429 479500 483153 486997 490786 494678 499028 503773 508287 512170 515927
62275E15927M483N275N259M601M129M234M716N471O645Q266J0217J2523J5184
$$ 515927 520410 525685 530944 535545 539674 543908 548624 554095 560740 569006 579223 591746 606930
62262F06930J7814K0069K2367K5474K9363L3156L6485M0148M4957N0483N5451
$$ 606930 624744 644813 667180 692654 722017 755173 791658 831806 876763 927246 982697
62251I82697N9049O1172O1694O0150N6279N0400M3096L4726K5492J5731O014l161
$$ 982697 1041746 1102918 1164612 1224762 1281041 1331441 1374537 1409263 1434755 1450486 1456500 1453339
62239A453339j1700j9881k7866l5259m1371m5962m9508n2531n4807n5567n4405
$$ 1453339 1441639 1421758 1393892 1358633 1317262 1271300 1221792 1169261 1114454 1058887 1004482
62228A004482n1827m8733m5512m1883l7654l3362k9876k7369k5109k2452j9622
$$ 1004482 952655 903922 858410 816527 778873 745511 715635 688266 663157 640705 621083
62217F21083j7200j5241j3411j1813j0918j0711j0486r725q584p404o303n483
$$ 621083 603883 588642 575231 563418 552500 541789 531303 521578 512994 505590 499287 493804
62205D93804n255n371m926l490j865j107j168j173p14q9N67J608L165M797O024
$$ 493804 488549 483178 478252 474762 472897 471790 470622 469449 468735 468646 469213 470821 473986 478783 484807
62190D84807O811P410Q025Q762R509R895R769R656J0260J1456J2316J2264J1651
$$ 484807 491618 499028 507053 515815 525324 535219 544988 554644 564904 576360 588676 600940 612591
62177F12591J1008J0310R397Q551Q134Q010P910Q193R623J2401J5886J9315K2535
$$ 612591 623599 633909 643306 651857 659991 668001 675911 684104 693727 706128 722014 741329 763864
62164G63864K5891K9707L3931L8085M1442M3367M3622M2247L9230L4470K8082
$$ 763864 789755 819462 853393 891478 932920 976287 1019909 1062156 1101386 1135856 1163938
62153A163938K0634J3009O025L2n242j0393j5672k0719k5061k8783l2281l5479
$$ 1163938 1184572 1197581 1203606 1203638 1198396 1188003 1172331 1151612 1126551 1097768 1065487 1030008
62141A030008l7656l8340l7866l6803l5102l2372k8844k5445k2723k0227j7237
$$ 1030008 992352 954012 916146 879343 844241 811869 783025 757580 734857 714630 697393
62130F97393j3832j0814q706p249n851m248k621j270k54O98J925L495N230P154
$$ 697393 683561 672747 664041 656792 650941 646693 644072 642802 642548 643246 645171 648666 653896 661050
62116F61050R574J2543J5503J7827J9433K0429K0431J8957J6420J4008J2328J0887
$$ 661050 670624 683167 698670 716497 735930 756359 776790 795747 812167 826175 838503 849390
62104H49390R183P608O743O257N175K954k04l838p497j0678j2946j4142j4290
$$ 849390 858573 866181 872924 879181 884356 887310 887106 883268 875771 865093 852147 838005 823715
62091H23715j3544j2334j1078r543p099m039j804j137o74J475N160Q482J0489
$$ 823715 810171 797837 786759 777216 770117 766078 764274 763137 762463 763938 769098 777580 788069
62078G88069J2170J4580J7305J9371K0684K1795K2956K4089K5187K6177K6775
$$ 788069 800239 814819 832124 851495 872179 893974 916930 941019 966206 992383 1019158
62067A019158K6936K7033K7258K7346K7201K7297K7962K8818K9322K9351K8794
$$ 1019158 1046094 1073127 1100385 1127731 1154932 1182229 1210191 1239009 1268331 1297682 1326476
62056A326476K7144K4067J9895J5016R340L078k683p079j0780j5142k0282k5052
$$ 1326476 1353620 1377687 1397582 1412598 1421938 1425016 1422333 1415254 1404474 1389332 1369050 1343998
62044A343998k8859l2370l6151l9649m1981m3023m3165m2548m1158l9360l7710
$$ 1343998 1315139 1282769 1246618 1206969 1164988 1121965 1078800 1036252 995094 955734 918024
62033I18024l6242l4417l1773k8456k5024k1952j9358j7176j5304j3593j1847
$$ 918024 881782 847365 815592 787136 762112 740160 720802 703626 688322 674729 662882
62022F62882j0122q888q504q619q528q194q302r076r759r601q784p887p025o126
$$ 662882 652760 643872 635368 626749 618221 610027 601725 592649 582890 573289 564505 556618 549593 543467
62008E43467n501n281m775l292j302J59J058K260M001N468O053N973N512M643
$$ 543467 537966 532685 527910 524618 523316 523475 524533 526793 530794 536262 542315 548288 553800 558443
61994E58443L683L285L337K773J050j021k375k959l285l567l963m938o562p973
$$ 558443 562126 565411 568748 571521 572571 571550 569175 566216 562931 559364 555401 550463 543901 535928
61980E35928q402q285q553r184r345q695p632o402m937l584l075l459l848l545
$$ 535928 527526 519241 510688 501504 492159 483464 475832 469430 464493 460909 457834 454375 450527 446982
61966D46982k861k466k426k285j760j011l13K27O86J152J548J666J465J256J385
$$ 446982 444121 441655 439229 436944 435184 434173 433860 434087 434773 435925 437473 439139 440604 441860 443245
61951D43245J824K279K647L137L957N136O576Q088R419J0549J1858J3774J6243
$$ 443245 445069 447348 449995 453132 457089 462225 468801 476889 486308 496857 508715 522489 538732
61938E38732J8832K1180K3075K4216K4397K3982K3774K4217K4934K5152K4343
$$ 538732 557564 578744 601819 626035 650432 674414 698188 722405 747339 772491 796834
61927G96834K2489K0082J7864J6211J4661J2372R138N639K530j82k743n067o898
$$ 796834 819323 839405 857269 873480 888141 900513 909651 915290 917820 917638 914895 909828 902930
61914I02930q209q978q870p586n365k743J10L403P100J0632J3345J4930J5364
$$ 902930 894721 885743 876873 869287 863922 861179 861289 864692 871792 882424 895769 910699 926063
61901I26063J4782J3513J1998J0373Q258N137R98l536p757j1538j5281j9196k2665
$$ 926063 940845 954358 966356 976729 984987 990124 991122 987586 979829 968291 953010 933814 911149
61888I11149k4669k4880k4087k3318k2797k2039k0772j9281j7904j6732j5867
$$ 911149 886480 861600 837513 814195 791398 769359 748587 729306 711402 694670 678803
61877F78803j5472j5288j4619j3219j1838j1371j1554j1144r350o699m358l016
$$ 678803 663331 648043 633424 620205 608367 596996 585442 574298 564948 558249 553891 550875
61865E50875k503k141j267L06K156L800N378P477J0165J2703J4461J5777J7477
$$ 550875 548372 546231 544964 545270 547426 551226 556604 564081 574246 586949 601410 617187 634664
61852F34664J9914K2902K6247K9798L3043L5356L6760L7915L9201M0212M0304
$$ 634664 654578 677480 703727 733525 766568 801924 838684 876599 915800 956012 996316
61841I96316L9271L7247L4298L0442K5789K0381J4163P392Q92m454q381j1155
$$ 996316 1035587 1072834 1107132 1137574 1163363 1183744 1197907 1205299 1206191 1201737 1193356 1182201
61829A182201j2913j3447j2534j0121o192r09M930R967J3239J4973J6042J6628
$$ 1182201 1169288 1155841 1143307 1133186 1126994 1126085 1131015 1140982 1154221 1169194 1185236 1201864
61817A201864J5808J2592P104M88o189j2569j8721k4692l0408l5643l9812m2160
$$ 1201864 1217672 1230264 1237368 1237856 1231667 1219098 1200377 1175685 1145277 1109634 1069822 1027662
61805A027662m2485m1433l9796l7711l4914l1591k8444k5859k3438k0598j7324
$$ 1027662 985177 943744 903948 866237 831323 799732 771288 745429 721991 701393 684069
61794F84069j4311j2397j1853j1902j1171q980o237m536m307m422l816k855k583
$$ 684069 669758 657361 645508 633606 622435 613455 607218 602682 598375 593953 590137 587282 584699
61781E84699l079l359k804j997j866k464l011k965k635k576k762k705k363k400
$$ 584699 581620 578261 575457 573460 571594 569130 566119 563154 560519 557943 555181 552476 550113 547713
61767E47713l237m232m349l480k535k179k166j994j603j089k80Q11J605J592J163
$$ 547713 544476 540244 535895 532415 529880 527701 525535 523541 521938 520849 520569 521380 522985 524577 525740
61752E25740J133J569J703J071K46J16Q19J627J760J117K54j90j6M99R90J270
$$ 525740 526873 528442 530145 531216 531462 531578 532397 534024 535784 536901 537155 536965 536949 537448 538438 539708
61736E39708J298J091P42L96J68J71N90J454K369K763K521K052J698J464J400
$$ 539708 541006 542097 542839 543235 543403 543574 544164 545618 547987 550750 553271 555323 557021 558485 559885
61721E59885J758K532L240L504L493L479L391L185L250L842M450M311L373K233
$$ 559885 561643 564175 567415 570919 574412 577891 581282 584467 587717 591559 596009 600320 603693 605926
61707F05926J249K66q35j851k552k803k436j397n9R71J414J369J031O78P78J514
$$ 605926 607175 607441 606606 604755 602203 599400 596964 595567 595508 596479 597893 599262 600293 600971 601749 603263
61691F03263K287K231J272J68m98q23j078j291j514j949k572l009l034k812k588
$$ 603263 605550 607781 609053 609221 608723 607900 606822 605531 604017 602068 599496 596487 593453 590641 588053
61676E88053k472k629l193l826l911l343k676k274j810j047m92p46j533j941j626
$$ 588053 585581 582952 579759 575933 572022 568679 566003 563729 561919 560872 560380 559634 558101 556160 554534
61661E54534j149j133j495j682j467j182j247j532j410n03P80J645J804J648J628
$$ 554534 553385 552252 550757 549075 547608 546426 545179 543647 542237 541734 542514 544159 545963 547611 549239
61646E49239J733J725J535J355J474K097L104M006M296L907L139K267J453Q23
$$ 549239 550972 552697 554232 555587 557061 559158 562262 566268 570564 574471 577610 579877 581330 582153
61632E82153K74o30k033l292l718l657m051m875n050m132l102k924l200l041k496
$$ 582153 582427 581797 579764 576472 572754 569097 565046 560171 555121 550989 547887 544963 541763 538722 536226
61617E36226k152j896j170j92J20n26j458k103k567k960l040k819k828l346l868
$$ 536226 534074 532178 531008 530816 530936 530410 528952 526849 524282 521322 518282 515463 512635 509289 505421
61602E05421l837l473l418l897m691n610o434o583n621m117l358l827m489m072
$$ 505421 501584 498111 494693 490796 486105 480495 474061 467478 461857 457740 454382 450555 446066 441994
61588D41994k778k000k407l101k965k240k070k785l435l122k140j514j822k741
$$ 441994 439216 437216 434809 431708 428743 426503 424433 421648 418213 415091 412951 411437 409615 406874
61574D06874l466l305k161p55j83r17k269l104k958k351k070k311k524k028q80
$$ 406874 403408 400103 397942 397187 397004 396087 393818 390714 387756 385405 383335 381024 378500 376472 375592
61559C75592m2m55j928l237l471k869k242j861j361m54O12J291J229O08M9M9L47
$$ 375592 375550 375095 373167 369930 366459 363590 361348 359487 358126 357672 358284 359575 360804 361412 361461 361510 361857
61542C61857K20n40j249j188m71K48O51R06J196J537J953K385K530K125J368P02
$$ 361857 362077 361537 360288 359100 358629 358877 359528 360434 361630 363167 365120 367505 370035 372160 373528 374230
61526C74230K47j95o19p92p47r22j582k427k937k906k548k173j965j944k036k113
$$ 374230 374477 374282 373663 372871 372124 371202 369620 367193 364256 361350 358802 356629 354664 352720 350684 348571
61510C48571k012j580q36j13Q3m67j441k175k133j236M5R34R04J61n72p84n44
$$ 348571 346559 344979 344143 344030 344113 343646 342205 340030 337897 336661 336706 337640 338544 338705 338133 337349 336805
61493C36805j70J40L04K69J25L3l8k65n81o65l63Q6M03M42O5o61j099n47P30J645
$$ 336805 336635 336775 337079 337348 337473 337506 337468 337203 336622 335957 335594 335680 336083 336525 336590 335929 334830 334283 335013 336658
61473C36658J714J602J856J996J497Q31O61O21J2p81p26J84Q21N45j27n25n83
$$ 336658 338372 339974 341830 343826 345323 346154 346815 347436 347448 346667 345941 346125 346946 347491 347364 346839 346256
61456C46256m31q2K20K8n86r87q06l32O1K71K03j96m66oR51J392Q93K79N29J539
$$ 346256 345825 345743 345963 345991 345405 344418 343612 343280 343341 343612 343815 343619 343153 343147 344098 345490 346383 346662 347191 348730
61436C48730K416K551K065J547J642K514L542L912L570L146K891K425J645J125
$$ 348730 351146 353697 355762 357309 358951 361465 365007 368919 372489 375635 378526 380951 382596 383721
61422C83721J235J530J506J378J561J933K134K214K443K765K884K636J962Q74
$$ 383721 384956 386486 387992 389370 390931 392864 394998 397212 399655 402420 405304 407940 409902 410776
61408D10776k33p13m78k29n03r95j261j531k149k751k755k386k345k647k648k181
$$ 410776 410543 409830 409352 409123 408620 407625 406364 404833 402684 399933 397178 394792 392447 389800 387152 384971
61392C84971j925k352k962k887j979r58o23j028j476j305o37j89k85m99l21K08
$$ 384971 383046 380694 377732 374845 372866 371908 371285 370257 368781 367476 366839 366650 366365 365866 365545 365753
61376C65753P88J307J668J612J164Q06P79O27K7m44j05O47Q93P28J206K630L878
$$ 365753 366541 367848 369516 371128 372292 373098 373877 374504 374531 374087 373982 374629 375522 376250 377456 380086 383964
61359C83964L872K941K240K295K712L002L162L506M252N319O425P385Q259R044
$$ 383964 387836 390777 393017 395312 398024 401026 404188 407694 411946 417265 423690 431075 439334 448378
61345D48378R422R113Q493Q421R242J0284J0576R934R062Q651Q526P834O029L620
$$ 448378 457800 466913 475406 483827 493069 503353 513929 523863 532925 541576 550102 557936 563965 567585
61331E67585J727R03O29P7r42k032k913l620m204m657n022n228m968m170l385
$$ 567585 569312 570215 570844 570921 569979 567947 565034 561414 557210 552553 547531 542303 537335 533165 529780
61316E29780l197l304k825j553j97P18J485K454L287L501L288L214L456L809M245
$$ 529780 526583 523279 520454 518901 518704 519422 520907 523361 526648 530149 533437 536651 540107 543916 548161
61301E48161M924N826O863Q131R539J0310R564P490N230L444J618q40l467n338
$$ 548161 553085 558911 565774 573905 583444 593754 603318 610808 616038 619482 621100 620260 616793 611455
61287F11455o333p047p668p800p377o888o417n336l452j762j314j780j959j341
$$ 611455 605122 598075 590407 582607 575230 568342 561925 556589 553137 551375 550061 548281 546322 544981
61273E44981l51P89K370M239N506N670N332N368N941O711P459P941P718O757N895
$$ 544981 544630 545419 547789 552028 557534 563204 568536 573904 579845 586556 594015 601956 609674 616431 622326
61258F22326O068P212Q458R194R523R846J0535J1856J3604J4826J4400J2088Q784
$$ 622326 628394 635606 644064 653258 662781 672627 683162 695018 708622 723448 737848 749936 758720
61245G58720N716L484J802o0k419m737o217o863p432q224q626q243p710p619p361
$$ 758720 764436 767920 769722 769662 767243 762506 756289 749426 741994 733770 725144 716901 709191 701572 694211
61230F94211o088m300l303l292l125k145r68k23M15J480K850M139N183N719N312
$$ 694211 688123 683823 680520 677228 674103 671958 670990 670767 671182 672662 675512 679651 684834 690553 695865
61215F95865M166L348L549M158M153L401K497J778J292J324K097L009L033K021
$$ 695865 700031 703379 706928 711086 715239 718640 721137 722915 724207 725531 727628 730637 733670 735691
61201G35691R82Q67J478J936J865J835K657M473O694Q674J0355J2107J4124J6265
$$ 735691 736673 737540 739018 740954 742819 744654 747311 751784 758478 767152 777507 789614 803738 820003
61187H20003J8371K0358K1857K2181K1000J8882J6839J5336J3934J1996R606P719
$$ 820003 838374 858732 880589 902770 923770 942652 959491 974827 988761 1000757 1010363 1018082
61175A018082P212P817Q225P395N508L419J510l99k304l920n334o995q903j0448
$$ 1018082 1025294 1033111 1041336 1048731 1054239 1057658 1059168 1058769 1056465 1052545 1047211 1040216 1031313 1020865
61161A020865j1382j2307j3812j5648j7152j8084j8556j8537j7998j7230j6533
$$ 1020865 1009483 997176 983364 967716 950564 932480 913924 895387 877389 860159 843626
61150H43626j5700j4363j2679j1219j0123q821o711l898j124Q47J724J693J016
$$ 843626 827926 813563 800884 789665 779542 770721 764010 760112 758988 759835 761559 763252 764268
61137G64268k30j987l875n318o007o028n580m897m328m004l396j741R08L571N525
$$ 764268 764038 762051 758176 752858 746851 740823 735243 730346 726018 722014 718618 716877 717785 721356 726881
61122G26881P090Q897J0926J2759J4413J6311J8612K1058K3312K5125K6307K6943
$$ 726881 733971 742868 753794 766553 780966 797277 815889 836947 860259 885384 911691 938634
61110I38634K7533K8543K9885L1101L1903L2171L1700L0327K8300K6167K4254
$$ 938634 966167 994710 1024595 1055696 1087599 1119770 1151470 1181797 1210097 1236264 1260518
61099A260518K2505K0689J8538J5719J2008P583K982j261n009q550j2235j5991
$$ 1260518 1283023 1303712 1322250 1337969 1349977 1357560 1360542 1359281 1354272 1345722 1333487 1317496
61087A317496j9346k2017k4299k6499k8266k9018k8875k8536k8241k7589k6416
$$ 1317496 1298150 1276133 1251834 1225335 1197069 1168051 1139176 1110640 1082399 1054810 1028394
61076A028394k5148k4039k2834k1439k0159j8968j7324j5118j2983j1268r500
$$ 1028394 1003246 979207 956373 934934 914775 895807 878483 863365 850382 839114 829614
61065H29614p373n412m007k701j133K28J106K229M043N607O002O072P275R360
$$ 829614 822241 816829 812822 810121 808988 809216 810322 812551 816594 822201 828203 834275 841550 850910
61051H50910J0752J0956J1031J1764J2912J4270J6101J8202J9881K1241K3276
$$ 850910 861662 872618 883649 895413 908325 922595 938696 956898 976779 998020 1021296
61040A021296K6317K9365L1489L2924L4361L5954L7498L9002M0669M2698M5193
$$ 1021296 1047613 1076978 1108467 1141391 1175752 1211706 1249204 1288206 1328875 1371573 1416766
61029A416766M7908N0290N2266N4683N8161O2004O5153O7691P0216P2264P3016
$$ 1416766 1464674 1514964 1567230 1621913 1680074 1742078 1807231 1874922 1945138 2017402 2090418
61018B090418P3312P5258P9836Q6515R5188J06488J19957J33951J47968J63338
$$ 2090418 2163730 2238988 2318824 2405339 2500527 2607015 2726972 2860923 3008891 3172229
61008C172229J81307K02462K28553K62562L06355L60640M27935N12726O18075
$$ 3172229 3353536 3555998 3784551 4047113 4353468 4714108 5142043 5654769 6272844
60999F272844P45754R00821J090822J317533J574935J858111K162034K455408
$$ 6272844 7018598 7919419 9010241 10327774 11902709 13760820 15922854 18378262
60991A8378262K659289K675966K457925K046108J533885J003711N12975J27784
$$ 18378262 21037551 23713517 26171442 28217550 29751435 30755146 31268121 31395905
60983C1395905p2751n9467Q5224J96768J35869j32769n57953j068574j603428
$$ 31395905 31323154 31263687 31348911 31545679 31681548 31548779 30990826 29922252 28318824
60974B8318824k092964k452430k618170k587193k411602k157666j875386j596842
$$ 28318824 26225860 23773430 21155260 18568067 16156465 13998799 12123413 10526571
60966A0526571j343508j126046r43496p90012o61933n57141m71688m00936l42514
$$ 10526571 9183063 8057017 7113521 6323509 5661576 5104435 4632747 4231811 3889297
60957C889297k95457k57668k26470k00605j79600j61866j45254j29092j14172
$$ 3889297 3593840 3336172 3109702 2909097 2729497 2567631 2422377 2293285 2179113
60948B179113j01082q9733q0182p2761o7433o3782o1424n9859n8350n6529n4692
$$ 2179113 2078031 1988298 1908116 1835355 1767922 1704140 1642716 1582857 1524507 1467978 1413286
60937A413286n3005n1021m8456m5793m3556m1588l9620l7835l6306l4575l2407
$$ 1413286 1360281 1309260 1260804 1215011 1171455 1129867 1090247 1052412 1016106 981531 949124
60926I49124l0292k8555k6748k4632k2863k1903k1008j9388j7605j6727j6591
$$ 949124 918832 890277 863529 838897 816034 794131 773123 753735 736130 719403 702812
60915G02812j6039j4556j2586j0505q414o766o136o289o360n971n379m615l302
$$ 702812 686773 672217 659631 649126 640712 633946 627810 621521 615161 609190 603811 599196 595894
60902E95894j496O5P32N28n1l98j19N42P98K95k96k20J96P6o97j532k233l078
$$ 595894 594398 594463 595195 595723 595672 595274 595155 595697 596495 596790 596494 596274 596470 596546 595849 594317 592084 589006
60884E89006l917m175l835l573l706l820l602l356l476l999m830n843o610o622
$$ 589006 585089 580914 577079 573506 569800 565980 562378 559022 555546 551547 546717 540874 534264 527642
60870E27642n969n255m795m445m156m129m247m085l594l149k766j969o63N24J067
$$ 527642 521673 516418 511623 507178 503022 498893 494646 490561 486967 483818 481052 479083 478420 478944 480011
60855D80011J164J230J322J395J573J836J917J822K024K736L479L719L568L433
$$ 480011 481175 482405 483727 485122 486695 488531 490448 492270 494294 497030 500509 504228 507796 511229
60841E11229L349L058K462J668P29k40q50p39m8O24P29K20m71q28p45n67n37l98
$$ 511229 514578 517636 520098 521766 522495 522255 521405 520666 520618 521242 521971 522191 521720 520892 520147 519580 519043 518645
60823E18645J44P77R18O21N48R19J117N60n44j552k125k344k462k804l540m388
$$ 518645 518789 519566 520484 521105 521653 522572 523689 524249 523705 522153 520028 517684 515222 512418 508878 504490
60807E04490m851m879m884m979m805m316m132m611n092m648l344k209k055k701
$$ 504490 499639 494760 489876 484897 480092 475776 471644 467033 461941 457293 453949 451740 449685 446984
60793D46984l297l131k244j469j639k617l331l016k066j365j113p98r0P16J170
$$ 446984 443687 440556 438312 436843 435204 432587 429256 426240 424174 422809 421696 420898 420808 421524 422694
60778D22694J179R60P24M98K43J52O10J701K818L214K915K702L078L730M198M576
$$ 422694 423873 424833 425557 426055 426298 426450 427060 428761 431579 434793 437708 440410 443488 447218 451416 455992
60762D55992N206O086O912P442P478O835N666M541L884L595L416L343L374L237
$$ 455992 461198 467284 474196 481638 489116 495951 501617 506158 510042 513637 517053 520396 523770 527007
60748E27007K747K159J856J970K506L413M168L851K197J58j194j928k856m159
$$ 527007 529754 531913 533769 535739 538245 541658 545826 549677 551874 552032 550838 548910 546054 541895
60734E41895n283n917o348o708o646n909m794l870l594m092m997n524n194m375
$$ 541895 536612 530695 524347 517639 510993 505084 500290 496420 492826 488734 483737 478213 473019 468644
60720D68644l728l251k441j286l84n7L0J87K70K01L37R20J577J832J856K278L306
$$ 468644 464916 461665 459224 457938 457554 457497 457527 457714 457984 458185 458522 459442 461019 462851 464707 466985 470291
60703D70291M477N313N874O438O841O607N850N556O450P840Q318P604O853O943
$$ 470291 474768 480081 485955 492393 499234 505841 511691 517247 523697 531537 539855 547459 554312 561255
60689E61255P422P579P607P869P849O967N931N978P007P736P631P490P937Q558
$$ 561255 568677 576256 583863 591732 599581 606548 612479 618457 625464 633200 640831 648321 656258 664816
60675F64816Q842Q936Q989Q763Q408Q694R819J0802J0753J0090R775R896R781
$$ 664816 673658 682594 691583 700346 708754 717448 727267 738069 748822 758912 768687 778583 788364
60662G88364R107Q127P012N706M227K645Q84j030k762m051n006n684n857n665
$$ 788364 797471 805598 812610 818316 822543 825188 826072 825042 822280 818229 813223 807539 801682 796017
60648G96017n970p358r097r927r654r205r186r296r289r625j0640j1706j1764
$$ 796017 790047 782689 773592 763665 754011 744806 735620 726324 717035 707410 696770 685064 673300
60635F73300j0617r219q661r040r426q837p217n380m066l316k806k385k065j709
$$ 673300 662683 653464 644803 635763 626337 617500 610283 604903 600837 597521 594715 592330 590265 588556
60621E88556j162n77k23q3P8K87K78j10p39j365j817j995j921j799j869k194k717
$$ 588556 587394 586817 586594 586511 586589 586876 587154 587044 586305 584940 583123 581128 579207 577408 575539 573345 570628
60604E70628l409m218m930n283n231m988m842n004n469n939o031n661n038m277
$$ 570628 567219 563001 558071 552788 547557 542569 537727 532723 527254 521315 515284 509623 504585 500308
60590E00308l273k213j756k290l194l363k428j159n88r51j462j011Q06L121M457
$$ 500308 497035 494822 493066 490776 487582 484219 481791 480632 480044 479093 477631 476620 477426 480547 485004
60575D85004M183L151K717L342M501N680O914Q471J0435J2680J4906J6663J7692
$$ 485004 489187 492338 495055 498397 502898 508578 515492 523963 534398 547078 561984 578647 596339
60562E96339J8202J8498J8425J7561J5840J3553J0712O960K285k591o687r457
$$ 596339 614541 633039 651464 669025 684865 698418 709130 716090 718375 715784 709097 699640
60550F99640j0883j1259j0937j0035q256n266j369K494N601Q082J0613J3593J6695
$$ 699640 688757 677498 666561 656526 648270 643004 641635 644129 649730 657812 668425 682018 698713
60537F98713J9152K0449K0845K0939K0651J8948J5042R551L983p97m899q357j0623
$$ 698713 717865 738314 759159 780098 800749 819697 834739 844290 848273 847476 842577 834220 823597
60524H23597j1261j0536q986p071n383m457l994l000j190M17R20Q90J493K777
$$ 823597 812336 801800 792814 785743 780360 775903 771909 768909 767719 768136 769056 769946 771439 774216
60510G74216L774M056M274N089O370P570Q389Q958R856J1913J5500K0070K4948
$$ 774216 777990 782046 786320 791409 797779 805349 813738 822696 832552 844465 859965 880035 904983
60497I04983L0388L7129M4971N2710N9630O6080P2112P6502P7810P5714P0490
$$ 904983 935371 972500 1017471 1070181 1129811 1195891 1268003 1344505 1422315 1498029 1568519
60486A568519O1750M8788L2010J3029o676k6362m5134o1413p3775q1800q5704
$$ 1568519 1630269 1679057 1711067 1724096 1717420 1691058 1645924 1584511 1510736 1428936 1343232
60475A343232q5721q2400p7052p1075o4883n8102n0820m4000l8431l3879k9700
$$ 1343232 1257511 1175111 1098059 1026984 962101 903999 853179 809179 770748 736869 707169
60464G07169k5886k2959k0975j9282j7315j5191j3267j1565r973q754q321q474
$$ 707169 681283 658324 637349 618067 600752 585561 572294 560729 550756 542002 533681 525207
60452E25207q381p477o166n279m994m661l730k552k007k378k966k937k354k007
$$ 525207 516826 509349 503183 497904 492910 488249 484519 481967 479960 477582 474616 471679 469325 467318
60438D67318k202k227j313J37Q71L11p39j172r15p83j291k123k726l018l254l560
$$ 467318 465116 462889 461576 461713 462584 462895 462156 460984 460069 459286 457995 455872 453146 450128 446874 443314
60422D43314l748l518k749j689q89p13q74o91P9Q96J137Q66O73Q77J239J381J200
$$ 443314 439566 436048 433299 431610 430721 430008 429134 428443 428522 429418 430555 431421 432094 432971 434210 435591 436791
60405D36791Q18M22K18K88M05K04l17o81m88J06N90P03O39P31J101J571J764J418
$$ 436791 437609 438031 438249 438537 438942 439146 438829 438148 437660 437766 438356 439059 439698 440429 441530 443101 444865 446283
60387D46283P28K76L59N43K14m29m41O10J918K358J832J203J021R99Q09O95R37
$$ 446283 447011 447287 447646 448189 448403 447974 447533 448143 450061 452419 454251 455454 456475 457474 458283 458978 459915
60370D59915J212J035N38K79M14N91O23O94Q54Q67P13P21R23Q73M18J84P38J665
$$ 459915 461127 462162 462700 462979 463393 463984 464607 465301 466155 467022 467735 468456 469379 470252 470670 470854 471592 473257
60352D73257K049J667J113Q45P69P54R44J363J730J868J893J870J707J583K003
$$ 473257 475306 476973 478086 478931 479700 480454 481398 482761 484491 486359 488252 490122 491829 493412 495415
60337D95415L049L934L735K427Q34k75p81j039j420j936k130j557n06N9l87j104
$$ 495415 498464 502398 506133 508560 509394 509119 508338 507299 505879 503943 501813 500256 499750 499809 499422 498318
60321D98318r46J95J348J862K140K794L692M332M760N459O535P590Q471R616J1431
$$ 498318 497372 497567 498915 500777 502917 505711 509403 513735 518495 523954 530489 538079 546550 556166 567597
60306E67597J3701J5930J8088K0675K4075K8021L1619L3803L3857L1705K7645
$$ 567597 581298 597228 615316 635991 660066 688087 719706 753509 787366 819071 846716
60295H46716K1744J3735L826o658j5924k3007k8015l1151l2190l1140k8722k5692
$$ 846716 868460 882195 886021 879363 863439 840432 812417 781266 749076 717936 689214 663522
60283F63522k2148j8029j3906j0619q329o555n055m074l791m078m774n622o055
$$ 663522 641374 623345 609439 598820 590491 583936 578881 574807 571016 566938 562164 556542 550487
60270E50487n728n165n175n608n492m568l714l546l515k918j998j341q56k17K05
$$ 550487 544759 539594 534419 528811 523319 518751 515037 511491 507976 505058 503060 501719 500863 500646 500851
60255E00851j98j165j733j477q71m46k33k8K66O40R16P67K04j70K01J052J655
$$ 500851 500653 499488 497755 496278 495407 494961 494728 494700 494966 495606 496522 497289 497493 497323 497524 498576 500231
60238E00231J773J694J542J191Q32Q79J279J523J490J667K322L051L420L582L906
$$ 500231 502004 503698 505240 506431 507263 508142 509421 510944 512434 514101 516423 519474 522894 526476 530382
60223E30382M327M394L795K659J497Q61Q59R75O61M4k26J69R39J742K500L157
$$ 530382 534709 539103 542898 545557 547054 547915 548774 549749 550410 550454 550228 550397 551336 553078 555578 558735
60207E58735L528L581L475L218K708K129J884K026K242K450K912L485L460K454
$$ 558735 562263 565844 569319 572537 575245 577374 579258 581284 583526 585976 588888 592373 595833 598287
60193E98287J024j8m63n23k17M71J136J191N15m68j255j548j324r42j035j837
$$ 598287 599311 599293 598830 598307 598090 598561 599697 600888 601403 600935 599680 598132 596808 595866 594831 592994
60177E92994k807l179k908k663k875l210l059k351j564j039n25L52J319J547P96
$$ 592994 590187 587008 584100 581437 578562 575352 572293 569942 568378 567339 566814 567166 568485 570032 570828
60162E70828L0L59J501K038J308L54N70J948L226L438K785K038J576J171M76l63
$$ 570828 570858 571217 572718 574756 576064 576418 576988 578936 582162 585600 588385 590423 591999 593170 593646 593283
60146E93283o17L16K090L562L941L597L521M244N483O652P439P984Q598R302R655
$$ 593283 592666 592982 595072 598634 602575 606172 609693 613937 619420 626072 633511 641495 650093 659395 669050
60131F69050R247Q282P218N891L591K29l132n298o056n976n567n098m728m238
$$ 669050 678297 686579 693797 699688 703279 703508 700376 695078 689022 683046 677479 672381 667653 663415
60117F63415l036j062O52J020K87k93n3N36Q42Q70Q84R54J078J303J487J303P35
$$ 663415 660379 659317 659969 660989 661276 660983 660930 661466 662308 663178 664062 665016 666094 667397 668884 670187 670922
60100F70922K05M3O6j78r99k357l762m388l758k375j251o44K50K099M420O131
$$ 670922 671127 671170 671236 671058 670059 667702 663940 659552 655794 653419 652168 651524 651774 653873 658293 664424
60084F64424O803O886O930O987O785O160N231M298L530K692J247j032l574n389
$$ 664424 671227 678113 685043 692030 698815 704975 710206 714504 718034 720726 721973 720941 717367 711978
60070G11978n961n697n473n867o849q015q908r141q539p356o283n968o403o894
$$ 711978 706017 700320 694847 688980 682131 674116 665208 656067 647528 640172 633889 627921 621518 614624
60056F14624o731n796m569l628l295l534m009m265l990l201k203j401j054j085
$$ 614624 607893 602097 597528 593900 590605 587071 583062 578797 574807 571606 569403 568002 566948 565863
60042E65863j106q52m86k96q9O83K097L418L875L511K998K770K651K236J440N84
$$ 565863 564757 563905 563419 563123 563034 563717 565814 569232 573107 576618 579616 582386 585037 587273 588713 589297
60026E89297M2k56q89k255l894m900n085n187n780o516o793o614o305n879n267
$$ 589297 589339 589083 588194 585939 582045 577145 572060 566873 561093 554577 547784 541170 534865 528986 523719
60011E23719m785m719m679m094l108k341j931j505j027q58r44p05N9P86R39O50
$$ 523719 518934 514215 509536 505442 502334 499993 498062 496557 495530 494672 493728 493023 493082 493868 494807 495457
59995D95457K81o3l47l33J10P56J292J642J870K047K302K719L114L189K979K795
$$ 495457 495738 495675 495328 494995 495105 495861 497153 498795 500665 502712 505014 507733 510847 514036 517015 519810
59979E19810K718K530K139J644R95J36n69o67m89q54j775k221j605p07n32r15
$$ 519810 522528 525058 527197 528841 529836 529972 529403 528736 528247 527393 525618 523397 521792 521085 520553 519638
59963E19638r76m26L58J198K138K867K944K562K339K310J852P55l42q48j016j461
$$ 519638 518662 518236 518594 519792 521930 524797 527741 530303 532642 534952 536804 537559 537217 536369 535353 533892
59947E33892k199k631k297j395n64l39p64j437j893j950j715j318q40m75n40j193
$$ 533892 531693 529062 526765 525370 524806 524467 523703 522266 520373 518423 516708 515390 514550 514075 513535 512342
59931E12342k162k879k974k619k261k003j444l38Q54J443J432J461J828K116J927
$$ 512342 510180 507301 504327 501708 499447 497444 496000 495662 496516 497959 499391 500852 502680 504796 506723
59916E06723J459J076Q53Q51J314K091K474K153J887K460L342L292K125R32N89
$$ 506723 508182 509258 510111 510962 512276 514367 516841 518994 520881 523341 526683 529975 532100 533032 533621
59901E33621R25J463K047K458K291J694J449J812J968J295N03P05J832K874L391
$$ 533621 534546 536009 538056 540514 542805 544499 545948 547760 549728 551023 551526 552231 554063 556937 560328
59886E60328L849M525N057N238N417N810O094O066O145O724P503P895P791P458
$$ 560328 564177 568702 573759 578997 584414 590224 596318 602384 608529 615253 622756 630651 638442 645900
59872F45900O900N817M074J857n09k597l936m430m648n243o101o473n917m785
$$ 645900 652800 658617 662691 664548 664039 661442 657506 653076 648428 643185 637084 630611 624694 619909
59858F19909l672k887k550k729l158l181k336r29L15J081J727K770M357O219P954
$$ 619909 616237 613350 610800 608071 604913 601732 599396 598467 598782 599863 601590 604360 608717 614936 622890
59843F22890R282J0115J0424J0091Q912O848M230J713k0n96j43Q01J668K194K303
$$ 622890 632172 642287 652711 662802 671714 678562 682792 684505 684485 683889 683746 684547 686215 688409 690712
59828F90712J830N22j644m384p296r946j1840j2635j2532j2111j1682j1026r975
$$ 690712 692542 693064 691420 687036 679740 669794 657954 645319 632787 620676 608994 597968 587993
59815E87993q875q214p957p587o718n457m233l383k928k669k425k193j910j392
$$ 587993 579118 570904 562947 555360 548642 543185 538952 535569 532641 529972 527547 525354 523444 522052
59801E22052p18m52r86j777j928j506j534k411l242l174k618k454k668k617k220
$$ 522052 521334 520882 519896 518119 516191 514685 513151 510740 507498 504324 501706 499252 496584 493967 491747
59786D91747j954j960j974j967k101k142j687q88k76N5L37L83j82j022j266p92
$$ 491747 489793 487833 485859 483892 481791 479649 477962 477074 476798 476853 477190 477573 477391 476369 475103 474311
59770D74311l58l37j70N67J358J468Q56jo84r15o28j92n9k0O19J853K773K885
$$ 474311 473953 473616 473446 474013 475371 476839 477695 477694 477010 476095 475467 475275 475216 475196 475815 477668 480441 483326
59752D83326K881L506M350M461L706K895K768L363M210M691M467L776L096K439
$$ 483326 486207 489713 494063 498524 502230 505125 507893 511256 515466 520157 524624 528400 531496 533935
59738E33935J500O12P18J970L108K884J531J44p67j350j617j488j347j657k174
$$ 533935 535435 536047 536765 538735 541843 544727 546258 546402 545635 544285 542668 541180 539833 538176 536002
59723E36002k332k135j960j686r33J2M18K31J01K19Q5l74m35L06J180J378J028
$$ 536002 533670 531535 529575 527889 526956 526968 527386 527617 527718 527937 528022 527648 527213 527519 528699 530077 531105
59706E31105P82Q29R25J046J395J836J866J232L35j59P5P86J379J420R74M57J85
$$ 531105 531887 532716 533641 534687 536082 537918 539784 541016 541351 541192 541267 542053 543432 544852 545826 546283 546468
59689E46468R2k3j11J66R31J710J773R84O9k45j41l03p05n39M76J390J103k83
$$ 546468 546560 546537 546426 546592 547523 549233 551006 551990 552059 551814 551673 551370 550665 550126 550602 551992 553095 552812
59671E52812j745k632l070l299l301l158l213l672m267m467l906k645j222l17
$$ 552812 551067 548435 545365 542066 538765 535607 532394 528722 524455 519988 516082 513437 512215 511898
59657E11898j85m37n07j85M22J190J997K673L170L587L835L612K887K157J826
$$ 511898 511713 511276 510769 510584 511006 512196 514193 516866 520036 523623 527458 531070 533957 536114 537940
59642E37940J667J167J63j143k432l250l222k619k265k409k302j389l13O7M5N00
$$ 537940 539607 540774 540937 539794 537362 534112 530890 528271 526006 523597 521295 519906 519593 519660 519705 520205
59626E20205J340J679J335J059J235J419J326J298J524J596J160L14q00k139l263
$$ 520205 521545 523224 524559 525618 526853 528272 529598 530896 532420 534016 535176 535490 534690 532551 529288
59611E29288l426k460j038Q7O12N26J00OO51J354J126K54L1P45J207O88n1k23
$$ 529288 525862 523402 522364 522451 523063 523589 523689 523695 524346 525700 526826 527080 527111 527856 529063 529751 529700 529477
59593E29477k72p24j027o82m79j274k226j871m76K27m30j286j323j021j240j852
$$ 529477 529205 528481 527454 526772 526293 525019 522793 520922 520446 520673 520243 518957 517634 516613 515373 513521
59577E13521k141j875j387j071j189j758k287k122j338q88j460k581l237k983
$$ 513521 511380 509505 508118 507047 505858 504100 501813 499691 498353 497465 496005 493424 490187 487204
59563D87204k094r78N7O83P80P85J253K060K446K030J378J248J594J772J543J378
$$ 487204 485110 484132 484189 484872 485652 486437 487690 489750 492196 494226 495604 496852 498446 500218 501761 503139
59547E03139J707K387L112L857M584M898M568M198M819O794R586J2538J5267J7257
$$ 503139 504846 507233 510345 514202 518786 523684 528252 532450 537269 544063 553649 566187 581454 598711
59533E98711J7680J6114J2963Q954M511n8m095o760p542o453l986j066J339K911
$$ 598711 616391 632505 645468 654422 658933 658875 654780 648020 640478 634025 630039 628973 630312 633223
59519F33223M116N391O414O573N858M889M115L404K368Q54r64k767m344n701o907
$$ 633223 637339 642730 649144 655717 661575 666464 670579 673983 676351 677205 676241 673474 669130 663429 656522
59504F56522p908q678r460j0441j1161j0813r366p894p333p386p133o329n433
$$ 656522 648614 639936 630476 620035 608874 598061 588695 580801 573468 566082 558949 552620 547187
59491E47187m666l818k930k433k435k456k092j491r01k14P50J789K462K609K527
$$ 547187 542521 538703 535773 533340 530905 528449 526357 524866 523965 523751 524501 526290 528752 531361 533888
59476E33888K681L338M351N197N415N024M503M246M174L914L214K166J120M93
$$ 533888 536569 539907 544258 549455 554870 559894 564397 568643 572817 576731 579945 582111 583231 583724
59462E83724N61J232K048K513K563K722L614N257O984Q187R038J0219J2052J4146
$$ 583724 584285 585517 587565 590078 592641 595363 598977 604234 611218 619405 628443 638662 650714 664860
59448F64860J5869J6803J6813J6002J4737J3258J1255Q168M099j03l812p146j0271
$$ 664860 680729 697532 714345 730347 745084 758342 769597 777765 781864 781761 777949 770803 760532
59435G60532j2803j4373j5208j5537j4900j2871j0124p960o844o147n246m037
$$ 760532 747729 733356 718148 702611 687711 674840 664716 656756 649912 643765 638519 634482
59423F34482k425k32K186M094N471P241R947J2944J5379J7374J9629K2324K5034
$$ 634482 632057 631825 634011 638105 643576 650817 660764 673708 689087 706461 726090 748414 773448
59410G73448K7326K8672K8076K4624J8494J0871K900m725j1201j5428j6733j5402
$$ 773448 800774 829446 857522 882146 900640 911511 914411 909686 898485 883057 866324 850922
59398H50922j2267q256m513k381k674n167r159j4247k0044k5411k8701k9050k7020
$$ 850922 838655 830399 825886 823505 820831 815664 806505 792258 772214 746803 718102 689052 662032
59385F62032k3873k0556j7488j4856j2629j0545q427o485n002l916k971k178j760
$$ 662032 638159 617603 600115 585259 572630 562085 553658 547173 542171 538255 535284 533106 531346
59372E31346j682j549j067k69O94J683K428K580K135J503J070Q45P75J062J945
$$ 531346 529664 528115 527048 526779 527473 529156 531584 534164 536299 537802 538872 539717 540492 541554 543499
59357E43499L285M652N732O484O963P258P565Q139R122J0436J1872J3266J4667
$$ 543499 546784 551436 557168 563652 570615 577873 585438 593577 602699 613135 625007 638273 652940
59344F52940J6286J8159J9917K1101K1702K2052K2171K1538J9761J7126J4249
$$ 652940 669226 687385 707302 728403 750105 772157 794328 815866 835627 852753 867002
59333H67002J1383Q407N318K342l65k927n606q614j1839j4634j6144j6203j5736
$$ 867002 878385 886792 892110 894452 894087 891160 885554 876940 865101 850467 834323 818120 802384
59320H02384j5787j6191j5778j4009j1903j0937j1286j1618j0608q308n904m384
$$ 802384 786597 770406 754628 740619 728716 717779 706493 694875 684267 675959 670055 665671
59308F65671l715l242k564j832j356j122p09L80K247M378O042P107Q326J0494
$$ 665671 661956 658714 656150 654318 652962 651840 651131 651511 653758 658136 664178 671285 679611 690105
59294F90105J3480J6435J8740K0158K0058J7390J1937N046j544p194j2138j6146
$$ 690105 703585 720020 738760 758918 778976 796366 808303 813349 811805 804611 792473 776327
59282G76327j8264j7904j5516j2065q407n230k960j372K58K313M484O396Q116
$$ 776327 758063 740159 724643 712578 704171 698941 695981 694609 694867 697180 701664 708060 716176
59269G16176R790J1290J2638J4241J6090J7167J6455J4410J2488J1177R419O369
$$ 716176 725966 737256 749894 764135 780225 797392 813847 828257 840745 851922 861341 867710
59257H67710K709m72l335o741j0443j3052j3888j3828j3984j4415j4603j4360
$$ 867710 870419 869947 866612 859871 849428 836376 822488 808660 794676 780261 765658 751298
59245G51298j3675j2306j0329q581p788p491o599m792k653o23J305K986M012M365
$$ 751298 737623 725317 714988 706407 698619 691128 684529 679737 677084 676461 677766 680752 684764 689129
59231F89129M453M470M354M338M731N060M346K447L37j283k800m678o555p901
$$ 689129 693582 698052 702406 706744 711475 716535 720881 723328 723665 722382 719582 714904 708349 700448
59217G00448q935j0085j1079j1277j0643r761r132q875q882q795q222p302o665
$$ 700448 691513 681428 670349 659072 648429 638668 629536 620661 611779 602984 594762 587460 580795
59204E80795o454n932m591l108k490k696k824k391j658r17j87M47Q13R71J122
$$ 580795 574341 568409 563818 560710 558220 555524 552700 550309 548651 547734 547547 547994 548807 549778 550900
59189E50900J288J466J851K413K648K284J960K551L989N405O192O336N953N318
$$ 550900 552188 553654 555505 557918 560566 562850 564810 567361 571350 576755 582947 589283 595236 600554
59175F00554N133N967P366Q256Q215P802P619P728P965Q244Q497Q843R720J1211
$$ 600554 605687 611654 619020 627276 635491 643293 650912 658640 666605 674849 683346 692189 701909 713120
59161G13120J2506J2701J2007J1317J0765R683Q005O553N627M381K009j165m240
$$ 713120 725626 738327 750334 761651 772416 782099 790104 796657 802284 806665 808674 807509 803269
59148H03269o703q437r449j0062j0752j1425j1430j0625r780r468r223q358p068
$$ 803269 796566 788129 778680 768618 757866 746441 735011 724386 714606 705138 695915 687557 680489
59135F80489o126n865n971n977n547m570l325k230j258jJ456K373K504K738L979
$$ 680489 674363 668498 662527 656550 651003 646433 643108 640878 639620 639619 641075 643448 645952 648690 652669
59120F52669N906P471Q306Q941R928J1331J2937J4368J5155J5161J4781J4329
$$ 652669 658575 666046 674352 683293 693221 704552 717489 731857 747012 762173 776954 791283
59108G91283J3497J1947J0143Q921Q357P700O514N222M391L912L217J959K74j513
$$ 791283 804780 816727 826870 835791 844148 851848 858362 863584 867975 871887 875104 877063 877337 875824
59094H75824l158m518n432n796n764n731n841n700m934m011l905m914o265p175
$$ 875824 872666 868148 862716 856920 851156 845425 839584 833884 828950 824939 821034 816120 809855 802680
59080H02680p649q012q260q460r124j0480j1730j1863j0986j0074r564r051q355
$$ 802680 795031 787019 778759 770299 761175 750695 738965 727102 716116 706042 696478 687427 679072
59067F79072p947p984p738o500m571k948k333k761l812m750m754l604k037j086
$$ 679072 671125 663141 655403 648903 644332 641384 639051 636290 632478 627728 622974 619370 617333 616247
59053F16247j046j383j525j403j264j315j679k366l081l301k726j679p54j79L07
$$ 616247 615201 613818 612293 610890 609626 608311 606632 604266 601185 597884 595158 593479 592725 592546 592853
59038E92853R92J788K400K640K496K021J385J011J389K620M166N217N397N171
$$ 592853 593845 595633 598033 600673 603169 605190 606575 607586 608975 611595 615761 620978 626375 631546
59024F31546N409O479P822Q657Q977R541J0821J2320J3130J2851J1678R934P929
$$ 631546 636955 643434 651256 659913 668890 678431 689252 701572 714702 727553 739231 749165 757094
59011G57094O117M797L684K231M61r22j447j517j766k076j626M7K365M319N505
$$ 757094 763211 768008 771692 773923 774384 773462 772015 770498 768732 766656 765030 765077 767442 771761 777266
58996G77266O327P168P756P617O928O419O397O327N587M240K883J948J366O55
$$ 777266 783593 790761 798517 806134 813062 819481 825878 832205 837792 842032 844915 846863 848229 848884
58982H48884q13l277o120q269r233r402r186q423o958n193l530j826P9J795L039
$$ 848884 848071 844794 838674 830405 821172 811770 802584 794161 787203 782010 778480 776654 776733 778528 781567
58967G81567M343O276Q315R437R589R697J0330J1260J2220J3178J3830J3619J2386
$$ 781567 785910 792186 800501 809938 819527 829224 839554 850814 863034 876212 890042 903661 916047
58954I16047J0345P469L708l26l858p041j0548j4013j6090j6363j6022j6115j6221
$$ 916047 926392 933861 937569 937243 933385 926344 915796 901783 885693 869330 853308 837193 820972
58941H20972j5496j4056j2527j0992r233p572o572o157n729m997m275m060m537
$$ 820972 805476 791420 778893 767901 758668 751096 744524 738367 732638 727641 723366 719306 714769
58928G14769n344n747n352m649m352m362m010l268k835k881k718k028j478j574
$$ 714769 709425 703678 698326 693677 689325 684963 680953 677685 674850 671969 669251 667223 665745 664171
58914F64171j823j592j082o98k13P65K055L233M298N442O603P711Q882J0018J0832
$$ 664171 662348 660756 659674 658976 658763 659528 661583 664816 669114 674556 681159 688870 697752 707770 718602
58899G18602J1568J2898J4736J5950J5885J5304J5193J5529J5882J6392J7281
$$ 718602 730170 743068 757804 773754 789639 804943 820136 835665 851547 867939 885220
58888H85220J8166J8891K0294K3123K6706K9666L1462L2252L1795K9648K6060
$$ 885220 903386 922277 942571 965694 992400 1022066 1053528 1085780 1117575 1147223 1173283
58877A173283K1702J6744J1133N387J21m891j0236j5710k0496k4218k6929k8449
$$ 1173283 1194985 1211729 1222862 1228249 1228370 1223479 1213243 1197533 1177037 1152819 1125890 1097441
58865A097441k8625k7974k7134k5943k3965k1495j9149j6931j4771j3462j3767
$$ 1097441 1068816 1040842 1013708 987765 963800 942305 923156 906225 891454 877992 864225
58854H64225j4933j5474j5152j4813j4598j3876j2919j2790j3357j3105j1407
$$ 864225 849292 833818 818666 803853 789255 775379 762460 749670 736313 723208 711801
58843G11801r503q525q037p289o569o348o169n485m750m605m723m423l933l999
$$ 711801 702298 693773 685736 678447 671878 665530 659361 653876 649126 644521 639798 635375 631442 627443
58829F27443m564m832m448l881l643l755l902l680k760j253J21O16K64j27K29
$$ 627443 622879 618047 613599 609718 606075 602320 598418 594738 591978 590725 590846 591462 591726 591599 591828
58814E91828J372K666L508L932M405N003N169M563L691L181K753J693J43r23j101
$$ 591828 593200 595866 599374 603306 607711 612714 617883 622446 626137 629318 632071 633764 633907 632984 631883
58799F31883j091j624k565l347l681l523k907k154j761j754j637j149o18k84J75
$$ 631883 630792 629168 626603 623256 619575 616052 613145 610991 609230 607476 605839 604690 604072 603788 603963
58784F03963J090K231L126L668M055M440M898N432N870N946N600M928L879K384
$$ 603963 605053 607284 610410 614078 618133 622573 627471 632903 638773 644719 650319 655247 659126 661510
58770F61510P75n08j626l102m738n549n077m144l785m041m266m131l735l030j854
$$ 661510 662285 661777 660151 657049 652311 646762 641685 637541 633756 629715 625449 621318 617583 614553 612699
58755F12699m11P87J512K014K618L394M171M749N090N391N826O261O372O130N890
$$ 612699 612288 613075 614587 616601 619219 622613 626784 631533 636623 642014 647840 654101 660473 666603 672493
58740F72493N970O348O920P672Q425Q734Q339P594P173P363P851Q161Q184Q161
$$ 672493 678463 684811 691731 699403 707828 716562 724901 732495 739668 747031 754882 763043 771227 779388
58726G79388Q249Q263P903P128O172N293M701M626N054N511N572N606O394P860
$$ 779388 787637 795900 803803 810931 817103 822396 827097 831723 836777 842288 847860 853466 859860 867720
58712H67720Q920Q961Q688Q967R448R099P597N372K736j78k907n043o990r503
$$ 867720 876640 885601 894289 903256 912704 921803 929400 934772 937508 937330 934423 929380 922390 912887
58698I12887j2526j5297j7524j9540k1329k2309k2259k1700k1067k0176j8711
$$ 912887 900361 885064 867540 848000 826671 804362 782103 760403 739336 719160 700449
58687G00449j6789j4763j2866j1237r917q785p785p083o717o359n796n326n172
$$ 700449 683660 668897 656031 644794 634877 626092 618307 611224 604507 598148 592352 587026 581854
58674E81854m909m117l155k510j834n45J012K061K897M580P201R550J0728J1039
$$ 581854 576945 572828 569673 567163 565329 564784 565796 567857 570754 575334 582535 592085 602813 613852
58660F13852J1066J0865J0300R292P486M606J373q70j706k056k714l388l481l008
$$ 613852 624918 635783 646083 655375 662861 667467 668840 667970 666264 664208 661494 658106 654625 651617
58646F51617k330j668j318j680k741l998n094n977o408o006m872l538k194p27
$$ 651617 649287 647619 646301 644621 641880 637882 632788 626811 620403 614397 609525 605987 603793 603066
58632F03066N13R36P75J054K149L180L153J999L95q49j121l97O50J497K495M046
$$ 603066 603579 604515 605290 606344 608493 611673 614826 616825 617220 616371 615250 614853 615503 617000 619495 623541
58616F23541N562O360P113Q981J1568J3367J4111J4870J5650J4940J2251R190
$$ 623541 629103 635463 642576 651557 663125 676492 690603 705473 721123 736063 748314 757504
58604G57504P140N542L471J346j26j362k969m486n248n580o007o220n897n663
$$ 757504 764644 770186 773657 775003 774877 773515 770546 766060 760812 755232 749225 743005 737108 731445
58590G31445o058o322n362l375j409R1J424K757M084N529P031Q159Q831R560J0421
$$ 731445 725387 719065 713703 710328 708919 709010 710434 713191 717275 722804 729835 737994 746825 756385 766806
58575G66806J0563R487Q035P290P216P191P103P147P168P209Q001J0017J2564
$$ 766806 777369 786856 794891 802181 809397 816588 823691 830838 838006 845215 853216 863233 875797
58562H75797J4643J6223J7827J9391K0359K0463J9736J8170J6042J4024J2331
$$ 875797 890440 906663 924490 943881 964240 984703 1004439 1022609 1038651 1052675 1065006
58551A065006J0277P268L683K29l032o333r412j1672j2754j2622j1649j0766j0778
$$ 1065006 1075283 1082551 1086234 1086463 1083431 1077098 1067686 1056014 1043260 1030638 1018989 1008223 997445
58538I97445j1357j1608j1672j2574j4295j5465j5419j5008j4732j3762j1725
$$ 997445 986088 974480 962808 950234 935939 920474 905055 890047 875315 861553 849828
58527H49828r800q846p908n943l695k346j526k13J432K614L400M212M631M137
$$ 849828 840028 831182 823274 817331 813636 811290 809764 809551 810983 813597 816997 821209 825840 829977
58513H29977L288K859K593K017J631J977K462K484K707L735M538L878K444J800
$$ 829977 833265 836124 838717 840734 842365 844342 846804 849288 851995 855730 860268 864146 866590 868390
58499H68390J912J567O13j57q76k424m505n755n857n911o551p146p032o347n445
$$ 868390 870302 871869 872482 872325 871449 869025 864520 858765 852908 846997 840446 833300 826268 819921 814476
58484H14476m477l584k780j735l45R33J932L272N215O873P494P632P968P984P081
$$ 814476 809999 806415 803635 801900 801555 802488 804420 807692 812907 819780 827274 834906 842874 850858 857939
58469H57939N920N199M105J707j086k743l523m724o184o568n757m935m428l405
$$ 857939 863859 869058 873163 874870 873784 871041 867518 862794 856610 850042 844285 839350 834922 831517
58455H31517j686j48P91J554K321K845L276L870M150L602K790K430J981O14r69
$$ 831517 829831 829683 830474 832028 834349 837194 840470 844340 848490 852092 854882 857312 859293 859907 858938
58440H58938j411r30q94j535j767j133j72Q65K099L032L079K857L407M436M935
$$ 858938 857527 856597 855703 854168 852401 851268 851096 851961 854060 857092 860171 863028 866435 870871 875806
58425H75806N088N894P240Q138Q605R525J0857J1709J1875J1682J0642Q096M868
$$ 875806 880894 886788 894028 902166 910771 920296 931153 942862 954737 966419 977061 985157 990025
58412I90025K499J092l24j750k345k268k450k847k779k622l237m168m364m216
$$ 990025 992524 993616 993292 991542 989197 986929 984479 981632 978853 976231 972994 968826 964462 960246
58398I60246m768n468m957l594k831k527j396K00N87k52o63k88l28q89o85L54
$$ 960246 955478 950010 945053 941459 938628 936101 934705 934905 935492 935240 934577 934289 933961 933072 932387 932741
58382I32741P71J88j89J24M42Q20J941L133L060K410L163N150O275O133O401P468
$$ 932741 933512 933700 933511 933635 934077 934897 936838 939971 943031 945441 948604 953754 960029 966162 972563 980031
58366I80031P931P763Q633J0493J1278J0785J1390J3803J5583J5208J4363J4596
$$ 980031 987962 995725 1004358 1014851 1026129 1036914 1048304 1062107 1077690 1092898 1107261 1121857
58354A121857J4790J3680J2088J0878R326P163N791N838N863N039M672N586O493
$$ 1121857 1136647 1150327 1162415 1173293 1182619 1189782 1195573 1201411 1207274 1212313 1216985 1222571 1229064
58341A229064O523P000Q934J1046J1988J2434J3331J4127J4217J4242J4591J4586
$$ 1229064 1235587 1242587 1251521 1262567 1274555 1286989 1300320 1314447 1328664 1342906 1357497 1372083
58329A372083J4294J4974J6639J7426J6628J5877J6112J5890J4148J2172J1245
$$ 1372083 1386377 1401351 1417990 1435416 1452044 1467921 1484033 1499923 1514071 1526243 1537488
58318A537488J0626R493Q616Q642Q863R000J0014J1966J3332J3621J4237J5663
$$ 1537488 1548114 1557607 1566223 1574865 1583728 1592728 1602742 1614708 1628040 1641661 1655898 1671561
58306A671561J6453J6177J6551J8343J9961K0481K1195K2765K3809K3764K4168
$$ 1671561 1688014 1704191 1720742 1739085 1759046 1779527 1800722 1823487 1847296 1871060 1895228
58295A895228K5559K6204K5456K5165K6226K6956K6571K6911K8865L0608L1218
$$ 1895228 1920787 1946991 1972447 1997612 2023838 2050794 2077365 2104276 2133141 2163749 2194967
58284B194967L2505L5264L7433L8115L9512M2535M4446M3585M2560M3824M5804
$$ 2194967 2227472 2262736 2300169 2338284 2377796 2420331 2464777 2508362 2550922 2594746 2640550
58273B640550M6518M7281M9586N1835N2586N3630N6627N9919O1932O4300O8413
$$ 2640550 2687068 2734349 2783935 2835770 2888356 2941986 2998613 3058532 3120464 3184764 3253177
58262C253177P2345P4565P7170Q1945Q6769Q9474R1673R5178R8213R9003R9590
$$ 3253177 3325522 3400087 3477257 3559202 3645971 3735445 3827118 3922296 4020509 4119512 4219102
58251D219102J02214J05457J07781J11215J17539J24455J29680J35178J43317
$$ 4219102 4321316 4426773 4534554 4645769 4763308 4887763 5017443 5152621 5295938
58242E295938J52410J60261J68397J78726J89767K00124K11706K25546K38888
$$ 5295938 5448348 5608609 5777006 5955732 6145499 6345623 6557329 6782875 7021763
58233G021763K50393K63472K80352K98007L14418L33109L56726L82079M06870
$$ 7021763 7272156 7535628 7815980 8113987 8428405 8761514 9118240 9500319 9907189
58224I907189M34899M68994N05325N41023N80527O27762O79312P32621P93298
$$ 9907189 10342088 10811082 11316407 11857430 12437957 13065719 13745031 14477652 15270950
58215A5270950Q66334R47955J034838J133293J249984J382332J528398J697419
$$ 15270950 16137284 17085239 18120077 19253370 20503354 21885686 23414084 25111503
58207B5111503J899321K133285K399188K710698L083602L521819M030641M633657
$$ 25111503 27010824 29144109 31543297 34253995 37337597 40859416 44890057 49523714
58199D9523714N360487O229606P262331Q502016R999494J1793150J3922286J6432358
$$ 49523714 54884201 61113807 68376138 76878154 86877648 98670798 112593084 129025442
58191A29025442J9324616K2509107K5825929K9042829L1712404L3034230L2036234
$$ 129025442 148350058 170859165 196685094 225727923 257440327 290474557 322510791
58184C22510791K8088834K1316689J2522474K770973o908225j5535362k2179368
$$ 322510791 350599625 371916314 384438788 387209761 380301536 364766174 342586806
58177C42586806k6184281k7483635k6667047k4680079k2379127k0262360j8497949
$$ 342586806 316402525 288918890 262251843 237571764 215192637 194930277 176432328
58170A76432328j7099576j6026174j5157728j4288537j3236102j1966608j0587583
$$ 176432328 159332752 143306578 128148850 113860313 100624211 88657603 78070020
58163G8070020r229027p963228o822345n831965n000113m304059l714199l217562
$$ 78070020 68840993 60877765 54055420 48223455 43223342 38919283 35205084 31987522
58155C1987522k805743k458843k157894j899646j685003j504052j345111j207910
$$ 31987522 29181779 26722936 24565042 22665396 20980393 19476341 18131230 16923320
58147A6923320j095466j001532r17084q41393p76658p18791o62745o10312n64162
$$ 16923320 15827854 14826322 13909238 13067845 12291187 11572396 10909651 10299339 9735177
58138I735177n20541m75786m33667l98629l67942l37877l11372k92140k77039
$$ 9735177 9214636 8738850 8305183 7906554 7538612 7200735 6889363 6597223 6320184
58129F320184k61724k48226k39531k31999k20683k07455j96581j86733j74532
$$ 6320184 6058460 5810234 5570703 5338704 5118021 4910566 4713985 4527252 4352720
58120D352720j61839j52471j45251j37004j28959j23740j19384j12729j05498
$$ 4352720 4190881 4038410 3893159 3756155 3627196 3503456 3384072 3271343 3165845
58111C165845j00827r6867r0059q2033p6998p4671p1682o7823o5232o3387o0418
$$ 3165845 3065018 2968151 2878092 2796059 2719061 2644390 2572708 2504885 2439653 2376266 2315848
58100B315848n7534n6915n6996n4843n1471m9936m9901m8854m6890m5618m4086
$$ 2315848 2258314 2201399 2144403 2089560 2038089 1988153 1938252 1889398 1842508 1796890 1752804
58089A752804m0556l6701l5225l4935l2753k9230k7344k7164k6325k4815k4661
$$ 1752804 1712248 1675547 1640322 1605387 1572634 1543404 1516060 1488896 1462571 1437756 1413095
58078A413095k5660k5714k4831k4783k5450k5210k4242k3950k3921k2921k1869
$$ 1413095 1387435 1361721 1336890 1312107 1286657 1261447 1237205 1213255 1189334 1166413 1144544
58067A144544k2312k3037k1753j9104j7413j6536j4679j2302j1401j1701j1328
$$ 1144544 1122232 1099195 1077442 1058338 1040925 1024389 1009710 997408 986007 974306 962978
58056I62978j0543j1118j2587j2796j1761j1438j2098j2323j2146j2767j3550
$$ 962978 952435 941317 928730 915934 904173 892735 880637 868314 856168 843401 829851
58045H29851j2732j0819r947j0162r615q227p729q231p998o838o483p385q080
$$ 829851 817119 806300 796353 786191 776576 768349 760620 752389 744391 737553 731070 723685 715605
58032G15605p930p830q069q130q543j0228j2135j2211j0717r837j0133j0105r224
$$ 715605 707675 699845 691776 683646 675103 664875 652740 640529 629812 619975 609842 599737 590513
58019E90513q571q327p362n629m439m185m072m098m875n606m839l170k622l316
$$ 590513 581942 573615 566253 560624 556185 552000 547928 543830 538955 533349 528510 525340 522718 519402
58005E19402l467k670k365k807k554j407j063k078k793k151j188q39m36O25J707
$$ 519402 515935 513265 510900 508093 505539 504132 503069 500991 498198 496047 494859 494020 493584 494209 495916
57990D95916K303K897L699M130M089M231M583M385L581K965K698K273J841J897
$$ 495916 498219 501116 504815 508945 513034 517265 521848 526233 529814 532779 535477 537750 539591 541488
57976E41488J755K79j886k863k392k058k546k914k781l044l931m435m262m340
$$ 541488 543243 543522 541636 538773 536381 534323 531777 528863 526082 523038 519107 514672 510410 506070
57962E06070m878m820l841k999k847k700k303k435l237l676l349l197l797m508
$$ 506070 501192 496372 492531 489532 486685 483985 481682 479247 476010 472334 468985 465788 461991 457483
57948D57483m823n027n040m179k570j296p50k77K38J87j06O62K680M611N746O817
$$ 457483 452660 447633 442593 438414 435844 434548 433798 433521 433759 433946 433840 434502 437182 441793 447539 454356
57932D54356Q174Q972Q841Q611Q685Q272O979N555M373K814Q36m84q16j391l141
$$ 454356 462530 471502 480343 488954 497639 505911 512890 518445 522818 525632 526468 525984 525168 523777 520636
57917E20636n367p092q279r042r089q690q784r409r464q708q347q880r074q158
$$ 520636 515269 508177 499898 490856 481767 473077 464293 454884 445420 436712 428365 419485 410411 402253
57903D02253p350p910r043r176q241p333o946o779o600o228n313l998l089k899
$$ 402253 394903 386993 377950 368774 360533 353200 346254 339475 332875 326647 321334 317336 314247 311348
57889C11348k648j735p17k32J44J107K402L278L569L592L456L180K995K989K833
$$ 311348 308700 306965 306248 306016 306160 307267 309669 312947 316516 320108 323564 326744 329739 332728 335561
57874C35561K287J503O32l29j161j541j604j731j765j348r38j387k399k630j535
$$ 335561 337848 339351 339983 339654 338493 336952 335348 333617 331852 330504 329566 328179 325780 323150 321615
57859C21615J2J195K107K861L113K944L096L829M510M770N017N490N806N761N606
$$ 321615 321627 322822 324929 327790 330903 333847 336943 340772 345282 350052 355069 360559 366365 372126 377732
57844C77732N252M289K964K013J420N53m00o06l61r89k676m006m182m093m525
$$ 377732 382984 387273 390237 392250 393670 394223 393823 393217 392856 391867 389191 385185 381003 376910 372385
57829C72385m991n027n063n213m717l410k269j675p33Q46J810J431R02J475K586
$$ 372385 367394 362367 357304 352091 347374 343964 341695 340020 339287 340133 341943 343374 344276 345751 348337
57814C48337L146L313L656L801L318K806K763K402R14j081k638l987n600o819
$$ 348337 351483 354796 358452 362253 365571 368377 371140 373542 374456 373375 370737 366750 361150 354331
57800C54331o909o554o781p200o854o099o082o764o982o204m956l756k797k381
$$ 354331 347422 340868 334087 326887 320033 313934 307852 301088 294106 287902 282946 279190 276393 274012
57786B74012k645l103l290l446l768l650k617j414j056j333j251n27L59J113J676
$$ 274012 271367 268264 264974 261528 257760 254110 251493 250079 249023 247690 246439 245912 246271 247384 249060
57771B49060J852J827K518M360O239O670N633M223L056K002J092N62K23k81q42
$$ 249060 250912 252739 255257 259617 265856 272526 278159 282382 285438 287440 288532 289094 289317 289036 288194
57756B88194j247j732k388k599j978j270j373j978k232k189k440k748k326j281
$$ 288194 286947 285215 282827 280228 278250 276980 275607 273629 271397 269208 266768 264020 261694 260413
57742B60413n66n96q67r64j053j365j874k472k965l057k772k535k443k078j401
$$ 260413 259847 259251 258384 257420 256367 255002 253128 250656 247691 244634 241862 239327 236884 234806 233405
57727B33405j019j027n89N26J045lj550j868r25L7N65J125J619J422P03K46J08
$$ 233405 232386 231359 230770 231296 232341 232338 230788 228920 227995 228032 228597 229722 231341 232763 233466 233712 233820
57710B33820k88q36q59m43l72p39q47n10k28l8N93J645K468K941L516M064L876
$$ 233820 233532 232696 231837 231394 231022 230283 229436 228926 228698 228660 229253 230898 233366 236307 239823 243887 247763
57693B47763K976K258J962J263k00j510j793j388j081r33o37l64m24m04O50L173
$$ 247763 250739 252997 254959 256222 256022 254512 252719 251331 250250 249317 248680 248316 247892 247488 248138 251311
57677B51311O642J0272J3866J7866K2624K7907L3366L9346M6628N5248O3944P0848
$$ 251311 257953 268225 282091 299957 322581 350488 383854 423200 469828 525076 589020 659868
57665F59868P4112P1850O2582M6456K5497K153k1618m3516o0397o9900p2113o8925
$$ 659868 733980 805830 868412 914868 940365 942518 920900 877384 816987 747087 674974 606049
57653F06049o2353n4207m6319l9725l3999k8424k3282j9119j5568j2184r648q654
$$ 606049 543696 489489 443170 403445 369446 341022 317740 298621 283053 270869 261221 252567
57641B52567q263p013n189m199m059l377j833p10o46p03k32K3n52j234j218q78
$$ 252567 244304 237291 232102 227903 223844 220467 218634 217924 217278 216575 216343 216366 215814 214580 213362 212484
57625B12484r54j357j590j626j680j686j613j702j982k054j735j443j595k073
$$ 212484 211530 210173 208583 206957 205277 203591 201978 200276 198294 196240 194505 193062 191467 189394
57611A89394k568k886k844k283j361m13M66J229J533J197P81R08J215Q49k02j228
$$ 189394 186826 183940 181096 178813 177452 177039 177505 178734 180267 181464 182245 183153 184368 185217 185015 183787
57595A83787j990k701l010k317j152q82j830k895l281l331l285k680j554r96j628
$$ 183787 181797 179096 176086 173769 172617 171735 169905 167010 163729 160398 157113 154433 152879 151883 150255
57580A50255k567k736k338k188k378k459k430k677l220l602l345k336j076n45
$$ 150255 147688 144952 142614 140426 138048 135589 133159 130482 127262 123660 120315 117979 116903 116358
57566A16358j182k049j834p50k95j004j657j243m07j74l48j64L22N42M88N25N50
$$ 116358 115176 113127 111293 110543 110248 109244 107587 106344 105937 105763 105415 105251 105573 106115 106603 107128 107678
57549A07678K53j60k67j42r2m0J76K28l40j353k169k338j793p28K23K14q42j893
$$ 107678 107931 107771 107504 107362 107270 107230 107406 107634 107294 105941 103772 101434 99641 98913 99136 99350 98508 96615
57531I6615j905j043k46m1k94p68j238j333q66j90L19Q86J971L475M776N479N682
$$ 96615 94710 93667 93421 93380 93086 92318 91080 89747 88881 88691 89010 89896 91867 95342 100118 105597 111279
57514A11279N657N668N925O363O635O635O689O886O586N205L262J958J704J685
$$ 111279 116936 122604 128529 134892 141527 148162 154851 161737 168323 173528 176790 178748 180452 182137
57500A82137J027j38j049j362j401j569j938k447l105l812m158l803k966k186
$$ 182137 183164 183026 181977 180615 179214 177645 175707 173260 170155 166343 162185 158382 155416 153230
57486A53230j598q88o8K58k48j040j358j106o43j63J82Op35j313j100o08p84j598
$$ 153230 151632 150744 150676 150934 150686 149646 148288 147182 146539 146376 146558 146564 145829 144516 143416 142808 142024 140426
57468A40426k141j980j490r82m50j16l16p98r69q33p46m95L34J088N90q88j482
$$ 140426 138285 136305 134815 133833 133383 133267 132951 132153 131184 130351 129605 129110 129444 130532 131122 130234 128752
57451A28752j59J845K600J608j41j385j407l73O86Q51M56N23J022Q74j87j040
$$ 128752 128593 130438 133038 134646 134505 133120 131713 131340 132026 132877 133333 133856 134878 135752 135565 134525
57435A34525r57o01o54o56p5O66J049J370J875K032J556J215J578J953J617J170
$$ 134525 133568 132967 132313 131657 131582 132248 133297 134667 136542 138574 140130 141345 142923 144876 146493 147663
57419A47663J460J968J621O30Q3J41Kn38p45k23N21Q59O77K22l5L97J355J863
$$ 147663 149123 151091 152712 153342 153425 153566 153568 153030 152285 152062 152583 153442 154119 154341 154306 154703 156058 157921
57401A57921J296L69K42R63J605J625J336J214J434J943K365K187J552J383K045
$$ 157921 159217 159586 159828 160791 162396 164021 165357 166571 168005 169948 172313 174500 176052 177435 179480
57386A79480K511J770N12K85J344K477K851K767K574J977Q28k07k97O19J766K142
$$ 179480 181991 183761 184273 184558 185902 188379 191230 193997 196571 198548 199376 199169 198872 199491 201257 203399
57370B03399J317o3p73l08N94J065J181J403J566J269P97Q02J352K099K982L920
$$ 203399 204716 204653 203880 203572 204166 205231 206412 207815 209381 210650 211447 212249 213601 215700 218682 222602
57354B22602M202L307K066J839K690L433L494L545M102M628M410L527K495J670
$$ 222602 226804 230111 232177 234016 236706 240139 243633 247178 251280 255908 260318 263845 266340 268010
57340B68010J266J400J881K355K791L302L624L416L082L485M690N694N636M736
$$ 268010 269276 270676 272557 274912 277703 281005 284629 288045 291127 294612 299302 304996 310632 315368
57326C15368L808L381L443L609L373K604J825J717K362L339M282M946N001M480
$$ 315368 319176 322557 326000 329609 332982 335586 337411 339128 341490 344829 349111 354057 359058 363538
57312C63538M147M676N588N807N231M848N267N985O309O192N892N474N021M815
$$ 363538 367685 372361 377949 383756 388987 393835 399102 405087 411396 417588 423480 428954 433975 438790
57298D38790N002N420N884O290O494O511O741P469Q158P908O646N265M579M668
$$ 438790 443792 449212 455096 461386 467880 474391 481132 488601 496759 504667 511313 516578 521157 525825
57284E25825N286O252P291Q007Q281Q322Q351Q510Q880R303R432R365R738J0604
$$ 525825 531111 537363 544654 552661 560942 569264 577615 586125 595005 604308 613740 623105 632843 643447
57270F43447J0864R771Q463Q767J0773J2812J3829J4319J4921J5457J5731J6056
$$ 643447 654311 664082 672545 681312 692085 704897 718726 733045 747966 763423 779154 795210
57258G95210J6424J6339J5911J6122J7366J8741J9387J9529J9603J9334J8567
$$ 795210 811634 827973 843884 860006 877372 896113 915500 935029 954632 973966 992533
57247I92533J8078J8577J9505J9776J9319J8965J9231J9938K0827K1769K2535
$$ 992533 1010611 1029188 1048693 1068469 1087788 1106753 1125984 1145922 1166749 1188518 1211053
57236A211053K3005K3450K4174K4963K5358K5280K5003K4772K4782K5320K6505
$$ 1211053 1234058 1257508 1281682 1306645 1332003 1357283 1382286 1407058 1431840 1457160 1483665
57225A483665K8037K9466L0526L0988L0606K9509K8405K7954K8125K8440K8642
$$ 1483665 1511702 1541168 1571694 1602682 1633288 1662797 1691202 1719156 1747281 1775721 1804363
57214A804363K8864K9297K9934L0607L1105L1405L1693L2063L2335L2562L3370
$$ 1804363 1833227 1862524 1892458 1923065 1954170 1985575 2017268 2049331 2081666 2114228 2147598
57203B147598L5154L7092L7851L7344L6886L7335L8039L8155L8037L8467L9158
$$ 2147598 2182752 2219844 2257695 2295039 2331925 2369260 2407299 2445454 2483491 2521958 2561116
57192B561116L9039L7761L6099L4826L3929L3024L2011L1113L0539L0210K9757
$$ 2561116 2600155 2637916 2674015 2708841 2742770 2775794 2807805 2838918 2869457 2899667 2929424
57181B929424K8813K7401K5974K5007K4623K4591K4568K4309K3917K3797K4184
$$ 2929424 2958237 2985638 3011612 3036619 3061242 3085833 3110401 3134710 3158627 3182424 3206608
57170C206608K4776K5076K5001K4910K5120K5709K6626K7599K8224K8487K8906
$$ 3206608 3231384 3256460 3281461 3306371 3331491 3357200 3383826 3411425 3439649 3468136 3497042
57159C497042K9706L0289L0120K9657K9518K9279K8196K6758K6233K6776K7359
$$ 3497042 3526748 3557037 3587157 3616814 3646332 3675611 3703807 3730565 3756798 3783574 3810933
57148C810933K7539K7805K7933K6671K3615J9929J6505J2747Q063L329k14k496
$$ 3810933 3838472 3866277 3894210 3920881 3944496 3964425 3980930 3993677 4001740 4005069 4004855 4002359
57136D002359m070m884m637l599k183l62J700L194L655L533L087J712o34k465
$$ 4002359 3998289 3993405 3988768 3985169 3982986 3982624 3984324 3987518 3991173 3994706 3997793 3999505 3998871 3996406
57122C996406k560j879k295m107o213q082r961j1457j1619j0483r111p895n871
$$ 3996406 3993846 3991967 3989672 3985565 3979352 3971270 3961309 3949852 3938233 3927750 3918639 3910744 3904873
57109C904873j867M571J3449K4609L7638N2093O7776Q4357J01341J19148J39624
$$ 3904873 3903006 3907577 3921026 3945635 3983273 4035366 4103142 4187499 4288840 4407988 4547612
57098D547612J64489J93852K27199K65086L08544L57403M10497M66682N23988
$$ 4547612 4712101 4905953 5133152 5398238 5706782 6064185 6474682 6941364 7465352
57089G465352N78404O24965O58977O74604O65474O32861N94054N76330N97311
$$ 7465352 8043756 8668721 9327698 10002302 10667776 11300637 11894691 12471021 13068332
57080A3068332O51991P20140P82332Q24466Q30343P79241O56468M65506K28274
$$ 13068332 13720323 14440463 15222795 16047261 16877604 17656845 18313313 18778819 19007093
57071A9007093k5727k70900m90865o77724q28302r40607j013226j047337j047938
$$ 19007093 18981366 18710466 18219601 17541877 16713575 15772968 14759742 13712405 12664467
57062A2664467j022190r76813r17319q48621p75087o99932o25392n53632m86948
$$ 12664467 11642277 10665464 9748145 8899524 8124437 7424505 6799113 6245481 5758533
57053E758533m26988l74296l28768k90146k57990k31562k09995j92403j77777
$$ 5758533 5331545 4957249 4628481 4338335 4080345 3848783 3638788 3446385 3268608
57044C268608j65105j53740j43418j33794j24370j15088j06536r9069r2094q4731
$$ 3268608 3103503 2949763 2806345 2672551 2548181 2433093 2326557 2227488 2135394 2050663
57034B050663p7013o9701o3036n6400m9371m2363l5748k8939k0826j0719J495
$$ 2050663 1973650 1903949 1840913 1784513 1735142 1692779 1657031 1628092 1607266 1596547 1598042
57023A598042J5672L1125M6134N8319O5681O7107O2116N0446L1956O933k3022
$$ 1598042 1613714 1644839 1690973 1749292 1814973 1882080 1944196 1994642 2026598 2033531 2010509
57012B010509n4101q0795r8408j05580j04347r7924q8615p7522o5424n3444m2964
$$ 2010509 1956408 1875613 1777205 1671625 1567278 1469354 1380739 1303217 1237793 1184349 1141385
57001A141385l4962k9391k5272k1567j7934j4596j1769r492p798o659n848n097
$$ 1141385 1106423 1077032 1051760 1030193 1012259 997663 985894 976402 968604 961945 956097 951000
56989I51000m295l391k267r68K25J191K116K926K953J664n65k939n273p924j0794
$$ 951000 946705 943314 941047 940079 940304 941495 943611 946537 949490 951154 950589 947650 942377 934453 923659
56974I23659j3045j3952j3473j2051j0256q655p536o581n259l654k397j613m57
$$ 923659 910614 896662 883189 871138 860882 852227 844691 838110 832851 829197 826800 825187 824730
56961H24730J935N250Q192R821J0352J0542J0514R554P086L488m24m376q457j2121
$$ 824730 826665 831915 840107 849928 860280 870822 881336 890890 897976 901464 901040 896664 888207 876086
56947H76086j4281j4707j4478j4492j4114j2206q992n935l859k043O45M336Q137
$$ 876086 861805 847098 832620 818128 804014 791808 782816 776881 773022 770979 771624 775960 784097
56934G84097J1184J3468J5670J8089J9796J9233J5830J0517M485j852q275j3964
$$ 784097 795281 808749 824419 842508 862304 881537 897367 907884 912369 910517 902242 888278
56922H88278j8203k1232k3467k4381k3254k0716j8327j6699j5129j3132j1170
$$ 888278 870075 848843 825376 800995 777741 757025 738698 721999 706870 693738 682568
56911F82568r671q375p005n744m719l824l253l448m146m343l526k243j121m1J284
$$ 682568 672897 664522 657517 651773 647054 643230 639977 636529 632383 628040 624514 622271 621150 621109 622393
56896F22393K602L537M173M784N469O407P994J0298J2702J4517J5570J5985J5670
$$ 622393 624995 628532 632705 637489 642958 649365 657359 667657 680359 694876 710446 726431 742101
56883G42101J4344J1767P881L043j846n828q592j0375j1265j1158j0212q695o440
$$ 742101 756445 768212 776093 779136 777290 771462 762870 752495 741230 730072 719860 711165 704725
56870G04725l242L16L327N953R333J3941J8983K3752K8413L3018L6736L8721L8808
$$ 704725 701483 701799 705126 711079 720412 734353 753336 777088 805501 838519 875255 913976 952784
56857I52784L6683L1351K2360J1007n75j1007j9644k5720k8588k8521k6458k3068
$$ 952784 989467 1020818 1043178 1054185 1053610 1042603 1022959 997239 968651 940130 913672 890604
56845H90604j8605j3371p598j168N939J3184K0092K7007L4548M2584N0361N7214
$$ 890604 871999 858628 851030 849862 855801 868985 889077 916084 950632 993216 1043577 1100791
56833A100791O2312O3907N9915M9588L4122J5626m027k3176l9974n2499n9419
$$ 1100791 1163103 1227010 1286925 1336513 1370635 1386261 1382234 1359058 1319084 1266585 1207166
56822A207166o0680n7683n2511m6591m0058l2549k4277j6049q445j347N766J3299
$$ 1207166 1146486 1088803 1036292 989701 949643 917094 892817 876768 868323 866976 872742 886041
56810H86041K1125K8489L4462L8547M0519L9620L4589K4956J1907k530j6846l0151
$$ 886041 907166 935655 970117 1008664 1049183 1088803 1123392 1148348 1160255 1157725 1140879 1110728
56798A110728m1427m9339n2877n1925m7412m1078l4684k8978k3602j8190j3081
$$ 1110728 1069301 1019962 967085 915160 867748 826670 791986 763008 739406 721216 708135
56787G08135q645m549k42M265Q662J2967J7090K0075K0546J7920J2683N623k611
$$ 708135 699490 694941 694699 698964 707626 720593 737683 757758 778304 796224 808907 814530 811919
56774H11919j1264j9403k6215l1102l3616l3719l1994k9242k5972k2491j9283
$$ 811919 800655 781252 755037 723935 690319 656600 624606 595364 569392 546901 527618
56763E27618j6815j5076j3673j2267j0743r179p916p307p159o797n980n287n154
$$ 527618 510803 495727 482054 469787 459044 449865 441949 434642 427483 420686 414706 409419 404265
56750D04265n096m450l413k681k484k595k886l158k846j736o71o05j219j457j189
$$ 404265 399169 394719 391306 388625 386141 383546 380660 377502 374656 372920 372249 371644 370425 368968 367779
56735C67779j301k074k638k349j716j491j618j605j362j154j116j188j247j077
$$ 367779 366478 364404 361766 359417 357701 356210 354592 352987 351625 350471 349355 348167 346920 345843
56721C45843n29Q2J76l19p53n89k6M61Q32J252J475J029K3p13n56Q6K72k24o11
$$ 345843 345314 345396 345572 345253 344500 343911 343885 344346 345178 346430 347905 348934 348957 348244 347688 347774 348046 347822 347211
56702C47211k40M12M02l43j077j449j792k129j907j107o52j032j374q00Q9J22
$$ 347211 346971 347383 347785 347442 346365 344916 343124 340995 339088 337981 337329 336297 334923 334123 334212 334334
56686C34334n40o71P0O78L99k46l77P7M73K72m38r65o09M73J218Q97Q6k28l9m8
$$ 334334 333794 333123 333193 333871 334270 334024 333647 333724 334197 334469 334031 333066 332457 332930 334148 335045 335131 334903 334864 334816
56666C34816k93j29N88J280J723K263K839K751J845J008J007J543J958K265K911
$$ 334816 334523 334394 334982 336262 337985 340248 343087 345838 347683 348691 349698 351241 353199 355464 358375
56651C58375L942M927N464N427M918M233L739L565L581L565L200K142N10q68j251
$$ 358375 362317 367244 372708 378135 383053 387286 391025 394590 398171 401736 404936 407078 407588 406720 405469
56636D05469r61j013j850k993l850m179l898l129k472k475k817k722k211k079
$$ 405469 404508 403495 401645 398652 394802 390623 386725 383596 381124 378649 375832 373110 370899 368820
56622C68820k557k888k483j682j067q03r40j587k416k744k523k444k733k643j686
$$ 368820 366263 363375 360892 359210 358143 357340 356400 354813 352397 349653 347130 344686 341953 339310 337624
56607C37624n20M5J97M85O46nj348k477k810k592k324k240k272k206j914j623
$$ 337624 337104 337149 337346 337831 338477 338472 337124 334647 331837 329245 326921 324681 322409 320203 318289 316666
56591C16666j701k034j986j287m78j79k90l43k61k53k52ON23J052J444J597J310
$$ 316666 314965 312931 310945 309658 309180 309001 308711 308368 308107 307854 307602 307608 308131 309183 310627 312224 313534
56574C13534O29J34M20J288J828J497Q06Q34K003L504M059L377K573K873M209
$$ 313534 314163 314297 314717 316005 317833 319330 320136 320970 322973 326477 330536 333913 336486 339359 343568
56559C43568N558O474P421Q568R119Q320O521M663L197K013J097O31N25M48K99
$$ 343568 349126 355600 363021 371589 380708 389028 395549 400212 403409 405422 406519 407150 407675 408123 408422
56544D08422L13N66O75J01j225k712l603l697l509l630m128m656m913m754m152
$$ 408422 408735 409301 409976 410077 408852 406140 402537 398840 395331 391701 387573 382917 378004 373250 369098
56529C69098l415l100l317l432k893k055j577j452j335j464k261l226l369k722
$$ 369098 365683 362583 359266 355834 352941 350886 349309 347857 346522 345058 342797 339571 336202 333480
56515C33480k371k790l176k762j821j024o29o64j090j377p83N45J458J249M52
$$ 333480 331109 328319 325143 322381 320560 319536 318907 318243 317153 315776 314993 315538 316996 318245 318697
56500C18697j61n25p55n85K9M04k3q90j474j558j272o55J31O46O77M43M0o80j451
$$ 318697 318536 318011 317256 316671 316700 317104 317081 316191 314717 313159 311887 311232 311363 312009 312686 313129 313169 312489 311038
56481C11038j639j227r52j074r68l30J58ol55n09r00j675j873p70P92J470J123
$$ 311038 309399 308172 307220 306146 305178 304848 305006 305000 304645 304136 303236 301561 299688 298918 299710 301180 302303
56464C02303M65j84p31o81J64R45Q34L68N50J208J422J109Q85P59K97j65J11Q48
$$ 302303 302768 302584 301853 301172 301336 302281 303115 303483 304033 305241 306663 307772 308657 309416 309713 309548 309659 310507
56446C10507R92L79j25j55l18q85j250r82n08k96j68J54N11N72K52l47j022j385
$$ 310507 311499 311878 311753 311598 311280 310395 309145 308163 307655 307359 307191 307345 307856 308428 308680 308333 307311 305926
56428C05926j112k98P04J611K100J857J146Q26J210J468R36K84M19Q20L17q35
$$ 305926 304814 304516 305220 306831 308931 310788 311934 312760 313970 315438 316374 316658 317077 317897 318214 317379
56412C17379j193l24O51R07R12J135J026Oj417k220k049j304n87l89q66j575j791
$$ 317379 316186 315862 316513 317420 318332 319467 320493 320499 319082 316862 314813 313509 312922 312533 311667 310092 308301
56395C08301j276m16L88R77J085L99q42j836k075j835j710j999k539k807k305
$$ 308301 307025 306609 306997 307974 309059 309458 308616 306780 304705 302870 301160 299161 296622 293815 291510
56380B91510j165k43j48l65L9J171K347L209M026M899N443N338M686L773K914
$$ 291510 290345 290102 289954 289589 289628 290799 293146 296355 300381 305280 310723 316061 320747 324520 327434
56365C27434K477K488K395J748R33O27P32N23k16r77j340j431j532j792k158k197
$$ 327434 329911 332399 334794 336542 337475 338102 338834 339357 339141 338164 336824 335393 333861 332069 329911 327714
56349C27714j305L58J606J558P88L18J45k42m83J65J230J474Q62O47J329J969
$$ 327714 326409 326767 328373 329931 330719 331037 331182 330940 330457 330622 331852 333326 334188 334835 336164 338133
56333C38133J927J925K716L786M163L746L164K776K428J880J155O46Q46J610K000
$$ 338133 340060 341985 344701 348487 352650 356396 359560 362336 364764 366644 367799 368445 369291 370901 372901
56318C72901J361K60l24m08o66j041q02J06R12J203J255J169Q09N93J176K197
$$ 372901 374262 374522 374198 373790 373124 372083 371281 371387 372299 373502 374757 375926 376735 377328 378504 380701
56302C80701K502J815J062Q47P96O89J024J953K796L082L124L169K918K324J939
$$ 380701 383203 385018 386080 386927 387723 388412 389436 391389 394185 397267 400391 403560 406478 408802 410741
56287D10741K003K087K018K207K726K950K546J972J698J775K363L719N343O203
$$ 410741 412744 414831 416849 419056 421782 424732 427278 429250 430948 432723 435086 438805 444148 450351
56273D50351O146O022O228O249O017O322P352Q120Q067Q066R066J0684J1975J2700
$$ 450351 456497 462519 468747 474996 481013 487335 494687 502807 510874 518940 528006 538690 550665 563365
56259E63365J3132J3448J4042J5503J7683J9576K0823K2417K5265K8904L2413
$$ 563365 576497 589945 603987 619490 637173 656749 677572 699989 725254 754158 786571
56248G86571L5717L9244M3078M7141N1478N5668N8778O0581O2089O4060O5743
$$ 786571 822288 861532 904610 951751 1003229 1058897 1117675 1178256 1240345 1304405 1370148
56237A370148O5793O3815O0215N5190M8632M0582L1181K0606R461j304j1216k0502
$$ 1370148 1435941 1499756 1559971 1615161 1663793 1704375 1735556 1756162 1765623 1764319 1753103 1732601
56225A732601k9187l6765m2961m8069n2175n4944n6394n7032n6917n5639n3350
$$ 1732601 1703414 1666649 1623688 1575619 1523444 1468500 1412106 1355074 1298157 1242518 1189168
56214A189168n0798m8067m4641m0893l8018l6080l3689l0297k7145k5143k3470
$$ 1189168 1138370 1090303 1045662 1004769 966751 930671 896982 866685 839540 814397 790927
56203G90927k1276j9216j8007j6930j5137j3203j1988j1054r606p977o828n838
$$ 790927 769651 750435 732428 715498 700361 687158 675170 664116 654510 646533 639705 633867
56191F33867m541l478l252l291k894k553k877l131k304q56R1N53J217J851J753
$$ 633867 629326 625848 622596 619305 616411 613858 610981 607850 605546 604690 604781 605334 606551 608402 610155
56176F10155J259J273J740J876J609J497J578J534J595K105K610K555K488L322
$$ 610155 611414 612687 614427 616303 617912 619409 620987 622521 624116 626221 628831 631386 633874 637196
56162F37196M752N598N511N220N350N966P011Q275R162R352R419J0072J1146J2043
$$ 637196 641948 647546 653057 658277 663627 669593 676604 684879 694041 703393 712812 722884 734030 746073
56148G46073J2620J3119J3809J5258J8112K1847K4800K6309K7901L1293L6167
$$ 746073 758693 771812 785621 800879 818991 840838 865638 891947 919848 951141 987308
56137I87308M1016M5360M9987N5808O3427P2960Q3197R1759R7150R9731R9900
$$ 987308 1028324 1073684 1123671 1179479 1242906 1315866 1399063 1490822 1587972 1687703 1787603
56126A787603R6605Q9118P9077O9198O0809N3841M8111M3016L6984K8924J9636
$$ 1787603 1884208 1973326 2052403 2121601 2182410 2236251 2284362 2327378 2364362 2393286 2412922
56115B412922J0430J381p697j5647k1289k5501l0279l6351m3350n1492o1174p1314
$$ 2412922 2423352 2424733 2417036 2401389 2380100 2354599 2324320 2287969 2244619 2193127 2131953 2060639
56103B060639p9793q5275q7420q6020q1341p4645o6998n8327m8839m0187l3614
$$ 2060639 1980846 1895571 1808151 1722131 1640790 1566145 1499147 1440820 1391981 1351794 1318180
56092A318180k8167k2457j7128j3604j1453r154o606m759l382j343J238L172M165
$$ 1318180 1290013 1267556 1250428 1236824 1225371 1216217 1209611 1204852 1201470 1200127 1201365 1204537 1208702
56079A208702M899N561N952O497P658Q868R543J0284J1696J3012J3417J3586J4352
$$ 1208702 1213601 1219162 1225114 1231611 1239269 1248137 1257680 1267964 1279660 1292672 1306089 1319675 1334027
56066A334027J5139J5414J6137J7895J9214J8883J8332J9373K1213K2155K2643
$$ 1334027 1349166 1364580 1380717 1398612 1417826 1436709 1455041 1474414 1495627 1517782 1540425
56055A540425K3897K5113K4953K4381K5072K6276K6312K5770K6187K6942K6659
$$ 1540425 1564322 1589435 1614388 1638769 1663841 1690117 1716429 1742199 1768386 1795328 1821987
56044A821987K6273K7317K8645K8482K8209L0190L3217L4320L3991L5158L7775
$$ 1821987 1848260 1875577 1904222 1932704 1960913 1991103 2024320 2058640 2092631 2127789 2165564
56033B165564L9091L8841L9578M1978M4163M5782M8475N2179N4987N6808N9300
$$ 2165564 2204655 2243496 2283074 2325052 2369215 2414997 2463472 2515651 2570638 2627446 2686746
56022B686746O2235O3931O5004O7628P1289P3496P4453P6730Q0596Q4044Q7123
$$ 2686746 2748981 2812912 2877916 2945544 3016833 3090329 3164782 3241512 3322108 3406152 3493275
56011C493275R1704R7219J01404J04959J10639J18066J24470J30113J37601J46229
$$ 3493275 3584979 3682198 3783602 3888561 3999200 4117266 4241736 4371849 4509450 4655679
56001D655679J52758J57743J65140J75514J85566J94505K04849K16710K27684
$$ 4655679 4808437 4966180 5131320 5306834 5492400 5686905 5891754 6108464 6336148
55992F336148K38636K53066K70391K86583L01811L20534L43539L67280L91500
$$ 6336148 6574784 6827850 7098241 7384824 7686635 8007169 8350708 8717988 9109488
55983I109488M19895M52601M85998N20711N61508O08618O57851P10168P71901
$$ 9109488 9529383 9981984 10467982 10988693 11550201 12158819 12816670 13526838 14298739
55974A4298739Q44572R24234J011940J114546J234062J367352J517840J695933
$$ 14298739 15143311 16067545 17079485 18194031 19428093 20795445 22313285 24009218
55966B4009218J906497K148535K428673K761556L155781L615057M155615M806525
$$ 24009218 25915715 28064250 30492923 33254479 36410260 40025317 44180932 48987457
55958D8987457N591600O529889P656246R021051J0667628J2630033J4944211J7618741
$$ 48987457 54579057 61108946 68765192 77786243 88453871 101083904 116028115 133646856
55950A33646856K0583225K3688924K6723307K9308560L0744201L0097079K6662084
$$ 133646856 154230081 177919005 204642312 233950872 264695073 294792152 321454236
55943C21454236K0429389J2094954K661893o888950j5622616k2633284k7256362
$$ 321454236 341883625 353978579 356640472 349751522 334128906 311495622 284239260
55936B84239260k9344642k9277584k7692554k5213887k2344732j9451150j6753094
$$ 284239260 254894618 225617034 197924480 172710593 150365861 130914711 114161617
55929A14161617j4342765j2243265j0452280q943958p671476o592435n681892
$$ 114161617 99818852 87575587 77123307 68179349 60507873 53915438 48233546
55922D8233546m917089m268503l713652l243637k848700k510799k216352j963070
$$ 48233546 43316457 39047954 35334302 32090665 29241965 26731166 24514814 22551744
55914B2551744j748040j560835j393886j248580j125342j017386r19359q33028
$$ 22551744 20803704 19242869 17848983 16600403 15475061 14457675 13538316 12705288
55906A2705288p59478o94112o33867n81517n38412n00101m63209m29800m01265
$$ 12705288 11945810 11251698 10617831 10036314 9497902 8997801 8534592 8104792 7703527
55897G703527l74403l47148l22082l00816k80604k59585k39932k22907k06103
$$ 7703527 7329124 6981976 6659894 6359078 6078474 5818889 5578957 5356050 5149947
55888E149947j88320j72036j58431j44831j29458j13923r8934q2458o4222m7223
$$ 5149947 4961627 4789591 4631160 4486329 4356871 4242948 4144014 4061556 3997334 3950111
55878C950111l2737j8946o506l62l468j3452k7736m6970p0716r4475j14171j29670
$$ 3950111 3917374 3898428 3891922 3891560 3888092 3874640 3846904 3799934 3729218 3634743 3520572 3390902
55866C390902j41191j46494j44692j39077j33007j26149j17403j08195j00063
$$ 3390902 3249711 3103217 2958525 2819448 2686441 2560292 2442889 2334694 2234631
55857B234631r2022q3132p5038o9391o5120o0520n5760n1444m7079m2777m0015
$$ 2234631 2142609 2059477 1984439 1915048 1849928 1789408 1733648 1682204 1635125 1592348 1552333
55846A552333l9003l7712l5145l3004l2582l2563l1575l0394k9878k9130k7405
$$ 1552333 1513330 1475618 1440473 1407469 1374887 1342324 1310749 1280355 1250477 1221347 1193942
55835A193942k5598k4433k3210k1640k0616k0084j8620j6170j4645j4727j4796
$$ 1193942 1168344 1143911 1120701 1099061 1078445 1058361 1039741 1023571 1008926 994199 979403
55824I79403j4081j3986j5102j5827j5395j5320j6289j6592j5223j3704j3174
$$ 979403 965322 951336 936234 920407 905012 889692 873403 856811 841588 827884 814710
55813H14710j2516j1106j0408j0935j0608q280o090n962o444n418l577k607k214
$$ 814710 802194 791088 780680 769745 759137 750857 744767 738805 732361 726943 723366 720759 718545
55800G18545j393p18q80q57K48J217Q65K90Q75J756J551P94N14M0j516l153l684
$$ 718545 717152 716434 715554 714697 714945 716162 717027 717317 718192 719948 721499 722293 722807 722847 721331 718178 714494
55783G14494m111n974q649j0448j1386j2738j4797j6867j8548j9509j8982j6949
$$ 714494 710383 704409 695760 685312 673926 661188 646391 629524 610976 591467 572485 555536
55771E55536j4652j2804j0686q094o279n603m452k101n25j312k962l410l166l523
$$ 555536 540884 528080 517394 509300 503021 497418 492966 490865 490340 489028 486066 482656 479490 475967
55757D75967l672k464j296k198m315n305n182n783p254p987p659p559q049q163
$$ 475967 472295 469831 468535 466337 462022 456717 451535 445752 438498 430511 422852 415293 407244 399081
55743C99081p627p148o844o300n816n773n304l518j449p95j229j131m42n48j668
$$ 399081 391454 384306 377462 371162 365346 359573 354269 350751 349302 348507 347278 346147 345705 345157 343489
55728C43489k607k972l547m443m901m958n416o096n870m589l349k772k508k390
$$ 343489 340882 337910 334363 329920 325019 320061 314645 308549 302679 298090 294741 291969 289461 287071
55714B87071k619k830k413j678j276q12N15K160K768K278J809J672J146J43o40
$$ 287071 284452 281622 279209 277531 276255 275443 275958 278118 280886 283164 284973 286645 287791 287934 287294
55699B87294j258k489m167n191n356n562n981n667m380l265l118l297k981k373
$$ 287294 286036 283547 279380 274189 268833 263271 257290 251623 247243 243978 240860 237563 234582 232209
55685B32209j989j681r87P6J041J459J204O64M82P26O91m5r19j398j842k590k948
$$ 232209 230220 228539 227552 227628 228669 230128 231332 231996 232478 233204 233895 233850 232931 231533 229691 227101 224153
55668B24153k278j333j256j821j983j623j355j154o16j56l68n37N29K413L509
$$ 224153 221875 220542 219286 217465 215482 213859 212504 211350 210734 210578 210210 209673 210202 212615 216124
55653B16124L343K911K747K385J900K180L242L839L233K170J572J436J389J267
$$ 216124 219467 222378 225125 227510 229410 231590 234832 238671 241904 244074 245646 247082 248471 249738
55639B49738P52n63k342l668m258m722n435o057o318o355o173n628m941m444l854
$$ 249738 250490 249927 247585 243917 239659 234937 229502 223445 217127 210772 204599 198971 194030 189586 185732
55624A85732k729j500j051j343j540j380j284j170m62O44J132N76m46j411k221
$$ 185732 183003 181503 180452 179109 177569 176189 174905 173735 173273 173917 175049 175625 175179 173768 171547
55609A71547k548k004j132j013j706k204k039j778j797j761j544j451j303n47
$$ 171547 168999 166995 165863 164850 163144 160940 158901 157123 155326 153565 152021 150570 149267 148720
55595A48720M37N03m50j111o46K04N23M98O21P08M45J38J73M40P85J322J861J787
$$ 148720 149157 149660 149210 148099 147453 147657 148180 148678 149299 150007 150452 150590 150763 151203 151988 153310 155171 156958
55577A56958J007L63O24J678L028M384N491O017O068O156O426O437N889M955L789
$$ 156958 157965 158328 158952 160630 163658 168042 173533 179550 185618 191774 198200 204637 210526 215481 219270
55562B19270K411J081L7j184l181n433o642o519o129o230o398o108n610n179m579
$$ 219270 221681 222762 222799 221615 218434 213001 206359 199840 193711 187481 181083 174975 169365 164186 159607
55547A59607l804l443l697l859l355k546k013j777j757k132k716k763j990j121
$$ 159607 155803 152360 148663 144804 141449 138903 136890 135113 133356 131224 128508 125745 123755 122634
55533A22634q45q68o04j85j65o27j138j264q47j42J95k39r13r92o27p45j450j672
$$ 122634 121789 120921 120317 120132 119967 119340 118202 116938 116091 115949 116144 115905 114992 114000 113373 112628 111178 109506
55515A09506p17Q29K140L089L708L616K723J668R96N11l5l73l49l72o52p34l51
$$ 109506 108789 109618 111758 114847 118555 122171 124894 126562 127558 128069 128034 127661 127312 126940 126288 125554 125203
55498A25203j9k08n84p05p40r05q14j81M08J20j043k343l091k954j973p09J24
$$ 125203 125184 124976 124392 123687 122947 122042 121228 121047 121455 121575 120532 118189 115098 112144 110171 109462 109586
55481A09586M04N82P39M45k19m61JL91J34k63k42k08p47j539j860j539p84K91
$$ 109586 109990 110572 111311 111756 111537 111076 111077 111468 111602 111339 111097 110889 110142 108603 106743 105204 104420 104711
55463A04711J280J370M56l99l48N9k5k65J37Q54Q05j26q88p32J2O26P45L90j32
$$ 104711 105991 107361 107817 107418 107070 107129 107104 106839 106976 107830 108635 108509 107621 106889 106901 107527 108272 108662 108530
55444A08530m38m96o30q31o38o0J16m16p09L4J017R44on16j48K46O6k81l11r2
$$ 108530 108092 107596 106966 106135 105497 105437 105553 105137 104428 104462 105479 106423 106417 105901 105753 105999 106065 105784 105473 105381
55424A05381K24O35Q37L88m68q94n97j77q0L2N26J035R65L23l18m83j13N37J057
$$ 105381 105605 106240 107077 107465 106997 106103 105506 105329 105249 105281 105807 106842 107807 108130 107812 107329 107216 107753 108810
55405A08810J068M81m15j113j210p14j08M6l25q05j052j111j063q29n13m55o55
$$ 108810 109878 110359 109944 108831 107621 106907 106799 106845 106520 105715 104663 103552 102489 101660 101147 100692 100037
55388A00037n55J73J065J479J355R48K81n41r32m16O30J455J866K032J752P01
$$ 100037 99482 99655 100720 102199 103554 104502 104783 104242 103310 102894 103524 104979 106845 108877 110629 111330
55372A11330p11j584j659j442j272r55m96l68p71j202j112n31J80Q26J295J386
$$ 111330 110619 109035 107376 105934 104662 103707 103211 102843 102072 100870 99758 99227 99407 100233 101528 102914
55356A02914J020M73P7j58m39p51p24l3J071J783J523O40P7K40N59L55l06r22
$$ 102914 103934 104407 104484 104326 103887 103136 102412 102379 103450 105233 106756 107396 107473 107713 108272 108627 108321 107399
55338A07399j363j809k134j896j001K5O09P11P69J129J555J412M65o01q30j52
$$ 107399 106036 104227 102093 100197 99196 99221 99830 100541 101310 102439 103994 105406 105871 105270 104440 104288
55322A04288N78P34N95N79N15J01l83m83k96k35l29l49l92p28j153j121n19J64
$$ 104288 104866 105600 106195 106774 107289 107390 107007 106524 106228 105993 105664 105315 104923 104195 103042 101921 101402 101566
55304A01566N02N46N84P32Q64P84N02L16M58O18K90l18l43M32J037O06l34o53
$$ 101566 102068 102614 103198 103930 104794 105578 106080 106396 106854 107472 107762 107444 107101 107533 108570 109176 108842 108189
55286A08189j66L53M68M77O11O86N76M21K49p2m29n42m10k32J5M37P35M83j65
$$ 108189 108023 108376 108844 109321 109932 110618 111194 111615 111864 111792 111363 110821 110411 110179 110194 110631 111366 111849 111684
55267A11684o09o59o44o86n29j87r4m13p60q30p96p96n69J02R36J462J474R87
$$ 111684 111075 110416 109772 109086 108557 108370 108276 107863 107103 106273 105477 104681 104112 104214 105150 106612 108086 109073
55249A09073O6r92j580j282l48N51R57R10O90M71K38j6j38l0N2k78q68r58j87
$$ 109073 109139 108147 106567 105285 104937 105488 106445 107355 108045 108516 108754 108738 108600 108570 108622 108344 107476 106518 106331
55230A06331O15K42j327k685k509r04R14J969K191J958J448O67j37m83l06j62
$$ 106331 106946 107188 105861 103176 100667 99763 100677 102646 104837 106795 108243 108910 108773 108290 107984 107822
55214A07822m98q68m74O26J459J427R66O61M41Q2j07J97O13N79K44J41K32L2m73
$$ 107822 107324 106456 105982 106608 108067 109494 110460 111121 111562 111644 111537 111734 112347 112926 113170 113311 113543 113575 113102
55195A13102p92p50o54o21m14p5m0m87j019j246j168q97l74L67J003J206R95O68
$$ 113102 112310 111560 110906 110285 109871 109796 109756 109269 108250 107004 105836 104939 104565 104932 105935 107141 108136 108804
55177A08804N25O01N47p0j077j592r64L74J360J530J246R47P29O73R65J503J792
$$ 108804 109329 109930 110477 110407 109330 107738 106774 107148 108508 110038 111284 112231 112960 113633 114598 116101 117893
55160A17893J496Q04J40k14j80J79O35R01Q64O26L65K65L90N25L25k48q50j275
$$ 117893 119389 120193 120333 120119 119939 120118 120753 121654 122518 123144 123509 123774 124164 124689 125014 124766 123916 122641
55142A22641j712k218k371j794p27K96R61J067M02p05j249o55L13M77k26r01j099
$$ 122641 120929 118711 116340 114546 113819 114115 115076 116143 116545 115840 114591 113936 114249 114726 114500 113599 112500
55125A12500j081q99k14Q14J368J002K20k17o7M86J096J344J003M03J14K41M53
$$ 112500 111419 110520 110306 111120 112488 113490 113710 113493 113426 113912 115008 116352 117355 117758 117872 118113 118566
55108A18566N90P41P41K98l69o26k96J33K68K79M87R27J400J637J441J042J032
$$ 118566 119156 119897 120638 120936 120567 119941 119645 119778 120046 120325 120812 121739 123139 124776 126217 127259 128291
55091A28291J533J727R45k05o46m38n56j208j625j499j391j431r63J14Q35O24
$$ 128291 129824 131551 132496 132291 131645 131207 130651 129443 127818 126319 124928 123497 122534 122648 123483 124107
55075A24107J57J27J46k94p56p27o72j181j700j232M6R51Q96M41K47L34M72N95
$$ 124107 124264 124391 124537 124243 123487 122760 122088 120907 119207 117975 118021 118972 119868 120309 120556 120890 121362 121957
55057A21957O88O64M73O8o40j539k167k110j421m19O81J670K181J965J189K40
$$ 121957 122645 123309 123782 123850 123210 121671 119504 117394 115973 115554 116235 117905 120086 122051 123240 123480
55041A23480n89j007p63j3O21P08M36J16l29r70j372j054k14M49O12O00Q40J316
$$ 123480 122891 121884 121121 121108 121729 122437 122873 122989 122660 121690 120318 119264 119050 119499 120111 120711 121551 122867
55023A22867J587J176R7r91j385j117p81o16k64M11R85J239J547K017J957R40
$$ 122867 124454 125630 125727 124736 123351 122234 121453 120837 120573 120984 121969 123208 124755 126772 128729 129669
55007A29669k28n02j39k76j179j904j783j306j144j101n47N35J467J679J253P46
$$ 129669 129441 128939 128800 128524 127345 125441 123658 122352 121208 120107 119560 120095 121562 123241 124494 125240
54991A25240O63J035J463J524J115M15k98o89m90J40N88M58J30K79Q98J261Q82
$$ 125240 125903 126938 128401 129925 131040 131455 131157 130468 129978 130118 130706 131164 131294 131573 132471 133732 134614
54974A34614R0m43m22MN54R06P89L29J27O00J282J231K50p57r04m32j59j76J64
$$ 134614 134704 134261 133839 133843 134397 135303 136092 136421 136548 137148 138430 139661 139911 139154 138250 137818 137659 137483 137647
54955A37647R79J470J129N85O15R04O64Jk06K53N89K56l42o80r33j479k044j913
$$ 137647 138626 140096 141225 141810 142425 143329 143993 143994 143788 144041 144630 144886 144544 143864 142931 141452 139408 137495
54937A37495q04P33J777J780J018L07J19J57M2L3N31J214J464J484K014K946L319
$$ 137495 136691 137424 139201 140981 141999 142306 142425 142582 142624 142657 143188 144402 145866 147350 149364 152310 155629
54920A55629K930K922M135N834O802O993P234P825Q300Q250P621O278M016J013
$$ 155629 158559 161481 165616 171450 178252 185245 192479 200304 208604 216854 224475 230753 234769 235782
54906B35782k171m975o922p600p063o093n598n728n875n495m638l753l196k894
$$ 235782 233611 228636 221714 214114 207051 200958 195360 189632 183757 178262 173624 169871 166675 163781
54892A63781k493j841j283j181j287j065n45k12j22J79O67O87J99K61J611L503
$$ 163781 161288 159447 158164 156983 155696 154631 154086 153874 153752 153931 154598 155285 155484 155745 157356 160859
54876A60859M718N118N476O172O918P434P607P214O177M937L916K820J126r90
$$ 160859 165577 170695 176171 182343 189261 196695 204302 211516 217693 222630 226546 229366 230492 229502
54862B29502k894m419n789o781o887o241n617n337n007m518m502n336o242o039
$$ 229502 226608 222189 216400 209619 202732 196491 190874 185537 180530 176012 171510 166174 159932 153893
54848A53893m530k724j687j589j873k070k110j978j481n90K60O19O37P73J010
$$ 153893 149363 146639 144952 143363 141490 139420 137310 135332 133851 133261 133521 134140 134777 135550 136560
54833A36560Q98L22l33q95j486j862j448l80L48K21p6J09L03j85r69j141o46j37
$$ 136560 137458 137780 137447 136552 135066 133204 131756 131376 131724 131945 131869 131978 132281 132096 131127 129986 129340 129203
54815A29203J60N28R52J139J171J337J401R21J75m7M08Q97R19N27j33r01j215
$$ 129203 129363 129891 130843 131982 133153 134490 135891 136812 136987 136940 137348 138245 139164 139691 139558 138657 137442
54798A37442n32P18J332P83k00p02o35m14k03N8K96L57J92j92p52j215j135k86
$$ 137442 136910 137628 138960 139743 139543 138841 138206 137792 137589 137647 137943 138300 138492 138300 137548 136333 135198 134912
54780A34912J064K345L028K913K240J491R69O73O73J216K287L355L968M214M356
$$ 134912 135976 138321 141349 144262 146502 147993 148962 149635 150308 151524 153811 157166 161134 165348 169704
54765A69704M361M240M420N229O279O923P035O849O316N225L760K318R18o47k301
$$ 169704 174065 178305 182725 187954 194233 201156 208191 215040 221356 226581 230341 232659 233577 232930 230629
54750B30629l829n246o547p319p264o714o104n283m044k921k606k832k739k104
$$ 230629 226800 221554 215007 207688 200424 193710 187606 182323 178279 175358 172752 169920 167181 165077
54736A65077j395q47l56o8j31r1M92J079R11M64R04K115K712K205J716K237L442
$$ 165077 163682 162835 162479 162411 162280 162189 162681 163760 164671 165135 166039 168154 170866 173071 174787 177024 180466
54719A80466M675N873O881P028O157N103M414L541K005M23n56j454l082n048o233
$$ 180466 185141 191014 197895 204923 211080 216183 220597 224138 226143 226566 226010 224556 221474 216426 210193
54704B10193o369o206o282o386o149n428m228k785j670j363j722k196k405k232
$$ 210193 203824 197618 191336 184950 178801 173373 169145 166360 164690 163327 161605 159409 157004 154772
54690A54772j603o27K49N71L24k18q08j265j407j243j026r24q38o64n19m80m53
$$ 154772 153169 152542 152791 153362 153686 153468 152660 151395 149988 148745 147719 146795 145957 145293 144774 144294 143841
54673A43841l99l54j54M64J292J660J271N96K15J58J57J45J59J17j7j18j52k70
$$ 143841 143442 143088 142934 143398 144690 146350 147621 148217 148432 148590 148747 148892 149051 149168 149151 149033 148881 148611
54655A48611m57m43j73L7m8l07n97r52j265j252r18o67o63o29m21l09l92k61L13
$$ 148611 148154 147711 147538 147575 147527 147220 146623 145671 144406 143154 142236 141569 140906 140277 139856 139547 139155 138894 139207
54636A39207R03R94P05M98N36O32O36M93K23RO7K36J01l84p99r41j005r07j40
$$ 139207 140110 141104 141809 142307 142843 143475 144111 144604 144827 144836 144903 145139 145240 144856 144057 143116 142111 141204 141064
54617A41064J262K288K074J060L89M65P53P42M95K79J21q7l50n43n94o52r45j373
$$ 141064 142326 144614 146688 147748 148137 148602 149355 150097 150592 150871 150992 150905 150555 150012 149418 148766 147821 146448
54599A46448j405p26K19P51Q44R68J157R74L64j12q3K37N14N24j6j113j974j701
$$ 146448 145043 144317 144536 145287 146131 147099 148256 149230 149594 149482 149399 149636 150150 150674 150658 149545 147571 145870
54581A45870o25K5j46l11%K40O2L2L94M52j39n66k83m0n21r20k17J028J463R28
$$ 145870 145245 145270 145124 144813 144813 145053 145115 145147 145541 145993 145854 145288 145005 144965 144444 143524 143307 144335 145798 146726
54561A46726L52J68N4j20k05l60p11p62j35N34M72J20M69J400J903J651J166O40
$$ 146726 147078 147246 147300 147180 146975 146615 145904 145142 145007 145541 146013 146133 146602 148002 149905 151556 152722 153362
54543A53362j22p27m83L66R03J033J470K190K235J349N00L60M45J86j52j98j42
$$ 153362 153240 152513 152030 152396 153299 154332 155802 157992 160227 161576 162076 162436 162881 163067 162915 162717 162575
54526A62575r2L19J117J549J102L38Q5K67J94l92j083j335r17p0N74N19K3k84
$$ 162575 162483 162802 163919 165468 166570 166908 166993 167260 167454 167062 165979 164644 163727 163657 164231 164750 164773 164489
54508A64489l65q47j936k909l034k421j591p61Q1P69J074J048Q71O45M73N23P64
$$ 164489 164124 163277 161341 158432 155398 152977 151386 150625 150706 151475 152549 153597 154468 155113 155586 156109 156873
54491A56873R57J007J097J334J476J235O23qj88K77Q97P88k45j223j142k93L02
$$ 156873 157830 158837 159934 161268 162744 163979 164602 164594 164406 164683 165580 166368 166123 164900 163758 163465 163767
54474A63767M47Q29J583J955J630J288J340J163K87m77n3J284K240K201J724J414
$$ 163767 164214 165043 166626 168581 170211 171499 172839 174002 174289 173812 173759 175043 177283 179484 181208 182622
54458A82622J122N14j52k67K99R22Q91K28m04o15p27j113j430j126l92L6k0p2
$$ 182622 183744 184258 184106 183839 184138 185060 185951 186179 185775 185160 184433 183320 181890 180764 180372 180408 180388 180316
54440A80316M0j68q59j435j419j146j036q51k56L34K19n15j058r39m97k93m40
$$ 180316 180356 180188 179329 177894 176475 175329 174293 173442 173186 173520 173739 173224 172166 171227 170730 170437 169997
54423A69997n50j03J049K316K715J813K56q55r64k76P08J488J603Q77l09j227
$$ 169997 169447 169344 170393 172709 175424 177237 177493 176638 175674 175398 176106 177594 179197 180074 179765 178538
54407A78538j469j203q40n92m16k09N7M22R21J460J683J282N09R4M10R18Q46K46
$$ 178538 177069 175866 175026 174434 174018 173809 173866 174288 175209 176669 178352 179634 180143 180237 180647 181565 182411 182657
54389A82657j01K06P13Q52P15P17Q71P68J92n64j027j065j007j187j454j327p36
$$ 182657 182556 182762 183475 184327 185042 185759 186630 187398 187590 187026 185999 184934 183927 182740 181286 179959 179223
54372A79223k60l62o83n12K25Q97J047Q52P13Q19J124J343J020nj180j737j564
$$ 179223 178963 178601 177918 177406 177631 178528 179575 180427 181140 181959 183083 184426 185446 185441 184261 182524 180960
54355A80960j155p92l41J44L14J21l0M0J8k46l96r8M65Q44P17l7j222k171k277
$$ 180960 179805 179013 178672 178816 179130 179251 179221 179261 179279 179033 178637 178539 179004 179848 180565 180528 179306 177135 174858
54336A74858j782j482j536j307n38R4K5l15k51J06K23N9j2P3L8j63l52m83o56
$$ 174858 173076 171594 170058 168751 168213 168307 168332 168017 167766 167872 168095 168154 168142 168215 168253 168090 167738 167255 166599
54317A66599q22q08n36p9L86N81L81J16K55P12R87J011J245J744J919J533J141
$$ 166599 165777 164969 164433 164354 164740 165321 165702 165818 166073 166785 167772 168783 170028 171772 173691 175224 176365
54300A76365J083Q36N4n36m6J205K150K365K200J909J482J078Q44M95k18r16j197
$$ 176365 177448 178284 178338 177802 177756 178961 181111 183476 185676 187585 189067 190145 190989 191484 191266 190350 189153
54283A89153j480k285l094k984k196j865k131j921q33J2k89j012r71k51K86M95
$$ 189153 187673 185388 182294 179310 177114 175249 173118 171197 170364 170376 170087 169075 168104 167853 168139 168634
54267A68634Q75J280R76L1m67J02R10Q48Q9k02M74J375J626J287Q84M48l71j427
$$ 168634 169509 170789 171765 171796 171329 171431 172341 173189 173278 173076 173550 174925 176551 177838 178722 179170 178799 177372
54249A77372j999j748j197r58r95r38p47o78p77q39p42m65K8O41J041J011P66
$$ 177372 175373 173625 172428 171470 170475 169537 168790 168112 167335 166496 165754 165289 165317 165958 166999 168010 168776
54232A68776N92L50j69o65o35j94m3m70r52r62o69n16m74j26N68J047P88k2o46
$$ 168776 169368 169718 169549 168884 168249 168055 168012 167542 166590 165628 164959 164443 163969 163843 164411 165458 166246 166224 165578
54213A65578o05j68O2j25m53o78q26q82o66k11J41K80O02J314J881J660Q45K44
$$ 165578 164973 164805 164867 164742 164289 163611 162785 161903 161237 161026 161167 161447 162049 163363 165244 166904 167749 167993
54195A67993J78K25J3k86l78l39m24o10n74p6O61R67L81o30r99l51M11L28k63
$$ 167993 168171 168396 168409 168123 167745 167406 166982 166372 165798 165722 166383 167350 167731 167101 166102 165751 166162 166490 166227
54176A66227k78M55R93O86m4n01n49l73p9J17p2m21k73M38Q65M75o8Q8O34O18
$$ 166227 165949 166404 167397 168083 168039 167538 166989 166616 166537 166654 166582 166161 165888 166326 167191 167666 167598 167686 168320 168938
54156A68938k2m26k12P4K1N0O22J474K051K212K009J308J69p29p37j68L5m68j114
$$ 168938 168916 168490 168278 168352 168373 168423 169045 170519 172570 174782 176791 178099 178268 177539 176802 176634 176669 176201 175087
54137A75087j442j662j953j860r86R7L61m01j351j664j241m01M98J010P99K38
$$ 175087 173645 171983 170030 168170 167184 167281 167642 167241 165890 164226 162985 162584 163082 164092 164891 165129
54121A65129J57P38J160Q15L16N78J346J555R53L63K77J70m48j109j081m13L38
$$ 165129 165286 166024 167184 167999 168315 168893 170239 171794 172747 173110 173387 173557 173109 172000 170919 170506 170844
54104A70844R27J357J399R07L89M78R02P36j94r24o73J01M40J49k19l24l31m26
$$ 170844 171771 173128 174527 175434 175823 176301 177203 177939 177745 176821 176148 176249 176689 176838 176619 176295 175964 175538
54086A75538o03q84j225j191l18J087K042K046J633J542J723J636J140N93K48
$$ 175538 174935 174051 172826 171635 171317 172404 174446 176492 178125 179667 181390 183026 184166 184759 185007
54071A85007M1q5q9k5J2J23M20O81N68J69n5P8K49J31j91m18l84j31K11N33Q07
$$ 185007 185048 184963 184874 184849 184861 184984 185404 186085 186653 186822 186767 186845 187094 187225 187034 186616 186232 186101 186312 186845 187652
54050A87652R82Q18J16o06k54J419L022L055J987J658K598L339K863K299L175
$$ 187652 188634 189452 189568 188962 188708 190127 193149 196204 198191 199849 202447 205786 208649 210948 214123
54035B14123N005N995N546M700M293M050L704L758M569N501N612M726L384K187
$$ 214123 219128 225123 230669 235369 239662 243712 247416 251174 255743 261244 266856 271582 274966 277153
54021B77153J527J572K057K348K070J535J191R15K54p34j362j194p41r26k043
$$ 277153 278680 280252 282309 284657 286727 288262 289453 290368 290622 289888 288526 287332 286591 285665 283622
54006B83622l513m667n352n624n268m118k663j823j959k552k961l014k752k196
$$ 283622 280109 275442 270090 264466 259198 255080 252417 250594 248635 246083 243122 240108 237356 235160
53992B35160j707j934k864l390k540q64J99J16l69n98p97j218j364p20K74P07
$$ 235160 233453 231519 228655 225265 222725 221861 222060 222176 221807 221209 220412 219194 217830 217110 217384 218091
53976B18091L81j24m95j082k055k707k150n37R06J223P07L62O49J131J267J086
$$ 218091 218472 218348 217853 216771 214716 212009 209859 209322 210228 211451 212158 212520 213169 214300 215567 216653
53960B16653J012J323J994K752L185L018K515K306K680L292L750M141M719N352
$$ 216653 217665 218988 220982 223734 226919 229937 232452 234758 237438 240730 244480 248621 253340 258692
53946B58692N792O287P456R515J2018J4390J6315J7581J7825J6716J4271J0868
$$ 258692 264484 270771 278227 287742 299760 314150 330465 348046 365871 382587 396858 407726
53934D07726O967K880j238n138q355j0432j1250j0992r884q114o071m311l178
$$ 407726 414693 417573 416335 411197 402842 392410 381160 370168 360284 352170 346099 341788 338610
53921C38610k603k278j811q13P68K379L373L772M176M805N251N238N012M743M260
$$ 338610 336007 333729 331918 331105 331873 334252 337625 341397 345573 350378 355629 360867 365879 370622 374882
53906C74882L668L572M113M476L899K669J535O17l55j241j688j896k338k949l260
$$ 374882 378550 382122 386235 390711 394610 397279 398814 399431 399076 397835 396147 394251 391913 388964 385704
53891C85704l240l344l857m680n632o436o628o082n372n118n202n167n026n054
$$ 385704 382464 379120 375263 370583 364951 358515 351887 345805 340433 335315 330113 324946 319920 314866
53877C14866n093m804m363m192m177l907l411k971k496j821j377j652k292k609
$$ 314866 309773 304969 300606 296414 292237 288330 284919 281948 279452 277631 276254 274602 272310 269701
53863B69701k719l144l571l182k128j466j583j792j616j374j312j239j233j634
$$ 269701 266982 263838 260267 257085 254957 253491 251908 250116 248500 247126 245814 244575 243342 241708
53849B41708k146k034j318p89o80n04k95o19j187r52j7K18o09j040k13O48L15
$$ 241708 239562 237528 236210 235421 234741 234237 233942 233323 232136 231184 231167 231385 230776 229736 229523 230171 230486
53832B30486m57n05m45j369k518k210o06M16j6q74j059o35p5M25O36L89J14L93
$$ 230486 230029 229524 229079 227710 225192 222982 222376 222792 222776 221902 220843 220208 220133 220558 221194 221583 221697 222090
53814B22090R25R02L98K94Q15J231J208J339J935K355K108J728J964K691L319
$$ 222090 223015 223917 224315 224609 225424 226655 227863 229202 231137 233492 235600 237328 239292 241983 245302
53799B45302L752M372N254N953N999N368M500L942L862L926L782L524L384L212
$$ 245302 249054 253426 258680 264633 270632 276000 280500 284442 288304 292230 296012 299536 302920 306132
53785C06132K682J928J459J399J305Q58K66j12k03j64k05n63j293k036k315k084
$$ 306132 308814 310742 312201 313600 314905 315763 316029 315917 315714 315550 315345 314782 313489 311453 309138 307054
53769C07054j634r60L01K189M104N465O368P322Q449R194Q785O875L751O3l643
$$ 307054 305420 304460 304761 306950 311054 316519 322887 330209 338658 347852 356637 363512 367263 367326 363683
53754C63683p044r865j1770j2545j2304j1389j0203r102q233p395o334n153m154
$$ 363683 356639 346774 335004 322459 310155 298766 288563 279461 271228 263833 257499 252346 248192
53741B48192l309k351j437j068j203j120m84J49K97L02N01M69j33o59m54r4m78
$$ 248192 244883 242532 241095 240027 238824 237704 237220 237369 237666 237968 238469 238938 238805 238146 237692 237598 237120
53724B37120j075m82J291K516K012N32n29p72o49n35o01r08j047k63J513L245
$$ 237120 236045 235563 236854 239370 241382 241914 241385 240613 239964 239429 238828 237920 236873 236610 238123 241368
53708B41368L889L512K875K434K246K367K729K891K518J916J728K181L015L870
$$ 241368 245257 248769 251644 254078 256324 258691 261420 264311 266829 268745 270473 272654 275669 279539
53694B79539M361M108L127K049J486J319J040O14N24R23J220P85k32r85q45n8
$$ 279539 283900 288008 291135 293184 294670 295989 297029 297643 298167 299090 300310 301095 300863 299878 299033 298975
53678B98975N24L75j15j16O67J728K499K933L199L165K616J803J291J248J233
$$ 298975 299499 299874 299759 299643 300310 302038 304537 307470 310669 313834 316450 318253 319544 320792 322025
53663C22025P53k06j335k425l383m067m341m253l942l457k856k486k716l284l278
$$ 322025 322778 322572 321237 318812 315429 311362 307021 302768 298826 295369 292513 290027 287311 284027 280749
53648B80749k213q06j58l23l11L45Q38K82r16j512r70M8O35N50J38j71j06M05
$$ 280749 278536 277730 277572 277249 276938 277283 278121 278403 277487 275975 275005 275053 275688 276238 276376 276205 276099 276504
53630B76504J252K239L099L465L048K111J465J642K260K553K399K364K753L132
$$ 276504 277756 279995 283094 286559 289607 291718 293183 294825 297085 299638 302037 304401 307154 310286
53616C10286K915K149J517J654K495L283L341K837K507K604K591K158J919K516
$$ 310286 313201 315350 316867 318521 321016 324299 327640 330477 332984 335588 338179 340337 342256 344772
53602C44772L463L669K891J925J400J185J048J033J005N11m58j160j011m32k89
$$ 344772 348235 351904 354795 356720 358120 359305 360353 361386 362391 362902 362444 361284 360273 359841 359552
53587C59552p43j127q91l68m33j448k721l190k695k196k492l127l030j990q35
$$ 359552 358809 357682 356791 356423 355990 354542 351821 348631 345936 343740 341248 338121 335091 333101 332266
53572C32266k83k51l28l48l56n05j038j925k546k236j143n7O17J097J508J685
$$ 332266 331983 331732 331404 331056 330700 330195 329157 327232 324686 322450 321307 321250 321867 322964 324472 326157
53556C26157J737J968K094J418R6o43j8J246K008K148K344K891L473L780L755
$$ 326157 327894 329862 331956 333374 333470 332827 332809 334055 336063 338211 340555 343446 346919 350699 354454
53541C54454L524L486M096N169N839N654N223N285N667N859O140P261R234J1206
$$ 354454 357978 361464 365560 370729 376568 382222 387445 392730 398397 404256 410396 417657 426891 438097
53527D38097J2486J3006J2937J2529J2292J2637J3330J3818J4083J4565J5319
$$ 438097 450583 463589 476526 489055 501347 513984 527314 541132 555215 569780 585099
53516E85099J5919J6275J6932J8318K0161K1909K3239K4096K4592K5054K5738
$$ 585099 601018 617293 634225 652543 672704 694613 717852 741948 766540 791594 817332
53505H17332K6361K6357K5754K5310K5510K5900K5726K4883K3736K2389K0714
$$ 817332 843693 870050 895804 921114 946624 972524 998250 1023133 1046869 1069258 1089972
53494A089972J8989J7849J7424J7003J5953J4710J4363J5267J6451J6688J5832
$$ 1089972 1108961 1126810 1144234 1161237 1177190 1191900 1206263 1221530 1237981 1254669 1270501
53483A270501J4785J4192J3734J2809J1539J0619J0303R987Q892O927M685K674
$$ 1270501 1285286 1299478 1313212 1326021 1337560 1348179 1358482 1368469 1377361 1384288 1388973 1391647
53471A391647P81j404l849n969p394q584j0353j2790j5076j6449j7010j7329j7688
$$ 1391647 1392428 1391024 1387175 1381206 1373812 1365228 1354875 1342085 1327009 1310560 1293550 1276221 1258533
53458A258533j8025j8348j8860j9677k0772k1963k2864k2925k1985k0646j9753
$$ 1258533 1240508 1222160 1203300 1183623 1162851 1140888 1118024 1095099 1073114 1052468 1032715
53447A032715j9556j9635j9589j9306j8561j6902j4304j1604r819r048q436p246
$$ 1032715 1013159 993524 973935 954629 936068 919166 904862 893258 883439 874391 865955 858709
53435H58709n676m360l352k013K5K216L733M583N638P456R493J0768J1156J1673
$$ 858709 853033 848673 845321 843308 843333 845549 849282 853865 859503 866959 876452 887220 898376 910049
53421I10049J3383J6225J9102K1049K2081K2871K3838K4918K6119K7769K9898
$$ 910049 923432 939657 958759 979808 1001889 1024760 1048598 1073516 1099635 1127404 1157302
53410A157302L1837L2903L3319L3986L5426L7481L9886M2517M4959M6517M7034
$$ 1157302 1189139 1222042 1255361 1289347 1324773 1362254 1402140 1444657 1489616 1536133 1583167
53399A583167M7291M8215M9973N2052N3876N5064N5455N5276N5058N5045N4871
$$ 1583167 1630458 1678673 1728646 1780698 1834574 1889638 1945093 2000369 2055427 2110472 2165343
53388B165343N4057N2623N0857M8848M6548M4162M1874L9349L5935L1537K6919
$$ 2165343 2219400 2272023 2322880 2371728 2418276 2462438 2504312 2543661 2579596 2611133 2638052
53377B638052K2986J9803J6559J2433P493K522k036o664j2024j7874k3351k8274
$$ 2638052 2661038 2680841 2697400 2709833 2717326 2719848 2717812 2711148 2699124 2681250 2657899 2629625
53365B629625l3417l9236m5038m9820n3408n6195n8237n9259n9356n9064n8805
$$ 2629625 2596208 2556972 2511934 2462114 2408706 2352511 2294274 2235015 2175659 2116595 2057790
53354B057790n8643n8463n7967n6770n4876n2957n1644n0812m9927m8837m7664
$$ 2057790 1999147 1940684 1882717 1825947 1771071 1718114 1666470 1615658 1565731 1516894 1469230
53343A469230m6192m4067m1557l9427l7987l6807l5379l3534l1178k8243k5087
$$ 1469230 1423038 1378971 1337414 1297987 1260000 1223193 1187814 1154280 1123102 1094859 1069772
53332A069772k2382k0388j8719j6993j5218j3466j1630r773q246p194o354n527
$$ 1069772 1047390 1027002 1008283 991290 976072 962606 950976 941203 932957 925763 919409 913882
53320I13882m861m422l870k905j647l15J141K720M079N021N988P529R394J0740
$$ 913882 909021 904599 900729 897824 896177 895862 897003 899723 903802 908823 914811 922340 931734 942474
53306I42474J1216J1460J2337J4134J6512J8921K0799K1783K2076K2495K3720
$$ 942474 953690 965150 977487 991621 1008133 1027054 1047853 1069636 1091712 1114207 1137927
53295A137927K5476K6808K7249K7344K7863K8761K9340K9162K8313K6841K4589
$$ 1137927 1163403 1190211 1217460 1244804 1272667 1301428 1330768 1359930 1388243 1415084 1439673
53284A439673K1794J9221J7311J5575J3381J0906Q714O621L812J54l361n795p403
$$ 1439673 1461467 1480688 1497999 1513574 1526955 1537861 1546575 1553196 1557008 1557162 1553801 1548006 1540603
53271A540603r188j1704j4681j7559j9920k1528k2440k3186k4516k6702k9229
$$ 1540603 1531415 1519711 1505030 1487471 1467551 1446023 1423583 1400397 1375881 1349179 1319950
53260A319950l1287l2525l3146l3416l3299l2768l2235l2278l2879l3296l2850
$$ 1319950 1288663 1256138 1222992 1189576 1156277 1123509 1091274 1058996 1026117 992821 959971
53249I59971l1614l0125k8739k7528k6651k6250k6062k5518k4389k3059k1983
$$ 959971 928357 898232 869493 841965 815314 789064 763002 737484 713095 690036 668053
53238F68053k1171k0328j9332j8314j7368j6371j5157j3747j2336j1096j0028
$$ 668053 646882 626554 607222 588908 571540 555169 540012 526265 513929 502833 492805
53227D92805r054q153p368o793o633p139q164q890q447o955n547n145n537n951
$$ 492805 483751 475598 468230 461437 454804 447665 439501 430611 422164 415209 409662 404517 398980 393029
53213C93029o107o260o411o138n236m177l713m193n233n963n695m561l432k999
$$ 393029 386922 380662 374251 368113 362877 358700 354987 350794 345561 339598 333903 329342 325910 322911
53199C22911l151l348l400l534l892m321m557m319l434k235j559j905k639k624
$$ 322911 319760 316412 313012 309478 305586 301265 296708 292389 288955 286720 285161 283256 280617 277993
53185B77993j633o45o46j511k227k008j004j03k5o42j223j363j288j199q84k84
$$ 277993 276360 275715 275069 273558 271331 269323 268319 268216 268191 267549 266326 264963 263675 262476 261592 261308
53169B61308J01k7p6N74J465J623R76K64k22p71j167o42Q02K058K291J754R53
$$ 261308 261409 261382 261306 261880 263345 264968 265944 266208 265986 265215 264048 263406 264208 266266 268557 270311 271264
53152B71264l6r73j172n08J16j9m41m25j72k28l68rO30Q27N08L05N21Q07Q37N68
$$ 271264 271228 270255 269083 268575 268691 268672 268231 267806 267634 267406 267038 267029 267659 268486 268994 269299 269820 270627 271464 272032
53132B72032rp67j149p15P0K27m31j031p66J73R07P60k21j314j653j080l67k73
$$ 272032 272023 271256 270107 269392 269462 269689 269258 268227 267461 267634 268541 269301 269080 267766 266113 265033 264666 264393
53114B64393n79m92J84Q26Q63L43m13j124j564j684j798k171k473k173j416q84
$$ 264393 263814 263322 263506 264332 265195 265538 265125 264001 262437 260753 258955 256784 254311 252138 250722 249838
53098B49838q33q91r05j194j762j984j499p67l87l79m58n52o14m33q0l0l81m68
$$ 249838 249005 248114 247209 246015 244253 242269 240770 240003 239616 239237 238779 238227 237613 237180 237100 237070 236689 236221
53080B36221K29J195J513J010J88n83j128j022k1J169J410M83p43j508j835j874
$$ 236221 236450 237645 239158 240168 240356 239773 238645 237623 237602 238771 240181 240664 239921 238413 236578 234704
53064B34704j469p32k94m97q13o17o8J91q1n98r55p99Q7J364K108J736Q25L92
$$ 234704 233235 232503 232209 231712 230899 230282 230214 230405 230324 229726 228771 227972 228059 229423 231531 233267 234092 234484
53046B34484N86O57J95l35l97j45k5j31k37k89m74r30j524j887j697j015l23m2
$$ 234484 235070 235727 235922 235587 235190 235045 235020 234889 234652 234363 233889 232959 231435 229548 227851 226836 226513 226471
53028B26471j00k19l76o30o47k8Q94J218N99l02p14n11N9Q06J397J337N87k75
$$ 226471 226371 226152 225776 225146 224499 224471 225365 226583 227182 226880 226166 225655 225714 226520 227917 229254 229841 229566
53010B29566q54j375j872j711o23N09P72O04R52J521J133k93j409j356p71m95
$$ 229566 228712 227337 225465 223754 223131 223640 224412 225016 225968 227489 228622 228329 226920 225564 224793 224298
52994B24298l78m1J92p8m42k81K24M31K26J1n8j61l23l52j61K98J112K015K202
$$ 224298 223920 223879 224071 223993 223551 223270 223494 223925 224151 224162 224104 223943 223620 223268 223107 223405 224517 226532 228734
52975B28734J186l20j064o73J11N17M56K26J10M23J266K109K154J397P88J014
$$ 228734 229920 229600 228536 227863 227974 228491 228947 229173 229283 229706 230972 233081 235235 236632 237420 238434
52959B38434J639J833J517J215J081P11p5q87j319j427j416j280j039j005j394
$$ 238434 240073 241906 243423 244638 245719 246430 246355 245468 244149 242722 241306 240026 238987 237982 236588
52944B36588j853j841j382j030j031j054q90q35j054j115o78k00k27l89K5N90
$$ 236588 234735 232894 231512 230482 229451 228397 227507 226672 225618 224503 223825 223625 223398 223009 223034 223624
52928B23624Q5j496k454j604m7L32n72j209p93k52n08j016p10L65J198J215Q15
$$ 223624 223709 222213 219759 218155 218108 218440 217868 216659 215866 215614 215106 214090 213380 213745 214943 216158 216973
52911B16973O01O85Q71J005R77O43J3o40r93r35n55k5M26N43K49k11n15n86n34
$$ 216973 217574 218259 219130 220135 221112 221755 221768 221128 220135 219200 218645 218620 219046 219589 219838 219627 219112 218526 217992
52892B17992l53N4N72Q81R08R19J055J053P32L99L41J47p62k017k414j404J08
$$ 217992 217639 217693 218265 219146 220054 220973 222028 223081 223813 224212 224553 224700 223938 221921 219507 218103 218211
52875B18211P74K68o22j007n68M66J512J887J363N47L57J020J835J976J392P72
$$ 218211 218985 219253 218631 217624 217056 217522 219034 220921 222284 222831 223188 224208 226043 228019 229411 230183
52859B30183P36J228J675J674J393J233J285J271R69M15k44q89j286j200p22l19
$$ 230183 230919 232147 233822 235496 236889 238122 239407 240678 241647 242062 241818 240929 239643 238443 237721 237402
52843B37402l70q49j534k273k903l211l179k999k734k180j266l00L69O62O01J86
$$ 237402 237032 236183 234649 232376 229473 226262 223083 220084 217350 215170 213904 213604 213973 214635 215236 215422
52827B15422k59r5Q55J835K012J504J041Q04L25n15j118j020n36k19o6K92Q71
$$ 215422 215163 215068 215923 217758 219770 221274 222315 223119 223444 222929 221811 220791 220255 220036 219970 220262 221133
52810B21133J242J170J032J392K305L200L526L350L097K799K018N85r90k094k711
$$ 221133 222375 223545 224577 225969 228274 231474 235000 238350 241447 244246 246264 246849 245859 243765 241054
52795B41054l148l384l180k688k404k549k854l029k994k661j907r54l56l99p44
$$ 241054 237906 234522 231342 228654 226250 223701 220847 217818 214824 212163 210256 209302 208946 208547 207803
52780B07803q06l29M81J168J324R79O54P75R71M53q00j720j418l65K04j15n27
$$ 207803 206997 206668 207149 208317 209641 210620 211274 212049 213020 213473 212673 210953 209535 209170 209374 209259 208732
52763B08732k20N92J085Q57K15l67o75o21r2Q17J648J909J577J066O73K65l31
$$ 208732 208512 209104 210189 211046 211261 210894 210219 209598 209506 210323 211971 213880 215457 216523 217196 217461 217130
52746B17130q54p92k1R46J447J347J042Q72O91J96m45n96N7J006J468J306J010
$$ 217130 216276 215484 215463 216409 217856 219203 220245 221117 221808 222004 221559 220963 221020 222026 223494 224800 225810
52729B25810R09Q41O70O03P71Q56N49N2k33l39o27j171j698k064k404k682k557
$$ 225810 226719 227560 228230 228833 229604 230460 231009 231061 230828 230489 229862 228691 226993 224929 222525 219843 217286
52712B17286j859r92n20n11n27k42J60L14K04J76M40Q05R73Q57N13j8o01r63j012
$$ 217286 215427 214435 213915 213404 212877 212635 212795 213109 213313 213489 213929 214734 215707 216564 217077 217059 216458 215495 214483
52693B14483r76r43n80K81J056J059N30K88M82N64N34J093K247K769J769j0j178
$$ 214483 213507 212564 211984 212265 213321 214380 214910 215198 215680 216244 216778 217871 220118 222887 224656 224646 223468
52676B23468j328r65m69L8K89K27L45R14J337J134J007J731K478J712k96j441
$$ 223468 222140 221175 220706 220744 221033 221260 221605 222519 223856 224990 225997 227728 230206 231918 231622 230181
52660B30181n98R54J510J086P48Q14Q17O65P64J157J404J262R54P33O34N89M83
$$ 230181 229583 230537 232047 233133 233881 234695 235512 236177 236941 238098 239502 240764 241718 242451 243085 243674 244157
52643B44157R1p31j852k979l802l995l354k191j298j158j416j312n29O37J690
$$ 244157 244248 243517 241665 238686 234884 230889 227535 225344 224046 222888 221472 220160 219631 220268 221958
52628B21958K299K433K420K703L295L647L263K311J351O01j70j085j803j893j369
$$ 221958 224257 226690 229110 231813 235108 238755 242018 244329 245680 246281 246111 245026 243223 241330 239961
52613B39961q26r14j679k375k104p79O51J162P13J55J06K63J1n61p59l59rk46
$$ 239961 239135 238221 236542 234167 232063 231284 231935 233097 233810 233965 234071 234334 234345 233784 233025 232666 232657 232411
52595B32411n59q1J052J801J642J135Q36N40J2k50K37J005J245J032J064J446
$$ 232411 231852 231771 232823 234624 236266 237401 238237 238777 238789 238539 238776 239781 241026 242058 243122 244568
52579B44568J493P80k97j052j090m29M52Q06L26m21p17o00n42o39p36j008j550
$$ 244568 246061 246841 246544 245492 244402 243973 244425 245231 245557 245136 244419 243819 243277 242638 241902 240894 239344
52562B39344j776j143k52j04n58o68l71l85n17K75J746K102O67q49q09L7J17l04
$$ 239344 237568 236425 236173 236069 235511 234843 234472 234087 233570 233845 235591 237693 238360 237511 236702 236739 236856 236552
52544B36552K22J716K524J615k95j935k626k172p56P41J206M69m77o38L4R05J446
$$ 236552 236774 238490 241014 242629 242334 240399 237773 235601 234845 235586 236792 237261 236784 236146 236180 237085 238531
52527B38531J526J329J020M73n08j539j692o22P44J197O55O2J11O87J378J885
$$ 238531 240057 241386 242406 242879 242371 240832 239140 238518 239262 240459 241114 241176 241287 241974 243352 245237
52511B45237J993J730J544J818K291K391K038J631J346J026O79N23M43j3r61j899
$$ 245237 247230 248960 250504 252322 254613 257004 259042 260673 262019 263045 263724 264247 264690 264677 263716 261817
52495B61817k241j874j158n93n53r81j397j368r27l45K53Q22J119R09L27k23m31
$$ 261817 259576 257702 256544 255951 255398 254417 253020 251652 250725 250380 250633 251455 252574 253483 253810 253587 253156
52478B53156j58N86J442J791J385P19M00M68O10P11Q00Q03P77J042J642K084K053
$$ 253156 252998 253584 255026 256817 258202 258921 259321 259789 260399 261110 261910 262713 263490 264532 266174 268258 270311
52461B70311J955K196K370J905J047M33L3n66j210j429j482k051k967l316k833
$$ 270311 272266 274462 276832 278737 279784 280217 280250 279684 278474 277045 275563 273512 270545 267229 264396
52446B64396k218j922j648j249j119j305j196n12J08L8n20j011j201j010l63M18
$$ 264396 262178 260256 258608 257359 256240 254935 253739 253227 253335 253373 252853 251842 250641 249631 249268 249686
52430B49686O59K04l08m25l85m02j46N17J027R94Q91J216J586J477J262J626K337
$$ 249686 250345 250549 250241 249816 249431 249029 248883 249400 250427 251421 252312 253528 255114 256591 257853 259479 261816
52413B61816K551K130J775J857K016J975K021K456L154L938M879O007P043P613
$$ 261816 264367 266497 268272 270129 272145 274120 276141 278597 281751 285689 290568 296575 303618 311231
52399C11231P479O452M473J890o57k761m416n625o158n926n256m552l814k863
$$ 311231 318710 325162 329635 331525 330868 328107 323691 318066 311908 305982 300726 296174 292360 289497
52385B89497j863j314j413j668j419n49M29J007J123R93P77N87N95Q65J176J282
$$ 289497 287634 286320 284907 283239 281820 281271 281700 282707 283830 284823 285600 286187 286782 287647 288823 290105
52369B90105J332J720K473L059K957K227J402Q89N93J12p61j715k181j923j253
$$ 290105 291437 293157 295630 298689 301646 303873 305275 306164 306757 306869 306108 304393 302212 300289 299036
52354B99036n88l1M41O11K63l71p59o75l41j1K84N71Q90J343J905K233K077J822
$$ 299036 298448 298417 298858 299469 299732 299361 298602 297927 297586 297575 297859 298430 299320 300663 302568 304801 306878 308700
52336C08700K149L057L781L826L573L607L900M062M053M246M911N968P135Q096
$$ 308700 310849 313906 317687 321513 325086 328693 332593 336655 340708 344954 349865 355833 362968 371064
52322C71064Q658Q895R066R253R246Q884Q310P823P593P566P439O788N535M363
$$ 371064 379722 388617 397683 406936 416182 425066 433376 441199 448792 456358 463797 470585 476120 480483
52308D80483M231N284O565P046O630N987N697N829O086O090N728N344N342N512
$$ 480483 484714 489998 496563 503609 510239 516226 521923 527752 533838 539928 545656 551000 556342 561854
52294E61854N118L920K647K101K114J847Q60m84j533j818j201l7Q26O60l78j360
$$ 561854 566972 570892 573539 575640 577754 579601 580461 579977 578444 576626 575425 575388 576214 576874 576496 575136
52278E75136j500q73k29k50r07j428r91L93J863K669K951L339M012M593M770M632
$$ 575136 573636 572763 572534 572284 571377 569949 568958 569351 571214 573883 576834 580173 584185 588778 593548 598180
52262E98180M431M399M819N859P126P797P429O443N628N348N475N905O669P521
$$ 598180 602611 607010 611829 617688 624814 632611 640040 646483 652111 657459 662934 668839 675508 683029
52248F83029P819P188O071N280N005M605L502J939O20j21m92p30q03o41l50j61
$$ 683029 690848 698036 704107 709387 714392 718997 722499 724438 725058 724937 724445 723715 722912 722271 721921 721760
52232G21760k84p24j119r53k31L25J25m51o08l29l51q81j170o39K34O26M96M81
$$ 721760 721476 720752 719633 718680 718449 718774 718899 718448 717840 717511 717160 716279 715109 714470 714704 715330 715826 716307
52214G16307R99J886K767L319L349K982K699K875L374L786L991M226M660N080
$$ 716307 717306 719192 721959 725278 728627 731609 734308 737183 740557 744343 748334 752560 757220 762300
52200G62300N032M193K770J490J051J425J981K235K227K168K111K145K417K829
$$ 762300 767332 771525 774295 775785 776836 778261 780242 782477 784704 786872 788983 791128 793545 796374
52186G96374K986K732K310J896J392Q75O79O90J24j516l667n343o191o384o015
$$ 796374 799360 802092 804402 806298 807690 808565 809244 809934 810058 808542 804875 799532 793341 786957 780942
52171G80942n191m419m108l934l375k675k505k746k476j318M3R47J616K512L385
$$ 780942 775751 771332 767224 763290 759915 757240 754735 751989 749513 748195 748238 749185 750801 753313 756698
52156G56698L619L166K598K275J972J343M36m35j108j592j798j529q85l05L9O56
$$ 756698 760317 763483 766081 768356 770328 771671 772107 771672 770564 768972 767174 765645 764760 764455 764494 765150
52140G65150K009L491L802K518O81n15j009j359j571j205l67K28K27R7N56J947
$$ 765150 767159 770650 774452 776970 777651 777136 776127 774768 773197 771992 771625 771853 772080 772177 772733 774680
52124G74680M178O758Q983J0480J1609J2944J4413J5382J5529J5113J4439J3567
$$ 774680 778858 785616 794599 805079 816688 829632 844045 859427 874956 890069 904508 918075
52112I18075J2628J1822J1039R938Q605P551O864N910M218K278J084J089J949
$$ 918075 930703 942525 953564 963502 972107 979658 986522 992432 996650 998928 1000012 1001101 1003050
52099A003050K997L779M215M552N055N700O251O663P045P150O307M194J420j034
$$ 1003050 1006047 1009826 1014041 1018593 1023648 1029348 1035599 1042262 1049307 1056457 1062764 1066958 1068378 1067344
52085A067344k838m470o324q098r135r177q560p687o507m743k567q04k33p61j531
$$ 1067344 1064506 1060036 1053712 1045614 1036479 1027302 1018742 1011055 1004548 999805 997238 996434 996201 995440 993909
52070I93909j754j289m25N35J405K008K222K137K084K382K966L304K878J864J092
$$ 993909 992155 990866 990441 990976 992381 994389 996611 998748 1000832 1003214 1006180 1009484 1012362 1014226 1015318
52055A015318J175J826K226J897R94q7j057j734k108k375k675k768k391j862j985
$$ 1015318 1016493 1018319 1020545 1022442 1023436 1023349 1022292 1020558 1018450 1016075 1013400 1010632 1008241 1006379 1004394
$$ [...]
##END NTUPLES=NMR SPECTRUM
##END=
