
##TITLE=AC1291_CRIAH12101_6528502_UZRDczU5y3
##JCAMPDX= 6.0         $$ Bruker NMR JCAMP-DX V2.0
##DATA TYPE= NMR SPECTRUM
##DATA CLASS= NTUPLES
##ORIGIN= BRUKER
##OWNER= Administrator
$$ 1.72 TOPSPIN		Version 2.1
$$ 2012-07-15 14:13:11.093 -0500  Administrator@TOPSPIN
$$ Compression mode = diff/dup
##.OBSERVE FREQUENCY= 400.02188249412
##.OBSERVE NUCLEUS= ^1H
##.ACQUISITION MODE= SIMULTANEOUS (DQD)
##.ACQUISITION SCHEME= undefined
##.AVERAGES= 8
##.DIGITISER RES= 22
##SPECTROMETER/DATA SYSTEM= spect
##.PULSE SEQUENCE= zg30
##.SOLVENT NAME= COFFEE_meoh
##.SHIFT REFERENCE= INTERNAL, COFFEE_meoh, 1, 14.98509
##AUDIT TRAIL= $$ (NUMBER, WHEN, WHO, WHERE, PROCESS, VERSION, WHAT)
$$ ##TITLE= Audit trail, TOPSPIN		Version 2.1
$$ ##JCAMPDX= 5.01
$$ ##ORIGIN= Bruker BioSpin GmbH
$$ ##OWNER= Administrator
$$ $$ C:\Bruker\TOPSPIN/data/COFFEE/nmr/AC1291_CRIAH12101_6528502_UZRDczU5y3/10/pdata/1/auditp.txt
$$ ##AUDIT TRAIL=  $$ (NUMBER, WHEN, WHO, WHERE, PROCESS, VERSION, WHAT)
(   1,<2012-07-15 14:13:03.906 -0500>,<Administrator>,<TOPSPIN>,<go>,<TOPSPIN 2.1>,
      <created by zg
	started at 2012-07-15 14:11:57.359 -0500,
	POWCHK enabled, PULCHK disabled,
       configuration hash MD5:
       6B 1B 68 BB D9 2E 58 E2 7F 35 AD 54 07 DF 0E 41
       data hash MD5: 64K
       3F 3E 75 35 05 EC 8B CC 31 D2 4B E3 E9 1B 81 C4>)
(   2,<2012-07-15 14:13:06.843 -0500>,<Administrator>,<TOPSPIN>,<proc1d>,<TOPSPIN 2.1>,
      <Start of raw data processing
       efp LB = 0 FT_mod = 6 PKNL = 1 PHC0 = 0 PHC1 = 0 SI = 32K 
       data hash MD5: 32K
       79 C0 1B 1A 13 96 9E 5D 07 2C 0C 1D B6 29 89 83>)
(   3,<2012-07-15 14:13:07.156 -0500>,<Administrator>,<TOPSPIN>,<proc1d>,<TOPSPIN 2.1>,
      <pk PHC0 = 176.2262 PHC1 = 0 
       data hash MD5: 32K
       0B 76 A8 77 44 68 32 E2 C3 C6 32 DD 6D CA DD 17>)
(   4,<2012-07-15 14:13:07.296 -0500>,<Administrator>,<TOPSPIN>,<proc1d>,<TOPSPIN 2.1>,
      <abs ABSG = 1 
       data hash MD5: 32K
       7B FD A1 BB 30 5D 88 FF 1B 11 B6 62 E9 50 28 BA>)
(   5,<2012-07-15 14:13:07.437 -0500>,<Administrator>,<TOPSPIN>,<proc1d>,<TOPSPIN 2.1>,
      <abs ABSG = 2 
       data hash MD5: 32K
       CB 1C 54 8D 64 D9 C2 D8 FC 69 2A BC 24 D5 BC D2>)
(   6,<2012-07-15 14:13:07.468 -0500>,<Administrator>,<TOPSPIN>,<proc1d>,<TOPSPIN 2.1>,
      <abs ABSG = 3 
       data hash MD5: 32K
       58 22 1D EB E8 0B A4 FD 00 32 79 E5 A5 F8 73 C9>)
(   7,<2012-07-15 14:13:07.500 -0500>,<Administrator>,<TOPSPIN>,<proc1d>,<TOPSPIN 2.1>,
      <abs ABSG = 4 
       data hash MD5: 32K
       B8 F7 E7 D7 0A 1A 58 12 9E 78 4C D5 01 41 A7 37>)
(   8,<2012-07-15 14:13:07.531 -0500>,<Administrator>,<TOPSPIN>,<proc1d>,<TOPSPIN 2.1>,
      <abs ABSG = 5 
       data hash MD5: 32K
       3F 58 27 4F F3 62 DD 2B 8C 0F 66 65 1B 53 20 B0>)
$$ ##END=
$$ 
$$ $$ hash MD5
$$ $$ 1D AF 48 1C 48 69 78 1A 8C 5C C5 80 76 5C C4 5F
##$RELAX= 
##$RELAX= 
##$RELAX= 
##$RELAX= 
##$RELAX= 
##$RELAX= 
##$RELAX= 
$$ Bruker specific parameters
$$ --------------------------
$$ [...]
150 150 150 150 150 150 150 150
##$TP07= 0
##$TPNAME0= <>
##$TPNAME1= <>
##$TPNAME2= <>
##$TPNAME3= <>
##$TPNAME4= <>
##$TPNAME5= <>
##$TPNAME6= <>
##$TPNAME7= <>
##$TPOAL= (0..7)
0.5 0.5 0.5 0.5 0.5 0.5 0.5 0.5
##$TPOFFS= (0..7)
0 0 0 0 0 0 0 0
##$TUNHIN= 0
##$TUNHOUT= 0
##$TUNXOUT= 0
##$USERA1= <user>
##$USERA2= <user>
##$USERA3= <user>
##$USERA4= <user>
##$USERA5= <user>
##$V9= 5
##$VALIST= <valist>
##$VCLIST= <CCCCCCCCCCCCCCC>
##$VD= 0
##$VDLIST= <DDDDDDDDDDDDDDD>
##$VPLIST= <PPPPPPPPPPPPPPP>
##$VTLIST= <TTTTTTTTTTTTTTT>
##$WBST= 2048
##$WBSW= 25
##$XGAIN= (0..3)
0 0 0 0
##$XL= 0
##$YL= 0
##$YMAX_a= 505210
##$YMIN_a= -645321
##$ZGOPTNS= <>
##$ZL1= 120
##$ZL2= 120
##$ZL3= 120
##$ZL4= 120
##$ABSF1= 14.98509
##$ABSF2= -5.573092
##$ABSG= 5
##$ABSL= 3
##$ALPHA= 0
##$AQORDER= 0
##$ASSFAC= 0
##$ASSFACI= 0
##$ASSFACX= 0
##$ASSWID= 0
##$AUNMP= <proc_prof1d_extract_pilot.lims>
##$AXLEFT= 0
##$AXNAME= <>
##$AXNUC= <1H>
##$AXRIGHT= 0
##$AXTYPE= 0
##$AXUNIT= <>
##$AZFE= 0.1
##$AZFW= 0.1
##$BCFW= 0
##$BC_mod= 0
##$BYTORDP= 0
##$COROFFS= 0
##$CY= 15
##$DATMOD= 1
##$DC= 0
##$DFILT= <>
##$DTYPP= 0
##$F1P= 0
##$F2P= 0
##$FCOR= 0.5
##$FTSIZE= 32768
##$FT_mod= 6
##$GAMMA= 0
##$GB= 0
##$INTBC= 1
##$INTSCL= 1
##$ISEN= 128
##$LB= 0
##$LEV0= 0
##$LPBIN= 0
##$MAXI= 10000
##$MC2= 0
##$MEAN= 0
##$ME_mod= 0
##$MI= 0
##$NCOEF= 0
##$NC_proc= -8
##$NLEV= 6
##$NOISF1= 0
##$NOISF2= 0
##$NSP= 0
##$NTH_PI= 0
##$NZP= 0
##$OFFSET= 14.98509
##$PC= 1
##$PHC0= 176.2262
##$PHC1= 0
##$PH_mod= 1
##$PKNL= yes
##$PPARMOD= 0
##$PPDIAG= 0
##$PPIPTYP= 0
##$PPMPNUM= 2147483647
##$PPRESOL= 1
##$PSCAL= 4
##$PSIGN= 0
##$PYNMP= <proc.py>
##$REVERSE= no
##$SF= 400.02
##$SI= 32768
##$SIGF1= 0
##$SIGF2= 0
##$SINO= 400
##$SIOLD= 32768
##$SPECTYP= <>
##$SREGLST= <1H.CDCl3>
##$SSB= 0
##$STSI= 32768
##$STSR= 0
##$SW_p= 8223.68421052631
##$SYMM= 0
##$S_DEV= 0
##$TDeff= 65536
##$TDoff= 0
##$TI= <>
##$TILT= no
##$TM1= 0
##$TM2= 0
##$TOPLEV= 0
##$USERP1= <user>
##$USERP2= <user>
##$USERP3= <user>
##$USERP4= <user>
##$USERP5= <user>
##$WDW= 1
##$XDIM= 32768
##$YMAX_p= 472621485
##$YMIN_p= -812824
##$CURPLOT= <Network HP LaserJet P1505>
##$CURPRIN= <$Network HP LaserJet P1505>
##$DFORMAT= <normdp>
##$LAYOUT= <+/1D_H.xwp>
##$LFORMAT= <normlp>
##$PFORMAT= <normpl>
##$SURQMSG= 1
$$ End of Bruker specific parameters
$$ ---------------------------------
##NTUPLES= NMR SPECTRUM
##VAR_NAME=  FREQUENCY,     SPECTRUM/REAL,   SPECTRUM/IMAG
##SYMBOL=    X,             R,               I
##VAR_TYPE=  INDEPENDENT,   DEPENDENT,       DEPENDENT
##VAR_FORM=  AFFN,          ASDF,            ASDF
##VAR_DIM=   32768,         32768,           32768
##UNITS=     HZ,            ARBITRARY UNITS, ARBITRARY UNITS
##FACTOR=    0.250966925370066, 1,           1
##FIRST=     8223.43324360094, -153891,      -4754
##LAST=      0,             178455,          -113052
##MIN=       0,             -812824,         0
##MAX=       8223.43324360094, 472621485,    0
$$ Real data points
##PAGE= N=1
##DATA TABLE= (X++(R..R)), XYDATA
$$ [...]
19558a78853J5524r1933F7741c90895A05634J5576b65211A01785k0524c2605A917
$$ -178853 -163329 -255262 67741 -390895 105634 121210 -265211 101785 81261 -32605 1917
19546A62910b52297j39833f4319a5997j01323A03389d0997A5012N7090a44048
$$ 162910 -252297 -392130 -64319 -15997 -117320 103389 -40997 15012 72102 -144048
19535d0422l02618A62623h1293A13936a24911L7692l9426A51957d9600D9840N0707
$$ -40422 -343040 162623 -81293 113936 -124911 -87219 -126645 151957 -49600 49840 100547
19524A00547J01100a01802j5308M6012B50522b77488B30384c0450j23451E1327
$$ 100547 201647 -101802 -117110 -71098 250522 -277488 230384 -30450 -153901 51327
19513a68780I3745C6241b09691a2341j60163f9775k18364A84582b63167G4199
$$ -168780 93745 36241 -209691 -12341 -172504 -69775 -288139 184582 -263167 74199
19502f9875j33901R2083q6390A05074c26183h473D2222e2099C04482a09094l04964
$$ -69875 -203776 -111693 -198083 105074 -326183 -8473 42222 -52099 304482 -109094 -414058
19491d14058E5789h8743D1281a87324I4052K14119c79055A28821b84243C1482
$$ -414058 55789 -88743 41281 -187324 94052 308171 -379055 128821 -284243 31482
19480a76640O6310D8696e510j53563j42077J05444F675a42523I9745c597I2135
$$ -176640 -110330 48696 -5510 -159073 -301150 -195706 6675 -142523 99745 -3597 92135
19468D26941E9094h4136J116L076A01739b98264P0775e261k40142A53617A1429
$$ 426941 59094 -84136 -83020 -79944 101739 -298264 -227489 -5261 -245403 153617 11429
19456b18382H5876J07905a73956L7237D5918r046J64759b3665o2912l0954q8625
$$ -218382 85876 193781 -173956 -136719 45918 36872 201631 -23665 -86577 -117531 -206156
19445b06156A01015a21850A65765b00536j58794a01870E767J40107a39176A20724
$$ -206156 101015 -121850 165765 -200536 -359330 -101870 5767 145874 -139176 120724
19434d19794C03277E4736b27018J02081p8181N0786a6025l34997A44920b83871
$$ -419794 303277 54736 -227018 -124937 -203118 -152332 -16025 -351022 144920 -283871
19423A74342c57338C784J42131a93452A86536A0031a5499A05055b04070K2268
$$ 174342 -357338 3784 145915 -193452 186536 10031 -15499 105055 -204070 -181802
19413a81802E2072a399j98514A11105a4958l4237q409J9821k48073a06022J4662
$$ -181802 52072 -1399 -199913 111105 -14958 -49195 -57604 -37783 -285856 -106022 -91360
19402i1360b9151m5558j57956H0741c31134e4173a391l41709A76370b26604P2106
$$ -91360 -29151 -74709 -232665 80741 -331134 -54173 -1391 -343100 176370 -226604 -154498
19391a54498j93238A5920c0261l1694K6080F0507j7075c75581B12965f0754A6644
$$ -154498 -347736 15920 -30261 -61955 -35875 60507 43432 -375581 212965 -60754 16644
19379d8205I0855a2714B36743a91317A26691B0760J38121a88297m54728a00750
$$ -48205 90855 -12714 236743 -191317 126691 20760 158881 -188297 -643025 -100750
19368A4425J81304a55045E0426b23982C89252j45514e1267D9958K4577A0603Q2612
$$ 14425 195729 -155045 50426 -223982 389252 243738 -51267 49958 74535 10603 93215
19357I3215b23923p0977m9621i7461j11850h1265n6876B4746b27365J07941k32830
$$ 93215 -223923 -294900 -344521 -97461 -209311 -81265 -138141 24746 -227365 -119424 -352254
19346c52254J22966C0593c3219D1755d66282a66759A70321q1172g8230j74782
$$ -352254 -229288 30593 -33219 41755 -466282 -166759 170321 89149 -78230 -253012
19336b53012B40218J64923n3931D3337a87128L8021B20210A02837b79989k776
$$ -253012 240218 405141 351210 43337 -187128 -149107 220210 102837 -279989 -282765
19326b82765B2176c40625f1980k35373e3909A95014c2886C43674a47003r436f4038
$$ -282765 22176 -340625 -61980 -297353 -53909 195014 -32886 343674 -147003 -156439 -64038
19314c73079I3954m6711i1642R888L1256o6470B4308a55588g1280B7354K05289
$$ -373079 93954 47243 -91642 -81754 -50498 -116968 24308 -155588 -71280 27354 232643
19303B32643c9749a6443n5773Q022J7095A52584c482j15493k58025J64801K4826
$$ 232643 -39749 -16443 -72216 -64194 -47099 152584 -3482 -118975 -377000 -212199 -187373
19292a87373B42967g3358A01268J1513C1667O0110b19044M8310g0164j40800A12949
$$ -187373 242967 -73358 101268 112781 31667 91777 -219044 -170734 -70164 -210964 112949
19280e7266C0913a71181F680d17525J48241c0711A34205a65979e0290q243j32591
$$ -57266 30913 -171181 6680 -417525 -269284 -30711 134205 -165979 -50290 -58533 -191124
19269a91124A42680b965j54953H6465a90986R0282k12668J50294A3252h7551A01778
$$ -191124 142680 -2965 -157918 86465 -190986 -100704 -313372 -163078 13252 -87551 101778
19257A66524a88503i3527l02737B65626F2497a05310l18607A3933b83712K8585
$$ 166524 -188503 -93527 -396264 265626 62497 -105310 -423917 13933 -283712 -255127
19247b55127j6749d7508C17743c9274m4836r913d0417A224b05650k13894a34119
$$ -255127 -271876 -47508 317743 -39274 -84110 -94023 -40417 1224 -205650 -419544 -134119
19235A03427J2357a77950c6235A09552b1770E003d97791f0605A47677K24848a39186
$$ 103427 115784 -177950 -36235 109552 -21770 5003 -497791 -60605 147677 372525 -139186
19223b24340O8663c514E2437Q4111C3088a94522j84420i7808r0138n7560A32666
$$ -224340 -155677 -3514 52437 136548 33088 -194522 -378942 -97808 -187946 -245506 132666
19211a63023A46972f7699j3642k76200f6840k87250e3108j82359O515M5045j02041
$$ -163023 146972 -67699 -81341 -357541 -66840 -354090 -53108 -235467 -228952 -183907 -285948
19200b85948K9267f6132j31542F3226O5540c48375A26438b6445A37477b02303
$$ -285948 -256681 -66132 -197674 63226 128766 -348375 126438 -26445 137477 -202303
19189a51229M0494c45E7691a3927j9897C4412a87762i0855J4184B13378a68081
$$ -151229 -110735 -345 57691 -13927 -33824 34412 -187762 -90855 -76671 213378 -168081
19177H7359i4398b1431j69532A20199a94852d2780D6499J8918M9805g6158k70852
$$ 87359 -94398 -21431 -190963 120199 -194852 -42780 46499 65417 115222 -76158 -347010
19166c47010a24869j38000J06377R524D4530g0847c768l3128E7872K2121e0875
$$ -347010 -124869 -262869 -156492 -146968 44530 -70847 -3768 -36896 57872 79993 -50875
19154a80278A20009i8196D0697b29964B06751J19134g7779A0003a7610k12420
$$ -180278 120009 -98196 40697 -229964 206751 325885 -77779 10003 -17610 -230030
19144b30030B99293a45073F4933e3365k15062A25437k6879d54712g8906B66357
$$ -230030 299293 -145073 64933 -53365 -268427 125437 98558 -454712 -78906 266357
19133b407A6525h4218C5692a99601A90629a49935n4377E4969K6018B5055a81327
$$ -2407 16525 -84218 35692 -199601 190629 -149935 -204312 54969 80987 25055 -181327
19121a84132h4225j10055Q2837D7737c0822q3080d9517B02289c99322h4306a4986
$$ -184132 -84225 -194280 -111443 47737 -30822 -113902 -49517 202289 -399322 -84306 -14986
19109b19122J05897A14829a84692Q0684b9791k77076a49196A6431a44419o1507
$$ -219122 -113225 114829 -184692 -104008 -29791 -306867 -149196 16431 -144419 -205926
19099b05926B84627f5617j31538R2804k12412P2852D62138f6886a0539k5233l71668
$$ -205926 284627 -65617 -197155 -104351 -316763 -243911 462138 -66886 -10539 -35772 -407440
19088d07440A82972E3282L241a96553h9714l21257E4687a1478j46665K0690j62455
$$ -407440 182972 53282 56523 -196553 -89714 -410971 54687 -11478 -158143 -137453 -299908
19077b99908P7420d2431j10451m4790h0378R691B55631b05272e2930J813k63984
$$ -299908 -222488 -42431 -152882 -197672 -80378 -70687 255631 -205272 -52930 -51117 -315101
19066c15101A11608C2709i7231p2752O1442B50516a20958l28206B58758d15490
$$ -315101 111608 32709 -97231 -169983 -108541 250516 -120958 -449164 258758 -415490
19055i1872k67473J53181A28929a96390k09013a73741g532j83012A9440J21283
$$ -91872 -359345 -206164 128929 -196390 -405403 -173741 -7532 -190544 19440 140723
19045A40723f1823A67261F3878R6113i2472A81614b06564H561J26084e6916A48640
$$ 140723 -61823 167261 63878 159991 -92472 181614 -206564 8561 134645 -56916 148640
19033b55591l4046I5056a00835C39262e6772a4892C07102A0702J97387h7293A13713
$$ -255591 -289637 95056 -100835 339262 -56772 -14892 307102 10702 208089 -87293 113713
19021A59983m3172J7524H542g3385k88664D7172c50962a26228A67354b34295O1632
$$ 159983 116811 134335 8542 -73385 -362049 47172 -350962 -126228 167354 -234295 -172663
19010a72663j12907C33c05882f1408C8225a07070B00533D0556n955b36599R887
$$ -172663 -285570 333 -305882 -61408 38225 -107070 200533 40556 34601 -236599 -226712
18999b26712J5575A16952K19967F1162a46141J0316k40472g2449B4454M809a35072
$$ -226712 -211137 116952 336919 61162 -146141 -135825 -376297 -72449 24454 29263 -135072
18987a57902e5373B48988C4772c50047A71827b15114A94185A2516b05542k1554
$$ -157902 -55373 248988 34772 -350047 171827 -215114 194185 12516 -205542 -227096
18977b27096A2725d1776l78387A26156f59804a02186j9253j48145a15557B11699
$$ -227096 12725 -41776 -420163 126156 -659804 -102186 -121439 -269584 -115557 211699
18966C3690J60875a51432m0497B21815j05134b12962F0690J1642b14869a6719
$$ 33690 194565 -151432 -191929 221815 116681 -212962 60690 72332 -214869 -16719
18955a8298j58769A96387M8265a93126f9449j78969b6815D3716b49561c6250j6152
$$ -18298 -177067 196387 244652 -193126 -69449 -248418 -26815 43716 -249561 -36250 -52402
18944e2402j0669K9249r1788n7185f6793K2370j51556I1038M414D0381a77045
$$ -52402 -63071 -33822 -125610 -182795 -66793 -44423 -195979 91038 95452 40381 -177045
18932d535B48899a37153n73D9529J4402J47102c3290j65633A28632J75087A38024
$$ -4535 248899 -137153 -137726 49529 63931 211033 -33290 -198923 128632 303719 138024
18920b81431P1331B67428h3275G912L7570a74319B2095k972b38745F6497d8493
$$ -281431 -210100 267428 -83275 7912 45482 -174319 22095 19123 -238745 66497 -48493
18908A63602M9753c6105A03845J30039O5430f29251b14599A67236a25702j05586
$$ 163602 213355 -36105 103845 233884 299314 -629251 -214599 167236 -125702 -231288
18898b31288A14860b69082R5645M2909A69964J6440r717a91700D1386a50036C4572
$$ -231288 114860 -269082 -173437 -130528 169964 186404 176687 -191700 41386 -150036 34572
18886b93509e6248j08982M9737j56805C0089J79150h3087B28152m1245a50028
$$ -293509 -56248 -165230 -115493 -272298 30089 209239 -83087 228152 186907 -150028
18875B28781a69078k23359A1769b86364j57766a77458B89b81088A04398L95a91447
$$ 228781 -169078 -392437 11769 -286364 -444130 -177458 289 -281088 104398 104793 -191447
18863C15700F4394K02071C4352f8478b6959j69224i2322l34275g9575A92692b86933
$$ 315700 64394 266465 34352 -68478 -26959 -196183 -92322 -426597 -79575 192692 -286933
18851a38086D06245D2530J14053a35218M6592A4462N711a52532K7167K9746j25351
$$ -138086 406245 42530 156583 -135218 -88626 14462 20173 -152532 -125365 -95619 -220970
18840b20970R8980M2616k85254R5696R7456r8693J0625A59234b47648E766b46471
$$ -220970 -121990 -79374 -364628 -268932 -171476 -270169 -259544 159234 -247648 5766 -246471
18828a3446M798A96017F5109a80031B6046J40125C0003J67798d5907D7567J39744
$$ -13446 -8648 196017 65109 -180031 26046 166171 30003 197801 -45907 47567 187311
18817A87311m0473B8707R981K0408J69373c9571i564E99946B40699j11745c26615
$$ 187311 146838 28707 38688 59096 228469 -39571 -9564 599946 240699 128954 -326615
18805d2516H0631J70986e694A85503d74941c113j49178A92120E147a32013n8748
$$ -42516 80631 251617 -5694 185503 -474941 -3113 -152291 192120 5147 -132013 -190761
18794a90761h5957H9992K7821c60083a54865C40184D5566f3031a1614r892j17807
$$ -190761 -85957 89992 117813 -360083 -154865 340184 45566 -63031 -11614 -21506 -139313
18783a39313C04858b1563A40384a06437A18747E8074D598a30732H6851K4890a35120
$$ -139313 304858 -21563 140384 -106437 118747 58074 4598 -130732 86851 111741 -135120
18771A02803b2913A87590h6581p2129K5355A45693c4425A6609a02424b1709A71000
$$ 102803 -22913 187590 -86581 -158710 -133355 145693 -34425 16609 -102424 -21709 171000
18759e9908C3239b49666a04009p0806F6007A3391K71355i7076A6862a92227h8868
$$ -59908 33239 -249666 -104009 -174815 66007 13391 284746 -97076 16862 -192227 -88868
18747f8676j9643C78861b14441Q0646L973D957g5331j44466J805n2943a1492j06693
$$ -68676 -88319 378861 -214441 -133795 -129822 4957 -75331 -219797 -217992 -270935 -11492 -118185
18735a18185B93749f3723j16143j45593j95114K53639D5899a18395F5979a37015
$$ -118185 293749 -63723 -179866 -325459 -520573 -266934 45899 -118395 65979 -137015
18724c62006e2728l7260G5541O9701G2036a08248A11323a77275b2451p6591k80224
$$ -362006 -52728 -89988 75541 145242 72036 -108248 111323 -177275 -22451 -99042 -379266
18713c79266J65854h5727A22439c87090A8198b5885l4841r1805P4718O37k03648
$$ -379266 -213412 -85727 122439 -387090 18198 -25885 -60726 -152531 -77813 -77176 -280824
18702b80824f6371B24958f9161D3885c55455a21416G0004K00326c59268f0928
$$ -280824 -66371 224958 -69161 43885 -355455 -121416 70004 270330 -359268 -60928
18691a04344D3876c38927Q4732c9799j67094B55081I3949c4928A17179b6609A94491
$$ -104344 43876 -338927 -254195 -39799 -206893 255081 93949 -34928 117179 -26609 194491
18679B36418b14129n1126h2108l90353bj73267J8415f1341I5695K9229C9070L1495
$$ 236418 -214129 -265255 -82108 -472461 -2 -173269 -154854 -61341 95695 124924 39070 70565
18667G0565h8309C7371a61080L2848k08177a09484j26642A02267a45432A82058
$$ 70565 -88309 37371 -161080 -128232 -336409 -109484 -236126 102267 -145432 182058
18656a40513J1598C16796a56943A9732N4197c41250I2643Q8583q636E8522e6430
$$ -140513 -128915 316796 -156943 19732 73929 -341250 92643 181226 172590 58522 -56430
18644h8891A87622g7577C940O1913p246a80634f0987C31272H8583a54906f7532
$$ -88891 187622 -77577 3940 65853 58607 -180634 -60987 331272 88583 -154906 -67532
18632a89842A57362B1639J99733e28168K28799A86132E1225b27348L7712m938
$$ -189842 157362 21639 221372 -528168 -299369 186132 51225 -227348 -189636 -194574
18622a94574A83736a3615e473k24672B72076A03558a29628B603N2442b09394c2277
$$ -194574 183736 -13615 -5473 -230145 272076 103558 -129628 2603 55045 -209394 -32277
18610g6852k09570G3549K4014C5121J23279j1125a1444j14623j67634A53674L4500
$$ -76852 -286422 73549 97563 35121 158400 147275 -11444 -126067 -293701 153674 188174
18599A88174D1397a45138j27459J00676O8412A55157i0663k38398Q1154A58406
$$ 188174 41397 -145138 -272597 -171921 -103509 155157 -90663 -329061 -247907 158406
18588a23382E4715a86179B59752H8632a79403M494A55975a28437j45451B07905
$$ -123382 54715 -186179 259752 88632 -179403 -174909 155975 -128437 -273888 207905
18577h8360C6389J37099b32148C869h9141L7459M469j87936M3105f5340k84881
$$ -88360 36389 173488 -232148 3869 -89141 -51682 -47213 -235149 -192044 -65340 -350221
18566c50221a03106H2007D0011K5145b64041i3821A17966b64023A50093d58804
$$ -350221 -103106 82007 40011 65156 -264041 -93821 117966 -264023 150093 -458804
18555b73863B5396b88717a0331j28076r0746J5312B3347J52089a96995j49551
$$ -273863 25396 -288717 -10331 -138407 -229153 -213841 23347 175436 -196995 -346546
18545c46546a41135b102G8001j0981P406b00975j08005G9900a42936E0569a04166
$$ -346546 -141135 -2102 78001 67020 74426 -200975 -308980 79900 -142936 50569 -104166
18533a29108J7800G5435c5516k87670E4760b87161H253J4044K3091K8807a67444
$$ -129108 -111308 75435 -35516 -323186 54760 -287161 8253 22297 45388 74195 -167444
18521E2235b44516A37012c70760J8893D161f9103C6422b09573A10711a97978B66104
$$ 52235 -244516 137012 -370760 -351867 4161 -69103 36422 -209573 110711 -197978 266104
18509a69306I9416c28714f9257p2218K0699C7367N6540c4516D7970a83470C0438
$$ -169306 99416 -328714 -69257 -141475 -120776 37367 93907 -34516 47970 -183470 30438
18497A95325b26244b6020o5117F1737a12809d2938A50199L9352a77619j30141
$$ 195325 -226244 -26020 -91137 61737 -112809 -42938 150199 189551 -177619 -307760
18487c07760e1696B8255L5769g6285A23248l4106b60352A34290a05602C6036b544
$$ -307760 -51696 28255 64024 -76285 123248 89142 -260352 134290 -105602 36036 -2544
18475e1118n3721B8395J13764F7084N4125a36818D8856M4250e2018j52566D9906
$$ -51118 -104839 28395 142159 67084 121209 -136818 48856 93106 -52018 -204584 49906
18463A75766b95771a40159L3582p7183i277B60461b83964A51421L1259h1117k7244
$$ 175766 -295771 -140159 -106577 -183760 -9277 260461 -283964 151421 182680 -81117 -108361
18452a08361m621j75060O9080I0701a70066M4571r1936f5844k09813A54965e0751
$$ -108361 -112982 -288042 -218962 90701 -170066 -125495 -217431 -65844 -275657 154965 -50751
18440A57532a10358k63744a0528k2049j93713K354l0593A70931c02453C8779a06630
$$ 157532 -110358 -374102 -10528 -32577 -226290 -223936 -254529 170931 -302453 38779 -106630
18428c5914j21990o2206A15631c45048i7637D51104G9285b95269J31991F8630
$$ -35914 -157904 -220110 115631 -345048 -97637 451104 79285 -295269 -163278 68630
18417A00010B9257a89196k0285b0870j42523k9569B03796G4528J20254a84919
$$ 100010 29257 -189196 -209481 -20870 -163393 -192962 203796 74528 194782 -184919
18406B765K71991p8594K1289r4826a363B34726G0675h0595E44452a61861l05799
$$ 2765 274756 196162 217451 122625 -1363 234726 70675 -80595 544452 -161861 -467660
18395d67660A24766a62339E7944d0516j15135m2381r798P8603j89007e5824D3033
$$ -467660 124766 -162339 57944 -40516 -155651 -198032 -207830 -129227 -318234 -55824 43033
18383c96024a10275m0638f6513o2209n8713B60201e2566a7775D6044b72037b8167
$$ -396024 -110275 -150913 -66513 -128722 -187435 260201 -52566 -17775 46044 -272037 -28167
18371A33994L7725a29797A13731A8668J30442c9056q55k4462k50887N3059O7063
$$ 133994 171719 -129797 113731 18668 149110 -39056 -39911 -64373 -315260 -262201 -195138
18360a95138H6670J39358d78869a99245o2398c6061A1967J02322a07059A41935
$$ -195138 86670 226028 -478869 -199245 -261643 -36061 11967 114289 -107059 141935
18349A86692D5688g9178H6006J14785J24712G5488b07115o6464H9047F468b00038
$$ 186692 45688 -79178 86006 200791 325503 75488 -207115 -273579 89047 6468 -200038
18337A04757b45891Q6558B69986a55284H5831J82043f2141G3106b00129O4893
$$ 104757 -245891 -159333 269986 -155284 85831 267874 -62141 73106 -200129 -135236
18327a35236C65890i7744I285J68363h4939I7725A0515L236e50647b43407A9367
$$ -135236 365890 -97744 9285 177648 -84939 97725 10515 13751 -550647 -243407 19367
18315i5377J6065L8623G8199B2829J8968a36892D04953A65980p289D4086O997
$$ -95377 -79312 -40689 78199 22829 41797 -136892 404953 165980 158691 44086 51083
18304E1083h0132m5085d0301j01874k5563P7131k57433a46272e6260r7980D4346
$$ 51083 -80132 -125217 -40301 -142175 -167738 -90607 -348040 -146272 -56260 -154240 44346
18292a40341d681A24256k2946d13396A38334i709k52537H4889a81520k392A22381
$$ -140341 -4681 124256 101310 -413396 138334 -9709 -262246 84889 -181520 -183912 122381
18280b1677j39804K3792k7058A41547F6924A3464h5108H1249j309J9865g0954
$$ -21677 -161481 -137689 -164747 141547 66924 13464 -85108 81249 79940 99805 -70954
18268e1397H9149c00965R6062L8439I6151a28294j06089B36265c11770a21157
$$ -51397 89149 -300965 -204903 -166464 96151 -128294 -234383 236265 -311770 -121157
18257A25507l7182g138r2560o758q5179c3017A01769a96562A97065b71333A410
$$ 125507 88325 -7138 -99698 -106456 -191635 -33017 101769 -196562 197065 -271333 1410
18245g4016a6117j36136A40498c52422G4518b0233k84054f311D14069i2227l08
$$ -74016 -16117 -152253 140498 -352422 74518 -20233 -304287 -6311 414069 -92227 -92535
18234i2535J8647m5984B65871A999e1738L143b0170A13028b29175A40744l6813
$$ -92535 -73888 -119872 265871 1999 -51738 -48595 -20170 113028 -229175 140744 103931
18223A03931b118o83247B77187a20289c7383o1222G8737M1780d5401k37975J33352
$$ 103931 -2118 -685365 277187 -120289 -37383 -98605 78737 120517 -45401 -283376 -150024
18212a50024g242D435h4628L1012j43866C54239a15692b050A4829b33859A2153
$$ -150024 -7242 4435 -84628 -53616 -197482 354239 -115692 -2050 14829 -233859 12153
18200A53978f2426q9772B14745E7425d32982h4884D0238b29854C46716H5349l5335
$$ 153978 -62426 -152198 214745 57425 -432982 -84884 40238 -229854 346716 85349 50014
18189E0014e4107o3435k58555e3102B4927n301a36006A63853a16480A90920b25222
$$ 50014 -54107 -117542 -376097 -53102 24927 19626 -136006 163853 -116480 190920 -225222
18177I9163m5714L13075d8645C41932H0413b16436F2309c8666l39925g9527j90707
$$ 99163 53449 366524 -48645 341932 80413 -216436 62309 -38666 -378591 -79527 -270234
18166b70234f932k19446B58064A26751c5821B39200H2488N6513o8727C3825f5752
$$ -270234 -6932 -226378 258064 126751 -35821 239200 82488 139001 70274 33825 -65752
18154B51581a54451f1363A30536f8464q6093e040j75544h0153B59589a72807N3804
$$ 251581 -154451 -61363 130536 -68464 -154557 -5040 -180584 -80153 259589 -172807 -119003
18143a19003A0692O767b15198B45897a37273q3114a2045n8476b6632q1667A60008
$$ -119003 10692 17459 -215198 245897 -137273 -220387 -12045 -70521 -26632 -108299 160008
18131a22432B09616k7183f8328k00446A87906b77264q82k3578A52086c81j03641
$$ -122432 209616 182433 -68328 -268774 187906 -277264 -278146 -301724 152086 -381 -104022
18120a04022p6778r2606J18533l27996A70841a79833d1894B15745I9304K765a71389
$$ -104022 -180800 -273406 -154873 -482869 170841 -179833 -41894 215745 99304 102069 -171389
18108A58800C8281a50816E7934J44441C3208i656p4706l06502a07044m116l37784
$$ 158800 38281 -150816 57934 202375 33208 -9656 -84362 -390864 -107044 -111160 -448944
18097d48944a17676a2232F6999b18283A02118g4735j23714h6504P343N244l7707
$$ -448944 -117676 -12232 66999 -218283 102118 -74735 -198449 -86504 -79161 -73917 -111624
18086a11624h137r2367g440l66146E495J97073a39813a9277m3310r5971D37945
$$ -111624 -8137 -100504 -7440 -373586 5495 202568 -139813 -19277 -62587 -158558 437945
18074I8516l2382b12515F7743C2136D562g608j38569l906B93737a02A69818R6299
$$ 98516 66134 -212515 67743 32136 4562 -7608 -146177 -150083 293737 -102 169818 266117
18062B66117G9287L6338g7013A70157i129A45315a13280o1272d6442B26276b47922
$$ 266117 79287 115625 -77013 170157 -9129 145315 -113280 -174552 -46442 226276 -247922
18050e2714k86079J37398p2788G7429a28128j60592g3811A00209L7072b142B04159
$$ -52714 -338793 -201395 -274183 77429 -128128 -288720 -73811 100209 137281 -2142 204159
18038e6085j7747k64758B52073a73839c9725A45227a63933C7851L35736b06553
$$ -56085 -73832 -338590 252073 -173839 -39725 145227 -163933 37851 373587 -206553
18027b28146i1919n5701A06204a66135A6726d21072B22930C2177a18436b4181
$$ -228146 -91919 -147620 106204 -166135 16726 -421072 222930 32177 -118436 -24181
18016a1861l02996A86236E0864a14667C206b27316R9676H2854Q0154a74567B24761
$$ -11861 -314857 186236 50864 -114667 3206 -227316 -127640 82854 163008 -174567 224761
18004e2030J7449B23824F1005J8109i0827C92071A40480b41959D5731J86099I8243
$$ -52030 -34581 223824 61005 79114 -90827 392071 140480 -241959 45731 231830 98243
17992A077J33141b30820A7425a85932g2745k88665J53207j73750B67263R7614
$$ 1077 134218 -230820 17425 -185932 -72745 -361410 -208203 -381953 267263 364877
17982C64877F7819J4502a5380C53429h1010I0997a30474A85089b44993j35167
$$ 364877 67819 82321 -15380 353429 -81010 90997 -130474 185089 -244993 -380160
17972c80160a16556A48072c09368j7831G3627K8769J06889a3737A70827a08881
$$ -380160 -116556 148072 -309368 -327199 73627 102396 209285 -13737 170827 -108881
17961I639N9513a43680j43460a4665k00045B4423b24009B1366i9824d0188j8530
$$ 9639 69152 -143680 -287140 -14665 -214710 24423 -224009 21366 -99824 -40188 -58718
17950e8718I2790c69870B91610I5130b56157C1469J26969i121K173p4786K9438
$$ -58718 92790 -369870 291610 95130 -256157 31469 158438 -9121 -6948 -81734 -52296
17939e2296B84158m7810i8226c3869j58549L4850C69072G5388d9417k5978C96591
$$ -52296 284158 236348 -98226 -33869 -192418 -157568 369072 75388 -49417 -75395 396591
17927A08974h6009k50412A39348F0057E5Q5185j1603R1987B7316J15764A325c63787
$$ 108974 -86009 -336421 139348 60057 55 85240 73637 165624 27316 143080 1325 -363787
17914a894q5815B10764q7013a24724E5353R8414c30575a34691l71887a0064A1857
$$ -1894 -87709 210764 123751 -124724 55353 153767 -330575 -134691 -506578 -10064 11857
17902C5726a35049c4789B69776a49121o4235A19227d8097m1598j43767I261J52416
$$ 35726 -135049 -34789 269776 -149121 -213356 119227 -48097 -89695 -233462 9261 161677
17891A61677F09K85231g2986j8192A66328a23947H4785k4981M6676c59245a15733
$$ 161677 609 285840 -72986 -91178 166328 -123947 84785 59804 106480 -359245 -115733
17879a7900j22854O3750h669n247G8513N1366h0562n5914f4829B00045F1115h8117
$$ -17900 -140754 -77004 -8669 -13916 78513 129879 -80562 -136476 -64829 200045 61115 -88117
17866b63298m4106B14397q2974a64293d1379B90009b3497j36813J9419A06425
$$ -263298 -307404 214397 131423 -164293 -41379 290009 -23497 -160310 -140891 106425
17855i9543b4041k00018A55172B6083J9705f1480k12495d1250B13438c41709G0954
$$ -99543 -24041 -224059 155172 26083 45788 -61480 -273975 -41250 213438 -341709 70954
17843I5944b77548B35420Q8880a01606j25925l5049D593J06860a2394B83392d54356
$$ 95944 -277548 235420 324300 -101606 -227531 -262580 4593 111453 -12394 283392 -454356
17831A1803l974a63070A46497L4477B3479h656m89211c5894p6875A09174e174
$$ 11803 7829 -163070 146497 180974 23479 -8656 -497867 -35894 -112769 109174 -5174
17819b14807L5977f3224B32752a66900j10446B17078a74873q1651a21616A03052
$$ -214807 -178830 -63224 232752 -166900 -277346 217078 -174873 -256524 -121616 103052
17808B48676D2397q07f3518c0841j99634A63112c1097A25731E3975c63299H4261
$$ 248676 42397 41590 -63518 -30841 -230475 163112 -31097 125731 53975 -363299 84261
17796c8265l589k32947J33749q3474H5838d6494I4212L9516A78L66645A79825
$$ -38265 -41854 -274801 -141052 -224526 85838 -46494 94212 133728 178 366823 179825
17784A88880c02765I3595k9628Q1257p1020g2552q7205A47613K16121A14620f5920
$$ 188880 -302765 93595 63967 145224 74204 -72552 -159757 147613 363734 114620 -65920
17772a06262A8270J2120b17894k03472F3176a7824r7222F6396R1967h9373B76472
$$ -106262 18270 30390 -217894 -421366 63176 -17824 -115046 66396 158363 -89373 276472
17760g1361B03689h408E2126b11586I2103a78207B16874a07394E760c1986A25146
$$ -71361 203689 -8408 52126 -211586 92103 -178207 216874 -107394 5760 -31986 125146
17748A92948K34421r9462c6534B85069a63831l9867k48636E34200N5230B8648
$$ 192948 427369 327907 -36534 285069 -163831 -203698 -452334 534200 589430 28648
17737A02336C4107N5570G628a1086A7244a1291A45479c63927J24454B35386o3331
$$ 102336 34107 89677 7628 -11086 17244 -11291 145479 -363927 -239473 235386 172055
17726A72055a9518p296k48243e6035A92151O6963G316e7770A95509c2180j63552
$$ 172055 -19518 -26814 -275057 -56035 192151 259114 7316 -57770 195509 -32180 -195732
17715a95732h1263q236I6219O8340C4955a61529q2737a13115D4904b0837j95437
$$ -195732 -81263 -89499 96219 164559 34955 -161529 -244266 -113115 44904 -20837 -216274
17704b16274A46344b17989P9307A09628c63854G4308J26902m9277p2079d12929
$$ -216274 146344 -217989 -138682 109628 -363854 74308 201210 151933 79854 -412929
17693A75942D267N4408L07594A08722c39399D40497i6436j47334h039j02676B4498
$$ 175942 4267 58675 366269 108722 -339399 440497 -96436 -243770 -8039 -110715 24498
17681H1102a47461B60554H3780K2901P8610E5592b1585N589k62680F6587j8390
$$ 81102 -147461 260554 83780 106681 185291 55592 -21585 -15996 -278676 66587 48197
17670D8197d4192j74134M0340j69244a15442A8476K24228h3195l51101B2164b03869
$$ 48197 -44192 -218326 -177986 -347230 -115442 18476 242704 -83195 -434296 22164 -203869
17658c5775A47095M4570F8692J03760Q3086a62950A91831O1492G2527b76798B24723
$$ -35775 147095 191665 68692 172452 255538 -162950 191831 253323 72527 -276798 224723
17646B81077d5523A69793J57394G8509p999Q7714c3209D8106J66478m3309b25493
$$ 281077 -45523 169793 327187 78509 70510 158224 -33209 48106 214584 171275 -225493
17634a90383e9208l07536h0482F054b77918A11054J37348g9143k3043J7001J465
$$ -190383 -59208 -366744 -80482 6054 -277918 111054 248402 -79143 -102186 -85185 -83720
17623h3720L9937J9812B45418j04626g4423A86577b5421E47546g2308B6721J4281
$$ -83720 -43783 -23971 245418 140792 -74423 186577 -25421 547546 -72308 26721 41002
17612D1002A3090a00725A03676O9017a46122e6273A96678q5909b2873a1189G7976
$$ 41002 13090 -100725 103676 172693 -146122 -56273 196678 110769 -22873 -11189 77976
17600A47456Q0053J02842A45556a00673r259C2057a62008m4836g367B2165a48397
$$ 147456 227509 330351 145556 -100673 -109932 32057 -162008 -206844 -7367 22165 -148397
17588B8996J67612k9994d9390B50653a0680B70063a23723a2428B21826C490R3463
$$ 28996 196608 166614 -49390 250653 -10680 270063 -123723 -12428 221826 3490 96953
17577I6953D632K0887a06525D857J14952f2180A89840e3683D22643A5059J33491
$$ 96953 4632 25519 -106525 4857 119809 -62180 189840 -53683 422643 15059 148550
17566A48550Q2303i1329B7077K69664F941J01516n3277c77836i7130Q506B51855
$$ 148550 230853 -91329 27077 296741 6941 108457 55180 -377836 -97130 -88624 251855
17554A36927J1757K62479j19954I1006a13167N709d6317A3378g5375a031r7218
$$ 136927 148684 411163 291209 91006 -113167 -107458 -46317 13378 -75375 -1031 -98249
17543i8249j16591A73991a02204B62436e72A14394g8601B59976I5361J75578A08861
$$ -98249 -214840 173991 -102204 262436 -572 114394 -78601 259976 95361 270939 108861
17531b53920O0491e9372B69027H6484C9905L6126L3140C2872L01931a30765C3506
$$ -253920 -193429 -59372 269027 86484 39905 76031 109171 32872 334803 -130765 33506
17519B13602c60493A48738L8880b12602I4774O2764K8750a83397j8810E45558
$$ 213602 -360493 148738 187618 -212602 94774 157538 186288 -183397 -202207 545558
17508A02482J80149E4225a8596A65041E2001A1479N9235g0383I193P0213J1502
$$ 102482 282631 54225 -18596 165041 52001 11479 70714 -70383 9193 79406 90908
17497I0908R2770a97641A58324A4444J28378c04296B53302j7345B3782M1695b32206
$$ 90908 183678 -197641 158324 14444 142822 -304296 253302 235957 23782 65477 -232206
17485g2793a3779C56724a63460A04366e8601B98088A32407J11094J08627H9184
$$ -72793 -13779 356724 -163460 104366 -58601 298088 132407 243501 352128 89184
17474b7583C00844J66079A76595J1168a37564B6393i8313M6569D0402J58866D3799
$$ -27583 300844 466923 176595 187763 -137564 26393 -98313 -51744 40402 199268 43799
17462B47366L4824E0162O5005J42445P72B0009J00895J5426k0396J04923J06639
$$ 247366 282190 50162 115167 257612 258384 20009 120904 136330 115934 220857 327496
17451C27496P0792n7706j41881a1462D51871l6593b50077B57624J6887r4191M1686
$$ 327496 398288 340582 198701 -11462 451871 415278 -250077 257624 274511 180320 222006
17440B22006R8088E0949L55509k4387A62831J22110q9568J18393A5705dF56879
$$ 222006 320094 50949 406458 382071 162831 284941 195373 313766 15705 -4 656879
17428A40758N8413L5606d2473D51373j96331r6175M6913j4016n8921J42852K01418
$$ 140758 199171 234777 -42473 451373 255042 158867 205780 191764 132843 275695 477113
17417D77113H0415J25419K36830A95667M8348k4802F8569a9884j22703a7863A32399
$$ 477113 80415 205834 442664 195667 244015 219213 68569 -19884 -142587 -17863 132399
17405a52181B94437j14215a76510A23554J14489G1019K74982F9464L3227L773
$$ -152181 294437 180222 -176510 123554 238043 71019 346001 69464 102691 106464
17395A06464F500P2971a43295D0409a75670C41368m5399K86102K1489a42580H9517
$$ 106464 6500 79471 -143295 40409 -175670 341368 295969 582071 603560 -142580 89517
17383d6251B19238G4268J49008E2108J77856L386J43611j16408g465A47466e9719
$$ -46251 219238 74268 223276 52108 229964 233350 376961 260553 -7465 147466 -59719
17371D62240C2205O28339f888j01623C22505n6945D8173L78132f7275A44823B8479
$$ 462240 32205 660544 -6888 -108511 322505 265560 48173 426305 -67275 144823 28479
17359F25351a85493E3296K68391j59935R851b61140C24354H1897J86762F2408
$$ 625351 -185493 53296 321687 161752 171603 -261140 324354 81897 268659 62408
17348I2077A2462L20176A15552R5436J47745J13129k22886l531r0971J94720A24404
$$ 92077 12462 332638 115552 210988 358733 471862 248976 245445 154474 349194 124404
17336D64801A10696m4326L77589B03842j573i6103B18411b17305D7582b7977F5912
$$ 464801 110696 66370 443959 203842 202269 -96103 218411 -217305 47582 -27977 65912
17324D4802D967b8866B94397g7937B05396p2498a85955D249K00915J90413j53665
$$ 44802 4967 -28866 294397 -77937 205396 132898 -185955 4249 205164 395577 241912
17313B41912a21892H4099K6591L34813F9004K2039O6343a12704A77308q034J57592
$$ 241912 -121892 84099 110690 445503 69004 91043 157386 -112704 177308 169274 326866
17302C26866O6156q8061A45510J9648K39877j28426J8297a70850B68805J00541
$$ 326866 393022 304961 145510 165158 405035 276609 294906 -170850 268805 369346
17292C69346r072j17332r3120L4979g4806B67554j01388m8203l953L91346j97479
$$ 369346 360274 242942 149822 184801 -74806 267554 166166 117963 114010 505356 307877
17281C07877I5934a95922i2127d0308o8561D59031g1543A0825J17938b12591A68185
$$ 307877 95934 -195922 -92127 -40308 -108869 459031 -71543 10825 128763 -212591 168185
17269h5286D7211a01200E2470M17895A61782p1065K12775L6302A52779J06436
$$ -85286 47211 -101200 52470 470365 161782 90717 303492 339794 152779 259215
17259B59215A19418J63316a937C01241J60841p8630j17248F1862P3352a57216
$$ 259215 119418 282734 -1937 301241 462082 383452 266204 61862 135214 -157216
17248D55345j96823r3069i341H3401J30608J21971P3800F9829J41265K7663Q1025
$$ 455345 258522 165453 -9341 83401 214009 335980 409780 69829 211094 238757 319782
17237C19782A16283L82090k27706A15396i4956A95056F8828K96833J48404H2934
$$ 319782 116283 498373 270667 115396 -94956 195056 68828 365661 514065 82934
17226g9215A86804A5378M06601b6506o3638A47167a03435B27015a1698F8420J73030
$$ -79215 186804 15378 421979 -26506 -90144 147167 -103435 227015 -11698 68420 241450
17215B41450a95965C47642k7732r2493A1321L77269D6903c82B11768a7276C60980
$$ 241450 -195965 347642 319910 227417 11321 388590 46903 -382 211768 -17276 360980
17203B64223K19485M1822B52840c076C38965o198J20919A18405J65681e06B1565
$$ 264223 483708 525530 252840 -3076 338965 332767 453686 118405 284086 -506 21565
17191C88271M9156E3847K96530j73184L98923H4291K98298j29690K65689A14360
$$ 388271 437427 53847 350377 177193 576116 84291 382589 252899 518588 114360
17180B31228J4166m2438Q1234j31102O4318N8296B1592a37753B06076J17831A30394
$$ 231228 245394 202956 284190 153088 217406 275702 21592 -137753 206076 323907 130394
17168D82165o5778j78956M1023p2997k5641K14980j91476J1819J458R9049a33686
$$ 482165 416387 237431 278454 205457 179816 394796 203320 215139 216597 315646 -133686
17156B68460R632n3243k9012L24697A72957B6516M21848j31895Q8627E2750J82266
$$ 268460 278092 224849 195837 520534 172957 26516 448364 316469 405096 52750 235016
17145B35016N4161L06781j57787j13976M2931J19066B18248K14774j88317P7229
$$ 235016 289177 595958 438171 324195 367126 486192 218248 433022 244705 321934
17135C21934J02275i422A9014M70591B08662m282J41524q850F0259N04899B27707
$$ 321934 424209 -9422 19014 489605 208662 204380 345904 337054 60259 565158 227707
17123C26322J79581L01982m03865j34528J05594m3892G4896K54023o8782K18549
$$ 326322 505903 807885 404020 269492 375086 331194 74896 328919 260137 478686
17113D78686F9860n857K50491K29392j64965n8543J82346J85188l10796j64934
$$ 478686 69860 64003 314494 543886 378921 320378 502724 687912 377116 212182
17103B12182J9565J03798J9292R9125j57773o925k092J7158m0246K18585l4336
$$ 212182 231747 335545 354837 453962 296189 289264 287172 304330 264084 482669 448333
17092D48333J4808J15867r3698A21978N27246k17841L31279A29095N26563K9398
$$ 448333 463141 579008 485310 121978 649224 431383 762662 129095 655658 685056
17082F85056l04859j88100M59611j296B94483L07567k54116J14882j5051j3394
$$ 685056 380197 192097 651708 650412 294483 602050 347934 462816 447765 434371
17072D34371j73551O10975k51092B89319M31215j47541j68971J60858k15145K59759
$$ 434371 260820 871795 620703 289319 720534 572993 404022 564880 349735 609494
17062F09494j36378K05640B84861L32926j64693Q2599k60991K84413B33115L09770
$$ 609494 473116 678756 284861 617787 453094 535693 274702 559115 233115 542885
17052E42885G5989p429M54647J65968k10694m7770k3820J55034m2669R0088L7740
$$ 542885 75989 68560 523207 689175 478481 430711 406891 561925 519256 609344 647084
17041F47084k85533K41200K9797B90700P48760l85843j1336k0640L3052j32939
$$ 647084 361551 602751 632548 290700 1039460 653617 642281 621641 654693 521754
17031E21754J9506B15129N92731O0417p6115k93065P2286J62261N3529C11568
$$ 521754 541260 215129 807860 868277 792162 499097 571383 733644 787173 311568
17020E23276J99441j3411R2038p1934o5139l689O7814k48673M03156r6700j60997
$$ 523276 722717 709306 801344 729410 664271 660582 728396 479723 882879 786179 625182
17009F25182k05054L36K62412p7903K35162J01523m6580k26700J022o6840M88068
$$ 625182 420128 420464 682876 604973 840135 941658 895078 668378 669400 602560 1090628
16998A090628n18657K35497J80059j29529k03581J65495l9763L00835l46852k73060
$$ 1090628 571971 807468 987527 857998 654417 819912 780149 1080984 734132 461072
16988D61072J39948J97141k1709J70749k65553J88811L44878l57308l4178J29212
$$ 461072 601020 798161 776452 947201 681648 870459 1215337 858029 823851 953063
16978I53063l9409r2705o4318j21112K50971j03575m8067L95323E54408L82884
$$ 953063 913654 820949 756631 635519 886490 782915 734848 1130171 554408 937292
16968I37292k00221j98031J70758K42459P4180K90380l16953J20651k84716J69893
$$ 937292 737071 539040 709798 952257 1026437 1316817 999864 1120515 835799 1005692
16958A005692N9644O8402k57377J7814M09339n47545J99870K71251l71256K43569
$$ 1005692 1065336 1133738 876361 894175 1303514 755969 955839 1227090 855834 1099403
16948A099403j5488J11499r6109J34769O3998K51712k33600k29323J02515M2942
$$ 1099403 1083915 1195414 1099305 1234074 1298072 1549784 1316184 1086861 1189376 1232318
16938A232318K43326m1155l22881J20889j35006q318M60897m04273l9627J32769
$$ 1232318 1475644 1434489 1111608 1232497 1097491 1089173 1550070 1145797 1106170 1238939
16928A238939j6666J19476J2255K14150k21940J56532k10314K34990K58057P382
$$ 1238939 1222273 1341749 1354004 1568154 1346214 1502746 1292432 1527422 1785479 1792861
16918A792861n08980Q459L92911l6747k18097Q6846J7100k67709K29095k61217
$$ 1792861 1283881 1292340 1685251 1648504 1430407 1517253 1534353 1266644 1495739 1234522
16908A234522O1257M59345l1036k89364M21238n62060L86483K60893m76313L37966
$$ 1234522 1295779 1755124 1724088 1434724 1855962 1293902 1680385 1941278 1464965 1802931
16898A802931l95301L72263k3770J75888k37410L35656R1797o7534j85868L33805
$$ 1802931 1407630 1779893 1756123 1932011 1694601 2030257 2122054 2054520 1868652 2202457
16888B202457j48304k0230K06280k09845K23044k64397L37824l03225L72975m2533
$$ 2202457 2054153 2033923 2240203 2030358 2253402 1989005 2326829 2023604 2396579 2354046
16878B354046m50274K31222L39575j67682J15219r637J9030J20840o3428J73744
$$ 2354046 1903772 2134994 2474569 2306887 2422106 2412469 2431499 2552339 2488911 2662655
16868B662655p074J25636n68311J99873M63915k9749j98389K32487p2129P7008
$$ 2662655 2655581 2781217 2212906 2412779 2876694 2846945 2648556 2881043 2808914 2885922
16858B885922k83650K82157L77984P5765k94467P4891Q304K02011K5480J39556
$$ 2885922 2602272 2884429 3262413 3338178 3043711 3118602 3126906 3328917 3354397 3493953
16848C493953J2695R549J49147j93350J12614J33562n0756L8595K92423J920J33001
$$ 3493953 3506648 3516197 3665344 3471994 3584608 3718170 3667414 3706009 3998432 4000352 4133353
16837D133353K42884p5560j53432L03616j24900j19743M53556j3009r6176K88101
$$ 4133353 4376237 4300677 4147245 4450861 4325961 4206218 4659774 4646765 4550589 4838690
16827D838690q3101M9344K44132P3762K4037K3253L46354J85892J6669o1013j01510
$$ 4838690 4755589 4804933 5049065 5122827 5146864 5170117 5516471 5702363 5719032 5658019 5556509
16816E556509J22394J72712L58550O9414K54230M1801k73531N66469M11219K93657
$$ 5556509 5678903 5851615 6210165 6279579 6533809 6575610 6302079 6868548 7279767 7573424
16806G573424j84484K44064j21860M59473k36606K26258O6282L71976K60619L49243
$$ 7573424 7388940 7633004 7511144 7970617 7734011 7960269 8026551 8398527 8659146 9008389
16796I008389k34039O83676l5116J58959N56000K79060P7104O22341j352K08896
$$ 9008389 8774350 9458026 9422910 9581869 10137869 10416929 10494033 11116374 11115022 11323918
16786A1323918M06543N33582J79619O7269J70124O10068P54569N05506N6025Q15158
$$ 11323918 11730461 12264043 12443662 12510931 12681055 13291123 14045692 14551198 14607223 15422381
16776A5422381K41477J76224J056218J69596P70407L5127J105341Q00491P01928
$$ 15422381 15663858 15840082 16896300 17065896 17836303 17871430 18976771 19777262 20479190
16767B0479190L68277J141539P74316R01331P24287Q20243J035773J122954J315426
$$ 20479190 20847467 21989006 22763322 23664653 24388940 25209183 26244956 27367910 28683336
16758B8683336J006696J300264J265482J313500J649993J640762J874842J568970
$$ 28683336 29690032 30990296 32255778 33569278 35219271 36860033 38734875 40303845
16750D0303845J780865J913825K245723K633724K628899K279638L291459K624020
$$ 40303845 42084710 43998535 46244258 48877982 51506881 53786519 57077978 59701998
16742E9701998L462300L313683L908507L957600L957419M842356M867402N192609
$$ 59701998 63164298 66477981 70386488 74344088 78301507 83143863 88011265 93203874
16734I3203874N555766N677309O366833O358130O919460P063710P459140P341254
$$ 93203874 98759640 104436949 110803782 117161912 124081372 131145082 138604222 145945476
16726A45945476P896254P390547P143220P377847O323756O047836M783786M304374
$$ 145945476 153841730 161232277 168375497 175753344 182077100 188124936 192908722 197213096
16718A97213096K462497J383851K95699j290197k720917l726910m791180o096763
$$ 197213096 199675593 201059444 201355143 200064946 197344029 193617119 188825939 182729176
16710A82729176o263808p348707p541975p885592p588542p692502p933243p048321
$$ 182729176 176465368 169116661 161574686 153689094 146100552 138408050 130474807 123426486
16702A23426486p350721o594174o515077n900695n694547n425697m778492n052369
$$ 123426486 116075765 109481591 102966514 97065819 91371272 85945575 81167083 76114714
16694G6114714m068583l979572l856541l288065l705480k826739k581318l147210
$$ 76114714 72046131 68066559 64210018 60921953 57216473 54389734 51808416 48661206
16686D8661206k092189k402813k122037j808031k222793j669991j675389j718822
$$ 48661206 46569017 44166204 42044167 40236136 38013343 36343352 34667963 32949141
16678C2949141j493743j370901o87293j386653j487077j241322q44393o43614
$$ 32949141 31455398 30084497 29397204 28010551 26523474 25282152 24437759 23794145
16670B3794145j346033n78267n88495j202314o35926p96096o62053k83325j062325
$$ 23794145 22448112 21869845 21281350 20079036 19443110 18647014 17984961 17701636 16639311
16661A6639311k30935p38708k68671o21346o59489l08381m7688p34555l80985
$$ 16639311 16408376 15669668 15400997 14779651 14120162 13811781 13764093 13029538 12648553
16652A2648553m84352k62525k76573j91498m86004l03069l88076k09072l42869
$$ 12648553 12164201 11901676 11625103 11433605 10947601 10644532 10256456 10047384 9704515
16643I704515j08928l94210l24677m31660n2204m496j48710m34635K6956l63522
$$ 9704515 9595587 9201377 8876700 8445040 8392836 8388340 8239630 7804995 7831951 7468429
16633G468429o43920L52159j56953q1501l29144j37495j35937j08426k61978J04705
$$ 7468429 6824509 7176668 7019715 6938214 6609070 6471575 6335638 6227212 5965234 6069939
16623F069939j16787n43019J33402o3378j16692n20230J00792J44075l46874J00271
$$ 6069939 5953152 5410133 5543535 5480157 5363465 4843235 4944027 5088102 4741228 4841499
16613D841499j67566p0278j96382J00987n8931p7974j57669J53941o50658K26010
$$ 4841499 4673933 4603655 4407273 4508260 4449329 4371355 4213686 4367627 3716969 3942979
16603C942979J51604m66995J62832j1982l13459J25307K80320n16187L381J37244
$$ 3942979 4094583 3627588 3790420 3778438 3464979 3590286 3870606 3354419 3357800 3495044
16593C495044j2407j19479j75741l488l1102j18809j97070o7341j28575L84750
$$ 3495044 3482637 3363158 3187417 3183929 3152827 3034018 2836948 2769607 2641032 3025782
16583C025782l63119l9910K88713k92316R8721k24353L8498P7136k83692K87316
$$ 3025782 2662663 2622753 2911466 2619150 2717871 2493518 2532016 2609152 2325460 2612776
16573B612776l78519K28314K0803k51850O978N1346l1522j58113q0382K38298
$$ 2612776 2234257 2462571 2483374 2231524 2238502 2289848 2258326 2100213 2019831 2258129
16563B258129p5411r6073L56609p43516J77620o9155J29143K179J05021J55991
$$ 2258129 2182718 2086645 2443254 1699738 1877358 1808203 1937346 1939525 2044546 2200537
16553B200537l73475l77714L98371k66296K6886J0533j06239o9525J70069k10914
$$ 2200537 1827062 1449348 1847719 1581423 1608309 1618842 1512603 1443078 1613147 1402233
16543A402233K5654M3865o5714Q4897K08057j31673j43849j68097J83137k60252
$$ 1402233 1427887 1471752 1406038 1490935 1698992 1567319 1423470 1255373 1438510 1178258
16533A178258L71625k57029l8130l4318J56555l2639n0175J89464k97541L37462
$$ 1178258 1549883 1292854 1254724 1220406 1376961 1344322 1294147 1483611 1186070 1523532
16523A523532l38063K54454l72379N64231l25867j51554l3884J14256m63716M70360
$$ 1523532 1185469 1439923 1067544 1631775 1305908 1154354 1120470 1234726 771010 1241370
16513A241370q5453J51797k526k37634j94273L35116j5034r8595n6377J33850
$$ 1241370 1155917 1307714 1305188 1067554 873281 1208397 1193363 1094768 1038391 1172241
16503A172241J4343j90222k09670K02912J11650J423J31289j0542k37409j99192
$$ 1172241 1186584 996362 786692 989604 1101254 1102677 1233966 1223424 986015 786823
16493G86823o7775o0781M22940j53314l27825M07393j2071k40622K54103l06609
$$ 786823 719048 658267 1081207 927893 600068 1007461 995390 754768 1008871 702262
16483G02262J14955r8315N50842n75748K49405O9579k95273j00473J6209K14715
$$ 702262 817217 718902 1269744 693996 943401 1012980 717707 617234 633443 848158
16473H48158J46532k73936j9406R5192r7783M25419n46295K55122j22277K8231
$$ 848158 994690 720754 701348 796540 698757 1124176 577881 833003 710726 738957
16463G38957K21856m09157k18190K57864m9639J87131J82718l74353K44276J19991
$$ 738957 960813 551656 333466 591330 541691 728822 911540 537187 781463 901454
16453I01454m19902L52479l59634J25419J18527j98299j38001K03219R8148p7502
$$ 901454 481552 834031 474397 599816 718343 520044 382043 585262 683410 605908
16443F05908J89423C18273M07596k55156j70165L29349j85464j98367N7954L65061
$$ 605908 795331 318273 725869 470713 300548 629897 444433 246066 304020 669081
16433F69081m9832n6076q4849J75202j3691k53937L49978j01902J87138l28943
$$ 669081 619249 563173 478324 653526 639835 385898 735876 633974 821112 492169
16423D92169J50022m4079K4305k8885M6267q5463k03887K92140j27486j16712
$$ 492169 642191 598112 622417 593532 639799 554336 350449 642589 515103 398391
16413C98391K56023C20917J20681K36316C12383j48656J09965O5967J4097A14444
$$ 398391 654414 320917 441598 677914 312383 163727 273692 339659 353756 114444
16402C74093K50034B97124M95174k3174k03824j07003j13631L20217k68023A86282
$$ 374093 624127 297124 792298 769124 565300 458297 344666 664883 396860 186282
16391H07391l55453j16969I1844L40958A79439J57680L57705N1230C72430C7303
$$ 807391 451938 334969 91844 432802 179439 337119 694824 746054 372430 37303
16380E3603K03833L34017k18271k6458J64191n9844K462j69133L41176k21914
$$ 53603 257436 591453 373182 346724 510915 451071 453533 284400 625576 403662
16370D03662K37750A8049P1243R3622Q2057A06223J67199M3711O1222M6279N2973
$$ 403662 641412 18049 89292 182914 264971 106223 273422 317133 378355 424634 477607
16359D77607A58883j7816O0992N9188J35624j67428J88045j72426J13002J70848
$$ 477607 158883 141067 202059 261247 396871 229443 417488 245062 358064 528912
16349E28912k57480a09312A38505o660L93085E1936i79F34783A49456J8827K55701
$$ 528912 271432 -109312 138505 131845 524930 51936 -979 634783 149456 168283 423984
16338D23984j54904r8028O3394p319l8981K78863B6518M77257C8152K97572j01212
$$ 423984 269080 171052 234446 227127 188146 467009 26518 503775 38152 335724 234512
16327B34512r3247L39904A25330K61198j9268j55360J50427A29175J57897k8998
$$ 234512 141265 481169 125330 386528 367260 211900 362327 129175 287072 258074
16317B58074D2353P1963b8695G648J50384K42542A91271a23176m1351B39705F3384
$$ 258074 42353 114316 -28695 7648 158032 400574 191271 -123176 -164527 239705 63384
16305D37195k13042J50848j22423I3108M16463j84182P4770j82489B6132L27032
$$ 437195 224153 375001 252578 93108 509571 325389 400159 217670 26132 353164
16295C53164J80572B66822q4258C0133K28444p2979K18586C6865N4281L0004J07139
$$ 353164 533736 266822 182564 30133 258577 185598 404184 36865 91146 121150 228289
16284B28289j12049O7538c5520C95323G5105P23385B43112l8843c7835n1562B40649
$$ 228289 116240 183778 -35520 395323 75105 798490 243112 204269 -37835 -89397 240649
16272B2681M78525k01707a66823C94311j12415o5820E4068a16656D45833A30061
$$ 22681 501206 299499 -166823 394311 281896 216076 54068 -116656 445833 130061
16261a5617I7792C7174a58812A10711D886K77597J93188C377J85661c8910p833
$$ -15617 97792 37174 -158812 110711 4886 282483 475671 3377 189038 -38910 -46743
16250d6743K487D2547M40980B05019k8690L11546k03820L30825B07720k5987L0798
$$ -46743 -44256 42547 483527 205019 176329 487875 284055 614880 207720 181733 212531
16239B12531g6783p7088E173K06809F8325P4653P811N1933i7655A92722J05295
$$ 212531 -76783 -153871 5173 211982 68325 142978 150789 202722 -97655 192722 298017
16228B98017a43253B81807I2578K9947K38197A67068j2788m963o307J05794k123
$$ 298017 -143253 281807 92578 122525 360722 167068 154280 149317 143010 248804 246681
16217B46681p0880A3638O4723Q735J9556b42505A36049n1270c6286j53442P0239
$$ 246681 175801 13638 78361 87096 106652 -242505 136049 84779 -36286 -189728 -119489
16206a19489A30640J8515K63206j02676A6583f9824N747B0517a53451O1806B45539
$$ -119489 130640 149155 412361 309685 16583 -69824 -64077 20517 -153451 -91645 245539
16194c26706I0498K49826o6641E4256f4598B4704h5511o5181a5539A96955g0345
$$ -326706 90498 340324 273683 54256 -64598 24704 -85511 -150692 -15539 196955 -70345
16182B2614n427J62947A3526b04309C6660J82879P9685F321Q4993g49n1879A0268
$$ 22614 17187 180134 13526 -204309 36660 219539 299224 6321 91314 -749 -52628 10268
16169a81787A49851b4338B23031j6631B6313J67763A595M16658b8761o7323o7447
$$ -181787 149851 -24338 223031 206400 26313 194076 1595 418253 -28761 -96084 -163531
16158a63531C25260N8692n3700H8243C7073p52a33095A68778K3316c0177E4961
$$ -163531 325260 383952 330252 88243 37073 36321 -133095 168778 192094 -30177 54961
16146a41168O578E3144i1584C9808j4226O1782k1913a36743D584M7483J58241
$$ -141168 -134590 53144 -91584 39808 25582 87364 65451 -136743 4584 52067 210308
16135B10308N3465j21455C5209a03621d4805o8015d3691b0158j91188A45661f3653
$$ 210308 263773 142318 35209 -103621 -44805 -112820 -43691 -20158 -211346 145661 -63653
16123B06291o323a49582o7005p5555a36102G5621c0439o5012c1081A21132b06495
$$ 206291 199968 -149582 -216587 -292142 -136102 75621 -30439 -95451 -31081 121132 -206495
16111b17893a5808j23426A66080b08419C10689h7875h172j4178C34803j08313
$$ -217893 -15808 -139234 166080 -208419 310689 -87875 -8172 -22350 334803 226490
16101B26490n9569l9491j1064M0014a35690d0763A32459a95544E1212j2484A0978
$$ 226490 166921 127430 116366 156380 -135690 -40763 132459 -195544 51212 38728 10978
16089a7193A4375b31055G7795J99548b91508e3677m5430a3887j78714B02250b65717
$$ -17193 14375 -231055 77795 277343 -291508 -53677 -99107 -13887 -192601 202250 -265717
16077E5837A2793g0346l432B50775a49800p6661a04p6926b2925A57261a79382
$$ 55837 12793 -70346 -73778 250775 -149800 -226461 -104 -77030 -22925 157261 -179382
16065e9656j95062R2967f3655E2348a94812A11243f2999k04770h814A81489a3877
$$ -59656 -254718 -161751 -63655 52348 -194812 111243 -62999 -267769 -8814 181489 -13877
16053a1540k73458j37790A04107m2822j2779e7209A7053K3018K66155f3332A65108
$$ -11540 -284998 -422788 104107 61285 48506 -57209 17053 40071 306226 -63332 165108
16041A14581J07238I7052O8969a35275A7307N37168A4444J64655a33241b1117
$$ 114581 221819 97052 166021 -135275 17307 554475 14444 179099 -133241 -21117
16030b09036H6619J87948b72426B9485d5656C6936c49709A29419e27822A18044
$$ -209036 86619 274567 -272426 29485 -45656 36936 -349709 129419 -527822 118044
16019G6043e2625H5480a20647j36621O031D16300i172A09986a44928j11165A04346
$$ 76043 -52625 85480 -120647 -257268 -251237 416300 -9172 109986 -144928 -256093 104346
16007a40768A16994c30943q0234I3510D3270g0149B4050K6031Q0615a6379D8523
$$ -140768 116994 -330943 -411177 93510 43270 -70149 24050 50081 130696 -16379 48523
15995b76423I6216d6911B52133n3563c27291A92047e5948E8884a50345k4443f2265
$$ -276423 96216 -46911 252133 198570 -327291 192047 -55948 58884 -150345 -174788 -62265
15983D20574k00974M1781A02813e4489C09517a66600m9370C3719J10971i1640
$$ 420574 219600 261381 102813 -54489 309517 -166600 -215970 33719 144690 -91640
15972f1031O525A74388a46319k03719C8952a39146A50186D6230b86344A10337
$$ -61031 -54506 174388 -146319 -350038 38952 -139146 150186 46230 -286344 110337
15961f5410q7389B16974f2004k82430g8854B35652c8856l84507e3950B9128K7650
$$ -65410 -152799 216974 -62004 -344434 -78854 235652 -38856 -423363 -53950 29128 56778
15950E6778m556i9257j49725C4011e9348G2094a9648k40159A63249c0449F2854
$$ 56778 52222 -99257 -248982 34011 -59348 72094 -19648 -259807 163249 -30449 62854
15938c74550J16105D0527Q0532J18859F3645K02414F1147e8782b8317k03337A65224
$$ -374550 -258445 40527 121059 239918 63645 266059 61147 -58782 -28317 -231654 165224
15926a37473I2305a64605C5654P7270D0793d2121j7612l39473d951E2365D911
$$ -137473 92305 -164605 35654 112924 40793 -42121 -59733 -399206 -4951 52365 4911
15914A1361J41456c84377A2890a99991r2764J26165C0337K07595N6787c64819
$$ 11361 152817 -384377 12890 -199991 -292755 -166590 30337 237932 294719 -364819
15903b69292A84707a12536C41834d5276j66744k0442B41149E1105c26396i364
$$ -269292 184707 -112536 341834 -45276 -212020 -232462 241149 51105 -326396 -9364
15892B57914b198B34251r9936c29203O1421k06080a54555E9259N2580a47301A81956
$$ 257914 -2198 234251 134315 -329203 -267782 -473862 -154555 59259 111839 -147301 181956
15880d3053A8378a80388A84164a99137G4006k8046b71265a28281l8255C8168J35514
$$ -43053 18378 -180388 184164 -199137 74006 45960 -271265 -128281 -166536 38168 173682
15869A73682b66844G3359J34317b21541a3577D9734g5177B74688a17097B32717
$$ 173682 -266844 73359 207676 -221541 -13577 49734 -75177 274688 -117097 232717
15858c9873j13143k17968J58626B74302a61698A33801k0347K20142j29399D8825
$$ -39873 -153016 -370984 -212358 274302 -161698 133801 113454 333596 204197 48825
15847a64356P0132c9007A33911a98902A1764b00220A18699Q0503i9445l86822
$$ -164356 -94224 -39007 133911 -198902 11764 -200220 118699 199202 -99445 -486267
15837d86267A8084a65090B9520b41178e5827D288J17227b59294h8291A0323a8903
$$ -486267 18084 -165090 29520 -241178 -55827 4288 121515 -259294 -88291 10323 -18903
15825C4658J0526L49599D9757d6755A82004a42441d8581I162N3032L46336a77181
$$ 34658 45184 394783 49757 -46755 182004 -142441 -48581 9162 62194 408530 -177181
15813h0050B19568i9315k19601A3011e3066K0951j01651g072o9777o1328j31854
$$ -80050 219568 -99315 -318916 13011 -53066 -32115 -133766 -7072 -76849 -138177 -270031
15802b70031C9813a27281n3338A46221c5073k92238e3781B48580d39645H0126
$$ -270031 39813 -127281 -180619 146221 -35073 -327311 -53781 248580 -439645 80126
15791b18613J03064E6242b67142f0334g945j91614k18829D0122d0011B00454b5980
$$ -218613 -115549 56242 -267142 -60334 -7945 -199559 -418388 40122 -40011 200454 -25980
15779A61184c86002a90861A40184b48272L0812K9963j09798A4361a51593c4684
$$ 161184 -386002 -190861 140184 -248272 -217460 -187497 -297295 14361 -151593 -34684
15768A85917a27869C00717b76505c4989k7076A0390b33867A74640a13026C10203
$$ 185917 -127869 300717 -276505 -34989 -62065 10390 -233867 174640 -113026 310203
15757b4847j15962o9885C87997h3524A20441K2893h6146l6952I9983a03467C85309
$$ -24847 -140809 -210694 387997 -83524 120441 143334 -86146 -123098 99983 -103467 385309
15745C07424i8821B4678O0808a61403K19b4311j70789A03256a98944A16841k9537
$$ 307424 -98821 24678 85486 -161403 -161184 -24311 -195100 103256 -198944 116841 87304
15734H7304a40058H0603N2556b4580C297i5399B04941c050C58472A19272A2685
$$ 87304 -140058 80603 133159 -24580 3297 -95399 204941 -3050 358472 119272 12685
15722A46997b2448k5745A5596J78599j9959a01092J9920A6218b1738q0170B21670
$$ 146997 -22448 -48193 15596 194195 174236 -101092 -81172 16218 -21738 -101908 221670
15710i7624k07055O1141c5596l5166j4562A65478D6169Q4812m1936a34500j38
$$ -97624 -304679 -243538 -35596 -70762 -85324 165478 46169 130981 89045 -134500 -134638
15699a34638B72551c16225c1022B5146a56937B47836a49958I2969j5127P4037
$$ -134638 272551 -316225 -31022 25146 -156937 247836 -149958 92969 77842 151879
15689A51879E8645b9034B31268b77279J31156A13121m9804f8617f24C1945K2928
$$ 151879 58645 -29034 231268 -277279 -146123 113121 63317 -68617 -624 31945 54873
15678E4873b11705k16443B68725a4549k00269K2745f7780k31514B59930b162o5084
$$ 54873 -211705 -428148 268725 -14549 -214818 -192073 -67780 -299294 259930 -2162 -67246
15667f7246E2687J38703a68775F9900P8285a18229L8183p715C6967d66714M5247
$$ -67246 52687 191390 -168775 69900 148185 -118229 -80046 -87761 36967 -466714 -421467
15656d21467d2416B92327a30530k26433C5129b50875a6829j4463k46n4256n7251
$$ -421467 -42416 292327 -130530 -356963 35129 -250875 -16829 -31292 -31538 -85794 -143045
15645a43045m7909K0353r9575A40892A2982c52877B82833b01548j02809a3052
$$ -143045 -190954 -170601 -270176 140892 12982 -352877 282833 -201548 -304357 -13052
15634f9794j52718b3155j06177n120a6940d256l29285I5567m654j4857j7995J50495
$$ -69794 -222512 -23155 -129332 -134452 -16940 -4256 -333541 95567 90913 76056 58061 208556
15622B08556e4029l23440B10599B7760j0446K4353K4981O6680d460l1288I5404
$$ 208556 -54029 -377469 210599 27760 17314 41667 66648 133328 -4460 -35748 95404
15610i8150A25476a88050j57391O2788A95506K74342d2574l9488j50047D5364
$$ -98150 125476 -188050 -345441 -282653 195506 469848 -42574 -82062 -232109 45364
15599a8886A880c33881B23450d6861o8556j82302C8133K00276A2483a85914B29857
$$ -18886 1880 -333881 223450 -46861 -115417 -297719 38133 238409 12483 -185914 229857
15587B3628L69046K717A68697o453b70154a03994A40631E3149b3933q0626k9542
$$ 23628 392674 395391 168697 162244 -270154 -103994 140631 53149 -23933 -104559 -134101
15576a34101A84943a9511B7249c5712A36423F3362i7304k79303J21559J7242r8854
$$ -134101 184943 -19511 27249 -35712 136423 63362 -97304 -376607 -255048 -237806 -336660
15565c36660G4157b7359j56736h2336A2295K53093j01289I349a50946n3033A48132
$$ -336660 74157 -27359 -184095 -82336 12295 265388 164099 9349 -150946 -203979 148132
15553b2668R47j81660o4032f7044q0161C45612a7085A58492N1895c90929B02595
$$ -22668 -21721 -203381 -267413 -67044 -147205 345612 -17085 158492 210387 -390929 202595
15541b75926d4911A91501a74264j85027a23209A01586D627a40837E3994h5320
$$ -275926 -44911 191501 -174264 -359291 -123209 101586 4627 -140837 53994 -85320
15530c20839f4578m8670j15421A99535E6758c3690F1266h4823A01768b45006J13078
$$ -320839 -64578 -113248 -228669 199535 56758 -33690 61266 -84823 101768 -245006 -131928
15519a31928k8883N7573H4293a33139N7547D3213R0485g1874o7579c1198D76700
$$ -131928 -160811 -103238 84293 -133139 -75592 43213 133698 -71874 -139453 -31198 476700
15507G3827C0L4846N6511a4092B11362c1197J1641j54256h5751I6752i4987B04647
$$ 73827 30 34876 91387 -14092 211362 -31197 -19556 -173812 -85751 96752 -94987 204647
15494B2355L7646a84372N5456d1142k08397H801A342g7122A30863a86142A84933
$$ 22355 60001 -184372 -128916 -41142 -249539 8801 1342 -77122 130863 -186142 184933
15482H6065b87392O0472a06973A04073m5856i1319A68267E2881K25961E8294P5593
$$ 86065 -287392 -226920 -106973 104073 58217 -91319 168267 52881 278842 58294 133887
15471A33887b5394r9005a09G1150l1634p84N5732a68776F3278J68819h3163C04554
$$ 133887 -25394 -124399 -109 71150 39516 38732 94464 -168776 63278 232097 -83163 304554
15458A34823Q5732a08923q3208B04168p4646a89887f8184A66266G8577P3190J04895
$$ 134823 220555 -108923 -192131 204168 129522 -189887 -68184 166266 78577 151767 256662
15447B56662j27616K79962E4612N2944D7864i235k1933j41083A68283m7927R8334
$$ 256662 129046 409008 54612 107556 47864 -9235 -31168 -172251 168283 120356 218690
15436B18690J6247b3966C772g45l26334C80836a41313f301B52702a10905n8842
$$ 218690 234937 -23966 3772 -745 -327079 380836 -141313 -6301 252702 -110905 -169747
15425a69747C13849a70506j91896H5531i0601A26379b38475B68366I0629a05604
$$ -169747 313849 -170506 -362402 85531 -90601 126379 -238475 268366 90629 -105604
15414b65465C3834b3559n3668k3219J9844j45731a07210J9929q6522C37453a27939
$$ -265465 33834 -23559 -77227 -100446 -80602 -226333 -107210 -87281 -173803 337453 -127939
15402A23853a71896I7486E183a0041k44544o0267N2641A87101b61125A32547d8598
$$ 123853 -171896 97486 5183 -10041 -254585 -314852 -262211 187101 -261125 132547 -48598
15390f2612l74242a57336A36583G125a25389r1641f7627B07418a12426b9663D8509
$$ -62612 -436854 -157336 136583 7125 -125389 -217030 -67627 207418 -112426 -29663 48509
15378A40319c4204D86959C2563b47856n1424A37037a25632H1290h5468p5676B0425
$$ 140319 -34204 486959 32563 -247856 -299280 137037 -125632 81290 -85468 -161144 20425
15366c22693A7732e8828a9351A72143g2171A82941k8799e3227G8007J33686J1881
$$ -322693 17732 -58828 -19351 172143 -72171 182941 154142 -53227 78007 211693 223574
15355B23574C0686a27578B39754j2194o6676G9973b53713B24666a94248G1380
$$ 223574 30686 -127578 239754 227560 160884 79973 -253713 224666 -194248 71380
15344c572A28640b36021R8501A03177l8149J15130N563a03472A34331C0206a78888
$$ -3572 128640 -236021 -137520 103177 65028 180158 185721 -103472 134331 30206 -178888
15332B10226a22256j47361J00421L1928C45117N8072d20170b05898n2094A00731
$$ 210226 -122256 -269617 -169196 -137268 345117 403189 -420170 -205898 -257992 100731
15321i5581B7602b38910H778b22976B34955o131P014B7448K0970a06298C03169
$$ -95581 27602 -238910 8778 -222976 234955 228824 235838 27448 48418 -106298 303169
15309C1259J75233L5741E3925d2072p5095k4062C2862K27339E091K00510l8397
$$ 31259 206492 242233 53925 -42072 -117167 -141229 32862 260201 5091 205601 167204
15298A67204A5768i1143J6093A3952J05246J37743J29410a09264A52380i146l57994
$$ 167204 15768 -91143 -75050 13952 119198 256941 386351 -109264 152380 -9146 -367140
15287c67140a5061A08192b56561I5553c18027B9721l349B495c3823A84612c369
$$ -367140 -15061 108192 -256561 95553 -318027 29721 26372 2495 -33823 184612 -3369
15275A91929i0984F8331M3417k5893N5213m8858l0779M04905k12328b73952D545
$$ 191929 -90984 68331 111748 85855 141068 92210 61431 466336 254008 -273952 4545
15263b29974a4356k73697A63343b8712j7134B3217M3402P8804M0077K9782d6249
$$ -229974 -14356 -288053 163343 -28712 -45846 23217 66619 145423 185500 215282 -46249
15251I6250N5484J54905M29244P38095j81851l01693P85858G11265l46547B9736
$$ 96250 151734 306639 735883 1473978 1292127 990434 1776292 711265 364718 29736
15240B50520A13456N7983K0582J21775A22110L5173A4561L9322c10350G2765a17941
$$ 250520 113456 171439 192021 313796 122110 157283 14561 53883 -310350 72765 -117941
15228c25763C9150i6697L7045k73299a38334B06349o0418k7157J74361q5827G7892
$$ -325763 39150 -96697 -59652 -332951 -138334 206349 145931 118774 293135 207308 77892
15216A07588A9638a43376I2716b49813A01944J7527g9959B92925J4158j08329
$$ 107588 19638 -143376 92716 -249813 101944 119471 -79959 292925 307083 198754
15206A98754J28395F5154J71302A13182B2137h2898o659A59946a52014B3721J94415
$$ 198754 327149 65154 236456 113182 22137 -82898 -89557 159946 -152014 23721 218136
15195B18136d0706C3178P0487a15460m8234A45756K1624o7996m0955d1658m1477
$$ 218136 -40706 33178 103665 -115460 -163694 145756 167380 99384 58429 -41658 -83135
15184h3135D07670j00390H119a2657B15914a4344C02528c0605G663a25191D1303
$$ -83135 407670 307280 8119 -12657 215914 -14344 302528 -30605 7663 -125191 41303
15172A55212d3086a8677F6189c12199A91185a59583A21479d915C70433b72852
$$ 155212 -43086 -18677 66189 -312199 191185 -159583 121479 -4915 370433 -272852
15161C67995A2791L9772O5733h615k94398H9315i6781B59237J951I8024a2110
$$ 367995 12791 52563 118296 -8615 -303013 89315 -96781 259237 261188 98024 -12110
15149d4043J8019A3446a67939G5321P1499K58527j45665C7263J35328a42593B03499
$$ -44043 -26024 13446 -167939 75321 146820 405347 259682 37263 172591 -142593 203499
15137A91522E7597K96323I8622a06303F1308f6464I2765r274f7484J8071k09432
$$ 191522 57597 353920 98622 -106303 61308 -66464 92765 83491 -67484 -49413 -258845
15126b58845D5264K35703a39690F3374K28225j20345B6934R4058b3408G9827a85683
$$ -258845 45264 280967 -139690 63374 291599 171254 26934 120992 -23408 79827 -185683
15114C95073A94728B0385K7606P0003a3328H5197a41562A17213Q0882a497j2859
$$ 395073 194728 20385 47991 117994 -13328 85197 -141562 117213 198095 -1497 -14356
15103a4356A94651r2555Q8269J64113b70906f0488A86059n6279c7933A58749p6608
$$ -14356 194651 102096 190365 354478 -270906 -60488 186059 129780 -37933 158749 82141
15092H2141b23573C96288a32197A53365K174e1355C97290G0942J15169L0241G7549
$$ 82141 -223573 396288 -132197 153365 155539 -51355 397290 70942 186111 216352 77549
15080D43568b52964D22920A2772L4414a55743C83503a12622A69704c30155I5636
$$ 443568 -252964 422920 12772 47186 -155743 383503 -112622 169704 -330155 95636
15069B13317G6100J26843N4998J42678P4141B31835H5221J63281K50453H7712
$$ 213317 76100 202943 257941 400619 474760 231835 85221 248502 498955 87712
15058C67553C4419K91517c7356A56868E0720K13881L51690b09802F78309B669
$$ 367553 34419 325936 -37356 156868 50720 264601 616291 -209802 678309 2669
15047A80366M357B5028N13697A08922L2333J76607H7488A7010J25878K73512g3739
$$ 180366 184723 25028 538725 108922 141255 317862 87488 17010 142888 416400 -73739
15035A08116h8926B98007b1784B37022J10684j38960l7552Q9543I627M38578Q4814
$$ 108116 -88926 298007 -21784 237022 347706 208746 171194 260737 9627 448205 533019
15024E33019e0808A62315m5235J13804R498G2262K44854j41845P6758f0273B67576
$$ 533019 -50808 162315 117080 230884 240382 72262 317116 175271 252029 -60273 267576
15012B69862p5117J72650C3312K9021M97792c1529D40828j26067H4152K30698
$$ 269862 194745 367395 33312 62333 560125 -31529 440828 314761 84152 314850
15002C14850r9344L1970K3085O7682j19622J44466f5690A59113J20304C6178K70094
$$ 314850 215506 247476 270561 338243 218621 363087 -65690 159113 279417 36178 306272
14991C06272L1689j04690L4620E3402f0063C64439E8000L35540F6645P8805P0122
$$ 306272 337961 233271 267891 53402 -60063 364439 58000 393540 66645 145450 215572
14980B15572j02524B1640a56522B04087p2021J75872O032K37406B37853l0150
$$ 215572 113048 21640 -156522 204087 132066 307938 313970 551376 237853 207703
14970B07703J73774o0434A5613L30646H653b0751Q733B54403c4681g446B49102
$$ 207703 381477 321043 15613 346259 8653 -20751 -12018 254403 -34681 -7446 249102
14958C98960n0016K46682j47279K7623j90214g1425D39493R6214H4708K43523
$$ 398960 348944 595626 448347 475970 285756 -71425 439493 535707 84708 328231
14948C28231j04091o5387k0075J00688E5930K65325G9636M35596J35014A36821
$$ 328231 224140 158753 138678 239366 55930 321255 79636 515232 650246 136821
14937B99462l0371K0063q4747G1973J41825B4014L81792o657A59540e2613C04743
$$ 299462 269091 289154 204407 71973 213798 24014 405806 399149 159540 -52613 304743
14925B85051L06985q0924j28143j33610o6792N3282I6187J42628n700Q9943A5509
$$ 285051 592036 511112 382969 249359 182567 235849 96187 238815 233115 323058 15509
14913A88171r328K47784j92822R1714r8662E584h922B57856O1429J70967H6202
$$ 188171 178843 426627 233805 325519 226857 5584 -8922 257856 319285 490252 86202
14901F40394B36200J84998k5912j41957r735Q7785j20492K25155n3024K0665N5236
$$ 640394 236200 421198 395286 253329 243594 331379 210887 436042 383018 403683 458919
14890D58919j53379J2651J54980l2292j88196p7326M39673j23563J14949B47824
$$ 458919 305540 318191 473171 440879 252683 175357 615030 491467 606416 247824
14879A79872L85938B68701L03780B78321O2491P5566q8188A32664K6718K22445
$$ 179872 565810 268701 572481 278321 340812 416378 328190 132664 159382 381827
14869C81827L2809K5324P5243j33524j0129D3958L6090M14683G7313J07840J69296
$$ 381827 414636 439960 515203 381679 371550 43958 80048 494731 77313 185153 354449
14858C54449L61336j75397k16606J2127r6317K05878j24734K76064A91115K48336
$$ 354449 715785 540388 323782 335909 239592 445470 320736 596800 191115 439451
14848D39451j50823J79935o0006J11067l6772L2621o9409j38653J58258q5877
$$ 439451 288628 468563 408557 519624 482852 515473 446064 307411 465669 379792
14838C79792K48658q2892M4330k45082j48733L77067k00138m6931l8369K16136
$$ 379792 628450 545558 589888 344806 196073 573140 373002 326071 287702 503838
14828E03838Q7011q0098L9820p7807p4162L49800l15347j13585M47541l79302
$$ 503838 590849 510751 550571 472764 398602 748402 433055 319470 767011 387709
14818C87709K03033l6250J42623j37689J3850B64611M26954k24474J36345k13935
$$ 387709 590742 554492 697115 559426 573276 264611 691565 467091 603436 389501
14808C89501l9939j10489L32019j7725j49924J53423j62809K41453R0246R7593
$$ 389501 349562 239073 571092 553367 403443 556866 394057 635510 725756 823349
14798H23349l62565J58496l5759j22706k12412L89438k40782K75840m6557J78579
$$ 823349 460784 619280 583521 460815 248403 637841 397059 672899 626342 804921
14788H04921j22826K62887m15120n9032J50684P2573j26371M04718l03860K08670
$$ 804921 682095 944982 529862 470830 621514 694087 567716 972434 668574 877244
14778H77244l04112o3335M3891B54864L72175K90495m07141N3595K64392r0815
$$ 877244 573132 509797 553688 254864 627039 917534 510393 563988 828380 737565
14768G37565j23794l2134B78933O62915C12570J49118O52238m74598p3423r476
$$ 737565 613771 581637 278933 941848 312570 461688 1113926 639328 565905 556429
14758E56429K40809j69943J11532O4328j99288J25417j60150L8556j69588J68248
$$ 556429 797238 627295 738827 803155 603867 729284 569134 607690 438102 606350
14748F06350R5181j0409k92515L33281J4893l5990n3281L80790l22303j58827
$$ 606350 701531 691122 398607 731888 746781 710791 657510 1038300 715997 557170
14738E57170K29574M805k5767o021p3340K44145l03074M52548k91557j59144k2289
$$ 557170 786744 791549 765782 759761 686421 930566 627492 1080040 788483 629339 607050
14727F07050L80401j12743J41005j3468j34212J35787k05719K3023L91524n56374
$$ 607050 987451 874708 1015713 1002245 868033 1003820 798101 821124 1212648 656274
14717F56274j0608K219K11300k9362j32171m5683K52105K49901n12840J48551
$$ 656274 645666 647885 859185 829823 697652 651969 904074 1153975 641135 789686
14707G89686K8936k29158J04620K76961J22254k67571j73390K26335k29555L03720
$$ 789686 818622 589464 694084 971045 1093299 825728 652338 878673 649118 952838
14697I52838R2646j16590M2505j2982J29664j9250J7068l16288K47901J59311
$$ 952838 1045484 928894 971399 958417 1088081 1068831 1085899 769611 1017512 1176823
14687A176823k9784m1811j63586l5026K38034j05500k58312L45653k53683J39468
$$ 1176823 1147039 1105228 941642 906616 1144650 1039150 780838 1126491 872808 1012276
14677A012276p5889M57233m27589K12288L78670o42421K17836K66519k36588m94719
$$ 1012276 936387 1393620 966031 1178319 1556989 914568 1132404 1398923 1162335 667616
14667F67616N51065j01082L1395j56222J92052J61682k66773Q3548L902R5795
$$ 667616 1218681 1117599 1148994 992772 1184824 1346506 1079733 1163281 1167183 1262978
14657A262978j30668r4469k8270K11693J99532l32723J60051q4952j04037J76396
$$ 1262978 1132310 1037841 1009571 1221264 1420796 1088073 1248124 1163172 1059135 1235531
14647A235531K09628j49250k12242P329J68029R89l0480J05766j49450r3764M25368
$$ 1235531 1445159 1295909 1083667 1090996 1259025 1260014 1229534 1335300 1185850 1092086 1517454
14636A517454l93620K09563J58605L3365p6450k09777N3739j74480N05193Q923
$$ 1517454 1123834 1333397 1492002 1525367 1448917 1239140 1292879 1118399 1623592 1632515
14626A632515m35953p7285N89642l62697M11267l36116M2730k26329J91019J11470
$$ 1632515 1196562 1119277 1708919 1346222 1757489 1421373 1464103 1237774 1428793 1540263
14616A540263J05073J0210M375m9065k07142n9657K35653K12830j25373J53445
$$ 1540263 1645336 1655546 1659921 1610856 1403714 1344057 1579710 1792540 1667167 1820612
14606A820612l57798K89607R3953l84460L28952K05583n31696L01453K48237m59281
$$ 1820612 1462814 1752421 1846374 1461914 1790866 1996449 1464753 1766206 2014443 1555162
14596A555162K61971o185K08185k33302J63439J37071l45287J68707j82912K24880
$$ 1555162 1817133 1810948 2019133 1785831 1949270 2086341 1741054 1909761 1726849 1951729
14586A951729n5056P475L62164l16864K47211j95882J82247J20224M035k05077
$$ 1951729 1896673 1904148 2266312 1949448 2196659 2000777 2183024 2303248 2307283 2102206
14576B102206M6021j22847L83422k42211J72690K37422k56229O9730j55645J57030
$$ 2102206 2148227 2025380 2408802 2166591 2339281 2576703 2320474 2390204 2234559 2391589
14566B391589p2183K18555M18641l29729L24102l59257L31287o0059M21783k20628
$$ 2391589 2319406 2537961 2956602 2626873 2950975 2591718 2923005 2862946 3284729 3064101
14556C064101L45649M61711J46958J28598J89271N87743J072371J951082L367800
$$ 3064101 3409750 3871461 4018419 4147017 4336288 4924031 5996402 7947484 11315284
14547A1315284Q579460J9159656R365941k2335985A0315669E039714j694520q86646
$$ 11315284 19894744 39054400 48420341 26084356 10315669 5039714 3345194 2458548
14539B458548j29728j61373O1174R5962k49696M4845K09893m7415j61475O8322
$$ 2458548 2328820 2167447 2228621 2324583 2074887 2119732 2329625 2282210 2120735 2189057
14529B189057M63518L45857o75290K32579j72983L96401n01696K27338J65365
$$ 2189057 2652575 2998432 2323142 2555721 2382738 2779139 2277443 2504781 2670146
14520B670146k19781L01668n9320J48100K09635n34412K90333J63712k53733J56705
$$ 2670146 2450365 2752033 2692713 2840813 3050448 2516036 2806369 2970081 2716348 2873053
14510B873053j18787M64319k40956J08616R3315o632j57613Q6355n6648K86379
$$ 2873053 2754266 3218585 2977629 3086245 3179560 3172928 3015315 3101670 3045022 3331401
14500C331401j35897L37261j05741J9732P7654j08748R5783J14164j07010J02976
$$ 3331401 3195504 3532765 3427024 3446756 3524410 3415662 3511445 3625609 3518599 3621575
14490C621575J20763L6804J27013j04911K53121j79229r3260K34500Q7666K37301
$$ 3621575 3742338 3779142 3906155 3801244 4054365 3875136 3781876 4016376 4104042 4341343
14480D341343k590j41083J58418l24414J44116M44045k54013J76355K49946L47694
$$ 4341343 4338753 4197670 4356088 4031674 4175790 4619835 4365822 4542177 4792123 5139817
14470E139817k99391j94403J68270K7260O8390J25352o1702j55294J98639j42627
$$ 5139817 4840426 4646023 4814293 4841553 4909943 5035295 4973593 4818299 5016938 4874311
14460D874311J96061L67345k19093K51505j57536J71981L01512p5437M8843q4027
$$ 4874311 5070372 5437717 5218624 5470129 5312593 5484574 5786086 5710649 5759492 5675465
14450E675465K07642j45666J71960L9420J51362J07246L15513Q9090j88730N885
$$ 5675465 5883107 5737441 5909401 5948821 6100183 6207429 6522942 6612032 6423302 6429187
14440F429187o8520K55047K23215j00961M26700l69912K70287J19344J61031j2033
$$ 6429187 6360667 6615714 6838929 6737968 7164668 6794756 7065043 7184387 7345418 7333385
14430G333385j81254K65109P57839n10965K38632J29386M39944l21556J19673
$$ 7333385 7152131 7417240 8175079 7664114 7902746 8032132 8472076 8150520 8270193
14421H270193M28331L30061o1602m62655N12007O42L71565J30100k657O9113K26271
$$ 8270193 8698524 9028585 8966983 8504328 9016335 9016977 9388542 9518642 9515985 9585098 9811369
14410I811369k35720Q48034k81311J41346R570O15246L7134k28913K79464J77772
$$ 9811369 9575649 10423683 10142372 10283718 10293288 10908534 10945668 10716755 10996219 11173991
14400A1173991K29085L36295N046N95238k0234J11937J36310N80359J22643J08307
$$ 11173991 11403076 11739371 11744417 12339655 12319421 12431358 12567668 13148027 13270670 13378977
14390A3378977O11498N535j26625P84172P9059O9069J82266O51353J25939L88157
$$ 13378977 13990475 13996010 13869385 14653557 14732616 14801685 14983951 15635304 15761243 16149400
14380A6149400N3195P63024J32437N1000L01952K91443N87259O4777R80984P7361
$$ 16149400 16202595 16965619 17098056 17149056 17451008 17742451 18329710 18394487 19375471 19452832
14370A9452832Q6107O26876N13586K70120K98422O70530K48839K99130M63655
$$ 19452832 19538939 20165815 20679401 20949521 21247943 21918473 22167312 22466442 22930097
14361B2930097Q79287K16594O66504O89876L03086O81541L13897Q64047P35072
$$ 22930097 23809384 24025978 24692482 25382358 25685444 26366985 26680882 27544929 28280001
14352B8280001N67196N74982Q91764O64027P81674J057094L56329R69675Q84666
$$ 28280001 28847197 29422179 30313943 30977970 31759644 32816738 33173067 34142742 35027408
14343C5027408Q77130J051066Q85902Q92406J183833J202945R17374J507546J240813
$$ 35027408 35904538 36955604 37841506 38733912 39917745 41120690 42038064 43545610 44786423
14334D4786423J485926J451076J271766J289589J630475J732281J523479J742168
$$ 44786423 46272349 47723425 48995191 50284780 51915255 53647536 55171015 56913183
14326E6913183J816287K085380K063622K085977K556047K258066K494036K388226
$$ 56913183 58729470 60814850 62878472 64964449 67520496 69778562 72272598 74660824
14318G4660824K554092K851148K952978L419826L096571L565095L472740M152498
$$ 74660824 77214916 80066064 83019042 86438868 89535439 93100534 96573274 100725772
14310A00725772M019546M422464M318890M935025M942785N679547N703053O027466
$$ 100725772 104745318 109167782 113486672 118421697 123364482 129044029 134747082 140774548
14302A40774548O476072O651511P163798P422596P719593Q723606Q942199R128484
$$ 140774548 147250620 153902131 161065929 168488525 176208118 184931724 193873923 203002407
14294B03002407J0316596R925683J1225574J1342344J2263566J2239988J3156897
$$ 203002407 213319003 223244686 234470260 245812604 258076170 270316158 283473055
14287B83473055J3213021J3935000J4310586J4443240J4708632J4515616J4819586
$$ 283473055 296686076 310621076 324931662 339374902 354083534 368599150 383418736
14280C83418736J4097583J4067497J3137834J2339677J1237922R366134P878654
$$ 383418736 397516319 411583816 424721650 437061327 448299249 457665383 465544037
14273D65544037N350479J726969q76418k050988k886828l338283n555705q122133
$$ 465544037 470894516 472621485 471745067 469694079 466807251 463468968 457913263 449791130
14265D49791130r418900j0990694j2654861j4119901j4407963j5150903j5454504
$$ 449791130 440372230 429381536 416726675 402606774 388198811 373047908 357593404
14258C57593404j5836067j5291071j5341336j4425548j3221747j3607615j3170572
$$ 357593404 341757337 326466266 311124930 296699382 283477635 269870020 256699448
14251B56699448j2524469j1848653j1339129j0452748j0304828r211150r168803
$$ 256699448 244174979 232326326 220987197 210534449 200229621 191018471 181849668
14244A81849668q145179q015073p715099p163505o927794o473121n316803n498717
$$ 181849668 173704489 165689416 157974317 150810812 143883018 137409897 132093094 126594377
14236A26594377n418287n473576m526765m901382m035810l589976l720640l562055
$$ 126594377 121176090 115702514 111175749 106274367 102238557 98648581 94927941 91365886
14228I1365886l781261l336854l475624k720204k849871k813937k376643k103397
$$ 91365886 87584625 84247771 80772147 78051943 75202072 72388135 70011492 67908095
14220F7908095k270518k293339j969530k183020j909118j799115j167952j519106
$$ 67908095 65637577 63344238 61374708 59191688 57282570 55483455 54315503 52796397
14212E2796397j893582j754720j480645j255981j422279n14081j075758j803064
$$ 52796397 50902815 49148095 47667450 46411469 44989190 44475109 43399351 41596287
14204D1596287j012465j124737j175035o46393p56026j237682j006166j411594
$$ 41596287 40583822 39459085 38284050 37637657 36881631 35643949 34637783 33226189
14196C3226189n14465p27137q23384n39822j051514q44389m17848p27341m53058
$$ 33226189 32711724 31984587 31161203 30621381 29569867 28725478 28307630 27580289 27127231
14187B7127231p83143o75337n72287p18252n33577j7637j168211j28662l47037
$$ 27127231 26344088 25668751 25096464 24378212 23844635 23826998 22658787 22530125 22183088
14178B2183088n70496k91436o56614o27738n16158j55194m77273m6802o93240
$$ 22183088 21612592 21321156 20664542 20036804 19520646 19365452 18888179 18841377 18148137
14169A8148137n06825J71863p32306k92305j38862j29862l70353j79320p71263
$$ 18148137 17641312 17813175 17080869 16788564 16649702 16519840 16149487 15970167 15198904
14160A5198904j21545j16247k25262l33617j42937k78460j31347J12627q72506
$$ 15198904 15077359 14961112 14735850 14402233 14259296 13980836 13849489 13962116 13089610
14151A3089610n0139j57049J00762m44710l95310P9069j95865l68165J69057l99713
$$ 13089610 13039471 12882422 12983184 12538474 12143164 12222233 12026368 11658203 11827260 11427547
14141A1427547j99066l09201k4015J39908m86307k51274O7970K13056m02610m26973
$$ 11427547 11228481 10919280 10895265 11035173 10548866 10297592 10365562 10578618 10176008 9749035
14131I749035M9553k05810m59317J85954K87744m24885M2466j48341l07906j3939
$$ 9749035 9798588 9592778 9133461 9319415 9607159 9182274 9224740 9076399 8768493 8754554
14121H754554m05537O81J20883l05069m852Q3632m85814J01156n26230L55241
$$ 8754554 8349017 8349698 8470581 8165512 8160660 8244292 7758478 7859634 7333404 7688645
14111G688645k21772Q7313m05612R3733k11257J86252m15548q826L25587m32256
$$ 7688645 7466873 7554186 7148574 7242307 7031050 7217302 6801754 6792928 7118515 6686259
14101F686259J63350j16443j40187k64731o926j52308l94608J95832K43567l33627
$$ 6686259 6849609 6733166 6592979 6328248 6321322 6169014 5774406 5970238 6213805 5880178
14091E880178j39606K72988l38815o200M0561k51560N6664p116k87307R5307L4936
$$ 5880178 5740572 6013560 5674745 5668545 5709106 5457546 5514210 5507094 5219787 5315094 5350030
14080E350030q2634M24122p12357N1931j35204j34268L86784l03060p8476o7710
$$ 5350030 5267396 5691518 4979161 5031092 4895888 4761620 5148404 4845344 4766868 4699158
14070D699158P8887r0280q7070K70228o11942J34972j42374l724K95465k49104
$$ 4699158 4778045 4687765 4600695 4870923 4258981 4393953 4251579 4247855 4543320 4294216
14060D294216K50897l9899k39182L80880o23134M5035M63605o46107M56315o85098
$$ 4294216 4545113 4505214 4266032 4646912 4023778 4068813 4532418 3886311 4342626 3657528
14050C657528J91911n1279L24028n40574k09932K87487J15288P7188m47265R8873
$$ 3657528 3849439 3798160 4122188 3581614 3371682 3659169 3774457 3851645 3404380 3503253
14040C503253k78231K83457K69098l84941J83190l88902Q9280J29347j78325L26740
$$ 3503253 3225022 3508479 3777577 3392636 3575826 3186924 3276204 3405551 3227226 3553966
14030C553966p1407l50373J44485K2215k02790P7431j33860j4021J23289k99044
$$ 3553966 3482559 3132186 3276671 3298886 3096096 3173527 3039667 3025646 3148935 2849891
14020B849891k2127N2890J74354n12717M41819j90162K43816m35102P5052q7905
$$ 2849891 2827764 2880654 3055008 2542291 2984110 2793948 3037764 2602662 2677714 2589809
14010B589809j01683J79957j22107m57767Q32440k98174n7353J08325k45851p4892
$$ 2589809 2488126 2668083 2545976 2088209 2920649 2622475 2565122 2673447 2427596 2352704
14000B352704j16315l5007K28624j46470j40478K82895o7324J98740N048K82931
$$ 2352704 2236389 2201382 2430006 2283536 2143058 2425953 2358629 2557369 2562417 2845348
13990B845348M12693K37166K767537O500471J7814723J6395424j6921785j4921797
$$ 2845348 3258041 3495207 6262744 12763215 30577938 46973362 30051577 15129780
13982A5129780o072823k325624j364996o06112q57062j67561n10776k40081m7242
$$ 15129780 9056957 6731333 5366337 4760225 3903163 3735602 3224826 2984745 2937503
13973B937503r7487k26144J16483O1436k58411M90407l13853j26698l57813p3771
$$ 2937503 2840016 2613872 2730355 2791791 2533380 3023787 2709934 2583236 2225423 2151652
13963B151652J77567J23972m9273l39380J40749P1658j59831M9745J4320j79440
$$ 2151652 2329219 2453191 2403918 2064538 2205287 2276945 2117114 2166859 2181179 2001739
13953B001739J73435k16319M25191J33162p52547M35514j33665j8828K68747j97693
$$ 2001739 2175174 1958855 2384046 2517208 1764661 2200175 2066510 2047682 2316429 2118736
13943B118736J05223O1806l742k54205m28552K98569P2291l31557N50857m14775
$$ 2118736 2223959 2285765 2282023 2027818 1599266 1897835 1970126 1638569 2189426 1774651
13933A774651n0052J35026K84461n19874L05169j13961j30387k9701j8964K35602
$$ 1774651 1724599 1859625 2144086 1624212 1929381 1815420 1685033 1655332 1636368 1871970
13923A871970l5654p5035Q2827k69133j00010j31094M77450n6779k83506J90611
$$ 1871970 1836316 1761281 1844108 1574975 1474965 1343871 1821321 1764542 1481036 1671647
13913A671647j10975j28888K68673P426j54251K1671J26974j76932m3107l61457
$$ 1671647 1560672 1431784 1700457 1707883 1553632 1575303 1702277 1525345 1482238 1120781
13903A120781j4562M29058N3239p7180K9956J86180l76661J91973l61199L78533
$$ 1120781 1106219 1535277 1588516 1511336 1541292 1727472 1350811 1542784 1181585 1560118
13893A560118J35113j32282j44233L8958q8682k503Q4258L1681j7836j39314j56039
$$ 1560118 1695231 1562949 1418716 1457674 1368992 1366489 1450747 1482428 1464592 1325278 1169239
13882A169239K01781J45652l03717J38254k98699K4430J73510M1659J09979p4626
$$ 1169239 1371020 1516672 1212955 1351209 1052510 1076940 1250450 1292109 1402088 1327462
13872A327462j36143K33758j93159l37287M56669k3474l26479R5929l71388N78963
$$ 1327462 1191319 1425077 1231918 894631 1351300 1327826 1001347 1097276 725888 1304851
13862A304851j26931J46852P9916j50702j15741J86962l43106J69168K58528j70206
$$ 1304851 1177920 1324772 1404688 1253986 1138245 1325207 982101 1151269 1409797 1239591
13852A239591k9855j24758k74371K28946r967O3606j8449Q1101J03341o7589k7042
$$ 1239591 1209736 1084978 810607 1039553 1029586 1093192 1074743 1155844 1259185 1191596 1164554
13841A164554L04893m64010m4969j52271L93169l46021K21352m8460k56836L26839
$$ 1164554 1469447 1005437 960468 808197 1201366 855345 1076697 1028237 771401 1098240
13831A098240j36991J51267j17133j90439L23240n3137L7816j61489k43210L04847
$$ 1098240 961249 1112516 995383 804944 1128184 1075047 1112863 951374 708164 1013011
13821A013011m8800P6817j29809r2572O65133o14977P0075J01749l89322M90781
$$ 1013011 964211 1041028 911219 818647 1483780 868803 938878 1040627 651305 1142086
13811A142086j90542n294K05664Q8102l37813r6443M474n5015K56807J00213J23430
$$ 1142086 951544 946250 1151914 1240016 902203 805760 810234 755219 1012026 1112239 1235669
13800A235669m82594N8715J79258n0956q8156l2376J39389k70353Q4321J57785
$$ 1235669 753075 811790 991048 940092 851936 819560 958949 688596 772917 930702
13790I30702K6089m910j10947j4924R4297j58051j29808J7174J46830J35261j34613
$$ 930702 956791 951881 840934 826010 920307 762256 632448 649622 796452 931713 797100
13779G97100o2906L04340j97191O9972j68429M36751j30775l10628j84385P7775
$$ 797100 734194 1038534 841343 911315 742886 1179637 1048862 738234 553849 631624
13769F31624L30153Q1275j25559p0619k15937K77404p2661l69269R1545J75386
$$ 631624 961777 1043052 917493 846874 630937 908341 835680 466411 557956 733342
13759G33342J51291o7752m02323L46249P8021q3719L9944k65644L19825J37862
$$ 733342 884633 816881 414558 760807 838828 755109 795053 529409 849234 987096
13749I87096j25058m12242J24538K57441R5374k45571q63K1497k13196K90529
$$ 987096 862038 449796 574334 831775 927149 681578 680715 702212 489016 779545
13739G79545j9756k78767r2581L00976k39018J36317J14520J86401k65249p0427
$$ 779545 759789 481022 388441 689417 450399 586716 701236 887637 622388 551961
13729E51961j7129q9605j0038M46185j58186j19749r0459o8395M3299J07596r5030
$$ 551961 534832 445227 435189 881374 723188 603439 512980 444585 487884 595480 500450
13718E00450K59613m1798C49763K98671m7197J085j88847K5508J15725J19270
$$ 500450 760063 718265 349763 648434 601237 602322 413475 438983 554708 673978
13708F73978l04024M89305C78789J92966J66673j84360J72563O5006k48008J1370
$$ 673978 369954 859259 378789 571755 738428 554068 726631 791637 543629 554999
13698E54999R9980J60273l41636k9469m9351L74196C05222L19043j7691J78238
$$ 554999 654979 815252 473616 444147 394796 768992 305222 624265 606574 784812
13688G84812J97091q0139D22192A59287K31905j39516O2849K7728K25031q3882
$$ 784812 981903 901764 422192 159287 391192 251676 314525 342253 567284 483402
13678D83402l1055K7242n3997K18465p8992k42199J65670L6178K04729l22473
$$ 483402 452347 479589 425592 644057 565065 322866 488536 524714 729443 406970
13668D06970J16856k43322N44244j06445l00706m9494k9001n364K27783j28910
$$ 406970 523826 280504 824748 718303 417597 368103 339102 333738 561521 432611
13658D32611K20341j71950J23169j6079o6135k16357K10883J75987l40858J75122
$$ 432611 652952 481002 604171 588092 521957 305600 516483 692470 351612 526734
13648E26734J13690j43600o7673q8716A3977N87679P4191B48068L34891M8857
$$ 526734 640424 496824 429151 340435 13977 601656 675847 248068 582959 631816
13638F31816j85038j46409o9373J00190O3193k060J80350n6779J47026P6688k49835
$$ 631816 446778 300369 230996 331186 394379 392319 572669 515890 662916 739604 489769
13627D89769n9955P9985r2075Q2576A36472L64877E5500K36053L7207l9674L02298
$$ 489769 429814 509799 417724 500300 136472 501349 55500 291553 328760 289086 591384
13616E91384j07837j63508J29805l7085P5631l3300L59388l64310J47447p7628
$$ 591384 483547 320039 449844 412759 488390 455090 814478 450168 597615 519987
13606E19987A53000N73314B56547K38115p232J0072r3584P3686o926j91990K05426
$$ 519987 153000 726314 256547 494662 487430 497502 403918 477604 470678 278688 484114
13595D84114P0347m2361j8397A51147J64547J13132P0911R8992A91217K70060
$$ 484114 554461 512100 493703 151147 315694 428826 499737 598729 191217 461277
13585D61277R422J33789j72334M749j80172I2684K52117j35007M4119J02935o6120
$$ 461277 470699 604488 432154 436903 256731 92684 344801 209794 253913 356848 290728
13574B90728L09714k68179A49601K43010p1902J63342A80981p3649c4055A11237
$$ 290728 600442 332263 149601 392611 320709 484051 180981 107332 -34055 111237
13563B51141q077K43050B07994J31506j42143J98002M6771l947L3431j82928J54766
$$ 251141 243064 486114 207994 339500 197357 395359 442130 438183 471614 288686 443452
13552D43452j70345P0280J08285j87864n7074J47911o4105N04407l30315B09614
$$ 443452 273107 343387 451672 263808 206734 354645 290540 794947 464632 209614
13541I1404n733k5969J26428l6646j9039n7902N15243A22270K83879r5624m3536
$$ 91404 85671 59702 186130 149484 130445 72543 587786 122270 406149 310525 266989
13530B66989A33431J49285O3341j12454J05913K7754J97487k18588M62279A64278
$$ 266989 133431 282716 346057 233603 339516 367270 564757 346169 808448 164278
13519D83573j2559A54608K20520P885k1068p620l6325n1648J42421J87326H9847
$$ 483573 471014 154608 375128 383013 361945 354325 318000 266352 408773 596099 89847
13507i4168D33043k8693A04877J67218r4292L24957k44688A18901P5765K1165
$$ -94168 433043 404350 104877 272095 177803 502760 258072 118901 194666 215831
13497B15831H6850P2149K367M49694j80695q0019A54341N37265B66183C0423L73939
$$ 215831 86850 158999 161366 611060 430365 350346 154341 691606 266183 30423 404362
13486D04362A65486l3446K50187J95080A46388J5018G0205L76549I0008J68729
$$ 404362 165486 132040 382227 577307 146388 161406 70205 446754 90008 258737
13476B58737N6106c0061C50334j52998J11922m7136p8913J05525J75938p8620
$$ 258737 314843 -30061 350334 197336 309258 262122 183209 288734 464672 386052
13466C86052a6858D34786I6672N4358K13228A31494J44130j28761K25917j8004
$$ 386052 -16858 434786 96672 151030 364258 131494 275624 146863 372780 354776
13456C54776A60861P9317l3668a05228B66954J7116L9290j11601q61K68642j48882
$$ 354776 160861 240178 206510 -105228 266954 284070 323360 211759 210898 479540 330658
13445C30658J21806e9286C35023j55040a4425C55084D5542M3103h3436D19023
$$ 330658 452464 -59286 335023 179983 -14425 355084 45542 88645 -83436 419023
13434A46341K42205J9008A89994G7147J24868K3892K74822E1985L03442a75394
$$ 146341 388546 407554 189994 77147 202015 225907 500729 51985 355427 -175394
13423C24280A57K10143L21493Q8123B04459j5741p8331J04433M07377A16795Q6287
$$ 324280 157 210300 531793 619916 204459 188718 110387 214820 622197 116795 203082
13412B03082m8408K60595j36237I5753c5469D72792p7295J04008A34120K1746
$$ 203082 154674 415269 279032 95753 -35469 472792 395497 499505 134120 155866
13402A55866J38817a16918F25217A11045h033C94804o2721O3762j52289r9048
$$ 155866 294683 -116918 625217 111045 -8033 394804 332083 395845 243556 144508
13392A44508N14244q3413B42086Q1471A47644P6948n3087q926J28333l0420l6954
$$ 144508 658752 575339 242086 323557 147644 224592 171505 162579 290912 260492 223538
13381B23538J48741j84267J36914b64741H034M2271K28452L6546p8080J65720
$$ 223538 372279 188012 324926 -264741 8034 50305 278757 315303 237223 402943
13371D02943a7117B67240K14160J9697n0765j94824j17700M2463q0487K86529
$$ 402943 -17117 267240 481400 501097 450332 255508 137808 180271 99784 386313
13361C86313r1038q9624K2181R1292L0238j03187J03792A48681E244K83131J6913
$$ 386313 295275 205651 227832 319124 349362 246175 349967 148681 5244 288375 305288
13350C05288K553K6133L4545j65062L8184L12908B65931J8100L44530G0496K25888
$$ 305288 307841 333974 368519 203457 241641 554549 265931 284031 628561 70496 296384
13339B96384J79664A79941O4858J00474j53806D1055b12702c7B06399O4228Q5737
$$ 296384 476048 179941 244799 345273 191467 41055 -212702 -37 206399 270627 356364
13328C56364k8339O413M956A56946Q6435j05217R9728l2869j607J00078F2987
$$ 356364 328025 334438 339394 156946 243381 138164 237892 205023 203416 303494 62987
13316A46532o4527J96956J24699m9282C2411J31917l230n5338J51263I9784f4856
$$ 146532 82005 278961 403660 354378 32411 164328 161098 105760 257023 99784 -64856
13304c311C5801L06896A40111F8369J66509L9487j25387d414j13344D7456P5547
$$ -3311 35801 342697 140111 68369 234878 274365 148978 -4414 -117758 47456 123003
13293A23003m9105M2482K59340J9110q3232A52061a22262B92249m6129j03478
$$ 123003 73898 116380 375720 394830 311598 152061 -122262 292249 246120 142642
13283A42642o9910k7879L7348j5561J8311N0670l3915L90712e0504B30979q9644
$$ 142642 72732 44853 82201 66640 84951 135621 101706 492418 -50504 230979 141335
13272A41335Q2823o1385j444J3576o7989i3730D39382j17821m4969q1047A1989
$$ 141335 224158 162773 161329 174905 106916 -93730 439382 321561 276592 195545 11989
13260B5893K24518J00596d9032C04397A11871b03080B12786J40888Q7762D0615
$$ 25893 250411 351007 -49032 304397 111871 -203080 212786 353674 441436 40615
13249B01726F4853K34978j29736m0o5188J38532j06882n268d6937G4859K63182
$$ 201726 64853 299831 170095 170055 104867 243399 136517 131249 -46937 74859 338041
13238C38041A17998P0943J701l0907J82479A03827K6257D7505J50180J9475p7210
$$ 338041 117998 188941 190642 159735 342214 103827 130084 47505 197685 217160 139950
13227A39950g9803B45093a80843A31356o1002M23192f9076C63421A33850c7374
$$ 139950 -79803 245093 -180843 131356 70354 493546 -69076 363421 133850 -37374
13216a24460D68872m9507j94675G3528K05780A31309e4110A00229J20851F7371
$$ -124460 468872 419365 224690 73528 279308 131309 -54110 100229 221080 67371
13205C81865a01410C16695d9915A49122c08126b5416A05970K2234D9595L3933
$$ 381865 -101410 316695 -49915 149122 -308126 -25416 105970 128204 49595 83528
13195H3528g7385C09479j16404R4512A1495A913R7918B9477L10444j51067J47528
$$ 83528 -77385 309479 193075 287587 11495 1913 99831 29477 339921 188854 336382
13184C36382a09747C04803j43832J6444a56122a0782B80918F9032P2129b22731
$$ 336382 -109747 304803 160971 177415 -156122 -10782 280918 69032 141161 -222731
13173C56176j13597m5952k0729P4289K9861j738j04165b0269q0522E1228J14518
$$ 356176 242579 196627 175898 250187 280048 278310 174145 -20269 -100791 51228 165746
13162A65746D6875M29787B14734j02043r807h3504E7337J07736h9783g309j20808
$$ 165746 46875 476662 214734 112691 102884 -83504 57337 165073 -89783 -7309 -128117
13151a28117A93638e9616K7505p0926A66304h2221B06959Q0781O3034H0917b70077
$$ -128117 193638 -59616 -32111 -103037 166304 -82221 206959 287740 350774 80917 -270077
13139B45138i2797B41128B3617b018o6769j04319D12958j65502D7091D844Q54
$$ 245138 -92797 241128 23617 -2018 -68787 -173106 412958 247456 47091 4844 5698
13128E698J00351a38452A35115n3976c45682E3805a04895A73363F8716K61640
$$ 5698 106049 -138452 135115 81139 -345682 53805 -104895 173363 68716 330356
13118C30356b08832G9262a9582A67975i1023H4307l2648Q5921c2182r1420A44431
$$ 330356 -208832 79262 -19582 167975 -91023 84307 51659 137580 -32182 -123602 144431
13106a21091L2139A92190a9640B98360J31357b55029f574D11202K15204C11497
$$ -121091 -88952 192190 -19640 298360 429717 -255029 -6574 411202 626406 311497
13095B16335a34025j31940a4139q1353B64854H3393K34931E9080a9177p2679A19016
$$ 216335 -134025 -265965 -14139 -95492 264854 83393 318324 59080 -19177 -91856 119016
13083a08177l6849C9799e2190H8489K05889n6400Q1463a99975B06869K57285H4744
$$ -108177 -145026 39799 -52190 88489 294378 237978 319441 -199975 206869 464154 84744
13071B51600d3033A60948j9554N0075p1994Q5252J3458c7785C9340K06646g3508
$$ 251600 -43033 160948 141394 191469 119475 204727 218185 -37785 39340 245986 -73508
13059C62879d142A93833o8022N7798J54553R5791A24765a2161E15177b863F8379
$$ 362879 -4142 193833 125811 183609 338162 433953 124765 -12161 515177 -2863 68379
13047G1293M8723j2873M3823r889e0493D35796c699j4716B08328n3106h3960k49697
$$ 71293 120016 107143 150966 141077 -50493 435796 -3699 -18415 208328 155222 -83960 -333657
13035c33657b0607B72898C2502R1948K71011n1398A49198O6304J17437I6749K57372
$$ -333657 -20607 272898 32502 124450 395461 344063 149198 215502 332939 96749 354121
13024C54121K3541j19643A22818D8221a06031E2780d8769k74944H4515a53565
$$ 354121 377662 258019 122818 48221 -106031 52780 -48769 -323713 84515 -153565
13013b21737D5311J6755J95834K17555e8898B62353j15974J95038A53836J87045
$$ -221737 45311 62066 257900 475455 -58898 262353 146379 341417 153836 340881
13003C40881H5083P2620B2874P3266m3500L67708m6092c43973B74409j11738b8884
$$ 340881 85083 157703 22874 96140 52640 420348 374256 -343973 274409 162671 -28884
12991h4545C94954a74299A29678K28765c24380C9657a08932G0240a74506f0452
$$ -84545 394954 -174299 129678 358443 -324380 39657 -108932 70240 -174506 -60452
12980D4180L0759B8454f286A91766k9034J54971A01529l6913P0920E4185e5136
$$ 44180 74939 28454 -6286 191766 162732 317703 101529 64616 135536 54185 -55136
12968c12808i3560A25114m4167L4227J38182F6384a90828A0725a89600A75051
$$ -312808 -93560 125114 80947 115174 253356 66384 -190828 10725 -189600 175051
12957B07371G6667c8902B20272N6580A05078L67157a41265d8778k3167C52758
$$ 207371 76667 -38902 220272 276852 105078 472235 -141265 -48778 -71945 352758
12946E3820f8529B48723C7184C552a61219B71592Q3322B095h8498c5612B3642
$$ 53820 -68529 248723 37184 3552 -161219 271592 354914 2095 -88498 -35612 23642
12934a94573c0544B57000G647c2322B30861K6774a29635I287L43551H9823d259
$$ -194573 -30544 257000 7647 -32322 230861 257635 -129635 9287 352838 89823 -4259
12922g7493B9350e2058B29946A1954b9937j81653B60190e5613k6215C47741b6481
$$ -77493 29350 -52058 229946 11954 -29937 -211590 260190 -55613 -81828 347741 -26481
12910a55045a1266I0800k4086h3937B7094K3364J64726q132N6880B7567b70925
$$ -155045 -11266 90800 66714 -83937 27094 50458 215184 207052 263932 27567 -270925
12898C32493a62588L1147j82C90772a80912F7200a98753B18698p3206a22652B09904
$$ 332493 -162588 -131441 -131623 390772 -180912 67200 -198753 218698 145492 -122652 209904
12886F7633i9955B05378C2866J24184A3218J0460a7458p6857M1166r1141o495
$$ 67633 -99955 205378 32866 157050 13218 23678 -17458 -94315 -53149 -144290 -150785
12875a50785A82204J5526a24589A08347K480L4414b9746G0007J34199a25892E5653
$$ -150785 182204 197730 -124589 108347 110827 145241 -29746 70007 204206 -125892 55653
12863A05335M4008k5919a38979A67981c0980q1431I9688K3521a67589A27966a52406
$$ 105335 149343 123424 -138979 167981 -30980 -112411 99688 123209 -167589 127966 -152406
12851B1234L04251H4698k8200K5686a13967b6227e303F4111R8509Q1129Q8624
$$ 21234 325485 84698 56498 82184 -113967 -26227 -5303 64111 162620 243749 332373
12840C32373Q015I3680a19405B2727N7191K81083A16311K54403A06038c7842q1670
$$ 332373 340388 93680 -119405 22727 79918 361001 116311 370714 106038 -37842 -119512
12829a19512e3256A48678g7393m0999d6299j71057a6867n3200A85853c61766B39641
$$ -119512 -53256 148678 -77393 -118392 -46299 -217356 -16867 -70067 185853 -361766 239641
12817b51358E2038f5393B61313F65L0654J25620f3643B23265J04697a23620B88748
$$ -251358 52038 -65393 261313 665 31319 156939 -63643 223265 327962 -123620 288748
12805a36090e753H9328N987a95184B81580h883E9393J06939k8768h9566B34061
$$ -136090 -5753 89328 95315 -195184 281580 -8883 59393 166332 137564 -89566 234061
12793c7407m57266g3408D0254L79062h7722k5490I1279f0977p7717G5818B3468
$$ -37407 -494673 -73408 40254 419316 -87722 -113212 91279 -60977 -138694 75818 23468
12781E8800a51158A38199k0816D1749J7600e9746A13783o491b89408F3118a13810
$$ 58800 -151158 138199 117383 41749 59349 -59746 113783 107292 -289408 63118 -113810
12769B09530H9270B1912d5589b2109j81060r103A15177g6614j10546A61639G7910
$$ 209530 89270 21912 -45589 -22109 -203169 -212272 115177 -76614 -187160 161639 77910
12757I6631n956k7072J49133C3764c71080A58628h0224B0406d1100j09204F2313
$$ 96631 90675 63603 212736 33764 -371080 158628 -80224 20406 -41100 -150304 62313
12745c45975B79462j15192a754F5476M1316l097B2875N8306J56648A0408N6718
$$ -345975 279462 164270 -1754 65476 106792 103695 22875 81181 237829 10408 67126
12734F7126C551J42832a65902A27018l2828J18023A05621e0888C31531A4353a55635
$$ 67126 3551 146383 -165902 127018 94190 212213 105621 -50888 331531 14353 -155635
12722a28896J6202n9326g7177j52451j13165J25065B22550B7767J30503D6115
$$ -128896 -112694 -172020 -77177 -229628 -342793 -217728 222550 27767 158270 46115
12711d015A55805P6906O491j1786K15779A66937j0572j8245Q786m2033J13764
$$ -4015 155805 232711 239202 227416 443195 166937 156365 138120 146906 104873 218637
12700B18637a18589n5964A17262K34050K77428a31186G5675K10761G525e2497
$$ 218637 -118589 -174553 117262 351312 628740 -131186 75675 286436 7525 -52497
12689B56395b96A66498d7821B74906o2012a59465A40411A8298a63606A96672l2357
$$ 256395 -296 166498 -47821 274906 212894 -159465 140411 18298 -163606 196672 164315
12678A64315a82749C06269A29251a9418A84468C1323R1810M0723O092K20319A55863
$$ 164315 -182749 306269 129251 -19418 184468 31323 123133 163856 169948 390267 155863
12666a97192j2843j0500o4351J16583D14350a51618D7118J51342b21004C19104
$$ -197192 -210035 -220535 -284886 -168303 414350 -151618 47118 198460 -221004 319104
12655A99927C2659M7954L20414A21049d9518a2712A06833F544i6506A7770h7996
$$ 199927 32659 80613 401027 121049 -49518 -12712 106833 6544 -96506 17770 -87996
12643b19913b0307C50226A34970a64210B01574c903n1835I0630N0814L49057k07659
$$ -219913 -20307 350226 134970 -164210 201574 -3903 -55738 90630 141444 490501 282842
12632B82842I6967N8135A650K12750q9665i5977K1081G337L45856O4887P1104
$$ 282842 96967 155102 1650 214400 124735 -95977 -74896 7337 353193 418080 489184
12621D89184a3045A92113F8502P4660k9046a75655K7979H4968b95346c673A51239
$$ 489184 -13045 192113 68502 143162 114116 -175655 -147676 84968 -295346 -3673 151239
12609A05839M1400l2700A6231d0874k6384B3224a35841A92087l3344c4234A54231
$$ 105839 147239 114539 16231 -40874 -67258 23224 -135841 192087 158743 -34234 154231
12597B43333O3986d8437A33918R9893f8905B84189J85976o2577b07967d1697j47114
$$ 243333 307319 -48437 133918 233811 -68905 284189 470165 407588 -207967 -41697 -188811
12586a88811A30332e3981A66691p4448k1625O5030K0096O815D0988I266a00483
$$ -188811 130332 -53981 166691 92243 70618 135648 155744 162559 40988 9266 -100483
12574C81098j47001F0532J87327P1552E7522K3284a85175A0201a25410F9330P5092
$$ 381098 234097 60532 247859 319411 57522 80806 -185175 10201 -125410 69330 144422
12563A44422n5499a20743c7148j03375K708j01645C6725P4716e4186k14141e4300
$$ 144422 88923 -120743 -37148 -140523 -137815 -239460 36725 111441 -54186 -268327 -54300
12551g223k892m2950l6095A33317K26436j51451D287h4396k56183A05913I330
$$ -7223 -10115 -53065 -89160 133317 359753 208302 4287 -84396 -340579 105913 9330
12539D4194j4449c10760A27284J6990M3709b26129C15684f3764D71962a2287j13330
$$ 44194 29745 -310760 127284 144274 187983 -226129 315684 -63764 471962 -12287 -125617
12528a25617G7528P3949Q9175J0421i2270D36087d195G3602L5384b35336B05334
$$ -125617 77528 151477 240652 251073 -92270 436087 -4195 73602 108986 -235336 205334
12516a28299B02972b7532l8458B98743J85130C4964a16553c4925B40578a2565
$$ -128299 202972 -27532 -65990 298743 483873 34964 -116553 -34925 240578 -12565
12505c6471E1448R3203J4980g5939C13819e5873A16192e590j62838c2640l8121
$$ -36471 51448 144651 159631 -75939 313819 -55873 116192 -5590 -168428 -32640 -70761
12494g0761C7004Q1001f9170B2180a96248B9679N5379h6556r4743A04161b97808
$$ -70761 37004 118005 -69170 22180 -196248 29679 85058 -86556 -181299 104161 -297808
12482a49499H8805K80200g891I2321K81972j30635b33833B52595J40646E6359
$$ -149499 88805 369005 -7891 92321 374293 243658 -233833 252595 393241 56359
12471D9930j5375b31191M075R9931A10419b69940a8694l2187j31551E4182i8368
$$ 49930 34555 -231191 -227116 -127185 110419 -269940 -18694 -50881 -182432 54182 -98368
12459b94737a14752b6035A29409d07541A2211k366f2048A90473P7502a73722A21077
$$ -294737 -114752 -26035 129409 -407541 12211 9845 -62048 190473 267975 -173722 121077
12447c07884A80434G3585a36342I9878Q560c33009A00334r195h54j62685O5144
$$ -307884 180434 73585 -136342 99878 108438 -333009 100334 91139 -854 -163539 -98395
12436i8395B15294E8495J2503c12942a49900e4167j0452j47619F3887J07543b99879
$$ -98395 215294 58495 70998 -312942 -149900 -54167 -64619 -212238 63887 171430 -299879
12424A18225N1756b48149A66876a07399n444J647B72494a54558A03150b24823
$$ 118225 169981 -248149 166876 -107399 -112843 -111196 272494 -154558 103150 -224823
12413B02562H008g4997B79813a86565A47029j2565C4501f5111A04252c204I0790
$$ 202562 8008 -74997 279813 -186565 147029 134464 34501 -65111 104252 -3204 90790
12401B49368b55340R7907n279B46690G3786K7477a95432l26689b50614D9421L08247
$$ 249368 -255340 -157433 -162712 246690 73786 101263 -195432 -522121 -250614 49421 357668
12390C57668b81609A70059F039b00305d8023A15044A7578a69126A75217a5443
$$ 357668 -281609 170059 6039 -200305 -48023 115044 17578 -169126 175217 -15443
12379B1905J51160h4041I7911l5147L74636c55609B06642i5391j03520a9054I6169
$$ 21905 173065 -84041 97911 62764 437400 -355609 206642 -95391 -198911 -19054 96169
12367a66292k430D7500a99863e389k39918D8425K01186O0109A8423b36564C19043
$$ -166292 -168722 47500 -199863 -5389 -245307 48425 249611 309720 18423 -236564 319043
12355b78429B07798H598K1234J79613a95265j490N1190O1856B33885d2778A8310
$$ -278429 207798 8598 29832 209445 -195265 -196755 -145565 -83709 233885 -42778 18310
12343C7303f3802B95097j18771C5154g4994A78594J07326C9598J4533j3305a30138
$$ 37303 -63802 295097 176326 35154 -74994 178594 285920 39598 54131 40826 -130138
12331D2631Q8339b3011B66654C8637b49573p3278C0422g5424K0637I7378D0494
$$ 42631 130970 -23011 266654 38637 -249573 -322851 30422 -75424 -54787 97378 40494
12319A9653d8988C03319b03339a01534I1984j3730B5447J58319E6104j3675K04172
$$ 19653 -48988 303319 -203339 -101534 91984 78254 25447 183766 56104 42429 246601
12308B46601A16321f7927j61279q3552D25943a91203E9139G174a70225A31868
$$ 246601 116321 -67927 -229206 -312758 425943 -191203 59139 7174 -170225 131868
12297C5318c6642A22667e5280B88653C3618K14160a1110G628J36093k4734K9286
$$ 35318 -36642 122667 -55280 288653 33618 247778 -11110 7628 143721 118987 148273
12286A48273a57064H0697a52239b5429D35434b7640C56130h7571j10065B9444
$$ 148273 -157064 80697 -152239 -25429 435434 -27640 356130 -87571 -197636 29444
12275B76771G5081L154J58726P7576E8716R3356J61851a8368A06645a34080a5256
$$ 276771 75081 78235 236961 314537 58716 152072 313923 -18368 106645 -134080 -15256
12263e9369m3999D34780d7513E3656J74067K6981J8514G5506J08832J10504R294
$$ -59369 -103368 434780 -47513 53656 227723 254704 273218 75506 184338 294842 304136
12252C04136C7684J67459e0310B75600B4442a75464K7324F4509N3945K25002i8463
$$ 304136 37684 205143 -50310 275600 24442 -175464 -148140 64509 118454 343456 -98463
12240A88272I3478K55998j27596F8671j0677a4328B57709j16090M2860j8301L4551
$$ 188272 93478 349476 221880 68671 57994 -14328 257709 141619 184479 166178 200729
12229B00729K27984j64407G5205K80419A05265J45452L97324m2232j07678B7189
$$ 200729 428713 264306 75205 355624 105265 250717 648041 605809 498131 27189
12218A24505J05995K59494j9350j32062j56023K5545M4291j03181O8647J25444
$$ 124505 230500 489994 470644 338582 182559 208104 252395 149214 217861 343305
12208C43305a20868B97250j24273N5224a40195d619B13598K32797k16705I1123
$$ 343305 -120868 297250 172977 228201 -140195 -4619 213598 446395 229690 91123
12197a19586G719L05594l2794j36699b99385D20393l1050H2149j6369J17851F8295
$$ -119586 7719 313313 280519 143820 -299385 420393 389343 82149 65780 183631 68295
12185b3513I5585Q2774e7448D3443a23350E4860K11997D9773A1967K56460I7936
$$ -23513 95585 178359 -57448 43443 -123350 54860 266857 49773 11967 268427 97936
12173c18373h9844B37785f3233C34824o7709M9434j31806K735p5383J18761J70716
$$ -318373 -89844 237785 -63233 334824 267115 316549 184743 187478 112095 230856 401572
12162D01572F7270h0737A99073a54253G2214J46589q4435A9851b21887g0944j49306
$$ 401572 67270 -80737 199073 -154253 72214 218803 134368 19851 -221887 -70944 -220250
12151b20250D96797B5997b6042I9336K3632i6514k97282J86903A15486A4143L6180
$$ -220250 496797 25997 -26042 99336 122968 -96514 -393796 -206893 115486 14143 50323
12140E0323J21354d8117O247A5633e3631A53230e9120I7454a09043F2692e6483
$$ 50323 171677 -48117 -41870 15633 -53631 153230 -59120 97454 -109043 62692 -56483
12128D6288J84116E9566b39716C59098b9299l38006c6130C42924j44778m0472
$$ 46288 230404 59566 -239716 359098 -29299 -367305 -36130 342924 198146 157674
12118A57674a89692A5788a89895N4671A21904a4465j06772b4212i435k26500a11317
$$ 157674 -189692 15788 -189895 -135224 121904 -14465 -121237 -24212 -9435 -235935 -111317
12106a93290J7923H0256K0618A8742H320O3810a89912f0513k5631D8116J20607
$$ -193290 -175367 80256 100874 18742 8320 72130 -189912 -60513 -86144 48116 168723
12095A68723F7725Q0409d39928e194j30900D8080P6030J11043D2527J13455a52371
$$ 168723 67725 148134 -439928 -5194 -136094 48080 124110 235153 42527 155982 -152371
12083D46825A50586J13364K6062i2869j9008B04912B1764a53388f034q1152K1249
$$ 446825 150586 263950 290012 -92869 -111877 204912 21764 -153388 -6034 -87186 -65937
12072f5937B38386J90675j5817N79371Q11750E34745A97843Q2107I937b30744
$$ -65937 238386 429061 413244 992615 1804365 534745 197843 279950 9937 -230744
12061A18505d4457B34471i6137D4801K10130o470B1590J42693f11075b67982f6878
$$ 118505 -44457 234471 -96137 44801 254931 248461 21590 164283 -611075 -267982 -66878
12049C17820o8732l9682A00606c63022I0386M8476c06473A02614K14861m2166
$$ 317820 249088 209406 100606 -363022 90386 138862 -306473 102614 317475 275309
12039B75309F002a43574A12322c7889A2268d4817l41127J32541M5576b6520e695
$$ 275309 6002 -143574 112322 -37889 12268 -44817 -385944 -253403 -207827 -26520 -5695
12027d13101a19124D24456D0883J56800G4585B9776Q7045n6433k0872M47143a69886
$$ -413101 -119124 424456 40883 197683 74585 29776 116821 60388 39516 486659 -169886
12015C10904C0052a05819e359j93198A59071a7050m3603F2914K55814d0931k11804
$$ 310904 30052 -105819 -5359 -198557 159071 -17050 -60653 62914 318728 -40931 -252735
12004b52735A5721b43686A28079C6530i7432B4731Q3532b531j45964J1936a551
$$ -252735 15721 -243686 128079 36530 -97432 24731 108263 -2531 -148495 -136559 -1551
11992c34849B15411B2885J49085n8872b56719F3586b08273B06326c6034n3312
$$ -334849 215411 22885 171970 113098 -256719 63586 -208273 206326 -36034 -89346
11982h9346B40490A05063L63031B13539m5900c92809J78560A27750E4836c49380
$$ -89346 240490 105063 468094 213539 167639 -392809 -214249 127750 54836 -349380
11971b6099G2201a81847j64864F6953c763B6226L02004B4800K40097E4911B4583
$$ -26099 72201 -181847 -346711 66953 -3763 26226 328230 24800 264897 54911 24583
11959C8763a64755r92N7749A72340h8340n5327B3472b52517E26657A21788K3137
$$ 38763 -164755 -165747 -107998 172340 -88340 -143667 23472 -252517 526657 121788 144925
11948A44925n2849N7735K6193I445g2583C25694g1798A55459N2159c13993A16151
$$ 144925 92076 149811 176004 9445 -72583 325694 -71798 155459 207618 -313993 116151
11936H7671h9584B07535b74094F5994a59604B3328L55947e7045j98163a15409
$$ 87671 -89584 207535 -274094 65994 -159604 23328 379275 -57045 -255208 -115409
11925F1942H217R9648Q5714n2926a92071j15674h2203n5108A75479a99542A96372
$$ 61942 8217 107865 193579 140653 -192071 -307745 -82203 -137311 175479 -199542 196372
11913A90099J16196a67672k53947a3235A90398e3626a704A20994b04323C24724
$$ 190099 306295 -167672 -421619 -13235 190398 -53626 -1704 120994 -204323 324724
11902c4334l269A30400m5105B0665r186b08967A37536c32110B92286A07634Q8206
$$ -34334 -37603 130400 85295 20665 11479 -208967 137536 -332110 292286 107634 195840
11891A95840I473N5989c84424B14883f4034k21450A23873E8684a8441A54822a21433
$$ 195840 9473 65462 -384424 214883 -64034 -285484 123873 58684 -18441 154822 -121433
11879i6583c2628j94441p761j1507B9026J6463f45468A8806f5449I3643d99B62361
$$ -96583 -32628 -227069 -234830 -246337 29026 45489 -645468 18806 -65449 93643 -499 262361
11866a17249j91266J34882N3136m6321O6520N510m25361d8755A48708F3619j1424
$$ -117249 -308515 -173633 -120497 -166818 -100298 -94788 -520149 -48755 148708 63619 52195
11855E2195b07363d2767j02170E99a69792k10500g9011A47027a63589N0858E9910
$$ 52195 -207363 -42767 -144937 599 -169792 -380292 -79011 147027 -163589 -112731 59910
11843A72363G47h9649j1182p9294D0285N0875K91907A24768b77217c1443P137
$$ 172363 747 -89649 -100831 -180125 40285 91160 383067 124768 -277217 -31443 -24306
11832b4306A38952E5014e7020j7106D6447g2749A66534K20774d48664a8169j83595
$$ -24306 138952 55014 -57020 -74126 46447 -72749 166534 387308 -448664 -18169 -201764
11821b01764i0711A85903J54259c68069F1695i4888l28882C42049B6088a7359
$$ -201764 -90711 185903 340162 -368069 61695 -94888 -423770 342049 26088 -17359
11810a11453j68761I9820Q4760q9399a34674k6688p1588j73642d6772D1893Q9273
$$ -111453 -280214 99820 184580 95181 -134674 -161362 -232950 -406592 -46772 41893 131166
11799A31166L1614J90084d58160a7907k7716a9028E8822a26775k26013B11917
$$ 131166 162780 352864 -458160 -17907 -45623 -19028 58822 -126775 -352788 211917
11788h6952R32E4333c92225D1440J23761d2390k97859J55546n9638B33846b16159
$$ -86952 -86020 54333 -392225 41440 165201 -42390 -340249 -184703 -244341 233846 -216159
11776A42223c7254C5240a98624J2489f1547C23007C6392a32461B25193N3945A03104
$$ 142223 -37254 35240 -198624 -186135 -61547 323007 36392 -132461 225193 279138 103104
11764e04749A07448e0569B0221J21174a59505n4623N9204K2567D43736C038i6108
$$ -504749 107448 -50569 20221 141395 -159505 -214128 -154924 -132357 443736 3038 -96108
11752D00281A07738J14420c31714a26080M3286B1360f8205c1955B24411q4212
$$ 400281 107738 222158 -331714 -126080 -82794 21360 -68205 -31955 224411 140199
11742A40199a01607j49363C29200k2385D0133J0807K5676P0298m6282a61523p1904
$$ 140199 -101607 -250970 329200 306815 40133 50940 76616 146914 100632 -161523 -233427
11731b33427A97200b4934C97383b69259G1792e0555A8149O8087i2269n7653B57187
$$ -233427 197200 -24934 397383 -269259 71792 -50555 18149 86236 -92269 -149922 257187
11719B96373a25905K5710B37505J52520j42044I2643a96710A59088D8345J01823
$$ 296373 -125905 -100195 237505 390025 247981 92643 -196710 159088 48345 150168
11709A50168l9385h3611k12135a10715A05845K27654b94280a0076B39745a83911
$$ 150168 110783 -83611 -295746 -110715 105845 333499 -294280 -10076 239745 -183911
11698B25164I0064M6092m633F0353g1726G3561k7609J945L9859i6694A00089J17696
$$ 225164 90064 136156 131523 60353 -71726 73561 45952 47897 87756 -96694 100089 217785
11686B17785o0571J40956b47780A74065o3050c9544C49144a63558B81290A29065
$$ 217785 157214 298170 -247780 174065 111015 -39544 349144 -163558 281290 129065
11675B92748F836Q310b15773A8072g8037C14955A15049g9710A47034f1450B3200
$$ 292748 6836 15146 -215773 18072 -78037 314955 115049 -79710 147034 -61450 23200
11663A50352P3869c9450E5650b477A95389o7874a52734A71189D3481K31975b30587
$$ 150352 224221 -39450 55650 -2477 195389 127515 -152734 171189 43481 275456 -230587
11651B6121L24411A22050K4734l8259b9513A92929G2994c20790B2003J9617b66613
$$ 26121 350532 122050 146784 108525 -29513 192929 72994 -320790 22003 41620 -266613
11639F1709a03263j58475M8703A51141a19814L0321c1076k04162B14176j03421
$$ 61709 -103263 -261738 -213035 151141 -119814 -89493 -31076 -235238 214176 110755
11629A10755C5665L287a38899r9131B4425a66190G6237a32324B44676d5600j7835
$$ 110755 35665 38952 -138899 -238030 24425 -166190 76237 -132324 244676 -45600 -63435
11618f3435A71984E3178M4022a82433P4201A1342b2402l611A01269N7228e9972
$$ -63435 171984 53178 97200 -182433 -108232 11342 -22402 -26013 101269 158497 -59972
11606a56008N0190R371A2077L03133c66973e8198j02771C614b95456F7477h208
$$ -156008 -105818 -96447 12077 315210 -366973 -58198 -160969 3614 -295456 67477 -8208
11594B23300o7399J03837G3942a77268G8768K08416a1243D2676c2394H4512h6454
$$ 223300 155901 259738 73942 -177268 78768 287184 -11243 42676 -32394 84512 -86454
11582F7803J04574A6428J11048a16822A82153q7142a14703j41553A10420e4656
$$ 67803 172377 16428 127476 -116822 182153 95011 -114703 -256256 110420 -54656
11571D75810A44566J55676f1384k2670J6126k10252r7509H4461B6693J72563J39222
$$ 475810 144566 300242 -61384 -84054 -67928 -278180 -375689 84461 26693 199256 338478
11560C38478d71264D5619e4069F3744P8364J90102A52129h7075p067C45901l4798
$$ 338478 -471264 45619 -54069 63744 142108 332210 152129 -87075 -94142 345901 311103
11549C11103c68287R6133J12533N320D36376D6249b6320A35230a03842K1559l582
$$ 311103 -368287 -272154 -159621 -154301 436376 46249 -26320 135230 -103842 -82283 -85865
11538h5865A29541o3588J07844p7893l7663R7441o0811P9389a56907G902f455
$$ -85865 129541 65953 173797 95904 58241 155682 94871 174260 -156907 7902 -6455
11526B10583D6333a81447B13532b49606h9289C76971A40438a24799A38151A3947
$$ 210583 46333 -181447 213532 -249606 -89289 376971 140438 -124799 138151 13947
11515B76428g0348C34148b2946I8922J6019J23798j16597d5649b1650m420A9685
$$ 276428 -70348 334148 -22946 98922 114941 238739 122142 -45649 -21650 -26070 19685
11503C2122K30331j03304P1277k2964A0489J41846p2904e1635C8800a62202Q0616
$$ 32122 262453 159149 230426 207462 10489 152335 79431 -51635 38800 -162202 -81586
11492h1586A34940J0308J70569a20873B61869G8261J4974n771K89653m8900A3015
$$ -81586 134940 145248 315817 -120873 261869 78261 93235 87464 377117 328217 13015
11480C65895f3135B02465J57082A61427h4422D17084j61949q5362b0691C62317
$$ 365895 -63135 202465 359547 161427 -84422 417084 255135 169773 -20691 362317
11469D55750B12400h8226A8062M1476J98689I4794J89652h8598A17863l933e406
$$ 455750 212400 -88226 18062 59538 258227 94794 284446 -88598 117863 113930 -5406
11457D24205A58825l4257O3952J40113A60027j3211C1833K16027p2019n5147a74891
$$ 424205 158825 124568 188520 328633 160027 146816 31833 247860 175841 120694 -174891
11445A74407F435J68367O4557H421J26250N9441J36654I8810E346R2269A7061
$$ 174407 6435 174802 239359 8421 134671 194112 330766 98810 5346 97615 17061
11433a75228H547J8513Q7506a28483A65441j3048k5344a9319j05673D6967R9877
$$ -175228 8547 27060 114566 -128483 165441 152393 127049 -19319 -124992 46967 146844
11422A46844l0594e5881E536a04991E9279a5948m5499H7247b09847F1275j6518
$$ 146844 116250 -55881 5536 -104991 59279 -15948 -61447 87247 -209847 61275 44757
11411D4757J24060b2497k02397C01462A17759D2825b10783C83535I3761J6190
$$ 44757 168817 -22497 -224894 301462 117759 42825 -210783 383535 93761 109951
11401A09951O2400J69572A33170L35010C9480L527b79397B776J48354O831P976
$$ 109951 172351 341923 133170 468180 39480 43007 -279397 2776 151130 157961 165937
11390A65937F8992a6879j24223m5775B20599I3389c14786e5430J1462k26835B8164
$$ 165937 68992 -16879 -141102 -186877 220599 93389 -314786 -55430 -43968 -270803 28164
11378B34030l0353j00271k4664d05981g1028A72229g2718q0078H4029c46877A48976
$$ 234030 203677 103406 78742 -405981 -71028 172229 -72718 -152796 84029 -346877 148976
11366h3686A34469b06587c7584B18348E6019d49448H7571N9354J23592D5848O4130
$$ -83686 134469 -206587 -37584 218348 56019 -449448 87571 146925 270517 45848 109978
11355A09978i0330B24345G9855b61042F7851g5214B75290B7009K90817l5122E4372
$$ 109978 -90330 224345 79855 -261042 67851 -75214 275290 27009 317826 282704 54372
11343A89063j4193e6610E7094b67144I5805A9181a35149B28988J13263b17990
$$ 189063 174870 -56610 57094 -267144 95805 19181 -135149 228988 342251 -217990
11332b74667d4562q4405B8206a17462j88834B39860a13251L949N2762k32165J17602
$$ -274667 -44562 -128967 28206 -117462 -306296 239860 -113251 -109302 -56540 -288705 -171103
11321a71103D2775c40834b6656A14175a66474r578A47376e089j14782C83817g539
$$ -171103 42775 -340834 -26656 114175 -166474 -176052 147376 -5089 -119871 383817 -7539
11309B29086G2042K41629n9093a21786E793j770i2332M1104K5083p9784b6109
$$ 229086 72042 313671 254578 -121786 5793 4023 -92332 -51228 -26145 -105929 -26109
11297f4466i67j4675C00583c00723g4382l28208A4003a46564i517B89476a30170
$$ -64466 -967 -15642 300583 -300723 -74382 -402590 14003 -146564 -9517 289476 -130170
11285A1489f5916j06070o3075j2632N7711i1182D843a71625C34051i0106I679
$$ 11489 -65916 -171986 -235061 -247693 -189982 -91182 4843 -171625 334051 -90106 9679
11273A32464i3031D2891p082Q9745c2589A19350k9146K6554a32475H3320j0777
$$ 132464 -93031 42891 35809 125554 -32589 119350 90204 116758 -132475 83320 72543
11262G2543b11181L7729r3071K1102Q6900K143l4448k2210l4212i3379j04224
$$ 72543 -211181 -173452 -266523 -245421 -158521 -156378 -190826 -213036 -247248 -93379 -197603
11251a97603a1865k09345j32351f9104p4764r0845B75280a84061c6993o7578J3877
$$ -197603 -11865 -221210 -353561 -69104 -143868 -234713 275280 -184061 -36993 -104571 -90694
11240i0694j1923d6501B59808a54375P1627o2639b0577B5509K05069c49701e2107
$$ -90694 -102617 -46501 259808 -154375 -82748 -145387 -20577 25509 230578 -349701 -52107
11228G4396P7684K7709a82960c1979j83762B78966c823k57326h6826A02129c1433
$$ 74396 152080 179789 -182960 -31979 -215741 278966 -3823 -261149 -86826 102129 -31433
11216B01783e5112A11449c42320a61494A7887J55103M786b8333i251k63610i7508
$$ 201783 -55112 111449 -342320 -161494 17887 172990 177776 -28333 -9251 -272861 -97508
11204E5526j8539O8691J76134I4418D0139e5993J5190m3592J5976j91016C6942
$$ 55526 36987 105678 281812 94418 40139 -55993 -40803 -84395 -68419 -259435 36942
11192C08961a01981k111B511a03451g97k34089K5068i7853c769k18069h4049r4079
$$ 308961 -101981 -104092 2511 -103451 -797 -234886 -209818 -97853 -3769 -221838 -84049 -178128
11180a78128j84305A06449d4227k33917A02991P4412B0411J13600R6829c85486
$$ -178128 -362433 106449 -44227 -278144 102991 177403 20411 134011 230840 -385486
11169a51780K2983C34689b81410a20919D9411b00146L6067C57886b23396a0550
$$ -151780 -128797 334689 -281410 -120919 49411 -200146 -164079 357886 -223396 -10550
11158D5474a36374n3786B267g0190k1008j30464g3956G8590k3666b50632e1716
$$ 45474 -136374 -190160 2267 -70190 -91198 -221662 -73956 78590 54924 -250632 -51716
11146b89454B47539d7215n0875D9052K63633h430B04368a3884m6939F9626a09813
$$ -289454 247539 -47215 -98090 49052 312685 -8430 204368 -13884 -60823 69626 -109813
11134c4818B79852B2065N950f9190A18926N1596i298q3559B7989b8569j00485
$$ -34818 279852 22065 28015 -69190 118926 170522 -9298 -92857 27989 -28569 -129054
11123a29054B03094b56758I5865K69751C2433a86218b0918H755J79888f4174A50044
$$ -129054 203094 -256758 95865 365616 32433 -186218 -20918 8755 188643 -64174 150044
11111B34413K37312G2367J86537f230A04688O6270J89201H3672h4328A02646K65746
$$ 234413 471725 72367 258904 -6230 104688 170958 360159 83672 -84328 102646 368392
11100C68392B5164J58160N0642b35087C92019A86573q6810J98399J23162d5891
$$ 368392 25164 183324 233966 -235087 392019 186573 99763 298162 421324 -45891
11089a19127M6141I6426J70003K16995A19381L09997A48559J29430B7938N04000
$$ -119127 -72986 96426 266429 483424 119381 429378 148559 277989 27938 531938
11079E31938B51287h7383H895f8850A65276J3557F3773K00303l6604K0340K03186
$$ 531938 251287 -87383 8895 -68850 165276 178833 63773 264076 227472 247812 450998
11068D50998J94196l02813A51952J62011K43709j08882n8482m9250A16794M24537
$$ 450998 645194 342381 151952 313963 557672 448790 390308 341058 116794 541331
11058E41331k67336M33425l21115L23962O3479k36763J2025J27284j2667l8363
$$ 541331 273995 707420 386305 710267 773746 536983 549008 676292 663625 625262
11048F25262j98422K94837N7736l40368K45463l0633j9204J62478P9561L9488
$$ 625262 426840 721677 779413 439045 684508 653875 634671 797149 876710 916198
11038I16198m5873j63596O1590o3150k03492Q2113K3100p621j60472L31460K51750
$$ 916198 870325 706729 768319 705169 501677 583790 606890 599269 438797 770257 1022007
11027A022007l12267l2783j22707K18444R239R2718m00357J11123N5092A60257
$$ 1022007 709740 676957 554250 772694 781933 874651 474294 585417 640509 160257
11016F38613J088j28508Q6977J31346C08581L16347k15126N19133o2344j90513
$$ 638613 639701 511193 598170 729516 308581 624928 409802 928935 866591 676078
11006F76078j49200M6570p3209M8906J76503n9058J95903j89423j83959L88470
$$ 676078 526878 573448 500239 549145 725648 666590 862493 673070 489111 877581
10996H77581k44305K40013l30393J2489j1035J66775J14749r4959L05765k31723
$$ 877581 633276 873289 542896 555385 544350 711125 825874 730915 1036680 804957
10986H04957j44688K32088J2089K89814k41169J46785J67345K49677l57187K05478
$$ 804957 660269 892357 904446 1194260 953091 1099876 1267221 1516898 1159711 1365189
10976A365189N69913J08560J47659J80310M09717N7041k94232J23300j72165j50390
$$ 1365189 1935102 2043662 2191321 2371631 2781348 2838389 2544157 2667457 2495292 2344902
10966B344902n96860J26411k7922m63362o5456M74027J95214m5126J008m8940
$$ 2344902 1748042 1874453 1846531 1383169 1317713 1791740 1986954 1941828 1942836 1893896
10956A893896k26760K60493l04794k90431o5555l57019l11994o3011N4592k92694
$$ 1893896 1667136 1927629 1622835 1332404 1266849 909830 597836 534825 589417 296723
10946B96723A39135L22748k16357o5220K4025m3682c2808H2602J92864l263L19674
$$ 296723 139135 461883 245526 180306 204331 160649 -32808 82602 275466 272203 591877
10935E91877E1113L40468I2348a8039A75045a2980A78983k6751K7551o3701a23486
$$ 591877 51113 391581 92348 -18039 175045 -12980 178983 152232 179783 116082 -123486
10923d0242B01905D1295N2358b70509B06793I0098M6259e7427k57206h3147A29114
$$ -40242 201905 41295 93653 -270509 206793 90098 136357 -57427 -314633 -83147 129114
10911B9756b4893j74394B85200f1385J6493J8050C39225a78248K0247D11261E821
$$ 29756 -24893 -199287 285200 -61385 -44892 -26842 339225 -178248 -158001 411261 5821
10899g4499l16384i8093I7899g1549A51275a55481H1813g6076A53148b79328D1378
$$ -74499 -390883 -98093 97899 -71549 151275 -155481 81813 -76076 153148 -279328 41378
10887i6022G5786j3673a746B56590a87110A40608E6659a3640j57078j50273m3527
$$ -96022 75786 62113 -1746 256590 -187110 140608 56659 -13640 -170718 -320991 -364518
10876c64518e5205j47488f0255A13234c23667B8799Q0549a36632C36470b40121
$$ -364518 -55205 -202693 -60255 113234 -323667 28799 109348 -136632 336470 -240121
10865G1627a06242m5068a7033j14012B09519I5179j9926J20204a05245p8447B34287
$$ 71627 -106242 -151310 -17033 -131045 209519 95179 75253 195457 -105245 -183692 234287
10853g3962C865J66232O8144b9897A28423c63020d0832C0684J47898P112d4341
$$ -73962 3865 170097 238241 -29897 128423 -363020 -40832 30684 178582 185694 -44341
10841d4457j48477A52177K30202a05765c3984k57507A12336A4186a06573J1897
$$ -44457 -192934 152177 382379 -105765 -33984 -291491 112336 14186 -106573 -94676
10831i4676I9998m4094a70285D9895b19499a00394F2444k1596P9056l995a42866
$$ -94676 99998 55904 -170285 49895 -219499 -100394 62444 40848 119904 115909 -142866
10819A01865k8358d4892Q031F3701a38521p3631E3878f7878E9361b52634I9649
$$ 101865 73507 -44892 -36861 63701 -138521 -212152 53878 -67878 59361 -252634 99649
10807b57390C39732F6767K6496c19287c8049j82130g5489C19043b00493j13288
$$ -257390 339732 66767 93263 -319287 -38049 -220179 -75489 319043 -200493 -313781
10797c13781B76634a31404G630i5089p2251g7854A52236J12211D8960J35638b73672
$$ -313781 276634 -131404 7630 -95089 -167340 -77854 152236 264447 48960 184598 -273672
10785a26250j00751A60817c0687A24958a67089C3701a43708P410f4293E0766c01878
$$ -126250 -227001 160817 -30687 124958 -167089 33701 -143708 -136298 -64293 50766 -301878
10773B23767a66835C5352J40389n2650b98545C7275C197J20909n0259b55742A68579
$$ 223767 -166835 35352 175741 123091 -298545 37275 3197 124106 73847 -255742 168579
10761a44945r2668d5484F0045P5477E4742b301n37698D824b98617H3934Q1350
$$ -144945 -237613 -45484 60045 135522 54742 -2301 -539999 4824 -298617 83934 165284
10750A65284O8328e4330k2811A76795J79702F0644a8289j83986B38314b23433
$$ 165284 233612 -54330 -77141 176795 356497 60644 -18289 -202275 238314 -223433
10739D0629Q5820b6786j68344A76066N2652a18229h413A43621b60436A77549m1293
$$ 40629 126449 -26786 -195130 176066 228718 -118229 -8413 143621 -260436 177549 136256
10728A36256h3386C39923a51758N3170j10638A5614J982b32756b230A01358b68271
$$ 136256 -83386 339923 -151758 -98588 -209226 15614 17596 -232756 -2230 101358 -268271
10716a02439b5004C50508B9866K1797N8433j0729b01678A3018a45866i237r7259
$$ -102439 -25004 350508 29866 51663 110096 99367 -201678 13018 -145866 -9237 -106496
10705a06496D9213p498K09521K1722b9624I8583a52385q4222J05972H0668g0667
$$ -106496 49213 41715 251236 272958 -29624 98583 -152385 -236607 -130635 80668 -70667
10693A33424e9075B33160G2041a1144k95269A02474c6357j37515C11703c15043
$$ 133424 -59075 233160 72041 -11144 -306413 102474 -36357 -173872 311703 -315043
10682g8225j61355k0774A21629D8205i195k99238a238E5745P0592c16095Q9630
$$ -78225 -239580 -260354 121629 48205 -9195 -308433 -1238 55745 126337 -316095 -226465
10671b26465I701c72641a9198k45946O2363b6033j51906P2846B00633d6372l21158
$$ -226465 9701 -372641 -19198 -265144 -202781 -26033 -177939 -105093 200633 -46372 -367530
10660c67530J01065J21874l41198a37932r5727c701j64147A7517J45995J3348
$$ -367530 -266465 -144591 -485789 -137932 -233659 -3701 -167848 17517 163512 176860
10650A76860e9013J3420A04444b06415e1577j80409L0504B30672C0010a46263
$$ 176860 -59013 -45593 104444 -206415 -51577 -231986 -201482 230672 30010 -146263
10639d20960a2782j55163B3651d3068j0481q9067j65202B82032i5749E9871n96
$$ -420960 -12782 -167945 23651 -43068 -53549 -142616 -307818 282032 -95749 59871 59275
10628E9275e7412G872J40515g9729j25350r3914M1106Q050a6607H0836Q0572g401
$$ 59275 -57412 7872 148387 -79729 -205079 -298993 -257887 -249837 -16607 80836 161408 -7401
10615b2829D7037K2664b7619m48726C1564b07639A10713k0523a67617N5867k70571
$$ -22829 47037 69701 -27619 -476345 31564 -207639 110713 90190 -167617 -111750 -382321
10604c82321K5820b0842l7180K5225B33948j8470a74613M3392q8015j05850C4682
$$ -382321 -356501 -20842 -58022 -32797 233948 215478 -174613 -131221 -219236 -325086 34682
10592I6278i1553C6743g5446B8061a07616j10843k69219b29696J09692l7644o1119
$$ 96278 -91553 36743 -75446 28061 -107616 -218459 -487678 -229696 -120004 -157648 -218767
10581b18767B5996L5878a38837l8818E6317a51905A9415d04552a03213F4720c72215
$$ -218767 25996 61874 -138837 -177655 56317 -151905 19415 -404552 -103213 64720 -372215
10569A33388m1940Q4520c47007g541k94458A45290e1378o4463B73737m292a79411
$$ 133388 91448 175968 -347007 -7541 -301999 145290 -51378 -115841 273737 269445 -179411
10557E1604a87368m9529B94533g3781k30173a46105N3639A18256i8886d0893B41190
$$ 51604 -187368 -236897 294533 -73781 -303954 -146105 -92466 118256 -98886 -40893 241190
10545d00535h2513I3459b16390C9734a8167h866o9074l7424Q974K7022A7917J53732
$$ -400535 -82513 93459 -216390 39734 -18167 -8866 -77940 -115364 -106390 -79368 17917 171649
10533A71649m1162A6118b25204A4001J6153e9783l04718J07771J27702J9088G5285
$$ 171649 130487 16118 -225204 14001 30154 -59783 -364501 -256730 -129028 -109940 75285
10521A28856a50722a2515p7059b607n90236b56347J14545N8656B5707d29593J33492
$$ 128856 -150722 -12515 -89574 -2607 -592843 -256347 -141802 -83146 25707 -429593 -296101
10510b96101B94912A02883f3501k45279A15389a40978J1695N4202A36579c27148
$$ -296101 294912 102883 -63501 -308780 115389 -140978 -129283 -75081 136579 -327148
10499a744H3963c40501c2405j00813A95496r6105B5234K6412L038g9095I5802
$$ -1744 83963 -340501 -32405 -133218 195496 99391 25234 51646 54684 -79095 95802
10487A60321B6747M1978J24073J05683A27526K49267O4966A94988Q7715N2627
$$ 160321 26747 68725 192798 298481 127526 376793 441759 194988 282703 335330
10477C35330F8543O268C1794L4670a57041I0394K4441M5187c83203J23294e8016
$$ 335330 68543 74811 31794 66464 -157041 90394 114835 160022 -383203 -259909 -58016
10465g3832A88328a3564D16091c74962b7182A49508a83459G0640a79331A06893
$$ -73832 188328 -13564 416091 -374962 -27182 149508 -183459 70640 -179331 106893
10454g5681k77866d7207q2420k9268c4500A50687a22776d7822E6085f5371B55789
$$ -75681 -353547 -47207 -129627 -158895 -34500 150687 -122776 -47822 56085 -65371 255789
10442a42137d1277G474N57376h926A19110a47800D3808J77298i1256B09661E9883
$$ -142137 -41277 7474 564850 -8926 119110 -147800 43808 221106 -91256 209661 59883
10430C1472L3186b28022A8252b26240B4529d4284B6044n054d14075g5015a0941
$$ 31472 64658 -228022 18252 -226240 24529 -44284 26044 20990 -414075 -75015 -10941
10418f1967m3082A76034E8563Q7613a37953D86139A22075l0380c17057Q2875d7169
$$ -61967 -105049 176034 58563 146176 -137953 486139 122075 91695 -317057 -234182 -47169
10406h5392r9721h486j47824E2684h8560m6853G159b73113B34674p6622B9480
$$ -85392 -185113 -8486 -156310 52684 -88560 -135413 7159 -273113 234674 158052 29480
10394A09422a20130A39190h1749j27538E01413g2975B75567J56619D0666d2110
$$ 109422 -120130 139190 -81749 -209287 501413 -72975 275567 432186 40666 -42110
10383A75167q4442f187j49001E79102k86465A09662K67588j82699j9968n6605
$$ 175167 90725 -6187 -155188 579102 292637 109662 377250 194551 174583 117978
10373A17978M43342k46901j26616K38939h1835D31546P291J19817j36817q8512
$$ 117978 561320 314419 187803 426742 -81835 431546 438837 558654 421837 333325
10363C33325e9646C60786H6848K2311L59172k32129N6691a5243C62971H970M64755
$$ 333325 -59646 360786 86848 109159 468331 236202 292893 -15243 362971 8970 473725
10352D73725j76421R0541J81240A98669J39377J92676A99728k2466B8187Q980
$$ 473725 297304 387845 569085 198669 338046 530722 199728 177262 28187 37167
10342C7167K66364I5023l512B363J67281J22557m1851a59268F5666J28171p0109
$$ 37167 303531 95023 91511 2363 169644 292201 250350 -159268 65666 193837 123728
10331A23728d1989C9042j8544d3364D2433N73J1335j919N0623d4848B02445A0454
$$ 123728 -41989 39042 20498 -43364 42433 43006 54341 52422 103045 -44848 202445 10454
10318B67833j26915J15276J13242A31924k2059K038c8077l4612A29351B3688a75328
$$ 267833 140918 256194 369436 131924 109865 111903 -38077 -72689 129351 23688 -175328
10306B288K58332j04671K3010C1863L3369J56773J85059b30944J13492j58926
$$ 2288 260620 155949 178959 31863 65232 222005 407064 -230944 -117452 -276378
10296b76378A58441F2197K14312A29626a27144k21604e8667k17914G4970a28890
$$ -276378 158441 62197 276509 129626 -127144 -348748 -58667 -276581 74970 -128890
10285h7022f844n11256H9381b50706A08859D6744R689b9736l65812d4275H4197
$$ -87022 -6844 -518100 89381 -250706 108859 46744 56433 -29736 -395548 -44275 84197
10273a25073C8706d0087q8984N3013p0407c8496m5686j54732J15093q7985e4148
$$ -125073 38706 -40087 -129071 -76058 -146465 -38496 -84182 -238914 -123821 -211806 -54148
10261A15136L55946A99818O4139K3340O0834N660j40231K747r9121b52621i1731
$$ 115136 471082 199818 263957 287297 348131 353791 213560 216307 117186 -252621 -91731
10249A42925J53424n0093a84925N5A88928a71330o2459A27599a67478g1565a7764
$$ 142925 296349 246256 -184925 -184870 188928 -171330 -233789 127599 -167478 -71565 -17764
10237B64098b07151A29088C0359f7794F485d3357j30376L6891l0170C056e2315
$$ 264098 -207151 129088 30359 -67794 6485 -43357 -173733 -136842 -167012 3056 -52315
10225a1345m48393a37j2933m29298a81301N3607D1584a86377K3096j1648p2506
$$ -11345 -459738 -137 -13070 -442368 -181301 -127694 41584 -186377 -163281 -174929 -247435
10214b47435b234A14856O6622H8847a6560k4777l09603C8953R4327k3232m6198
$$ -247435 -2234 114856 181478 88847 -16560 -41337 -350940 38953 133280 110048 63850
10203F3850d09689J81434O0871K373b361k64636b4261k6084J7913I0336a957A74824
$$ 63850 -409689 -228255 -167384 -165011 -2361 -266997 -24261 -50345 -32432 90336 -1957 174824
10190b22673D15644b80901P8875G0948i7434n6175a1716H0089a31747B8397L1407
$$ -222673 415644 -280901 -202026 70948 -97434 -153609 -11716 80089 -131747 28397 59804
10179E9804J73927d79952f222A05858a82181a7414j7062A31227J04882j03439
$$ 59804 233731 -479952 -6222 105858 -182181 -17414 -34476 131227 236109 132670
10169A32670g9050A61097g2866n0839C5887b72841A92222a48805K0554e7153l2766
$$ 132670 -79050 161097 -72866 -123705 35887 -272841 192222 -148805 -128251 -57153 -89919
10158h9919k1230C7177g8411l63482A31325d9229n4475j94806a5377j99375b9997
$$ -89919 -111149 37177 -78411 -441893 131325 -49229 -103704 -298510 -15377 -214752 -29997
10146f0180e914F6210d7955j56409Q300b8737A28133K3232k9577A1010c25811
$$ -60180 -5914 66210 -47955 -204364 -196064 -28737 128133 151365 121788 11010 -325811
10134b4876A01675a61410G5512a79459A35963a05486A76832a5965C1860J12348
$$ -24876 101675 -161410 75512 -179459 135963 -105486 176832 -15965 31860 144208
10124A44208a73933M5771K5231D2630a79390c8527n499A1012d04947H6828f2177
$$ 144208 -173933 -128162 -102931 42630 -179390 -38527 -44026 11012 -404947 86828 -62177
10112c05149C26691j20811a33881A21132a36134o5945R4815n2828d7890A10432
$$ -305149 326691 205880 -133881 121132 -136134 -202079 -107264 -160092 -47890 110432
10101a44452N6879F0137M4414C9779i6944E0420b47697P9036Q2223j4572o5575
$$ -144452 -87573 60137 104551 39779 -96944 50420 -247697 -168661 -86438 -101010 -166585
10090a66585B0694a16139M16n2979A89684a35323A69244g8014A8761Q1876A3548
$$ -166585 20694 -116139 -115723 -168702 189684 -135323 169244 -78014 18761 100637 13548
10078b04536j63712a54207A70380b74035d9169A4809K00782n2517o9069B0484
$$ -204536 -368248 -154207 170380 -274035 -49169 14809 215591 163074 94005 20484
10067A57611a15457A73607J0496a03072F0676b40491e6576j29353b4032C851d4545
$$ 157611 -115457 173607 184103 -103072 60676 -240491 -56576 -185929 -24032 3851 -44545
10055B9060J26221J4200L2723a81087M6757J7721m4596j90704f4979C24669G2490
$$ 29060 155281 169481 202204 -181087 -134330 -116609 -161205 -351909 -64979 324669 72490
10043A2919f0284k05458a06436q4643B78764b75379A49172c81676A4484O7166
$$ 12919 -60284 -265742 -106436 -191079 278764 -275379 149172 -381676 14484 81650
10033H1650b4489A1727Q7663e5565j01930I4774K1119g005j47761A45385f7334
$$ 81650 -24489 11727 99390 -55565 -157495 94774 115893 -7005 -154766 145385 -67334
10021C71974j61927r9482E1485a04802j35613A3743d1390j445o1010I5634a9187
$$ 371974 210047 110565 51485 -104802 -240415 13743 -41390 -42835 -103845 95634 -19187
10009a03055B06449c05932c3192A10438a12920H3813J4064d7484B63653A6103
$$ -103055 206449 -305932 -33192 110438 -112920 83813 97877 -47484 263653 16103
9998B41382C3675a12386k73429G837P2465b06600P2940B7883a84622A91762d6641
$$ 241382 33675 -112386 -385815 7837 80302 -206600 -133660 27883 -184622 191762 -46641
9986d2211j45250k46995a33672m23143A92510i565r2159M6737j00078k5356H666
$$ -42211 -187461 -434456 -133672 -556815 192510 -9565 -101724 -54987 -155065 -180421 8666
9974d16369J07821N2063b0509j9846j30934C6182L8549b83933O9691o160a00026
$$ -416369 -308548 -256485 -20509 -40355 -171289 36182 74731 -283933 -214242 -220402 -100026
9962C3627J21238b61581F4035a73958P0053B43498b4741G21182H6882j2360c1218
$$ 33627 154865 -261581 64035 -173958 -103905 243498 -24741 721182 86882 74522 -31218
9950a42281K1801K4797O479k23785e5193E9791b44398a01204A44403m1744K16838
$$ -142281 -120480 -95683 -89204 -312989 -55193 59791 -244398 -101204 144403 102659 319497
9939C19497A58569c81817a40274j45359f4729j99229A5319a58718f7570p5736
$$ 319497 158569 -381817 -140274 -285633 -64729 -263958 15319 -158718 -67570 -143306
9929a43306k68683b5797D5557c2086A13169J20361a38346D22888j21463a42266
$$ -143306 -411989 -25797 45557 -32086 113169 233530 -138346 422888 301425 -142266
9918A31499L8926K57933b0203m3162J567R632j3839B18284b3531j99165D6047
$$ 131499 170425 428358 -20203 -63365 -61798 -52166 -66005 218284 -23531 -222696 46047
9906b84504D8306c25842d7536B50915c71731m651A66644f9797D0915c0600k52991
$$ -284504 48306 -325842 -47536 250915 -371731 -376382 166644 -69797 40915 -30600 -283591
9895b83591L3089P5418m1984R5953B39548a15199C1014a75112d2306B01635H261
$$ -283591 -250502 -175084 -217068 -121115 239548 -115199 31014 -175112 -42306 201635 8261
9883E9887J05787a50403g319A11031c92595H1247a69014b2738m43616a5271B51347
$$ 59887 165674 -150403 -7319 111031 -392595 81247 -169014 -22738 -466354 -15271 251347
9871H8823c01020J33554D03139A44225b68909h0164B82783C856b1944j16480A90036
$$ 88823 -301020 -167466 403139 144225 -268909 -80164 282783 3856 -21944 -138424 190036
9859a82143h5592A81584a26267e6135a1577k40332C5810b64872j0401J21386C020
$$ -182143 -85592 181584 -126267 -56135 -11577 -251909 35810 -264872 -275273 -153887 3020
9847b62609A8773a19085d7337A01164h3175l1374I5371b794k96775R3553i3098
$$ -262609 18773 -119085 -47337 101164 -83175 -114549 95371 -2794 -299569 -206016 -93098
9835b23555b3490l79D4203K08458B3393N3897a65475j59430a46634j2356k745
$$ -223555 -23490 -23869 44203 252661 23393 77290 -165475 -324905 -146634 -158990 -161735
9824a61735o4957B7778d50869E641c86451J11484D6390k1580H970a42631A24735
$$ -161735 -226692 27778 -450869 5641 -386451 -274967 46390 24810 8970 -142631 124735
9812a93454k5511G6872b5749A92676c21410J44518A5347h1073q7418q0539J1024
$$ -193454 -218965 76872 -25749 192676 -321410 -176892 15347 -81073 -168491 -249030 -238006
9801b38006B02170b48600J06882A36712b90612d4267k99633B37703g6859j5569
$$ -238006 202170 -248600 -141718 136712 -290612 -44267 -343900 237703 -76859 -92428
9791i2428C338b44336D3392a19038B63594b87003D20352b31437B77887E6172b29860
$$ -92428 3338 -244336 43392 -119038 263594 -287003 420352 -231437 277887 56172 -229860
9779b46810A20476b72280b2463H9422B6838c21491J38258B34108g0423j46272
$$ -246810 120476 -272280 -22463 89422 26838 -321491 -183233 234108 -70423 -216695
9769b16695Q0208d5313A71648g439G0688d6131F061J90784D0687g8505q5412Q0291
$$ -216695 -136487 -45313 171648 -7439 70688 -46131 6061 196845 40687 -78505 -163917 -83626
9757h3626D4955i9248j77423a37438O3949a1165j33059k10787a25944D6371D151
$$ -83626 44955 -99248 -276671 -137438 -73489 -11165 -144224 -355011 -125944 46371 4151
9745a08568K4973j00768A10153l9323a5280j7474j06361I8350P0426M9082I3488
$$ -108568 -83595 -184363 110153 70830 -15280 -32754 -139115 98350 168776 217858 93488
9733C34243j65085b28k77822A83078a45518B521i408B7567c87732a5240D6574
$$ 334243 169158 -228 -278050 183078 -145518 2521 -9408 27567 -387732 -15240 46574
9721d1229J8031k24922A3984b8237l04049A08949c69795C8764Q4347a8079k16352
$$ -41229 -23198 -248120 13984 -28237 -332286 108949 -369795 38764 123111 -18079 -234431
9710b34431J0209k01104f3638r8921A59134d67341F9257J2269f0189q5602F2062
$$ -234431 -224222 -425326 -63638 -162559 159134 -467341 69257 81526 -60189 -145791 62062
9698a21440j83963c9315l37316E8550a10884L909k42931h4446L0972k75479a4432
$$ -121440 -305403 -39315 -376631 58550 -110884 -106975 -349906 -84446 -53474 -328953 -14432
9686b5591n620o3251A79704F3636J52803b19570l80O6921A27983d37698a85556
$$ -25591 -31211 -94462 179704 63636 216439 -219570 -219950 -153029 127983 -437698 -185556
9674d11908D2985P4588P7144c28105a01892A0756N6482b27837J61C1258a42192
$$ -411908 42985 117573 194717 -328105 -101892 10756 67238 -227837 -227676 31258 -142192
9662e1501D6890n093J3954e8488j14963c6746j09658l5017D5001f8550K7468k33293
$$ -51501 46890 41797 55751 -58488 -173451 -36746 -146404 -181421 45001 -68550 -41082 -274375
9650b74375a16293p0953g5557j02474A90413n5149l0156K4989k326b27490E8348
$$ -274375 -116293 -187246 -75557 -178031 190413 135264 105108 130097 127771 -227490 58348
9638I0855b10255I4659j1323i8184B11061f806j45223b8314l12495A05698a24694
$$ 90855 -210255 94659 83336 -98184 211061 -6806 -152029 -28314 -340809 105698 -124694
9626e0131k10282d4245l962r0700b3944A71982a41012l80383a20578p6365A43777
$$ -50131 -260413 -44245 -48207 -138907 -23944 171982 -141012 -521395 -120578 -196943 143777
9614A8853J74889H4586M8225c50289D58083c87162J1541A3808c4961C8369b40029
$$ 18853 193742 84586 132811 -350289 458083 -387162 -375621 13808 -34961 38369 -240029
9602b60136a20533B6552a03734l2305D921e3297q5287n7869A86966E7442j4787
$$ -260136 -120533 26552 -103734 -136039 4921 -53297 -138584 -196453 186966 57442 42655
9591D2655c35112F5474f2838p1057O324p3827j97697M2606q093n0568H4158b13209
$$ 42655 -335112 65474 -62838 -133895 -127571 -201398 -399095 -356489 -364582 -415150 84158 -213209
9578c48222D0511J65531C2279I683a26033k0842k5216k3505K7310A17577a67287
$$ -348222 40511 206042 32279 9683 -126033 -146875 -172091 -195596 -168286 117577 -167287
9566A61114l8924b15493h2918k10145J29548C1353L61418j87683I7842e040j22119
$$ 161114 122190 -215493 -82918 -293063 -163515 31353 392771 205088 97842 -5040 -127159
9555a27159J0179A25149i0534l50384D6718Q3629K22277b35101B39847C1008J69086
$$ -127159 -116980 125149 -90534 -440918 46718 130347 352624 -235101 239847 31008 200094
9544B00094a12656c9619l27148a9002A00549d879k17519D3278a10076L5093I6988
$$ 200094 -112656 -39619 -366767 -19002 100549 -4879 -222398 43278 -110076 -74983 96988
9532a85251N84F7621b45118k9500R3631J1616P7122j17868j30159B81988b06916
$$ -185251 -184667 67621 -245118 -274618 -180987 -169371 -92249 -210117 -340276 281988 -206916
9520H3160c20135O4830L7394D9725Q629c2009n4935a4673j6061k20891a11998
$$ 83160 -320135 -255305 -217911 49725 58354 -32009 -86944 -14673 -30734 -251625 -111998
9508a66407h108k62872f7807k00236A55045a43301A45352A0804Q9491a96744b8670
$$ -166407 -8108 -270980 -67807 -268043 155045 -143301 145352 10804 100295 -196744 -28670
9496c28504A33291b12636j4733B5221K79435d8551j78232c7132j37325A4848c46514
$$ -328504 133291 -212636 -227369 25221 304656 -48551 -226783 -37132 -174457 14848 -346514
9484D3709h385B51098b23265G9311i5719b5138H7176c15282R4722A42984h050
$$ 43709 -8385 251098 -223265 79311 -95719 -25138 87176 -315282 -220560 142984 -8050
9472e9195l9039F2697q653N66J40517d05299d9636A79993a31080D7930b33587
$$ -59195 -98234 62697 54044 54610 195127 -405299 -49636 179993 -131080 47930 -233587
9460C4482d84217f9966m1985I6333D0961I862c93345L7899g165j11738E8088a76543
$$ 34482 -484217 -69966 -111951 96333 40961 9862 -393345 -355446 -7165 -118903 58088 -176543
9447g5807J0598c314o26A47421L8529b23395A62294b62372c7320J7210j97724
$$ -75807 -65209 -3314 -3940 147421 185950 -223395 162294 -262372 -37320 -20110 -217834
9436b17834r5729P8704J05518j04682k1093A4371f5054j43463D7918a61203e6126
$$ -217834 -313563 -234859 -129341 -234023 -255116 14371 -65054 -208517 47918 -161203 -56126
9424b24222A58379b45165B65731j29227e1338C54427H2375I033a51374E1231M5349
$$ -224222 158379 -245165 265731 136504 -51338 354427 82375 9033 -151374 51231 96580
9413I6580a98168l15057C31784h320H3046j107J45597B9217p160h9644q9621Q6241
$$ 96580 -198168 -513225 331784 -8320 83046 81939 227536 29217 22057 -89644 -179265 -93024
9401i3024j01054f0036o7533B9612M3362c49161J40657B14420B7793a57007j17159
$$ -93024 -194078 -60036 -127569 29612 72974 -349161 -208504 214420 27793 -157007 -274166
9390b74166K4204f6842A6547b1566k18270g8952j65751q7300a38644B8403a97454
$$ -274166 -249962 -66842 16547 -21566 -239836 -78952 -244703 -332003 -138644 28403 -197454
9378H0017a9509k9354r8121k03163E3415b46686e5396b2127F6777P2057j533c27099
$$ 80017 -19509 -48863 -146984 -350147 53415 -246686 -55396 -22127 66777 138834 137301 -327099
9365d17847b6814A59320i4480c3090m6710G3435b16008i9079A59394h2896A21053
$$ -417847 -26814 159320 -94480 -33090 -79800 73435 -216008 -99079 159394 -82896 121053
9353b16643f0532C2261b5185B842J2265c18017G3014c84597P5671A58285m2645
$$ -216643 -60532 32261 -25185 2842 15107 -318017 73014 -384597 -308926 158285 115640
9342A15640b22899C8146a96050h453m5110j14705P8459A41843j9473D9585d8173
$$ 115640 -222899 38146 -196050 -8453 -53563 -168268 -89809 141843 122370 49585 -48173
9330F64910a60432A85275b6546H5857g252H4709D0808K12313A11387a23764M1861
$$ 664910 -160432 185275 -26546 85857 -7252 84709 40808 253121 111387 -123764 -81903
9319h1903p6181K2259J8407j87898h8630j65293M8299L5397M3748r3549C16690
$$ -81903 -158084 -135825 -117418 -305316 -88630 -253923 -205624 -170227 -126479 -220028 316690
9307C25738F0134B8062b21629A57381a82843L0373d1438j14752c5417k93561E6346
$$ 325738 60134 28062 -221629 157381 -182843 -152470 -41438 -156190 -35417 -328978 56346
9295g2437F8451j3807b39248m5121a14723b2837D2537J5669f0658B1854J64140
$$ -72437 68451 54644 -239248 -284369 -114723 -22837 42537 58206 -60658 21854 185994
9284A85994a34571o3663C036K02578b41550J14162c7866j11679B5373c16451J45311
$$ 185994 -134571 -198234 3036 205614 -241550 -127388 -37866 -149545 25373 -316451 -171140
9273a71140k01432I0717f4355j69282k25477b22610j05266A4825F330N0292e1236
$$ -171140 -372572 90717 -64355 -233637 -459114 -222610 -327876 14825 6330 56622 -51236
9261D1957J70259J0367d81510a03547A12617c9930K106A05555a34585A39762M5628
$$ 41957 212216 222583 -481510 -103547 112617 -39930 -37824 105555 -134585 139762 185390
9250A85390d4292j60604a3845I1660b03410G2033O5852C4385J04936f5243q5825
$$ 185390 -44292 -204896 -13845 91660 -203410 72033 137885 34385 139321 -65243 -151068
9239a51068j00938N3048r3042g2615G4581b15413a9815F3145C0867a96654c0356
$$ -151068 -252006 -198958 -292000 -72615 74581 -215413 -19815 63145 30867 -196654 -30356
9227c75226b353m372j90798j8293h3492J9861q8658j35913B1890a46901J5669
$$ -375226 -2353 -6725 -197523 -215816 -83492 -63631 -152289 -288202 21890 -146901 -131232
9216a31232K2940j82277F016b90432e3836m27757A51816k2722i0760d3553B67168
$$ -131232 -108292 -290569 6016 -290432 -53836 -481593 151816 129094 -90760 -43553 267168
9204C20140a59673k0968A93730b20772A18635a06827L7349A19654b9006r6485
$$ 320140 -159673 -180641 193730 -220772 118635 -106827 -69478 119654 -29006 -125491
9194a25491B38445b733r4103a8358A73479a5395C8098H332K38435a14919j18113
$$ -125491 238445 -2733 -96836 -18358 173479 -15395 38098 8332 246767 -114919 -233032
9183b33032G6065a148j7689o6088j45868j59770F3640L1267R4266F2465a00603
$$ -233032 76065 -1148 -18837 -84925 -230793 -390563 63640 94907 189173 62465 -100603
9171b49019A25850A6057J57190C5119a57494A37680a70753E2862h9147H4625d4265
$$ -249019 125850 16057 173247 35119 -157494 137680 -170753 52862 -89147 84625 -44265
9159E0045G742e1330F6641b58579B11225b90616f9467m92385a97515E1922a86513
$$ 50045 7742 -51330 66641 -258579 211225 -290616 -69467 -561852 -197515 51922 -186513
9147b05839c9959k34801K1161i2212l6058f0830G4845d1668p8874A3534K8877
$$ -205839 -39959 -274760 -253599 -92212 -128270 -60830 74845 -41668 -120542 13534 42411
9136D2411b24298i1693r041M9976B26165J12017e9886q7797j13565J0859c6998
$$ 42411 -224298 -91693 -100734 -50758 226165 338182 -59886 -147683 -261248 -250389 -36998
9124b2540k26340b7734n5003k40595d0356p74E1843h3584B98573a56779A60150
$$ -22540 -248880 -27734 -82737 -323332 -40356 -41130 51843 -83584 298573 -156779 160150
9112b19443i6742i110k12087N4055l2106B06405k6011e81387A36934c69153B4723
$$ -219443 -96742 -9110 -221197 -167142 -199248 206405 180394 -581387 136934 -369153 24723
9100d758A28826b58501f2171D8125a61036q2669J12234C39655a45054M348j17860
$$ -4758 128826 -258501 -62171 48125 -161036 -243705 -131471 339655 -145054 -140706 -258566
9089b58566A06652K03498e2314m3258n7465A23119a92833Q2435A42250b49032
$$ -258566 106652 310150 -52314 -95572 -153037 123119 -192833 -110398 142250 -249032
9078C537a09800B13300e0030A02073e9985A20553i2646J554a4924A31582c39428
$$ 3537 -109800 213300 -50030 102073 -59985 120553 -92646 -91092 -14924 131582 -339428
9066B1551J68257a34507C45965c0530j60019O8700j25076B8543J91243i9303j48642
$$ 21551 189808 -134507 345965 -30530 -190549 -121849 -246925 28543 219786 -99303 -247945
9055b47945l96461i3838A36884c04032a47177C6551a98422A37436N1092i8429
$$ -247945 -644406 -93838 136884 -304032 -147177 36551 -198422 137436 188528 -98429
9044A55942a35457k86739c4847A86196a55646A57670b07669A5205b60642F1763
$$ 155942 -135457 -422196 -34847 186196 -155646 157670 -207669 15205 -260642 61763
9033a36325D8810k726C250b36387h5957l6904B31161a20728I1863c55272g0566
$$ -136325 48810 46084 3250 -236387 -85957 -122861 231161 -120728 91863 -355272 -70566
9021B65467a70353R850F437b26683D665i9968B13293d8868j27517j47882B40207
$$ 265467 -170353 -160503 6437 -226683 4665 -99968 213293 -48868 -176385 -324267 240207
9009a16F7695a19852A55473m9438D7864h8972K0210A44467B3185h5898A46600
$$ -116 67695 -119852 155473 106035 47864 -88972 -68762 144467 23185 -85898 146600
8997i5960J4067I5194a96324j69645A45556a34108k8165g3140k42374d0479J1640
$$ -95960 -81893 95194 -196324 -365969 145556 -134108 -162273 -73140 -315514 -40479 -28839
8986b8839A6703M9153b74387M066a22619j40400C7220b54652C46081a87078F8656
$$ -28839 16703 65856 -274387 -270321 -122619 -263019 37220 -254652 346081 -187078 68656
8974c9301h441k85489i250A42413b8871A19183c79893a09812L3720j46853B13554
$$ -39301 -8441 -293930 -9250 142413 -28871 119183 -379893 -109812 -76092 -222945 213554
8962B1653L0150b08885B67909i5239L1309m0049c2294k895b760A49004i9192J6613
$$ 21653 51803 -208885 267909 -95239 -63930 -103979 -32294 -35189 -2760 149004 -99192 -82579
8950h2579B12232M9453a5714j24353c0762l95582g576E4600i0642I0670l2910
$$ -82579 212232 261685 -15714 -140067 -30762 -426344 -7576 54600 -90642 90670 57760
8939E7760a47109B84507D4438M19258D8655M56735A56923L8713G2725R1239M7598
$$ 57760 -147109 284507 44438 463696 48655 505390 156923 195636 72725 163964 211562
8928B11562h5339B68913J0350A07809M90987J007348O157343J500204B416878
$$ 211562 -85339 268913 279263 107809 598796 1606144 7763487 9263691 2416878
8918C56577J4227K066c88279J48394E6555c13661A10992a94949g0888A25064K58625
$$ 356577 370804 372870 -388279 -239885 56555 -313661 110992 -194949 -70888 125064 383689
8907C83689G4415k3107N3893l0473N0169i9409H341J06017i5428F7983b40249
$$ 383689 74415 51308 105201 74728 124897 -99409 8341 114358 -95428 67983 -240249
8895C01228H1443N842c09860J15225q0174b507B70084a50402e0064k04798J02487
$$ 301228 81443 87285 -309860 -194635 -274809 -2507 270084 -150402 -50064 -254862 -152375
8884a52375j8943c5512o2569A40663E279a74315c3379j70544A8512c0750l9819
$$ -152375 -171318 -35512 -98081 140663 5279 -174315 -33379 -203923 18512 -30750 -70569
8873g0569D6787d910m09244j57003b73974j04023Q1506K4846i8493B74956a37708
$$ -70569 46787 -4910 -414154 -571157 -273974 -377997 -296491 -271645 -98493 274956 -137708
8861H1642c558F4075b96505a00014j31571J12770A24515R5087f448q076j84102
$$ 81642 -3558 64075 -296505 -100014 -231585 -118815 124515 219602 -6448 -14524 -198626
$$ [...]
##END NTUPLES=NMR SPECTRUM
##END=
