
##TITLE=AC1292_BRARS11103_6613942_1T3xleJ703
##JCAMPDX= 6.0         $$ Bruker NMR JCAMP-DX V2.0
##DATA TYPE= NMR SPECTRUM
##DATA CLASS= NTUPLES
##ORIGIN= BRUKER
##OWNER= Administrator
$$ 1.72 TOPSPIN		Version 2.1
$$ 2012-08-02 14:46:45.968 -0500  Administrator@TOPSPIN
$$ Compression mode = diff/dup
##.OBSERVE FREQUENCY= 400.02188249412
##.OBSERVE NUCLEUS= ^1H
##.ACQUISITION MODE= SIMULTANEOUS (DQD)
##.ACQUISITION SCHEME= undefined
##.AVERAGES= 8
##.DIGITISER RES= 22
##SPECTROMETER/DATA SYSTEM= spect
##.PULSE SEQUENCE= zg30
##.SOLVENT NAME= COFFEE_meoh
##.SHIFT REFERENCE= INTERNAL, COFFEE_meoh, 1, 14.98509
##AUDIT TRAIL= $$ (NUMBER, WHEN, WHO, WHERE, PROCESS, VERSION, WHAT)
$$ ##TITLE= Audit trail, TOPSPIN		Version 2.1
$$ ##JCAMPDX= 5.01
$$ ##ORIGIN= Bruker BioSpin GmbH
$$ ##OWNER= Administrator
$$ $$ C:\Bruker\TOPSPIN/data/COFFEE/nmr/AC1292_BRARS11103_6613942_1T3xleJ703/10/pdata/1/auditp.txt
$$ ##AUDIT TRAIL=  $$ (NUMBER, WHEN, WHO, WHERE, PROCESS, VERSION, WHAT)
(   1,<2012-08-02 14:46:38.812 -0500>,<Administrator>,<TOPSPIN>,<go>,<TOPSPIN 2.1>,
      <created by zg
	started at 2012-08-02 14:45:31.890 -0500,
	POWCHK enabled, PULCHK disabled,
       configuration hash MD5:
       6B 1B 68 BB D9 2E 58 E2 7F 35 AD 54 07 DF 0E 41
       data hash MD5: 64K
       3D 10 2A 66 12 72 4A FB 99 49 E1 6B 08 59 12 29>)
(   2,<2012-08-02 14:46:41.718 -0500>,<Administrator>,<TOPSPIN>,<proc1d>,<TOPSPIN 2.1>,
      <Start of raw data processing
       efp LB = 0 FT_mod = 6 PKNL = 1 PHC0 = 0 PHC1 = 0 SI = 32K 
       data hash MD5: 32K
       D2 30 C3 92 E6 31 45 F4 B9 FD F4 50 18 ED 36 CA>)
(   3,<2012-08-02 14:46:42.062 -0500>,<Administrator>,<TOPSPIN>,<proc1d>,<TOPSPIN 2.1>,
      <pk PHC0 = 179.9451 PHC1 = 0 
       data hash MD5: 32K
       45 D0 03 CD BE 90 CD 8A 31 D8 96 40 C0 64 30 17>)
(   4,<2012-08-02 14:46:42.125 -0500>,<Administrator>,<TOPSPIN>,<proc1d>,<TOPSPIN 2.1>,
      <abs ABSG = 1 
       data hash MD5: 32K
       95 B6 7D 55 D8 47 76 FB A4 5F 1A 1E 09 95 D4 17>)
(   5,<2012-08-02 14:46:42.156 -0500>,<Administrator>,<TOPSPIN>,<proc1d>,<TOPSPIN 2.1>,
      <abs ABSG = 2 
       data hash MD5: 32K
       9A 60 73 05 64 D0 D4 DF AB AC 7A D2 D2 6D 2D AD>)
(   6,<2012-08-02 14:46:42.187 -0500>,<Administrator>,<TOPSPIN>,<proc1d>,<TOPSPIN 2.1>,
      <abs ABSG = 3 
       data hash MD5: 32K
       A8 8C 62 B2 14 F8 CA 5C 6E 04 64 A0 A5 CA 8A 73>)
(   7,<2012-08-02 14:46:42.218 -0500>,<Administrator>,<TOPSPIN>,<proc1d>,<TOPSPIN 2.1>,
      <abs ABSG = 4 
       data hash MD5: 32K
       6E 05 CD AA 3F F9 F2 39 F9 75 52 9F 2B 66 B0 05>)
(   8,<2012-08-02 14:46:42.250 -0500>,<Administrator>,<TOPSPIN>,<proc1d>,<TOPSPIN 2.1>,
      <abs ABSG = 5 
       data hash MD5: 32K
       90 2B 77 1A 60 0A 85 6B 86 0A 4F 9C 59 35 E3 66>)
$$ ##END=
$$ 
$$ $$ hash MD5
$$ $$ 12 85 4D 0A 84 05 5C 81 F7 FD 1B 24 29 9C 2B B6
##$RELAX= 
##$RELAX= 
##$RELAX= 
##$RELAX= 
##$RELAX= 
##$RELAX= 
##$RELAX= 
$$ Bruker specific parameters
$$ --------------------------
$$ [...]
##$TP= (0..7)
150 150 150 150 150 150 150 150
##$TP07= 0
##$TPNAME0= <>
##$TPNAME1= <>
##$TPNAME2= <>
##$TPNAME3= <>
##$TPNAME4= <>
##$TPNAME5= <>
##$TPNAME6= <>
##$TPNAME7= <>
##$TPOAL= (0..7)
0.5 0.5 0.5 0.5 0.5 0.5 0.5 0.5
##$TPOFFS= (0..7)
0 0 0 0 0 0 0 0
##$TUNHIN= 0
##$TUNHOUT= 0
##$TUNXOUT= 0
##$USERA1= <user>
##$USERA2= <user>
##$USERA3= <user>
##$USERA4= <user>
##$USERA5= <user>
##$V9= 5
##$VALIST= <valist>
##$VCLIST= <CCCCCCCCCCCCCCC>
##$VD= 0
##$VDLIST= <DDDDDDDDDDDDDDD>
##$VPLIST= <PPPPPPPPPPPPPPP>
##$VTLIST= <TTTTTTTTTTTTTTT>
##$WBST= 1024
##$WBSW= 4
##$XGAIN= (0..3)
0 0 0 0
##$XL= 0
##$YL= 0
##$YMAX_a= 487907
##$YMIN_a= -629700
##$ZGOPTNS= <>
##$ZL1= 120
##$ZL2= 120
##$ZL3= 120
##$ZL4= 120
##$ABSF1= 14.98509
##$ABSF2= -5.573092
##$ABSG= 5
##$ABSL= 3
##$ALPHA= 0
##$AQORDER= 0
##$ASSFAC= 0
##$ASSFACI= 0
##$ASSFACX= 0
##$ASSWID= 0
##$AUNMP= <proc_prof1d_extract_pilot.lims>
##$AXLEFT= 0
##$AXNAME= <>
##$AXNUC= <1H>
##$AXRIGHT= 0
##$AXTYPE= 0
##$AXUNIT= <>
##$AZFE= 0.1
##$AZFW= 0.1
##$BCFW= 0
##$BC_mod= 0
##$BYTORDP= 0
##$COROFFS= 0
##$CY= 15
##$DATMOD= 1
##$DC= 0
##$DFILT= <>
##$DTYPP= 0
##$F1P= 0
##$F2P= 0
##$FCOR= 0.5
##$FTSIZE= 32768
##$FT_mod= 6
##$GAMMA= 0
##$GB= 0
##$INTBC= 1
##$INTSCL= 1
##$ISEN= 128
##$LB= 0
##$LEV0= 0
##$LPBIN= 0
##$MAXI= 10000
##$MC2= 0
##$MEAN= 0
##$ME_mod= 0
##$MI= 0
##$NCOEF= 0
##$NC_proc= -8
##$NLEV= 6
##$NOISF1= 0
##$NOISF2= 0
##$NSP= 0
##$NTH_PI= 0
##$NZP= 0
##$OFFSET= 14.98509
##$PC= 1
##$PHC0= 179.9451
##$PHC1= 0
##$PH_mod= 1
##$PKNL= yes
##$PPARMOD= 0
##$PPDIAG= 0
##$PPIPTYP= 0
##$PPMPNUM= 2147483647
##$PPRESOL= 1
##$PSCAL= 4
##$PSIGN= 0
##$PYNMP= <proc.py>
##$REVERSE= no
##$SF= 400.02
##$SI= 32768
##$SIGF1= 0
##$SIGF2= 0
##$SINO= 400
##$SIOLD= 32768
##$SPECTYP= <>
##$SREGLST= <1H.CDCl3>
##$SSB= 0
##$STSI= 32768
##$STSR= 0
##$SW_p= 8223.68421052631
##$SYMM= 0
##$S_DEV= 0
##$TDeff= 65536
##$TDoff= 0
##$TI= <>
##$TILT= no
##$TM1= 0
##$TM2= 0
##$TOPLEV= 0
##$USERP1= <user>
##$USERP2= <user>
##$USERP3= <user>
##$USERP4= <user>
##$USERP5= <user>
##$WDW= 1
##$XDIM= 32768
##$YMAX_p= 444228203
##$YMIN_p= -652905
##$CURPLOT= <Network HP LaserJet P1505>
##$CURPRIN= <$Network HP LaserJet P1505>
##$DFORMAT= <normdp>
##$LAYOUT= <+/1D_H.xwp>
##$LFORMAT= <normlp>
##$PFORMAT= <normpl>
##$SURQMSG= 1
$$ End of Bruker specific parameters
$$ ---------------------------------
##NTUPLES= NMR SPECTRUM
##VAR_NAME=  FREQUENCY,     SPECTRUM/REAL,   SPECTRUM/IMAG
##SYMBOL=    X,             R,               I
##VAR_TYPE=  INDEPENDENT,   DEPENDENT,       DEPENDENT
##VAR_FORM=  AFFN,          ASDF,            ASDF
##VAR_DIM=   32768,         32768,           32768
##UNITS=     HZ,            ARBITRARY UNITS, ARBITRARY UNITS
##FACTOR=    0.250966925370066, 1,           1
##FIRST=     8223.43324360094, -159379,      -77174
##LAST=      0,             114183,          -43470
##MIN=       0,             -652905,         0
##MAX=       8223.43324360094, 444228203,    0
$$ Real data points
##PAGE= N=1
##DATA TABLE= (X++(R..R)), XYDATA
$$ [...]
19507A4314a12292l14071d888A13635j8906e4127n5938A7348c16048d8576j05495
19496a54071J737H0177l7657d60990J92582q5826I5621e10883J67110J24605P0171
19485a48997A80635b53690B23799e016j8570k7523G4471a06130p1533A95647c29257
19473a88558a2281H9636c02165c4313B22977a39145I1612N3519a90399o5209B87953
19461G8061a63965H9735J27604I4148a89505A4865K057e0194j2669j74489F51
19449B51090D4430J61627a08587I0117c85912a60542a7191B6501J37862b11640
19438A1213K1955K66919r3834a55916g6494D5761R1521B1719L5491a08966j47257
19427b56223A99580a25618B07459o8357a44246A88768E8208b00101C9570b18315
$$ plain form
19507 14314 -112292 -426363 -4888 113635 94729 -54127 -110065 17348 -316048 -48576 -154071
19496 -154071 -152334 80177 42520 -460990 -268408 -354234 95621 -510883 -343773 -219168 -148997
19485 -148997 180635 -253690 223799 -5016 -23586 -51109 74471 -106130 -177663 195647 -329257
19473 -188558 -12281 89636 -302165 -34313 222977 -139145 91612 145131 -190399 -255608 287953
19461 78061 -163965 89735 217339 94148 -189505 14865 16922 -50194 -62863 -237352 651
19449 251090 44430 206057 -108587 90117 -385912 -160542 -17191 26501 164363 -211640
19438 11213 33168 300087 206253 -155916 -76494 45761 137282 21719 57210 -108966 -256223
19427 -256223 199580 -125618 207459 139102 -144246 188768 58208 -200101 39570 -218315
19416b38008j2282A36646d4031n00713c0532j3495k14518Q4283p1037A43540o5104
19405G8436a55065j51978i0440A00271E57a69841B6396J05622l1614a52225B64178
19393a75805A6007J58691C5958p902J4325b9557H580K2967b4946j56856j29769
19382c11571k8393B1117a85028A9345N8339c72985B18097E9833K11692f09k73271
19371b73880a29314N0597a1860j80489G1936b72279N8570P7596k73678B0656K2679
19360D3335a38k20596j18929b031k53088Q0451r2596i4616l0751F5388a37115
19348A3466J4314a21790B40170a32038B0317g5434r7564j49373a25328j23564
19338b48892D6496K89666C308a81999L2296A23154M5611a32770A69721c21775
$$ plain form
19416 -238008 -250290 136646 -44031 -544744 -30532 -44027 -258545 -174262 -245299 143540 78436
19405 78436 -155065 -307043 -90440 100271 557 -169841 26396 132018 100404 -152225 264178
19393 -175805 16007 174698 35958 28056 42381 -29557 8580 31547 -24946 -181802 -311571
19382 -311571 -339964 21117 -185028 19345 77684 -372985 218097 59833 271525 -609 -273880
19371 -273880 -129314 -78717 -11860 -192349 71936 -272279 -213709 -136113 -409791 20656 43335
19360 43335 -138 -220734 -339663 -2031 -255119 -174668 -267264 -94616 -125367 65388 -137115
19348 13466 27780 -121790 240170 -132038 20317 -75434 -172998 -322371 -125328 -248892
19338 -248892 46496 336162 3308 -181999 -149703 123154 168765 -132770 169721 -321775
19327h6439c1117R938l15728p4842A99372a54006B17832m5832l3700d46439J77466
19316b68973F3671k2889P7927a11570C4887b38487C95147b04913H2944b16016
19305a98790F5207B926J15532f3250K3212j36367b5650k24142I5969a00523r4113
19294a94636N2500B1974h5928j7392l0947N1913A99739m4489B1009b48425A26350
19282C8240K8929e2835j61179q1152e4374C4218h0476C01608a64973E194a0509
19270a35462D8505f3889k49397a18867d6714C2903K04431d0903r4738l6159A7233
19258h9940L8704J6166n0924d0642C13576L4575h5037j97161D5339e8415r9569
19247a57984P503c8598j23497A62183a9849k09159e7995B16509G64J41089l0405
$$ plain form
19327 -86439 -31117 -21179 -336907 -411749 199372 -154006 217832 172000 138300 -446439 -268973
19316 -268973 63671 40782 118709 -111570 34887 -238487 395147 -204913 82944 -216016
19305 -198790 65207 2926 118458 -63250 -40038 -176405 -25650 -249792 95969 -100523 -194636
19294 -194636 -142136 21974 -85928 -103320 -134267 -82354 199739 155250 21009 -248425 126350
19282 38240 67169 -52835 -214014 -295166 -54374 34218 -80476 301608 -164973 5194 -10509
19270 -135462 48505 -63889 -313286 -118867 -46714 32903 237334 -40903 -135641 -171800 17233
19258 -89940 -51236 -35070 -85994 -40642 313576 348151 -85037 -282198 45339 -58415 -157984
19247 -157984 -150481 -38598 -162095 162183 -19849 -229008 -57995 216509 764 141853 111448
19236A11448O6739O523b67355O9052j16488B3172K26641c47026B3079d3840o3260
19225a07100b3020l03147f1550o2402N9314j73223C25471i2296j59268A27800
19214C9800f4334I589K29859b34175q9800f289k43983B3120a00145l3063m21946
19203e55154A935b60056M6472J8784I2573b02387B36506J36772a95229R5521l27360
19192d27068K10933p0489F9789d18037e572A89847a1839C5025b6461q7660j80534
19181b94655F2423a50887B62052c00039C37627a75834O7922m4710J9740B8709
19170a12073B06567b72063R9669F8189a79766c9495A06216l4916b56707A12007
19159a08320q6207A7101a42331d1535K139l26617a73718j30314H3884L9690a33864
$$ plain form
19236 111448 178187 184710 -267355 -198303 -314791 23172 249813 -347026 23079 -43840 -107100
19225 -107100 -23020 -326167 -61550 -123952 -64638 -237861 325471 -92296 -251564 127800
19214 39800 -64334 9589 239448 -234175 -323975 -6289 -250272 23120 -100145 -133208 -555154
19203 -555154 1935 -260056 -213584 -194800 92573 -202387 236506 373278 -195229 -99708 -427068
19192 -427068 -216135 -286624 69789 -418037 -5572 189847 -11839 35025 -26461 -114121 -294655
19181 -294655 62423 -150887 262052 -300039 337627 -175834 -107912 -152622 -132882 28709
19170 -112073 206567 -272063 -172394 68189 -179766 -39495 106216 71300 -256707 112007
19159 -108320 -194527 17101 -142331 -41535 -39396 -366013 -173718 -304032 83884 123574 -133864
19147i0874d5357p8140k4842J4614q2095N1186b8557j0732m18043K12175A9799
19135b30358B83192G3519a6943o8251L2850A34827P9914J38777D1449c3893o4658
19124i8551A5596f7878D3895a44962N8208c5450k57129d2611B27342b21874e1102
19112H8229b2474h340A66356a7365q9857M0671I927K51719e20123C03965b62025
19100a96207Q3524j2971h751q5593B8568a73547j24322J46642A36727b91870G9983
19088c07002A94533h7329A36482c00127a9347l16841E8597b71196B3263I481J31268
19077A40749M0248a72906O6938n3048B16214I6961M5526o3485d2451B04694a56751
19065A15278a16695C0135Q7897o789b2937j35097L1249j46173d5416j93320j12403
$$ plain form
19147 -90874 -45357 -123497 -148339 -133725 -215820 -164634 -28557 -39289 -457332 -245157 19799
19135 -230358 283192 73519 -16943 -85194 -52344 134827 214741 353518 41449 -33893 -98551
19124 -98551 15596 -67878 43895 -144962 -86754 -35450 -292579 -42611 227342 -221874 -51102
19112 88229 -22474 -8340 166356 -17365 -107222 -66551 9927 261646 -520123 303965 -262025
19100 -196207 -112683 -125654 -8751 -94344 28568 -173547 -297869 -151227 136727 -291870 79983
19088 -307002 194533 -87329 136482 -300127 -19347 -336188 58597 -271196 23263 9481 140749
19077 140749 180997 -172906 -105968 -159016 216214 96961 142487 79002 -42451 204694 -156751
19065 115278 -116695 30135 118032 111243 -22937 -158034 -126785 -272958 -45416 -238736 -351139
19054c51139F1277K12015C7235h5099A56409m6678i7390j9911e7005j62876H0560
19042A33011b16813b2388j11398I5737B2594J96032C7487N2873D2857b75786g8504
19030c35870d1651C19297B6054d5533F4590f6275k90397a20698l8933E5423a26972
19018d3882l4051G2677J12921B6521g9067L7030n7153A47463E4697K2039f0687
19006B6533J18168B2474K56610E1409a54985c2340A40804n2485J8515a16826j26627
18995b43453l8594r0224R6204A44162a88973A08342a7768I0344c439j61409F8552
18983C2842J62666e8087j01089A29377D9968Q3045N1195a99618r0483l589B74796
18971A0542f7223A2627a4432m0529B1675a27814e021D8210J73116f3069H6501
$$ plain form
19054 -351139 61277 273292 37235 -85099 156409 109731 -97390 -117301 -57005 -219881 80560
19042 133011 -216813 -22388 -133786 95737 22594 218626 37487 90360 42857 -275786 -78504
19030 -335870 -41651 319297 26054 -45533 64590 -66275 -356672 -120698 -159631 55423 -126972
19018 -43882 -77933 72677 185598 26521 -79067 -42037 -99190 147463 54697 76736 -60687
19006 26533 144701 22474 279084 51409 -154985 -32340 140804 88319 106834 -116826 -243453
18995 -243453 -282047 -372271 -276067 144162 -188973 108342 -17768 90344 -3439 -164848 68552
18983 32842 195508 -58087 -159176 129377 49968 133013 184208 -199618 -290101 -293690 274796
18971 10542 -67223 12627 -14432 -54961 21675 -127814 -5021 48210 221326 -63069 86501
18959a85108A47850b3527k33886c6227q4211e9145B32467c87029d5693B28248
18948B5937a42718q2107i5415G5077K87466c58408B48093H8286a26534B64510
18937A90915k7584l3787D074J79921c3188a681A02170b27714a9114l29307d2865
18925i0559j6312K8830J3417j62859I7116f9343J5079A82169a87747P1079L4669
18914h1999B40432m9501i6976j54073A06054a51828A53629C156a69940Q582l8045
18903a99403r7617e2918D34858g5347j46420R5088A40705b9780m7986m1099a9140
18891c24766C88932b26973B02066a26167d7279A613b07697Q709j80423A59547
18880A24276c28552O3367E0444K1645K6820P9811a02787b3748j96635A6435c34272
$$ plain form
18959 -185108 147850 -23527 -257413 -36227 -120438 -59145 232467 -387029 -45693 228248
18948 25937 -142718 -224825 -95415 75077 362543 -358408 248093 88286 -126534 264510
18937 190915 163331 129544 4074 183995 -33188 -1681 102170 -227714 -19114 -348421 -42865
18925 -90559 -106871 -78041 -64624 -227483 97116 -69343 -54264 182169 -187747 -116668 -81999
18914 -81999 240432 190931 -96976 -251049 106054 -151828 153629 3156 -169940 -161358 -199403
18903 -199403 -297020 -52918 434858 -75347 -221767 -126679 140705 -29780 -77766 -118865 -19140
18891 -324766 388932 -226973 202066 -126167 -47279 1613 -207697 -198988 -379411 159547
18880 124276 -328552 -265185 50444 72089 98909 178720 -102787 -23748 -220383 16435 -334272
18868B89905H5793J08561h2553C0182e3898j64308E6252e2177I0045b1067A13120
18856A2462L6000c64457a69556j04413b7133H0565J39411b04161n8965a7123I8967
18844c30749d9585G6911a06762E1215b71533j4195A22513J72848e4264A64556
18833a99335N4211I665a48728c6066A73436a11920F3464h9617n4441A84117b5829
18821a16061k27053g6879C82273B9830b95036g0279j95628F613J39304a01975
18810a19627C5953g7920j34002A78732h4617A4154e07507a13322I926c45824D9960
18798D9279d6030A1060J41248m7976D8987e5715q5764B79829a68935N8243c4314
18786a23885c0481A42561K68531A4952b92304C05462A48229O0953a04183j92851
$$ plain form
18868 289905 85793 194354 -82553 30182 -53898 -218206 56252 -52177 90045 -21067 113120
18856 12462 48462 -364457 -169556 -273969 -27133 80565 219976 -204161 -263126 -17123 98967
18844 -330749 -49585 76911 -106762 51215 -271533 -285728 122513 295361 -54264 164556
18833 -199335 -145124 9665 -148728 -36066 173436 -111920 63464 -89617 -144058 184117 -25829
18821 -116061 -343114 -76879 382273 29830 -295036 -70279 -265907 6613 145917 -101975
18810 -119627 35953 -77920 -211922 178732 -84617 14154 -507507 -113322 9926 -345824 49960
18798 49279 -46030 11060 152308 104332 48987 -55715 -141479 279829 -168935 -110692 -34314
18786 -123885 -30481 142561 411092 14952 -292304 305462 148229 209182 -104183 -297034
18776b97034J40257A56338J19339g4875A06545O5286l787a41626l07900a12531
18765A28685J89673f3454b0229H1946G341Q3165K2241O0707A4574A245a82968
18753b41710A02802M26258A26296J4859k7686b01162n0848R5131f274A91578a13953
18741C0701h9436k01689A3014K67662D1648O8270a2666G42K27128a78497B9436
18729A90554a99009D1525O9023e1708j10240k48383a49643D2438J13370a34579
18718C69832a84166O6673B30368G8655c6654j90751a08699I2403a00973j54280
18708b55253a14082p9997A38448q609C0176J92774b54608e562m21057A30838J0040
18697A40878d8324H4729B1905L60234c90017A50719c5744B08675E5675c46504
$$ plain form
18776 -297034 -156777 156338 275677 -74875 106545 171831 168044 -141626 -449526 -112531
18765 128685 318358 -63454 -20229 81946 7341 90506 112747 173454 14574 1245 -182968
18753 -241710 102802 529060 126296 141155 113469 -201162 -252010 -156879 -6274 191578 -113953
18741 30701 -89436 -291125 13014 280676 41648 109918 -12666 742 227870 -178497 29436
18729 190554 -199009 41525 110548 -51708 -161948 -410331 -149643 42438 155808 -134579
18718 369832 -184166 -117493 230368 78655 -36654 -227405 -108699 92403 -100973 -255253
18708 -255253 -114082 -194079 138448 129839 30176 222950 -254608 -5562 -426619 130838 140878
18697 140878 -48324 84729 21905 382139 -390017 150719 -35744 208675 55675 -346504
18686A46457k0338Q2860C5861J28795i5539m5958M6158B67318b09378j9254J13770
18675a14862k83257g1293j1231o5177q0003I8086J5888a58768F4668O879b79529
18663a83295o0144J06094j38948J34402j49951a34621A12125A5753R619M8415
18653G3787d22152F0736f309B45812L2552h9095A81599b32623b1188q4017A83322
18641a35642M9326k02805A04914A3706c18912J37670l02556g0720A42150b18556
18630d2573E1464d93767i4227K3870k61059D0588C053i8643b2155l98690a9805
18618C5600b1401E8389d3117l46542R6964B89608a53170A3483R2006b01525C03449
18606A10661m5297g4598A11822C1194K7175b16810A21268a61894i905B43405b31218
$$ plain form
18686 146457 126119 208979 35861 164656 -95539 -141497 -95339 267318 -209378 -228632 -114862
18675 -114862 -398119 -71293 -82524 -147701 -227704 98086 113974 -158768 64668 71547 -279529
18663 -183295 -243439 -137345 -276293 -141891 -291842 -134621 112125 15753 25372 73787
18653 73787 -422152 60736 -6309 245812 278364 -89095 181599 -232623 -21188 -105205 183322
18641 -135642 -86316 -289121 104914 13706 -318912 -181242 -483798 -70720 142150 -218556
18630 -42573 51464 -493767 -94227 -70357 -331416 40588 3053 -98643 -22155 -420845 -19805
18618 35600 -21401 58389 -43117 -389659 -292695 289608 -153170 13483 105489 -201525 303449
18606 110661 65364 -74598 111822 31194 58369 -216810 121268 -161894 -9905 243405 -231218
18594H04b95668A23756g3425a5089j70554K8505K2352J6991c4222n57918b03176
18582a55480M9572b9210k46850e3665D581O8576b6591j04460b3219n8731q0859
18571a62809d9425A01740g162j16323C21884b59210K5825A98475a00931j98549
18561b99480b5370m6969j35759f5451e749j97286l3258b1431j82530A40972a89539
18549c24968b5501E130a56156I0463j380c11816j35951C7329R0546l9993Q1931
18538A69813a52557N3188M8802B04658b70815j54916d6026A55802J26612a58636
18527a02258n6386C99170c4293a1466k38990B86534a25478A38825b23239A59172
18516a34484m0808C4800N4757H625c58086f0476a0759n6930j40286j36309G2652
$$ plain form
18594 804 -295668 123756 -73425 -15089 -185643 -157138 -134786 -117795 -34222 -592140 -203176
18582 -155480 -105908 -29210 -276060 -53665 4581 73157 -26591 -131051 -23219 -81950 -162809
18571 -162809 -49425 101740 -7162 -123485 321884 -259210 -233385 198475 -100931 -299480
18561 -299480 -25370 -72339 -208098 -65451 -5749 -203035 -236293 -21431 -203961 140972 -189539
18549 -324968 -25501 5130 -156156 90463 89083 -311816 -447767 37329 127875 87882 169813
18538 169813 -152557 -99369 -50567 204658 -270815 -425731 -46026 155802 282414 -158636
18527 -102258 -158644 399170 -34293 -11466 -250456 286534 -125478 138825 -223239 159172
18516 -134484 -175292 34800 89557 8625 -358086 -60476 -10759 -67689 -207975 -344284 72652
18504G9203N9370a2362k14179E3268B0580a40380f1702E1133b7147H3953C3064
18492F4613K51633a50041j29328R5316j35666A34185d4269n0270I5872g1099m8767
18481a19866j76625H8076M61a78512k87480A21534a0561l2184A01766b6628A34778
18469b92031J09615m6584d5494B33673a07128c4312j09624D81J66011k8414J65523
18458C03601a53855j98277C99388a73506L8166o0249N050a8666F9269j3708e0989
18446a62496g1050j83211A27331a3156j75701q7516C3556K7040a12714j81781
18436b94495D0106c27597A51375O654c6881D474b04349D8533j8502g66G6757e2919
18423A29504b4421C73626a34296f5474A84139a35242A53329c49971a30087I1596
$$ plain form
18504 79203 138573 -12362 -226541 53268 20580 -140380 -61702 51133 -27147 83953 33064
18492 64613 316246 -150041 -279369 -184053 -319719 134185 -44269 -94539 95872 -71099 -119866
18481 -119866 -296491 88076 88537 -178512 -465992 121534 -10561 -42745 101766 -26628 134778
18469 -292031 -182416 -229000 -45494 233673 -107128 -34312 -143936 481 166492 138078 303601
18458 303601 -153855 -352132 399388 -173506 -135340 -195589 -190539 -18666 69269 55561 -50989
18446 -162496 -71050 -254261 127331 -13156 -188857 -276373 33556 60596 -112714 -294495
18436 -294495 40106 -327597 151375 158029 -36881 4474 -204349 48533 30031 -766 76757 -52919
18423 129504 -24421 373626 -134296 -65474 184139 -135242 153329 -349971 -130087 91596
18412c97998B4745a37130j8893C5618K03274F4493J51428i0068B74413d7677F1105
18400E0805P3219a8569D9543a31631d7386C7040a16638I485J53359f0496D9413
18388A0248a80978F9245a94009c8122J0581I5526c9492o9227L1840p5075C6814
18376b74834J35106a7701B29156a12639L4969o9046j04160D4888b30229A4463
18365b26448a05979j14179E3737M2789K92465a37278C18092a12212j72392O0069
18355b24535C73122e3649B1033b21299J02899A30029c30397A99404H6366g0265
18344B34623a21426B91054f5892j65158F2577O425J16072f8953A53299a07028
18333i1560l5628A2541a59629A32652a76826A88053f6452j55088N8643j75230
$$ plain form
18412 -397998 24745 -137130 -156023 35618 238892 64493 215921 -90068 274413 -47677 61105
18400 50805 124024 -18569 49543 -131631 -47386 37040 -116638 9485 162844 -60496 49413
18388 10248 -180978 69245 -194009 -38122 -27541 95526 -39492 -108719 -76879 -151954 36814
18376 -274834 -139728 -17701 229156 -112639 -77670 -146716 -250876 44888 -230229 14463
18365 -226448 -105979 -220158 53737 96526 388991 -137278 318092 -112212 -284604 -224535
18355 -224535 373122 -53649 21033 -221299 -118400 130029 -330397 199404 86366 -70265
18344 234623 -121426 291054 -65892 -231050 62577 69002 185074 -68953 153299 -107028
18333 -91560 -127188 12541 -159629 132652 -176826 188053 -66452 -221540 -162897 -338127
18323c38127h7260b0940A05320O1216e4700A02028C0050a20142A55056g3948j03807
18312a77755B41888G6816N351l5206R8441D1158J56402a71271J2476c0668l5498
18301f6166B16331B9316J22800a56119A64992b1499j24304L9197q6757O6758j14690
18290b41295e8995o71n0249M9595E3996B2728d1707l0891B06160a8420j60740
18279a79160b0057m6549A11726e7678k37593K8564A98244o6185L4965b7278C9393
18267I2290b41486J8146k40759A41995d9339B1811a80747j31588a15421q4142
18257a99563k25535a64283R453P5271A65725g5699k80680g0763j17776A73147
18246A75359G4364Q4650a02442m4745F4907j8267J58124a2323j87889C9762O2085
$$ plain form
18323 -338127 -87260 -20940 105320 166536 -54700 102028 30050 -120142 155056 -73948 -177755
18312 -177755 241888 76816 82167 46961 145402 41158 197560 -171271 -158795 -30668 -66166
18301 -66166 216331 29316 152116 -156119 164992 -21499 -145803 -106606 -193363 -126605 -241295
18290 -241295 -58995 -59666 -109915 -60320 53996 22728 -41707 -72598 206160 -18420 -179160
18279 -179160 -20057 -66606 111726 -57678 -295271 -266707 198244 132059 167024 -27278 39393
18267 92290 -241486 -223340 -464099 141995 -49339 21811 -180747 -312335 -115421 -199563
18257 -199563 -425098 -164283 -154830 -79559 165725 -75699 -356379 -70763 -188539 173147
18246 175359 74364 159014 -102442 -147187 64907 46640 204764 -12323 -200212 39762 101847
18235A01847b1267j24039F3852b54142e5662B27302E8100b0900G2060P7452D7109
18223D7941f1562k07825a21696A02891j4259c8769k11784j01149i5844c0161j08023
18212a38184m7298B42159a83882b7913A4358M3775d3559m5019r5789O9304j01447
18201b16510q5651A33573c99738e659m7354b5831m5626E9874J9943J0983c50802
18189c36173B03534a24558p2238L1510o0306c2111n2914j82195F8462b11773A13753
18177D4120h4309K357p7313E3773J01043m6115J88453j38708f8319j62294K9730
18166b00883j18280A88003p0974K7073b7921k18611R42k8037D5958J25479a00421
18154c00161F4454K12701a01534A06350K79446b49643A58304c3670n59255C3305
$$ plain form
18235 101847 -21267 -145306 63852 -254142 -55662 227302 58100 -20900 72060 149512 47109
18223 47941 -61562 -269387 -121696 102891 88632 -38769 -250553 -351702 -95844 -30161 -138184
18212 -138184 -185482 242159 -183882 -27913 14358 58133 -43559 -88578 -184367 -115063 -216510
18201 -216510 -302161 133573 -399738 -5659 -53013 -25831 -71457 59874 79817 90800 -350802
18189 -336173 203534 -124558 -196796 -165286 -225592 -32111 -85025 -267220 68462 -211773 113753
18177 44120 -84309 -81952 -159265 53773 154816 108701 297154 158446 -68319 -230613 -200883
18166 -200883 -319163 188003 117029 144102 -27921 -246532 -245590 -273627 45958 171437 -100421
18154 -300161 64454 277155 -101534 106350 385796 -249643 158304 -33670 -592925 33305
18143i1420K9589H7260g6171n087B16221a99626A7600L9729c30628E7944a49296
18131c22630J23366d50k19822l74328b01793B57190a6701r6391j26821c5134k46247
18120b81381P4334j82426I5579J91496a25359B49756E6400L24650b00169J8672
18110a81497k0029i0144Q240k4178j91417Q0734B5881c4843C05070f1600j38040
18099a99640A61472a565o2257i711j33865B34693b40196J12698j83791A01137
18088a88233C41259f4128j17228B08753H088R2538d5014q9189d2460D0322b37101
18076c02896B1682K04671b10344B94697i3128B4871J9340a36345D1912b39133
18065b3313l13420H4343J75156j10525c4719k19745J07337A90210a41510f6024
$$ plain form
18143 -91420 -61831 87260 -76171 -81258 216221 -199626 17600 57329 -330628 57944 -149296
18131 -322630 -199264 -450 -220272 -594600 -201793 257190 -16701 -113092 -239913 -35134 -281381
18120 -281381 -207047 -389473 95579 287075 -125359 249756 56400 381050 -200169 -181497
18110 -181497 -201526 -90144 -81904 -106082 -297499 -216765 25881 -34843 305070 -61600 -199640
18099 -199640 161472 -1565 -63822 -9711 -143576 234693 -240196 -127498 -311289 101137
18088 -188233 341259 -64128 -181356 208753 8088 100626 -45014 -134203 -42460 40322 -237101
18076 -302896 21682 226353 -210344 294697 -93128 24871 44211 -136345 41912 -239133
18065 -23313 -336733 84343 259499 148974 -34719 -254464 -147127 190210 -141510 -66024
18054F6788k9308b51208a20496K1328B31413J94916g2169A16459d49209I2619
18043b7619C0704K10675a15904l4584O7489k0324K8908A35416b81622b5289C2026
18031h7226g938k00169A14083a3591e972A57183J23916g7433A37503a20364N2182
18020f8182j2016j4602I4729Q787J54496C3084b10252b8725k4744j93231H3207
18008c6681q1860A49344m8612d1442A49481a99524K9826I2570j902c3456j36427
17997a69883D3073e3568B01341B2397b70129M5712e2685j11158D351L17236c20337
17985C5091a46778B69534g8565k1618i23H520L944a35225A2404b22059A78176
17973B04963h8502K8852l0209G9572P7578b15998e7360j26804D101N2302r539
$$ plain form
18054 66788 37480 -251208 -120496 -99168 231413 426329 -72169 116459 -449209 92619
18043 -27619 30704 241379 -115904 -150488 -82999 -103323 -74415 135416 -281622 -25289 32026
18031 -87226 -7938 -208107 114083 -13591 -5972 157183 281099 -77433 137503 -120364 -68182
18020 -68182 -80198 -94800 94729 103516 258012 33084 -210252 -28725 -53469 -246700 83207
18008 -36681 -118541 149344 100732 -41442 149481 -199524 -169698 92570 90668 -33456 -169883
17997 -169883 43073 -53568 201341 22397 -270129 -224417 -52685 -163843 4351 321587 -320337
17985 35091 -146778 269534 -78565 -100183 -923 8520 12464 -135225 12404 -222059 178176
17973 204963 -88502 -59650 -89859 79572 157150 -215998 -57360 -184164 4101 56403 46864
17962D6864b05159c8672B02813c85571B8406L3917a21051i270o9420R677o4754
17951a33767F7692R0747i8088H5364b60548A72170g5163l32586a37995A65494
17940b98427A94092k8387M7741j01836a8859B08827D9812a32371k96042C3587
17929B671L9344d12797I1160a67314B58610j06221K211R7228F4290K3930B4364
17917c9I2760A5370c9749E9243a3911k8917k17002a04072O55I0610a0084J234
17905h850C28688f9711r0734B77264o2371b95662d4632D7818f7036D4975d86845
17893A19853a78810l9833F477J69372N7023A12770a71954e3011A50166d882l02129
17882c07011a6207A68277a3263j65948C06307d2194j54394B1210a36711b3197
$$ plain form
17962 46864 -205159 -38672 202813 -385571 28406 62323 -121051 -9270 -78690 -69013 -133767
17951 -133767 67692 158439 -98088 85364 -260548 172170 -75163 -407749 -137995 165494
17940 -298427 194092 165705 213446 111610 -18859 208827 49812 -132371 -428413 33587
17929 2671 42015 -412797 91160 -167314 258610 152389 154600 251828 64290 88220 24364
17917 -39 92760 15370 -39749 59243 -13911 -42828 -259830 -104072 -103417 90610 -10084 -8850
17905 -8850 328688 -69711 -160445 277264 214893 -295662 -44632 47818 -67036 44975 -486845
17893 119853 -178810 -218643 6477 175849 232872 112770 -171954 -53011 150166 -4882 -307011
17882 -307011 -16207 168277 -13263 -179211 306307 -42194 -196588 21210 -136711 -23197
17871B67251B4194b14224K8418i605B03992M1042c4655F1817J01444N0840E5149
17859F51f3354F4746e1284B90043a51815B10514C6603M3971m803i1442B22677
17847a27333d0545p0745j46579E2351J28899C4774b6654F6054J99554H9417J8759
17836A08176K15177b35343i1187B57699G3881b75255K8799J05028G2229h6150
17825D00532a82110k2402j27243g2683D63959D262O0448k6003b13199B8221b32127
17813e0000A012i9707A31098k7467C4672a58044A40370R3372K0877K8002o0036
17802B22585J8076f6983O589A3892e859A95J06383R3503A568Q392a93721B21598
17789A19851n6946K35603A11316b37921P7795m9645H4348K11847H626a00866j09648
$$ plain form
17871 267251 24194 -214224 -185806 -9605 203992 245034 -34655 61817 163261 214101 55149
17859 651 -63354 64746 -51284 290043 -151815 210514 36603 80574 75771 -91442 222677
17847 -127333 -40545 -111290 -257869 52351 181250 34774 -26654 66054 265608 89417 108176
17836 108176 323353 -235343 -91187 257699 73881 -275255 -246456 -141428 72229 -86150
17825 400532 -182110 -204512 -331755 -72683 463959 4262 64710 38707 -213199 28221 -232127
17813 -50000 1012 -99707 131098 103631 34672 -158044 140370 233742 254619 282621 222585
17802 222585 240661 -66983 -60394 13892 -5859 195 106578 200081 1568 9960 -193721 221598
17789 119851 62905 298508 111316 -237921 -160126 -209771 84348 296195 8626 -100866 -210514
17778b10514o5018J17016j01777C11640p6065q3532C875L4416e951B84168a85224
17766c4807A12260k9376c32205a60375I5365a08614K4021b5344A93158b35041
17755A7436g5067l036A02015M7835n70a65405A01389a37184a9116A05630g1723
17743G6818J37675N973F1844a9380B99637d8475G9204K0441a89391k04571a57863
17731a62l67970g6078A48141a51346j3394B55961G4735K52629j62179B2896h7814
17719H9565g6672A85756b98289H0955a4072A79119A0131b8167A48018b77119a6681
17707F776i0226A08578Q9614F8356K97225a08041A7519e8013B10595h0883k51572
17696c32455a55709n2768A50610P049n9644J63976a97972A71793k3109D2696J8722
$$ plain form
17778 -210514 -275532 -158516 -260293 311640 235575 152043 3875 38291 -5951 284168 -185224
17766 -34807 112260 82884 -332205 -160375 95365 -108614 -84593 -25344 193158 -235041
17755 17436 -75067 -78103 102015 149850 149280 -165405 101389 -137184 -19116 105630 -71723
17743 76818 214493 220466 61844 -19380 299637 -48475 79204 99645 -189391 -393962 -157863
17731 -162 -368132 -76078 148141 -151346 -164740 255961 74735 327364 165185 22896 -87814
17719 89565 -76672 185756 -298289 80955 -14072 179119 10131 -28167 148018 -277119 -16681
17707 6776 -90226 108578 198192 68356 365581 -108041 17519 -58013 210595 -80883 -332455
17696 -332455 -155709 -208477 150610 157659 98015 261991 -197972 171793 148684 42696 61418
17685F1418M4199d5181C1831K3241g4757C14765j05331l029O638a93118Q1667
17674a11451n1284A94862b07310E9614a56835d4821j42883K5407C62165c06092
17663I2378b3140g090j29513N9629B97888j1202j5224j13122F16J89556a01417
17651a9438A43248J1742B1872f3848G1839k1708O4652B5930K26408N4706F9325
17639I4995a1806J387j59417A57692J75271J01800A78492c5134C03135J36763
17629D39898A8506J04276a71435A17476A6600e4096A06918b19442c240j19739
17619a22979A09569J60544b3750B41132a84086B53449c07540A51569E4030J24193
17609A78223G7010R0824e2035n5951e2453I4520C2127a28158C38344e4671k36043
$$ plain form
17685 61418 105617 -45181 31831 55072 -74757 314765 209434 206405 213043 -193118 -111451
17674 -111451 -162735 194862 -207310 59614 -156835 -44821 -187704 -162297 362165 -306092
17663 92378 -23140 -7090 -136603 -76974 297888 286686 271462 158340 616 190172 -101417
17651 -19438 143248 154990 21872 -63848 71839 50131 114783 25930 252338 307044 69325
17639 94995 -11806 -10419 -169836 157692 332963 434763 178492 -35134 303135 439898
17629 439898 18506 122782 -171435 117476 16600 -54096 106918 -219442 -3240 -122979
17619 -122979 109569 270113 -23750 241132 -184086 253449 -307540 151569 54030 178223
17609 178223 77010 167834 -52035 -107986 -52453 94520 32127 -128158 338344 -54671 -290714
17598b90714B1209a64593B96543f1734A22598d0417l9308A8087K69905A36176
17587D19805j7422q9998k3571d45756E176M1422a35011b377E0909c5362n8709
17576i4071b1250E4404h6633l01220A54899P0842K0104j7913C6516f5440A64373
17564F09157k45763H7519O0954P7450C5034M3549C6399J686J40985J74562G142
17552B56176r6740a78162C44131p7799j30373J57063c2273A11584R9638J16527
17542C27749a15694C44777a92691H2046g4403D5545M89186g4455C42465r732k6458
17531C06275b19826B04480c276B74570H7800b82582A57130a8038C1717N8533K58767
17520C49017q4163A08096L4387K64729A26614K83698o2350E3345J73640F6805
$$ plain form
17598 -290714 21209 -164593 296543 -61734 122598 -40417 -79725 18087 287992 136176
17587 419805 402383 312385 288814 -445756 5176 46598 -135011 -2377 50909 -35362 -94071
17576 -94071 -21250 54404 -86633 -387853 154899 225741 245845 227932 36516 -65440 164373
17564 609157 363394 87519 148473 225923 35034 78583 36399 38085 179070 353632 7142
17552 256176 159436 -178162 344131 266332 135959 293022 -32273 111584 211222 327749
17542 327749 -115694 344777 -192691 82046 -74403 45545 534731 -74455 342465 332733 306275
17531 306275 -219826 204480 -3276 274570 87800 -282582 157130 -18038 31717 90250 349017
17520 349017 264854 108096 142483 407212 126614 410312 347962 53345 226985 66805
17509C53485G9281J15838j2374j696D685R0199j9575K14844a0273j10521B09950
17497E8100K65943r9482p3145P443J5552J46556g3824C98408l1353l8046H989
17485b04968C590J80290d8070D02485A94918K41847j86532Q980K19146M3193A89164
17473B61829j1567d4832J8457C16963D7826m460A9596M6059R4020k2649a59265
17461A82554E782K22408k496j6075d9298A9553R6479L31231A20331P2642Q1404
17450B74377j4046m6712c6168C50814j65752n0189K40181A21586J19885n3401
17440A88070p0734K3597J90191k0507Q2440A29559L64199k33758L7043n2517Q1770
17429C26296A23894a4078B39552K0855B7642J80721Q8865J68884A28979M16625
$$ plain form
17509 353485 79281 195119 182745 181049 4685 94884 75309 290153 -10273 -120794 209950
17497 58100 324043 224561 151416 158859 174411 320967 -73824 398408 367055 329009 8989
17485 -204968 3590 183880 -48070 402485 194918 436765 250233 259213 478359 521552 189164
17473 261829 250262 -44832 -26375 316963 47826 43366 19596 65655 159675 137026 -159265
17461 182554 5782 228190 225694 209619 -49298 19553 116032 447263 120331 192973 274377
17450 274377 260331 213619 -36168 350814 185062 134873 375054 121586 241471 188070
17440 188070 117336 140933 331124 310617 393057 129559 493758 260000 297043 244526 326296
17429 326296 123894 -14078 239552 260407 27642 208363 297228 466112 128979 545604
17419E45604A19515J27338A09029J28286j13632l2847Q8045G7392K14501r6136
17409A95757p6585J73193P9876a55540B60734K1477a39072D4716A4460J78897
17399A93357J21508D0145J1427R4817e8034A70930J74928n5783A15356b943B703
17387c6751J996H487J67208c6770q5257B10887E5819J12696d5146B23899J5411
17376B39310f1446B41497K76794a50234E9227R2391J72352G8447J96781A26906
17365b3855q952D60558a36780B92701A17194O0203j1303A706P1578d6230A22903
17353A27171J73646j50304b96327O4524D5771a02110l0146C0506K44127J8021
17343B92654A29482B5369L32400E824O5550L88516A48789j2990J37195E890L5015
$$ plain form
17419 545604 119515 246853 109029 237315 123683 90836 178881 77392 291893 195757
17409 195757 119172 292365 372241 -155540 260734 282211 -139072 44716 14460 193357
17399 193357 314865 40145 51572 146389 -58034 170930 345858 290075 115356 -2943 2703
17387 -36751 -34755 8487 175695 -36770 -122027 210887 55819 168515 -45146 223899 239310
17376 239310 -61446 241497 518291 -150234 59227 151618 323970 78447 275228 126906
17365 -23855 -32807 460558 -136780 292701 117194 177397 166094 1706 73284 -46230 122903
17353 127171 300817 150513 -296327 -231803 45771 -102110 -132256 30506 274633 292654
17343 292654 129482 25369 357769 5824 71374 459890 148789 135799 272994 5890 40905
17332D0905J38970J30534A06370k1480L17294e3064C57770n0130a8982A6387a22011
17320B04233H9627l8102J94875c3793B17519G6932A0863b8088D1938e7857B02309
17308g3661I9204J52852J65940G2946f1130B30044a84252A96500p9122B1469K4188
17297D5657P2003K72311a53455H4137J9984a2622E60355k77544F4462K44073A51039
17285D8661J0631R1572L0034J24405J04322j66364K8648J17244g4880A06240J70899
17274B77139J08075r3813K06988m4214A29541l8402K4919c6289A13733K08014
17264C21747a45787D08123I2125D1507M33525c1277H8268C7469K43144j11070
17254A69543M6120O3983r2036D7532L93848j94383q7805L54018A88732J48223
$$ plain form
17332 40905 179875 310409 106370 84890 402184 -53064 357770 307640 -18982 16387 -122011
17320 204233 89627 51525 246400 -33793 217519 76932 10863 -28088 41938 -57857 202309
17308 -73661 99204 252056 417996 72946 -61130 230044 -184252 196500 117378 21469 45657
17297 45657 117660 389971 -153455 84137 104121 -12622 560355 282811 64462 308535 151039
17285 48661 59292 150864 180898 305303 409625 243261 271909 389153 -74880 106240 277139
17274 277139 385214 291401 498389 454175 129541 91139 116058 -36289 113733 321747
17264 321747 -145787 408123 92125 41507 475032 -31277 88268 37469 280613 169543
17254 169543 215663 279646 187610 47532 441380 246997 159192 513210 188732 336955
17244C36955A61355f3381B23270J12282r8642K12862J45793A43555f860A07217
17233B95512N7053A32620K43057L5739A54932K0390Q6921A27137P0901K54203
17223D52241d0296D45475H6492F701b10143b4091D34867b19515B36162G7678A5907
17211A47006J92988d9732A67137D3925J34496L39871k36190k6843N7390j26174
17201A86475J35362k1199r1455L88679k86132J64241r522j13282f1904A98494
17190a17610B38520b1966C71338A28485l3719J00526e8962A63764J11983J85771
17180D61518j20328M6007I7180J28554K38631A49162K34113A44795J61846J4828
17170C21469D1873M33155j23437B4726J21444L03856j58669A38493M10649P121
$$ plain form
17244 336955 161355 -63381 223270 335552 236910 449772 595565 143555 -6860 107217
17233 295512 352565 132620 375677 411416 154932 175322 262243 127137 198038 452241
17223 452241 -40296 445475 86492 6701 -210143 -24091 434867 -219515 236162 77678 15907
17211 147006 339994 -49732 167137 43925 178421 518292 282102 255259 312649 186475
17201 186475 321837 300638 209183 597862 311730 475971 466449 353167 -61904 198494
17190 -117610 238520 -21966 371338 128485 94766 195292 -58962 163764 275747 461518
17180 461518 341190 387197 97180 225734 464365 149162 383275 144795 306641 321469
17170 321469 41873 475028 351591 24726 146170 450026 291357 138493 549142 556263
17160E56263a2754B65750M989j167q315M81936G3185K95188J70223j83295j46676
17149B08625M01335B1854J07116J18269Q3852j8736R2910J98716k81519k7761
17139B94701J05157n690a94112D11403j49900q9452J08872A37299J36278M0964
17129C14541D3988K76130Q4073r2116J14181p9185K25336B62447J15545J03445
17119D81437J34535k14718n9598R162q5439q3313L21597m1786L0892j17083j1187
17108C64499J2762J19366F8089K97408n1408N7532A78525K43731J70526r8337
17098D94445j5807n9361O26639A75774N58935C39513R781K64981k548j58465j85022
17087B68240N63606C27821J82498m6688j73059J87519K11503B97200k7900N8383
$$ plain form
17160 556263 -12754 265750 270739 269572 261257 743193 73185 368373 538596 355301 208625
17149 208625 609960 21854 128970 247239 331091 312355 405265 603981 322462 294701
17139 294701 399858 394168 -194112 411403 261503 172051 280923 137299 273577 314541
17129 314541 43988 320118 404191 312075 426256 347071 572407 262447 377992 481437
17119 481437 615972 401254 341656 350818 265379 182066 503663 461877 492769 375686 364499
17108 364499 377261 496627 68089 365497 314089 371621 178525 422256 592782 494445
17098 494445 478638 419277 1045916 175774 734709 339513 349294 614275 611727 453262 268240
17087 268240 831846 327821 510319 463631 290572 478091 689594 297200 269300 327683
17077C27683o0373O8238K13834j83401K19183p8843M8215A70993K15613l7907
17067C48699P6552L5309j09554J85356L03527k19917k58538N19476m04692J95594
17057F71812j2224o8323n9651o9941p8561K88926C32004k613J0060L49602R2956
17046G82009l54123j63231L46884K09251C45689M2893K53096m4350r7029J39270
17036F39569k75945K61628B64137J42439N31268l18786j01133K80147l65129M01631
17026H34574C89393K07919p7465K65881J561j72466J09720N5701j90322j70516
17016D19406O55173n35079K31554K25090D36535L94546l19949L82939J8078k69358
17006F42791j02798K98153j01949l0511j09421L77693j20800j68604p2012J12625
$$ plain form
17077 327683 267310 335548 549382 365981 585164 506321 554536 170993 386606 348699
17067 348699 425251 460560 351006 536362 839889 619972 361434 880910 476218 671812
17057 671812 659588 591265 531614 461673 383112 672038 332004 329391 339451 689053 782009
17046 782009 427886 264655 611539 820790 345689 388582 641678 597328 500299 639569
17036 639569 363624 625252 264137 406576 937844 619058 517925 798072 432943 834574
17026 834574 389393 597312 519847 785728 787289 614823 724543 780244 589922 419406
17016 419406 1074579 539500 771054 996144 436535 831081 511132 894071 912149 642791
17006 642791 539993 838146 736197 705686 596265 973958 853158 684554 612542 725167
16996G25167K14295o8095k31812Q0284M8535J6261K24821m56202K81903J86543
16986A021700n672j65021J65597j6143J54519k61534r5715J63959J39644k88092
16976H13242K94668m51495K11540j09961J82546j51334O7089L23644m30170M18263
16966A168032j35490L1634l18208K13833K0387O4351j91847L65421k70938J65275
16956A112450J74392q7229O6531J2286k96821K16203O2641n10737J98727K83291
16946A231734l18376L56714J09592m02708j15895L80237J37362l72928J64733
16937A170465N49078n67261p8699Q9247L70705k6565j15772K0854m53706L91666
16927A350012J58786J0637P4679p5389K37690l46958k61809L53662K78008p2060
$$ plain form
16996 725167 939462 871367 639555 719839 768374 784635 1009456 553254 835157 1021700
16986 1021700 1016028 851007 1016604 1000461 1154980 893446 797731 961690 1101334 813242
16976 813242 1107910 656415 867955 757994 940540 789206 856295 1179939 749769 1168032
16966 1168032 1032542 1064176 745968 959801 980188 1044539 852692 1218113 947175 1112450
16956 1112450 1286842 1199613 1266144 1278430 981609 1197812 1260453 749716 948443 1231734
16946 1231734 913358 1270072 1379664 976956 861061 1241298 1378660 1005732 1170465
16937 1170465 1719543 1152282 1073583 1162830 1533535 1506970 1391198 1412052 958346 1350012
16927 1350012 1508798 1519435 1594114 1518725 1756415 1409457 1147648 1501310 1779318 1707258
16917A707258o3891j33502K3298J41462Q4072l32137R9552L89154m24903J25975
16907A616338R3925L68669j68196j55923J10516k5517j3289K9162N3753L3019
16897A942457n52634M40129N97965k68571J7913K40389m11661K16051J96175k26435
16887B191778j17451R7453M74887l09119J52194m45120M08199k19772K52873K20330
16877B706252l8818j16990j61432l5573M92341l41195L27692j78406K55669j88991
16867B720549J58857K56802j03244L56027j55911j20584K3685L36018l03004M22908
16857C592103o4320n7871q9980O46704m19004J59985J1648j44728J36983K04329
16847C975849j98464K49421J78522Q1950o5930r668L62059K479K63781J40090
$$ plain form
16917 1707258 1643367 1509865 1533163 1674625 1758697 1426560 1526112 1915266 1490363 1616338
16907 1616338 1710263 2078932 1910736 1754813 1865329 1839812 1826523 1855685 1909438 1942457
16897 1942457 1389823 1829952 2427917 2159346 2177259 2417648 2005987 2222038 2418213 2191778
16887 2191778 2074327 2171780 2646667 2337548 2489742 2044622 2452821 2233049 2485922 2706252
16877 2706252 2667434 2550444 2389012 2353439 2845780 2504585 2832277 2653871 2909540 2720549
16867 2720549 2879406 3136208 3032964 3388991 3233080 3112496 3136181 3472199 3169195 3592103
16857 3592103 3527783 3469912 3379932 4026636 3607632 3767617 3779265 3634537 3771520 3975849
16847 3975849 3777385 4026806 4205328 4287278 4221348 4211680 4573739 4576218 4839999 4980089
16837D980089p37426M24586L42310L58884k72964j4901L43589q2691J01367K70724
16827E713567k39442J27786M72182k48674L41474P2208L54078M1992R7300K75164
16817G007635J00320M27891J7331q5227K61748K4884J13179M23350O7948M13583
16807H772642J15207p2590Q16545m54061M69668n9459P50684P4578O87932K533
16797A1103679K86933J91839K82372M17948N74198K71028J40202L85270N35027
16788A4188496K02868O69282O24536J79693N70388N05057L97510P85400M60925
16779A8584155O49480L58111O27825J000686M38891J023659Q22036J000257P25680
16770B5230780R54833O01696J205287P40910Q82933J510918J143972J108480J619382
$$ plain form
16837 4980089 4242663 4667249 5009559 5368443 5095479 5080578 5424167 5341476 5442843 5713567
16827 5713567 5474125 5601911 6074093 5825419 6166893 6239101 6593179 6635171 6732471 7007635
16817 7007635 7107955 7535846 7553177 7467950 7729698 7754582 7867761 8291111 8359059 8772642
16807 8772642 8887849 8815259 9631804 9177743 9647411 9587952 10338636 10413214 11101146 11103679
16797 11103679 11390612 11582451 11864823 12282771 12856969 13127997 13268199 13653469 14188496
16788 14188496 14391364 15060646 15685182 15864875 16435263 16940320 17337830 18123230 18584155
16779 18584155 19233635 19591746 20219571 21220257 21659148 22682807 23504843 24505100 25230780
16770 25230780 26185613 26787309 27992596 28733506 29616439 31127357 32271329 33379809 34999191
16761C4999191J539676J331558J258429K065493J486376K364394J632791J725018
16753D8402926K137001K667192J838287K731668K521656K950455K929639K854899
16745F9033723L237943L215294L452354L565449L769223M020412M046788M309418
16737I8650604L779541M307833M539330M044381M228930M490682L504413M227672
16729A31773386L570230L449108K747179K692834J900195J639547P69269K19206
16721A48760954R159j067295j057169k364567k207660k774814l240261l449103
16713A32609244m074381l906958m457625m173542m175304m328895m476607l976762
16705I9039170m246389l891574l856985l837711l700799l265314l280320l187107
$$ plain form
16761 34999191 36538867 37870425 39128854 41194347 42680723 45045117 46677908 48402926
16753 48402926 50539927 53207119 55045406 57777074 60298730 63249185 66178824 69033723
16745 69033723 72271666 75486960 78939314 82504763 86273986 90294398 94341186 98650604
16737 98650604 102430145 106737978 111277308 115321689 119550619 124041301 127545714 131773386
16729 131773386 135343616 138792724 141539903 144232737 146132932 147772479 148541748 148760954
16721 148760954 148770113 147702818 146645649 144281082 142073422 139298608 136058347 132609244
16713 132609244 128534863 124627905 120170280 115996738 111821434 107492539 103015932 99039170
16705 99039170 94792781 90901207 87044222 83206511 79505712 76240398 72960078 69772971
16697F9772971l092821l189213k671110k706729k345930k246193k204851k216588
16689D9099536j995394k008847j737231j774696j606201j351581j899115r78136
16681C5748335j467426j364457j032781j364649o77637j211855j115283n21559
16673B6992688r26832j513988o51373n10301j155980l93884m45665j068376l80254
16664A9946035q63094k03479r21460l43455n94052q5212r24486l13949o92065
16655A5004783K4371r53279j4790l23723l67073l57738l98649l41900k42772n19460
16645A1509770k807n37897j18538k07877j36978m90816q6923k63297m72421k1865
16635I170351J42112l24490l29705j4504q0320p27380M18106m84291j41187m30261
$$ plain form
16697 69772971 66680150 63490937 60819827 58113098 55767168 53520975 51316124 49099536
16689 49099536 47104142 45095295 43358064 41583368 39977167 38625586 36726471 35748335
16681 35748335 34280909 32916452 31883671 30519022 29841385 28629530 27514247 26992688
16673 26992688 26065856 24551868 23900495 23390194 22234214 21840330 21394665 20326289 19946035
16664 19946035 19082941 18879462 17958002 17614547 17020495 16935283 16010797 15696848 15004783
16655 15004783 15029154 14075875 14061085 13737362 13370289 13012551 12613902 12272002 12029230 11509770
16645 11509770 11506963 10969066 10850528 10642651 10505673 10014857 9927934 9664637 9192216 9170351
16635 9170351 9312463 8987973 8658268 8643764 8563444 7836064 8254170 7769879 7628692 7198431
16625G198431K43757l09628J5543j45642k16278q8558l50033l3849j1574K8584
16615F330753r5319l09234m01405J64406o0063j42689k49473o4457K57065r3138
16605E336446j38476k07505l45469N73837m09903l75415m0087N622J05893j28109
16595D376834J94812k63992J67095l62325l5801K7843n2422k57640n8837r0308
16585C645259k5161l5864j02630R1623j49711Q2475k07366J9710j10842j5124
16575C192369j65635R9726k06281J87851M6864m51828M70356l60872k70852M64520
16565C006218k02374k3762q0436J91644k71552j29610J7396n6642N2172J04237
16555B607291j58964k45278K51633o23497K95181N25878l11146k53043K41691
$$ plain form
16625 7198431 7442188 7132560 7148103 7002461 6786183 6697625 6347592 6313743 6302169 6330753
16615 6330753 6235434 5926200 5524795 5689201 5629138 5486449 5236976 5172519 5429584 5336446
16605 5336446 5197970 4990465 4644996 5218833 4808930 4433515 4393428 4399050 4504943 4376834
16595 4376834 4571646 4307654 4474749 4112424 4076623 4104466 4052044 3794404 3735567 3645259
16585 3645259 3620098 3584234 3481604 3573227 3423516 3505991 3298625 3318335 3207493 3192369
16575 3192369 3026734 3126460 2920179 3108030 3154894 2703066 3173422 2812550 2541698 3006218
16565 3006218 2803844 2780082 2699646 2891290 2619738 2490128 2507524 2450882 2503054 2607291
16555 2607291 2448327 2203049 2454682 1831185 2126366 2652244 2341098 2088055 2329746
16546B329746j66528J31592k76708P7346P6388M774n1073k25115j16470M18382
16536B202334l92165R6031J84401k26742L3179o6958K53435m39238j01175K65993
16526A809095n9810j88834K20543k2326j31873l6298J13924p7234l05147L32538
16516A654578J63460m59869J57795Q7800r9963j47406m5337L03875Q4908k72853
16506A426988K3830P5119k128P8790j40949j50949M2932K65941p1257j87053k63785
16495A097479L30241l56654N86340k97378r2822L12784l81981M24989m06544R7590
16485A314044R6151k96362K04990J89715j06834J16945r4163l85801M20623o22225
16475H37083L18060O15643p76963R0836L85320k29050p5219q8432R9136j6585
$$ plain form
16546 2329746 2163218 2294810 2018102 2095448 2171836 2176610 2125537 1900422 1783952 2202334
16536 2202334 1810169 1906200 2090601 1863859 1897038 1830080 2083515 1644277 1543102 1809095
16526 1809095 1749285 1560451 1780994 1758668 1626795 1590497 1704421 1627187 1322040 1654578
16516 1654578 1818038 1358169 1515964 1603764 1503801 1356395 1311058 1614933 1699841 1426988
16506 1426988 1450818 1525937 1523809 1602599 1461650 1310701 1353633 1619574 1548317 1361264 1097479
16495 1097479 1427720 1071066 1657406 1360028 1267206 1579990 1198009 1622998 1216454 1314044
16485 1314044 1410195 1113833 1318823 1508538 1401704 1518649 1424486 1038685 1459308 837083
16475 837083 1155143 1770786 993823 1084659 1469979 1240929 1165710 1077278 1176414 1159829
16465A159829M925l2394p9192k17003L68619j1885k51183M506J84416j02219j6524
16454A011895J03468r6135o9987J26127L2141l40993J19260N3666P3867J65676
16444A178985k51607K08935l18093N7873J23732K8253P2163k6148J26357l52510
16434H47940J26108k81933Q4048j08149M75786l40603J86899j69210N53052l87968
16424I85970q904j92449K1882L23028l95136J85439j9206j80998M59333k99311
16414H79648k8473K16715J22898j08750k86902L19990j58570k88182n937J76530
16404H38967J45554j79635M38974k64299n8150j45486O972J15150l4124j01883
16394G62040j14026J42528J13181k10451M18605k0156O2399j85767j2458l38589
$$ plain form
16465 1159829 1164754 1132360 1053168 836165 1204784 1192899 941716 946222 1130638 1028419 1011895
16454 1011895 1115363 1019228 949241 1075368 1107509 766516 885776 939442 1013309 1178985
16444 1178985 927378 1136313 818220 876093 999825 1028078 1100241 1074093 1200450 847940
16434 847940 974048 692115 776163 668014 1143800 803197 990096 820886 1373938 985970
16424 985970 977066 784617 806499 1129527 734391 919830 900624 719626 1178959 879648
16414 879648 851175 1067890 1190788 1082038 795136 1115126 956556 668374 662437 838967
16404 838967 984521 804886 1243860 979561 921411 775925 782897 898047 863923 762040
16394 762040 648014 790542 903723 693272 1111877 1091721 1154120 968353 955895 617306
16384F17306K69475j5163p7529n7778o0913J97469j37608K99183L2892k71889
16374G95445J08780M986J09468m7561m27538N14917k84124k77729N14489j65082
16364H46051j55383J45525l71202O0475M07970n0648k55180J14415J97315D69641
16353G76329L7827M4798N3679p34r7620o3050j76037L42827n8437K1225j74190
16342G06617j22622L70917l71228j63305O05543k56850j5322J53594l5225j0534
16332H61585k87725J91179L07279k58802k21519J81892j37097k01967L38926k2272
16322G51479j02163K65710j96497j77061K77336J90901r8393K7694l02674J21730
16312G58062j25772K00025K78823k09370l18039O6709J60188P6406j53478k25521
$$ plain form
16384 617306 886781 871618 794089 736311 675398 872867 735259 1034442 1067334 795445
16374 795445 904225 909211 1018679 971118 543580 1058497 774373 496644 1011133 846051
16364 846051 690668 836193 464991 525466 933436 882788 627608 742023 939338 469641
16353 776329 814156 858954 912633 911899 814279 751229 575192 918019 859582 880807 706617
16342 706617 583995 954912 583684 420379 1025922 769072 753750 907344 872119 861585
16332 861585 573860 765039 1072318 813516 591997 773889 636792 434825 773751 751479
16322 751479 649316 915026 718529 541468 818804 1009705 911312 939006 636332 758062
16312 758062 632290 832315 1111138 901768 583729 650438 810626 887032 733554 508033
16302E08033L70771j0053k59555K73788J34902l05290l22356M37048j61409k67547
16292C98332M44909j62596K17350r2192j34644j28694r9282K72140n7814p2959
16282E84550L1871L71589J1508m58223L76469l62723N3242M16810m81794K15650
16272G58949j35570P6446k7407N42159E55138N3473J51847K66794D54877k3719
16262D31158J84197L8322k50993L3933M7800p98J28112J06827p0450k9184j03881
16251E15043q2668J81786J7662q1240O3498j66867J85650r2164k50612P8878J5401
16240C84367o7554K44712J03871J28865l12335K52037R2069l71106j07877L26260
16230F73309k14851r9352K23931B68708P2956K0831L53052k05630B48483j18850
$$ plain form
16302 508033 878804 868751 609196 882984 1017886 712596 390240 827288 665879 398332
16292 398332 843241 680645 897995 805803 671159 542465 443183 715323 657509 584550
16282 584550 616421 988010 999518 541295 917764 555041 608283 1025093 543299 758949
16272 758949 623379 699825 672418 1214577 555138 608611 760458 1027252 454877 431158
16262 431158 615355 653677 402684 436617 484417 483619 611731 718558 648108 618924 515043
16251 515043 432375 614161 631823 550583 614081 447214 632864 540700 290088 368966 384367
16240 384367 316813 561525 665396 794261 481926 733963 826032 454926 347049 673309
16230 673309 458458 359106 583037 268708 341664 362495 715547 509917 248483 129633
16220A29633J10606J58313K53783Q2822J1824l07415Q9262N620B40062L69062
16210F09124j49671j3631M2871j27489O9221r1472R7058J55117j01355M10709
16200I00482l68793o1354n6078O5283P1378r9323j11197K8593N3965j32757J32619
16189D22818N7350O4423L02167C28121A50767M18631k26549m7058L37602B74305
16178B46258J86521j64561J4887j37103J05042N7083p6008m4364K06722o3688
16168C30789K25964l8414j53097l256E4666K54468A40034N51320A32569K91303
16158D23872j99264J69085A03042K74506K76037l18204a4855B20392J66005j54736
16148B31661P7173I7504L46638o9347K4526N6277h8563B79035A06868K68758H7838
$$ plain form
16220 129633 240239 398552 652335 735157 746981 439566 528828 534448 240062 609124
16210 609124 459453 445822 488693 361204 430425 338953 436011 591128 489773 900482
16200 900482 531689 470335 414257 479540 550918 451595 340398 368991 422956 290199 422818
16189 422818 480168 544591 846758 328121 150767 569398 342849 295791 633393 274305
16178 246258 432779 268218 283105 146002 251044 308127 232119 187755 394477 330789
16168 330789 556753 518339 365242 361986 54666 309134 140034 691354 132569 423872
16158 423872 224608 393693 103042 377548 653585 335381 -14855 220392 386397 231661
16148 231661 308834 97504 444142 374795 399321 455598 -88563 279035 106868 375626 87838
16136A04929K6070C1505R8248J88569o1001R0628J84761A23659P356o2190J70367
16125B39192j03636L89963G6479K98630A12305j0886K7689d238B34112K4797l260
16114B55649D803A548M32642A71243K00260o478G0961J12232B4296O28824F1847
16102B68463D0754K01737e7599D85488j03530G5492c2768o4010B69537D5027K01190
16091B46217n0380Q3347n4808J82888j61402a89000A96275M6603B6922e4384A20880
16079C18508R0327b3250A36969m0933C2559i2059B00967h8701A65186Q8946q2135
16068A71997E1725a09249B27904B747a75388B39498c39573C1557I632K71317b86087
16056B37209l7973c5861l05902B35364r3786a04412M0647H2775J29685A05682
$$ plain form
16136 104929 130999 31505 129753 318322 257321 347949 532710 123659 131015 68825 239192
16125 239192 135556 525519 76479 375109 112305 101419 129108 -4238 234112 258909 255649
16114 255649 4803 1548 434190 171243 371503 365025 70961 183193 24296 653120 61847
16102 268463 40754 242491 -57599 485488 381958 75492 -32768 -96778 269537 45027 246217
16091 246217 195837 279184 224376 407264 245862 -189000 196275 242878 26922 -54384 120880
16079 318508 408835 -23250 136969 96036 32559 -92059 200967 -88701 165186 254132 171997
16068 171997 51725 -109249 227904 2747 -175388 239498 -339573 31557 9632 280949 -286087
16056 237209 199236 -35861 -341763 235364 141578 -104412 -63765 82775 212460 105682
16045A11916A9520L02483m2379j02363J32182e2077b0102H6832b22441A445J92196
16034A93641n0701a57999K5588B65845n7846q6125b14589K3276H9098K59613j31590
16023B17121o2836a11976A84795n3858J37451O7444j09631M4096a1111A72340
16012B50723b7908l3360j08682I8443P5495B3413J75032c50660J44561i5605A16853
16000A81287o2074A5431f4118b7050B20428n2807R9529a54022F1332K23131D681
15988b23403o735B38303C293c0268A14779J35697D7182L70989P5129m2137m0247
15977D10916j75731O8473j41280G7410k0549c21242a15953A0101b68195A76571
15966A1627N8999N189P1245b70182e1670I384c5884B74806a1836A80065G6591
$$ plain form
16045 111916 19520 322003 279624 177261 309443 -52077 -20102 86832 -222441 1445 193641
16034 193641 142940 -157999 -132411 265845 207999 121874 -214589 -191313 89098 348711 217121
16023 217121 154285 -111976 184795 130937 268388 335832 226201 270297 -11111 172340
16012 250723 -27908 -61268 -169950 98443 173938 23413 198445 -350660 -206099 -95605 116853
16000 181287 119213 15431 -64118 -27050 220428 167621 267150 -154022 61332 284463 4681
15988 -223403 -230138 238303 3293 -30268 114779 250476 47182 418171 493300 451163 410916
15977 410916 235185 303658 162378 77410 56861 -321242 -115953 10101 -268195 176571
15966 11627 70626 75815 147060 -270182 -51670 9384 -35884 274806 -11836 180065 76591
15954a90998A35401b10642g416C9557f3317m64767a5398A4578b71775a2918o6736
15943g9654n2633A85244i5518G3175R6238e0851k29737i5950l1021A13211a57544
15931a80952A92995h5954A4903P1998l1481J22511G0831M7832a45316j175a6114
15919A8483h0054C849a86192j4176Q122l8469B11635b48946e5061g98C29609j29589
15907B00020o2240M3176j5659b38178f8674A97363I66a93113h896q7154D154L3024
15895C7178J80472I7036b32936O270A04229b70036C1410K4340j3966f8316l3703
15884a02019B68467a7520j1282j74210A46580a47813j23577Q120O6474e1898H4635
15872C55832m6208b45753h3364B618j279b48239P5892B13476C3518Q4105e4216
$$ plain form
15954 -190998 135401 -210642 -7416 39557 -63317 -528084 -15398 14578 -271775 -12918 -79654
15943 -79654 -132287 185244 -95518 73175 169413 -50851 -280588 -95950 -126971 113211 -157544
15931 -180952 192995 -85954 14903 86901 55420 177931 70831 118663 -145316 -146491 -16114
15919 18483 -80054 3849 -186192 -200368 -192246 -230715 211635 -248946 -55061 -798 329609 200020
15907 200020 137780 180956 165297 -238178 -68674 197363 966 -193113 -8896 -96050 4154 37178
15895 37178 217650 97036 -232936 -226666 104229 -270036 31410 55750 41784 -68316 -102019
15884 -102019 268467 -17520 -28802 -203012 146580 -147813 -271390 -263270 -196796 -51898 84635
15872 355832 309624 -245753 -83364 2618 1339 -248239 -172347 213476 33518 117623 -54216
15860f05535a78990G9004k2252k76K36300H9181b48560B71136g9096A02781a93434
15848f541k87636a4133A01321L8636P943f3130A00643D2885c00403A03521a45140
15836A964K4344i5079k9567A42786a40348I1930a19649B57445i1642J8618k15729
15825b88753D415A744b45088g9602n0216L1446B1229b87108b8192G8170b52969
15813D2182f6040j62399b0658A04725m7102b62795J19073N7721j00079A70778
15802h4763N525l06335a92271k3706D9745K11244b8315j31253j03201F4765a39955
15790G5092a43363C68296d1423a3568N258B2963a79068E8590a64746A2231f2500
15778i6199E3835a25813j08045j87526J31303B15391b37900j968K8114B0907J04216
$$ plain form
15860 -605535 -178990 79004 56752 56476 292776 89181 -248560 271136 -79096 102781 -193434
15848 -6541 -294177 -14133 101321 139957 147900 -63130 100643 42885 -300403 103521 -145140
15836 1964 26308 -95079 -124646 142786 -140348 91930 -119649 257445 -91642 -73024 -288753
15825 -288753 4415 1744 -245088 -79602 -129818 -98372 21229 -287108 -28192 78170 -252969
15813 42182 -66040 -228439 -20658 104725 57623 -262795 -143722 -86001 -186080 170778
15802 -84763 -79238 -385573 -192271 -215977 49745 260989 -28315 -159568 -262769 64765 -139955
15790 75092 -143363 368296 -41423 -13568 -8310 22963 -179068 58590 -164746 12231 -62500
15778 -96199 53835 -125813 -233858 -421384 -290081 215391 -237900 -239868 -211754 20907 125123
15767A25123E0298a8258j2584C4839K2055M8382b6646j18449j38420P7397j38764
15756c44882d4501k49794Q7472j06010R1117P4848O584B04855a24057A37736D6721
15744B39026R5892f0136j79751a3972l83682D8221d1397j5044j5299a7455A11671
15732d3322j46485o8300L559J01462L9963K7073G6383a65576c9480A28449c54710
15720c57807J41801c5626D4625O2974c7220A20933O701h7444j12311d7020H2207
15708b3760j12159C4705e3938j86877j3361A03336b66908R7853O035a8736D8189
15696G8289Q68e2396a7088j94296p2261k42690d7156I6921i7024j57176a18651
15684a64537O4633A37128d9976r5111k430m72G3288c73733O6954D5606h7658b8034
$$ plain form
15767 125123 50298 -18258 -30842 34839 56894 105276 -26646 -145095 -283515 -206118 -344882
15756 -344882 -44501 -294295 -206823 -312833 -221716 -146868 -140284 204855 -124057 137736 46721
15744 239026 334918 -60136 -239887 -13972 -397654 48221 -41397 -56441 -71740 -17455 111671
15732 -43322 -189807 -258107 -254548 -153086 -113123 -86050 76383 -165576 -39480 128449 -354710
15720 -357807 -216006 -35626 44625 107599 -37220 120933 127634 -87444 -199755 -47020 82207
15708 -23760 -135919 34705 -53938 -240815 -254176 103336 -266908 -169055 -163020 -18736 48189
15696 78289 79157 -52396 -17088 -211384 -283645 -526335 -47156 96921 -97024 -254200 -118651
15684 -164537 -99904 137128 -49976 -145087 -147517 -147989 73288 -373733 -306779 45606 -87658 -28034
15671b37884A4923O0243e8014G7565b5325j16700o9574A53636e1843D4865M6469
15660I1334b3323C31303a52938f7936j18340A29134b0546j4228j98646G5055b15325
15648a96328e4449G5345B3168c3024m2715l1956B10020a51041A29190b9983j23405
15637a53388G564R4449a21758N7994n9569K3173L4107k3714D8281j4944a02259
15625b52008E0386a4308j51261A18651A1790h7067L6389C12848b38743f4025A27914
15613F0637b344n24077B9378J0277a83386O1366A8153K21271d9600C6195a44691
15601a33551d0711D0421K0366b36046g5789D6559J97821E5812R2917b34470f8371
15589A03198O2403i217H3878a63525F2634Q9945f7452a2228l14329a00052A5020
$$ plain form
15671 -237884 14923 75166 -58014 77565 -25325 -142025 -211599 153636 -51843 44865 91334
15660 91334 -23323 331303 -152938 -67936 -186276 129134 -20546 -34774 -233420 75055 -215325
15648 -196328 -54449 75345 23168 -33024 -75739 -107695 210020 -151041 129190 -29983 -153388
15637 -153388 7564 102013 -121758 -63764 -123333 -100160 -66053 -89767 48281 33337 -102259
15625 -252008 50386 -14308 -165569 118651 11790 -87067 -50678 312848 -238743 -64025 127914
15613 60637 -2344 -526421 29378 39655 -183386 -122020 18153 239424 -49600 36195 -144691
15601 -133551 -40711 40421 60787 -236046 -75789 46559 244380 55812 148729 -234470 -68371
15589 103198 165601 -9217 83878 -163525 62634 152579 -67452 -12228 -326557 -100052 15020
15577E0580L93918G0788G174a18976K7478F9213a72665l35553B64141a01102D9282
15565B65917b86382D1915c7391G0903d4763O907k03316J13133C63937g9172K9751
15554d9421q5717A13204D7942O4735J21834b33022j3055A49929O683h3949B76889
15542h5035c9966A97526F262O979J75757i2714A7101a621A35145E7972c8784B2079
15529b9012B63046a81791C43289J83136b67422B51917B035R5229l1477i9754l9949
15518a39703H7406i8194F3012N1982a76239A28940a2295A54418a93636I7918J97368
15507B95286A10858c24021D3253J6173a88052C27327i1162G9079d64343A5930
15496B28173b02587B8398h0338L6278l4589n7941j90419J46384E72a59294A01076
$$ plain form
15577 50580 444498 70788 7174 -118976 -91498 69213 -172665 -508218 264141 -101102 49282
15565 265917 -286382 41915 -37391 70903 -44763 -37856 -241172 -128039 363937 -79172 -49421
15554 -49421 -135138 113204 47942 112677 234511 -233022 -246077 149929 156612 -83949 276889
15542 -85035 -39966 197526 6262 13241 188998 -92714 17101 -1621 135145 57972 -38784 22079
15529 -29012 263046 -181791 343289 526425 -267422 251917 2035 97264 65787 -99754 -139703
15518 -139703 87406 -98194 63012 114994 -176239 128940 -12295 154418 -193636 97918 295286
15507 295286 110858 -324021 43253 59426 -188052 327327 -91162 79079 -464343 15930
15496 228173 -202587 28398 -80338 -44060 -78649 -136590 -327009 -180625 572 -159294 101076
15484a29355A95067d4864k2201C1937K58682A01985a69088L0648a3975m8836B38199
15472C3443a34714c1943j72894g0496C3840a59341G2240h2195p7598A47210K53690
15461D00900D5160j9942a10131B36339J00651B4327b69666A02005J57609H3448
15450B12360e6005D7510e0489a7964k95347j87537a66943M1982B1061a08209A97042
15438C78878h2364C34056A9567k400J60730a47030M2919F4365b2446q6982e1860
15426h5359B25245G1446b5617A61383n3991K4979a09862D5237J84624j07197k1836
15415A00828c36259J00731F9868a1636j27062E522O9640Q0218O100p6652K23459
15404C08287A44167F4077Q8004a9408j977B8938M3521L1639f4483A57718b62878
$$ plain form
15484 -129355 195067 -44864 -67065 31937 290619 101985 -169088 -138440 -13975 -62811 238199
15472 33443 -134714 -31943 -204837 -70496 33840 -159341 72240 -82195 -159793 147210 400900
15461 400900 45160 25218 -110131 236339 336990 24327 -269666 102005 259614 83448
15450 212360 -56005 47510 -50489 -17964 -313311 -500848 -166943 -124961 21061 -108209 197042
15438 378878 -82364 334056 19567 17167 177897 -147030 -104111 64365 -22446 -109428 -51860
15426 -85359 225245 71446 -25617 161383 107392 132371 -109862 45237 229861 122664 100828
15415 100828 -336259 -235528 69868 -11636 -138698 5522 75162 155380 161480 84828 308287
15404 308287 144167 64077 152081 -19408 -21385 28938 72459 104098 -64483 157718 -262878
15392A23975a9389C3596b22750M8391M5198A2786J26173c002l5050A4676K88613
15381C03289c85096d9499F3152c3985B5528K06240A00755a55030d0830k3267p2749
15370a36846d3359A091d03564A03175D5522B0396K65204A9281J67572D0841A4318
15358b22278E6626J80518a06329d1041l8772j16136b4426h531j21440H5189c7989
15346A6876M3247J25777i7537C8609O601O7723J66756l8501A16105G704J45158
15335A52862J08073D0385g013D46069B11992h9758D9171e1668A1031K5999J25183
15324A62213O0806d8835K3366l7075I1271a12972H6613J34180b36422J02344j7638
15313a51716H5554h6276H0325K7466i3652A70767b5693G5961b27604d0015j96452
$$ plain form
15392 123975 -19389 33596 -222750 -174359 -129161 12786 138959 -3002 -38052 14676 303289
15381 303289 -385096 -49499 63152 -33985 25528 231768 100755 -155030 -40830 -64097 -136846
15370 -136846 -43359 1091 -403564 103175 45522 20396 285600 19281 186853 40841 14318
15358 -222278 56626 237144 -106329 -41041 -79813 -195949 -24426 -8531 -129971 85189 -37989
15346 16876 60123 185900 -97537 38609 45210 112933 279689 241188 116105 7704 152862
15335 152862 260935 40385 -7013 446069 211992 -89758 49171 -51668 11031 37030 162213
15324 162213 223019 -48835 -25469 -62544 91271 -112972 86613 220793 -236422 -134078 -151716
15313 -151716 85554 -86276 80325 107791 -93652 170767 -25693 75961 -227604 -40015 -236467
15302b36467A37151F891M589a3331p059E1422L88761F6135C1374d8335C7393a14701
15289C32413g5433F4458L9583i6731D4904O5618J69047B2368a62822J4383A27309
15277e4670I1118D560J57721b43860A00261D251K01558a57311A34282K56418A43711
15265I2163Q222a66446A565M1312O7522m6712A761N19338a71257C5876B190J69385
15253A71575b8850B3171J42226l7839J76225A26613J82235M46211R50228m76680
15243A228607J80320Q73250F74122l0933B16616p4980k7232f9311D03443A35988
15232A53507f5860D28944A40664c0389A58807O5259a4245j00443A22759K3147
15222A45906i6536A5148P9736g217p7280G0050g6632j9838M8106A18787a49300
$$ plain form
15302 -236467 137151 6891 11480 -13331 -20390 51422 440183 66135 31374 -48335 37393 -114701
15289 332413 -75433 64458 104041 -96731 44904 110522 279569 22368 -162822 -148439 127309
15277 -54670 91118 4560 162281 -243860 100261 4251 205809 -157311 134282 390700 143711
15265 92163 100385 -166446 1565 42877 110399 63687 1761 521099 -171257 35876 2190 171575
15253 171575 -28850 23171 165397 127558 303783 126613 308848 755059 1705287 1228607
15243 1228607 1408927 2282177 674122 643189 216616 141636 114404 -69311 403443 135988
15232 153507 -65860 428944 140664 -30389 158807 224066 -14245 -114688 122759 145906
15222 145906 -96536 15148 94884 -7217 -84497 70050 -76632 -96470 -48364 118787 -149300
15210F5745b44044I2368D5766f2366A36582C1269Q7042J31738N2473c24993e4451
15198B86091A32739o4879j7012j6900j397J19703a33629A05185C1119b9499n6272
15187h5771L1254F3131c86031d0878A43668N5559J35991j52856J31458A7653J94975
15176B12628p9596b28910B39931b65751H7770A703c25152a3319k1264A04507d4557
15164C45121b18726j73272d6041B01720J33934j47149f1409l23547G097L96447
15154D03544A67667a27325o8037M8528B83155a94625h3634C61539g4506A56989
15143I5798K65359A01838O9514a15395B31438p7302a98360f4589D10398b60080
15132e8974B50086m5955O2742L3785A1086J06127J8784J13382b50982C7355f8536
$$ plain form
15210 65745 -244044 92368 45766 -62366 136582 31269 118311 250049 302522 -324993 -54451
15198 286091 132739 67860 50848 33948 32551 152254 -133629 105185 31119 -29499 -85771
15187 -85771 -54517 63131 -386031 -40878 143668 199227 335218 182362 313820 17653 212628
15176 212628 133032 -228910 239931 -265751 87770 1703 -325152 -13319 -34583 104507 -44557
15164 345121 -218726 -391998 -46041 201720 335654 188505 -61409 -384956 7097 403544
15154 403544 167667 -127325 -195362 -146834 283155 -194625 -83634 361539 -74506 156989
15143 95798 361157 101838 171352 -115395 231438 154136 -198360 -64589 410398 -260080
15132 -58974 250086 204131 266873 300658 11086 117213 135997 249379 -250982 37355 -68536
15120G3414E922a42189A37163b38645A67121i3132Q933D89919j89563J16974N3024
15109D70354j38205k2259A22752a09179K9624B48007d5993B29826D3326q061i7071
15097a11394B37800j04830f4136H3055b55455B89680j01159c338B08364J33081
15087C41445J3305d9575B64963m6502D3341J88195J0848H0210e7256B62845J28385
15076C91230A81848j8401j677L8724K49695j86439A04686a25164a1836D57297
15065B70960J41934q2901j27260L32052A19378e0911B16476J36587N7147D4882
15054B32421n7198J3566a8427C14345B9133P824L26705b1378k82009B00061J33137
15043C33198n8501j06325P6091j0135n5181Q613J20278k2515m2875L6980J63898
$$ plain form
15120 73414 5922 -142189 137163 -238645 167121 -93132 -84199 489919 300356 417330 470354
15109 470354 332149 309890 122752 -109179 -79555 248007 -45993 229826 43326 35265 -97071
15097 -111394 237800 132970 -64136 83055 -255455 289680 188521 -3338 208364 341445
15087 341445 354750 -49575 264963 218461 43341 231536 242384 80210 -57256 262845 391230
15076 391230 181848 163447 161770 200494 450189 263750 104686 -125164 -11836 457297
15065 270960 412894 329993 202733 534785 119378 -50911 216476 353063 410210 44882
15054 232421 175223 188789 -18427 314345 29133 36957 363662 -21378 -303387 200061 333198
15043 333198 274697 168372 244463 234328 179147 187760 308038 285523 242648 279628 443526
15032D43526k08775J03406j20039K99043A80048Q6396M9731b21122D28812c7519
15021B38729j05180h0216F0140K52035J16200j26489j09815J44793A56404K76025
15011D32429G6039Q39O65100C33731E0790J94068R9252I4508J56572o0228L9199
15000B30051L7991J04077m9627Q179a8252A91884L0678M7664J16710A41260d9084
14988C08595R6741A07898k645K1555J21838I9675H520M00247k6820M8967A59999
14976D29041j30272n7868n7575N3401r0077k0255L7271J66961P9547j04699A08117
14964A98696m2062J10277n3143L09300j84657N1622C6092L34843m8859J19418
14954D41494J4080B26365J1138k7217l0896o6875K30318p0192r1203N2062n5979
$$ plain form
15032 443526 234751 338157 218118 517161 180048 266444 316175 -221122 428812 -37519
15021 238729 133549 -80216 60140 312175 428375 301886 192071 336864 156404 432429
15011 432429 76039 76878 741978 333731 50790 244858 344110 94508 251080 190852 230051
15000 230051 268042 372119 322492 330671 -18252 191884 222562 270226 386936 141260 -49084
14988 308595 405336 107898 105253 126808 248646 99675 8520 408767 381947 430914 159999
14976 429041 298769 240901 183326 236727 146650 126395 163666 330627 410174 305475 108117
14964 198696 156634 266911 213768 523068 338411 390033 36092 370935 322076 441494
14954 441494 455574 226365 237503 210286 179390 112515 342833 272641 181438 233500 177521
14943A77521J06227K39630m5905j80109o0079J3849q2899r489J96331j40562o4487
14932A50028r520L33340B04024J09475A02024J26608J10540J6005K29321k10818
14922C73680K34200P3641p6449j7749A40044N26760j16872B19585N37292j42005
14912F14872k05085K2231O6930j09269K28392k28121K3570J87448A91061D5079
14901C79380j3027K8461n5646j07234J28480j06501K2908o2008O7912L89475k45387
14890D26813P5554J2479k15215M69775l52095n0784m1193K34064K48260l57150
14880D50508n6030n7806Q5554j41749R2445o0780J02229j89374L04785j52917
14870C76865J23468k36939L89996l25568j62290K15055K357K08052B23598J74792
$$ plain form
14943 177521 283748 523378 477473 297364 237285 251134 168235 158746 355077 214515 150028
14932 150028 140508 473848 204024 313499 102024 228632 339172 355177 584498 373680
14922 373680 607880 681521 605072 587323 140044 666804 549932 219585 756877 614872
14912 614872 409787 432018 498948 389679 618071 389950 413520 600968 191061 45079
14901 379380 366353 394814 339168 231934 360414 253913 276821 214813 282725 672200 426813
14890 426813 502367 514846 299631 769406 417311 366527 325334 559398 807658 450508
14880 450508 394478 336672 422226 280477 372922 312142 414371 224997 529782 376865
14870 376865 500333 263394 653390 327822 165532 380587 382944 590996 223598 398390
14860C98390j39756L03970B20758L88730k44819j9231L19407k26910l7223N5680
14850D56392j50876K89352j18915N570J5538j06493J3235K1792K0565J57730k45533
14839C58357J59924J96545k44437J89450B50209N81227j47228j66364k01786q7374
14829B28684L50583k12629n116K80999R8011j96795M6846r0584J41686k07980
14819D33705A75302J88295K17454j17549k24077K25829r7140L03823P8754I6150
14808G71436C84300L55645k15612k37759N3659J75268m8349o5510J80924j09650
14798D72916K7628K3061M17893D39974Q9629m6418K10188j63548j0266j07207
14788D12352J27688o6163q8232J87846B84394M56602C63240A15122M66569K19640
$$ plain form
14860 398390 258634 562604 220758 609488 364669 345438 664845 437935 400712 456392
14850 456392 305516 594868 475953 481523 497061 390568 403803 425595 446160 603890 358357
14839 358357 518281 714826 470389 659839 250209 831436 684208 517844 316058 228684
14829 228684 579267 366638 361522 642521 740532 543737 590583 499999 641685 433705
14819 433705 175302 363597 581051 463502 239425 465254 368114 671937 750691 96150
14808 771436 384300 739945 524333 286574 340233 515501 467152 401642 582566 472916
14798 472916 500544 523605 941498 439974 529603 483185 693373 529825 519559 412352
14788 412352 540040 473877 385645 573491 284394 740996 363240 115122 581691 801331
14778H01331k05688o8575M00749l32508J68594l16265K28241r2767M9026R6354
14768G28492j2014k25357k3521q8094L78209j77802O7860k60370K78929B08017
14757D98326K73939B93342P5268M73445k14595k55177L93916l79252K15848k42691
14747C60104J48103M35994C93658K96919j80800J45296k07245M75026k71020K90941
14737I42775l23981K53545j93833Q683k89455L94340Q4138k85154K41452j47967
14727F84543L42293l86071K84282P8905l14971J14548K46604J4507k94420J87333
14717I57553J63247k43486j50625K7974l7346M04278l42485j0464L04107Q7803
14707A160556E60968K64002j48125J02730j40805K62573j95553J27531k0137M1018
$$ plain form
14778 801331 595643 527068 927817 595309 763903 447638 675879 583112 632138 728492
14768 728492 716478 491121 467600 379506 757715 579913 647773 387403 666332 208017
14757 498326 772265 293342 368610 842055 627460 372283 766199 386947 602795 360104
14747 360104 508207 944201 393658 690577 509777 655073 447828 922854 651834 942775
14737 942775 618794 872339 678506 687189 397734 792074 876212 591058 832510 684543
14727 684543 1026836 640765 925047 1003952 688981 803529 1050133 1064640 770220 957553
14717 957553 1120800 877314 726689 754663 717317 1121595 779110 768646 1072753 1160556
14707 1160556 560968 824970 676845 779575 638770 901343 705790 833321 813184 854202
14697H54202j12855K07086L4278j68246j72832N09934J12863k25292j9995M7800
14687A066943k22813K34828j59610N8146k3390K22561l48549R1892L57884l74176
14677I03716J55755J73543k98226k39495J35606K66835j32454K02354l37613J99509
14667A029530n01807N40970k38291Q1758J12062k98714M61848l9611Q396m9148
14657A106993m7436j79551J24975J44473J53167j59339l7127O7379k23464J39968
14647A090038m4023J86255n401L12694m01397J33236O5501j70534J08819j95678
14637A079510M83934k56516M8382j25287r4703J02716L4910K02546j14101l48137
14627A013254M19561k17074J70436r7373J38345l69827M99585n03087L53200j8551
$$ plain form
14697 854202 741347 948433 982711 814465 641633 1151567 1264430 1039138 1019143 1066943
14687 1066943 844130 1078958 919348 977494 954104 1176665 828116 920008 1277892 903716
14677 903716 1059471 1233014 934788 695293 830899 1097734 965280 1167634 830021 1029530
14667 1029530 527723 1068693 830402 912160 1024222 725508 1187356 1147745 1156141 1106993
14657 1106993 1059557 880006 1004981 1149454 1302621 1143282 1106155 1173534 950070 1090038
14647 1090038 1046015 1232270 1226869 1539563 1138166 1271402 1336903 1166369 1275188 1079510
14637 1079510 1563444 1306928 1355310 1230023 1135320 1238036 1272946 1475492 1361391 1013254
14627 1013254 1432815 1215741 1386177 1288804 1427149 1057322 1556907 1053820 1407020 1388469
14617A388469L3168k73323L00915m2465L12884m14267L10081n56220L11549L19090
14607A689881m3895k15104J88921p5554J27069q2755j37744M19937l11971J4171
14597A572956L18753k71620J97648p943l6341L88478n14003N6663K42039n665
14587A940965q4882P6370n25887M71293j60030K73296K76982n20159L20950l32358
14577A736540J50397l1936M21596r7916j85225K70125l3837m636K49074o5355
14567B408827Q7341l20239J59817O8583N68494j60505j0678j1731o0072L67655
14557C097492j72900O10405j35644M70968J54451N05505Q86446J178965J919494
14548H515182L504285O413437J1043377K765425j0736255q705149l738213j390472
$$ plain form
14617 1388469 1421637 1148314 1449229 1406764 1719648 1305381 1615462 1059242 1370791 1689881
14607 1689881 1645986 1430882 1619803 1544249 1671318 1588563 1450819 1870756 1558785 1572956
14597 1572956 1891709 1620089 1817737 1809794 1773453 2161931 1647928 1704591 1946630 1940965
14587 1940965 1856083 1932453 1406566 1877859 1717829 1991125 2268107 1747948 2068898 1736540
14577 1736540 1886937 1855001 2276597 2178681 1993456 2263581 2229744 2225108 2474182 2408827
14567 2408827 2496168 2175929 2335746 2404329 2972823 2812318 2801640 2789909 2729837 3097492
14557 3097492 2924592 3534997 3399353 3870321 4024772 4530277 5416723 6595688 8515182
14548 8515182 12019467 18432904 29476281 32241706 21505451 12800302 9062089 7671617
14540G671617k973170j240940p49204k14162o3481j11870L2769j55090L81220
14531B577689m47347J29370j68797K10328L67771j23064j61522j26236L13011
14522B571203N7883r3864L91108k61192K40605l84248n3536J51165J05092M21306
14512C145522m58102j5226L03758m65172O76805n44267M02607J27399k6919l05
14502C146100j45314K35576k40400K76181K50976k8613k41846K35040p2269J57722
14492C573153K09570j06105l15092M47740k33817o85K79971P6320n9406J42065
14482D013714j82637K85369k39345K53096l04340J64467R2029O3167K1897L39786
14472D507203l82751L47763P9251j84169J09782l3101N12036m04683M03442k26030
$$ plain form
14540 7671617 4698447 3457507 2708303 2494141 2430660 2318790 2351559 2196469 2577689
14531 2577689 2130342 2259712 2090915 2301243 2669014 2545950 2384428 2258192 2571203
14522 2571203 2629086 2535222 2926330 2665138 2905743 2521495 2467959 2619124 2724216 3145522
14512 3145522 2687420 2672194 2975952 2510780 3187585 2643318 3045925 3173324 3146405 3146100
14502 3146100 3000786 3236362 2995962 3272143 3523119 3494506 3252660 3487700 3415431 3573153
14492 3573153 3782723 3676618 3361526 3809266 3575449 3574764 3854735 3931055 3871649 4013714
14482 4013714 3831077 4116446 3877101 4130197 3825857 3990324 4082353 4145520 4167417 4507203
14472 4507203 4124452 4472215 4551466 4367297 4477079 4443978 4956014 4551331 4954773 4728743
14462D728743M13267n84658L14315Q1880j72861L30196J14787p4614j73620K91785
14452E269220N46525l40156P7631L04861k59110M57483l89277M82401k64944K42180
14442F126814J71435k68492J533N70813m4690M8096j76162K47864n05263O74254
14432F846202J18206j29626m1429L54654J63898Q7896o2698J98141j86114K71684
14422G620814j7150K95028k4277L48786J82668K77473m17085J99307L68566J46473
14412H980603j77549p0733Q52072k97643N7819J33857J15972N94245q5445J45586
14402A0248784M26194K51563p9400L61530p135L06457o963m3897K73078K77247
14392A2007458K97769R0290j781M28604L25712j33489K48852K93909J89011L16452
$$ plain form
14462 4728743 5142010 4557352 4871667 4953547 4780686 5110882 5225669 5151055 4977435 5269220
14452 5269220 5815745 5475589 5553220 5858081 5598971 6056454 5667177 6149578 5884634 6126814
14442 6126814 6298249 6029757 6031290 6602103 6557413 6605509 6429347 6677211 6171948 6846202
14432 6846202 6964408 6834782 6793353 7148007 7311905 7399801 7337103 7535244 7349130 7620814
14422 7620814 7603664 7898692 7874415 8223201 8405869 8683342 8266257 8465564 8834130 8980603
14412 8980603 8803054 8732321 9584393 9286750 9344569 9478426 9594398 10188643 10103198 10248784
14402 10248784 10674978 10926541 10847141 11208671 11201536 11507993 11501030 11457133 11730211 12007458
14392 12007458 12305227 12395517 12393736 12822340 13148052 13014563 13263415 13557324 13746335 14062787
14382A4062787K70953L10755R2699O54645m842N63253K45741K13267K33149M36409
14372A7078816K73284O70949J63510K97016L07133P38856K92791R2326O72217
14363B0586898N00474N21167N15197M47655M54246N62283M50617R16664J57613
14354B5112814O70619P22652M04220P22931R66930O63704N56378J042446P74215
14345C1636909N78815M68361R40109J480982N58230J168652P95362J219670J308763
14336D0155853Q86894J074484J420106J395566R93851J306229J732296J692680
14328E0657959J722484J464959J818378J973050K043968J538955K381112K210048
14320F5810913K153289K308533K274623K873737K571392L151033L103387L191523
$$ plain form
14382 14062787 14333740 14644495 14737194 15391839 15386997 15950250 16195991 16409258 16642407 17078816
14372 17078816 17352100 18023049 18186559 18483575 18790708 19529564 19822355 19914681 20586898
14363 20586898 21087372 21608539 22123736 22571391 23025637 23587920 24038537 24955201 25112814
14354 25112814 25783433 26506085 26910305 27633236 28600166 29263870 29820248 30862694 31636909
14345 31636909 32215724 32684085 33624194 35105176 35663406 36832058 37627420 38847090 40155853
14336 40155853 41042747 42117231 43537337 44932903 45926754 47232983 48965279 50657959
14328 50657959 52380443 53845402 55663780 57636830 59680798 61219753 63600865 65810913
14320 65810913 67964202 70272735 72547358 75421095 77992487 81143520 84246907 87438430
14312H7438430L255575L804367L485588L821289M443157M477190M835187M966117
14304A20526900N165870N719654N553522N771083O767463O843734O938025Q153890
14296A71440141P615633Q636871Q653521R111468R908303J0193404J0859465J0974854
14288B47393660J1978068J2128694J2669069J2468544J3372534J3579725J3837417
14281C37427711J3536606J3400098J3429615J2943044J2262894J1081762R792401
14274D23874131Q178306N778929L711553K084650O00634j566047l526509m036643
14266D35099004m574298o538164q515688j0167679j1900412j2984478j3820207
14259C66598078j4269322j4380392j4663518j4051675j4222897j3854061j3196522
$$ plain form
14312 87438430 90694005 94498372 97983960 101805249 106248406 110725596 115560783 120526900
14304 120526900 125692770 131412424 136965946 142737029 149504492 156348226 163286251 171440141
14296 171440141 179055774 187692645 196346166 205457634 215365937 225559341 236418806 247393660
14288 247393660 259371728 271500422 284169491 296638035 310010569 323590294 337427711
14281 337427711 350964317 364364415 377794030 390737074 402999968 414081730 423874131
14274 423874131 432052437 437831366 441542919 443627569 444228203 442662156 439135647 435099004
14266 435099004 430524706 423986542 415470854 405303175 393402763 380418285 366598078
14259 366598078 352328756 337948364 323284846 309233171 295010274 281156213 267959691
14252B67959691j1512847j2020770j1826181j1331333j0536104j0155383r580432
14245A90996641q807653q393880p718535q222987o960173o750890o283883o004854
14237A31853786n198234n755867n229521m598772m740793m517693l176284m269455
14229I4367167l562502l677765l263636l239353k640925k748098k958933k343238
14221F9932717k458652k366427k135073k020226k229280j904562k202203j488743
14213E3127551j046491j456952j683140j777365r89478j529612p77142j129201
14205D2738170j354217j380209j154169p50354j086567p06692j310901r51695
14197C4043366o55794j056696o37804q89231m61617q93467n41750r15310o97119
$$ plain form
14252 267959691 256446844 244426074 232599893 221268560 210732456 200577073 190996641
14245 190996641 182188988 173795108 166076573 157853586 150893413 144142523 137858640 131853786
14237 131853786 126655552 120899685 115670164 111071392 106330599 101812906 98636622 94367167
14229 94367167 90804665 87126900 83863264 80623911 77982986 75234888 72275955 69932717
14221 69932717 67474065 65107638 62972565 60952339 58723059 56818497 54616294 53127551
14213 53127551 52081060 50624108 48940968 47163603 46174125 44644513 43867371 42738170
14205 42738170 41383953 40003744 38849575 38099221 37012654 36305962 34995061 34043366
14197 34043366 33387572 32330876 31693072 30803841 30342224 29448757 28907007 27991697 27294578
14188B7294578o50888k00951j251741k49154o34324n28907m51459n39567j31958
14179B2655629q81108m49988j83879o65933k52222J34871q84631o60023j82812
14170A8629904l16139m85875m62208m26023N2334j24286o28987j26223m16876
14161A5695621j6438n94202j19057l82253j52301l83103j82271j55858p115m62818
14151A3240205j52021l85724m3473m31872J47484m70863k21888K312j34800l44101
14141A1205259p6153J50228m08152l48002k34631j88864j02991L5239k20894l67892
14131I443147j27485L03366j18135m30917o9111k51664j62648k26107L88853o10644
14121H138655N3070M0527n86791N39515m49413p0589l27522K69735m21439o7779
$$ plain form
14188 27294578 26643690 26442739 25190998 24941844 24307520 23778613 23327154 22787587 22655629
14179 22655629 21774521 21324533 21140654 20474721 20222499 20357370 19472739 18812716 18629904
14170 18629904 18313765 17827890 17365682 16939659 16991993 16867707 16238720 16112497 15695621
14161 15695621 15679183 15084981 14965924 14583671 14431370 14048267 13865996 13710138 13703023 13240205
14151 13240205 13088184 12702460 12658987 12227115 12374599 11903736 11681848 11684160 11549360 11205259
14141 11205259 11129106 11279334 10871182 10523180 10288549 10099685 9996694 10031933 9811039 9443147
14131 9443147 9315662 9619028 9500893 9069976 9000865 8749201 8586553 8360446 8749299 8138655
14121 8138655 8191725 8232252 7645461 8184976 7735563 7664974 7337452 7607187 7185748 7117969
14111G117969j3878j38532J8421n5678n1925l33353N3471j80904Q4250j79485
14101F320356J36619J15934l70212m23952M8478J21436l22594Q2441J00888o5794
14091E743600q102j32137R1893k11222l0572j95678p3614J04201j61465j3433
14081E113471Q0184l63692J87488R916k95308J88555q6086l78981J95808K998
14071D654353k51056J71693k76183M66757l59819j0467l64804K93122l16932L67714
14061D374378j37035l9447k26817k11963L21184l7410l09575j02276Q7918P7555
14051C796512j98041L61955k62187j52954J01713R7768m29698K29189l74678J52516
14041C322095K49040l33910m9909L38333j96282l05344j68272J38988J87658l60532
$$ plain form
14111 7117969 7104091 6965559 6983980 6928302 6876377 6543024 6596495 6415591 6499841 6320356
14101 6320356 6456975 6572909 6202697 5778745 5827223 5948659 5626065 5708506 5809394 5743600
14091 5743600 5735498 5603361 5695254 5484032 5453460 5257782 5184168 5288369 5126904 5113471
14081 5113471 5193655 4829963 5017451 5027367 4732059 4920614 4834528 4455547 4651355 4654353
14071 4654353 4403297 4574990 4298807 4765564 4405745 4395278 4030474 4323596 4006664 4374378
14061 4374378 4237343 4197896 3971079 3759116 4080300 4042890 3733315 3631039 3718957 3796512
14051 3796512 3598471 3960426 3698239 3545285 3646998 3744766 3315068 3544257 3169579 3322095
14041 3322095 3571135 3237225 3187316 3525649 3329367 3024023 2855751 2994739 3182397 2821865
14031B821865K35924j56860K47176m27241M10013j49834M8406J588j83834j98800
14021B648403K49741j87378K06218j86068j08934J44986O254m32031M54181k8900
14011B766472k59010j38398J20141j45521N06954p71065K09433K69459l13119
14002B245346m9951J26927r3078j70949Q53637p15047J84919J6688L23905j22563
13992B599834L03506M93204M15134J592215K387603N256975J1095162Q263619
13984C2407252p285004q568374n856548k657685k158791j197021j35895n37299
13976D010635p85303Q9369k94634j70274J24328j8856P4033p88785K12739N6859
13966B510111l22996K71282k26367L01474l35855J71926K0777n25242J06813L08739
$$ plain form
14031 2821865 3057789 2900929 3148105 2720864 3130877 2981043 3029449 3031037 2847203 2648403
14021 2648403 2898144 2710766 2916984 2730916 2621982 2766968 2773222 2341191 2795372 2766472
14011 2766472 2507462 2369064 2489205 2343684 2850638 2079573 2289006 2558465 2245346
14002 2245346 2195395 2322322 2229244 2058295 2911932 2196885 2381804 2398492 2722397 2599834
13992 2599834 2903340 3396544 3811678 5403893 7791496 13048471 24143633 32407252
13984 32407252 25122248 16553874 10697326 8039641 5880850 4683829 4547934 4010635
13976 4010635 3225332 3314701 3020067 2849793 2974121 2955265 3029298 2240513 2453252 2510111
13966 2510111 2187115 2458397 2232030 2533504 2197649 2369575 2390352 1865110 1971923 2280662
13956B280662q65j54276j49725N11487j76849n13564K43863r0559J13384k88864
13946A774694O21922o94458L37201r1715R1691k77299M21638k61693l90970K69982
13936A800993M6300J91636m73192L47021j10757J40105j15011J50832m00384J81140
13926A758683J67663l01243J45302l9630k60024L32387k37297n090k4189K21743
13916A758305j78070k22917L50416j96688J15449j41107K38307k83544m4520m6970
13906A348661j14513j48478M97218k8339n2593R445j88927j75977L55913m20661
13896A081749J61513J23541k57521K78596j29982M3292p1023l6225J15298j5830
13886A293408k07111O7228K12209l20875M00365j75162J28335j34501j6071l96313
$$ plain form
13956 2280662 2279797 2125521 1975796 2487283 2310434 1796870 2040733 1950174 2063558 1774694
13946 1774694 2396616 1702158 2039359 1947644 2039335 1762036 2183674 1921981 1531011 1800993
13936 1800993 1847293 2038929 1565737 1912758 1802001 1942106 1827095 1977927 1577543 1758683
13926 1758683 1926346 1625103 1770405 1730775 1470751 1803138 1565841 1560751 1536562 1758305
13916 1758305 1580235 1357318 1707734 1511046 1626495 1485388 1723695 1440151 1395631 1348661
13906 1348661 1234148 1085670 1582888 1554549 1501956 1511401 1322474 1146497 1502410 1081749
13896 1081749 1243262 1366803 1109282 1387878 1257896 1301188 1230165 1193940 1309238 1293408
13886 1293408 1086297 1153525 1365734 1044859 1445224 1270062 1398397 1263896 1247825 851512
13876H51512O22160L0940l3366m3231l53119K71424j30536k2681l31788L45962
13866A207277r9323L6173m26093N70070p2224m31677J94872J66880m8609Q8145
13856A185491j05342J28079k50078J64824M6277m72554J67595Q5213R0405J12300
13846A152210o8693J01092k29260Q6111j49239L93271l97985n935K47004n7140
13836A071436p0759M09990j36719l30146J26285j90367R7774j68003R5113J80947
13826A085551J28360l90767K7892J01117m5853l61135L37157j40938Q1164K09780
13816A032328m5062l9105k12452J27701J19792K4615Q5888l54248K76540j57924
13806H58073J15320j35803P515L08862j59466J68062k90571p7898O9682j12864
$$ plain form
13876 851512 1473672 1504612 1471246 1428015 1074896 1346320 1215784 1193103 861315 1207277
13866 1207277 1107954 1144127 718034 1288104 1215880 784203 979075 1145955 1097346 1185491
13856 1185491 1080149 1208228 958150 1122974 1169251 696697 864292 949505 1039910 1152210
13846 1152210 1083517 1184609 955349 1041460 892221 1285492 887507 881572 1128576 1071436
13836 1071436 1000677 1410667 1273948 943802 1070087 879720 977494 809491 904604 1085551
13826 1085551 1213911 823144 851036 952153 906300 545165 882322 741384 822548 1032328
13816 1032328 987266 948161 735709 863410 983202 1007817 1093705 739457 1015997 858073
13806 858073 973393 837590 845105 1153967 994501 1162563 871992 794094 863776 750912
13796G50912L59994k70141P7567o719j7673P9255K2680k04497r4275J57231j60536
13785F93798K9653j60417J93984k31875J45163j25494K49935k18845J72966J41859
13775H90727k454k93002K00277C75219L30771L02558J41694n64471M78912j54856
13765I09827J5537k71826R5844q1369P1034k27962m944K39315k94942N6695K09824
13754G17033B70906N22255j34287K61775k66943l24967K97463q7496K61933j40880
13744F59759R0864L15677D93404R5154n0799K12686j2631k88759K06789j48643
13734E07201L1608L5212J33583L0300p705M7817j21598k06941M1962m4916M4489
13723D91012K16018J53833R0999m66611K54147J31036C53163K46087L46254C64941
$$ plain form
13796 750912 1110906 840765 918332 911613 893940 973195 995875 791378 697103 854334 693798
13785 693798 723451 563034 757018 525143 670306 544812 794747 575902 748868 890727
13775 890727 888273 595271 795548 375219 705990 1008548 1150242 585771 1064683 909827
13765 909827 925364 653538 749382 668013 739047 511085 506141 745456 450514 507209 717033
13754 717033 270906 793161 658874 920649 653706 328739 626202 538706 800639 659759
13744 659759 750623 1066300 493404 588558 537759 750445 737814 449055 655844 507201
13734 507201 538809 574021 707604 737904 730199 778016 656418 449477 491439 446523 491012
13723 491012 707030 860863 951862 485251 739398 870434 353163 599250 945504 364941
13712D81673j2450L7749J54299j61832m0057N40328C74571M17001o2023k74403
13702D55146K54840l11531K64419j29613N3652J62355k95992J77173j34582J25822
13692F21689j07595P9159r6919l3406l2388J61601L23964l59763j027j27403K98852
13681G26764k0179k27863J3972K83250j26841p1359j43048j2438r7154M79492
13671H04596k43576k27174K6858K53295J98206q2329B89183K35849j50982m245
13661C69805r1995K56948J79878j64826j13989j46413K26714n8779j19347J12438
13651D50434K28176k58916q4177A59178L89176j99892K80922P5188C29883A58706
13640E67710k19142k5709j442K16886k42008J45814m7975L7842J93248k30093
$$ plain form
13712 481673 469223 506972 661271 499439 459382 999710 374571 791572 729549 455146
13702 455146 709986 398455 662874 533261 586913 749268 453276 630449 495867 621689
13692 621689 514094 593253 496334 462928 430540 592141 916105 556342 555315 427912 726764
13681 726764 706585 478722 492694 775944 649103 577744 434696 422258 325104 804596
13671 804596 561020 333846 360704 613999 812205 729876 289183 525032 374050 369805
13661 369805 277810 534758 714636 549810 435821 289408 516122 457343 337996 450434
13651 450434 678610 419694 335517 159178 548354 348462 629384 704572 329883 158706
13640 567710 348568 322859 321417 538303 296295 442109 394134 431976 625224 395131
13630C95131A34431J43451Q6138J96508k50562j7135B247N52254B14368J53858
13620C68226j80009K89723j8344R332j37444J11073O2226j46632J11091J24298
13610E93540a11177D49070j20525n8719J70628j45971K28140j46445j39164J07899
13600C44913J01694o06L3035P8763I8268J40999O3422A10286M82116A61626J96551
13589C58177k1970K3849k6110J5723K08865j49331r9233j34738K07739K44134
13579F27105c3743F18720k06369A20483N31856j06659j90035J21490j61767M4651
13569C60019R4950B05373J73089r3064a046C41835j7526Q3403A87770K86181F3946
13557C71856K33190j42810J85396j39115j44617A71117M61750A09002K97122A92693
$$ plain form
13630 395131 134431 277882 364020 560528 309966 292831 2247 554501 214368 368226
13620 368226 188217 477940 459596 468928 331484 442557 504783 358151 469242 593540
13610 593540 -111177 449070 328545 269826 440454 294483 522623 376178 237014 344913
13600 344913 446607 446001 479036 557799 98268 239267 302689 110286 592402 161626 358177
13589 358177 336207 360056 333946 349669 558534 409203 309970 175232 382971 627105
13579 627105 -33743 618720 412351 120483 652339 545680 355645 477135 315368 360019
13569 360019 454969 205373 378462 285398 -1046 341835 324309 407712 187770 473951 63946
13557 371856 605046 462236 647632 508517 363900 171117 632867 109002 406124 192693
13546B50145p5251J72760J65703A98642p5696J33882K66112k13510k0172Q7336
13536C76594j86061B9402N86390k01973l7219J71251k19215B8694L6758J31770
13526A97222L72509k23253G8642O55764B24308K90597A98402j8416J2256K50007
13516D42249h2671C25979k9049M6248N0314R916m9865c602B96634J05432C3669
13504A50056P2028G5133J73756M0465p0995j08887J56722O8420b7560B4231N1309
13493G5540N4655N06817A47899K58965K9054L4169c9993D78988E1226c7009D64565
13481F32478k37084A44109M78328A94489K40624d1976j6327A1582L33248J03225
13471D48055j31854A18057R2885N0312J42053e8706D84475G0044a65082B22576
$$ plain form
13546 250145 174894 347654 513357 198642 122946 256828 522940 309430 289258 376594
13536 376594 190533 29402 615792 413819 376600 547851 328636 28694 65452 197222
13526 197222 569731 346478 78642 734406 224308 514905 198402 179986 192242 442249
13516 442249 -82671 325979 296930 343178 393492 403408 353543 -3602 296634 402066 33669
13504 150056 222084 75133 248889 289354 218359 109472 266194 334614 -27560 24231 75540
13493 75540 130195 637012 147899 406864 435918 470087 -39993 478988 51226 -37009 464565
13481 632478 395394 144109 622437 194489 435113 -41976 -58303 11582 344830 448055
13471 448055 316201 118057 210942 261254 403307 -58706 484475 70044 -165082 222576
13460G2467J90734J75942j03232A13253a8428A0363L21327A48297O2689K36642
13450D47628m2792N3867J45123B54423Q0130G6400J48903a65261g1896D18714
13439i663C36735j48744O5639C2098a13880N5449B34866Q2786E6972J50960O5767
13428B73699m298L09671k62918O1485b494B9224M60508E665N47979A73921K81190
13417D55111A85881N51526B10974J46642l3587j2434K3099c9434A39710N6686
13407A96396L35809a1664A15358J30069K67771k38982H5103A214J80758m4206
13397A37766D4852A6647J59614K35580c0469B25292l1437P9773k031L01109A80377
13385A87616M4769O9124o6090e7379C314K97772A02064M8966K50521Q5104F4502
$$ plain form
13460 72467 263201 439143 335911 113253 -18428 10363 331690 148297 210986 447628
13450 447628 404836 458703 603826 254423 334553 76400 225303 -165261 -71896 418714
13439 -9663 336735 187991 253630 32098 -113880 -58431 234866 317652 56972 207932 273699
13428 273699 269401 579072 316154 377639 -2494 29224 489732 5665 553644 173921 455111
13417 455111 185881 737407 210974 357616 324029 311595 334694 -39434 139710 196396
13407 196396 532205 -11664 115358 245427 513198 274216 85103 1214 181972 137766
13397 137766 44852 16647 176261 411841 -30469 225292 193855 273628 271597 572706 180377
13385 187616 232385 301509 235419 -57379 3314 301086 102064 151030 401551 486655 64502
13373D43541j68403p863D1617L98673A4726K73374k2887K31033A63452L93716
13363E57168h2156D01074A09787J44153j11732J68715j10325J19467p267c1344
13352B39347K9703K08046A96824B7049K89425G9452N22823B14003L83563j62708
13342D34858a9151D60178B29376N97714B75411P5500B908K38970a4726D98972
13331C84646e9343A51018C8569L9938J36166J27387j38680A6217B316K83305a51682
13319F9491M7093K26502K7367l4050G9258K66913n6713K6288j15180D8896J71151
13308B20047F35J35082b7617D3620J15574a26724B61665j5870F3813K04228d3332
13296A62835J20019h7710B71733K50979B35603K05898j87807A06675E2480P1326
$$ plain form
13373 443541 275138 267275 41617 440290 14726 288100 265213 496246 163452 557168
13363 557168 -82156 401074 109787 253940 142208 310923 200598 320065 312798 -31344
13352 239347 269050 477096 196824 27049 316474 79452 602275 214003 597566 434858
13342 434858 -19151 460178 229376 827090 275411 350911 2908 241878 -14726 498972
13331 384646 -59343 151018 38569 78507 214673 342060 203380 16217 2316 285621 -151682
13319 69491 116584 343086 370453 336403 79258 346171 289458 315746 200566 48896 220047
13308 220047 635 135717 -27617 43620 159194 -126724 261665 245795 63813 268041 -43332
13296 162835 282854 -87710 271733 522712 235603 441501 253694 106675 52480 123806
13286A23806a604p9182B04957q2947a25539e7084A90641H6884K13345C0790a4440
13274C53535q8719C538L9935a43577A50395O8047m985O3454A31169a29611j585
13263a31196B63876A2744J65508B3136J7395e4780r692I5330M80280A80860a60794
13251C18744I4583K03804n5680J5178H8712K26072j10677p6369A3108a63389d055
13239D5188L42778j06792A31110d581B12566r5924M5405g444I7967e1858B25300
13227a27648f1855o9545B4015J06096K15971o9649b8528A50733B8268J86125H6203
13215A15142j7874A0612c3809A77114q6615a32073A87308k957A6592b74175R2583
13204a81592G2786J3934J77227A3537L03209E3467k4508a41327C22594j31295
$$ plain form
13286 123806 -1604 -80786 204957 122010 -125539 -57084 190641 86884 300229 30790 -14440
13274 353535 264816 3538 43473 -143577 150395 218442 213457 276911 131169 -129611 -131196
13263 -131196 263876 12744 178252 23136 40531 -54780 -64472 95330 575610 180860 -160794
13251 318744 94583 298387 242707 257885 88712 314784 204107 127738 13108 -163389 -4055
13239 45188 387966 281174 131110 -4581 212566 116642 162047 -7444 97967 -51858 225300
13227 -127648 -61855 -131400 24015 130111 346082 276433 -28528 150733 28268 214393 86203
13215 115142 97268 10612 -33809 177114 90499 -132073 187308 184351 16592 -274175 -181592
13204 -181592 72786 86720 263947 13537 316746 53467 28959 -141327 322594 191299
13194A91299o5980a32693A20353c4728A95385K9885k9831h5769A86091b23220
13183b1287A01740j9687j9988J6942K12474b97048A82989q6052L4410m8762c1808
13171G5036c4387k99773b8752p5932B30051G4020a12372C10811r2149b33401B55673
13159a40078B99089C7151K87203j62085J88666b0805A67729h7113B4445b0929
13148g1320C84433D7881P2650a7677C37841M77A31361J69916i4782J9152i056
13136b4626j00269j26074O8936A32358J19594F9984K47286A43257k0057J30418
13126B53618h7274H1619K57629A14020F240P9024L0651D7206B1325J3329c6058
13114A7443a53346d7823G2755J32327r5892J08055o2348C5956a30896B9514N4750
$$ plain form
13194 191299 125319 -132693 120353 -34728 195385 225270 195439 -85769 186091 -223220
13183 -21287 101740 82053 62065 79007 291481 -297048 182989 96937 131347 82585 -31808
13171 75036 -34387 -334160 -28752 -104684 230051 74020 -112372 310811 218662 -233401 255673
13159 -140078 299089 37151 324354 162269 350935 -20805 167729 -87113 24445 -20929
13148 -71320 384433 47881 120531 -17677 337841 338318 131361 301277 -94782 -75630 -9056
13136 -24626 -124895 -250969 -182033 132358 251952 69984 317270 143257 123200 253618
13126 253618 -87274 81619 339248 114020 6240 85264 115915 47206 21325 34654 -36058
13114 17443 -153346 -47823 72755 205082 109190 217245 154897 35956 -130896 29514 84264
13103H4264L7271g3343A86091h632B38966F2078b20197F8645R6101M4292C9246
13091A72865A0783a23196a8057B12295M2546C3332O3262j0046a75603A32008L82447
13080E14455A16637a04676E7378K70064o5229D3272b6938A72609q3588M6631k8041
13069A07611K27695I585J63806g3805B37545D1087K04809G7457a62231e3596A09733
13057C07493n6408a39158o0337h4550D4387J41024a30160A56387m9401a27850
13046A53199C3799h1289A47827F4102O807K41382e8728o6959B60129L3360c5952
13034b0708A77844b3893A35339A4927B719L5454K25904a25040A95097J01218K518
13023B98833I5661O2294j2435j9741h3908i081j5536C81650m9073d5519I5157
$$ plain form
13103 84264 121535 -73343 186091 -8632 238966 62078 -220197 68645 164746 209038 39246
13091 172865 10783 -123196 -18057 212295 254841 33332 96594 86548 -175603 132008 514455
13080 514455 116637 -104676 57378 327442 262213 43272 -26938 172609 89021 135652 107611
13069 107611 335306 9585 173391 -73805 237545 41087 245896 77457 -162231 -53596 109733
13057 307493 251085 -139158 -199495 -84550 44387 185411 -130160 156387 106986 -127850
13046 153199 33799 -81289 147827 64102 70909 312291 -58728 -125687 260129 293489 -35952
13034 -20708 177844 -23893 135339 14927 2719 38173 264077 -125040 195097 296315 298833
13023 298833 95661 157955 145520 125779 -83908 -9081 -24617 381650 332577 -45519 95157
13011A18496b9664q4728A17590c3654B37286b08539N4878B60268f853A83668F1028
12999A34198J8339D5444c8662A2776b56272B44110A05310L47110d6931p9026H3165
12987B7201M3555l0852K53401I2703J25281J11222I4559d462n1264D0417j1821
12976B8596O6411N1224b12309A45635J59617d3046k63660I5980b36207A18409
12965B97791j11795J54244E8714k581J92469B1634J50221d0313j91915M8652i383
12953C543e3827l70022J78038a8233A95754a28960F2304Q0007N7386C7585a22215
12941C2552J64179k1877l9467l727o1335c01743B99025A34531a21398H6711A9258
12929B533a95091P2614A20478a07513B71488M0928K02945e9548p117L3063r830
$$ plain form
13011 118496 -29664 -114392 117590 -33654 237286 -208539 -153661 260268 -6853 183668 61028
12999 134198 152537 45444 -38662 12776 -256272 244110 105310 452420 -46931 -125957 83165
12987 27201 70756 39904 293305 92703 217984 329206 94559 -4462 -55726 40417 28596
12976 28596 95007 146231 -212309 145635 305252 -43046 -306706 95980 -236207 118409
12965 297791 185996 340240 58714 56133 248602 21634 171855 -40313 -232228 -183576 -9383
12953 3543 -53827 -423849 -245811 -18233 195754 -128960 62304 142311 199697 37585 -122215
12941 32552 196731 174854 135387 131660 70325 -301743 299025 134531 -121398 86711 19258
12929 2533 -195091 -122477 120478 -107513 271488 312416 515361 -59548 -66665 -33602 -43432
12918d3432D28186c4663k24263A75330g7939B05964a31900b8020A61148M3284
12908B04432F6755a882A88724b9768q1456M1672D6046f1365l2691H8859i5876
12896B58639A8897c08389b6959j06001G188J45899j0845J80034c6749k75138A31673
12884a26678B33003J85874a35749B13095q3461h0542A13292C9924e7280B7031
12873F5108J29518k9614L0392a00673k9994d7588p3148H7729m1119a72427A77165
12861F1976l0018J1638E749J71086c00080B47654F2971n396i4309B00231E9055
12849a73745A38581K3340J6273H1323e6115k4313C647R4251a45289L8938e2126
12837d0323A41573l7000J4631Q2754d6779j70413E7817Q6680D5692K36219A24498
$$ plain form
12918 -43432 428186 -34663 -258926 175330 -77939 205964 -131900 -28020 161148 204432
12908 204432 66755 -1882 188724 -29768 -111224 -69552 46046 -61365 -94056 88859 -95876
12896 258639 18897 -308389 -26959 -132960 7188 153087 142242 322276 -36749 -311887 131673
12884 -126678 233003 418877 -135749 213095 129634 -80542 113292 39924 -57280 27031
12873 65108 194626 165012 195404 -100673 -130667 -47588 -120736 87729 46610 -172427 177165
12861 61976 31958 43596 5749 176835 -300080 247654 62971 57575 -94309 200231 59055
12849 -173745 138581 161921 178194 81323 -56115 -80428 3647 97898 -145289 -106351 -52126
12837 -40323 141573 104573 119204 201958 -46779 -217192 57817 144497 45692 281911 124498
12825C3098b13867A29582D6798e3068B19280a87707k579G3592K99530A4439a48098
12813E0316B4284h3404D059a18925l9895L5401B12126L9685h5880K4658B05292
12801E8445E303J39439K0022c2274C6544a71917g3425m4665A55565i0513A02139
12789a02476J4637G3267b06309D2144b11826C8272N67368A46741J0475m5310K1364
12778A33270L0905A8970a47551k80517I9689b67384f1478B1844L11569b3288C5426
12766B5904a09874l27339a4860B8127J07744O5623a2961r3131B46356h7749l5931
12755a23680q2659m822Q4382A51756G43J84215h7823B33221a5749B84908c62479
12743a15208I2008f8596B61706d21230D01538A51704d983A67008a89539f4018
$$ plain form
12825 33098 -213867 129582 46798 -53068 219280 -187707 -190286 73592 373122 14439 -148098
12813 50316 24284 -83404 4059 -118925 -158820 -123419 212126 251811 -85880 -61222 205292
12801 58445 5303 144742 164764 -32274 36544 -171917 -73425 -118090 155565 -90513 102139
12789 -102476 -87839 73267 -206309 42144 -211826 38272 605640 146741 157216 111906 133270
12778 133270 164175 18970 -147551 -428068 99689 -267384 -61478 21844 333413 -23288 35426
12766 25904 -109874 -437213 -14860 28127 135871 201494 -12961 -106092 246356 -87749 -123680
12755 -123680 -206339 -211161 -126779 151756 743 184958 -87823 233221 -15749 284908 -362479
12743 -115208 92008 -68596 261706 -421230 401538 151704 -4983 167008 -189539 -64018
12732B62417A21540C9874a80388j14249A6423A139a03840E9228K22210D8338f5244
12720A25644a58310D5053J0677J42581j496b0397r8170K0593D5171d9490D96313
12708h6335K7026r5998B18320a45019B11116e9659b9742A71199H0574b01839E49948
12696c07668d1088B39434a57653A89540f5853j95768E935K2601b20015A21653
12685b14252R9430d7078l3486A15052K09890b5171A27363J47813k3345b28812
12674e5742C28630j29963o3194J05554e3526A10929J15664G8279P006i6742p6703
12663a73445N4640A23875a54557j21503B00501l0416j1411a77815B52077e3233
12652d3129A55450n5773K42033K7004D0769J59243N399a57358C3738e7938j07876
$$ plain form
12732 262417 121540 39874 -180388 -294637 16423 1139 -103840 59228 281438 48338 -65244
12720 125644 -158310 45053 55730 198311 196815 -20397 -118567 -97974 45171 -49490 496313
12708 -86335 -59309 -155307 218320 -145019 211116 -59659 -29742 171199 80574 -201839 549948
12696 -307668 -41088 239434 -157653 189540 -65853 -261621 5935 28536 -220015 121653
12685 -214252 -114822 -47078 -80564 115052 324942 -25171 127363 275176 251831 -228812
12674 -55742 328630 198667 135473 241027 -53526 110929 226593 78279 85285 -96742 -173445
12663 -173445 -118805 123875 -154557 -276060 200501 170085 158674 -177815 252077 -53233
12652 -43129 155450 99677 341710 368714 40769 200012 205411 -157358 33738 -57938 -165814
12641a65814B54752B9592J01037n9187a47892A12604a51822I3531E701c79A24833
12629B78798m8350H2264J40776a42025A44132J36427j37117Q4851F7920a98366
12618A410a16588E609e702G4638L8524H333L01582j20752L6104b15847R0236d089
12605a26341I2244J78524A526J06244K02016b1237A00121N142J52551c03458a3937
12593B26056J17221a51553A44007J14566b0089A63875a61444p4907I7703b94622
12582B8986a14540o6527A4914J4850a04290C04077e53730B31566C8889J11137
12572A50026E7563J52258f5583k18438D9579O249K5266O3898a35243A64954C9700
12560b56370J5953c9367j57881R5702G1907J03709a38270n9462C40310a07659
$$ plain form
12641 -165814 254752 29592 130629 71442 -147892 112604 -151822 93531 5701 -379 124833
12629 278798 230448 82264 223040 -142025 144132 280559 143442 228293 67920 -198366
12618 1410 -116588 5609 -5702 74638 113162 8333 309915 189163 225267 -215847 -125611 -4089
12605 -126341 92244 270768 1526 107770 309786 -21237 100121 105263 257814 -303458 -13937
12593 226056 343277 -151553 144007 258573 -20089 163875 -161444 -236351 97703 -294622
12582 28986 -114540 -181067 14914 29764 -104290 304077 -553730 231566 38889 150026
12572 150026 57563 209821 -65583 -284021 49579 55828 81094 144992 -135243 164954 39700
12560 -256370 -240417 -39367 -197248 -101546 71907 175616 -138270 -197732 340310 -107659
12549D0186N5240K10777j44883J0642P485a75061d9049A33979a98036D1328K57284
12538B98612E8709L4868a14758b791A11677h02B46380a2242j32092B9580O7707
12527I7287b36808D5031J88638b94992A05110b27843B34928J33313A79506O4540
12517B44046b96781f9408A80808H2480J19197J15253j39109N3671c48891E2790
12506i1477j6181N3373B38838I710J14595a52722N1336j0604j09046K5184g0698
12494e9473j76167A21846b84511A12560a71470M6013N7812E7860h5521B30451
12483A71146a97683B86329a90125A17137n8378n06J57205A7507c85909A61763
12472H1762K58854A1970b09039A96842c6644j71201H572b98686B08684a35862
$$ plain form
12549 40186 95426 306203 161320 171962 179447 -175061 -49049 133979 -198036 41328 298612
12538 298612 58709 93577 -114758 -2791 111677 -802 246380 -12242 -144334 29580 97287
12527 97287 -236808 45031 233669 -294992 105110 -227843 234928 368241 179506 244046
12517 244046 -296781 -69408 180808 82480 201677 316930 177821 231492 -348891 52790
12506 -91477 -107658 -54285 238838 9710 124305 -152722 -101386 -111990 -221036 -195852 -70698
12494 -59473 -235640 121846 -284511 112560 -171470 -125457 -67645 57860 -85521 230451
12483 171146 -197683 286329 -190125 117137 58759 58253 215458 17507 -385909 161763
12472 81762 340616 11970 -209039 196842 -36644 -207845 8572 -298686 208684 -135862
12461A19426f7224C51696A26465d21763C12934j24577g4973A03107k6380a8829
12450I0369a15790A59975b29075A00234A9597a23872D5844A6224P4912g3420c4362
12438B17464d0846A38381e1703D3242j5737h0477b7449B59692a62369J8380c5532
12426b8814A67916n0117e2445j0028D17389d45757A47770a92686a8574n30755
12416e49329K50430Q8868C97546A54553a19326C5018K6302L6989K73161a69620
12405B09150a95323P4241i681E6680b50881j84280D9218g2382L3479j30197m0489
12394b09589R0371B6247J03280a87994A60038a523j28870B5487b41466d0907j76560
12383b17467G2136J09514A5470O5973J71056E6927Q6433d0072k54061e2470B61084
$$ plain form
12461 119426 -67224 351696 126465 -421763 312934 188357 -74973 103107 76727 -18829
12450 90369 -115790 159975 -229075 100234 19597 -123872 45844 16224 91136 -73420 -34362
12438 217464 -40846 138381 -51703 43242 27505 -80477 -27449 259692 -162369 -143989 -35532
12426 -28814 167916 117799 -52445 -62473 417389 -445757 147770 -192686 -18574 -549329
12416 -549329 -298899 -210031 397546 154553 -119326 35018 61320 98309 371470 -169620
12405 209150 -195323 -121082 -9681 56680 -250881 -435161 49218 -72382 -38903 -169100 -209589
12394 -209589 -119218 26247 129527 -187994 160038 -1523 -130393 25487 -241466 -40907 -217467
12383 -217467 72136 181650 15470 81443 252499 56927 143360 -40072 -294133 -52470 261084
12371C31599c132C4145a99477C56543c35628c2358D1300h9377A3036f8052A73401
12359B72724a55316E32699c6525l9071H7453J83836J14949A29453A0413f3728
12348f0432A21846a19336n9698J847k01520A68827F3474L21361c72184P7214A77650
12336a15640a1233A80361J91984a20541d6602C68214H552J17275j5462K20046
12326C30411Q5253a45860A24418d0372B5580P7314A8242Q9506a00956b6187B07270
12314G3845P7003b03209A71958i8608A58625b6771A65921E6954J24309b50750
12303H4106J46000i167H32L41764A38432o2202b31599A31810e5551J9538E5585
12291b73780a33343r9757B33568J7819a95470R4000A34320l668F0612d0271A85448
$$ plain form
12371 331599 -3132 34145 -199477 356543 -335628 -32358 41300 -89377 13036 -68052 173401
12359 272724 -155316 532699 -36525 -75596 87453 271289 386238 129453 10413 -63728
12348 -60432 121846 -119336 -179034 -177187 -378707 168827 63474 384835 -372184 -294970 177650
12336 -115640 -11233 180361 372345 -120541 -46602 368214 8552 125827 110365 330411
12326 330411 415664 -145860 124418 -40372 25580 102894 18242 107748 -100956 -26187 207270
12314 73845 150848 -203209 171958 -98608 158625 -26771 165921 56954 181263 -250750
12303 84106 230106 -9167 832 342596 138432 76230 -231599 131810 -55551 -36013 55585
12291 -273780 -133343 -233100 233568 251387 -195470 -101470 134320 130652 60612 -40271 185448
12279F3437g7608A92547D8157M033E289J78083a78972P1441L0864k05726J22691
12268a59702B75498E8885K4335K304P1106J66973a91321E20J25662D4457Q5852
12257A30309f0203A87058H494M6116K14554a09010D9039J1485J04625Q8267g8015
12245e1599B43798I9454g5538C0190J18954b87910A03133h7775J0614A21079M3636
12234A64715b6658A02407M0387P7223j0556I4355K32894K4244a82019B77620A25460
12222E07771I968N9989L27503A11672L81270B00867a09693C46353q2325m6754
12212B17274R1372k8872j10818D9082p375Q0352K33450D1428L2518a06975B02688
12200B14683C2545K74138A13250J91016j00799E5612K55116j08655K0418B0216
$$ plain form
12279 63437 -77608 192547 48157 52190 5289 183372 -178972 -107531 -76667 -282393 -159702
12268 -159702 275498 58885 83220 85524 156630 323603 -191321 520 126182 44457 130309
12257 130309 -60203 187058 8494 54610 269164 -109010 49039 60524 165149 253416 -78015
12245 -51599 243798 99454 -75538 30190 149144 -287910 103133 -87775 -77161 121079 164715
12234 164715 -26658 102407 142794 220017 209461 94355 327249 351493 -182019 277620 125460
12222 507771 9968 69957 397460 111672 492942 200867 -109693 346353 264028 217274
12212 217274 308646 279774 168956 49082 41707 122059 355509 41428 73946 -106975 202688
12200 214683 32545 306683 113250 304266 203467 55612 310728 202073 222491 20216
12189B69757e6275C58556C8765K42250I9197J32512c3834l2239E4300B2121J24206
12178A46327m6257m5888K34801q455N335j2882a2527H9386m1536N5766m9024f5123
12165a02661G6233e2319n4998C66303e0407H4626d2253B6177d9658b723j00640
12154a03363A36561m3812L40505a18450B12830a51881H3619K3718J88571l8478
12144B57430j21446c3214k88476a1700A30923L7823m7004a57731F9056a29027
12133A66041P0899p6838A7485h6320J3549B55008Q711a09187E1417J57150l4572
12122A73995a16662A30779a77095C06749f4720A68856J48842j49936e5646A03361
12111a21016B37160A0882a10761E0528J98099a02889j86990d164A83391G4095
$$ plain form
12189 269757 -56275 358556 38765 281015 99197 231709 -33834 -66073 54300 22121 146327
12178 146327 100070 54182 288983 280528 285863 272981 -12527 89386 47850 103616 54592 -65123
12165 -102661 76233 -52319 -107317 366303 -50407 84626 -42253 26177 -49658 -2723 -103363
12154 -103363 136561 92749 433254 -118450 212830 -151881 83619 107337 295908 257430
12144 257430 135984 -33214 -321690 -11700 130923 168746 121742 -157731 69056 -129027
12133 166041 236940 160102 17485 -86320 -72771 255008 263719 -109187 51417 208567 173995
12122 173995 -116662 130779 -177095 306749 -64720 168856 317698 167762 -55646 103361
12111 -121016 237160 10882 -110761 50528 248627 -102889 -289879 -4164 183391 74095
12100A93224j4190i762A46498c86345C42432b15718H7785f6927b7535A92645K72104
12089D64749B09751J4277c61579H1337j425L00294c5875H5261f5528j04452P6962
12078i3018c9760B66606j17057e1071l1912i153k41997p2464B79134c00623C0468
12066B64113b3885K135m5782B196a08899D4303c0487r9074F731R5580J6764c17628
12053f7290D2682a58530A44860D038a79254e4833B05067o4925K13742b24606p7494
12042c02100L4706c0263j41481A3270a18614N7979I6364g6633B49848b62118i5746
12030d5095j30986j35349J30656J7442A92597a29432c9377k65866f5456j736E4980
12018a11371A53663a86841N1798d7834k86138A50947F4234M09383j17418a12051
$$ plain form
12100 193224 179034 -9762 146498 -386345 342432 -215718 87785 -66927 -27535 192645 464749
12089 464749 209751 224028 -361579 81337 79912 380206 -35875 85261 -65528 -169980 -93018
12078 -93018 -39760 266606 149549 -51071 -82983 -9153 -251150 -323614 279134 -300623 30468
12066 264113 -23885 -21750 -67532 2196 -108899 44303 -30487 -129561 6731 102311 119075 -317628
12053 -67290 42682 -158530 144860 4038 -179254 -54833 205067 140142 353884 -224606 -302100
12042 -302100 -267394 -30263 -171744 13270 -118614 -60635 96364 -76633 249848 -262118 -95746
12030 -45095 -176081 -311430 -180774 -163332 192597 -129432 -39377 -305243 -65456 -67192 54980
12018 -111371 153663 -186841 -135043 -47834 -333972 150947 64234 473617 356199 -112051
12007E8806Q5277d48949b1925C14261A10255C4889J49730D8791J90361a31516
11996i2607A10118b33893J14348B20244d6488C60835e2834l278j06917J7757H7621
11984a51498d070A37967a21460L7853A2951J46143i5778K6970j54589e5027k00632
11973b55659A86744A9705J95109q295J76551j51887H9827c03537J49916E2200
11962b70493j9864a066D5829d7315k13066J27406a1747F6132a60199e9329B48148
11950c91999a11075B3630J42183a04038A53528c60888b5506A49686I679a25151
11939b04304B97989d7146F0596a19665b2895j15534M7287A62317h0023C70892
11928c06796i1678P086k83115E7702P1615a48998C8378a7154B2319c56871a12141
$$ plain form
12007 58806 144083 -448949 -21925 314261 110255 34889 184619 48791 239152 -131516
11996 -92607 110118 -233893 -119545 220244 -46488 360835 -52834 -56112 -163029 -145272 87621
11984 -151498 -4070 137967 -121460 -83607 12951 159094 -95778 -68808 -223397 -55027 -255659
11973 -255659 186744 19705 214814 206519 383070 231183 89827 -303537 -153621 52200
11962 -270493 -290357 -1066 45829 -47315 -260381 -132975 -11747 66132 -160199 -59329 248148
11950 -391999 -111075 23630 165813 -104038 153528 -360888 -25506 149686 9679 -125151
11939 -204304 297989 -47146 60596 -119665 -22895 -138429 -91142 162317 -80023 370892
11928 -306796 -91678 -84592 -367707 57702 129317 -148998 38378 -17154 22319 -356871 -112141
11916a05239k8800o2231r9474g1088j265F7767a36114N1738k47246A80156a5166
11904a00713A16019f7946n0861B04137c15308o1750H5589a13362b0258D5907a97451
11892g2223j8795r786A6307b674j6760l18863H6246N1440K83687A16459a21050
11880A35342a08803k37586g5625J6584B01925c65517D9625j7634a79973B12206
11869a41885f5764n7100A93537e2488l88627J56382o091m9375i6780l4247b436
11857b78180C820b03988Q6151k634A89432E5415P2692e0493b2889j4409H6652
11845b13736k6670I3021D209h1512k16383i804n8556A32781j1820j3106b41183
11833b35048A41491b5641k31498G8690C4766K80739A03767k2063Q3312a29472
$$ plain form
11916 -105239 -134039 -196270 -295744 -71088 -72353 67767 -136114 -84376 -331622 180156 -15166
11904 -100713 116019 -67946 -118807 204137 -315308 -377058 85589 -113362 -20258 45907 -197451
11892 -72223 -91018 -100804 16307 -2674 -19434 -338297 86246 137686 421373 116459 -121050
11880 135342 -108803 -346389 -75625 -59041 201925 -365517 49625 31991 -179973 212206
11869 -141885 -65764 -122864 193537 -52488 -441115 -284733 -290824 -340199 -96780 -131027 -2436
11857 -278180 3820 -203988 -117837 -120471 189432 55415 128107 -50493 -22889 -37298 86652
11845 -213736 -240406 93021 4209 -81512 -297895 -9804 -68360 132781 120961 107855 -241183
11833 -235048 141491 -25641 -257139 78690 34766 315505 103767 81704 165016 -129472
11822C5394K0731a76082A95554I1409a0591A336i3006l8948j29510R1123P8078
11811i2263d0430k4192C4616a71788C99000I1484P624b70683A43441A9103Q2586
11800A01689J29803K7221H953a19762A37704B8876K66700F2357N6931C2972a3361
11788F2225b31389A95030d5760B3373a08275A20009b24196j39880b4656A024b18790
11776a04132L7353j08301B39700H173a39641a9182l9877c63j78352c0589A48695
11764H0749N8208M407f1687F886i2001k6913r3998A42965a10163N0301A19389
11752f5778A04239Q1063n0623b36316a04307A5207a48319C1286K33299f3293p3364
11741a36657L2009I2433a7047f236l05633l5823G8938a33450l1846F2211J65936
$$ plain form
11822 35394 56125 -176082 195554 91409 -10591 1336 -93006 -131954 -261464 -170341 -92263
11811 -92263 -40430 -64622 34616 -171788 399000 91484 99108 -270683 143441 19103 101689
11800 101689 231492 258713 8953 -119762 137704 28876 295576 62357 119288 32972 -13361
11788 62225 -231389 195030 -45760 23373 -108275 120009 -224196 -364076 -24656 1024 -218790
11776 -104132 -66779 -175080 239700 8173 -139641 -19182 -59059 -363 -178715 -30589 148695
11764 80749 138957 143364 -61687 6886 -92001 -118914 -212912 142965 -110163 -59862 119389
11752 -65778 104239 185302 134679 -236316 -104307 15207 -148319 31286 264585 -63293 -136657
11741 -136657 -104648 92433 -17047 -6236 -311869 -347692 78938 -133450 -165296 62211 228147
11730B28147b71274I625a7308B31240k3615f666B38120a27765A18051g0675j8117
11719h8792P974A44383Q9884a3613j76146R0167k10068D967a32746A30229a10840
11707D6343c45842j20928a23184c5321E605J6955a58270d9945b2252A15344b1980
11695C97445A6438c9981j23974B00772A5193M0595R7084b59891J5319B25515c11346
11683c50403C27644a48652o951n8160n9067A43270f3935j4648J2126B60299h1438
11671H4659M151K32327E4333a9021r1429B92029C0816a34255j02844O975J03488
11660a26636C0159N3465g113m253I1756J65021A1684a89991Q4588m4978a2123
11648H1520b80812k24006a68047A26898D1193J28540b7947m3766k12655L7052
$$ plain form
11730 228147 -271274 9625 -17308 231240 207625 -6666 238120 -127765 118051 -70675 -88792
11719 -88792 -80818 144383 234267 -13613 -189759 -99592 -309660 4967 -132746 130229 -110840
11707 46343 -345842 -466770 -123184 -35321 5605 22560 -158270 -49945 -22252 115344 -21980
11695 397445 16438 -39981 -163955 200772 15193 55788 152872 -259891 -244572 225515 -311346
11683 -350403 327644 -148652 -155603 -213763 -272830 143270 -63935 -78583 -66457 260299 -81438
11671 84659 88810 321137 54333 -19021 -110450 292029 30816 -134255 -237099 -230124 -126636
11660 -126636 30159 83624 -7113 -11366 91756 256777 11684 -189991 -105403 -150381 -12123
11648 81520 -280812 -504818 -168047 126898 41193 169733 -27947 -71713 -284368 -247316
11638b47316Q6904A20154P6574J73127b36932B28406p7605d02330A80867a56008
11627i7205q8648j4141A82610j6168B7414a15770e3467p6899d8574I5207P6934
11616A72141j3783a43771E5239O6210D5008a57830N2961B00672g2619B79011a46082
11604h1696J0139b2362A35796N3241b63078B939N6303a54999d4324B09459b53524
11592A05302c0144o5579I0694K0220J83570N8569a08987r4822d5052k35880C61891
11580A82725E7140K3294J0041P4907J7715n0437J04503b99692A5625a6639A88030
11568B7438J14969m921b77758A32851P1124c6290A99846c549C48271a37453e4468
11556a53971N8783k55250a20193H253J01345h1713K7679j80523g4720A87096b88446
$$ plain form
11638 -247316 -160412 120154 196728 369855 -236932 228406 150801 -402330 180867 -156008
11627 -97205 -185853 -199994 182610 166442 27414 -115770 -53467 -130366 -48574 95207 172141
11616 172141 158358 -143771 55239 121449 45008 -157830 -104869 200672 -72619 279011 -146082
11604 -81696 -71557 -22362 135796 189037 -263078 2939 59242 -154999 -44324 209459 -253524
11592 105302 -30144 -95723 90694 110914 294484 353053 -108987 -203809 -45052 -280932 361891
11580 182725 57140 80434 90475 165382 183097 132660 237163 -299692 15625 -16639 188030
11568 27438 142407 137486 -277758 132851 203975 -36290 199846 -3549 348271 -137453 -54468
11556 -153971 -95188 -350438 -120193 8253 109598 -81713 -54034 -234557 -74720 187096 -288446
11544C1413P5690a44868j59080D10386g1961m1348k3711j75230f9591j55181A89977
11532B09106a83051A060a63032K30B09847k0470a33966b704B29807E3091O2J58217
11520B11370K8886c7785A4466b66276G2876J65631b0378j90125B7994M9728A8028
11508f4549J8248p8040L7633C19952f8699a6349j4376A77479E8649b00461C24655
11496a93781A3209a14604A77092E0162M123J80587J7550m9178a4872B85768G6799
11484e2017k35194C11350A17116h0488A16055k5137J93885a04249A88882n4582
11474A34300c26894C19536h6641p3705B71661a03380l7820I2563a77947B35166
11463C24225H5605j9902E766J04482a74557b7527C540a05684B50443a52006B15822
$$ plain form
11544 31413 107103 -144868 -303948 410386 -71961 -113309 -137020 -312250 -69591 -224772 189977
11532 209106 -183051 1060 -163032 -162802 209847 189377 -133966 -2704 229807 53091 53153 211370
11520 211370 240256 -37785 14466 -266276 72876 238507 -20378 -210503 27994 77722 18028
11508 -64549 -46301 -124341 -86708 319952 -68699 -16349 -30725 177479 58649 -200461 324655
11496 -193781 13209 -114604 177092 50162 54285 234872 252422 203244 -14872 285768 76799
11484 -52017 -287211 311350 117116 -80488 116055 90918 284803 -104249 188882 134300
11474 134300 -326894 319536 -86641 -160346 271661 -103380 -141200 92563 -177947 235166
11463 324225 85605 65703 5766 110248 -174557 -27527 3540 -105684 250443 -152006 215822
11451A92761a47622B72404m6994G8860h649F1424a75293A4527Q2054L3824h0014
11439C09894a07641L3092B67741A10729D9864a3623C8843J6822a02789H0935O6392
11428A47327a28939G0365J8793J73721a02389B2597J55989c7497o2680B14511
11417a88341q8249A31372k9131a00131B61140a60204G0388g8053k3932l71506
11407d73491B45227A06109a80484e8996m488A35857J65102F3141B599c95083f7694
11395c29375A8220L9287d591k14661L9370p2876G8721K38903f3359j13594f3329
11383A93139H1866a22008l3254i58j5046A44434a45034k6393D6045a67215L1184
11372a36031G5490K11608J9687D4933J11362L5323o0322b54580a8046j9237A79417
$$ plain form
11451 192761 -147622 272404 225410 78860 -8649 61424 -175293 14527 96581 130405 -80014
11439 309894 -107641 -74549 267741 110729 49864 -13623 38843 55665 -102789 80935 147327
11428 147327 -128939 70365 89158 262879 -102389 22597 178586 -37497 -100177 214511
11417 -188341 -276590 131372 102241 -100131 261140 -160204 70388 -78053 -101985 -473491
11407 -473491 245227 106109 -180484 -58996 -63484 135857 300959 63141 2599 -395083 -67694
11395 -329375 18220 57507 -4591 -219252 -179882 -252758 78721 317624 -63359 -176953 -63329
11383 193139 81866 -122008 -155262 -958 -16004 144434 -145034 -171427 46045 -167215 -136031
11372 -136031 75490 287098 306785 44933 156295 191618 131296 -254580 -18046 -37283 179417
11360a96461A26932b62002d2747j7446b0376l3902j21679k3298h7406A20632i5868
11348a02241A44382a29824q8985M5774G121N3009M4415c8400k13706A0575e7079
11336a55780B22218b80028f5333P496E755J1938d56531a59638E0423L6239c23014
11324f6960A26651e2706k96018I8775a49690B16299i323p7982j22977O1036A00809
11312d27620H1298p856K7362j5964O4384a45505k4112B03114D3497b05473J7034
11301a88439A34948b48924L2124O7547K0748j23444A235a45021k94594A56813
11290b78484B323g6285P199j38276A63852n2687a97102C85978j36726H2346h7092
11278a02594B90988c47248A08336f084o1042A53605d3715l6056a9397n7319F3055
$$ plain form
11360 -196461 126932 -262002 -42747 -60193 -20376 -54278 -175957 -199255 -87406 120632 -95868
11348 -102241 144382 -129824 -218809 -173035 7121 60130 104545 -38400 -252106 10575 -57079
11336 -155780 222218 -280028 -65333 -57837 5755 17693 -456531 -159638 50423 86662 -323014
11324 -66960 126651 -52706 -348724 98775 -149690 216299 -9323 -87305 -210282 -149246 100809
11312 -427620 81298 73442 100804 84840 149224 -145505 -169617 203114 43497 -205473 -188439
11301 -188439 134948 -248924 -216800 -149253 -128505 -251949 1235 -145021 -439615 156813
11290 -278484 2323 -76285 -69086 -207362 163852 111165 -197102 385978 249252 82346 -87092
11278 -102594 290988 -347248 108336 -6084 -67126 153605 -43715 -79771 -19397 -76716 63055
11266B00521p0136a4801j58893Q2060C04a6435k07774a9791b540l22522A97661
11254b74102A58611a05365J1909K2948j6773I4479a01798E8044h9863l1154a0176
11242H183c0480A63978d1712l8639j79876B28755A1469J84767B7510C491a82742
11230A2029i9239a1781d008m390p8131n7271B9006J85368l3959b30476A22412
11218b24484C24020b6947m8775G6647b92695f7345b2206B2504J88419J77766b47507
11206c51206C08312P307c4037J172k7258B5575a76808N5984D6073K22847c71059
11194G7047b09142A07564A4855J51299d0190D5901B2548i2132r5283i152j07903
11183a17055k580D5035j487a6482k7237A74484k9244C3342i167l84214B9099K53539
$$ plain form
11266 200521 130385 -14801 -173694 -91634 304 -16435 -224209 -19791 -2540 -325062 197661
11254 -274102 158611 -105365 -93456 -70508 -87281 94479 -101798 58044 -89863 -121017 -10176
11242 8183 -30480 163978 -41712 -80351 -260227 228755 11469 196236 27510 3491 -182742
11230 12029 -99239 -11781 -4008 -8398 -86529 -143800 29006 214374 180415 -230476 122412
11218 -224484 324020 -26947 -75722 76647 -292695 -67345 -22206 22504 210923 388689 -247507
11206 -351206 308312 315619 -34037 -32865 -60123 25575 -176808 -120824 46073 268920 -371059
11194 77047 -209142 107564 14855 166154 -40190 45901 22548 -92132 -187415 -9152 -117055
11183 -117055 -119635 45035 43548 -16482 -43719 174484 145240 33342 -9167 -393381 29099 282638
11171B82638I1681d0343B73397i9063d978A65904k9344g5633J3956m54673B32194
11159d1195A74958B5092J80234a5765D9681O3858a37276H4281j4636f7977k64902
11148c32879A05080L0871a07951r6844E5618Q4540o4210J59209a71594O5059H4900
11136A85975q1261m0306a12586I1453a29351l1099A25062m1012L21652a72164
11125b0439B8557a07212D6138N9683R6030a11044c3554D8339a2859j84159a2986
11113A17264J4008D2928N114J92926Q8489r6055a44272q3708H4458a00325R480
11102i0845I7395J63275h9418A23255J48009A34234P1621e6818h368j68768a5781
11090A11334b02550C66451H7459P1865j1883g578A23944L3258D9245K26628p097
$$ plain form
11171 282638 91681 -40343 273397 -99063 -4978 165904 136560 -75633 -61677 -516350 232194
11159 -41195 174958 25092 205326 -15765 49681 113539 -137276 84281 69645 -67977 -332879
11148 -332879 105080 135951 -107951 -204795 55618 140158 75948 235157 -171594 -106535 84900
11136 185975 104714 64408 -112586 91453 -129351 -160450 125062 84050 405702 -172164
11125 -20439 28557 -107212 46138 105821 201851 -111044 -33554 48339 -12859 -197018 -12986
11113 117264 131272 42928 48042 240968 329457 233402 -144272 -227980 84458 -100325 -90845
11102 -90845 97395 260670 -89418 123255 271264 134234 205855 -56818 -8368 -177136 -15781
11090 111334 -202550 366451 87459 159324 147441 -7578 123944 157202 49245 275873 268776
11079B68776N7823G9397K44821g5025k79783A74835K35647d4789B81663I0775
11068B73706J44079j93142A11051N090M70193k46402A49063E0888K68737L5900
11058C55525D294K44011J91318J7568P5373k22811K83384k87033J76495J55462
11048F38061j65977N7593j70376K05268K12302n1596k18884o3017J79067B99305
11037A037988C13553L68578j16855j7278k02478L03309j0767k43246K99907J54509
11027H49232k86800j210L27311l86474L04657l86366j73868J29306q8712J26829
11017D13905Q3767r9845M07569k12142m8177A78005K66136l1070K47819k17665
11007D43225A02845J27885L79711j22277A92844N7659K75788j95752N32986B61804
$$ plain form
11079 268776 326599 79397 324218 -75025 -354808 174835 410482 -44789 281663 90775
11068 273706 417785 224643 111051 116141 586334 339932 149063 50888 319625 355525
11058 355525 4294 248305 439623 457191 532564 309753 593137 306104 482599 638061
11048 638061 472084 529677 359301 564569 776871 725275 506391 443374 622441 299305
11037 1037988 313553 682131 565276 547998 345520 648829 638062 394816 694723 849232
11027 849232 562432 561222 888533 502059 806716 420350 246482 375788 287076 413905
11017 413905 497672 397827 805396 593254 545077 178005 444141 413071 660890 443225
11007 443225 102845 230730 610441 488164 192844 250503 526291 330539 863525 261804
10996D29576N1792k6773j15821L39717B66851O61536C0103N40338K56460l91252
10986D35649K20231J74704j38023m7329K64425j03099K61627k60230K70526Q3008
10976A161489j30830K02834L07510R0573L49067L4755J19472J88357k67732q6591
10966A968904j74245L2096n80011k01749j60877K1016L50530k65344p7663k51802
10956F60855K5909O7863N9099o5615r3747C19829J41984r1675j27973R1882j16035
10945B18012J62163j13310a8737B66327a19086n0573B51802a4125p6663A29713
10934C115i2412l19507A06011C7927R9590M32785a97331B21407L0776N0246A6395
10922a40421p0953P8904j84964D36984A15265N4447n8330m2065q52a05804j36133
$$ plain form
10996 429576 481368 454595 338774 678491 266851 928387 30103 570441 826901 435649
10986 435649 655880 830584 692561 645232 909657 806558 1068185 807955 1078481 1161489
10976 1161489 1030659 1233493 1541003 1631576 1980643 2015398 2134870 2323227 2055495 1968904
10966 1968904 1794659 1826755 1246744 1044995 884118 905134 1255664 990320 912657 660855
10956 660855 686764 754627 813726 748111 654364 319829 461813 370138 242165 334047 218012
10945 218012 380175 266865 -18737 266327 -119086 -169659 251802 -14125 -90788 129713
10934 3115 -92412 -411919 106011 37927 137517 570302 -197331 221407 252183 302429 16395
10922 -140421 -211374 -132470 -317434 436984 115265 169712 111382 69317 68465 -105804 -241937
10911b41937H3864J57033a70903K2493C86039f4764A27903b16578c3830C0579
10900b07531I1348O7116o1731h3189C73665A34530b2280A69670a35367o3221o241
10889b04829C2605K04324H8671a01106j93497I5360b06190E8356d26532J65062
10879b61470J24106M7681A12211a74000e8376l47404J89884N5445M8514D131M3553
10868D7684J03115J59209a34439A55861A1028J13268a53200k99529K02651F3585
10857a40751L3800B56842i1210d1664k29870A25457a00493M0235K7737j50907
10847a83428D2123c3453A15246Q5791c55601d0768o6235j75582L2517O621A23172
10835c08454J41264c71l03486a21887r6509h5539B87451A29805a04200d8339k43143
$$ plain form
10911 -241937 83864 240897 -170903 -148410 386039 -64764 127903 -216578 -33830 30579
10900 -207531 91348 158464 96733 -83189 373665 134530 -22280 169670 -135367 -198588 -204829
10889 -204829 32605 236929 88671 -101106 -294603 95360 -206190 58356 -426532 -261470
10879 -261470 -137364 -89683 112211 -174000 -58376 -405780 -215896 -160451 -111937 4131 47684
10868 47684 150799 310008 -134439 155861 11028 124296 -153200 -452729 -250078 63585
10857 -140751 -106951 256842 -91210 -41664 -271534 125457 -100493 -60258 -32521 -183428
10847 -183428 42123 -33453 115246 201037 -355601 -40768 -107003 -282585 -250068 -243447 123172
10835 -308454 -167190 -371 -303857 -121887 -218396 -85539 287451 129805 -104200 -48339 -291482
10824b91482A6927L7071e5297n9389j92447G7899a92391B93267b81853a1840n100
10813a6940B3277J6425a00930o155p1350N2333A9874i5917l5653B0828J52004
10802A72832a41565B17407a26480m2274L6261j7178I9998b57809A67242a30722
10791A5691a35868b0960E5820O1335k1868M3134a44539E1006P7652g6558G1259
10779i4388o2819H5404A7191a09388J9875B0266a12930k8414p483A03104e6991
10767B22505b68107a25232F0156i8359j4939l23894f3679K1405A82209b14354
10756e9786r4841k29881A22343R1452a65865j02301G7388j9587d4735J5324A21423
10744A61440a75210M2300N8276j01879k2065A1471L7357a35775F8977J80014r5041
$$ plain form
10824 -291482 16927 53998 -55297 -114686 -307133 77899 -192391 293267 -281853 -11840 -16940
10813 -16940 23277 39702 -100930 -107085 -178435 -126102 19874 -95917 -131570 20828 172832
10802 172832 -141565 217407 -126480 -168754 -132493 -149671 99998 -257809 167242 -130722
10791 15691 -135868 -20960 55820 117155 95287 138421 -144539 51006 128658 -76558 71259
10779 -94388 -157207 85404 17191 -109388 -89513 20266 -112930 -141344 -148827 103104 -56991
10767 222505 -268107 -125232 60156 -98359 -113298 -437192 -63679 -42274 182209 -214354
10756 -59786 -154627 -384508 122343 213795 -165865 -268166 77388 57801 -44735 -29411 121423
10744 161440 -175210 -132910 -74634 -176513 -198578 11471 48828 -135775 68977 248991 153950
10733A53950c68379B7776J01840e3746b4022C8128M3465i7568A4912a9387l26382
10722c45769A61606l511d0194l09429a26633c6987j88019D17869g2077j12752
10712a84829A24902a2108G9726i353D96883a23615E7076b34727J11729j73240
10702b96238j82048g1473A32722c2297p3864O487a7986A3800a63361d2222A53613
10690a96366B7193d8056j93356K955k0111E5735b34937b0882l4142p9602f501
10678a48330B01608a03103B2479K30536a02680F3640J73835B4701b36722L173
10668b33549L0125A40030K30879D1890a53910b2122E0233J0677a82839B03601
10657h4502B1384h973k63671A68803p819Q4827g7572m1876k40160A43668b01962
$$ plain form
10733 153950 -368379 27776 129616 -53746 -24022 38128 81593 -97568 14912 -19387 -345769
10722 -345769 161606 158095 -40194 -349623 -126633 -36987 -225006 417869 -72077 -184829
10712 -184829 124902 -12108 79726 -9353 496883 -123615 57076 -234727 -122998 -296238
10702 -296238 -478286 -71473 132722 -32297 -106161 -99674 -17986 13800 -163361 -42222 153613
10690 -196366 27193 -48056 -241412 -238457 -258568 55735 -234937 -20882 -55024 -134626 -6501
10678 -148330 201608 -103103 22479 253015 -102680 63640 237475 24701 -236722 -233549
10668 -233549 -203424 140030 370909 41890 -153910 -22122 50233 60910 -182839 203601
10657 -84502 21384 -8973 -272644 168803 160984 245811 -77572 -119448 -359608 143668 -201962
10645g1017K5905J3090j41425r4125A48952a98766A59767h3304o0141A33639j6214
10634A17425b98727J24978d2264k28441A35581B3246b2703A73064j6559m6394
10624A10111a5282l68222J54216n1753B99591d15273a69584k2422d91j1090j60007
10613a71588j73269B0902I750h5818k27083b9371B94469a22478I9697a89458C91364
10601b28341N0928d0219A10849k0978g8392C5645c65031a67900A60093i2336j51755
10590b44091A64391a32346I3405A6712c87768A30654a23192l00959B1183a1738
10579g7488L5216p1453d0694B26159G941L80913F1124a17343K6431c5722A51401
10567A13604d8222r1735A73584c68690a6391A87125b40051D081a10735M4375n8487
$$ plain form
10645 -71017 -45112 -32022 -173447 -267572 148952 -198766 159767 -83304 -143445 133639 117425
10634 117425 -298727 -173749 -42264 -270705 135581 23246 -22703 173064 156505 110111
10624 110111 -15282 -383504 -229288 -281041 299591 -415273 -169584 -192006 -491 -11581 -171588
10613 -171588 -344857 20902 9750 -85818 -312901 -29371 294469 -122478 99697 -189458 391364
10601 -228341 -177413 -40219 110849 89871 -78392 35645 -365031 -167900 160093 -92336 -244091
10590 -244091 164391 -132346 93405 16712 -387768 130654 -123192 -424151 21183 -11738
10579 -77488 -42272 -113725 -40694 226159 7941 388854 61124 -117343 -90912 -35722 151401
10567 113604 -48222 -139957 173584 -368690 -16391 187125 -240051 4081 -110735 -66360 -124847
10556a24847b6851G7628a67357L2776l194J2672f1141B26777e2425A97065b0325
10544B68532b47320B05219G5291d66744J82441c5423E1645J17675a68278H6607
10533a45242A06382J5542n2998a3887A20284g091F8625k393g4195b8494j39663
10522a68157g6436m2306F5027j4501b80862P7656M8891B2607N4459a91867A39504
10510a02331j39997I60f0834B80787b50455a10184c7279j8865A9955M4293M0985
10499A05233C3638g6181k61472A02011i0737F9838J84886a03640E2050a34337
10488d34851B96087e4023r1664B74311J87299i9690n1738A25458c16001c4514
10477A84436b01688L9715B34162h7982m13819a24783O0039J7145F2151L50279
$$ plain form
10556 -124847 -26851 77628 -167357 -134581 -137775 -125103 -61141 226777 -52425 197065 -20325
10544 268532 -247320 205219 75291 -466744 -284303 -35423 51645 169320 -168278 86607
10533 -145242 106382 121924 68926 -13887 120284 -7091 68625 66232 -74195 -28494 -168157
10522 -168157 -76436 -118742 65027 50526 -280862 -203206 -154315 22607 77066 -191867 139504
10510 -102331 -242328 960 -60834 280787 -250455 -110184 -37279 -56144 19955 64248 105233
10499 105233 33638 -76181 -337653 102011 -90737 69838 254724 -103640 52050 -134337
10488 -434851 296087 -54023 -145687 274311 461610 -99690 -151428 125458 -316001 -34514
10477 184436 -201688 -161973 234162 -87982 -501801 -124783 -64744 -47599 62151 412430
10467D12430a13158M6555C1912a48672o6845I8871b3537j65193C9921M8001a75843
10455B83546A9560R8142i428k04061a3406j91599A65507g2009j29854B14139a07320
10443b69928O321B49146R0781a09238m3513H4764k9718b24621R0346L3808A1539
10431C4612e61900J73096a25969A31078l5991d76141C2765a4387B06721b28638
10420A5434b16089a05269M8822B53384E3081F335K0739n569K09788d6586k17043
10409b63629A34201a20317r6932A74774o7427C9011b19391J6180A31827J73973
10399C05800h4921K163p7281r2478a21213H7137J5851m8071R6682c5754C24433
10387f8432B36625a59356m7844i8072J449E0898a95714A55642R3984g9839G8517
$$ plain form
10467 412430 -113158 -66603 31912 -148672 -215517 98871 -23537 -188730 39921 87922 -175843
10455 283546 19560 117702 -9428 -213489 -13406 -205005 165507 -72009 -201863 214139 -107320
10443 -269928 -263607 249146 339927 -109238 -152751 84764 55046 -224621 -134275 -100467 11539
10431 34612 -561900 -388804 -125969 131078 95087 -476141 32765 -14387 206721 -228638
10420 15434 -216089 -105269 -56447 253384 53081 6335 27074 21505 231293 -46586 -263629
10409 -263629 134201 -120317 -217249 174774 107347 39011 -219391 -203211 131827 305800
10399 305800 -84921 -82758 -160039 -252517 -121213 87137 102988 54917 151599 -35754 324433
10387 -68432 236625 -159356 -207200 -98072 -96623 50898 -195714 155642 249626 -79839 78517
10375B55848K6116D455N1909g9567j74591A82839C4343L60305j79327L03388B07529
10363D47997A23999a10084e1227A98074A3125L25527K3817F2658K58402b8908
10352B26795M00271k64304N1332p7697J72191H2679J45026j02037M3037n9252
10342A09453K04984A5013K28149D1799K4265J6646J01900A6700K87060A14818
10331a04960B03121F8725L21090A9460c2869a1547A16199a80494A57843D4916
10320A82654p108B9146q181G216a223B00622a3218E8286b20884A87718C1809b14882
10307a10278k4506A44916h9742b1739A07856A1204K5779a94414E6942B2524a20119
10295g2991l2094L0474C5433J59874G1249h9314l4489K8764r5206B8670a04429
$$ plain form
10375 255848 281964 4455 56364 -79567 -254158 182839 34343 394648 215321 518709 207529
10363 447997 123999 -110084 -51227 198074 13125 338652 362469 62658 321060 -28908
10352 226795 627066 362762 414094 336397 508588 82679 227705 125668 168705 109453
10342 109453 314437 15013 243162 41799 66064 82710 184610 16700 303760 114818
10331 -104960 203121 68725 389815 19460 -32869 -11547 116199 -180494 157843 44916
10320 182654 175546 29146 20965 7216 -1223 200622 -13218 58286 -220884 187718 31809 -214882
10307 -110278 -134784 144916 -89742 -21739 107856 11204 36983 -194414 56942 22524 -120119
10295 -72991 -105085 -74611 35433 195307 71249 -89314 -123803 -95039 -190245 28670 -104429
10283g4727j7r565b4430l8629G3900j2782B5910c49973B98855a88735E69011B7167
10270g9231B97788j02914a89105K090J5435D9915J09381d1977m26986a19355A82562
10258A56934A7395J88906J76278A07618K51766b0403j46062F9610a07468B1470
10247A2365K57444A0804K99281c44412C00472A16160d03822D9791K65239j31259
10237A83771b8798n5397m9054G9876b67769c3974o8973A80520M6118G7975b39475
10225b3008j8746i174j12929B26956j12761l8356f6938I1912C8925Q8441f4391
10213E4464b87648A47864O0818a15420m12539a34305C4258b13268g3175j35520
10203b08695A65292m8692a04964a5344r1846r8807b2869k59599J2468A6690e253
$$ plain form
10283 -74727 -74744 -84309 -24430 -63059 73900 61118 25910 -349973 298855 -188735 569011 27167
10270 -79231 297788 194874 -189105 -187015 -171580 49915 159296 -41977 -468963 -119355 182562
10258 156934 17395 206301 382579 107618 359384 -20403 -166465 69610 -107468 21470
10247 12365 269809 10804 310085 -344412 300472 116160 -403822 49791 315030 183771
10237 183771 -28798 -84195 -133249 79876 -267769 -33974 -102947 180520 226638 77975 -239475
10225 -23008 -41754 -9174 -122103 226956 114195 75839 -66938 91912 38925 127366 -64391
10213 54464 -287648 147864 208682 -115420 -527959 -134305 34258 -213268 -73175 -208695
10203 -208695 165292 116600 -104964 -15344 -107190 -205997 -22869 -282468 -270000 16690 -5253
10191a78878F9874P0474J43882E1277a68672j54414G0251J35678C8940a24258
10180b0351l92681a17199A66421d27734c415k16389g6155D0180a8337A83a98334
10168A70756J31791E1382M1873a587m53565a59044o8623A23701a25260j53923
10158b79183A78878o6633c99650G5938L171h6077M2690j49178c5072k31707L8410
10147b28369h6411K1766k27622J18636E6095b73280J33831a680j80438O0923H8859
10135a75539L7753K0681j05361e9034k64435h4462j86444c3708p5596C65117a65686
10123b99648B951J47453c9888k41320C6820a06268c5077j23889c8845k60024a09439
10111E8258a96334E2322h4216l7495k3373L0047Q175k622A9059N9258O5512L21423
$$ plain form
10191 -178878 69874 140348 284230 51277 -168672 -323086 70251 205929 38940 -124258
10180 -20351 -413032 -117199 166421 -427734 -3415 -219804 -76155 40180 -18337 183 -198334
10168 170756 302547 51382 93255 -1587 -455152 -159044 -227667 123701 -125260 -279183
10158 -279183 178878 112245 -399650 75938 79109 -86077 -43387 -192565 -35072 -266779 -228369
10147 -228369 -86411 -64645 -292267 -173631 56095 -273280 -139449 -1680 -182118 -121195 88859
10135 -175539 -137786 -117105 -222466 -59034 -323469 -84462 -270906 -33708 -109304 365117 -165686
10123 -299648 2951 150404 -39888 -281208 36820 -106268 -35077 -158966 -38845 -298869 -109439
10111 58258 -196334 52322 -84216 -121711 -145084 -115037 -106862 -109484 19059 78317 143829 465252
10099D65252d16716a10846c4192k92728B4908i783o1907j31380B91167b16918
10088c22756J28877j19366a49529B33594a64433k47744g6499I9534b00266e5604
10077a87237F1179d08691b04295d8562C02243j10037a91080i1155A46452a14380
10066b9556o7175b6705p1220A07841J70995d90954J35537c0973j63098B28916
10055A1738a3322A71271m3705c0833m18376A13975D5339o101b69637e8417j36642
10044a95059j64825a49455B2755i5902p1870L3741j62056I1086J28990E4261a32900
10032d42567A42243L9388D3655e6243b5322l03465J9981P8199c8030D210N82354
10021E86564b45665A72437c828G4826p724b57496J15825o7987L3003B254a05935
$$ plain form
10099 465252 -416716 -110846 -34192 -326920 24908 -9783 -71690 -203070 291167 -216918
10088 -322756 -193879 -313245 -149529 233594 -164433 -412177 -76499 99534 -200266 -55604
10077 -187237 61179 -408691 -204295 -48562 302243 192206 -191080 -91155 146452 -114380
10066 -29556 -96731 -26705 -97925 107841 278836 -490954 -355417 -30973 -194071 228916
10055 11738 -13322 171271 127566 -30833 -449209 113975 45339 39238 -269637 -58417 -195059
10044 -195059 -359884 -149455 22755 -95902 -167772 -134031 -296087 91086 220076 54261 -132900
10032 -442567 142243 181631 43655 -56243 -25322 -328787 -308806 -230607 -38030 4210 586564
10021 586564 -245665 172437 -3828 74826 67102 -257496 -141671 -209658 -176655 2254 -105935
10009b24378d3896k7327A00122m7912a84703c8466j21865A9691a14562j10957
9999b25519f2333J9594G2754b11151I958J13260M67a85486C8847A1503a15275
9987b78497l7259A13488J24396q6222P687i9300M6042E8882b16050C1023J48984
9976A80007M8041j02414a24191K3174K2825J2991j7236j29553k4552A87297b23971
9964b65766c0172j57543B25449E2757K77883A09717b56211H2265C1966O0107m4584
9953D7489J73415B8394c26991a10770C9822a67733A37305b50210J18514C1901
9942g3746L5349j38878O6439G4291M0809a45936G8205k1525Q6889d5704B31355
9930a93695R4075C6056b63542i2228F553i8185F0572a28442d1575A54896b26986
$$ plain form
10009 -224378 -43896 -71223 100122 52210 -184703 -38466 -160331 19691 -114562 -225519
9999 -225519 -62333 -42739 72754 -211151 9958 123218 123685 -185486 38847 11503 -115275
9987 -278497 -315756 113488 237884 151662 159349 -99300 -53258 58882 -216050 31023 180007
9976 180007 228048 125634 -124191 -101017 -78192 -65201 -82437 -211990 -236542 187297 -223971
9964 -265766 -30172 -187715 225449 52757 330640 109717 -256211 82265 31966 92073 47489
9953 47489 220904 28394 -326991 -110770 39822 -167733 137305 -250210 -131696 31901
9942 -73746 -38397 -177275 -110836 74291 115100 -145936 78205 56680 143569 -45704 231355
9930 -193695 -99620 36056 -263542 -92228 6553 -98185 60572 -128442 -41575 154896 -226986
9918B1674L6431b65457M2440F4922K8823h1010n18889a53745C43360H5900g8204
9906c6169k40369o0026P8077d9299j59762H6936c85283a37000m9565l371g0383
9894I6128J95743A22874n4929j6820L7268e0156I3341A8160a46797A58843E1305
9882a63035A27184b40899j14293k8793b6752o2506B30306j9314a25699j8985k9850
9871a74534l9067L5610N7370K5750l12747A52295i6740j02186B3835L5679M7711
9860A07225g8057G3978O9274a00998I2694c82740J40797l02644B98534H4024a96660
9848b22271l4319J04685E0408J41015a36738o635l3944o8219B72135m7647J64073
9837C88561a09816B40896A5581c8788B14059a39939p3106L8746I5646g6746r7521
$$ plain form
9918 21674 58105 -265457 -223017 64922 93745 -81010 -599899 -153745 343360 85900 -78204
9906 -36169 -276538 -336564 -258487 -49299 -209061 86936 -385283 -137000 -186565 -189936 -70383
9894 96128 291871 122874 67945 51125 88393 -50156 93341 18160 -146797 158843 51305
9882 -163035 127184 -240899 -355192 -383985 -26752 -89258 230306 210992 -125699 -144684 -174534
9871 -174534 -213601 -177991 -120621 -94871 -407618 152295 -96740 -198926 23835 59514 107225
9860 107225 -78057 73978 143252 -100998 92694 -382740 -241943 -544587 298534 84024 -196660
9848 -222271 -256590 -151905 50408 191423 -136738 -143373 -177317 -245536 272135 224488 388561
9837 388561 -109816 240896 15581 -38788 214059 -139939 -213045 -174299 95646 -76746 -174267
9826a74267Q1879p4263B5634h0416C792b3907l09104b9594H2168J3025f4543k58551
9814c23094D9477a27148L2408C3433J17989d30656a00237p718d9397F6185R1173
9803A57358c21873J24005F5227j5809C893a53138j28753a0320k5769j03958o2356
9792b02403M7239B02717a57478L5067d0641B29130n3041f00D9704A8909f4683
9780a42785f8658j5182j90725J35962O0419p3881j15191J18503A52085b97152
9769d49686K025A26209R4994a82715b0533B42777r7162b14792i3563j39674R5765
9758a37472E3248b52828A84642K5588a73467Q5013A54414o3591C2367n859P9119
9747A05627D7430B0750c22642M9485B33854o6618k4499e9382l05637J72102D06379
$$ plain form
9826 -174267 -92388 -166651 25634 -80416 3792 -23907 -333011 -29594 82168 95193 -64543 -323094
9814 -323094 49477 -127148 -94740 33433 151422 -430656 -100237 -107955 -49397 66185 157358
9803 157358 -321873 -197868 65227 49418 3893 -153138 -281891 -10320 -36089 -140047 -202403
9792 -202403 -155164 202717 -157478 -122411 -40641 229130 176089 -600 49704 18909 -64683
9780 -142785 -68658 -83840 -274565 -138603 -78184 -152065 -267256 -148753 152085 -297152
9769 -449686 -447661 126209 221203 -182715 -20533 242777 145615 -214792 -93563 -233237 -137472
9758 -137472 53248 -252828 184642 210230 -173467 -88454 154414 90823 32367 26508 105627
9747 105627 47430 20750 -322642 -273157 233854 167236 142737 -59382 -365019 -192917 406379
9735B47585c67927A84427j2516a06838F9424g4193m1889M1262K0246k32706J29469
9724a57811k50j65526N7134A29179a54838C05023a25827D1730p229a08090n9256
9713a67346a7627B8439a08835I3264j7192a50657M6862H3022b04585Q7213g536
9701a05394p3570g5325q0026J1942h936q8952B35201h2129A20248b75390c3555
9689C9812b15687B2968b71848Q8921E4947a26662A19346b05283C7695h1367m6895
9678a28262A89467a58668f76A22225b15415Q5430e5141A57743a13365j31895B20565
9666B37497I416d7924j44548B5011M1332a73074k5337m4411M9341c4930k35217
9655b70147a20605K8588K7863A2936b52790L0130D3467a35536d7150k94509b9506
$$ plain form
9735 247585 -367927 184427 171911 -106838 69424 -74193 -116082 -74820 -54574 -287280 -157811
9724 -157811 -158061 -323587 -266453 129179 -154838 305023 -125827 41730 34501 -108090 -167346
9713 -167346 -17627 28439 -108835 93264 76072 -150657 -103795 83022 -204585 -117372 -7536
9701 -105394 -178964 -75325 -155351 -143409 -8936 -97888 235201 -82129 120248 -275390 -33555
9689 39812 -215687 22968 -271848 -182927 54947 -126662 119346 -205283 37695 -81367 -128262
9678 -128262 189467 -158668 -676 122225 -215415 -129985 -55141 157743 -113365 -245260 220565
9666 237497 9416 -47924 -192472 25011 66343 -173074 -198411 -242822 -193481 -34930 -270147
9655 -270147 -120605 -92017 -64154 12936 -252790 -222660 43467 -135536 -47150 -341659 -29506
9643b466k33010E2080b81199B59111f2198n7951j17085A6865a43173J8338b8816
9631a15967h719r3796a8873G2001K8537A3928B694a303j36513l8275B51985a94763
9618A5247M2860a18304j10457B44255G6813a88552F5441d609k55633A85475I222
9606F6936b7978j56025B38497f2306K1725q5272e403r3240A29835c28663R7803
9595b30860n1013h8874m50233g4537I6688b9501E6238R9578b08244A36278J39464
9584B75742C0852b30487d625J637j1845D2567J91080m4837a9076k29565c2046
9572a6311j31883L6220L9783A03097a7689A6361f9122j03951M2120A1189K173
9561A3362h099j95993A92465b99470C73372D9565J6098C071b31084E9044h4515
$$ plain form
9643 -2466 -235476 52080 -281199 259111 -62198 -120149 -237234 16865 -143173 -124835 -28816
9631 -115967 -8719 -102515 -18873 72001 100538 13928 2694 -1303 -137816 -176091 251985 -194763
9618 15247 58107 -118304 -228761 244255 76813 -188552 65441 -4609 -260242 185475 9222
9606 66936 -27978 -184003 238497 -62306 -40581 -125853 -5403 -98643 129835 -328663 -230860
9595 -230860 -281873 -88874 -539107 -74537 96688 -29501 56238 155816 -208244 136278 275742
9584 275742 30852 -230487 -4625 -2988 -14833 42567 233647 188810 -19076 -248641 -32046
9572 -16311 -148194 -111974 -72191 103097 -17689 16361 -69122 -173073 -130953 11189 13362
9561 13362 -8099 -204092 192465 -299470 373372 49565 65663 3071 -231084 59044 -84515
9549A3781c8321I1555b57915m5340I1553f795I5425a04077K2625c2655E6808a16394
9536b60766B95130j32070a47799F8126b72874R1470E1671K6237J67293b27587
9525h3685l7893j31666p0725J08308j6200G7764a87374J8464j79921R7522E2256
9513B3187b53818B42528c24041J43747K0053F4628d09826a88461g9562p6485P7333
9502g8714B71647b23377A60526e0105K2569l38617J52914i9133G3542N7229b4943
9490c48927O5637J34942k25213d2473B68792b73200R0815C05426A35145I90J66622
9479A67612a30784k45780G5752b43762j12698A47620e6063p8203A70627P914a10016
9467A21029a33706D48331c22174L8318D9429f3172a7096D79592i1407c146j15941
$$ plain form
9549 13781 -38321 91555 -257915 -303255 91553 -6795 95425 -104077 -81452 -32655 56808 -116394
9536 -260766 295130 163060 -147799 68126 -272874 -181404 51671 77908 245201 -227587
9525 -83685 -121578 -253244 -323969 -215661 -231861 77764 -187374 -168910 -348831 -251309 52256
9513 23187 -253818 242528 -324041 -180294 -160241 64628 -409826 -188461 -79562 -156047 -78714
9502 -78714 271647 -223377 160526 -50105 -27536 -366153 -213239 -99133 73542 130771 -24943
9490 -348927 -283290 -148348 -373561 -42473 268792 -273200 -182385 305426 135145 990 167612
9479 167612 -130784 -376564 75752 -243762 -356460 147620 -56063 -134266 170627 178541 -110016
9467 121029 -133706 448331 -322174 -283856 49429 -63172 -17096 479592 -91407 -3146 -119087
9456a19087n9904I262J26512i3047I618c01669A22108D2997K9153M5390J13427
9445B30967a34449B06041A7103a20573A73240c838k7786B0497M1794b63407A43143
9433a11235b3742k22054F6902a92979i2433k7914k54405h2090n1022B5577Q2301
9422A07878a02519l98425A3167c6699j51385E532a3785A84100c08560K3991A64541
9410b04573A0249M6492d7653m9717M161B704a18392k76322F8931l2099a63235
9398D1107p325a06802F7576J49349b49637a09493A87594b48332j2861a24392L3592
9387i0800j25718H3873e4402D56487I2285Q1171a29946J3976B2591A0343a40994
9375b64427h4945F9728J9671j6339b08178P5472B48389a25614J5681B92731a96743
$$ plain form
9456 -119087 -178991 9262 135774 -93047 9618 -301669 122108 42997 72150 117540 230967
9445 230967 -134449 206041 17103 -120573 173240 -3838 -31624 20497 62291 -263407 143143
9433 -111235 -23742 -245796 66902 -192979 -92433 -120347 -374752 -82090 -133112 25577 107878
9422 107878 -102519 -500944 13167 -36699 -188084 5532 -13785 184100 -308560 -284569 164541
9410 -204573 10249 56741 -47653 -97370 -93209 2704 -118392 -394714 68931 36832 -163235
9398 41107 33782 -106802 67576 216925 -249637 -109493 187594 -248332 -261193 -124392 -90800
9387 -90800 -216518 83873 -54402 456487 92285 173456 -129946 -115970 22591 10343 -140994
9375 -264427 -84945 69728 89399 73060 -208178 -132706 248389 -125614 -109933 292731 -196743
9363B11748B7141J09495a58953k00182K0319a7563l5426A5684c72047B77442d973
9351a35979j6514G6097b54613h5691p9415C55528c7757n22469A15491b30173j31588
9340c61761c0950D1410b78130r923C10843A9775K1325f2687H10b14985C4804c0117
9327b64165b9871B831a47235K2724j78809A03366h4907j3284A16230A3547b63407
9315c9889p4052M8779c547I1006N6779d58171B27984f6842j44325H4674a77073
9303A14131A2065d0091C8056a55940J2312N0030l68849C00365j30256b1465A5192
9291A0819b76804g4525B0356b64701c7670j47334P3391l04311B02949c67359A18874
9279c74401c2758B51780a22842P700I8192A6070K29659g1290k18202a00073E8708
$$ plain form
9363 211748 27141 136636 -158953 -359135 -338816 -17563 -52989 15684 -372047 277442 -4973
9351 -135979 -152493 76097 -254613 -85691 -165106 355528 -37757 -560226 115491 -230173 -361761
9340 -361761 -30950 41410 -278130 -288053 310843 19775 41100 -62687 810 -214985 34804 -30117
9327 -264165 -29871 2831 -147235 -124511 -303320 103366 -84907 -98191 116230 13547 -263407
9315 -39889 -113941 -65162 -3547 91006 147785 -458171 227984 -66842 -211167 84674 -177073
9303 114131 12065 -40091 38056 -155940 -143628 -93598 -462447 300365 170109 -21465 15192
9291 10819 -276804 -74525 20356 -264701 -37670 -185004 -111613 -415924 202949 -367359 118874
9279 -374401 -32758 251780 -122842 -115142 98192 16070 245729 -71290 -289492 -100073 58708
9267B05912Q7389a3425k81553d3881j32042a3869B45156J61764a82448d6874D8136
9255a63063o6063A20458i0412j92968A38533D1086J16787a51429B19787r3666
9245A26121k2605c12615h6676B07859E3425f3925o552j71005m8559N0131B86192
9233c05187A0035b77792A8497K9066c0604B99737B8473Q7610a75194A91212r2883
9222I8329J46816f8014j0255H92h0368a0407l8561j95306h1231C08280b20522
9210D8638j9394J12457e3357A08263M129d66088A60090c8283D7595c28821D0094
9198a73002L4540k22716A2506j492b41961A29629i0025k12071R1577B96009K3604
9187C19613q0529D0987J90847g1827k2497B14923d23148a9729f654p5607K0793
$$ plain form
9267 205912 293301 -13425 -294978 -43881 -175923 -13869 245156 406920 -182448 -46874 48136
9255 -163063 -229126 120458 -90412 -283380 138533 41086 157873 -151429 219787 126121
9245 126121 103516 -312615 -86676 207859 53425 -63925 -70477 -241482 -290041 -239910 286192
9233 -305187 10035 -277792 18497 47563 -30604 299737 28473 116083 -175194 191212 98329
9222 98329 245145 -68014 -78269 892 -80368 -10407 -48968 -244274 -81231 308280 -220522
9210 48638 29244 141701 -53357 108263 112392 -466088 160090 -38283 47595 -328821 40094
9198 -173002 -138462 -361178 12506 11014 -241961 129629 -90025 -302096 -210519 296009 319613
9187 319613 239084 40987 231834 -71827 -94324 214923 -423148 -19729 -6654 -82261 -61468
9176f1468j08868B0607b64932R9558k7679d1816A20875B7778K51078G402J82990
9165A90392a25111a82j23008m8049b9958l11221J06045A98576i0142B22872e2904
9153a9331n5650G7349N9030a40063F0562b56550M5525d1369A07488i8103I9478
9141f6246A62899a3411j10540a7934j16845F3520b95571A13379A2528h3039l91183
9130d74222i2007k17494O2822k4808b6949k46134L0263g897j91725A11822d21324
9118C62021b20425F6525L8466J82194h3007b1241j87827a03532j05109n6257J07245
9107a57653B21277a18650B36555B699a50762B17363o3275h6385B52644A24901
9096A9086a17877j06720A12051C3963b44025c1338j69822A95384b9904k99246
$$ plain form
9176 -61468 -170336 20607 -264932 -165374 -193053 -41816 120875 27778 278856 7402 190392
9165 190392 -125111 -182 -123190 -171239 -29958 -341179 -235134 198576 -90142 222872 -52904
9153 -19331 -74981 77349 136379 -140063 60562 -256550 -211025 -41369 107488 -98103 99478
9141 -66246 162899 -13411 -123951 -17934 -134779 63520 -295571 113379 12528 -83039 -474222
9130 -474222 -92007 -309501 -246679 -271487 -26949 -273083 -242820 -7897 -199622 111822 -421324
9118 362021 -220425 66525 104991 287185 -83007 -21241 -209068 -103532 -208641 -264898 -157653
9107 -157653 221277 -118650 236555 2699 -150762 217363 154088 -86385 252644 124901
9096 19086 -117877 -224597 112051 33963 -244025 -31338 -201160 195384 -29904 -329150
9086c29150q689J28154C42604c4967r7015B934N3020J02333d3574j1272A70855
9074B82274a62452P9905k35376A57008a15260P247j0433e1087G4068a59059o4703
9063b23762A28282c25380I2853b91273B10046r8680a81114A67557N5522h8672
9052F6827c0624J2520r040p8040A10180a592l27700A3482O3485b06208b2561B23763
9039A05913K61149C2305h0487Q582k447c138j81954c8539B49378a60743j46869
9028c07612E1297a49278N3786d5034B69283A0903a31749j3815b1404j65572D224
9016b19019F4997c83517A8927b0778j35682F1395b84115a24820l5936j41989n2025
9005c54770A09605G620R8141g3530o8502G5564a51806d8415m8124a4652k77593
$$ plain form
9086 -329150 -337839 -209685 342604 -34967 -131982 2934 55954 158287 -43574 -54846 170855
9074 282274 -162452 -82547 -317923 157008 -115260 -108013 -118446 -51087 74068 -159059 -223762
9063 -223762 128282 -325380 92853 -291273 210046 111366 -181114 167557 223079 -88672
9052 66827 -30624 -18104 -27144 -105184 110180 -1592 -329292 13482 76967 -206208 -22561 223763
9039 105913 367062 32305 -80487 -71905 -74352 -3138 -185092 -38539 249378 -160743 -307612
9028 -307612 51297 -149278 -95492 -45034 269283 10903 -131749 -145564 -21404 -186976 4224
9016 -219019 64997 -383517 18927 -20778 -156460 61395 -284115 -124820 -160756 -302745 -354770
9005 -354770 109605 7620 105761 -73530 -142032 75564 -151806 -48415 -96539 -14652 -292245
8994b92245A28625a31420k00069E3860a1066l2386H5585i1426q3088j7436j00882
8983b92832J39842A06566M280b45990C44452a48535a1767j4402j33927B28965
8972g8043j82045h1695k4239J6960k13246h1005K7477I6532a78256A65085J5219
8961A80304D6101c28705P3890f159H9580K07060b72953A21828a46460A9615J65064
8950A84679b66727a23038A78439E2116q680d12932B4510o533K4112O6689a33926
8938I8474k8746c76431A48015i9583C94661A28741c12140l5167F8969a59854D12496
8926D1166c1110A44261K28420M79884J020160P055907k738973B309414H78956
8916F43280k19588a90873J610N1862j3578F033d975A03355r22K09341D4321K3986
$$ plain form
8994 -292245 128625 -131420 -331489 53860 -11066 -43452 85585 -91426 -174514 -191950 -292832
8983 -292832 -152990 106566 110846 -245990 344452 -148535 -11767 -26169 -160096 228965
8972 -78043 -260088 -81695 -105934 -88974 -302220 -81005 -53528 96532 -178256 165085 180304
8961 180304 46101 -328705 -254815 -6159 89580 296640 -272953 121828 -146460 19615 184679
8950 184679 -266727 -123038 178439 52116 43436 -412932 24510 17977 42089 108778 -133926
8938 98474 69728 -376431 148015 -99583 394661 128741 -312140 -347307 68969 -159854 412496
8926 41166 -31110 144261 372681 852565 1872725 8928632 6189659 2309414 878956
8916 643280 423692 -190873 -189263 -137401 -150979 6033 -4975 103355 102433 311774 44321 68307
8904F8307B1614R5879a88657G9744O1755R4386q1360J11142a15418A6383g9121
8892d2883B09515p7081a23043A52020a82031M2949F2349b33667K1620A2060a03646
8880b06098B27297c7462F3c6293k18322a8709A47614a31897k82746a75966N5074
8869a20892B66821b77309A1896a5992p913A12277c35959b3012B42483D8449J54210
8858B02659m0999C1678a44541k38054A79666l867c22855A05895O2225f3386r7043
$$ plain form
8904 68307 21614 117493 -188657 79744 141499 235885 154525 265667 -115418 16383 -79121
8892 -42883 209515 132434 -123043 152020 -182031 -139082 62349 -233667 -212047 12060 -103646
8880 -206098 227297 -37462 63 -36293 -254615 -18709 147614 -131897 -414643 -175966 -120892
8869 -120892 266821 -277309 11896 -15992 -23905 112277 -335959 -23012 242483 48449 202659
8858 202659 161660 31678 -144541 -382595 179666 175799 -322855 105895 168120 -63386 -160429
$$ [...]
##END NTUPLES=NMR SPECTRUM
##END=
