
##TITLE=AC1292_BRARS11103_6613942_1T3xleJ703
##JCAMPDX= 6.0         $$ Bruker NMR JCAMP-DX V2.0
##DATA TYPE= NMR SPECTRUM
##DATA CLASS= NTUPLES
##ORIGIN= BRUKER
##OWNER= Administrator
$$ 1.72 TOPSPIN		Version 2.1
$$ 2012-08-02 14:59:48.796 -0500  Administrator@TOPSPIN
$$ Compression mode = diff/dup
##.OBSERVE FREQUENCY= 400.02188249412
##.OBSERVE NUCLEUS= ^1H
##.ACQUISITION MODE= SIMULTANEOUS (DQD)
##.ACQUISITION SCHEME= undefined
##.AVERAGES= 64
##.DIGITISER RES= 22
##SPECTROMETER/DATA SYSTEM= spect
##.PULSE SEQUENCE= noesygpps1d.comp
##.SOLVENT NAME= COFFEE_meoh
##.SHIFT REFERENCE= INTERNAL, COFFEE_meoh, 1, 14.96145
##AUDIT TRAIL= $$ (NUMBER, WHEN, WHO, WHERE, PROCESS, VERSION, WHAT)
$$ ##TITLE= Audit trail, TOPSPIN		Version 2.1
$$ ##JCAMPDX= 5.01
$$ ##ORIGIN= Bruker BioSpin GmbH
$$ ##OWNER= Administrator
$$ $$ C:\Bruker\TOPSPIN/data/COFFEE/nmr/AC1292_BRARS11103_6613942_1T3xleJ703/12/pdata/1/auditp.txt
$$ ##AUDIT TRAIL=  $$ (NUMBER, WHEN, WHO, WHERE, PROCESS, VERSION, WHAT)
(   1,<2012-08-02 14:59:44.015 -0500>,<Administrator>,<TOPSPIN>,<go>,<TOPSPIN 2.1>,
      <created by zg
	started at 2012-08-02 14:48:13.765 -0500,
	POWCHK enabled, PULCHK disabled,
       configuration hash MD5:
       6B 1B 68 BB D9 2E 58 E2 7F 35 AD 54 07 DF 0E 41
       data hash MD5: 64K
       59 9D 59 85 6D 3F 4A E0 62 F2 25 5A 53 B1 0B 76>)
(   2,<2012-08-02 14:59:46.828 -0500>,<Administrator>,<TOPSPIN>,<proc1d>,<TOPSPIN 2.1>,
      <Start of raw data processing
       efp LB = 0.3 FT_mod = 6 PKNL = 1 PHC0 = 0 PHC1 = 0 SI = 128K 
       data hash MD5: 128K
       CD 80 3E 83 15 00 79 1A F6 5C 25 36 29 1D 73 0A>)
(   3,<2012-08-02 14:59:47.984 -0500>,<Administrator>,<TOPSPIN>,<proc1d>,<TOPSPIN 2.1>,
      <pk PHC0 = 2.471924 PHC1 = 0 
       data hash MD5: 128K
       1E 0E BC 2E 38 4E 6D 28 B1 BA 82 E8 7A 95 95 3E>)
(   4,<2012-08-02 14:59:48.218 -0500>,<Administrator>,<TOPSPIN>,<proc1d>,<TOPSPIN 2.1>,
      <abs ABSG = 1 
       data hash MD5: 128K
       A7 C8 9C 13 69 86 E3 C6 76 5A 45 E8 2E 2E 12 4E>)
(   5,<2012-08-02 14:59:48.296 -0500>,<Administrator>,<TOPSPIN>,<proc1d>,<TOPSPIN 2.1>,
      <abs ABSG = 2 
       data hash MD5: 128K
       7C 9D 1D A0 27 CB 57 F6 0E A1 45 8E 1D 66 D4 FC>)
(   6,<2012-08-02 14:59:48.421 -0500>,<Administrator>,<TOPSPIN>,<proc1d>,<TOPSPIN 2.1>,
      <abs ABSG = 3 
       data hash MD5: 128K
       98 E6 9F AA A7 BE E2 28 A5 B0 51 80 4F F5 25 00>)
(   7,<2012-08-02 14:59:48.656 -0500>,<Administrator>,<TOPSPIN>,<proc1d>,<TOPSPIN 2.1>,
      <abs ABSG = 4 
       data hash MD5: 128K
       65 ED 8C D6 50 57 4D 3D 29 7C 4B 36 7A 9A 17 C3>)
(   8,<2012-08-02 14:59:48.703 -0500>,<Administrator>,<TOPSPIN>,<proc1d>,<TOPSPIN 2.1>,
      <abs ABSG = 5 
       data hash MD5: 128K
       53 9D BF F9 26 17 4E 0B 07 3D FF 03 92 3A 3E AA>)
$$ ##END=
$$ 
$$ $$ hash MD5
$$ $$ 87 E3 AF 80 CC 25 4B 70 F8 29 B3 83 17 AD 02 AA
##$RELAX= 
##$RELAX= 
##$RELAX= 
##$RELAX= 
##$RELAX= 
##$RELAX= 
##$RELAX= 
##$RELAX= 
$$ Bruker specific parameters
$$ [...]
150 150 150 150 150 150 150 150
##$TP07= 0
##$TPNAME0= <>
##$TPNAME1= <>
##$TPNAME2= <>
##$TPNAME3= <>
##$TPNAME4= <>
##$TPNAME5= <>
##$TPNAME6= <>
##$TPNAME7= <>
##$TPOAL= (0..7)
0.5 0.5 0.5 0.5 0.5 0.5 0.5 0.5
##$TPOFFS= (0..7)
0 0 0 0 0 0 0 0
##$TUNHIN= 0
##$TUNHOUT= 0
##$TUNXOUT= 0
##$USERA1= <user>
##$USERA2= <user>
##$USERA3= <user>
##$USERA4= <user>
##$USERA5= <user>
##$V9= 5
##$VALIST= <valist>
##$VCLIST= <CCCCCCCCCCCCCCC>
##$VD= 0
##$VDLIST= <DDDDDDDDDDDDDDD>
##$VPLIST= <PPPPPPPPPPPPPPP>
##$VTLIST= <TTTTTTTTTTTTTTT>
##$WBST= 1024
##$WBSW= 4
##$XGAIN= (0..3)
0 0 0 0
##$XL= 0
##$YL= 0
##$YMAX_a= 10636443
##$YMIN_a= -6813166
##$ZGOPTNS= <>
##$ZL1= 120
##$ZL2= 120
##$ZL3= 120
##$ZL4= 120
##$ABSF1= 14.96145
##$ABSF2= -5.596732
##$ABSG= 5
##$ABSL= 3
##$ALPHA= 0
##$AQORDER= 0
##$ASSFAC= 0
##$ASSFACI= 0
##$ASSFACX= 0
##$ASSWID= 0
##$AUNMP= <proc_prof1d_extract.lims>
##$AXLEFT= 0
##$AXNAME= <>
##$AXNUC= <1H>
##$AXRIGHT= 0
##$AXTYPE= 0
##$AXUNIT= <>
##$AZFE= 0.1
##$AZFW= 0.1
##$BCFW= 0
##$BC_mod= 0
##$BYTORDP= 0
##$COROFFS= 0
##$CY= 15
##$DATMOD= 1
##$DC= 0
##$DFILT= <>
##$DTYPP= 0
##$F1P= 0
##$F2P= 0
##$FCOR= 0.5
##$FTSIZE= 131072
##$FT_mod= 6
##$GAMMA= 0
##$GB= 0
##$INTBC= 1
##$INTSCL= 1
##$ISEN= 128
##$LB= 0.3
##$LEV0= 0
##$LPBIN= 0
##$MAXI= 10000
##$MC2= 0
##$MEAN= 0
##$ME_mod= 0
##$MI= 0
##$NCOEF= 0
##$NC_proc= -2
##$NLEV= 6
##$NOISF1= 0
##$NOISF2= 0
##$NSP= 0
##$NTH_PI= 0
##$NZP= 0
##$OFFSET= 14.96145
##$PC= 1
##$PHC0= 2.471924
##$PHC1= 0
##$PH_mod= 1
##$PKNL= yes
##$PPARMOD= 0
##$PPDIAG= 0
##$PPIPTYP= 0
##$PPMPNUM= 2147483647
##$PPRESOL= 1
##$PSCAL= 4
##$PSIGN= 0
##$PYNMP= <proc.py>
##$REVERSE= no
##$SF= 400.020009457332
##$SI= 131072
##$SIGF1= 0
##$SIGF2= 0
##$SINO= 400
##$SIOLD= 131072
##$SPECTYP= <>
##$SREGLST= <1H.CDCl3>
##$SSB= 0
##$STSI= 131072
##$STSR= 0
##$SW_p= 8223.68421052631
##$SYMM= 0
##$S_DEV= 0
##$TDeff= 65536
##$TDoff= 0
##$TI= <>
##$TILT= no
##$TM1= 0
##$TM2= 0
##$TOPLEV= 0
##$USERP1= <user>
##$USERP2= <user>
##$USERP3= <user>
##$USERP4= <user>
##$USERP5= <user>
##$WDW= 1
##$XDIM= 131072
##$YMAX_p= 326559925
##$YMIN_p= -12879
##$CURPLOT= <Network HP LaserJet P1505>
##$CURPRIN= <$Network HP LaserJet P1505>
##$DFORMAT= <normdp>
##$LAYOUT= <+/1D_H.xwp>
##$LFORMAT= <normlp>
##$PFORMAT= <normpl>
##$SURQMSG= 1
$$ End of Bruker specific parameters
$$ ---------------------------------
##NTUPLES= NMR SPECTRUM
##VAR_NAME=  FREQUENCY,     SPECTRUM/REAL,   SPECTRUM/IMAG
##SYMBOL=    X,             R,               I
##VAR_TYPE=  INDEPENDENT,   DEPENDENT,       DEPENDENT
##VAR_FORM=  AFFN,          ASDF,            ASDF
##VAR_DIM=   131072,        131072,          131072
##UNITS=     HZ,            ARBITRARY UNITS, ARBITRARY UNITS
##FACTOR=    0.0627417313425164, 1,          1
##FIRST=     8223.62146879497, -1673,        -44335
##LAST=      0,             604,             -45507
##MIN=       0,             -12879,          0
##MAX=       8223.62146879497, 326559925,    0
$$ Real data points
##PAGE= N=1
##DATA TABLE= (X++(R..R)), XYDATA
$$ [...]
63768G5859O99J004O06K83L24L06j6j95K21R39J165N24n64j415j702j508r73k12
63750G5345M68O38K35j92m6N56R28P78O86J292K303K746K193J349J196J916K943
63733I5334L826M539N044N129M924N078N989P145P715P593P364P377P357P003
63719A81417O334N315L657J369r39k651l804m771n591n971n847n522n328n370
63705A52298n542n601n241m296k821r93Q78K252K686K436K297K546K543J760P25
63690A45927K96L78J08q20j813k315k378k151j530n66L38R90J630K405L055L484
63674A47038M107N204O330O901P051P393P986Q089P013M934K646P51q08k448m300
63659B07887n970o996p377p418p177o492n548m966n050n310n042m169l149k313
$$ y = [75859, 76558, 77562, 78168, 78451, 78775, 79081, 79065, 78870, 79091, 80030, 81195, 81719, 81155, 79740, 78038, 76530, 75557, 75345, 75813, 76451, 76686, 76494, 76448, 77004, 77932, 78710, 79396, 80688, 82991, 85737, 87930, 89279, 90475, 92391, 95334, 99160, 103699, 108743, 113872, 118796, 123874, 129863, 137008, 144723, 152316, 159680, 167057, 174414, 181417, 187751, 193066, 196723, 198092, 197153, 194502, 190698, 185927, 180336, 174365, 168518, 162996, 157668, 152298, 146756, 141155, 135914, 131618, 128797, 127804, 128682, 130934, 133620, 136056, 138353, 140899, 143442, 145202, 145927, 146223, 146601, 146709, 145889, 144076, 141761, 139383, 137232, 135702, 135136, 135474, 136464, 138094, 140499, 143554, 147038, 151145, 156349, 162679, 169580, 176631, 184024, 192010, 200099, 207112, 212046, 214692, 215443, 214635, 212187, 207887, 201917, 194921, 187544, 180126, 172949, 166457, 160909, 155943, 150893, 145583, 140541, 136372, 133223, 130910]
63645A30910j659j178r13p14k64M84J207J653J967K416K948L253L253L336L898
63630A50597M789N433N578N686O366P570Q670R297R693J0209J0835J1474J2253
63617B58450J3298J4444J5535J6815J8563K0465K1767K2113K1825K1258K0176
63606D64709J7982J4459J0117N860K434O7j428k291k631k570k418k512k985l874
63592D94919n390p773j0871j4033j6536j7953j8174j7344j5878j4247j2619j0846
63580C33255q992p592p084p126o803n487l299p32J803M040N708O586O638O049
63566C16964N217M615M493M657M785M928N420O270P057P632Q476R988J1820J3380
63552D15702J4737J6407J8407K0131K1099K1193K0112J7390J3273Q958N565L318
$$ y = [130910, 129251, 128073, 127160, 126446, 126182, 126666, 127873, 129526, 131493, 133909, 136857, 140110, 143363, 146699, 150597, 155386, 160819, 166397, 172083, 178449, 186019, 194689, 203986, 213679, 223888, 234723, 246197, 258450, 271748, 286192, 301727, 318542, 337105, 357570, 379337, 401450, 423275, 444533, 464709, 482691, 497150, 507267, 513127, 515561, 515628, 514200, 511909, 509278, 506708, 504290, 501778, 498793, 494919, 489529, 481756, 470885, 456852, 440316, 422363, 404189, 386845, 370967, 356720, 344101, 333255, 324263, 316671, 309587, 302461, 295658, 290171, 286872, 286140, 287943, 291983, 297691, 304277, 310915, 316964, 322181, 326796, 331289, 335946, 340731, 345659, 351079, 357349, 364406, 372038, 380514, 390502, 402322, 415702, 430439, 446846, 465253, 485384, 506483, 527676, 547788, 565178, 578451, 587409, 592974, 596292]
63540E96292K018J695K293L258M048M672N201N132L905J723r07m109q286j2979
63526F03956j7009j9890k2177k4286k5796k6238k5832k4961k3584k1632j9473
63515C53078j7480j5609j3841j2489j1552j0305q219o002m873m967n224m855m134
63502B33528l594l090k185j017k10m1j30p7o8m90j075r49L29K100L407M158M969
63485B35565O000O699O779O720O996P445P797Q211Q708Q653P450N412L268J131
63471C26834j292l766n640o830p859q846r296r016q542q291p899o817n176l644
63457B33920k685k271k072j742j173n51K7Q62K214L619M236L980L710M052M594
63442B50720M701M514M692N461O466P358Q139R030J0310J2034J3697J4558J4614
$$ y = [596292, 598310, 600005, 602298, 605556, 609604, 614276, 619477, 624609, 628514, 630237, 629330, 625221, 616935, 603956, 586947, 567057, 544880, 520594, 494798, 468560, 442728, 417767, 394183, 372551, 353078, 335598, 319989, 306148, 293659, 282107, 271802, 263583, 257581, 252708, 247741, 242517, 237662, 233528, 229934, 226844, 224659, 223642, 223432, 223391, 223261, 223184, 223116, 222626, 221551, 220602, 220931, 223031, 226438, 230596, 235565, 241565, 248264, 255043, 261763, 268759, 276204, 284001, 292212, 300920, 309573, 317023, 322435, 325703, 326834, 325542, 321776, 316136, 309306, 301447, 292601, 283305, 274289, 265747, 257456, 249557, 242740, 237564, 233920, 231235, 228964, 226892, 225150, 223977, 223426, 223453, 224315, 226529, 230148, 234384, 238364, 242074, 246126, 250720, 255421, 259935, 264627, 270088, 276554, 283912, 292051, 301081, 311391, 323425, 337122, 351680, 366294]
63429C66294J4830J5949J7513J8670J9595K1221K3792K6497K8642L0299L1514
63418F14816L1695L0229K7242K3237J8466J3119P801L238k66k738m080m261l749
63405G54749l320l422m163n813q712j2626j6671k0114k2789k4623k5241k4548
63393E82707k3253k2212k1329j9690j6862j3687j1423j0414r831q718p059n622
63381D12607m843m089k329M64K997M040L919M175N819Q351J0543J1727J2155J2507
63367D78043J3324J4638J5885J6478J6697J7648J9945K2691K4356K4452K3739
63356F87896K2816K1215J8139J3530Q083K650j942m938o077o004n742n819o094
63343G37713o417p041q323j0423j3339j6920k0596k3424k4810k5122k5271k5653
$$ y = [366294, 381124, 397073, 414586, 433256, 452851, 474072, 497864, 524361, 553003, 583302, 614816, 646511, 676740, 703982, 727219, 745685, 758804, 766605, 769843, 769577, 766839, 762759, 758498, 754749, 751429, 748007, 743844, 738031, 729319, 716693, 700022, 679908, 657119, 632496, 607255, 582707, 559454, 537242, 515913, 496223, 479361, 465674, 454251, 443837, 434006, 425288, 418229, 412607, 407764, 403675, 401346, 401810, 404807, 408847, 412766, 416941, 422760, 431111, 441654, 453381, 465536, 478043, 491367, 506005, 521890, 538368, 555065, 572713, 592658, 615349, 639705, 664157, 687896, 710712, 731927, 750066, 763596, 771679, 774329, 772387, 767449, 761372, 755368, 749626, 743807, 737713, 731296, 724255, 715932, 705509, 692170, 675250, 654654, 631230, 606420, 581298, 556027, 530374]
63331E30374k5702k4617k2300j9504j7136j5573j4546j3544j2301j0945r707q589
63319C35910p480o583o330o684o814n924m332l193l122l608l945m135m449m573
63305B64738l944k754j963k133k839l331l376l204k977k614k076j564j451j918
63291B28594k596k683j810o60l14r76j837k231k322k411k255j616r28p05o37l6
63275B04577R30J309P54M4j04Ll04r77j438j519j470j249n51M16Q68N52K82Q59
63257B02982J855K101J257J83k74k27j06K31J161K357K952K652K054J745J653
63242B22576J573J804K697L893M514M130L130K116J347Q58P42J059J578J881J738
63227B55636J322J051J246J885K626L042K925K433J962J809J936K105K225K448
$$ y = [530374, 504672, 480055, 457755, 438251, 421115, 405542, 390996, 377452, 365151, 354206, 344499, 335910, 328430, 321847, 315517, 308833, 302019, 296095, 291763, 288570, 285448, 281840, 277895, 273760, 269311, 264738, 260794, 258040, 256077, 253944, 251105, 247774, 244398, 241194, 238217, 235603, 233527, 231963, 230512, 228594, 225998, 223315, 221505, 220845, 220531, 219555, 217718, 215487, 213165, 210754, 208499, 206883, 205955, 205250, 204613, 204577, 205507, 206816, 207570, 207614, 207510, 207513, 207209, 206232, 204794, 203275, 201805, 200556, 200005, 200421, 201289, 201841, 202123, 202982, 204837, 206938, 208195, 208378, 208104, 207877, 207771, 208002, 209163, 211520, 214472, 217124, 219178, 220923, 222576, 224149, 225953, 228650, 232543, 237057, 241187, 244317, 246433, 247780, 248638, 249380, 250439, 252017, 253898, 255636, 256958, 258009, 259255, 261140, 263766, 266808, 269733, 272166, 274128, 275937, 277873, 279978, 282203, 284651]
63213B84651K821L028K761K222J953K164K528K716K757K731K530K207K227K923
63199C20219L926M531M640M916N950P541Q865R229Q696Q077Q277R445J0882J1853
63185D27047J2374J2916J3716J4684J5824J7181J8378J8715J7968J6728J5823
63174F01354J5635J5981J6334J6143J5285J4280J3692J3321J2437J0809Q858O727
63162G60856L946L42l450o930j0451j4310j7710j9660k0482k1371k2597k3217
63150F04966k2667k1552k0453j9001j6851j4705j3482j2901j1858j0034q271p293
63138D25898o790o018m817l650k936k658k519k255j817j384j165j183j268j257
63124C86181j103q67o90p25j025j497j963k125j589k28J266J687O10q52j171j79
$$ y = [284651, 287472, 290500, 293261, 295483, 297436, 299600, 302128, 304844, 307601, 310332, 312862, 315069, 317296, 320219, 324145, 328676, 333316, 338232, 344182, 351723, 360588, 369817, 378513, 386590, 394867, 404312, 415194, 427047, 439421, 452337, 466053, 480737, 496561, 513742, 532120, 550835, 568803, 585531, 601354, 616989, 632970, 649304, 665447, 680732, 695012, 708704, 722025, 734462, 745271, 754129, 760856, 764802, 765144, 761694, 754764, 744313, 730003, 712293, 692633, 672151, 650780, 628183, 604966, 582299, 560747, 540294, 521293, 504442, 489737, 476255, 463354, 451496, 441462, 433191, 425898, 419108, 413090, 408273, 404623, 401687, 399029, 396510, 394255, 392438, 391054, 389889, 388706, 387438, 386181, 385078, 384211, 383521, 382796, 381771, 380274, 378311, 376186, 374597, 374369, 375635, 377322, 377932, 377080, 375909, 375730]
63108C75730Q89J061O66N31Q56J348J889K466K781K568K127K077K632L598M805
63093D06024O040O782O677O255O418P124P273O182M442K987J947R10k19j305k485
63078D65052l907n138n544n220m967n286n879o196o079n726n394n302n444n454
63064C89516m962m156l669l739l874l476k518j443o75m63r50k028l153l524k626
63049C48260p11J165J824J040j36m04L87J245J400J112R71J033J094J314J955
63034C61549K753L124K970K739K740K797K644K273J825J457J432J982K943L779
63020C97007M149M264M552N122N725O168O627P434Q629R809J0560J0999J1718
63007D92763J3062J4770J6458J8164K0112K2129K3754K4910K6021K7459K9124
$$ y = [375730, 376619, 377680, 378346, 378877, 379733, 381081, 382970, 385436, 388217, 390785, 392912, 394989, 397621, 401219, 406024, 412064, 418846, 425523, 431778, 438196, 445320, 452593, 458775, 463217, 466204, 468151, 469061, 468842, 467537, 465052, 461145, 456007, 450463, 445243, 440276, 434990, 429111, 422915, 416836, 411110, 405716, 400414, 394970, 389516, 384554, 380398, 376729, 372990, 369116, 365640, 363122, 361679, 361004, 360541, 359591, 357563, 354410, 350886, 348260, 347549, 348714, 350538, 351578, 351442, 351038, 351425, 352670, 354070, 355182, 356153, 357186, 358280, 359594, 361549, 364302, 367426, 370396, 373135, 375875, 378672, 381316, 383589, 385414, 386871, 388303, 390285, 393228, 397007, 401156, 405420, 409972, 415094, 420819, 426987, 433614, 441048, 449677, 459486, 470046, 481045, 492763, 505825, 520595, 537053, 555217, 575329, 597458, 621212, 646122, 672143, 699602, 728726]
62996G28726L0671L1741L2009L1314K9999K8798K8253K8326K8623K8725K8271
62985A055456K7006K4951K2282J8949J4654R325L294l112r834j6740k3306k9077
62973A093848l4159l8908m3151m6130m7287m6900m5815m4606m3123m0819l7584
62962F25366l4104l1302k9351k7525k5094k2151j9420j7466j6291j5486j4562
62951C72614j3233j1636j0255r453r097q772q210p462o725o231o084o101n853
62938B63502n065l886k737k048k106k813l448l144j843n13l7k60n09o59j081j736
62922B31617k099j929j506j067o14l48o05j208j432j022o19q33j333j340p09n
62906B14948K62Q6k47m73m46j71L63J284K588L677L697K642J668J889L114M299
$$ y = [728726, 759397, 791138, 823147, 854461, 884460, 913258, 941511, 969837, 998460, 1027185, 1055456, 1082462, 1107413, 1129695, 1148644, 1163298, 1172623, 1175917, 1172805, 1162971, 1146231, 1122925, 1093848, 1059689, 1020781, 977630, 931500, 884213, 837313, 791498, 746892, 703769, 662950, 625366, 591262, 559960, 530609, 503084, 477990, 455839, 436419, 418953, 402662, 387176, 372614, 359381, 347745, 337490, 328037, 318940, 310168, 301958, 294496, 287771, 281540, 275456, 269355, 263502, 258437, 254551, 251814, 249766, 247660, 244847, 241399, 238255, 236412, 235899, 235862, 235602, 235093, 234434, 233353, 231617, 229518, 227589, 226083, 225016, 224402, 224054, 223449, 222241, 220809, 219787, 219168, 218335, 217002, 215662, 214953, 214948, 215210, 215296, 215049, 214576, 214130, 213959, 214322, 215606, 218194, 221871, 225568, 228210, 229878, 231767, 234881, 239180]
62890B39180M880N096N159M880M206L502L070K795K437J944J276L08q66j843k366
62875B73658k674l151l809m310m404m187l988m105m512m750m311l253k219j757
62861B22228j743j663j266p42m00l74n46n93k57K83M55k1o78p53p9Q24J398J502
62843B17575J202N90l4j60L78J085J308J016P99J095J649J839J398O97L10L48
62827B31095L78K7n17q06q41j008j338j338p98k88l76p94r79j065j567k271k386
62810B15128j902j801k561l331l221k626k447k679k717k615k932l445l261k296
62796A77294j627j973k678k746k172j636j395j137p06l51l64p66j240j225l83
62781A56895Q15J365R25L05M10J032J277Q46L11J93L85N37N28M69N22Q03J236
$$ y = [239180, 244060, 249156, 254315, 259195, 263401, 266903, 269973, 272768, 275205, 277149, 278425, 278733, 277867, 276024, 273658, 270984, 267833, 264024, 259714, 255310, 251123, 247135, 243030, 238518, 233768, 229457, 226204, 223985, 222228, 220485, 218822, 217556, 216814, 216414, 216040, 215494, 214901, 214644, 214927, 215382, 215361, 214683, 213930, 213851, 214675, 216073, 217575, 218777, 219367, 219333, 219173, 219551, 220636, 221944, 222960, 223759, 224854, 226503, 228342, 229740, 230437, 230747, 231095, 231473, 231500, 230983, 230177, 229336, 228328, 226990, 225652, 224854, 224566, 224190, 223396, 222417, 221352, 219785, 217514, 215128, 213226, 211425, 208864, 205533, 202312, 199686, 197239, 194560, 191843, 189228, 186296, 182851, 179590, 177294, 175667, 173694, 171016, 168270, 166098, 164462, 163067, 161930, 161224, 160873, 160509, 159743, 158503, 157278, 156895, 157710, 159075, 160000, 160305, 160715, 161747, 163024, 163870, 164181, 164374, 164759, 165296, 165824, 166293, 166815, 167618, 168854]
62764A68854J546J544J389J355J580K087K769L150K577J105k17m98j16q3n83r56
62748A85503r48j038j490j871j866j728j628j219l26N05O64K71j23k45r9L68J026
62731A75756J317Q58J73K73J415K694L028K295J407J373K394L761M656M912M967
62716B11279N221N712O386P273Q345R488J0731J2147J3478J4304J4756J5575J7234
62703C51929J9433K1800K4560K7999L1677L4796L7189L9431M2097M5298M8827
62692G25036N2165N4518N5252N4412N2432M9383M4812L8274K9748J9730R162q82
62680A184042r979j8578k7092l5004m1394m6046m9362n1346n1628n0527m9100
62669G53986m7869m6253m3753m0805l7978l5019l1520k7970k5283k3499k1757
$$ y = [168854, 170400, 171944, 173333, 174688, 176268, 178355, 181124, 184274, 186851, 187956, 187739, 187241, 187125, 187042, 186459, 185503, 184555, 183517, 182027, 180156, 178290, 176562, 174934, 173715, 173389, 173894, 174558, 174829, 174706, 174461, 174362, 174730, 175756, 177073, 177931, 178104, 178377, 179792, 182486, 185514, 187809, 189216, 190589, 192983, 196744, 201400, 206312, 211279, 216500, 222212, 228598, 235871, 244216, 253704, 264435, 276582, 290060, 304364, 319120, 334695, 351929, 371362, 393162, 417722, 445721, 477398, 512194, 549383, 588814, 630911, 676209, 725036, 777201, 831719, 886971, 941383, 993815, 1043198, 1088010, 1126284, 1156032, 1175762, 1184924, 1184042, 1174063, 1155485, 1128393, 1093389, 1051995, 1005949, 956587, 905241, 853613, 803086, 753986, 706117, 659864, 616111, 575306, 537328, 502309, 470789, 442819, 417536, 394037, 372280]
62658C72280j9547j7256j5407j3971j2646j1316j0035q887q021p597p513p421
62646B32663p092o554n856m917l816k863k291k010j846j848k118k417k310j673
62632A85052r79q76j566k546l078k822k052j228n43k0J29l75j296j771j131K98
62616A65196J465J675J125M33J8j6K94P09P90L32k57l19K90J093J634J928K151
62599A78541K210J980J707J826K283K472K002J254R39J164J358J117P85R20J403
62584B01961J600J310J114J523K254K698K731K545J958O33j033k030j960j520
62570B13784j464j696j775j688j522r44K23J258J208J54r52j524j634j214n9J254
62554B03409J574P50J18P31J887K185J345J34r58j975k651k497j665r17n27j01
$$ y = [372280, 352733, 335477, 320070, 306099, 293453, 282137, 272102, 263215, 255194, 247597, 240084, 232663, 225571, 219017, 213161, 208244, 204428, 201565, 199274, 197264, 195418, 193570, 191452, 189035, 186725, 185052, 184073, 183197, 181631, 179085, 176007, 173185, 171133, 169905, 169362, 169342, 169471, 169096, 167800, 166029, 164898, 165196, 166661, 168336, 169461, 169894, 169912, 169896, 170190, 170899, 171689, 172021, 171764, 171445, 171735, 172828, 174462, 176390, 178541, 180751, 182731, 184438, 186264, 188547, 191019, 193021, 194275, 195214, 196378, 197736, 198853, 199638, 200558, 201961, 203561, 204871, 205985, 207508, 209762, 212460, 215191, 217736, 219694, 220327, 219294, 217264, 215304, 213784, 212320, 210624, 208849, 207161, 205639, 204695, 204918, 206176, 207384, 207538, 206586, 205062, 203428, 202214, 202155, 203409, 204983, 205733, 205851, 206582, 208469, 210654, 211999, 212133, 211175, 209200, 206549, 204052, 202387, 201470, 200943, 200842]
62538B00842L98L53m35j144r92k71K76O22J273K265L145L814M650N667O287O240
62522B32990O152O813Q154R399J0124J0788J2168J4512J7332J9951K2132K4115
62510C94630K6082K7729K8521K8373K7840K7501K7267K6356K3904J9622J4005
62499F71830P982K261l049q085j2622j6174j8724k0858k2891k4281k4421k3676
62487E07292k2917k2258k1050j9202j7589j6766j6057j4568j2581j1079j0347
62476C22878r782q971q063p130n983m786m068l834l361k337j536j719k394k395
62462B56519j442l80R5K34O40J422K264K888L197L195L085L251L817M369M338
62447B87492L757L388L956N387O832P475P215O560O012N694N444N060M378L329
$$ y = [200842, 201240, 201593, 201158, 200014, 199022, 198751, 199027, 199649, 200922, 203187, 206332, 210146, 214796, 220463, 226750, 232990, 239142, 245955, 254109, 263508, 273632, 284420, 296588, 311100, 328432, 348383, 370515, 394630, 420712, 448441, 476962, 505335, 533175, 560676, 587943, 614299, 638203, 657825, 671830, 679812, 682073, 679024, 670939, 658317, 642143, 623419, 602561, 579670, 555389, 530968, 507292, 484375, 462117, 441067, 421865, 404276, 387510, 371453, 356885, 344304, 333225, 322878, 313096, 304125, 296062, 288932, 282949, 278163, 274095, 270261, 266900, 264563, 263027, 261308, 258914, 256519, 255077, 254697, 254792, 255026, 255666, 257088, 259352, 262240, 265437, 268632, 271717, 274968, 278785, 283154, 287492, 291249, 294637, 298593, 303980, 310812, 318287, 325502, 332062, 338074, 343768, 349212, 354272, 358650, 361979]
62433C61979K050P56n89k250m162n655o131n865n678n847n823n131m090l340k997
62418C07227k640j928r07J44Q74R86N37O6Q5N47J034J467K170L192M054M331M190
62401C25429M067M082M058L917L749L628L626L895M463N073N498N936O714P642
62387C91777Q014P427O298N446N407O194P424Q450Q659P978P033O580O810P374
62373D90871P993Q752R810J1033J2095J2890J3719J5005J6851J9003K1276K3858
62361F63156K6979L0450L3818L7010M0432M4162M7326M8570M7071M3048L7473
62350A099495L1525K6059K1203J6432J1267N879Q63l506p624j2176j7548k3428
62338A148441k8796l2393l3585l2856l1331k9831k8431k6822k4863k2769k0924
$$ y = [361979, 364029, 364785, 364196, 361946, 357784, 352129, 345998, 340133, 334455, 328608, 322785, 317654, 313564, 310224, 307227, 304587, 302659, 301752, 301896, 302770, 303756, 304293, 304359, 304444, 304991, 306025, 307492, 309662, 312854, 316908, 321239, 325429, 329496, 333578, 337636, 341553, 345302, 348930, 352556, 356451, 360914, 365987, 371485, 377421, 384135, 391777, 399791, 407218, 413516, 418962, 424369, 430563, 437987, 446437, 455096, 463074, 470107, 476687, 483497, 490871, 498864, 507616, 517426, 528459, 540554, 553444, 567163, 582168, 599019, 618022, 639298, 663156, 690135, 720585, 754403, 791413, 831845, 876007, 923333, 971903, 1018974, 1062022, 1099495, 1131020, 1157079, 1178282, 1194714, 1205981, 1211860, 1212723, 1209217, 1201593, 1189417, 1171869, 1148441, 1119645, 1087252, 1053667, 1020811, 989480, 959649, 931218, 904396, 879533, 856764, 835840]
62327H35840j9503j8257j6850j5413j4504j4299j4285j3971j3552j3368j3134
62316F68704j2374j1362j0806j0629r915q274o446n184m239k929j209L99J531
62303E87267K186K505K849L732N202O529P008O813O593O507O310O148O466P135
62289F63250P440P135O867P211P828Q055P908P941Q362Q794Q812Q372P697P146
62275G72818P130P844Q914R815J0669J2263J4932J7798J9696K0610K1640K3562
62263I47691K6087K8709L1480L4567L7644M0475M3583M7469N1345N3612N3655
62252A396317N2246N0014M6420M0819L3781K6597J9932J3624P473J504m510j1055
62240A673162j8269k5566l1918l6382l8570l8931l8390l7501l6041l3722l0841
$$ y = [835840, 816337, 798080, 781230, 765817, 751313, 737014, 722729, 708758, 695206, 681838, 668704, 656330, 644968, 634162, 623533, 613618, 605344, 598898, 593714, 589475, 586546, 585337, 585736, 587267, 589453, 591958, 594807, 598539, 603741, 610270, 617278, 624091, 630684, 637191, 643501, 649649, 656115, 663250, 670690, 677825, 684692, 691903, 699731, 707786, 715694, 723635, 731997, 740791, 749603, 757975, 765672, 772818, 779948, 787792, 796706, 806521, 817190, 829453, 844385, 862183, 881879, 902489, 924129, 947691, 973778, 1002487, 1033967, 1068534, 1106178, 1146653, 1190236, 1237705, 1289050, 1342662, 1396317, 1448563, 1498577, 1544997, 1585816, 1619597, 1646194, 1666126, 1679750, 1687223, 1688727, 1684217, 1673162, 1654893, 1629327, 1597409, 1561027, 1522457, 1483526, 1445136, 1407635, 1371594, 1337872, 1307031]
62229A307031k7876k4778k1266j7625j4546j2224j0229q328o758n593m419k897
62217A150492j240J62J275K316L387M425N329N987O299O321O261O357O804P678
62203A211853Q735R452R585R601J0114J1066J1885J2380J2854J3436J3955J4585
62191A349501J5813J7489J8747J9344K0392K2884K6010K7817K7374K5444K2976
62180A593791J9889J5736J0930O660L740K050J070O24R99K506N178Q801J3071
62167A685045J7593K1829K5221K7434K8439K8377K7330K5183K1731J7060J1846
62156A937088P014K917r02m928r011j2841j6717k1199k6007l0054l2679l4210
62144A758471l5106l5214l4287l2593l0472k7818k4607k1452j9025j7236j5738
$$ y = [1307031, 1279155, 1254377, 1233111, 1215486, 1200940, 1188716, 1178487, 1170159, 1163401, 1157808, 1153389, 1150492, 1149252, 1149414, 1150689, 1153005, 1156392, 1160817, 1166146, 1172133, 1178432, 1184753, 1191014, 1197371, 1204175, 1211853, 1220588, 1230040, 1239625, 1249226, 1259340, 1270406, 1282291, 1294671, 1307525, 1320961, 1334916, 1349501, 1365314, 1382803, 1401550, 1420894, 1441286, 1464170, 1490180, 1517997, 1545371, 1570815, 1593791, 1613680, 1629416, 1640346, 1647006, 1650746, 1652796, 1653866, 1654490, 1655489, 1657995, 1663173, 1671974, 1685045, 1702638, 1724467, 1749688, 1777122, 1805561, 1833938, 1861268, 1886451, 1908182, 1925242, 1937088, 1944102, 1947019, 1946117, 1941189, 1932178, 1919337, 1902620, 1881421, 1855414, 1825360, 1792681, 1758471, 1723365, 1688151, 1653864, 1621271, 1590799, 1562981, 1538374, 1516922, 1497897, 1480661, 1464923]
62133A464923j4861j5106j5907j5917j4784j3708j3779j4572j4951j4608j4021
62122A302709j3347j2283j0945j0024r839r848r432q697q086p610o899n899m977
62109A184823m266l349j759M74K884M883N797M922K088j846n434p710q640q528
62095A164339p388n173k478o29q89l492p448j1224j3715j4608j4087j2440j0030
62082A060738p250m194n53L746Q041J1449J3784J5416J6322J5982J4324J2129
62070A159934J0170Q637P689P804Q981J0194J0498J0242J0327J0550R632O884
62058A271542K930j254n160q415j0605j2048j4022j7526k2135k6587l0167l2999
62046A093554l5238l6646l7034l6622l5797l4721l3248l1183k8595k5944k3708
$$ y = [1464923, 1450062, 1434956, 1419049, 1403132, 1388348, 1374640, 1360861, 1346289, 1331338, 1316730, 1302709, 1289362, 1277079, 1266134, 1256110, 1246271, 1236423, 1226991, 1218294, 1210208, 1202598, 1195699, 1189800, 1184823, 1180557, 1177208, 1175449, 1175923, 1178807, 1183690, 1189487, 1194409, 1196497, 1194651, 1189217, 1181507, 1172867, 1164339, 1156951, 1151778, 1149300, 1148671, 1147782, 1144290, 1136842, 1125618, 1111903, 1097295, 1083208, 1070768, 1060738, 1053488, 1049294, 1048741, 1052487, 1060528, 1071977, 1085761, 1101177, 1117499, 1133481, 1147805, 1159934, 1170104, 1178741, 1186430, 1194234, 1203215, 1213409, 1223907, 1234149, 1244476, 1255026, 1264658, 1271542, 1274472, 1273218, 1268058, 1259643, 1249038, 1236990, 1222968, 1205442, 1183307, 1156720, 1126553, 1093554, 1058316, 1021670, 984636, 948014, 912217, 877496, 844248, 813065, 784470, 758526, 734818]
62035G34818k1906k0160j8344j6798j5697j4607j3045j1224r785q943q407q059
62023E67843q137q589q791q262p295o569o308o180n872n346m591l524k342j655
62009D84382j873k589k779j768J58K127L463M073M283M563N313O586P938Q742
61995E22619Q720Q111P261O163M468J925j275m555p414r844j2172j4454j6192
61982D93361j6878j6612j5835j4652j2882j0817r247q461p752o358m571l364l188
61969C62744l624m067m213l885k961j715q26p47j231j589j367p15j70p5j01M80
61953C35938J838L145L467K958K636L033L654L975M307N277O815Q207Q987R402
61939D03639J0009J1053J2165J2607J2000J0903J0394J0873J1639J1839J1487
$$ y = [734818, 712912, 692752, 674408, 657610, 641913, 627306, 614261, 603037, 593252, 584309, 575902, 567843, 559706, 551117, 542326, 534064, 526769, 520200, 513892, 507712, 501840, 496494, 491903, 488379, 486037, 484382, 482509, 479920, 477141, 475373, 475531, 477658, 481121, 485194, 489477, 494040, 499353, 505939, 513877, 522619, 531339, 539450, 546711, 552874, 557342, 559267, 557992, 553437, 546023, 536179, 524007, 509553, 493361, 476483, 459871, 444036, 429384, 416502, 405685, 396438, 387977, 380225, 373867, 369296, 365932, 362744, 359120, 355053, 350840, 346955, 343994, 342279, 341453, 340706, 339475, 337886, 336519, 335804, 335634, 335559, 335458, 335938, 337776, 340921, 344388, 347346, 349982, 353015, 356669, 360644, 364951, 370228, 377043, 385250, 394237, 403639, 413648, 424701, 436866, 449473, 461473, 472376, 482770, 493643, 505282, 517121, 528608]
61928E28608J1149J0952J0490R519Q229O882N677M962N057N733O358O718P330
61915F27664Q700J0607J2445J4065J5949J8613K2010K5585K8766L1286L3105L4248
61903H83043L4950L5809L7315L9134M0371M0823M1469M3245M5762M7912M9361
61892A339194N0553N1391N0905M8507M4731M0257L4864K7787J8657P717m398j6753
61880A693412k8383l8892m8328n6258o1624o4027o4509o4319o3394o0919n7024
61869A085735n2952m9591m6686m3607m0134l6289l2064k7722k3888k0946j8607
61858F93249j6260j3538j0480p405m748k744j127O46K789M965O708P840Q427Q558
61844F76880Q199P261N767M007K333O81j320l609n436o287o660p322q026p707
$$ y = [528608, 539757, 550709, 561199, 570718, 578947, 585829, 591506, 596468, 601525, 607258, 613616, 620334, 627664, 636364, 646971, 659416, 673481, 689430, 708043, 730053, 755638, 784404, 815690, 848795, 883043, 917993, 953802, 991117, 1030251, 1070622, 1111445, 1152914, 1196159, 1241921, 1289833, 1339194, 1389747, 1441138, 1492043, 1540550, 1585281, 1625538, 1660402, 1688189, 1706846, 1714563, 1710165, 1693412, 1665029, 1626137, 1577809, 1521551, 1459927, 1395900, 1331391, 1267072, 1203678, 1142759, 1085735, 1032783, 983192, 936506, 892899, 852765, 816476, 784412, 756690, 732802, 711856, 693249, 676989, 663451, 652971, 645566, 640818, 638074, 636947, 637593, 640382, 645347, 652055, 659895, 668322, 676880, 685079, 692340, 698107, 702114, 704447, 705128, 703808, 700199, 694763, 688476, 681816, 674494, 666468, 658761]
61830F58761n886l195n06J806L635M905N772O455O655N681L428O91j703l620n308
61815F77571o910q556j0328j1797j2186j1396j0370r966r918r338p855n753l453
61802E59745j405j10L43N91J333K533L725M843O237P996R773J1227J2212J2745
61788F31788J3116J3875J5272J6929J8438J9993K1926K3979K5750K7605L0297
61777H58968L3709L6833L9254M1819M5507N0160N4898N9275O3608O8371P3682
61766A426084P9346Q4958R0050R4206R6987R7792R6058R1816Q5748P8382O9223
61755B390650N7032M1121K2376K930j5295l1732m6873o0967p3315q2937q9621
61744B113369r3881r6157r6540r5273r2991r0169q6668q2125p6699p1174o6311
$$ y = [658761, 652875, 649680, 649174, 650980, 654615, 659520, 665292, 671747, 678402, 684083, 687511, 688202, 686499, 682879, 677571, 670661, 662105, 651777, 639980, 627794, 616398, 606028, 596062, 586144, 576806, 568951, 563198, 559745, 558340, 558230, 558573, 559164, 560497, 563030, 566755, 571598, 577835, 585831, 595604, 606831, 619043, 631788, 644904, 658779, 674051, 690980, 709418, 729411, 751337, 775316, 801066, 828671, 858968, 892677, 929510, 968764, 1010583, 1056090, 1106250, 1161148, 1220423, 1284031, 1352402, 1426084, 1505430, 1590388, 1680438, 1774644, 1871631, 1969423, 2065481, 2157297, 2243045, 2321427, 2390650, 2447682, 2488803, 2511179, 2514109, 2498814, 2467082, 2420209, 2359242, 2285927, 2202990, 2113369, 2019488, 1923331, 1826791, 1731518, 1638527, 1548358, 1461690, 1379565, 1302866, 1231692, 1165381]
61733A165381o2227n8435n4408n0046m5661m1573l7891l4552l1382k8151k4798
61722F96257k1706j9403j7901j6618j5180j3875j3045j2418j1555j0681j0512
61711E33363j1269j2361j3094j3252j2973j2415j1724j1061j0497j0013r588r169
61699C95947q579p727o790o162o138o751p691q311q097p270o568o224n740m956
61685B98943m631n251n969n669m658m145m303m089l032j914j439j349j280j464
61671B49750k005k386k355k440k982l413l152k612k466k547k258j619j097p16
61657B17702j02P84J602K047J871R45j85l15J000K559K892K152J696K087K591
61642B39326K613K460K502K569K519K543K556K019P80m56q97m69L66J097J334
$$ y = [1165381, 1103154, 1044719, 990311, 940265, 894604, 853031, 815140, 780588, 749206, 721055, 696257, 674551, 655148, 637247, 620629, 605449, 591574, 578529, 566111, 554556, 543875, 533363, 522094, 509733, 496639, 483387, 470414, 457999, 446275, 435214, 424717, 414704, 405116, 395947, 387368, 379641, 372851, 366689, 360551, 353800, 346109, 337798, 329701, 322431, 315863, 309639, 303899, 298943, 294312, 289061, 283092, 277423, 272765, 268620, 264317, 260228, 257196, 255282, 253843, 252494, 251214, 249750, 247745, 245359, 243004, 240564, 237582, 234169, 231017, 228405, 225939, 223392, 221134, 219515, 218418, 217702, 217600, 218384, 219986, 222033, 223904, 224849, 224664, 224349, 225349, 227908, 230800, 232952, 234648, 236735, 239326, 241939, 244399, 246901, 249470, 251989, 254532, 257088, 259107, 259887, 259431, 258534, 258065, 258431, 259528, 260862]
61627B60862R18K11j52L9N22J169K123L182L746L571K983K161Q97o32j661j884
61611B78055j982k610l455l944m210m645n033n005m816m830m636l734k740k756
61597B23659l604l880k904j514n92L8P18R96M28m09n17K62J272J982K237K017
61581B20189J582J585K312L019K818J999J699K322L152L581L824M147M225L764
61567B60218L122K832K938L339M239N671O934P214O629O097O166O518O586O176
61553C34679N392M405L446K730K296K039J887J755J442R16N51P35J271J614J629
61538C66787J589J486R83J84k03J27N12K08n75j076j097j142j612k364l000l113
61522C57694k352p36J079K339L004L617M353M807M843N064O023P425Q537R212
$$ y = [260862, 261780, 261991, 261839, 261878, 262400, 263569, 265692, 268874, 272620, 276191, 279174, 281335, 282232, 281600, 279939, 278055, 276073, 273463, 270008, 266064, 261854, 257209, 252176, 247171, 242355, 237525, 232889, 229155, 226415, 223659, 220055, 216175, 213271, 211757, 211165, 211203, 211921, 212917, 213345, 212936, 212419, 212681, 213953, 215935, 218172, 220189, 221771, 223356, 225668, 228687, 231505, 233504, 235203, 237525, 240677, 244258, 248082, 252229, 256454, 260218, 263340, 266172, 269110, 272449, 276688, 282359, 289293, 296507, 303136, 309233, 315399, 321917, 328503, 334679, 340071, 344476, 347922, 350652, 352948, 354987, 356874, 358629, 360071, 360987, 361538, 362273, 363544, 365158, 366787, 368376, 369862, 370845, 371029, 370826, 370953, 371465, 371673, 371098, 370022, 368925, 367783, 366171, 363807, 360807, 357694, 355342, 354606, 355685, 358024, 361028, 364645, 368998, 373805, 378648, 383712, 389735, 397160, 405697, 414909]
61508D14909R948J1074J2332J3420J4563J6309J8808K1570K3922K5650K7038K8338
61496F37881K9403L0006L0306L0606L0628K9443K6454K2127J7492J3032Q514L792
61484I09684p20m547p782j0894j4003j6564j7780j7309j5705j4131j3474j3552
61472G63223j3365j2182j0247q318o809n678m822m182l571k903k554l004l975
61459F81613m487m031l196k732k424j489J60J748K690L267M061N276O798Q548
61445F95802J0369J1851J2659J2910J2993J3032J2717J1705R989P929N990M424
61433H22370L124J858O57j32l02r5P8J19K05L46L68L31O99J788L170L871L175
61416H41630J134j643m545p155r202j0509j1149j1374j1330j0928j0133r218q533
$$ y = [414909, 424857, 435931, 448263, 461683, 476246, 492555, 511363, 532933, 556855, 582505, 609543, 637881, 667284, 697290, 727596, 758202, 788830, 818273, 844727, 866854, 884346, 897378, 905892, 909684, 908964, 904417, 896635, 885741, 871738, 855174, 837394, 820085, 804380, 790249, 776775, 763223, 749858, 737676, 727429, 719111, 712302, 706624, 701802, 697620, 694049, 691146, 688592, 685588, 681613, 677126, 673095, 669899, 667167, 664743, 663254, 663414, 665162, 667852, 671119, 675180, 680456, 687254, 695802, 706171, 718022, 730681, 743591, 756584, 769616, 782333, 794038, 804027, 811956, 817946, 822370, 825494, 827352, 828009, 827877, 827575, 827480, 827558, 827677, 827882, 828228, 828596, 828927, 829626, 831414, 834584, 838455, 841630, 842764, 841121, 836576, 829421, 820219, 809710, 798561, 787187, 775857, 764929, 754796, 745578, 737045]
61403G37045q051p452o677o168o276o660o573n729m609l777l129k095m97J139
61389F70491K233K938L977N739P843R702J1342J3328J5905J8573K0694K2311K4076
61376H29152K6354K8652L0105L0373K9849K9130K8453K7619K6145K3478J9412
61365A128722J4418R329M514k94n188r544j2757j5171j7701k0610k3289k5146
61353A027283k6113k6290k5772k4933k4164k3172k1280j8700j6621j5610j4869
61342G89759j3726j2906j3347j4397j4479j3184j1502j0174q995p792o855o134
61330F56268n092l641k313j144N61K883M718N258N224N742O764P459P692Q109
61316F98488Q940R610R556Q782P666O680O249O367O488O240O013O354P021P328
$$ y = [737045, 728994, 721542, 714865, 708697, 702421, 695761, 689188, 683459, 678850, 675073, 671944, 669849, 669352, 670491, 672724, 675662, 679639, 685378, 693221, 702923, 714265, 727593, 743498, 762071, 782765, 805076, 829152, 855506, 884158, 914263, 944636, 974485, 1003615, 1032068, 1059687, 1085832, 1109310, 1128722, 1143140, 1152469, 1156983, 1156689, 1151501, 1141957, 1129200, 1114029, 1096328, 1075718, 1052429, 1027283, 1001170, 974880, 949108, 924175, 900011, 876839, 855559, 836859, 820238, 804628, 789759, 776033, 763127, 749780, 735383, 720904, 707720, 696218, 686044, 677049, 669257, 662402, 656268, 651176, 647535, 645222, 644078, 644639, 647522, 652240, 657498, 662722, 668464, 675228, 682687, 690379, 698488, 707428, 717038, 726594, 735376, 743042, 749722, 755971, 762338, 768826, 775066, 781079, 787433, 794454, 801782]
61302H01782P261P422P800P492N945L790J881R8k307n431q520j0926j2684j3981
61288G89622j4617j4417j3773j3271j2854j1915j0315q797q017p674p009n888
61276F61075m779l884k965k035j473j293r39j53O07J027J641L002M579N213M575
61261F64198L559L183L720M966O814R170J1614J3522J4587J5015J5213J5382J5426
61248G96369J5265J5086J5218J5782J6590J7284J7446J6616J4506J1374P972M985
61236I64493K564M51j573l471n100o446p607q548r007q830q263p582o495m514
61222H90072k086o40j054k675m490o617r625j2883j4880j5161j4804j4708j4541
61209G75908j3666j2227j0802r820r605j0185j0733j0141q504p148o691o152m662
$$ y = [801782, 809043, 816465, 824265, 831757, 837702, 841492, 843373, 843471, 841164, 835733, 827213, 816287, 803603, 789622, 775005, 760588, 746815, 733544, 720690, 708775, 698460, 689663, 681646, 673972, 666963, 661075, 656296, 652412, 649447, 647412, 645939, 644646, 643707, 643554, 644161, 645188, 646829, 649831, 654410, 659623, 664198, 667757, 670940, 674660, 679626, 686440, 695610, 707224, 720746, 735333, 750348, 765561, 780943, 796369, 811634, 826720, 841938, 857720, 874310, 891594, 909040, 925656, 940162, 951536, 959508, 964493, 967057, 967508, 965935, 962464, 957364, 950918, 943311, 934763, 925756, 916926, 908663, 901081, 894586, 890072, 887986, 887346, 886292, 883617, 879127, 872510, 862885, 850002, 835122, 819961, 805157, 790449, 775908, 762242, 750015, 739213, 729393, 719788, 709603, 698870, 688729, 680225, 673077, 666386, 660234, 655572]
61196F55572k956k186k112j586k39J316K591L552M052L847K962J451q83l840o352
61181F55189p402p186o689o500o654p162p886q249p841p112o764o838p050p446
61167E54410p911p587n900l771k719k940l344l228k869k499j876j006l12O7L79
61152E08894O13N78N70J208K477L737M673N516O309O694O399N299L155N1l086
61137E53087n278o598p717q601q651p957p261o711n791m448l229k234j092m8J53
61122D77624l13l03O05J485J498R25L69ll6M93J114P95n88j874k200k078k344
61105D75169k902l178l012k476j554n03P8R0Q6J76m68k375m768o468p242p598
61089D33055p715p307o269m937l781l137k989k889k324j293k39M27M86j36r92
$$ y = [655572, 652616, 650430, 648318, 646732, 646493, 647809, 650400, 653952, 658004, 661851, 664813, 666264, 665381, 661541, 655189, 647787, 640601, 633912, 627412, 620758, 613596, 605710, 597461, 589620, 582508, 575744, 568906, 561856, 554410, 546499, 538912, 533012, 529241, 526522, 523582, 520238, 517010, 514141, 511642, 509766, 508760, 508448, 508515, 508894, 509507, 510085, 510655, 511863, 514340, 518077, 522750, 528266, 534575, 541269, 547668, 552967, 556122, 556173, 553087, 547809, 541211, 533494, 524893, 516242, 508285, 501024, 494313, 488522, 484074, 480845, 478611, 477519, 477471, 477624, 477311, 477008, 477613, 479098, 480596, 481521, 481890, 481887, 481851, 482344, 483458, 484253, 483665, 481791, 479591, 477513, 475169, 472267, 469089, 466077, 463601, 462047, 461544, 461622, 461712, 461798, 461974, 461506, 459131, 454363, 447895, 440653, 433055, 425340, 418033, 411764, 406827, 403046, 399909, 396920, 394031, 391707, 390414, 390175, 390602, 391088, 390952, 389960]
61074C89960j059J98J983L124L523L764L792L208K531K697L477L821L720M148
61060D28887N097N392M731M222M526N019N277N746O337O072M814L885M120M761
61046D98886M971N033N271N233M777M574M867N054N126N898P283Q068Q092Q725
61032E81858J0378J1614J1709J1976J3302J4584J5024J5846J8054K0561K2327
61021G47233K4346K7641L1253L4229L7633M2473M7461N0990N3477N5629N6522
61010A208887N5906N6351O0399O7423P5899Q6557J00191J14553J26891J37790
61000B090847J49453J62735J79403K04176K39814K83212L31573L89034M61096
60991D491343N47558O50616P85718R72134J217341J528398J929795K422275K890002
$$ y = [389960, 388901, 389099, 391082, 394206, 397729, 401493, 405285, 408493, 411024, 413721, 417198, 421019, 424739, 428887, 433984, 439376, 444107, 448329, 452855, 457874, 463151, 468897, 475234, 481306, 486120, 490005, 494125, 498886, 503857, 508890, 514161, 519394, 524171, 528745, 533612, 538666, 543792, 549690, 556973, 565041, 573133, 581858, 592236, 603850, 615559, 627535, 640837, 655421, 670445, 686291, 704345, 724906, 747233, 771579, 799220, 830473, 864702, 902335, 944808, 992269, 1043259, 1096736, 1152365, 1208887, 1264793, 1321144, 1381543, 1448966, 1524865, 1611422, 1711613, 1826166, 1953057, 2090847, 2240300, 2403035, 2582438, 2786614, 3026428, 3309640, 3641213, 4030247, 4491343, 5038901, 5689517, 6475235, 7447369, 8664710, 10193108, 12122903, 14545178, 17435180]
60982A7435180L082663K768114J949075R12904L6485m60507n73296l82416M5276
60973B4813478N96693J025086J031500M87766m36051j389675k086169k438807
60965B1603821k513556k412695k214347j973254j727310j493983j276244j077083
60957F915349r02550p53654o25404n15059m24534l54021k99262k56136k22973
60948B561756j97464j75946j56931j41544j29475j17943j05471r3328q2374p1741
60938A289539o1729n4872n2524n2744n2889n2253n1026m8783m5347m1595l8192
60927G37585l4780l1084k7557k4348k1105j8204j6653j6265j5464j3544j1621
60916E06960j0701j0276r579q826q337p644o400n202m739m831m924m792m383l753
$$ y = [17435180, 20517843, 23285957, 25235032, 26147936, 26184421, 25723914, 25150618, 24768202, 24813478, 25410171, 26435257, 27466757, 27954523, 27518472, 26128797, 24042628, 21603821, 19090265, 16677570, 14463223, 12489969, 10762659, 9268676, 7992432, 6915349, 6012799, 5259145, 4633741, 4118682, 3694148, 3340127, 3040865, 2784729, 2561756, 2364292, 2188346, 2031415, 1889871, 1760396, 1642453, 1536982, 1443654, 1361280, 1289539, 1227810, 1172938, 1120414, 1067670, 1014781, 962528, 911502, 862719, 817372, 775777, 737585, 702805, 671721, 644164, 619816, 598711, 580507, 563854, 547589, 532125, 518581, 506960, 496259, 485983, 476404, 467578, 459241, 451597, 445197, 439995, 435256, 430425, 425501, 420709, 416326, 412573]
60902D12573l434m070n403o433o718o665o459n844n093n033n728o199n853n180
60888C34461m743m431m067l760l320k274q34j6l95j467k493l106l085k396j680
60873B96394j645j959j738j138j229k110k565j903q54k34j6j81j088k405k980
60858B74349k538k226k713l000k052m77N24R16J376J889J911J388P51K79J96Q51
60842B71424K054K869K734K160J662Q54o97k379l309l557l705l765l447k979k730
60827B57189k444j782j229j455k077j991q22P29J816K037J337J10p76p39j66K36
60811B49973M21P73J210J363J352J586J946K009J879J996K208J895J075M67L54
60796B70507J99l47q61r05p38p30o85k54K64K00n09j133j105q22j107k061k855
$$ y = [412573, 409139, 405069, 399666, 393233, 386515, 379850, 373391, 367547, 362454, 357421, 351693, 345494, 339641, 334461, 329718, 325287, 321220, 317460, 314140, 311866, 311032, 311016, 310621, 309154, 306661, 303555, 300470, 298074, 296394, 294749, 292790, 291052, 289914, 288685, 286575, 284010, 282107, 281253, 281019, 281003, 280822, 279734, 277329, 274349, 271811, 269585, 266872, 263872, 261820, 261343, 261867, 262783, 264159, 266048, 267959, 269347, 270098, 270377, 270573, 271424, 273478, 276347, 279081, 281241, 282903, 283757, 283060, 280681, 277372, 273815, 270110, 266345, 262898, 259919, 257189, 254745, 252963, 251734, 250279, 248202, 246211, 245389, 246118, 247934, 249971, 251308, 251418, 250642, 249903, 249737, 249973, 250394, 251167, 252377, 253740, 255092, 256678, 258624, 260633, 262512, 264508, 266716, 268611, 269686, 270153, 270507, 270706, 270359, 269498, 268593, 267855, 267125, 266440, 266186, 266450, 266650, 266141, 265008, 263903, 263081, 261974, 259913, 257058]
60779B57058k812k181j612j210p04j98n2r1K00O26L38p81j717j749j375j186p56
60762B41798M07J565J620Q83P53J720K728K727J921J220J147J571K036K123J843
60747B66062J711K102K664K788K509K326K248J782Q28j55r89k007l205l968l972
60732B70724l774l969m391m554m430m203l737k890k118k046k593l056l084k942
60718B22937k772k265j331n76o34j316j835j747j274p70l61j03o5l4M10J218J627
60701B11109J082J18k18K57O96M71pjN87J280J657J490O86m33j035n51N46J227
60683B18961J201J150J622K196K091J295O24P31J373J855J903J821J846J759J342
60668B41770R20R73J367J477J141R75J454K178K484K424K604L129L313K599J358
$$ y = [257058, 254246, 252065, 250453, 249243, 248539, 248341, 248289, 248198, 248398, 249024, 249362, 248581, 246864, 245115, 243740, 242554, 241798, 242205, 243770, 245390, 246273, 247026, 248746, 251474, 254201, 256122, 257342, 258489, 260060, 262096, 264219, 266062, 267773, 269875, 272539, 275327, 277836, 280162, 282410, 284192, 285020, 284865, 283876, 281869, 278664, 274696, 270724, 266950, 262981, 258590, 254036, 249606, 245403, 241666, 238776, 236658, 234612, 232019, 228963, 225879, 222937, 220165, 217900, 216569, 215993, 215359, 214043, 212208, 210461, 209187, 208417, 208056, 207953, 207888, 207854, 208264, 209482, 211109, 212191, 212309, 212091, 212348, 213044, 213515, 213508, 213507, 214094, 215374, 217031, 218521, 219207, 218774, 217739, 217188, 217734, 218961, 220162, 221312, 222934, 225130, 227221, 228516, 229140, 229871, 231244, 233099, 235002, 236823, 238669, 240428, 241770, 242690, 243663, 245030, 246507, 247648, 248623, 250077, 252255, 254739, 257163, 259767, 262896, 266209, 268808, 270166]
60653B70166O09J002K228L333L617L242K988L311L795L657K669J373M19j47p17
60638C01545j465k018j855j003j38O8m05r89j142q09l28m0QR1M59R76J279J342
60620B95576J575K114K500K414K355L033M341N594O568P510Q337Q750R116J0206
60606C69989J1796J2595J1997J0898J0115Q980O425K732p73l376n343o936q025
60593D21074q630r039r315r220q639p620o174m528l319k988l176l279l326l613
60579C38208l736k934j351o0L02J84K42N41Q98J325J773J916J579J018O16N35
60563C41056Q51J530K220K473K374K490L066L706M018M211M684N434O034O045
60549C90192N350M303L614L739M358M795M943N244N826O306O616P365Q999J1123
$$ y = [270166, 270775, 271777, 274005, 277338, 280955, 284197, 287185, 290496, 294291, 297948, 300617, 301990, 302409, 302262, 301545, 300080, 298062, 296207, 295204, 295066, 295134, 294729, 293740, 292598, 291789, 291461, 291421, 291429, 291520, 291979, 292955, 294234, 295576, 297151, 299265, 301765, 304179, 306534, 309567, 313908, 319502, 326070, 333580, 341917, 350667, 359783, 369989, 381785, 394380, 406377, 417275, 427390, 436370, 442795, 445527, 444754, 441378, 436035, 429099, 421074, 412444, 403405, 394090, 384870, 376231, 368611, 362437, 357909, 354590, 351602, 348426, 345147, 341821, 338208, 334472, 331538, 330187, 330127, 330429, 330613, 330855, 331396, 332294, 333619, 335392, 337308, 338887, 339905, 340521, 341056, 341907, 343437, 345657, 348130, 350504, 352994, 356060, 359766, 363784, 367995, 372679, 378113, 384147, 390192, 395542, 399845, 403459, 407198, 411556, 416351, 421294, 426538, 432364, 438670, 445286, 452651, 461650, 472773]
60535D72773J3114J4913J6883J9156K1689K4600K8135L2408L7499M3527N0403
60524G75100N7773O5486P3561Q1235Q6405Q6759Q1473P1369N7660M1123K2534
60513A500478L226j5078l0770m2713n0528n4743n6403n6342n4897n2256m8646
60502A041328m4102l8398l1546k4062j6470q636n8R249J8504K6896L4108L9775
60490A006588M2733M1502L5650K6275J4881K334j0639k2376l0703l4692l5418
60479A036135l4570l2726k9478k4870j9988j5979j2897r823n906j068M164R230
60467H62224J3916J8438K3344K9198L6145M3796N1763O0356P0490Q2795R7026
60456A389491J12606J29559J48704J70984J96802K25756K56553K86914L13623
$$ y = [472773, 485887, 500800, 517683, 536839, 558528, 583128, 611263, 643671, 681170, 724697, 775100, 832873, 898359, 971920, 1053155, 1139560, 1226319, 1307792, 1379161, 1436821, 1477944, 1500478, 1503704, 1488626, 1457856, 1415143, 1364615, 1309872, 1253469, 1197127, 1142230, 1089974, 1041328, 997226, 958828, 927282, 903220, 886750, 878114, 878056, 887305, 905809, 932705, 966813, 1006588, 1049321, 1090823, 1126473, 1152748, 1167629, 1169963, 1159324, 1136948, 1106245, 1071553, 1036135, 1001565, 968839, 939361, 914491, 894503, 878524, 865627, 855804, 849898, 848830, 852994, 862224, 876140, 894578, 917922, 947120, 983265, 1027061, 1078824, 1139180, 1209670, 1292465, 1389491, 1502097, 1631656, 1780360, 1951344, 2148146, 2373902, 2630455, 2917369, 3230992]
60447C230992L32565L38769L27081K93974K39396J66969Q2530p201r4908j73042
60437D737125k35444k79178l04774l14717l11869k99024k79222k55710k31321
60428B225866k07833j85879j65400j46221j28407j12310r8333q6514p6336o7156
60418I51477n8805n1542m5397l9936l4912l0708k7702k5498k3301k0958j8980
60407E73738j7632j6569j5485j4527j3823j3064j1863j0252q610p335o691o623
60395D31264o634o233n590n287n311m923l805k699k401k672k716k351j981j727
60381C76934j366j006j056j534j948j983j748j330o83o7N2k78m42k43k60q44j281
60364C60917o45Q91K225K701K587K301J821J115N03J88j16p05j298j384r61m31
$$ y = [3230992, 3563557, 3902326, 4229407, 4523381, 4762777, 4929746, 5012276, 5005075, 4910167, 4737125, 4501681, 4222503, 3917729, 3603012, 3291143, 2992119, 2712897, 2457187, 2225866, 2018033, 1832154, 1666754, 1520533, 1392126, 1279816, 1181483, 1094969, 1018633, 951477, 892672, 841130, 795733, 755797, 720885, 690177, 662475, 636977, 613676, 592718, 573738, 556106, 539537, 524052, 509525, 495702, 482638, 470775, 460523, 451913, 444578, 437887, 431264, 424630, 418397, 412807, 407520, 402209, 397286, 393481, 390782, 388381, 385709, 382993, 380642, 378661, 376934, 375568, 374562, 373506, 371972, 370024, 368041, 366293, 364963, 364280, 364213, 364265, 363987, 363545, 363302, 363042, 362198, 360917, 360272, 361163, 363388, 366089, 368676, 370977, 372798, 373913, 374416, 374604, 374488, 373783, 372485, 371101, 370140, 369709]
60348C69709L9N89J164J488J619J985K643L114L162L217L519L488K618J617J758
60333D01729L201M828N929P131R379J2675J6349J9906K2887K4229K2732J8335
60321E69310J2373O327N71n382j1583j6998k0332k1358k1062k0457j9599j8061
60309D33749j5931j3760j1848j0253r360r527j0067r601p803n990n372n514n263
60296C13460m476l861l628l345k991k994l248l057k255j563j520j749j633j102
60282B76038m43K06P06P68L66k3R4O54J197J412J276R02M86L07N68J286K323L385
60264B91508M125M509M993N917O862P052O414N629N069M344L187K068J453J006
60250C54136J69q40j216o56L01J013J342J537J867K464L324M288N086N377M966
$$ y = [369709, 369748, 370337, 371501, 372989, 374608, 376593, 379236, 382350, 385512, 388729, 392248, 395736, 398354, 399971, 401729, 404930, 409758, 415687, 422818, 432197, 444872, 461221, 481127, 504014, 528243, 550975, 569310, 581683, 588010, 588581, 583199, 571616, 554618, 534286, 512928, 491866, 471409, 451810, 433749, 417818, 404058, 392210, 381957, 372597, 363070, 353003, 343402, 335599, 329609, 324237, 318723, 313460, 308984, 305123, 301495, 298150, 295159, 292165, 288917, 285860, 283605, 282042, 280522, 278773, 277140, 276038, 275595, 275801, 276507, 277275, 277641, 277618, 277712, 278366, 279563, 280975, 282251, 283153, 283639, 283946, 284514, 285800, 288123, 291508, 295633, 300142, 305135, 311052, 317914, 324966, 331380, 337009, 342078, 346422, 349609, 351677, 353130, 354136, 354305, 353465, 352249, 351593, 351894, 352907, 354249, 355786, 357653, 360117, 363441, 367729, 372815, 378192, 383158]
60235C83158M166L830M561N887O773P050P684R356J1474J3146J4463J6092J7979
60222E05619J9381K0016K0365K0827K1259K1444K1356K0879J9740J7950J5862
60211G24698J3716J1489R175O778M081Q90k424n130o888p857q164p784o966o139
60197G19475n312m145k648j104O90L243O269Q702J0283J2142J5181J8670K1344
60184H02790K3175K5104K7363K9083K9499K8676K7076K5090K3045K1018J8601
60173A080520J5368J1526P681M037M20l054n959q130r688j0376r588p150l623
60160A061984L62M558Q965J3745J9260K5529L1446L5237L5934L3898K9800K3808
60148A324526J6165P833o4p038j3045j7872k1220k3140k3927k3768k2909k1811
$$ y = [383158, 387324, 391154, 395715, 401602, 408375, 415425, 423109, 432465, 443939, 457085, 471548, 487640, 505619, 525000, 545016, 565381, 586208, 607467, 628911, 650267, 671146, 690886, 708836, 724698, 738414, 749903, 759078, 765856, 769937, 770827, 768403, 763273, 756385, 748528, 740364, 732580, 725614, 719475, 714163, 710018, 707370, 706266, 706956, 710199, 716468, 725170, 735453, 747595, 762776, 781446, 802790, 825965, 851069, 878432, 907515, 937014, 965690, 992766, 1017856, 1040901, 1061919, 1080520, 1095888, 1107414, 1115095, 1119132, 1119552, 1116498, 1110539, 1102409, 1092721, 1082345, 1072757, 1065607, 1061984, 1062346, 1066904, 1075869, 1089614, 1108874, 1134403, 1165849, 1201086, 1237020, 1270918, 1300718, 1324526, 1340691, 1348524, 1348460, 1341422, 1328377, 1310505, 1289285, 1266145, 1242218, 1218450, 1195541, 1173730]
60136A173730k0788j9612j7910j5747j3439j0991q119m672p13L675Q339J3032
60124A086785J7792K3035K8774L3991L7400L8802L9143L9267L9207L8865L8772
60113A461833L9649M1503M3537M4962M5623M5748M5287M3677M0439L5802L0506
60102A918566K4982J9025J2337N044k587j0445j8281k5507l1804l7657m3603m9116
60090A760954n2880n4235n3756n2289n0070m6983m3110l8617l3570k8288k3491
60079A283665j9572j5962j1711o627j433L186P280J1305J5465J9594K3404K6701
60067A335295K9422L1743L4060L6711L9577M2131M3923M4939M5332M4846M2667
60056A770646L7951L0491K0904J0299l42j0658k0823l0840l9994m7297n2392n5580
$$ y = [1173730, 1152942, 1133330, 1115420, 1099673, 1086234, 1075243, 1067124, 1062452, 1061739, 1065414, 1073753, 1086785, 1104577, 1127612, 1156386, 1190377, 1227777, 1266579, 1305722, 1344989, 1384196, 1423061, 1461833, 1501482, 1542985, 1586522, 1631484, 1677107, 1722855, 1768142, 1811819, 1852258, 1888060, 1918566, 1943548, 1962573, 1974910, 1979954, 1977367, 1966922, 1948641, 1923134, 1891330, 1853673, 1810070, 1760954, 1708074, 1653839, 1600083, 1547794, 1497724, 1450741, 1407631, 1369014, 1335444, 1307156, 1283665, 1264093, 1248131, 1236420, 1229793, 1228360, 1231546, 1238826, 1250131, 1265596, 1285190, 1308594, 1335295, 1364717, 1396460, 1430520, 1467231, 1506808, 1548939, 1592862, 1637801, 1683133, 1727979, 1770646, 1808597, 1839088, 1859992, 1870291, 1869949, 1859291, 1838468, 1807628, 1767634, 1720337, 1667945, 1612365]
60044A612365n6952n6143n3217m9219m5183m1027l6094l0506k5196k0615j6190
60033A182023j1293o017p95M223R028J3432J7270K0577K3223K4676K4474K2695
60021A323516J9733J5879J1400O690J987k875q069j3325j8187k2493k6283k9381
60009A258592l1536l2866l3649l3664l2355k9708k6597k3827k1196j7862j3554
59998I61778r047n349k688m10K300N756R754J3897J7888K1622K5219K8842L2430
59985A101992L5583L7892L9229L9577L8686L6215L2222K7200K1570J5488R241
59974A434895L401j780o780j2180j7678k2211k5087k6626k7539k8027k7744k6383
59962A216261k4001k0872j7400j4127j1515r534p649n414k854j35K853O239R639
$$ y = [1612365, 1555413, 1499270, 1446053, 1396834, 1351651, 1310624, 1274530, 1244024, 1218828, 1198213, 1182023, 1170730, 1164713, 1163918, 1168141, 1177169, 1190601, 1207871, 1228448, 1251671, 1276347, 1300821, 1323516, 1343249, 1359128, 1370528, 1377218, 1379205, 1376330, 1368261, 1354936, 1336749, 1314256, 1287973, 1258592, 1227056, 1194190, 1160541, 1126877, 1094522, 1064814, 1038217, 1014390, 993194, 975332, 961778, 952731, 947382, 944694, 944284, 946584, 952340, 962094, 975991, 993879, 1015501, 1040720, 1069562, 1101992, 1137575, 1175467, 1214696, 1254273, 1292959, 1329174, 1361396, 1388596, 1410166, 1425654, 1434895, 1438296, 1436516, 1429736, 1417556, 1399878, 1377667, 1352580, 1325954, 1298415, 1270388, 1242644, 1216261, 1192260, 1171388, 1153988, 1139861, 1128346, 1118812, 1111163, 1105749, 1102895, 1102760, 1105613, 1111852, 1121491]
59949A121491J2452J4764J7328K0369K2869K3606K2624K1041J9584J7981J5873
59938A329982J3629J1871J0695R739Q750P635O276M760L714L839N100O781Q495
59925A431266J0719J4033J8190K2351K6139K9889L3766L7269L9907M1986M3985
59914A749500M5402M4976M2221L7967L3003K6894J8834R162p80j0059j8661k6567
59902A951892l3212l8049m1149m2924m3694m3625m2674m0526l7022l2734k8531
59891A527752k4561k0275j5663j1593q561n828k488J255M563P201R502J1436J2659
59878A485399J3296J3882J4466J4510J3683J2070R588N943J332l509q222j3090
59866A559348j8131k2612k5963k8554l0885l2536l2752l1875l1272l1759l2790
$$ y = [1121491, 1133943, 1148707, 1166035, 1186404, 1209273, 1232879, 1255503, 1276544, 1296128, 1314109, 1329982, 1343611, 1355482, 1366177, 1375916, 1384666, 1392301, 1398577, 1403337, 1407051, 1410890, 1415990, 1422771, 1431266, 1441985, 1456018, 1474208, 1496559, 1522698, 1552587, 1586353, 1623622, 1663529, 1705515, 1749500, 1794902, 1839878, 1882099, 1920066, 1953069, 1979963, 1998797, 2007959, 2007179, 1997120, 1978459, 1951892, 1918680, 1880631, 1839482, 1796558, 1752864, 1709239, 1666565, 1626039, 1589017, 1556283, 1527752, 1503191, 1482916, 1467253, 1455660, 1447099, 1441271, 1438783, 1440038, 1444601, 1451802, 1461304, 1472740, 1485399, 1498695, 1512577, 1527043, 1541553, 1555236, 1567306, 1576894, 1582837, 1584169, 1580660, 1572438, 1559348, 1541217, 1518605, 1492642, 1464088, 1433203, 1400667, 1367915, 1336040, 1304768, 1273009, 1240219]
59855A240219l3473l3681l3771l3664l2899l1304k9073k6266k2842j9256j6333
59844I27657j4270j2215r397o277m057l107k445r11J682M649P272R073R575Q324
59830I15553N380J620j584l159k846j035J786N174Q213R378P569L340j392n045
59816I42952p465r259j0615j1164j0765r949r559j0060j1089j1621j0854r142
59804H21410p753p528q040q320q008p407o659n474l677j649J2J012J514J907K491
59789G63831L240L857M100L918L247J883j40k178l313l087j856l26J090K470M004
59774G80740N579O893Q039R650J2206J5407J8605K1718K5209K9274L3749L8762
59762A005831M4685N1138N6997O1754O5999O9712P0774O6242N4917L8061J8129
$$ y = [1240219, 1206746, 1173065, 1139294, 1105630, 1072731, 1041427, 1012354, 986088, 963246, 943990, 927657, 913387, 901172, 891775, 885498, 881441, 878334, 875889, 874978, 876660, 881309, 888581, 897654, 907229, 915553, 920933, 922553, 920969, 917810, 914964, 913929, 915715, 920889, 929102, 938480, 946049, 949389, 947997, 942952, 935487, 926228, 915613, 904449, 893684, 883735, 874176, 864116, 853027, 841406, 830552, 821410, 813657, 806129, 798089, 789769, 781761, 774354, 767695, 762221, 758544, 756895, 756907, 757919, 759433, 761340, 763831, 767071, 770928, 775028, 778946, 782193, 784076, 783936, 781758, 778445, 775358, 773502, 773176, 774266, 776736, 780740, 786319, 793212, 801251, 810901, 823107, 838514, 857119, 878837, 904046, 933320, 967069, 1005831, 1050516, 1101654, 1158651, 1220405, 1286404, 1356116, 1426890, 1493132, 1548049, 1586110, 1604239]
59751A604239k214k0284l4108m3397m9082n1716n1130m7716m3013l8446l4188
59740A188945k9772k5185k0735j6342j1694p030l129m13J619L963P135J0662J3575
59727A111599J5556J7429K0238K3953K7552L0425L3107L6470M0631M5028M9220
59716A451208N3302N7757O3159O9732P6971Q3940R0184R6143J02442J08901J14515
59705B368254J18196J19383J18140J14922J10100J03654R5500Q6159P6739O8018
59695C379065N9986N2505M5996M0902L6798L2734K8403K4352K0944J7664J3862
59684C753211R643N606J899j892n841r177j0998j1362j1148j0825r692o676j728
59671C691020L965R292J4370K0278K7775L6549M5672N4462O2731P0384P7137Q2695
$$ y = [1604239, 1602025, 1581741, 1547633, 1504236, 1455154, 1403438, 1352308, 1304592, 1261579, 1223133, 1188945, 1159173, 1133988, 1113253, 1096911, 1085217, 1078187, 1075058, 1074645, 1076264, 1080227, 1087362, 1098024, 1111599, 1127155, 1144584, 1164822, 1188775, 1216327, 1246752, 1279859, 1316329, 1356960, 1401988, 1451208, 1504510, 1562267, 1625426, 1695158, 1772129, 1856069, 1946253, 2042396, 2144838, 2253739, 2368254, 2486450, 2605833, 2723973, 2838895, 2948995, 3052649, 3148149, 3234308, 3311047, 3379065, 3439051, 3491556, 3537552, 3578454, 3615252, 3647986, 3676389, 3700741, 3721685, 3739349, 3753211, 3762854, 3768460, 3770359, 3768467, 3762626, 3753449, 3742451, 3731089, 3719941, 3709116, 3699424, 3692748, 3691020, 3694985, 3704277, 3718647, 3738925, 3766700, 3803249, 3848921, 3903383, 3966114, 4036498, 4113635, 4196330]
59659D196330Q6990Q9968R1169Q9782Q5096P6718O4428M8305K9030P673j5056
59648D850433l8914o3181q6014j05348j20243j30925j37750j40683j39741j35334
59638C752300j28046j18455j07262r5300q3452p2932o5619o3561o7833p7841r1376
59627B780623j05163j15909j21871j23528j22292j18811j13067j05702r7920r0027
59617A666333q1365p2136o3984n7911n2763m6863m0373l4869l1058k8168k5390
59606A131453k2723k0388j8354j6641j5255j3766j1691r410p898p377p039o315
59594I74596n680n790o517p342q106q880r528r910j0190j0508j0681j0601j0568
59581H60295j0695j0451r369p929p021o675o130n172m564m859n481n465m596l433
$$ y = [4196330, 4283320, 4373288, 4464457, 4554239, 4639335, 4716053, 4780481, 4828786, 4857816, 4865489, 4850433, 4811519, 4748338, 4662324, 4556976, 4436733, 4305808, 4168058, 4027375, 3887634, 3752300, 3624254, 3505799, 3398537, 3303237, 3219785, 3146853, 3081234, 3017673, 2949840, 2871999, 2780623, 2675460, 2559551, 2437680, 2314152, 2191860, 2073049, 1959982, 1854280, 1756360, 1666333, 1584968, 1512832, 1448848, 1390937, 1338174, 1291311, 1250938, 1216069, 1185011, 1156843, 1131453, 1108730, 1088342, 1069988, 1053347, 1038092, 1024326, 1012635, 1003225, 995327, 987950, 980911, 974596, 968916, 963126, 956609, 949267, 941161, 932281, 922753, 912843, 902653, 892145, 881464, 870863, 860295, 849600, 839149, 829780, 821851, 814830, 808155, 802025, 796853, 792289, 787430, 781949, 776484, 771888, 768455]
59567G68455k489j887j493r98o7J200K239K854L764N680Q103R841J0613J1251
59553H17066J2232J3028J3302J3745J4984J6450J7270J7748J8921K1029K3426
59542I99201K5819K8489L1409L4325L7752M2462M7303M8907M4721L5887K6151
59531A402426J8448J3327J0089Q011O370M400J986j49j383k091l303n610q673
59518A443848j1618j3795j5250j6489j7860j9215k0247k0870k1053k0494j8882
59507A248075j6434j3772j1239q637n650k187J825O531J1863J7346K2447K6999
59495A277167L1169L5178L9175M3169M6813M9367N0162M9082M6390M2088L5855
59484A745615K7713J8430Q894o71j0480k0230k8987l6081m1584m5594m7642m7403
$$ y = [768455, 765966, 764079, 762586, 761588, 761521, 762721, 764960, 767814, 771578, 777258, 785361, 795202, 805815, 817066, 829298, 842326, 855628, 869373, 884357, 900807, 918077, 935825, 954746, 975775, 999201, 1025020, 1053509, 1084918, 1119243, 1156995, 1199457, 1246760, 1295667, 1340388, 1376275, 1402426, 1420874, 1434201, 1444290, 1452301, 1458671, 1463071, 1465057, 1464908, 1463525, 1461434, 1458131, 1452521, 1443848, 1432230, 1418435, 1403185, 1386696, 1368836, 1349621, 1329374, 1308504, 1287451, 1266957, 1248075, 1231641, 1217869, 1206630, 1197993, 1192343, 1190156, 1191981, 1198512, 1210375, 1227721, 1250168, 1277167, 1308336, 1343514, 1382689, 1425858, 1472671, 1522038, 1572200, 1621282, 1667672, 1709760, 1745615, 1773328, 1791758, 1800652, 1799981, 1789501, 1769271, 1740284, 1704203, 1662619, 1617025, 1569383, 1521980]
59472A521980m5523m3036m0151l6429l1957k7482k3215j8560j3343q425m514j164
59460A228181K317N622Q021R663J1294J2865J3486J2817J1505J0018P857M458
59448A338104K45l772p215j0667j4798j9462k3693k6560k8002k8719k9248k9444
59436A116769k9067k8493k8314k8401k7919k6293k3747k0936j8471j6700j5415
59425H53013j3845j1440q697o613n362m179k547o37J482M137P354J0880J5274
59412H38820K1483K8276L1397K7132J6639N370j837m080l162q10K392O690J2714
59399I81024K0387K7472K9946K5200J4814L564m305p563p405n611l380j120J309
59386A074332M191P515J0920J3907J6137J7659J8962K0539K2293K3625K4253K4600
$$ y = [1521980, 1476457, 1433421, 1393270, 1356841, 1324884, 1297402, 1274187, 1255627, 1242284, 1233859, 1229345, 1228181, 1230498, 1236120, 1244141, 1253804, 1265098, 1277963, 1291449, 1304266, 1315771, 1325789, 1333646, 1338104, 1338349, 1334577, 1327362, 1316695, 1301897, 1282435, 1258742, 1232182, 1204180, 1175461, 1146213, 1116769, 1087702, 1059209, 1030895, 1002494, 974575, 948282, 924535, 903599, 885128, 868428, 853013, 839168, 827728, 819031, 812418, 807056, 802877, 800330, 799693, 801175, 805312, 812666, 823546, 838820, 860303, 888579, 919976, 947108, 963747, 969117, 967280, 963200, 960038, 959228, 961620, 968310, 981024, 1001411, 1028883, 1058829, 1084029, 1098843, 1102407, 1098102, 1090539, 1083134, 1077523, 1074143, 1073023, 1074332, 1078523, 1086038, 1096958, 1110865, 1127002, 1144661, 1163623, 1184162, 1206455, 1230080, 1254333, 1278933]
59374A278933K5182K6052K7183K8793L0753L2175L2401L2097L2457L3522L4234
59363A613782L4182L4191L4979L6278L7775L9976M3354M7447N1586N6005O1316
59352B090871O7328P3267P8990Q4981R1149R6421R9753J00888J00028R7353R3064
59341C074093Q7438Q0600P2608O3876N5047M6256L7002K7007J6831P192k009j1629
59329C554312k2238l3493m4595n5182o5490p5656q5080r2770r8279j01949j04130
59318B775450j04649j03262j00281r6262r1420q5862q0177p5122p0776o6584o2261
59307A838794n8102n4356n0845m7415m4286m1708l9543l7432l5115l2553k9934
59296A367505k7572k5536k3424k0877j8149j5691j3258j0004n442J26N939J0638
$$ y = [1278933, 1304115, 1330167, 1357350, 1386143, 1416896, 1449071, 1481472, 1513569, 1546026, 1579548, 1613782, 1647964, 1682155, 1717134, 1753412, 1791187, 1831163, 1874517, 1921964, 1973550, 2029555, 2090871, 2158199, 2231466, 2310456, 2395437, 2486586, 2583007, 2682760, 2783648, 2883676, 2981029, 3074093, 3161531, 3242131, 3314739, 3378615, 3433662, 3479918, 3516920, 3543927, 3560758, 3567950, 3565941, 3554312, 3532074, 3498581, 3453986, 3398804, 3333314, 3257658, 3172578, 3079808, 2981529, 2879580, 2775450, 2670801, 2567539, 2467258, 2370996, 2279576, 2193714, 2113537, 2038415, 1967639, 1901055, 1838794, 1780692, 1726336, 1675491, 1628076, 1583790, 1542082, 1502539, 1465107, 1429992, 1397439, 1367505, 1339933, 1314397, 1290973, 1270096, 1251947, 1236256, 1222998, 1212994, 1207552, 1207678, 1213617, 1224255]
59284A224255J2014Q162l26j0030j7271k0647k0905j9227j6507j3559j0933q525
59272A106501n945l122j51L061O337Q788R732R836J0505J2033J3152J2583J0426
59259A193736P719N246L111J026j353m123o897r075j0530j1728j2959j3820j3829
59246A126524j3219j2559j1748j0109p678n680n102n269m600k737q86J06J010
59233A048053K859N139O493O760P137Q327R670J0455J1044J2112J3539J4685J5276
59220A171549J5482J5549J5861J6921J8699K0317K0863K0372J9619J9264J9481
59209A373977K0091K0705K1095K1705K3322K5875K8199K9512L0634L3001L6886
59198A665002M1351M5603M9561N3254N6503N9199O1242O2113O1148N8246N3743
$$ y = [1224255, 1236269, 1244431, 1244105, 1234075, 1216804, 1196157, 1175252, 1156025, 1139518, 1125959, 1115026, 1106501, 1100556, 1097434, 1097283, 1100344, 1106681, 1115469, 1125201, 1135037, 1145542, 1157575, 1170727, 1183310, 1193736, 1201455, 1206701, 1209812, 1210838, 1209485, 1205362, 1198465, 1189390, 1178860, 1167132, 1154173, 1140353, 1126524, 1113305, 1100746, 1088998, 1078889, 1071211, 1065531, 1060429, 1055160, 1050560, 1047823, 1046937, 1047043, 1048053, 1050912, 1056051, 1062544, 1069304, 1076441, 1084768, 1094438, 1104893, 1115937, 1128049, 1141588, 1156273, 1171549, 1187031, 1202580, 1218441, 1235362, 1254061, 1274378, 1295241, 1315613, 1335232, 1354496, 1373977, 1394068, 1414773, 1435868, 1457573, 1480895, 1506770, 1534969, 1564481, 1595115, 1628116, 1665002, 1706353, 1751956, 1801517, 1854771, 1911274, 1970473, 2031715, 2093828, 2154976, 2213222, 2266965]
59187B266965M7583L9267K8732J6710M025q989k2123l4762m6041n5270o2093o6394
59175B107610o8271o8044o6283o3717o0922n7902n4230m9728m4773l9791l4872
59164A499077l0159k6170k3294k1255j9552j8139j7222j6704j6341j6241j6633
59153A277367j7350j7999j8525j9091j9663k0178k0886k1932k2849k3059k2649
59142A053186k2102k1500k0669j9890j9586j9442j8631j6998j5274j4013j3068
59131H52013j2126j1104r835q096o073m258k731j209K30J178J758K673M148N550
59117H12118O399P043P984R113J0108J1031J2040J2887J3193J2969J2495J1889
59105I39269J1062R972Q712P415O173M882L246J188q22k147k642k628k387k045
$$ y = [2266965, 2314548, 2353815, 2382547, 2399257, 2403282, 2394293, 2372170, 2337408, 2291367, 2236097, 2174004, 2107610, 2039339, 1971295, 1905012, 1841295, 1780373, 1722471, 1668241, 1618513, 1573740, 1533949, 1499077, 1468918, 1442748, 1419454, 1398199, 1378647, 1360508, 1343286, 1326582, 1310241, 1294000, 1277367, 1260017, 1242018, 1223493, 1204402, 1184739, 1164561, 1143675, 1121743, 1098894, 1075835, 1053186, 1031084, 1009584, 988915, 969025, 949439, 929997, 911366, 894368, 879094, 865081, 852013, 839887, 828783, 818948, 810852, 804779, 800521, 797790, 796581, 796811, 797989, 799747, 802420, 806568, 812118, 818517, 825560, 833544, 842657, 852765, 863796, 875836, 888723, 901916, 914885, 927380, 939269, 950331, 960303, 969015, 976430, 982603, 987485, 990731, 991919, 991097, 988950, 986308, 983680, 981293, 979248]
59091I79248j750j480q99P5P98P16K98L23M59l27j954k982k555j474r08j022j431
59074I65135k170l399m812n966o806p378p611p776q521r998j1574j2883j4407
59061H61834j6405j8001j8210j7325j6480j6196j6222j6305j6330j5934j4874
59050F79552j3621j2801j2227j1201r673q295p371o537n523m553l801l085k279
59037E78585j532q97j83O71J530K454L752N463P186Q617R849J0940J1614J1750
59023F49799J1850J2524J3518J3767J2523J0144P543N209L102J332K65j78p53
59010G40645j922l032l039j938p41j49J25N55J055J372J621J990K205J779O36
58995G41162q74k365l613m455m775m534l796k840k191k164k354j981q35N02J475
$$ y = [979248, 977498, 976018, 975119, 975194, 975992, 976708, 977006, 977329, 977788, 977461, 975507, 972525, 969970, 968496, 967588, 966566, 965135, 962965, 959566, 954754, 948788, 941982, 934604, 926993, 919217, 910696, 900698, 889124, 876241, 861834, 845429, 827428, 809218, 791893, 775413, 759217, 742995, 726690, 710360, 694426, 679552, 665931, 653130, 640903, 629702, 620029, 611734, 604363, 597826, 592303, 587750, 583949, 580864, 578585, 577053, 576156, 575973, 576644, 578174, 580628, 584380, 589843, 597029, 605646, 615495, 626435, 638049, 649799, 661649, 674173, 687691, 701458, 713981, 724125, 731668, 736877, 739979, 741311, 741576, 741398, 740645, 738723, 735691, 732652, 730714, 729973, 729824, 729949, 730504, 731559, 732931, 734552, 736542, 738747, 740526, 741162, 740288, 737923, 734310, 729855, 725080, 720546, 716750, 713910, 711719, 709555, 707201, 705220, 704385, 704887, 706362]
58980G06362K118K601K799K665K554K772L108L217L106K938K639K136J627J207
58966G41849N56n16j531j912j897k211k912l283k988k661k948l476l290k240j402
58951G09138j875l472m901n185m534l698k901j805l18J134K264L375M867O510
58937F98599P471P100N647M217L833M465N161N243N074N309N849O096N982O028
58923G76074O448O929P345Q071R358J0962J2571J4115J5594J7061J8824K1068
58911I24420K3247K4521K4862K5060K5489K5699K5491K5549K6499K7999K9364
58900A208200L0627L2361L4820L7659M0295M2311M3713M5018M6731M8703N0441
58889A660879N1956N3720N5727N7391N8545N9666O0840O1345O0640N8926N6342
$$ y = [706362, 708480, 711081, 713880, 716545, 719099, 721871, 724979, 728196, 731302, 734240, 736879, 739015, 740642, 741849, 742405, 741889, 740358, 738446, 736549, 734338, 731426, 728143, 725155, 722494, 719546, 716070, 712780, 710540, 709138, 707263, 703791, 698890, 693705, 689171, 685473, 682572, 680767, 680449, 681583, 683847, 687222, 692089, 698599, 706070, 713170, 718817, 723034, 726867, 731332, 736493, 741736, 746810, 752119, 757968, 764064, 770046, 776074, 782522, 789451, 796796, 804867, 814225, 825187, 837758, 851873, 867467, 884528, 903352, 924420, 947667, 972188, 997050, 1022110, 1047599, 1073298, 1098789, 1124338, 1150837, 1178836, 1208200, 1238827, 1271188, 1306008, 1343667, 1383962, 1426273, 1469986, 1515004, 1561735, 1610438, 1660879, 1712835, 1766555, 1822282, 1879673, 1938218, 1997884, 2058724, 2120069, 2180709, 2239635, 2295977]
58878B295977N2416M6931M0476L3642K6311J8347J0147K001o363j4847k2484k8623
58866B453931l3925l9299m4506m8738n2017n4972n7681n9691o0935o1703o1956
58855A878508o1381o0022n8190n6040n3724n1588m9701m7649m5288m3110m1273
58844A310542l9087l6164l3264l1026k8751k5626k2429k0508j9551j7851j4729
58833A021556j1228q484o678n621n104m479l076j296k65k17k52J48N35P07J340
58818I77586K894M764O179P157Q109R074R816J0231J0305J0147J0251J1134J2543
58805A090190J3631J4186J4954J6450J8186J9527K0752K2631K5378K8520L1579
58794A315984L4497L7487M0823M4542M8196N1045N2749N3815N5181N7297N9648
$$ y = [2295977, 2348393, 2395324, 2435800, 2469442, 2495753, 2514100, 2524247, 2526248, 2519885, 2505038, 2482554, 2453931, 2420006, 2380707, 2336201, 2287463, 2235446, 2180474, 2122793, 2063102, 2002167, 1940464, 1878508, 1817127, 1757105, 1698915, 1642875, 1589151, 1537563, 1487862, 1440213, 1394925, 1351815, 1310542, 1271455, 1235291, 1202027, 1171001, 1142250, 1116624, 1094195, 1073687, 1054136, 1036285, 1021556, 1010328, 1001844, 995166, 989545, 984441, 979962, 976886, 975590, 975325, 975108, 974856, 975004, 975539, 976246, 977586, 980480, 985244, 991423, 998580, 1006689, 1015763, 1025579, 1035810, 1046115, 1056262, 1066513, 1077647, 1090190, 1103821, 1118007, 1132961, 1149411, 1167597, 1187124, 1207876, 1230507, 1255885, 1284405, 1315984, 1350481, 1387968, 1428791, 1473333, 1521529, 1572574, 1625323, 1679138, 1734319, 1791616, 1851264]
58783A851264O1142O1098N9878N8319N6498N3441M8299M1374L3598K5368J6504
58772B366783P004k785j2606k2275l1340l9292m6101n2028n6957o0445o2407o3252
58760A924299o3375o2922o2057o0949n9558n7693n5336n2581m9463m6144m3053
58749A311168m0444l8090l5673l3214l0754k8026k4902k1806j9199j7014j5050
58738A006996j3400j1943j0063p614n598m969n248n316n139n589o816p957q466
58725I08878q642q776q721q418q014p282n690l237o69J160J732R87m37j503k121
58710H49247l712p455j2415j6524j9064k0945k2819k4320k5197k5694k5644k4482
58698F20976k2480k0688j9318j7478j4883j2602j1496j1035j0207q722o770m557
$$ y = [1851264, 1912406, 1973504, 2033382, 2091701, 2148199, 2201640, 2249939, 2291313, 2324911, 2350279, 2366783, 2373787, 2371002, 2358396, 2336121, 2304781, 2265489, 2219388, 2167360, 2110403, 2049958, 1987551, 1924299, 1860924, 1798002, 1735945, 1674996, 1615438, 1557745, 1502409, 1449828, 1400365, 1354221, 1311168, 1270724, 1232634, 1196961, 1163747, 1132993, 1104967, 1080065, 1058259, 1039060, 1022046, 1006996, 993596, 981653, 971590, 963976, 958378, 953409, 948161, 942845, 937706, 932117, 925301, 917344, 908878, 900236, 891460, 882739, 874321, 866307, 859025, 853335, 850098, 849429, 850589, 852321, 853308, 852871, 851368, 849247, 845535, 838080, 825665, 809141, 790077, 769132, 746313, 721993, 696796, 671102, 645458, 620976, 598496, 577808, 558490, 541012, 526129, 513527, 502031, 490996, 480789, 472067, 465297, 460740]
58686D60740k577j528j345j097k90N18P10L95l01j670l548m909n101m743m686
58671D30568m702m026k657j298k56Q47K297L781M659M660M201L942L856L091J231
58656D50194p40j497j152r31j262j246j57J616L391M889N867O076N946O276O859
58641D84129O494M893L481L544M504M898M366L779L801M106L847K381j79k879
58627E31165m720n605o043o063n280m077l636m353n280n682o045o862p431o838
58613D53250n442m309l646k751j265M34J913L151M300N521O945Q510R917J1019
58599D87547J1998J2978J3753J4174J4535J5313J6691J8451K0127K1239K1653
58588F68459K1757K2019K2472K2898K3192K3100K1998J9580J6542J3758J1082
$$ y = [460740, 458163, 456635, 455290, 454193, 453903, 454421, 455131, 455526, 455225, 453555, 450007, 445098, 439997, 435254, 430568, 425866, 421840, 419183, 417885, 417629, 418476, 420773, 424554, 429213, 433873, 438074, 442016, 445872, 448963, 450194, 449454, 447957, 446805, 445874, 444612, 443366, 443209, 444825, 448216, 453105, 458972, 465048, 470994, 477270, 484129, 490623, 495516, 498997, 502541, 507045, 511943, 516309, 520088, 523889, 527995, 531842, 534223, 534044, 531165, 526445, 520840, 514797, 508734, 503454, 499377, 495741, 491388, 486108, 480426, 474381, 467519, 460088, 453250, 447808, 443499, 439853, 437102, 435837, 436271, 438184, 441335, 445635, 451156, 458101, 466611, 476528, 487547, 499545, 512523, 526276, 540450, 554985, 570298, 586989, 605440, 625567, 646806, 668459, 690216, 712235, 734707, 757605, 780797, 803897, 825895, 845475, 862017, 875775, 886857]
58577H86857P776L907K88k742n431p573q551q522q383q399p945o846n815n307
58563H23314n011m682m512m391l942l463l695m434m670m416m962o839q891j0063
58549G49343j0797j1919j3244j4222j4946j5707j6303j6483j6362j5852j4534
58538E88974j2591j0937r983r216q356p847p689p003n409l751k799k255j709j470
58524D97959j724j863j369m56O48K030L177K975J284o54k006l266m759n626n232
58509D81118m310l685l071k101j346j230j095l91K91M23O07J313J784J408J123
58494D70838K056L685M669M767M674M645M525M510M805N075N060N048N058M462
58480E33877L233K430K644L031K815K451K312J674K20q09n37k02j341l278m241
$$ y = [886857, 894633, 898540, 898828, 896086, 890655, 883082, 874531, 866009, 857626, 849227, 841282, 834436, 828621, 823314, 818303, 813621, 809109, 804718, 800776, 797313, 793618, 789184, 784514, 780098, 775136, 768297, 759406, 749343, 738546, 726627, 713383, 699161, 684215, 668508, 652205, 635722, 619360, 603508, 588974, 576383, 565446, 555463, 546247, 537891, 530044, 522355, 515352, 509943, 506192, 503393, 501138, 499429, 497959, 496235, 494372, 493003, 492547, 493195, 495225, 498402, 501377, 502661, 502007, 500001, 496735, 491976, 486350, 481118, 476808, 473123, 470052, 467951, 466605, 465375, 464280, 463889, 464180, 464603, 465210, 466523, 468307, 469715, 470838, 472894, 476579, 481248, 486015, 490689, 495334, 499859, 504369, 509174, 514249, 519309, 524357, 529415, 533877, 537110, 539540, 542184, 545215, 548030, 550481, 552793, 554467, 554687, 553878, 553341, 553139, 551798, 548520, 544279]
58465E44279m042l857m028l845l146k493k051j646j479j616j294K1J441J764J237
58450E19245R96J370J900K471L143L430K964K380K454K937L242L559M151M401
58436E58643L726K780K508K793L094L549M284M612M196M041M914N751N226L977
58422F14094L660M511N440N935O224O201N741N546O242P113P070O313N715N287
58408F95092M586L936L840L868L464L111L373L633L142K517K740L537M053M312
58394G45204M599M485L803L525M123M327L164J909K127L084L160K620K724L186
58380G92040K862K122K159K632K343J645J926L180M252M956N821O355N779M983
58366H43055N501O994P875P989Q462R335R591R267R385R965J0107R826R940J0457
$$ y = [544279, 540237, 536380, 532352, 528507, 525361, 522868, 520817, 519171, 517692, 516076, 514782, 514803, 516244, 518008, 519245, 520241, 521611, 523511, 525982, 529125, 532555, 535519, 537899, 540353, 543290, 546532, 550091, 554242, 558643, 562369, 565149, 567657, 570450, 573544, 577093, 581377, 585989, 590185, 594226, 599140, 604891, 610117, 614094, 617754, 622265, 627705, 633640, 639864, 646065, 651806, 657352, 663594, 670707, 677777, 684090, 689805, 695092, 699678, 703614, 707454, 711322, 714786, 717897, 721270, 724903, 728045, 730562, 733302, 736839, 740892, 745204, 749803, 754288, 758091, 761616, 765739, 770066, 773230, 775139, 777266, 780350, 783510, 786130, 788854, 792040, 794902, 797024, 799183, 801815, 804158, 805803, 807729, 810909, 815161, 820117, 825938, 832293, 838072, 843055, 848556, 855550, 863425, 871414, 879876, 889211, 898802, 908069, 917454, 927419, 937526, 947352, 957292, 967749]
58352I67749J0790J1088J1703J1981J1361J0843J1536J2658J2963J3020J3988
58341A099680J5207J5405J5148J5636J6084J4996J3122J2389J2732J2709J2402
58330A255510J2861J3510J3104J2543J3634J5658J6244J5306J4965J5922J6940
58319A416197J7633J8751J9914J9990J9561K0143K1334K1530K1076K1698K3262
58308A641089K4147K4431K5609K7477K8386K8265K8397K8584K7718K6685K7448
58297A938236K9568L0851L0980L1325L1791L1287L0667L1681L3607L4496L4984
58286B289473L7070L9892M0990M1020M2815M6138M7997M8013M8910N1494N3716
58275B787528N4931N6720N9137O0502O1201O3461O7168P0061P2144P5637Q0491
$$ y = [967749, 978539, 989627, 1001330, 1013311, 1024672, 1035515, 1047051, 1059709, 1072672, 1085692, 1099680, 1114887, 1130292, 1145440, 1161076, 1177160, 1192156, 1205278, 1217667, 1230399, 1243108, 1255510, 1268371, 1281881, 1294985, 1307528, 1321162, 1336820, 1353064, 1368370, 1383335, 1399257, 1416197, 1433830, 1452581, 1472495, 1492485, 1512046, 1532189, 1553523, 1575053, 1596129, 1617827, 1641089, 1665236, 1689667, 1715276, 1742753, 1771139, 1799404, 1827801, 1856385, 1884103, 1910788, 1938236, 1967804, 1998655, 2029635, 2060960, 2092751, 2124038, 2154705, 2186386, 2219993, 2254489, 2289473, 2326543, 2366435, 2407425, 2448445, 2491260, 2537398, 2585395, 2633408, 2682318, 2733812, 2787528, 2842459, 2899179, 2958316, 3018818, 3080019, 3143480, 3210648, 3280709, 3352853, 3428490, 3508981]
58264C508981Q4350Q6844Q9646R2554R4058R5317R8660J02702J04105J03629J04957
58253D565803J08205J10523J12542J17671J25193J30891J34712J40892J50010
58244E696442J58054J64204J72234J82996J92826K00926K11116K24568K37769
58235G441135K49494K62855K78795K94527L10016L28820L51030L72740L93909
58226A0283321M19076M48860M78873N08668N43250N84048O27150O72311P24529
58217A5290086P84646Q48052R15009R92390J082752J181917J290158J415101J560720
58208B5360831J724537J908975K124213K376670K666554K999924L390696L847518
58200D6399918M372273M974839N675281O488962P426675Q514047R793645J1302487
$$ y = [3508981, 3593331, 3680175, 3769821, 3862375, 3956433, 4051750, 4150410, 4253112, 4357217, 4460846, 4565803, 4674008, 4784531, 4897073, 5014744, 5139937, 5270828, 5405540, 5546432, 5696442, 5854496, 6018700, 6190934, 6373930, 6566756, 6767682, 6978798, 7203366, 7441135, 7690629, 7953484, 8232279, 8526806, 8836822, 9165642, 9516672, 9889412, 10283321, 10702397, 11151257, 11630130, 12138798, 12682048, 13266096, 13893246, 14565557, 15290086, 16074732, 16922784, 17837793, 18830183, 19912935, 21094852, 22385010, 23800111, 25360831, 27085368, 28994343, 31118556, 33495226, 36161780, 39161704, 42552400, 46399918, 50772191, 55747030, 61422311, 67911273, 75337948, 83851995, 93645640, 104948127]
58192A04948127J3062833J5092356J7390263J9888583K2408037K4623423K6014491
58185B43428113K5873065K3508538J8629398J1625471L495340m532225j1415974
58178C10611726j6553949j9819122k1414626k1659094k0858799j9304003j7254508
58171A73747625j4858047j2183532r474114p317410o356692o725095p847429q882848
58163A00102458r326033r168266q627130p885919p060691o243754n488080m795341
58155D1507244m160841l602681l131798k730119k378249k077000j826527j610604
58147A9989425j417085j252179j120778j011443r12768q27613p60154p03949o52475
58138A1330981o07749n70079n32113m90559m51875m19728l88529l55046l24666
$$ y = [104948127, 118010960, 133103316, 150493579, 170382162, 192790199, 217413622, 243428113, 269301178, 292809716, 311439114, 323064585, 326559925, 322027700, 310611726, 294057777, 274238655, 252824029, 231164935, 210306136, 191002133, 173747625, 158889578, 146706046, 137231932, 129914522, 123557830, 116832735, 108985306, 100102458, 90776425, 81608159, 72981029, 65095110, 58034419, 51790665, 46302585, 41507244, 37346403, 33743722, 30611924, 27881805, 25503556, 23426556, 21600029, 19989425, 18572340, 17320161, 16199383, 15187940, 14275172, 13447559, 12687405, 11983456, 11330981, 10723232, 10153153, 9621040, 9130481, 8678606, 8258878, 7870349, 7515303, 7190637]
58129G190637l00464k77715k54985k39202k33442k30276k23253k15089k08752
58120E007459k00464j87721j75111j65970j56612j44456j33731j27543j22111
58111C593740j14256j07139j03245r9103r2224q6307q4178q2313p7626p3209p2053
58100B602087p1261o7804o4228o3317o2578n9212n5492n4070n2749m8850m4351
58089A958175m1856l9804l6245l3213l2767l2697l0655k8779k9755l1806l2012
58078A588586l1358l2191l3605l3437l2297l1837l1453l0020k8486k7740k6415
58067A249747k3701k1601k1651k2048k0878j9371j9195j9190j7768j6067j5795
58056A032482j6236j6042j5791j6310j6605j5779j4915j4994j5120j4638j4618
$$ y = [7190637, 6890173, 6612458, 6357473, 6118271, 5884829, 5654553, 5431300, 5216211, 5007459, 4806995, 4619274, 4444163, 4278193, 4121581, 3977125, 3843394, 3715851, 3593740, 3479484, 3372345, 3269100, 3169997, 3077773, 2991466, 2907288, 2824975, 2747349, 2674140, 2602087, 2530826, 2463022, 2398794, 2335477, 2272899, 2213687, 2158195, 2104125, 2051376, 2002526, 1958175, 1916319, 1876515, 1840270, 1807057, 1774290, 1741593, 1710938, 1682159, 1652404, 1620598, 1588586, 1557228, 1525037, 1491432, 1457995, 1425698, 1393861, 1362408, 1332388, 1303902, 1276162, 1249747, 1226046, 1204445, 1182794, 1160746, 1139868, 1120497, 1101302, 1082112, 1064344, 1048277, 1032482, 1016246, 1000204, 984413, 968103, 951498, 935719, 920804, 905810, 890690, 876052, 861434]
58045H61434j5418j5378j3768j2482j2837j3323j2439j1144j0601j0179r523r829
58033G14513j1193j1500r903q526q791r069q066p436q600r939r726r082r450r698
58019E83534q509p191p388q167p899o975o337n402l798k967l745m413l461k185
58005E05097k271k907k612j868j696j541q11n16j234j424M3J689J825J185J014
57990D93973P41l39j096n95m5n82j128o20k57j215k250j935j195j304j398m77
57974D80278K63l55j012k33Q35O96N11J863L360K632K61j401k060l149m733n660
57958D72096n949o472p100p381q016r483j0401r577q304q261q551p398n473m778
57944C64952n302n529n245n224m988l506j342K47J454K944L858L360K900M256
$$ y = [861434, 846016, 830638, 816870, 804388, 791551, 778228, 765789, 754645, 744044, 733865, 724342, 714513, 703320, 691820, 681917, 673391, 664600, 655531, 647465, 640029, 631429, 621490, 611764, 602682, 593232, 583534, 575025, 567834, 560446, 552279, 544380, 537405, 531068, 525666, 521868, 518901, 515156, 510743, 507282, 505097, 502826, 499919, 497307, 495439, 493743, 492202, 491391, 490875, 489641, 488217, 488260, 489949, 491774, 492959, 493973, 494714, 494375, 493279, 492684, 492639, 492057, 490929, 490309, 490052, 488837, 486587, 484652, 483457, 482153, 480755, 480278, 480541, 480186, 479174, 478941, 479776, 480472, 480983, 482846, 486206, 488838, 489099, 487698, 485638, 482489, 477756, 472096, 466147, 459675, 452575, 445194, 437178, 427695, 417294, 407717, 399413, 391152, 382601, 375203, 369730, 364952, 359650, 354121, 348876, 343652, 338664, 335158, 333816, 334063, 335517, 338461, 342319, 345679, 348579, 352835]
57930C52835O328O703N527M898N097M544L005J932J717J342O49M18K55j063l128
57915C91059m160l791l398l626l792l718m060m692m744m343m514n353o034o456
57901C28378p193p996q176q111q577q921p890o003n102n577n974n379m314l265
57887B35900k103j040n51k90M73J442J770J634J884K400K370J835J419R43j02
57872B47984j180j405j178j455j928j675j059j113j539j301o86q03j358j141l37
57857B29826k02o42l46P53J425J525K218L566M191L685L270L618L949L766L573
57842B64175L340K162J19j251j165p02j057j969k627k908l087l202l262l294l090
57827B42182k629k569l279l757k772p89O38J078J362J793J883J767K153K827K904
$$ y = [352835, 359163, 365866, 371393, 376291, 381388, 385932, 388937, 390869, 392586, 393928, 394577, 394995, 395250, 394187, 391059, 386899, 383108, 379710, 376084, 372292, 368574, 364514, 359822, 355078, 350735, 346221, 340868, 334834, 328378, 321185, 313189, 305013, 296902, 288325, 279404, 271514, 265511, 260409, 254832, 248858, 243479, 239165, 235900, 233797, 232757, 232206, 231916, 232389, 233831, 235601, 237235, 239119, 241519, 243889, 245724, 247143, 248086, 247984, 246804, 245399, 244221, 242766, 240838, 239163, 238104, 236991, 235452, 234151, 233465, 232662, 231304, 230163, 229826, 229624, 228982, 228636, 229389, 230814, 232339, 234557, 238123, 242314, 245999, 249269, 252887, 256836, 260602, 264175, 267515, 269677, 269796, 268545, 267380, 266678, 265621, 263652, 261025, 258117, 255030, 251828, 248566, 245272, 242182, 239553, 236984, 233705, 229948, 227176, 226387, 227025, 228103, 229465, 231258, 233141, 234908, 237061, 239888, 242792]
57812B42792K538K685L115K492P00p00o83Q8O51P31J13j402l042l573l036k540
57796B40929k205j063P99J889J679J540K505L760M219M124M148M099L519K530
57782B72472J384J05r05q71J62J140J482J817K716L764M349M520M544M454M398
57767C05531M631M885M593L911L543L432K687J071n64j667k783m489o418p829
57753C10534q446q502q481q867r469r293p825o039n086m502l104j211l34p67j277
57738B27331j207j195j552j674j375j217j106k27J223J934J600J490K309L143
57724B29477L263L297L774M012L491K945L049L324L266L335L793L800K845J954
57710B75625K272L336L958M022M259M893N688O799Q508J0458J2073J3416J4893
$$ y = [242792, 245330, 248015, 251130, 253622, 254322, 253622, 252939, 253027, 253678, 254409, 254522, 253120, 250078, 246505, 243469, 240929, 238724, 237661, 238460, 240349, 242028, 243568, 246073, 249833, 254052, 258176, 262324, 266423, 269942, 272472, 273856, 273961, 273056, 272185, 272347, 273487, 274969, 276786, 279502, 283266, 287615, 292135, 296679, 301133, 305531, 310162, 315047, 319640, 323551, 327094, 330526, 333213, 334284, 333720, 332053, 329270, 324781, 318363, 310534, 302088, 293586, 285105, 276238, 266769, 257476, 249651, 243612, 238526, 234024, 230920, 229709, 229375, 228608, 227331, 226124, 224929, 223377, 221703, 220328, 219111, 218005, 217778, 219001, 220935, 222535, 224025, 226334, 229477, 232740, 236037, 239811, 243823, 247314, 250259, 253308, 256632, 259898, 263233, 267026, 270826, 273671, 275625, 277897, 281233, 285191, 289213, 293472, 298365, 304053, 310852, 319360, 329818, 341891, 355307, 370200]
57697C70200J6243J6548J5037J1527O454Q30m088p486r269r687r182q477q064
57684C80586p481n859l299r04P16K120M049O629R801J3619J7792K1806K5897L1143
57670D96615L8300M7323N8340P2247Q9499J08141J22725J25230J08848P3372K7446
57659A368086j6073m8016o6445p3838p3217o7262n8708m9679m1131l3502k7164
57648H13051k1913j7150j3057j0578r897r984j0136j0701j1916j3183j4127j5080
57636F55329j5961j5926j4854j3937j3997j4307j3897j2968j2134j1261r966q536
57624D97585p509o929o635o525o186n098l641k869k892k629j615p39n65k42R68
57609D44479K338K899K968L446M489N746P096Q285Q776Q683Q929R723J0053R499
$$ y = [370200, 386443, 402991, 418028, 429555, 436009, 436839, 432751, 425265, 415996, 406309, 397127, 388650, 380586, 373105, 367246, 363947, 363043, 363759, 365879, 369928, 376557, 386358, 399977, 417769, 439575, 465472, 496615, 534915, 582238, 640578, 712825, 802324, 910465, 1033190, 1158420, 1267268, 1340640, 1368086, 1352013, 1303997, 1237552, 1163714, 1090497, 1023235, 964527, 914848, 873717, 840215, 813051, 791138, 773988, 760931, 750353, 740456, 730472, 720336, 709635, 697719, 684536, 670409, 655329, 639368, 623442, 608588, 594651, 580654, 566347, 552450, 539482, 527348, 516087, 506121, 497585, 490076, 483147, 476512, 469987, 463801, 458703, 455062, 452193, 449301, 446672, 445057, 444318, 443753, 443511, 444479, 446817, 449716, 452684, 456130, 460619, 466365, 473461, 481746, 490522, 499205, 508134, 517857, 527910, 537409]
57595E37409R326J0612J2453J3278J3027J2736J2747J2607J2064J0983Q905N889
57583F72036L076J298k76k911o292r105j1035j2840j4694j5832j5882j5461j5218
57570E56864j5129j4798j3964j2670j1399j0761j0723j0442r296p618o090m924
57558D29050l999l188k115l73J637K852L011L116L919M983N857O980Q577R702
57544D70009R582Q959Q903R089Q523P367O654O641O599N995M852L200J219l67
57530E57225r43q70r52j328j650j959k583l389l913l900l287k036n29M65Q19J346
57514E32516K529L653L961L887M320N355O602Q063R754J1141J1874J2430J3186
57501F29271J3639J3389J3122J3540J4094J3967J3487J3341J3113J1976J0230
$$ y = [537409, 546735, 557347, 569800, 583078, 596105, 608841, 621588, 634195, 646259, 657242, 666147, 672036, 675112, 676410, 676134, 673223, 666931, 657826, 646791, 633951, 619257, 603425, 587543, 572082, 556864, 541735, 526937, 512973, 500303, 488904, 478143, 467420, 456978, 447682, 440064, 433974, 429050, 425051, 421863, 419748, 419375, 421012, 423864, 426875, 429991, 433910, 438893, 444750, 451730, 460307, 470009, 479591, 488550, 497453, 506542, 515065, 522432, 529086, 535727, 542326, 548321, 553173, 556373, 557592, 557225, 556282, 555412, 554460, 553132, 551482, 549523, 546940, 543551, 539638, 535738, 532451, 530415, 529886, 530351, 531170, 532516, 535045, 538698, 542659, 546546, 550866, 556221, 562823, 570886, 580640, 591781, 603655, 616085, 629271, 642910, 656299, 669421, 682961, 697055, 711022, 724509, 737850, 750963, 762939, 773169]
57490G73169Q721P228M902J933n95k348l872n363o548p584q812r693r379q200
57476G33559p441p529p642p105o116n068m127l531l409l273k543j404l82O16J885
57461F76490K953L126K850L242M444N533O051O461P123P842Q494R126R433R102
57447G62270Q654Q937R874J0703J1397J2666J4516J5969J6454J6443J6486J6551
57435I20920J6535J6527J6341J5529J4054J2329J0492Q393O265M585L210J483
57423A046663o90k659l982m844n473n818n931n951n705m929l842k904k049q63
57409I91023N67J656K125K286K574L282M442N504N594M747M204M804N765O065
57395A044638O187P171Q611R212Q876Q589Q458P665O455O295P605Q988R310R150
$$ y = [773169, 781890, 789118, 794020, 795953, 795358, 793010, 789138, 783775, 777227, 769643, 760831, 751138, 741759, 733559, 726118, 718589, 710947, 703842, 697726, 692658, 688531, 685000, 681591, 678318, 675775, 674371, 673989, 674605, 676490, 679443, 682569, 685419, 688661, 693105, 698638, 704689, 711150, 718273, 726115, 734609, 743735, 753168, 762270, 770924, 779861, 789735, 800438, 811835, 824501, 839017, 854986, 871440, 887883, 904369, 920920, 937455, 953982, 970323, 985852, 999906, 1012235, 1022727, 1031120, 1037385, 1041970, 1045180, 1046663, 1045973, 1043314, 1039332, 1034488, 1029015, 1023197, 1017266, 1011315, 1005610, 1000681, 996839, 993935, 991886, 991023, 991590, 993246, 995371, 997657, 1000231, 1003513, 1007955, 1013459, 1019053, 1023800, 1028004, 1032808, 1038573, 1044638, 1050825, 1057996, 1066607, 1075819, 1084695, 1093284, 1101742, 1109407, 1115862, 1122157, 1129762, 1138750, 1148060, 1157210]
57381A157210R493J0161J0376R959R290Q759Q728R390J0267J0551J0181R895J0040
57368A284300J0169R936R594R369R144R006R279R868J0323J0645J1205J1857J2049
57355A416744J1819J1696J1657J1290J0987J1711J3267J4226J3972J3522J3823
57344A554714J4378J4373J3998J3894J4108J4347J4556J4621J4254J3676J3703
57333A710622J4598J5549J5844J5809J5997J6209J5924J5191J4513J4269J4558
57322A879083J5176J5578J5413J5274J6081J7637J8683J8645J8262J8199J8083
57311B066114J7468J6743J6407J6371J6549J7208J8168J8544J8049J7583J7789
57300B256993J7990J7487J6921J7224J7908J7697J6437J5253J4978J5420J6096
$$ y = [1157210, 1166703, 1176864, 1187240, 1197199, 1206489, 1215248, 1223976, 1233366, 1243633, 1254184, 1264365, 1274260, 1284300, 1294469, 1304405, 1313999, 1323368, 1332512, 1341518, 1350797, 1360665, 1370988, 1381633, 1392838, 1404695, 1416744, 1428563, 1440259, 1451916, 1463206, 1474193, 1485904, 1499171, 1513397, 1527369, 1540891, 1554714, 1569092, 1583465, 1597463, 1611357, 1625465, 1639812, 1654368, 1668989, 1683243, 1696919, 1710622, 1725220, 1740769, 1756613, 1772422, 1788419, 1804628, 1820552, 1835743, 1850256, 1864525, 1879083, 1894259, 1909837, 1925250, 1940524, 1956605, 1974242, 1992925, 2011570, 2029832, 2048031, 2066114, 2083582, 2100325, 2116732, 2133103, 2149652, 2166860, 2185028, 2203572, 2221621, 2239204, 2256993, 2274983, 2292470, 2309391, 2326615, 2344523, 2362220, 2378657, 2393910, 2408888, 2424308, 2440404]
57289B440404J6727J7064J6952J6622J6412J6283J6080J6104J6819J8082J9136
57278B626685J9442J9145J8756J8633J8690J8498J7770J6828J6255J6097J5820
57267B822619J5192J4633J4470J4432J4223J3998J3902J3625J2932J2186J1834
57256B974046J1751J1512J1012J0452J0027R934J0314J0897J1069J0697J0404
57245C092115J0727J1394J1873J2132J2394J2512J2240J1869J1937J2421J2687
57234C224301J2326J1631J1207J1340J1804J2165J2193J2017J1873J1804J1729
57223C354390J1582J1265J0706J0192J0247J0817J1058J0506R991J0496J1477
57212C472727J1467J0241R175R284J0020J0464J0594J0759J0761J0267R618R463
$$ y = [2440404, 2457131, 2474195, 2491147, 2507769, 2524181, 2540464, 2556544, 2572648, 2589467, 2607549, 2626685, 2646127, 2665272, 2684028, 2702661, 2721351, 2739849, 2757619, 2774447, 2790702, 2806799, 2822619, 2837811, 2852444, 2866914, 2881346, 2895569, 2909567, 2923469, 2937094, 2950026, 2962212, 2974046, 2985797, 2997309, 3008321, 3018773, 3028800, 3038734, 3049048, 3059945, 3071014, 3081711, 3092115, 3102842, 3114236, 3126109, 3138241, 3150635, 3163147, 3175387, 3187256, 3199193, 3211614, 3224301, 3236627, 3248258, 3259465, 3270805, 3282609, 3294774, 3306967, 3318984, 3330857, 3342661, 3354390, 3365972, 3377237, 3387943, 3398135, 3408382, 3419199, 3430257, 3440763, 3450754, 3461250, 3472727, 3484194, 3494435, 3503610, 3512894, 3522914, 3533378, 3543972, 3554731, 3565492, 3575759, 3585377, 3594840]
57200C594840R851J0172R885R087Q544R115J0714J2073J2062J1091J0426J0277
57188C718137R660Q119O446N302M350L189K142J490Q80P6n25p82j404k979n050
57173C749051o730p609p643o931o135o275p413q290p947o944o311o089n756n346
57159C653632n160m928m223l308k720k369j805j104p55r43j527k456l671m858
57145C613805n807o655p456p977q312r029j0187j0935j0653r894r399q855p450
57132C501196n251l118j516j55J506L866O975J0128J2161J2724J2852J3778J5666
57119C580812J8106K1190K5275L0153L5348M0984M7595N5346O4033P3618Q4272
57108D076732R6224J10053J26683J46648J69923J96908K28841K66670L10382L60266
$$ y = [3594840, 3604691, 3614863, 3624748, 3633835, 3642379, 3651494, 3662208, 3674281, 3686343, 3697434, 3707860, 3718137, 3727797, 3735916, 3742362, 3747664, 3752014, 3755203, 3757345, 3758835, 3759715, 3759791, 3759266, 3758484, 3757080, 3754101, 3749051, 3742321, 3734712, 3727069, 3720138, 3714003, 3707728, 3700315, 3692025, 3684078, 3677134, 3670823, 3664734, 3658978, 3653632, 3648472, 3643544, 3639321, 3636013, 3633293, 3630924, 3629119, 3628015, 3627260, 3626317, 3624790, 3622334, 3618663, 3613805, 3607998, 3601343, 3593887, 3585910, 3577598, 3568569, 3558382, 3547447, 3536794, 3526900, 3517501, 3508646, 3501196, 3495945, 3492827, 3491311, 3491156, 3492662, 3496528, 3503503, 3513631, 3525792, 3538516, 3551368, 3565146, 3580812, 3598918, 3620108, 3645383, 3675536, 3710884, 3751868, 3799463, 3854809, 3918842, 3992460, 4076732, 4172956, 4283009, 4409692, 4556340, 4726263, 4923171, 5152012, 5418682, 5729064, 6089330]
57098F089330M18028M85568N63293O50669P47848Q55548R73536J100251J233386
57089A3117457J369633J503760J628855J737342J821157J871559J880097J839939
57081B6769799J746016J595033J387266J128568Q29679N03549J64024j73920m95324
57072C3454690p88234j045373j262934j438734j571858j663021j714472j729613
57064B2240451j712752j668568j601571j516391j418451j313581j206633j100820
57056A0701684r98277r00755q09620p25707o49390n80562n18748m63486m14553
57047D640586l71506l33343k99124k68648k42034k18898j98430j80051j63459
57038B365093j48336j34539j22292j11576j01673r1936q2777p5111o9021o3569
$$ y = [6089330, 6507358, 6992926, 7556219, 8206888, 8954736, 9810284, 10783820, 11884071, 13117457, 14487090, 15990850, 17619705, 19357047, 21178204, 23049763, 24929860, 26769799, 28515815, 30110848, 31498114, 32626682, 33456361, 33959910, 34123934, 33950014, 33454690, 32666456, 31621083, 30358149, 28919415, 27347557, 25684536, 23970064, 22240451, 20527699, 18859131, 17257560, 15741169, 14322718, 13009137, 11802504, 10701684, 9703407, 8802652, 7993032, 7267325, 6617935, 6037373, 5518625, 5055139, 4640586, 4269080, 3935737, 3636613, 3367965, 3125931, 2907033, 2708603, 2528552, 2365093, 2216757, 2082218, 1959926, 1848350, 1746677, 1654741, 1571964, 1496853, 1427832, 1364263]
57028A364263n7824n1502m4663l7372k9688k1723j3647n424L704J5232L0178M8573
57016A200107P1321J00887J35765J63175J62379J21171M9338k7284q6330j21196
57006A769333j37007j40620j36522j27819j16682j04063r0798p8457o8095n9198
56996G10072n0943m3554l7392l1865k6407k1679j8516j6478j4563j2708j1348
56985D24619j0108q217n984m571m487n165o045p201q764j0463j1834j2507j2350
56972C16923j1653j1060j0833j0453r274p419n600m237l119j812MK345M769O536
56958B55117P305P588Q164R022R219P776M623O97k831n430p313q755r534r322
56944B66326q372p327o454n476m205k780j294M12K396M495O571Q561J0248J1405
$$ y = [1364263, 1306439, 1254937, 1210274, 1172902, 1143214, 1121491, 1107844, 1102420, 1106124, 1121356, 1151534, 1200107, 1271428, 1372315, 1508080, 1671255, 1833634, 1954805, 2004143, 1976859, 1890529, 1769333, 1632326, 1491706, 1355184, 1227365, 1110683, 1006620, 915822, 837365, 769270, 710072, 659129, 615575, 578183, 546318, 519911, 498232, 479716, 463238, 448675, 435967, 424619, 414511, 406294, 400310, 395739, 391252, 386087, 380042, 372841, 364077, 353614, 341780, 329273, 316923, 305270, 294210, 283377, 272924, 263650, 256231, 250631, 246394, 243275, 241463, 241467, 243812, 248581, 255117, 262422, 270010, 278174, 287196, 296415, 304191, 308814, 309511, 306680, 301250, 293937, 285182, 275648, 266326, 257954, 250627, 244173, 238697, 234492, 231712, 230418, 230830, 233226, 237721, 244292, 252853, 263101, 274506]
56930B74506J2138J2568J2185J0118O250J513l055p038j0236j2310j3244j3706
56918B69689j4356j4909j4411j2433r747p687o962p089p040o289n066l703k278
56905A57719j088p45j264j577p46P22J511J267Q69J098J869K808L742M530N150
56890A75865O028P616R540J0907J1462J1751J1964J1464R712O937L709M48k430
56877B74973m506n759o456o538n686m080k352p34J127L374N719Q168J1144J4599
56863B82993J7873K0694K3581K6819K9665L0963K9971K6365K0217J2421M544k266
56851E23840p819j2199j5200j6717j7028j6295j4295j0989o823k212K750P864
56839D14877J2817J7749K3156K9013L4709L9966M4776M8092M7704M2154L2047
$$ y = [274506, 286644, 299212, 311397, 321515, 327765, 329278, 326223, 319185, 308949, 296639, 283395, 269689, 255333, 240424, 226013, 213580, 203833, 196146, 189184, 182095, 175055, 168766, 163700, 159997, 157719, 156631, 155886, 154622, 153045, 152299, 153021, 154532, 155799, 156668, 157766, 159635, 162443, 166185, 170715, 175865, 181893, 189509, 199049, 209956, 221418, 233169, 245133, 256597, 266309, 273246, 276955, 277403, 274973, 270467, 264708, 258252, 251714, 246028, 241948, 239596, 238862, 239989, 243363, 249082, 257250, 268394, 282993, 300866, 321560, 345141, 371960, 401625, 432588, 462559, 488924, 509141, 521562, 526106, 523840, 516021, 503822, 488622, 471905, 454877, 438582, 424287, 413298, 406475, 404263, 407013, 414877, 427694, 445443, 468599, 497612, 532321, 572287, 617063, 665155, 712859, 755013, 787060]
56828G87060J9032M496j0066k2461l0950l5623l7759l8166l6910l4214l0654k6585
56816E07200k2024j7073j1871o321l16N906J2040J8048K3771K8520L1435L1990
56804F01305K9797K4377J5667M647o969j7511k5822l1388l4434l5515l4834l2289
56792D57031k8378k4322k0909j7734j4024r788n653k067R66L712O596R862J2999
56779C68291J4850J4528J1854O930J98o987j2859j6844j9785k2157k3181k2377
56767B92461k0842j9885j9206j7672j5250j2932j1241r993r234r123r067q107
56755A29909o293m710m067m102m366m696m813m270l100j890j066n83l92o34j281
56740H3646k001k525k776k662k121j396r50j027j515k039k067j243L0P20L01o16
$$ y = [787060, 806092, 810588, 800522, 778061, 747111, 711488, 673729, 635563, 598653, 564439, 533785, 507200, 485176, 468103, 456232, 449911, 449595, 455501, 467541, 485589, 509360, 537880, 569315, 601305, 631102, 655479, 671146, 675793, 668824, 651313, 625491, 594103, 559669, 524154, 489320, 457031, 428653, 404331, 383422, 365688, 351664, 341876, 336223, 334156, 335122, 338834, 345430, 355292, 368291, 383141, 397669, 409523, 416453, 416651, 409664, 396805, 379961, 360176, 338019, 314838, 292461, 271619, 251734, 232528, 214856, 199606, 186674, 175433, 165440, 156206, 147083, 138016, 129909, 123616, 118906, 114839, 110737, 106371, 101675, 96862, 92592, 89492, 87602, 86536, 85953, 85561, 84927, 83646, 81645, 79120, 76344, 73682, 71561, 70165, 69215, 68188, 66673, 64634, 62567, 61324, 61354, 62074, 62375, 61759]
56724F1759j103j052r14p43k22N93J195J298J114J017J220J629J780J220K22l19
56708F8694j17%o01j262j057l78m19j299j816j142J86J188J575J643J550J206
56692F7951O19J23J72Q61J593J554O88j87m90n98j069j647j597p07N46J526J802
56675G1140J367R14J309K377K863K190J403J566K066J650N65K53J205K484L280
56660I6632L711L997L981L683L419L166K621K030J988K436K665K466K303K286
56646A37384J924J150O01N61M73r2p93j253j677k292k846l132l423l982m545m684
56630A13374m264l412k409j806k038k805l315l328l333l578l626l189k627k292
56616G1352j931j213l59K49O55J107J568J856J980K043K043J965J916J900J739
$$ y = [61759, 60656, 59604, 58690, 57947, 57725, 58318, 59513, 60811, 61925, 62942, 64162, 65791, 67571, 68791, 69013, 68694, 68577, 68577, 67976, 66714, 65657, 65279, 64860, 63561, 61745, 60603, 60789, 61977, 63552, 65195, 66745, 67951, 68570, 68693, 68865, 69726, 71319, 72873, 73561, 73374, 72884, 72286, 71217, 69570, 67973, 67266, 67812, 69338, 71140, 72507, 73421, 74730, 77107, 79970, 82160, 83563, 85129, 87195, 88845, 89410, 89663, 90868, 93352, 96632, 100343, 104340, 108321, 112004, 115423, 118589, 121210, 123240, 125228, 127664, 130329, 132795, 135098, 137384, 139308, 140458, 141059, 141620, 142093, 142001, 141208, 139955, 138278, 135986, 133140, 130008, 126585, 122603, 118058, 113374, 109110, 105698, 103289, 101483, 99445, 96640, 93325, 89997, 86664, 83086, 79460, 76271, 73644, 71352, 69421, 68208, 67849, 68098, 68753, 69860, 71428, 73284, 75264, 77307, 79350, 81315, 83231, 85131, 86870]
56601H6870J355R48Q15J163J986K897L187K483J291M20Ml68p20n95J42J099K014
56584A04991K895L370K806J359J81J21Q29J521J990K378K589K523K534L004L647
56569A36738L763L057J963J195J214J939K820L383L722M217M757M728L928L000
56555A80424K690L053L592L946M108M189M227M125L714L010K332J901J467O48
56541B23426m25j247j638j753j563r44l34o06k031l932n477o357o558o119n350
56526A79092m735m329l779l053k584k514k388j918j394j067p23k38jk94p81j000
56510A48294r22o71j65N58J091J163R90Q17N27N1l37n17p87j206j196l79O44R24
56492A48879L47l94o64l01N24J324J450P68m2k51J1J18j19l40l27k52k71k78q8
$$ y = [86870, 88225, 89173, 89988, 91151, 93137, 96034, 99221, 101704, 102995, 103415, 103419, 103051, 102331, 101736, 101878, 102977, 104991, 107886, 111256, 114062, 115421, 115602, 115723, 116552, 118073, 120063, 122441, 125030, 127553, 130087, 133091, 136738, 140501, 143558, 145521, 146716, 147930, 149869, 152689, 156072, 159794, 164011, 168768, 173496, 177424, 180424, 183114, 186167, 189759, 193705, 197813, 202002, 206229, 210354, 214068, 217078, 219410, 221311, 222778, 223426, 223001, 221754, 220116, 218363, 216800, 215856, 215522, 214916, 212885, 208953, 203476, 197119, 190561, 184442, 179092, 174357, 170028, 166249, 163196, 160612, 158098, 155710, 153792, 152398, 151331, 150608, 150370, 150369, 150075, 149294, 148294, 147372, 146701, 146536, 147094, 148185, 149348, 150338, 151155, 151682, 151733, 151396, 150879, 150092, 148886, 147690, 147311, 147955, 148879, 149226, 148832, 148168, 147867, 148391, 149715, 151165, 151933, 151891, 151640, 151651, 151769, 151650, 151310, 150983, 150731, 150460, 150182, 150094]
56473A50094L87J050J594J730J610J709K123K409K365K369K608K549J830J211
56459A75638J737L279M684N303N493N668N640N156M371L480K408J166J14m45o43
56444B23049o85m91J9N08N02l4o66j078j343j617j864k026k221k519k660k365
56428B04509j934k104l110m218m517l995l367l056k792k254j592j144r79q88o76
56413A67883l03J14M48Q57J725L088M301M777M861N331O109O209N173L749K824
56398B17146K257J407K25p61j332j729k042j970j353n97l39p35j272j437j511
56383B05957k303l834m815m085k346j532k415l768m221l949l917m283m491m462
56369A55536m595m727m002k053L31K027K721K869K881K691K152J574J503K068
$$ y = [150094, 150481, 151531, 153125, 154855, 156465, 158174, 160297, 162706, 165071, 167440, 170048, 172597, 174427, 175638, 177375, 180654, 185338, 190641, 196134, 201802, 207442, 212598, 216969, 220449, 222857, 224023, 224137, 223692, 223049, 222364, 221873, 221892, 222400, 222902, 222868, 222202, 221124, 219781, 218164, 216300, 214274, 212053, 209534, 206874, 204509, 202575, 200471, 197361, 193143, 188626, 184631, 181264, 178208, 175416, 173162, 171570, 170426, 169447, 168559, 167883, 167580, 167694, 168142, 168999, 170724, 173812, 178113, 182890, 187751, 193082, 199191, 205400, 210573, 214322, 217146, 219403, 220810, 221035, 220274, 218942, 217213, 215171, 213201, 211848, 211251, 210912, 210177, 208905, 207468, 205957, 203654, 199820, 195005, 190920, 188574, 187042, 184627, 180859, 176638, 172689, 168772, 164489, 159998, 155536, 150941, 146214, 142212, 140159, 140490, 142517, 145238, 148107, 150988, 153679, 155831, 157405, 158908, 160976]
56355A60976K838L382L659L622K966J771R78J433K647L313L036K611K547K351
56341A98130J651J096J418K318K994L307L655M119M377M282L952L439K798K325
56327B39861K306K696L270L917M461M475L712K553J780J857K556L134K952K175
56313B81705J790K492L710M267L922L492L446L312K699J909J229M90j80r2Q97
56298C15088J839J960J692J846K479L210L930M474M425L934L930M717N255M786
56284C63565M243M813N937O145N306M642M826N474O282P332Q355Q932R380J0295
56270D55527J1361J1796J1931J3011J5385J8070K0219K1868K3199K4356K6145
56259F52868K9592L4392L9012M2761M6634N1623N7399O3215O9061P5122Q0961
$$ y = [160976, 163814, 167196, 170855, 174477, 177443, 179214, 180192, 181625, 184272, 187585, 190621, 193232, 195779, 198130, 199781, 200877, 202295, 204613, 207607, 210914, 214569, 218688, 223065, 227347, 231299, 234738, 237536, 239861, 242167, 244863, 248133, 252050, 256511, 260986, 264698, 267251, 269031, 270888, 273444, 276578, 279530, 281705, 283495, 285987, 289697, 293964, 297886, 301378, 304824, 308136, 310835, 312744, 313973, 314463, 314283, 314191, 315088, 316927, 318887, 320579, 322425, 324904, 328114, 332044, 336518, 340943, 344877, 348807, 353524, 358779, 363565, 367808, 372621, 378558, 384703, 390009, 394651, 399477, 404951, 411233, 418565, 426920, 435852, 445232, 455527, 466888, 478684, 490615, 503626, 519011, 537081, 557300, 579168, 602367, 626723, 652868, 682460, 716852, 755864, 798625, 845259, 896882, 954281, 1017496, 1086557, 1161679, 1242640]
56248A242640Q6055R0490R4397R7223R8132R6708R2801Q6230P7101O5889N2890
56237B180556L8046K1771N251j0447k5003l8211m9389n8071o4749p0284p4921
56226A854549p8308q0148q0346p8909p6152p2722o9051o5066o0747n6539n2842
56215A083719m9463m6064m2735l9724l6856l3778l0536k7522k4971k2846k1066
56204G08158j9512j7943j6140j4175j2305j0730r447q258o995n834n172m933m329
56191E72385k901j490j342k265k677j715l26K23qj28Q8R9l36p33n02M39J610K285
56173E62706K080J433J206J640K165K396K746L674M853N630N896O002O143O333
56159F14903O713P354P935Q136Q164Q501R248J0139J1034J2022J3115J4137J4931
$$ y = [1242640, 1328695, 1419185, 1513582, 1610805, 1708937, 1805645, 1898446, 1984676, 2061777, 2127666, 2180556, 2218602, 2240373, 2245624, 2235177, 2210174, 2171963, 2122574, 2064503, 1999754, 1929470, 1854549, 1776241, 1696093, 1615747, 1536838, 1460686, 1387964, 1318913, 1253847, 1193100, 1136561, 1083719, 1034256, 988192, 945457, 905733, 868877, 835099, 804563, 777041, 752070, 729224, 708158, 688646, 670703, 654563, 640388, 628083, 617353, 607906, 599648, 592653, 586819, 581647, 576714, 572385, 569484, 567994, 566652, 564387, 561710, 559995, 559669, 559892, 559884, 559756, 559844, 559943, 559607, 558874, 558372, 558811, 560421, 562706, 564786, 566219, 567425, 569065, 571230, 573626, 576372, 580046, 584899, 590529, 596425, 602427, 608570, 614903, 621616, 628970, 636905, 645041, 653205, 661706, 670954, 681093, 692127, 704149, 717264, 731401, 746332]
56146G46332J5430J5675J5947J6680J7994J9487K0640K1386K2166K3670K6506
56135I61913L0875L6528M3366N1937O2759P5025Q6554R5136R9370R8300R1452
56124A733215P9939O6736N5050M6685M2136M1079M1721M0615L4782K4266J1904
56113B218128P88p272j1392j1582r656r162j3335k3101l6994n2361o6383p6740
56101A900938q2301q3303q0684p5294o7760n8877m9668m1024l3284k6226j9539
56090A282978j3359q260m595j967M36L020N501P431Q783R974J1378J2945J4354
56077A328619J5467J6450J7394J8104J8523J9060K0059K1169K1779K1984K2403
56066A541011K3069K3281K2676K1707K0792J9896J9219J9414K0518K1513K1731
$$ y = [746332, 761762, 777437, 793384, 810064, 828058, 847545, 868185, 889571, 911737, 935407, 961913, 992788, 1029316, 1072682, 1124619, 1187378, 1262403, 1348957, 1444093, 1543463, 1641763, 1733215, 1813154, 1879890, 1934940, 1981625, 2023761, 2064840, 2106561, 2147176, 2181958, 2206224, 2218128, 2218916, 2211644, 2200252, 2188670, 2179014, 2169852, 2156517, 2133416, 2096422, 2044061, 1977678, 1900938, 1818637, 1735334, 1654650, 1579356, 1511596, 1452719, 1403051, 1362027, 1328743, 1302517, 1282978, 1269619, 1261359, 1256764, 1254797, 1255233, 1258253, 1263754, 1271185, 1279968, 1289942, 1301320, 1314265, 1328619, 1344086, 1360536, 1377930, 1396034, 1414557, 1433617, 1453676, 1474845, 1496624, 1518608, 1541011, 1564080, 1587361, 1610037, 1631744, 1652536, 1672432, 1691651, 1711065, 1731583, 1753096, 1774827]
56055A774827K1948K3231K5271K6862K7624K8237K9202L0336L1501L2946L4802
56044B086787L6829L8739M0288M1233M1689M2348M3780M5699M7458M8988N0521
56033B564359N1800N2365N2554N3302N4948N7061N9407O2261O5607O8850P1598
56022C214112P4171P7128Q0701Q4804Q9158R3414R7496J01711J06157J10342J13932
56011D243126J17540J21959J26972J31813J36563J42045J48372J54743J60794
56002E483927J67179J74619J83217J92890K03568K14792K25958K37228K49472
55993G332850K63180K78224K94668L12797L32292L52404L73199L95607M20186
55984A0355407M46884M76175N09108N45893N85734O28501O75386P27570P85506
$$ y = [1774827, 1796775, 1820006, 1845277, 1872139, 1899763, 1928000, 1957202, 1987538, 2019039, 2051985, 2086787, 2123616, 2162355, 2202643, 2243876, 2285565, 2327913, 2371693, 2417392, 2464850, 2513838, 2564359, 2616159, 2668524, 2721078, 2774380, 2829328, 2886389, 2945796, 3008057, 3073664, 3142514, 3214112, 3288283, 3365411, 3446112, 3530916, 3620074, 3713488, 3810984, 3912695, 4018852, 4129194, 4243126, 4360666, 4482625, 4609597, 4741410, 4877973, 5020018, 5168390, 5323133, 5483927, 5651106, 5825725, 6008942, 6201832, 6405400, 6620192, 6846150, 7083378, 7332850, 7596030, 7874254, 8168922, 8481719, 8814011, 9166415, 9539614, 9935221, 10355407, 10802291, 11278466, 11787574, 12333467, 12919201, 13547702, 14223088, 14950658, 15736164]
55975A5736164Q50080R23045J005686J098292J201782J318623J451682J603443
55967B5188797J777145J977426K209271K477735K789254L151782L573139M060990
55959D7205539M625031N277542O032015O904624P918589R104986J0498579J2134201
55951A09701106J4042281J6233253J8668288K1222341K3635031K5449435K5997744
55944B54949479K4542578K0601308J4285724O391309j873504r345899j5261249
55937B94289746j9342746k1686710k2588686k2403962k1464313k0043562j8355529
55930A48404238j6562123j4778084j3076334j1499514j0071346q800770p683470
55923F5932597o707587n860220n128487m497767l953223l483031l078085k729333
$$ y = [15736164, 16586244, 17509289, 18514975, 19613267, 20815049, 22133672, 23585354, 25188797, 26965942, 28943368, 31152639, 33630374, 36419628, 39571410, 43144549, 47205539, 51830570, 57108112, 63140127, 70044751, 77963340, 87068326, 97566905, 109701106, 123743387, 139976640, 158644928, 179867269, 203502300, 228951735, 254949479, 279492057, 300093365, 314379089, 320770398, 318896894, 309550995, 294289746, 274947000, 253260290, 230671604, 208267642, 186803329, 166759767, 148404238, 131842115, 117064031, 103987697, 92488183, 82416837, 73616067, 65932597, 59225010, 53364790, 48236303, 43738536, 39785313, 36302282, 33224197, 30494864]
55915C0494864k427585k165438j937418j738543j564239j411258j277095j158798
55907A6814490j053558r59883q76930q03114p36660o76945o23870n76270n32355
55898I974905m91536m54473m21460l91883l65169l41059l18942k98030k78239
55889F614114k59976k43096k26923k11247j96350j82052j67632j52732j37514
55880D836592j21970j05868q9365p3098n7887m5221l7675l7506m4630n6834p2002
55869D094536q9186j07364j24379j37722j45745j48025j45263j39089j31224j22496
55859B804043j13197j04201r6746r0922q5441p9322p2898o6854o1301n6333n2527
55848A924301n0101m8253m6106m3736m1656l9828l7927l6061l4487l2974l1229
$$ y = [30494864, 28067279, 25901841, 23964423, 22225880, 20661641, 19250383, 17973288, 16814490, 15760932, 14801049, 13924119, 13121005, 12384345, 11707400, 11083530, 10507260, 9974905, 9483369, 9028896, 8607436, 8215553, 7850384, 7509325, 7190383, 6892353, 6614114, 6354138, 6111042, 5884119, 5672872, 5476522, 5294470, 5126838, 4974106, 4836592, 4714622, 4608754, 4519389, 4446291, 4388404, 4343183, 4305508, 4268002, 4223372, 4166538, 4094536, 4005350, 3897986, 3773607, 3635885, 3490140, 3342115, 3196852, 3057763, 2926539, 2804043, 2690846, 2586645, 2489899, 2398977, 2313536, 2234214, 2161316, 2094462, 2033161, 1976828, 1924301, 1874200, 1825947, 1779841, 1736105, 1694449, 1654621, 1616694, 1580633, 1546146, 1513172, 1481943]
55837A481943k9577k8553k8004k7266k6055k4606k3099k1586k0317j9565j9174
55826A214141j8730j8146j7651j7333j7110j7026j7130j7140j6691j5841j4928
55815A026415j4057j3056j1885j0719r676q819q223p695o767n383m322m300m891
55802I16622n171n284o388q901j1664j3400j4164j4756j5319j5355j4797j4178
55790G77245j3677j2802j1204r216p201m935k224P5L73k043o094r874j2250j3267
55776F72906j3306j2461j0865q992p227n446l419j580q31j594l438n659p894r931
55762E80263j1405j2043j2086j1954j1516j0207q007n890m910n017n279n145n046
55749D71758n594o742p969q939r574r718r253q422p711p314p081o878o684o348
$$ y = [1481943, 1452366, 1423813, 1395809, 1368543, 1342488, 1317882, 1294783, 1273197, 1252880, 1233315, 1214141, 1195411, 1177265, 1159614, 1142281, 1125171, 1108145, 1091015, 1073875, 1057184, 1041343, 1026415, 1012358, 999302, 987417, 976698, 967022, 958203, 949980, 942285, 935518, 930135, 925813, 921513, 916622, 911451, 906167, 899779, 890878, 879214, 865814, 851650, 836894, 821575, 806220, 791423, 777245, 763568, 750766, 739562, 730346, 723145, 718210, 715986, 716061, 716434, 714391, 708297, 698423, 686173, 672906, 659600, 647139, 636274, 627282, 620055, 614609, 611190, 609610, 608779, 607185, 603747, 598088, 590194, 580263, 568858, 556815, 544729, 532775, 521259, 511052, 503045, 497155, 492245, 487228, 481949, 476804, 471758, 466164, 459422, 451453, 442514, 432940, 423222, 413969, 405547, 397836, 390522, 383441, 376563, 369879, 363531]
55735C63531n691m843m180l850l683l604l694l880l978m137m709n516n837n421
55721C00508m933m982n239n127m882n170n794n633m039j687J90J046J259J420
55707B56937J651J618J032J44m41m49l18o89j662k863l991m926n362m878l564
55692B32239k247j757k135k744l041l048l039l019k678j893j006l83J08Q52J704
55677B07913J958J278K38m22p14j137j783k285k475k473k212j490o03k24m11m22
55661A94736J57O75M30p6K85J599K597K225R14j37m96p92j629k767l551l804l950
55644A86416m326m719m688m159l492k959k472j895j406j279j363j090j49J044
55630A53463J758J811J737K008K345K036Q62n43j390j568j629j982k362k265j670
$$ y = [363531, 357840, 352997, 348817, 344967, 341284, 337680, 333986, 330106, 326128, 321991, 317282, 311766, 305929, 300508, 295575, 290593, 285354, 280227, 275345, 270175, 264381, 258748, 254709, 253022, 253212, 254258, 255517, 256937, 258588, 260206, 261238, 261382, 260941, 260492, 260174, 259485, 257823, 254960, 250969, 246043, 240681, 235803, 232239, 229992, 228235, 226100, 223356, 220315, 217267, 214228, 211209, 208531, 206638, 205632, 205249, 205357, 206209, 207913, 209871, 211149, 211387, 210965, 210251, 209114, 207331, 205046, 202571, 200098, 197886, 196396, 195793, 195569, 195158, 194736, 194893, 195568, 195998, 195922, 196207, 197806, 200403, 202628, 203542, 203405, 202909, 202117, 200488, 197721, 194170, 190366, 186416, 182090, 177371, 172683, 168524, 165032, 162073, 159601, 157706, 156300, 155021, 153658, 152568, 152419, 153463, 155221, 157032, 158769, 160777, 163122, 165158, 166020, 165477, 164087, 162519, 160890, 158908, 156546, 154281, 152611]
55615A52611j058o80k85K27L08m88j487j424j42J046R78l0j024j784k530k891
55599A41347k312j316j056j549j580o80J4m04j110q59N8M36J21M6N52J035J298
55582A34041J982L282M370M729N137O587Q888J1202J3399J6071J9305K2320K4299
55569B75612K4873K3765K0549J5176Q328R69o173j2509j7415k0494k1879k1975
55557B68827k1013j9168j7017j5381j4572j4087j3202j1729j0032q530p397o628
55545A10071o118n652n006m153l314k806k803l146l298k758j612n41o1Q6N42J485
55529G0916K504L174L409L247K701J904J153O10K69J95N12J018J070J16j766l867
55513H7165n303n550m855m086m010m617n381n965o297o164n364m300l683l572
$$ y = [152611, 151553, 150873, 150588, 150815, 151123, 150635, 149148, 147724, 147582, 148628, 149606, 149576, 148552, 146768, 144238, 141347, 139035, 137719, 136663, 135114, 133534, 132854, 132868, 132464, 131354, 130495, 130553, 130989, 131110, 131156, 131708, 132743, 134041, 136023, 139305, 143675, 148404, 153541, 160128, 169016, 180218, 193617, 209688, 228993, 251313, 275612, 300485, 324250, 344799, 359975, 368303, 369272, 363099, 350590, 333175, 312681, 290802, 268827, 247814, 228646, 211629, 196248, 181676, 167589, 154387, 142658, 132626, 124096, 116699, 110071, 103953, 98301, 93295, 89142, 85828, 83022, 80219, 77073, 73775, 71017, 69405, 68864, 68803, 68889, 69431, 70916, 73420, 76594, 80003, 83250, 85951, 87855, 89008, 89618, 89887, 90082, 90594, 91612, 92682, 92798, 91032, 87165, 81862, 76312, 71457, 67371, 63361, 58744, 53363, 47398, 41101, 34937, 29573, 25273, 21590, 18018]
55499A8018l259k425j662j448j309o11L39P55N35J90j05o02j159j163m08N63J231
55482G480J692K272K885L160K930K451K168K305K557K262J110l11j016p32k29
55467C0984l50j013j419j136o45o60j167j450j056l36J50L83O15O83K41m09m76
55450B2939J67O65L99j63k46J52M60M78M70N93P75R36Q94L19p20j498j448r77
55432B4195q60j060q72p9P84J279J506J561J270O50Q5j81k17k3N61J331J675J426
55414C3031J246J731K446K471J696J049J214J641J200l51k039k916l122l346l630
55399C2321l399k547j725j368j151p37l72k72j09L71P41N79K29J80J28m56j248
55382B1165j440r52l97k1L82O47L16m14p79o10m76o14n89k62j11l03l51o9K6k94
$$ y = [18018, 14759, 12334, 10672, 9224, 7915, 7304, 7643, 8398, 8933, 9123, 9018, 8416, 7257, 6094, 5686, 6249, 7480, 9172, 11444, 14329, 17489, 20419, 22870, 25038, 27343, 29900, 32162, 33272, 32961, 31945, 31213, 30984, 30634, 29621, 28202, 27066, 26421, 25761, 24594, 23144, 22088, 21752, 21902, 22285, 22900, 23583, 23824, 23415, 22939, 23106, 23771, 24170, 24007, 23761, 23913, 24373, 24851, 25321, 25914, 26689, 27625, 28519, 28838, 28118, 26620, 25172, 24195, 23335, 22275, 21403, 21324, 22108, 23387, 24893, 26454, 27724, 28374, 28459, 28278, 28061, 28038, 28599, 29930, 31605, 33031, 34277, 36008, 38454, 40925, 42621, 43670, 44884, 46525, 47725, 47374, 45335, 42419, 39297, 35951, 32321, 28922, 26375, 24650, 23282, 22131, 21394, 21022, 20750, 20641, 21012, 21753, 22332, 22561, 22741, 22869, 22413, 21165, 19725, 18773, 18376, 18355, 18737, 19384, 19700, 19286, 18507, 17897, 17421, 16807, 16218, 15956, 15845, 15542, 15191, 15122, 15148, 14854]
55362A4854l78J95P74O06M1m7L74N49R4n99j023r79m84K23O24L86j20k10J66L14
55342A5360k49j149j628j463j037o49p0R35J979K257J490K81n98r45r47o35M3
55325A2975P83J005M08p83j928k268j461j53M44n0o57m21K70M42Q9j2K82L66R7
55306I428k3R3l9m01k97M19R52P87M12L62M10K42J07K52M16L65L53N76P41O21
55286A5776L87J09l75p78m69L89P66L64K25R83J626J115J82K11R66R94Pp38m64
55267B1276M4j84r11j300j128p87n16j96K40N85O28M62M27O60Q12N00r8m11l19
55248A9784l45q69j614k147k411k522k476k303k016j311P1J513J861R81J14J87
55232F497O01L57m14r15r85r91r54p03m43l70j17N70J108R33N91Q73J418J310
$$ y = [14854, 14476, 14671, 15445, 16051, 16092, 16045, 16419, 16968, 17062, 16463, 15440, 14461, 13977, 14200, 14824, 15210, 15090, 14880, 15046, 15360, 15111, 13962, 12334, 10871, 9834, 9185, 9115, 10050, 12029, 14286, 15776, 16057, 15459, 14514, 13567, 12932, 12975, 13758, 14763, 15171, 14388, 12460, 10192, 8731, 8578, 9022, 8972, 8315, 7894, 8164, 8606, 8695, 8683, 8965, 9331, 9428, 9405, 9498, 9459, 9058, 8761, 9180, 10132, 10919, 11331, 11693, 12103, 12345, 12452, 12704, 13120, 13485, 13838, 14414, 15155, 15776, 16163, 16272, 15897, 15119, 14650, 15039, 15805, 16169, 16394, 17377, 19003, 20118, 20300, 20511, 21477, 22471, 22478, 21740, 21276, 21320, 21136, 20225, 18925, 17797, 17010, 16494, 16298, 16538, 17123, 17751, 18213, 18640, 19300, 20112, 20612, 20514, 20103, 19784, 19439, 18570, 16956, 14809, 12398, 9876, 7400, 5097, 3081, 1770, 1841, 3354, 5215, 6196, 6310, 6497, 7098, 7455, 7041, 6126, 5141, 4150, 3196, 2493, 2050, 1680, 1563, 2133, 3241, 4174, 4765, 5638, 7056, 8366]
55214H366P37O93J196J203L73m11n26m21n21m49P5M98K85j88k24J93N10L97ll88
55194A1395n13k99R4M46O85P67N15q1o30p76o95p17p25m91k57k86k09L80R23N56
55174A0082l47m76M51J192P88j97p66q18q00p84o19m22k81J10R11J660J784J313
55156A2781O62O6m29p47q92r73r20n14Q7L46J10j72j90k21m71o26m57l33n45o06
55136E956M8J037J376O72m68j143q46K59J358J477M64o81r14l46J18J00Q6N23
55118I076J189J622J642J308O72r8o55p67n76l99l65l19m0N13J126J508J568J522
55100A8527J600J683J392O31p4%R37K002K422K218J994J992J781R88j22r82j373
55083C5616j452j423j493j785k042j717p50Q0J11l11m59l66n28p61l63N49Q97
$$ y = [8366, 9103, 9796, 10992, 12195, 12568, 12157, 11631, 11210, 10689, 10240, 10315, 10813, 11098, 10910, 10686, 10879, 11389, 11786, 11783, 11395, 10882, 10583, 10677, 11123, 11808, 12575, 13090, 13009, 12379, 11603, 10908, 10191, 9466, 8975, 8718, 8432, 8223, 8603, 9526, 10082, 9735, 9259, 9710, 10902, 11690, 11493, 10727, 9909, 9109, 8325, 7706, 7284, 7003, 7113, 8024, 9684, 11468, 12781, 13443, 13509, 13080, 12333, 11441, 10468, 9548, 9034, 9121, 9467, 9577, 9405, 9215, 8994, 8523, 7897, 7440, 7107, 6562, 5956, 6004, 7041, 8417, 9089, 8621, 7478, 6632, 6891, 8249, 9726, 10190, 9509, 8595, 8249, 8367, 8467, 8553, 9076, 10265, 11887, 13529, 14837, 15509, 15411, 14756, 13989, 13413, 13014, 12649, 12330, 12290, 12803, 13929, 15437, 17005, 18527, 20127, 21810, 23202, 23833, 23759, 23759, 24696, 26698, 29120, 31338, 33332, 35324, 37105, 38093, 37971, 36989, 35616, 34164, 32741, 31248, 29463, 27421, 25704, 24954, 25034, 25145, 24834, 24375, 24009, 23481, 22720, 22357, 22906, 23803]
55066B3803J93o75p68l79l20n19j51R47J834J540K07j116j548j161p23p72j059
55049A9333j016n56q0J62L04M44M72M20N37Q82J145J039N81r4q20j255j053l98
55031B0047O4j2l40n33n38l61J18P40R20L50m41o21N5J161K142K658K604K118
55013C0131J511R75N25K64M16Q85J160R40N61M95O64N50q6r00j306j005k79J47
54995C5648j69p53o08N77J956K503K150J616J362J222R02M29n0n01q69r46n95
54978D3874j10om41r37j007q99j239j944k095j222j52P4l27l60R5J23o54j385
54960C1388j280p47o38r97j213j020o60k97J92Q28J350J484J223Q66P66R98J170
54943C3413Q76K75m1J76N96Q70J059J344J678J944K182K476K861L434M316N476
$$ y = [23803, 23996, 23321, 22553, 22174, 21854, 21335, 21184, 22131, 23965, 25505, 25712, 24596, 23048, 21887, 21164, 20392, 19333, 18317, 17761, 17681, 17843, 18147, 18591, 19063, 19483, 20020, 20902, 22047, 23086, 23667, 23573, 22753, 21498, 20445, 20047, 20111, 20099, 19759, 19226, 18688, 18327, 18445, 19185, 20105, 20455, 20014, 19393, 19448, 20609, 22751, 25409, 28013, 30131, 31642, 32617, 33142, 33406, 33822, 34707, 35867, 36807, 37368, 37863, 38527, 39077, 38991, 38091, 36785, 35780, 35501, 35648, 35479, 34726, 34118, 34695, 36651, 39154, 41304, 42920, 44282, 45504, 46406, 46835, 46785, 46284, 45415, 44469, 43874, 43764, 43758, 43317, 42380, 41373, 40474, 39235, 37291, 35196, 33974, 33822, 33896, 33569, 33209, 33304, 33427, 32773, 31388, 30108, 29361, 28723, 27726, 26513, 25493, 24833, 24536, 24728, 25556, 26906, 28390, 29613, 30479, 31245, 32243, 33413, 34289, 34564, 34523, 34699, 35295, 36165, 37224, 38568, 40246, 42190, 44372, 46848, 49709, 53143, 57459, 62935]
54927F2935O830Q420J0182J1610J2175J1964J1341J0078P466L434j087n024p820
54914A42504r226r246q498p897p739p561p066o431n678m654l743l636m095l999
54900E3035k999k041j775j638j129p40p23j91J290K409J857O01P06K414M061M737
54884E9874N260O363P495Q019Q343R069R772R366P317M087O45k228m324n889p043
54869A16126p567p434p044o579n587l912k510k505l650m564m332l143j532P8J113
54854E6958J065K11n90q95r55j086j385j932k607k791k027q08l3J89L26K71m62
54837D3449j498j782j190p71j037j213o99j18j41l05Q3N90K67q74j899k247k140
54820B8475j823j187k72M46N48J76j68k48l85r64j680j581k91J222J597P62j10
$$ y = [62935, 69765, 78185, 88367, 99977, 112152, 124116, 135457, 145535, 153001, 156435, 155348, 150324, 142504, 133278, 124032, 115534, 107637, 99898, 92337, 85271, 78840, 73162, 68508, 64765, 61129, 57034, 53035, 50036, 47995, 46220, 44582, 43453, 42713, 41990, 41799, 43089, 45498, 47355, 47956, 48662, 51076, 55137, 59874, 65134, 71497, 78992, 87011, 95354, 104423, 114195, 123561, 130878, 134965, 135610, 133382, 129058, 123169, 116126, 108559, 101125, 94081, 87502, 81915, 78003, 75493, 72988, 69338, 64774, 60442, 57299, 55767, 55845, 56958, 58023, 58234, 57644, 56749, 55794, 54708, 53323, 51391, 48784, 45993, 43966, 43158, 43125, 43314, 43640, 43911, 43449, 41951, 40169, 38979, 38208, 37171, 35958, 35259, 35141, 35000, 34695, 34778, 35368, 35635, 34761, 32862, 30615, 28475, 26652, 25465, 25193, 25639, 26187, 26363, 26195, 25947, 25562, 24598, 22918, 21337, 21046, 22268, 23865, 24627, 24517]
54803B4517k33j4k1l6L77R96J273J125Q84P20O26O94R69J190J045N72N4k82l04
54784C4152N3O41J182J653K282L050L566L753M108M946N758N938N864O608Q509
54769I2063J0599J1594J1202J0112Q998P767N898L270L54k354m677o455p277o957
54755A34137n965m934l909k650j406o83k95N48K069L586M597N428O455P304P386
54740A51668O690N590M238K668J135j42j203j956j973j200l96k63l85K67J885
54725A66623L596M553M599L776J932p71l530n591p047q552j0304j1678j1939j1073
54711A14594r723q467p355o213n054m086l392k855k363j959j771j898k303k739
54697E4416k924k842k697k493k042j500j397j770j775q22M37R55Q40J023J641
$$ y = [24517, 24284, 24270, 24249, 24213, 24590, 25586, 26859, 27984, 28868, 29588, 30214, 30908, 31877, 33067, 34112, 34684, 34738, 34456, 34152, 34205, 34846, 36028, 37681, 39963, 43013, 46579, 50332, 54440, 59386, 65144, 71082, 76946, 83554, 92063, 102662, 114256, 125458, 135570, 144568, 152335, 158233, 161503, 161857, 159503, 154826, 148371, 141094, 134137, 128172, 123238, 119329, 116679, 115273, 114590, 114295, 114843, 116912, 120498, 125095, 130523, 136978, 144282, 151668, 158358, 163948, 168186, 170854, 171989, 171847, 170644, 168688, 166715, 165515, 165119, 164856, 164471, 164738, 166623, 170219, 174772, 179371, 183147, 185079, 184308, 180778, 175187, 168140, 159588, 149284, 137606, 125667, 114594, 104871, 96404, 89049, 82836, 77782, 73696, 70304, 67449, 65086, 63127, 61356, 59458, 57155, 54416, 51492, 48650, 45953, 43460, 41418, 39918, 38521, 36751, 34976, 34154, 34591, 35546, 36386, 37409, 39050]
54682C9050J877J495J345J918K507K352J752J363J171Q96P64J029J263R26K63
54667E9971j15k12m81r28j082p84l57j03j29m99j082j399j092l68L87J141J938
54650E4806K483K556K503K698K870K690K635L404M698N501N525N450N802O509
54636A10130P697R824J2675J5052J6082J6120J5882J5246J3494J0309O029J264
54624B49804l228o640q602r487r935j0211j0253j0027r545q723p601o528n820
54611A43204n360m880m502m644n367o094o086n140l774k760k469k695l064l407
54597H2962l593l277k338j369j165j641j912j614j465k073k825k650j475k64K29
54582E5530O8m18j040j506j483j098q94j029r44k31O30Q04K08l99l55K28P75R19
$$ y = [39050, 40927, 42422, 43767, 45685, 48192, 50544, 52296, 53659, 54830, 55726, 56490, 57519, 58782, 59708, 59971, 59856, 59644, 59163, 58235, 57153, 56369, 56012, 55909, 55780, 55281, 54199, 52800, 51708, 51340, 51727, 52868, 54806, 57289, 59845, 62348, 65046, 67916, 70606, 73241, 76645, 81343, 86844, 92369, 97819, 103621, 110130, 117827, 127651, 140326, 155378, 171460, 187580, 203462, 218708, 232202, 242511, 248540, 249804, 246576, 239936, 231334, 221847, 211912, 201701, 191448, 181421, 171876, 163153, 155552, 149024, 143204, 137844, 132964, 128462, 123818, 118451, 112357, 106271, 101131, 97357, 94597, 92128, 89433, 86369, 82962, 79369, 76092, 73754, 72385, 71220, 69579, 67667, 66053, 64588, 62515, 59690, 57040, 55565, 55301, 55530, 55598, 55180, 54140, 52634, 51151, 50053, 49159, 48130, 47186, 46955, 47585, 48389, 48597, 48198, 47843, 48071, 48846, 49765]
54564D9765P26M23J07k13m01k23L31Q26Q02L20j21k77m05o77p49k22P08J445J664
54545E3829J460R38J81m50m13M06J507K312K614K467K043J706J830K288K475K126
54529G7319J772K099L113M270N180N803O196O512P018P736Q128P610O201M336
54515A53293K215p9k093l333m042m931o025o562o250n808n751n506m395k950k267
54500I5516k425k468j913j320j215j334j323j427j894k174j567m07J45l83j124
54485G4687j081m22p9l35n15j28L59K46k77l99J24N95L79k27m95k78m2k0J48P53
54465G2993J475J750J525J175Q79M36j40l66R9Q42J136Q70N98O74P80M85j71q53
54447H4187j366j670j695j487j334j403j454j135m89J84P17J065J064O72L06M54
$$ y = [49765, 50491, 50914, 51021, 50808, 50407, 50184, 50515, 51341, 52143, 52463, 52342, 52065, 51660, 50983, 50234, 50012, 50720, 52165, 53829, 55289, 56227, 56408, 55958, 55545, 55951, 57458, 59770, 62384, 64851, 66894, 68600, 70430, 72718, 75193, 77319, 79091, 81190, 84303, 88573, 93753, 99556, 105752, 112264, 119282, 127018, 135146, 142756, 148957, 153293, 155508, 155429, 153336, 150003, 145961, 141030, 135005, 128443, 122193, 116385, 110634, 105128, 100733, 97783, 95516, 93091, 90623, 88710, 87390, 86175, 84841, 83518, 82091, 80197, 78023, 76456, 76049, 76194, 75811, 74687, 73606, 73184, 73105, 72770, 72255, 72127, 72486, 72732, 72455, 72056, 72180, 72775, 73154, 72927, 72432, 72154, 72112, 72092, 72240, 72993, 74468, 76218, 77743, 78918, 79797, 80233, 80093, 79727, 79826, 80668, 81804, 82674, 83272, 83946, 84726, 85211, 85040, 84187, 82821, 81151, 79456, 77969, 76635, 75232, 73778, 72643, 72154, 72338, 73055, 74120, 75184, 75856, 76162, 76616]
54431G6616R20R39J89p18r76n28j2N2k48m92m97m67n74n46O3J162K020K098J685
54412H0686J428J497J631J758K041K431K594K397K011J568J060N34N9l97p63p25
54396I9810k61m0o48j604j921j538j335j624j694j123n78p04j047q67l72l42q96
54379H3216j421j557j461j295r98o47n16o95r96j183j105p10k28o6k55k57K31
54362G0057O36K05p97j239n64N20R35M51k66n26j90M49J059J463J590J363P61
54345G5907o6q22j246j264r99p36p91j224j710j869j663j292q36l09K3k18r52
54328E9933j638j919j953j994k027j918j621j095l86J62J75k04m50l89k74j38
54312D4264L30J029J317R88O57P52P52M4r76j404j040m28R6O02J002Q69lj236
$$ y = [76616, 77536, 78475, 78664, 77946, 76970, 76442, 76430, 76482, 76234, 75742, 75245, 74778, 74204, 73658, 73721, 74883, 76903, 79001, 80686, 82114, 83611, 85242, 87000, 89041, 91472, 94066, 96463, 98474, 100042, 101102, 101636, 101695, 101298, 100535, 99810, 99549, 99509, 98861, 97257, 95336, 93798, 92463, 90839, 89145, 88022, 87444, 86740, 85693, 84826, 84454, 84112, 83216, 81795, 80238, 78777, 77482, 76484, 75837, 75321, 74626, 73630, 72447, 71342, 70632, 70404, 70338, 70083, 69826, 70057, 70693, 70898, 70101, 68862, 68298, 68818, 69753, 70204, 69938, 69412, 69222, 69671, 70730, 72193, 73783, 75146, 75907, 75841, 75019, 73773, 72509, 71510, 70774, 69983, 68759, 67049, 65180, 63517, 62225, 61389, 61080, 61103, 60885, 59933, 58295, 56376, 54423, 52429, 50402, 48484, 46863, 45768, 45382, 45544, 45719, 45515, 45065, 44676, 44402, 44264, 44594, 45623, 46940, 47928, 48585, 49337, 50089, 50133, 49157, 47753, 46713, 46285, 46381, 46983, 47985, 48854, 48851, 47615]
54294D7615k149k288j800j347j420j683j447q09n91r39q63K68J568J807J114N17
54278C7553K98p0o46p69k06M20N67L77J56n5k17j68J21M68P86J002Q39J78m48
54259D0186m07Q8K17k05n32l88k21m52q08q80q14r40j141j059o16k5N49R87J066
54240C4605O62N3k39OM22L82k92j073j319j083j010j326j490j045l36P7K27M11
54222B7632M72J41k19n6L74L05k53m52P2O69P46N62N31L80m03j670k663k777j993
54203B1398p36M11J026J086Q14L23l44q63p66m4P18R51O69K49o6l36p29j218j418
54184B1125r28Q3Q39Q04K86r8k08j85J37R03J550J279K11o95r58j005j170j079
54166B0891m13M22Q96J095J368J613J398O28k76p61n73OL15p8p86r55k44P70J258
$$ y = [47615, 45466, 43178, 41378, 40031, 38611, 36928, 35481, 34672, 34081, 33142, 32279, 32547, 34115, 35922, 37036, 37553, 37851, 37781, 37135, 36366, 36160, 36580, 37147, 37524, 37680, 37625, 37408, 37240, 37361, 37829, 38615, 39617, 40456, 40634, 40186, 39779, 39867, 40084, 39879, 39347, 38959, 38738, 38286, 37478, 36598, 35784, 34844, 33703, 32644, 32028, 32003, 32552, 33539, 34605, 35267, 35320, 35081, 35087, 35509, 35891, 35599, 34526, 33207, 32124, 31114, 29788, 28298, 27253, 26917, 26994, 27221, 27632, 28104, 28245, 28026, 27970, 28344, 28649, 28396, 27944, 28016, 28685, 29431, 29993, 30524, 30904, 30501, 28831, 26168, 23391, 21398, 20662, 21073, 22099, 23185, 23999, 24322, 23978, 23115, 22349, 22305, 23023, 23974, 24643, 24892, 24826, 24490, 23761, 22543, 21125, 20197, 20280, 21119, 21923, 22209, 22111, 21903, 21718, 21855, 22758, 24308, 25587, 25798, 25103, 24145, 23140, 21970, 20891, 20478, 20900, 21796, 22891, 24259, 25872, 27270, 27898, 27622, 26861, 26288, 26294, 26609, 26531, 25745, 24790, 24546, 25316, 26574]
54147B6574Q87m2q94j083n04K72N56K52k37o96j220j703j723j105j84N75R39Q91
54129B1555O08M44N81P53O85N74P20Q37M45k56n63l49j82l81o00n30k55J61P97
54110B5044J430J641J483J416J461J152M57j4j2k5l67o75o67o32p58p01k95J1
54092B9949j06k78j17J60K37K87N21P01N87L92L11J35k05k32L89J227J658J670
54074C7286J568J394J080P79N78K51j95k21M74J302J510J134P37N19K79o8m13
54057D7994p37j017j016n68J98J070J961K629K659K031J227O07J45j3O05J916
54041E9691K974L101K764K788L244L682L988M348M721M940M978M739M008L013
54027A12979K450K552K652K239J733J661J731J431R12N62L04M1R2L88J7j419k738
$$ y = [26574, 27461, 27419, 26525, 25442, 24938, 25210, 25766, 26018, 25781, 25085, 23865, 22162, 20439, 19334, 19150, 19725, 20664, 21555, 22163, 22607, 23188, 23941, 24626, 25200, 25920, 26757, 27202, 26946, 26383, 26034, 25852, 25471, 24871, 24341, 24086, 24247, 25044, 26474, 28115, 29598, 31014, 32475, 33627, 34084, 34070, 34058, 34033, 33666, 32991, 32324, 31692, 30934, 30233, 29938, 29949, 29843, 29565, 29448, 29608, 29845, 30132, 30653, 31354, 31941, 32333, 32644, 32779, 32574, 32342, 32731, 33958, 35616, 37286, 38854, 40248, 41328, 42107, 42685, 42936, 42741, 42520, 42994, 44296, 45806, 46940, 47677, 48196, 48475, 48407, 47994, 47257, 46240, 45224, 44656, 44854, 45924, 47885, 50514, 53173, 55204, 56431, 57038, 57183, 57170, 57775, 59691, 62665, 65766, 68530, 71318, 74562, 78244, 82232, 86580, 91301, 96241, 101219, 105958, 109966, 112979, 115429, 117981, 120633, 122872, 124605, 126266, 127997, 129428, 130340, 130902, 131206, 131247, 131339, 131727, 131744, 130325, 127587]
54010A27587k640j669j404k133k689k471k153k297k569k574k505k548k520k311
53996I5104k052j669r82k99k56q92j565j838j804j575j113o63o64j075j391j364
53980G5902j188r58n41j7K50O9m83j254j878j765p72L40Q06Q08R16J006O77L08
53962G2226O24J363J563J107P96Q94P95L13J18N56J119J369J423J290P44K12O24
53945H7136J898K690K211J293R54R02L44n32q97n24J53Q68J629K224K310J898
53929A04557J389J297K108L923N933O804O048M624L817L989M715N562O134N971
53915A66871N073M253M365N345O388O824O457N426M150L139K483J774Q08j1l08
53900B23037k88k81k34j34m80j669l173m005l871l355l072l145l437l812m110
$$ y = [127587, 124947, 123278, 121874, 119741, 117052, 114581, 112428, 110131, 107562, 104988, 102483, 99935, 97415, 95104, 93052, 91383, 90401, 90102, 89846, 88954, 87389, 85551, 83747, 82172, 81059, 80396, 79732, 78657, 77266, 75902, 74714, 73756, 73215, 73198, 73448, 73517, 73034, 71780, 69902, 68137, 67365, 67705, 68511, 69319, 70235, 71241, 71918, 72226, 72850, 74213, 75776, 76883, 77679, 78573, 79368, 79681, 79799, 80355, 81474, 82843, 84266, 85556, 86300, 86512, 87136, 89034, 91724, 93935, 95228, 96182, 97084, 97428, 96896, 95999, 95475, 95628, 96496, 98125, 100349, 102659, 104557, 105946, 107243, 109351, 113274, 119207, 126011, 132059, 136683, 140500, 144489, 149204, 154766, 160900, 166871, 171944, 176197, 180562, 185907, 192295, 199119, 205576, 211002, 215152, 218291, 220774, 222548, 223356, 223345, 223037, 222749, 222468, 222234, 222100, 221620, 219951, 216778, 212773, 208902, 205547, 202475, 199330, 195893, 192081, 187971]
53885A87971m172l982l645l279l023k932k813k468k180k544l571m461m522l976
53871A40403l363k704j796r78r40j783k860l540l706l550l277l040k782k181j119
53856A02784j57j04j036k116k541k323j962j642j131l73K12J84l49q62j014r00
53840H6670p02m29j26n1l87r40j375j462r84J85J569K121J326n5r57j310j623
53823H1470j739j147l05l43j227j569p12K30J70k50J97J363K050J867J594J879
53807H3528K534L091L308L146K835K915L633M418M513L979L485L266K978K541
53793A30170K371K631K946L003K919K762K279J427P20N93P27M73j79n18j43L51
53777A52532O8r71j780j667j138j188j987k791k995k734k351j932j519j354j530
$$ y = [187971, 183799, 179817, 176172, 172893, 169870, 166938, 164125, 161657, 159477, 156933, 153362, 148901, 144379, 140403, 137040, 134336, 132540, 131562, 130622, 128839, 125979, 122439, 118733, 115183, 111906, 108866, 106084, 103903, 102784, 102627, 102523, 101487, 99371, 96830, 94507, 92545, 90903, 89772, 89399, 89611, 89795, 89446, 88584, 87570, 86670, 85968, 85539, 85413, 85362, 84975, 84035, 82660, 81198, 80214, 80399, 81968, 84089, 85415, 85360, 84403, 83093, 81470, 79731, 78584, 78279, 77936, 76709, 75140, 74428, 74658, 74828, 74578, 74775, 76138, 78188, 80055, 81649, 83528, 86062, 89153, 92461, 95607, 98442, 101357, 104990, 109408, 113921, 117900, 121385, 124651, 127629, 130170, 132541, 135172, 138118, 141121, 144040, 146802, 149081, 150508, 151228, 151821, 152548, 153021, 152842, 152324, 152181, 152532, 152600, 151629, 149849, 148182, 147044, 145856, 143869, 141078, 138083, 135349, 132998, 131066, 129547, 128193, 126663]
53762A26663j756j775j715j862k283k840l226l008k076j154j249k356l316l280
53748I4767k589j865j013J59R73N39q72k003k072j397o24m0K83L13J77P8M5M7
53730H4906J69L69K42m19j059r03l1O86P21M21L06M21N13M47K46O1J81P85J611
53711H9673K111K003J422O43o4l28J04R93J727J870J396N05m38q96n31L62J165
53694A01717J685K168K598K558J973J427J450J830K030K012K204K702K917K221
53680A31492P62o02j111p63r4M54P55Q07O23L82K42j3p95j966k747k590j847j236
53662A21753r80q61p03m37O6P32J067P12j3n27p24q19p41l28Q2o5o64j069j029
53643A15452q84p54l23L58O43K61j36J32Q04J134J016J054J586K165K113J319
$$ y = [126663, 124907, 123132, 121417, 119555, 117272, 114432, 111206, 108198, 106122, 104968, 103719, 101363, 98047, 94767, 92178, 90313, 89300, 89459, 90432, 90971, 90099, 88096, 86024, 84627, 84003, 83963, 84246, 84559, 84736, 84814, 84859, 84906, 85075, 85444, 85686, 85267, 84208, 83305, 83274, 83960, 84681, 85102, 85408, 85829, 86342, 86789, 87035, 87096, 87277, 88062, 89673, 91784, 93787, 95209, 95852, 95788, 95460, 95564, 96557, 98284, 100154, 101550, 102055, 101617, 100721, 100190, 100552, 101717, 103402, 105570, 108168, 110726, 112699, 114126, 115576, 117406, 119436, 121448, 123652, 126354, 129271, 131492, 132254, 131652, 130541, 129778, 129684, 130138, 130893, 131700, 132323, 132705, 132947, 132934, 132139, 130173, 127426, 124836, 122989, 121753, 120773, 119912, 119209, 118772, 118838, 119570, 120637, 121349, 121336, 120809, 120085, 119266, 118525, 118197, 118279, 118214, 117550, 116481, 115452, 114568, 113814, 113491, 113849, 114492, 114753, 114617, 114749, 115553, 116687, 117703, 118757, 120343, 122508, 124621, 125940]
53627A25940L79K6M74J306J991K352K490K454K183J739J278Q44M69L86P97J463
53611A46571J870J857J787K006K470K938L253L319L115K808K619K518K310K053
53597A81494K048K370K754L008L143L030K427J465P40N65N74L35o9l67o27r94
53581B01896j237j036n80l54m87p70j169j738k138j861j091o68r46j292j144r50
53565A84435j430k280k462j703q70o80p94n95j83r3l64n91o68q39j068r87n23
53548A68305p1J63N20J376K538L341L227K198R38M12J034K221L008L106K947K915
53532A98178L094L636M715N979O767P053P482Q243Q697Q492Q317Q916J0072J1137
53518C00778J2014J2879J3451J3316J2707J2317J2604J3724J5596J7528J8388
$$ y = [125940, 126319, 126345, 126819, 128125, 130116, 132468, 134958, 137412, 139595, 141334, 142612, 143456, 143925, 144311, 145108, 146571, 148441, 150298, 152085, 154091, 156561, 159499, 162752, 166071, 169186, 171994, 174613, 177131, 179441, 181494, 183542, 185912, 188666, 191674, 194817, 197847, 200274, 201739, 202479, 203044, 203618, 203953, 203884, 203517, 202890, 201896, 200659, 199623, 199043, 198689, 198202, 197432, 196263, 194525, 192387, 190526, 189435, 188767, 187821, 186529, 185385, 184435, 183005, 180725, 178263, 176560, 175690, 175010, 174216, 173621, 173438, 173345, 172981, 172390, 171722, 170883, 169815, 168828, 168305, 168234, 168397, 168917, 170293, 172831, 176172, 179399, 181597, 182535, 182947, 183981, 186202, 189210, 192316, 195263, 198178, 201272, 204908, 209623, 215602, 222369, 229422, 236904, 245147, 253844, 262336, 270653, 279569, 289641, 300778, 312792, 325671, 339122, 352438, 365145, 377462, 390066, 403790, 419386, 436914, 455302]
53507D55302J7988J7684J8698K0398K1278K1153K1067K1351K1278K0663K0318
53496F77178K0538K0506J9732J8943J8888J9225J9319J9282J9441J9542J9264
53485H91858J8983J9167J9493J9294J8579J7879J7299J6423J5076J3671J2749
53474A080471J2491J2582J2377J1427R968Q610P420N738L185L57j903l492m859
53461A154372o255p721r508j1852j4393j6309j7110j7045j6823j7200j8595k0735
53449I80826k2699k3668k3529k2728k1731k0868k0339k0008j9433j8413j7360
53438G50050j6756j6501j6119j5377j4330j2959j1201r209p248n460m017l155
53426F17718k680j805n0J935L180L840N047P220R477J1007J2269J4154J6513J8308
$$ y = [455302, 473290, 490974, 509672, 530070, 551348, 572501, 593568, 614919, 636197, 656860, 677178, 697716, 718222, 737954, 756897, 775785, 795010, 814329, 833611, 853052, 872594, 891858, 910841, 930008, 949501, 968795, 987374, 1005253, 1022552, 1038975, 1054051, 1067722, 1080471, 1092962, 1105544, 1117921, 1129348, 1139316, 1147926, 1155346, 1161084, 1164269, 1164626, 1162723, 1159231, 1154372, 1148117, 1140396, 1130888, 1119036, 1104643, 1088334, 1071224, 1054179, 1037356, 1020156, 1001561, 980826, 958127, 934459, 910930, 888202, 866471, 845603, 825264, 805256, 785823, 767410, 750050, 733294, 716793, 700674, 685297, 670967, 658008, 646807, 637598, 630350, 624890, 620873, 617718, 615038, 613233, 613183, 615118, 618298, 622138, 627185, 634405, 643882, 654889, 667158, 681312, 697825, 716133]
53412G16133J9022J9260J9853K0953K2244K3616K5235K7071K8753K9983L0922
53401I83045L1979L3379L5096L7109L9454M1950M4202M6031M7690M9369N0713
53390A440017N1226N1069N1027N1557N2255N2487N2191N1760N1309N0515M9082
53379B004495M7028M4436M1334L7951L4725L1816K8779K5073K0753J6389J2504
53368B345283R251O525L897O06l850r099j4335j9450k5066l1378l7593m2898m7352
53355B134541n1333n4663n6952n8386n9361n9692n8948n7479n6186n5300n4199
53344A512042n2562n0855m9435m8059m6660m5852m6029m6439m5882m4032m1480
53333I94757l8831l6290l4099l2589l1597l0256k7746k4203k0656j8045j6385
$$ y = [716133, 735155, 754415, 774268, 795221, 817465, 841081, 866316, 893387, 922140, 952123, 983045, 1015024, 1048403, 1083499, 1120608, 1160062, 1202012, 1246214, 1292245, 1339935, 1389304, 1440017, 1491243, 1542312, 1593339, 1644896, 1697151, 1749638, 1801829, 1853589, 1904898, 1955413, 2004495, 2051523, 2095959, 2137293, 2175244, 2209969, 2241785, 2270564, 2295637, 2316390, 2332779, 2345283, 2354534, 2361059, 2364956, 2365562, 2361712, 2352613, 2338278, 2318828, 2293762, 2262384, 2224791, 2181893, 2134541, 2083208, 2028545, 1971593, 1913207, 1853846, 1794154, 1735206, 1677727, 1621541, 1566241, 1512042, 1459480, 1408625, 1359190, 1311131, 1264471, 1218619, 1172590, 1126151, 1080269, 1036237, 994757, 955926, 919636, 885537, 852948, 821351, 791095, 763349, 739146, 718490, 700445, 684060]
53322F84060j4982j3360j1691j0277q982p505n977m804l967k986j554J75J981
53309F00131L747N195N955O157O489P426Q767J0084J1293J2491J3658J4802J6105
53296G22300J7683J9377K1009K2533K3833K4751K5471K6449K7671K8429K8223
53285I87729K7488K6994K6814K6370K5288K3740K2030K0263J8396J6322J3952
53274A235386J1361Q888O810N004L032N77k206m714o349p232q367j0637j3712
53261A217841j6446j8404k0338k2872k5451k7143k7965k8677k9642l0608l1434
53250I38861l2352l3339l3831l3273l1735k9842k8266k7276k6628k5923k5049
53239F11347k4232k3657k3341k3382k3930k4703k4954k4175k2592k0774j9107
$$ y = [684060, 669078, 655718, 644027, 633750, 624768, 617263, 611286, 606482, 602515, 599529, 597975, 598150, 600131, 603878, 609073, 615028, 621185, 627674, 635100, 643867, 653951, 665244, 677735, 691393, 706195, 722300, 739983, 759360, 780369, 802902, 826735, 851486, 876957, 903406, 931077, 959506, 987729, 1015217, 1042211, 1069025, 1095395, 1120683, 1144423, 1166453, 1186716, 1205112, 1221434, 1235386, 1246747, 1255635, 1262445, 1267449, 1270481, 1271058, 1268852, 1264138, 1257789, 1250557, 1242190, 1231553, 1217841, 1201395, 1182991, 1162653, 1139781, 1114330, 1087187, 1059222, 1030545, 1000903, 970295, 938861, 906509, 873170, 839339, 806066, 774331, 744489, 716223, 688947, 662319, 636396, 611347, 587115, 563458, 540117, 516735, 492805, 468102, 443148, 418973, 396381, 375607, 356500]
53228C56500j7812j7005j6366j5194j3224j1052r454q552q020p599p063o105m832
53215B14222l935l898m399m933n505o059n906m632l213l078m189n041m588l286
53201A51560k138j607j689k240k779k658j810q65l78l29n27r56j490j844j963
53186A28287k059k063j620q25l29m56p39p14o61j017j595j859j684j382j148r84
53170A09152r52j121j306j255j023q89r10q02l34L01O09K85l95q37q43q70j294
53153I7516j676j272j47Q20J036P61L95q6o96j070j022r68j276j559j225m10K34
53136H9355M33M15K79j20o40q63p38o64p71o51m5O23P54L34j85m93n55l57P2M16
53116H6599K71l35r23j177j249j334j322j079q61j034j479j655j269n56J10N89
$$ y = [356500, 338688, 321683, 305317, 290123, 276899, 265847, 256393, 247841, 239821, 232222, 225159, 219054, 214222, 210287, 206389, 201990, 197057, 191552, 185493, 179587, 174955, 171742, 168664, 164475, 159434, 154846, 151560, 149422, 147815, 146126, 143886, 141107, 138449, 136639, 135774, 135396, 135067, 134540, 133584, 132094, 130250, 128287, 126228, 124165, 122545, 121720, 121391, 120935, 120196, 119482, 118821, 117804, 116209, 114350, 112666, 111284, 110136, 109152, 108200, 107079, 105773, 104518, 103495, 102606, 101696, 100894, 100560, 100861, 101470, 101755, 101360, 100523, 99680, 98810, 97516, 95840, 94568, 94421, 95241, 96277, 97038, 97433, 97347, 96651, 95581, 94559, 93591, 92315, 90756, 89531, 89121, 89355, 89788, 90203, 90482, 90362, 89722, 88859, 88121, 87457, 86686, 86035, 85990, 86613, 87367, 87701, 87516, 87023, 86468, 86111, 86183, 86599, 86870, 86535, 85612, 84435, 83186, 81852, 80530, 79451, 78590, 77556, 76077, 74422, 73153, 72597, 72707, 73296]
53100G3296Q14O08j07j069j904k438k627k381j688q00o6L71N97P09P70Q30Q21
53083F5736N61K2n24q35j003j154j091n52K61Q18Q82O25J55o17j577k262k356
53066E7089j995j415o12L34R47P51p8p77p76j48O88J410J791J551O09n68j245
53049E7556j215r90j028j065o83k35m99j407j866j171L1O32M08r6n69j054j304
53032D5445q71Q8P84P65L83Q4j91o31j037j053o41NP51J402J533Q71k14r29q40
53013D5704k20M04Q10J018R92O91M89J019K352L579L663K627J455P96L83j83o85
52996F4894q01p75j001j276j071m01J73K69o9o87j367j661j301p40o89j139j409
52979E0949j219r97r89q20l04om58j184j218l61N29O13pn32m14J37N03L27k55
$$ y = [73296, 74110, 74718, 74611, 73542, 71638, 69200, 66573, 64192, 62504, 61704, 61638, 62009, 62606, 63315, 64085, 64915, 65736, 66297, 66319, 65795, 64960, 63957, 62803, 61712, 61160, 61421, 62239, 63121, 63746, 63901, 63284, 61707, 59445, 57089, 55094, 53679, 53067, 53401, 54348, 55099, 55021, 54244, 53468, 53320, 54008, 55418, 57209, 58760, 59369, 58801, 57556, 56341, 55351, 54323, 53258, 52575, 52340, 51841, 50434, 48568, 47397, 47428, 48060, 48468, 48372, 47803, 46749, 45445, 44574, 44662, 45446, 46211, 46594, 46678, 46487, 45856, 44819, 43766, 43125, 43130, 43881, 45283, 46816, 47687, 47473, 46544, 45704, 45484, 45888, 46698, 47716, 48708, 49399, 49888, 50907, 53259, 56838, 60501, 63128, 64583, 65379, 65762, 65579, 64894, 64093, 63318, 62317, 61041, 59970, 59569, 59742, 60011, 59942, 59255, 57888, 56227, 54926, 54186, 53497, 52358, 50949, 49730, 48733, 47744, 46924, 46620, 46614, 46156, 44972, 43754, 43393, 43922, 44535, 44528, 43996, 43582, 43719, 44222, 44549, 44294]
52960D4294r08j300j122l40M09J39j328k840l082k026p37M8M98J002J544J840
52944C6091J663R45k1o14n31k97n16q48m86M67R56M87k57n02k77P4M61P09M28
52925C7932l25q69q53p22q27p91l51p0m49r11n34N48J301J117K67p13j404j471
52907C0875r48m44m51o00j94O23R39L28n23o41J91J298J752J205K22l03j92j17
52889C3020m25m76L32J387J560Q00P2j17j89m18m05J9K48k26r33j008k87O91J511
52870C5156K203K807L057K611J522L47k64k11j8q4m1P25K061L110L400L344L378
52853F3103L249K543J462N77k3p53j763k571k633j968j087n34m88p29q60o73l50
52836E6502k74o04j146j627j865j737j162k98L82M93K18J14L57M10l35j780l123
$$ y = [44294, 43386, 42086, 40964, 40624, 41033, 41172, 39844, 37004, 33922, 31896, 31159, 31207, 31705, 32707, 34251, 36091, 37754, 38699, 38678, 38064, 37533, 37236, 36720, 35872, 35386, 35853, 36809, 37296, 37039, 36537, 36260, 36334, 36795, 37504, 37932, 37607, 36738, 35885, 35163, 34336, 33545, 33194, 33124, 32675, 31764, 31230, 31778, 33079, 34196, 34463, 33750, 32346, 30875, 29927, 29483, 29032, 28432, 28238, 28861, 29800, 30128, 29605, 28964, 29155, 30453, 32205, 33410, 33632, 33329, 33137, 33020, 32595, 32119, 32451, 33838, 35398, 36198, 36270, 36153, 35964, 35546, 35141, 35160, 35408, 35182, 34249, 33241, 32954, 33645, 35156, 37359, 40166, 43223, 45834, 47356, 47703, 47439, 47228, 47210, 47126, 47085, 47810, 49871, 52981, 56381, 59725, 63103, 66352, 68895, 70357, 70934, 70911, 70158, 68395, 65824, 63191, 61223, 60136, 59602, 59114, 58385, 57525, 56852, 56502, 56228, 55624, 54478, 52851, 50986, 49249, 48087, 47789, 48171, 48664, 48882, 48996, 49353, 49763, 49428, 47648, 44525]
52819D4525l569k907j542k23M43M24K73M62Q28R24O34J58m81j319j987j952j381
52802C3310j075j391j749j518q46k52O4J37n2l01q8P14J402J265N41o6m14q19
52784B8862j169r70k18M79P31O85N41L37K43M68P86P11K57n5o6j88n64o87k22
52765B9961L54M39J39n8q5k25m67m65q5M52R38J370J727J845J604J132P61P49
52747D0086R76R16J54r95j683j452o78K2N30J010J359J320J108J272J835K039
52731D7819J297J64j56P32J855J955R24j90n10k34o2j20P4P05J187Q07m02j713
52713E4132k420k410k030j718j700j958k240k122j287O0J063Q60m55j725j799
52698C4251o85O06J178J048Q23R51J346J539J107O2j065j666j506p98K9N15L63
$$ y = [44525, 40956, 38049, 36507, 36284, 36727, 37151, 37424, 37886, 38714, 39638, 40272, 40430, 39949, 38630, 36643, 34691, 33310, 32235, 30844, 29095, 27577, 26731, 26479, 26543, 26680, 26628, 26327, 26239, 26953, 28355, 29620, 30161, 30095, 29681, 28862, 27693, 26723, 26505, 26984, 27715, 28400, 28941, 29278, 29521, 29989, 30775, 31486, 31743, 31688, 31622, 31434, 30870, 30183, 29961, 30315, 30754, 30893, 30835, 30750, 30525, 30058, 29593, 29508, 29960, 30898, 32268, 33995, 35840, 37444, 38576, 39337, 40086, 41062, 41978, 42132, 41137, 39454, 38002, 37324, 37346, 37876, 38886, 40245, 41565, 42673, 43945, 45780, 47819, 49116, 49280, 49124, 49856, 51711, 53666, 54590, 54400, 53890, 53656, 53594, 53474, 53548, 54253, 55440, 56247, 55845, 54132, 51712, 49302, 47272, 45554, 43854, 41896, 39656, 37534, 36247, 36307, 37370, 38230, 37775, 36050, 34251, 33566, 34172, 35350, 36398, 37221, 38172, 39518, 41057, 42164, 42226, 41161, 39495, 37989, 37191, 37220, 37735, 38098]
52681C8098k54o87m48J81N18M22M29R49J700K120J985J461Q52M72M83O10L13n49
52663D8655j416j652j213n53j22j88q32j745k222j802p73K26Q90J206J015K31
52647C9705o47q76m03R7K47L95P57Q48K41n81q42o06n92r99j220q48k12L07Q60
52628C5631J623K177J994J255O70N48M73j9q71j606j811j393o46l7K36L80O05
52611C9209O64K23m58o75j78N09Q17P62O12M19K17L21R86J892K416K327J828J086
52593E2977J34p39r84l76O37J323J285O58m6k12M78J681K543K379J317J35m56
52576F2734l57L4L12L49K17J0j95l00l20m32p61j090j008l75M54R49Q20J01q70
52557F0272j517j393o59nJ11q8j97k44m98q32p99l44j5k55p46o95K33J372J598
$$ y = [38098, 37844, 37157, 36709, 36890, 37408, 37830, 38259, 39208, 40908, 43028, 45013, 46474, 47326, 47798, 48281, 48891, 49204, 48655, 47239, 45587, 44374, 43821, 43699, 43511, 42679, 40934, 38712, 36910, 36137, 36363, 37253, 38459, 39474, 39705, 39058, 38182, 37779, 37876, 38123, 38518, 39275, 40123, 40364, 39783, 38941, 38335, 37743, 36744, 35524, 34676, 34464, 34771, 35631, 37254, 39431, 41425, 42680, 43350, 43898, 44371, 44352, 43481, 41875, 40064, 38671, 38025, 37988, 38224, 38604, 39209, 39873, 40096, 39638, 38963, 38785, 39294, 40111, 40873, 41485, 41904, 42121, 42442, 43428, 45320, 47736, 50063, 51891, 52977, 53111, 52372, 51388, 51012, 51649, 52972, 54257, 54915, 54869, 54657, 55135, 56816, 59359, 61738, 63055, 63190, 62734, 62377, 62411, 62723, 63072, 63289, 63299, 63104, 62804, 62484, 62052, 61291, 60201, 59193, 58818, 59272, 60221, 61041, 61142, 60272, 58755, 57362, 56703, 56698, 56809, 56721, 56524, 56280, 55782, 54950, 54151, 53807, 53792, 53537, 52791, 52096, 52329, 53701, 55299]
52538E5299N27r00j324m89N13O85K77J05K37J41j90j58K76L65j87n56mR04J043
52519E6564L41k37j79n5m79j164j388r77l57O5K01J04j22k78j71K23P98J382J658
52500E5929J199j2j250j634j106m52k63l29j77J88M24M58M41L05j94r97j648j751
52482D9131j285m53M89J229J518J346R30N15L03M18P37Q93P19N45P73J228J343
52465F0379Q80R0p06j279j320p04Q1L15o2m51n06m21k35L35J079J151K60o85p29
52446E7472j49J35q7k60p4K61N57P81P86M57J39K66O46O58K14j43r4L5n3r9K45
52425F1693P16O66j34j145j581j185m43k3r4l29l93j36N29J496K243K291J917
52408F6088J791J776R37q17k054j579j68M65k9m63n5N81N72n9o73q13m25K23O27
$$ y = [55299, 55826, 54926, 53602, 53113, 53626, 54311, 54588, 54693, 54930, 55071, 54881, 54723, 54999, 55364, 55177, 54621, 54617, 55521, 56564, 56905, 56668, 56489, 56434, 55955, 54791, 53403, 52426, 52069, 52134, 52335, 52439, 52317, 52039, 51868, 52091, 52889, 54271, 55929, 57128, 57116, 55866, 54232, 53126, 52674, 52411, 52082, 51905, 52093, 52517, 52975, 53416, 53721, 53527, 52530, 50882, 49131, 47846, 47393, 47882, 49111, 50629, 51975, 52905, 53420, 53723, 54141, 54878, 55771, 56490, 57035, 57808, 59036, 60379, 61259, 61349, 60643, 59364, 58044, 57340, 57421, 57736, 57674, 57223, 56717, 56296, 56061, 56396, 57475, 58626, 58886, 58201, 57472, 57323, 57458, 57371, 57111, 57037, 57298, 57855, 58636, 59422, 59879, 60018, 60284, 60930, 61588, 61802, 61659, 61565, 61600, 61547, 61448, 61693, 62409, 63075, 62941, 61796, 60215, 59030, 58587, 58564, 58470, 58141, 57748, 57612, 58141, 59637, 61880, 64171, 66088, 67879, 69655, 70592, 69775, 67721, 66142, 65974, 66439, 66410, 65947, 65892, 66473, 67045, 66986, 66313, 65500, 65075, 65298, 65925]
52389F5925M31r8l36kO50J248J488J079O1r00j088n53P9M82P16O63J14o56j076
52370F8227j101j095r64j89J140K190K509K495K488K208J489P95N02K97j92o36
52354H0163m88K01R00J210J009L65k81k51N99J440J357M56k95k03M90J048J047
52337H8767O80M34N18O97P53R07J475K287K815K861K724K674K697K737K795K778
52321A18599K660K763L396M260M703M549M190L892L610L438L625M027M229M202
52307A72143M218M099L375K350K070K884L830L894L184K450K059J924J864J627
52293B11971J061N36N41P99N18j81j71Q71J613Q62p18j563j211m15K16O65R45
52276B16339J046J248J704J973J591Q94N73P42J065J530K313L102L371L213L206
$$ y = [65925, 66356, 66258, 65922, 65920, 66570, 67818, 69306, 70385, 70446, 69546, 68458, 67905, 67984, 68466, 69182, 69845, 69959, 69303, 68227, 67126, 66031, 65067, 64878, 66018, 68208, 70717, 73212, 75700, 77908, 79397, 80192, 80694, 80991, 80799, 80163, 79675, 79876, 80776, 81986, 82995, 83360, 83079, 82828, 83427, 84867, 86224, 86680, 86385, 86182, 86672, 87720, 88767, 89447, 89881, 90399, 91096, 91849, 92756, 94231, 96518, 99333, 102194, 104918, 107592, 110289, 113026, 115821, 118599, 121259, 124022, 127418, 131678, 136381, 140930, 145120, 149012, 152622, 156060, 159685, 163712, 167941, 172143, 176361, 180460, 183835, 186185, 188255, 191139, 194969, 198863, 202047, 204497, 206556, 208480, 210344, 211971, 213032, 213568, 214109, 214908, 215426, 215245, 215074, 215945, 217558, 218420, 217702, 216139, 214928, 214513, 214729, 215394, 216339, 217385, 218633, 220337, 222310, 223901, 224795, 225368, 226110, 227175, 228705, 231018, 234120, 237491, 240704, 243910]
52261B43910L492L689L613L551L724M050M433M825N020M750M004L096K453K445
52247B97055L067L713L727L325L393M115M577M128L330K994L056L192L625M435
52233C47732M829M256L570L916M910N264M768M315M233M051L832M215N016N217
52219D10124M693M494N073N496N130M775N330O272O465N818N171N024N112N017
52205D83994M593L992L652M003M854N415N188M454L702L071K633K596K824K675
52191E37646J859J028R76J541J878J573R65M41l6o58j346j830j978j983k205k706
52175E35165l094k962k435k034k006k095k014j815j709j824k193k692l021k971
52161E02300k684k351j852j096o06j121k560l940m469m210l555k683j788j260
$$ y = [243910, 247402, 251091, 254704, 258255, 261979, 266029, 270462, 275287, 280307, 285057, 289061, 292157, 294610, 297055, 300122, 303835, 307562, 310887, 314280, 318395, 322972, 327100, 330430, 333424, 336480, 339672, 343297, 347732, 352561, 356817, 360387, 364303, 369213, 374477, 379245, 383560, 387793, 391844, 395676, 399891, 404907, 410124, 414817, 419311, 424384, 429880, 435010, 439785, 445115, 451387, 457852, 463670, 468841, 473865, 478977, 483994, 488587, 492579, 496231, 500234, 505088, 510503, 515691, 520145, 523847, 526918, 529551, 532147, 534971, 537646, 539505, 540533, 541509, 543050, 544928, 546501, 547466, 547907, 547871, 547213, 545867, 544037, 542059, 540076, 537871, 535165, 532071, 529109, 526674, 524640, 522634, 520539, 518525, 516710, 515001, 513177, 510984, 508292, 505271, 502300, 499616, 497265, 495413, 494317, 493711, 492590, 490030, 486090, 481621, 477411, 473856, 471173, 469385, 468125]
52147D68125j264j492j688j935k263k388k229k224k718l384l692l657l672l826
52133D31693l890l798l675l463k978k380k134k359k548k163j392j035j589k570
52119C95719k898j972k46J313K162K482K684K909K979K698K199K015K607L747
52105D18398M616M703M336M096M081M118M265M588M727M315L663L400L553L646
52091D76505L579L687L919L741L016K296K018J964J771J420J064Q36R64J548K124
52076E10452K056J511J338J840K376K463K472K801L113K981K722K897L419L747
52062E46188L643L215K567J917J668J824J669O49p45j558j653j786k450l312l809
52047E48027l844l739l767l858l691l136k716l253m872o578p281o942o346n943
$$ y = [468125, 466861, 465369, 463681, 461746, 459483, 457095, 454866, 452642, 449924, 446540, 442848, 439191, 435519, 431693, 427803, 424005, 420330, 416867, 413889, 411509, 409375, 407016, 404468, 402305, 400913, 399878, 398289, 395719, 392821, 390849, 390603, 391916, 394078, 396560, 399244, 402153, 405132, 407830, 410029, 412044, 414651, 418398, 423014, 427717, 432053, 436149, 440230, 444348, 448613, 453201, 457928, 462243, 465906, 469306, 472859, 476505, 480084, 483771, 487690, 491431, 494447, 496743, 498761, 500725, 502496, 503916, 504980, 505816, 506780, 508328, 510452, 512508, 514019, 515357, 517197, 519573, 522036, 524508, 527309, 530422, 533403, 536125, 539022, 542441, 546188, 549831, 553046, 555613, 557530, 559198, 561022, 562691, 563340, 562595, 561037, 559384, 557598, 555148, 551836, 548027, 544183, 540444, 536677, 532819, 529128, 525992, 523276, 520023, 515151, 508573, 501292, 494350, 488004, 482061]
52033D82061n435m540l591l176l377l614l250k347j672j749k011j375L11J865
52019D48100K145J310L53j88m53n48l73j68n50j724l067l815l979m337n505p201
52003D20000q527r007r186r925j1194j2036j1814j1086j0864j1381j2038j2313
51991B90629j2358j2603j3198j3821j3895j2996j1262r342p827o865o344o152
51979A63966o001n398m219l161l097l945m598m156k925k004k070k746l134k781
51965A13731k064j613j553j453j033o19p82j602k527k886k438j457m16L59P53
$$ y = [482061, 476626, 472086, 468495, 465319, 461942, 458328, 455078, 452731, 451059, 449310, 447299, 445924, 446235, 448100, 450245, 451555, 451908, 451720, 451267, 450719, 450346, 450178, 449628, 447904, 444837, 441022, 437043, 432706, 427201, 420000, 411473, 402466, 393280, 383355, 372161, 360125, 348311, 337225, 326361, 314980, 302942, 290629, 278271, 265668, 252470, 238649, 224754, 211758, 200496, 191154, 183327, 176462, 170118, 163966, 157965, 152567, 148348, 145187, 142090, 138145, 133547, 129391, 126466, 124462, 122392, 119646, 116512, 113731, 111667, 110054, 108501, 107048, 106015, 105396, 104614, 103012, 100485, 97599, 95161, 93704, 93288, 93647, 94400]
$$ [...]
##END NTUPLES=NMR SPECTRUM
##END=
