
##TITLE=AC1295_UGARS11106_6615348_fLFundBM2C
##JCAMPDX= 6.0         $$ Bruker NMR JCAMP-DX V2.0
##DATA TYPE= NMR SPECTRUM
##DATA CLASS= NTUPLES
##ORIGIN= BRUKER
##OWNER= Administrator
$$ 1.72 TOPSPIN		Version 2.1
$$ 2012-08-02 19:47:28.390 -0500  Administrator@TOPSPIN
$$ Compression mode = diff/dup
##.OBSERVE FREQUENCY= 400.02188249412
##.OBSERVE NUCLEUS= ^1H
##.ACQUISITION MODE= SIMULTANEOUS (DQD)
##.ACQUISITION SCHEME= undefined
##.AVERAGES= 8
##.DIGITISER RES= 22
##SPECTROMETER/DATA SYSTEM= spect
##.PULSE SEQUENCE= zg30
##.SOLVENT NAME= COFFEE_meoh
##.SHIFT REFERENCE= INTERNAL, COFFEE_meoh, 1, 14.98509
##AUDIT TRAIL= $$ (NUMBER, WHEN, WHO, WHERE, PROCESS, VERSION, WHAT)
$$ ##TITLE= Audit trail, TOPSPIN		Version 2.1
$$ ##JCAMPDX= 5.01
$$ ##ORIGIN= Bruker BioSpin GmbH
$$ ##OWNER= Administrator
$$ $$ C:\Bruker\TOPSPIN/data/COFFEE/nmr/AC1295_UGARS11106_6615348_fLFundBM2C/10/pdata/1/auditp.txt
$$ ##AUDIT TRAIL=  $$ (NUMBER, WHEN, WHO, WHERE, PROCESS, VERSION, WHAT)
(   1,<2012-08-02 19:47:21.531 -0500>,<Administrator>,<TOPSPIN>,<go>,<TOPSPIN 2.1>,
      <created by zg
	started at 2012-08-02 19:46:14.953 -0500,
	POWCHK enabled, PULCHK disabled,
       configuration hash MD5:
       6B 1B 68 BB D9 2E 58 E2 7F 35 AD 54 07 DF 0E 41
       data hash MD5: 64K
       3B 32 3C 95 D8 69 C7 85 43 46 B9 C0 F1 FB 87 09>)
(   2,<2012-08-02 19:47:24.296 -0500>,<Administrator>,<TOPSPIN>,<proc1d>,<TOPSPIN 2.1>,
      <Start of raw data processing
       efp LB = 0 FT_mod = 6 PKNL = 1 PHC0 = 0 PHC1 = 0 SI = 32K 
       data hash MD5: 32K
       57 A9 33 FF 8C 8E 1A 6C 1A 87 27 50 0D EC 99 40>)
(   3,<2012-08-02 19:47:24.703 -0500>,<Administrator>,<TOPSPIN>,<proc1d>,<TOPSPIN 2.1>,
      <pk PHC0 = 180.7361 PHC1 = 0 
       data hash MD5: 32K
       BB 9D A1 34 62 AA D8 0B 8F 00 A4 5E 49 D0 8B A1>)
(   4,<2012-08-02 19:47:24.812 -0500>,<Administrator>,<TOPSPIN>,<proc1d>,<TOPSPIN 2.1>,
      <abs ABSG = 1 
       data hash MD5: 32K
       DE F3 E9 7F 28 EF AA 50 35 33 46 8B B5 27 ED 6B>)
(   5,<2012-08-02 19:47:24.843 -0500>,<Administrator>,<TOPSPIN>,<proc1d>,<TOPSPIN 2.1>,
      <abs ABSG = 2 
       data hash MD5: 32K
       75 8C 67 72 00 C0 CC C2 78 6F 5A 07 26 BA 31 DA>)
(   6,<2012-08-02 19:47:24.875 -0500>,<Administrator>,<TOPSPIN>,<proc1d>,<TOPSPIN 2.1>,
      <abs ABSG = 3 
       data hash MD5: 32K
       A5 94 56 38 20 8C FA 56 42 F6 3A 35 B7 BD D9 3C>)
(   7,<2012-08-02 19:47:24.906 -0500>,<Administrator>,<TOPSPIN>,<proc1d>,<TOPSPIN 2.1>,
      <abs ABSG = 4 
       data hash MD5: 32K
       65 83 AB DD 44 60 F8 BA D0 08 06 B8 5A 75 C1 48>)
(   8,<2012-08-02 19:47:24.937 -0500>,<Administrator>,<TOPSPIN>,<proc1d>,<TOPSPIN 2.1>,
      <abs ABSG = 5 
       data hash MD5: 32K
       7B 90 57 FA BB 0D 92 9E E6 C5 8A A4 E8 03 D4 95>)
$$ ##END=
$$ 
$$ $$ hash MD5
$$ $$ 15 0B F9 9D 4B FA 56 AF C8 CC 36 3A 40 A8 E4 9E
##$RELAX= 
##$RELAX= 
##$RELAX= 
##$RELAX= 
##$RELAX= 
##$RELAX= 
##$RELAX= 
$$ Bruker specific parameters
$$ --------------------------
$$ [...]
##$TP= (0..7)
150 150 150 150 150 150 150 150
##$TP07= 0
##$TPNAME0= <>
##$TPNAME1= <>
##$TPNAME2= <>
##$TPNAME3= <>
##$TPNAME4= <>
##$TPNAME5= <>
##$TPNAME6= <>
##$TPNAME7= <>
##$TPOAL= (0..7)
0.5 0.5 0.5 0.5 0.5 0.5 0.5 0.5
##$TPOFFS= (0..7)
0 0 0 0 0 0 0 0
##$TUNHIN= 0
##$TUNHOUT= 0
##$TUNXOUT= 0
##$USERA1= <user>
##$USERA2= <user>
##$USERA3= <user>
##$USERA4= <user>
##$USERA5= <user>
##$V9= 5
##$VALIST= <valist>
##$VCLIST= <CCCCCCCCCCCCCCC>
##$VD= 0
##$VDLIST= <DDDDDDDDDDDDDDD>
##$VPLIST= <PPPPPPPPPPPPPPP>
##$VTLIST= <TTTTTTTTTTTTTTT>
##$WBST= 1024
##$WBSW= 4
##$XGAIN= (0..3)
0 0 0 0
##$XL= 0
##$YL= 0
##$YMAX_a= 485478
##$YMIN_a= -632580
##$ZGOPTNS= <>
##$ZL1= 120
##$ZL2= 120
##$ZL3= 120
##$ZL4= 120
##$ABSF1= 14.98509
##$ABSF2= -5.573092
##$ABSG= 5
##$ABSL= 3
##$ALPHA= 0
##$AQORDER= 0
##$ASSFAC= 0
##$ASSFACI= 0
##$ASSFACX= 0
##$ASSWID= 0
##$AUNMP= <proc_prof1d_extract_pilot.lims>
##$AXLEFT= 0
##$AXNAME= <>
##$AXNUC= <1H>
##$AXRIGHT= 0
##$AXTYPE= 0
##$AXUNIT= <>
##$AZFE= 0.1
##$AZFW= 0.1
##$BCFW= 0
##$BC_mod= 0
##$BYTORDP= 0
##$COROFFS= 0
##$CY= 15
##$DATMOD= 1
##$DC= 0
##$DFILT= <>
##$DTYPP= 0
##$F1P= 0
##$F2P= 0
##$FCOR= 0.5
##$FTSIZE= 32768
##$FT_mod= 6
##$GAMMA= 0
##$GB= 0
##$INTBC= 1
##$INTSCL= 1
##$ISEN= 128
##$LB= 0
##$LEV0= 0
##$LPBIN= 0
##$MAXI= 10000
##$MC2= 0
##$MEAN= 0
##$ME_mod= 0
##$MI= 0
##$NCOEF= 0
##$NC_proc= -8
##$NLEV= 6
##$NOISF1= 0
##$NOISF2= 0
##$NSP= 0
##$NTH_PI= 0
##$NZP= 0
##$OFFSET= 14.98509
##$PC= 1
##$PHC0= 180.7361
##$PHC1= 0
##$PH_mod= 1
##$PKNL= yes
##$PPARMOD= 0
##$PPDIAG= 0
##$PPIPTYP= 0
##$PPMPNUM= 2147483647
##$PPRESOL= 1
##$PSCAL= 4
##$PSIGN= 0
##$PYNMP= <proc.py>
##$REVERSE= no
##$SF= 400.02
##$SI= 32768
##$SIGF1= 0
##$SIGF2= 0
##$SINO= 400
##$SIOLD= 32768
##$SPECTYP= <>
##$SREGLST= <1H.CDCl3>
##$SSB= 0
##$STSI= 32768
##$STSR= 0
##$SW_p= 8223.68421052631
##$SYMM= 0
##$S_DEV= 0
##$TDeff= 65536
##$TDoff= 0
##$TI= <>
##$TILT= no
##$TM1= 0
##$TM2= 0
##$TOPLEV= 0
##$USERP1= <user>
##$USERP2= <user>
##$USERP3= <user>
##$USERP4= <user>
##$USERP5= <user>
##$WDW= 1
##$XDIM= 32768
##$YMAX_p= 459520837
##$YMIN_p= -753552
##$CURPLOT= <Network HP LaserJet P1505>
##$CURPRIN= <$Network HP LaserJet P1505>
##$DFORMAT= <normdp>
##$LAYOUT= <+/1D_H.xwp>
##$LFORMAT= <normlp>
##$PFORMAT= <normpl>
##$SURQMSG= 1
$$ End of Bruker specific parameters
$$ ---------------------------------
##NTUPLES= NMR SPECTRUM
##VAR_NAME=  FREQUENCY,     SPECTRUM/REAL,   SPECTRUM/IMAG
##SYMBOL=    X,             R,               I
##VAR_TYPE=  INDEPENDENT,   DEPENDENT,       DEPENDENT
##VAR_FORM=  AFFN,          ASDF,            ASDF
##VAR_DIM=   32768,         32768,           32768
##UNITS=     HZ,            ARBITRARY UNITS, ARBITRARY UNITS
##FACTOR=    0.250966925370066, 1,           1
##FIRST=     8223.43324360094, 141702,       21547
##LAST=      0,             -212429,         240605
##MIN=       0,             -753552,         0
##MAX=       8223.43324360094, 459520837,    0
$$ Real data points
##PAGE= N=1
##DATA TABLE= (X++(R..R)), XYDATA
$$ [...]
23781 232621 63340 -22926 -30482 -70119 326716 101507 -76221 -76738 -56265 12980 124565
23770 124565 126337 184684 273591 -29591 -170934 -288210 114320 -124809 -107366 -125139 -325563
23759 -325563 241306 -410127 -62491 -14687 -95495 -106003 140424 -127170 -46478 220846
23748 -366516 324333 68924 -75055 -64909 113037 -140021 165048 8310 210679 167371 -214532
23736 75892 82879 198091 65662 14143 161076 -37106 -349113 -154762 -13908 -311565 -360400
23725 -360400 -22218 -17282 -141665 10373 109279 -145947 331071 -115063 72262 104701 184360
23714 184360 139552 -329253 10129 193334 238265 -95689 177700 -76295 138200 334706
23704 334706 46266 -69671 208758 266498 -126793 -7873 224118 153116 -209319 2583 31155
23693 31155 -53586 54722 -331218 207561 276063 -316287 -265144 58270 -1027 -283299 -54337
23681 137088 176441 -57485 -78785 147729 267223 -161889 125464 21589 123006 -212873
23670 -76330 -34770 82185 -124119 -128815 -44055 -396328 9847 29859 -271163 27638 -38042
23658 1637 100969 -99818 -369079 53703 -314155 -152878 -110956 -134295 91140 -117078 -21669
23646 -166885 -156630 -474341 -95984 -176842 -97765 49501 -12005 243767 -113447 90119 219196
23635 219196 -160992 135252 -207323 9813 -360853 -286343 -114872 151790 360775 -59428
23624 -18369 105543 -85567 322936 -198224 227000 -196424 -133028 96561 -186812 200708
23613 -591430 -341340 -110190 -287001 118292 26883 188460 237897 -227595 190860 -126906
23602 -136470 -84188 68610 -48767 -76468 98419 36684 -80961 82497 174253 -16814 -9734 192672
23589 184546 -163681 441622 60725 162461 -80986 -65130 189195 -152245 -216485 455081
23578 18950 67864 396384 269687 322657 20123 -99135 279707 155460 189657 136305 -115917
23566 -55451 242323 -139978 14102 -246822 -201347 172828 -107020 -93817 -148091 -204438 154565
23554 -36931 180253 -159484 -101780 -9993 -99319 -191682 -26426 248795 -297468 -108562 58076
23542 -214446 16307 105604 -169449 -168855 -290892 -189369 -378869 159863 -330424 -164794
23531 -267152 -23116 29164 -1574 72274 -101078 -9367 -57512 212080 128956 176839 130762
23520 130762 65977 136628 -217949 -154569 -169296 -90410 149880 -160619 -478453 -347807
23510 -347807 -113466 128468 30419 30604 -289413 -240867 -20710 -39901 32994 -40270 52926
23498 -189558 -24791 -59017 110682 228439 -422587 -82215 -246118 -109552 -805 -159041 -255628
23487 -255628 -82819 -66489 -349174 -18302 152505 12833 -62695 -253837 -123753 51148 126346
23476 126346 -151175 -367113 318889 258090 22007 148045 75070 580 -31134 -19895 -129377
23465 -129377 13231 -44512 201713 17474 -1044 124253 123417 -266064 -42981 -59788 -344324
23454 -344324 -31090 238563 -68282 -48963 184384 -145488 -29145 143958 -179777 -52512
23443 -85982 -157537 -244752 -161415 241310 -64340 -168904 -136493 1282 16622 41641 -70366
23431 -101243 -132697 116576 -19074 148277 -220158 -68468 -22873 259279 173178 -31080 320531
23419 -25019 21448 -247340 323441 -195786 -194836 43142 89561 -154857 -101173 36168 -145418
23407 -25477 -12664 91607 41293 -36331 -58522 102230 343974 47025 -41137 75585 -208286
23395 -48598 75788 -2198 -170238 -71150 130877 -239489 96371 -277295 329523 -17813 112174
23383 219964 22439 276991 -90758 -156356 -162703 64416 -11159 191325 -251779 -216377 50048
23371 215866 378051 -553131 107651 -147175 229946 -50245 -242759 -206337 -30939 -212197
23361 -212197 -232331 -144526 21878 -380409 -45808 -61676 -75452 126426 -8138 -188057 -140396
23350 -140396 -58797 -239530 267998 22910 -32703 -312242 94994 266606 -119177 78105
23339 -188657 -201412 -219522 96248 241479 -74482 16428 -391325 69435 136844 26442 -205592
23327 53295 3670 -107408 86340 36386 -8393 84323 -364869 229934 14544 -101326 337948
23315 153878 -3429 -3884 -197971 -1400 167555 -398518 35702 -2000 -65838 142726 -107007
23303 33281 -203369 378388 132939 53772 -226144 8985 78719 88251 68625 -84700 23538
23291 339529 -37993 -174061 -31269 135061 11217 -19210 41042 -250300 226125 48296 -370575
23279 -74499 -279036 -180357 -92586 -184863 -101942 -72988 170300 56319 67683 189977 35204
23267 -322945 99876 255730 210873 -5795 163293 -136624 -291576 199480 -36714 -69629 12141
23255 -178880 -150430 254538 -67699 -81369 64492 -295819 -112920 48798 81065 112061 -92804
23243 130568 186147 158353 -231737 -250373 79410 -144877 37536 -190095 -379393 -142635
23232 -56146 -28379 -169238 -262964 268321 -34295 -59619 -128836 -39519 -211039 -104261 -19885
23220 20990 131048 -75628 -28455 -195187 11138 -64235 61894 -61046 -191065 189152 -58430
23208 -106954 168593 -454547 -152648 -264036 -232345 130078 75618 -172138 -300677 81788
23197 146468 157177 99397 -105012 -601651 -246423 -45018 55271 -165916 326332 208767
23187 208767 292655 181905 -102821 -130798 -158512 -168829 29492 111097 9571 143286 -214727
23175 60179 -14987 107734 233321 -294634 -62683 510273 12208 90219 19416 -157566 73893
23163 -311291 -28652 123586 284185 -416489 -98347 20212 119180 -333215 297566 245466
23153 245466 2181 309332 -15556 10654 -319369 -183219 125396 -10632 -206627 -66794 -177305
23142 -177305 -65493 -256284 247235 1498 -167120 172658 -67386 79766 -55551 207427 27795
23130 -283760 -282072 -95634 -256307 28543 -44109 467033 -55874 66560 20495 128347 340176
23119 340176 198111 -29417 288394 142126 -3826 354595 251737 -182036 255546 207527
23109 207527 -230026 79064 -134641 4484 -266086 14752 -269438 -15964 -7502 121923 -221662
23097 -167405 7924 -106811 162544 -225312 -146768 135133 140832 -50855 65100 -457032 226695
23085 -253947 -60926 282938 37105 61514 -353520 -35761 177401 -12041 211044 243842 -107254
23073 -120576 -342790 -153191 -31545 -124620 -164713 -38932 -109374 1628 122698 -207451 -84326
23061 72876 87661 -164592 -1804 -57534 -80827 -77210 -126336 -208920 -58038 245778 -199479
23049 -25242 21427 220260 -102940 42066 48990 -25821 -95741 100735 59071 99312 83201
23038 83201 100621 216783 -192666 -30936 86968 295570 -186570 357764 -241454 -95671
23027 -307580 -153364 293300 -97843 -120409 57304 56743 -326292 162182 -106271 -52335 158269
23015 -44666 -233038 -246356 -115246 244525 70218 -188235 3562 -182790 16836 -144830 -28323
23003 113955 -83941 77735 -19901 75344 46832 70446 136227 65702 47727 116658 235747
22992 235747 18124 160422 -330427 -109482 -120853 200484 -192248 93850 -273388 -350906
22982 -350906 166944 93568 49123 82558 150454 -100070 -165748 54746 155041 -235984 -26608
22970 -96010 179234 164218 18816 179495 -39432 152601 -151443 -76816 -113810 312886 -276882
22958 150829 -115518 -42237 -166747 -369873 -152618 99421 -96796 476544 -90885 -124103
22948 -124103 9434 27842 -438616 -35849 -134669 476279 82 -129854 119315 154011 -438274
22936 -60936 44843 38603 -157949 -220635 -284981 -35936 97430 64922 -248849 -52346 -96128
22925 -96128 68436 -240979 -278426 113677 -396717 108441 -257071 164250 93511 -60772
22914 -6960 -47550 -89395 18965 -42094 520677 -61650 64450 -131803 342187 11930 -268387
22902 -118424 4536 -50938 -101417 -57375 9423 152487 330153 -85717 216131 -88800 -26971
22890 539 211882 213077 140954 -200604 172527 -50908 32737 -146191 -27018 153514 -127414
22878 115360 147888 228762 51959 -185780 205233 -51193 165749 215791 -81743 95676 -308371
22866 -223000 -147207 -100817 8615 230742 -443501 45998 77622 -5634 82373 -82591 -138559
22855 -138559 99567 -50340 -76933 -57245 -15263 -106323 116532 -135314 134664 236457 -76649
22843 -115392 204794 -255201 -308583 120230 78482 271071 -257195 107255 -190936 213201
22832 -107675 -239308 5356 53084 -242073 -181662 -169216 53544 159687 -83016 -194602 -279239
22821 -279239 -45905 -186799 -87360 -102212 167254 -95500 55777 -118445 -21699 -71241 -249826
22810 -249826 25100 -6641 -268676 -277982 127189 23540 -67796 136715 27610 198550 -70215
22798 -110823 15657 116648 188866 -104878 -32358 -344083 153212 -40534 -87838 -17447 100788
22786 -193708 200311 18356 156232 -336394 -251664 116297 163155 -37686 -293870 230318
22775 -62532 -215527 -289798 -329279 229397 -43237 57741 316611 -233155 -34354 104681 -288361
22763 2059 -74000 163188 111971 -16641 60464 15413 13651 -223879 28935 70474 1348 -151024
22750 -145607 -188808 70048 157748 61503 273549 -140930 -190391 153962 114831 -110585 -119038
22739 -119038 -9991 -173316 84627 -31475 -80274 -100293 -135922 -77118 42894 -401861 -51112
22727 -270577 20254 -243363 -186986 184340 -78597 -52068 -39114 -162047 23440 -121559 -187909
22716 -187909 -163129 -28299 -345548 150237 -35019 162547 126096 221831 335100 2933 98792
22705 98792 73842 -221290 -113939 -316494 -210280 -7243 -50065 130232 -316273 40632 11533
22693 134473 84313 -33183 -123358 -44562 -115289 71877 -146726 122548 1249 -25908 -317975
22682 -317975 -192947 -417183 122265 -279631 -78274 14855 -119782 -94331 130534 -156160
22671 -67269 13101 307430 154888 -136492 30694 -52205 10880 -231508 201572 -170228
22660 -138134 -55233 -71021 -19270 -76000 24249 98459 -180968 123738 -283301 -41448 -1597
22648 5921 -232100 1746 -423188 246006 -498168 -67739 98788 -129244 358721 -113615 -110168
22637 -110168 -69604 41291 58675 -290360 -223909 -21408 -198350 174003 -188072 249106
22626 28923 107658 87280 -5579 142243 3599 -181871 -62789 31664 -148177 192826 -317025
22614 230286 263437 -120914 158330 184893 -22448 306103 255056 279743 198248 129187 118553
22603 118553 -120002 -302415 -46536 142982 -277881 270001 -275803 10777 72346 167698
22593 167698 -125263 -204012 -95638 84081 -60383 112268 324751 -33085 -343337 33843 150431
22582 150431 -92837 218460 -158345 -15542 45657 -242710 -41440 -67825 62219 49667 17682
22570 -370350 212709 -24928 151758 208282 -303399 -314709 -59342 -129521 -123532 6145 63551
22559 63551 -29320 46535 -350315 1651 -247063 89700 47342 62530 123977 -422413 32778
22547 -100526 -92070 -16255 90924 274220 -111659 -249380 -247226 -226553 174883 -149217 58624
22535 163911 32958 225073 58671 -14298 -44388 14769 -17405 -181862 -27387 -2788 185809
22523 -37369 -89003 -105018 -239949 -7605 216455 -56366 -181260 -91918 -149770 8353 19986
22512 19986 90969 -11491 -249047 -253774 95533 -95732 7494 247051 -210789 217159 -158360
22500 -90850 -3244 189754 -26573 -45616 -195146 -57245 -297513 -175268 -191170 -74398 96989
22488 -137527 138247 -332893 -363407 66965 4910 -31306 60113 -104475 58908 -66820 216209
22476 171635 45417 -199038 -8049 -297006 419379 -7837 8440 32073 -276074 -193073 -18197
22464 -88073 -294074 136937 -125164 -112429 -9984 129462 -330747 90123 -330934 -159260
22453 -338562 -154128 -36464 -180687 322111 10231 121239 -81540 46108 153182 -244347
22442 -235493 116295 -206404 -202238 119100 52460 16601 -26636 -50450 -123040 -55066 -163247
22431 -163247 -2505 -48259 -79121 187628 13971 -211624 -28201 -235761 -101606 40354 -179333
22419 -559793 -81374 -7971 -12475 -437009 -274598 332530 -77706 -96383 -70543 151463 -68074
22407 -124703 -239689 27892 -341658 7126 -53187 -40446 245390 45827 122820 138428 -14615
22395 -10431 -291018 -218120 156716 -188221 -84363 94111 -271965 -247249 -279818 -120216 -211632
22384 -211632 25142 -200829 -191035 -31831 -82880 2516 -183531 -21673 -222204 -160778 -111032
22373 -111032 -2419 -81037 -316190 -276576 165571 76115 -59579 59211 -215043 339269 -224573
22361 -122752 27320 90398 -197646 -404897 -308087 316487 -345658 -66303 134779 -351628
22350 93480 -309371 227321 -29801 91672 -113097 -143687 -126628 27336 125298 -23138 -312073
22339 -312073 -51811 -25558 67327 80417 202706 -336892 116099 -46935 -19651 -71771 -14453
22327 -421341 -303039 51173 -103378 -88358 87309 58029 -89460 -65615 68714 -78254 -545
22315 -85944 -31444 34715 -143928 535015 -152735 -117394 45443 -137410 -206242 -195352 -21837
22303 -24523 124490 -46725 -189762 -249223 -209050 -128636 59163 -8827 -336735 148551 -279415
22291 60387 931 58431 135044 25660 -89536 307033 94428 -204566 62740 -8765 -21669 149879
22278 -183728 -320667 88604 -158274 -231373 6685 36597 -53295 125169 5091 -304999 348875
22266 162429 41865 -172332 -296725 -85533 -194238 40134 -375 -299009 43035 -236421 -286114
22255 -286114 -16408 -178105 78864 41129 -394629 88291 -175938 49991 -262218 -257949 -397191
22244 -397191 -64248 192879 89797 267900 254152 195548 -216468 31674 86089 -139507 -51793
22232 -490415 127389 42912 44025 139291 6780 -1027 -79499 -218354 3006 -65858 244593 37582
22219 11367 -186834 246318 252276 70983 -421064 -83861 -152956 293485 -90387 -55744 -197177
22208 -197177 119715 196830 265490 -217272 24982 -188069 -154185 20669 -131862 -217550 -173934
22197 -173934 -85432 112300 -106165 350779 -11385 196212 -283179 20968 15294 -140183
22186 -159709 -148966 99886 -67230 25010 102245 366986 -34131 -184001 181104 -15210 -292113
22175 -292113 65198 309704 -214316 -43984 69332 142231 -92856 94561 -59169 82678 -127786
22163 -146401 266154 -196517 -146869 -318928 57340 318224 253693 -5857 86016 -28659 -332463
22152 -332463 29474 -145947 -222929 -22101 -74731 -10254 -305558 -202190 93580 71106 294358
22141 294358 -40117 -289180 -12920 -231708 -239255 -54352 -52306 99056 108253 -15432 26199 298603
22129 298603 216407 353720 -8874 841 -68383 -123984 -6234 -451941 -127129 -127195 51646 -166083
22116 -124845 -294055 -105021 134219 79223 -125875 -95489 -68670 92147 154684 -30389 6955
22104 -242676 -67022 -390097 47567 46009 -17658 30362 -138148 192617 -132629 -81687 -132432
22093 -132432 -120320 -65670 13047 -215318 -92948 -231485 100852 -76627 -345668 129101
22082 -94432 -461319 -112672 42765 22024 119083 187372 58274 -210553 -235726 -92863 56167
22070 -284243 117035 219331 -166802 -166513 200196 97902 -167611 -368047 -177023 56214
22059 216491 226991 -228192 59667 30279 -171173 -268590 32966 -72143 -40176 -223911 58121
22047 99190 200813 167689 106302 -58284 -18117 -71215 43643 93456 -62100 236973 -160850
22035 86602 -6699 306110 -110404 -223823 -12122 -161631 11718 66423 8744 -198275 -129277
22024 -129277 119154 -324937 -185588 64525 177769 79979 -60995 -169541 25435 -204906
22013 50680 55150 115893 138008 -190877 -61600 -203276 134831 -230606 -328667 -190729 -366396
22002 -366396 76108 108871 -90243 151606 142915 -166687 -21965 387517 206074 -41511 -41039
21991 -41039 31518 162921 -32708 -65404 -18389 -296529 -281082 -90405 -245726 -7648 99656
21979 -86671 141442 -269783 -29310 -140572 -214963 -134734 87451 -3051 15448 -250854 -139359
21968 -139359 -301369 -214049 -310440 -249236 266188 -35252 31249 9753 70583 -107255 -109590
21957 -109590 -69360 -204806 -41162 -12121 140464 -361786 -118935 -140177 98732 -370961
21946 98265 109408 -255470 115477 -47265 -53663 114247 -216904 78778 -260472 -65315 -373428
21935 -373428 -205869 -325566 83061 -63592 -133865 452549 -128378 203067 192679 35772
21924 16966 22701 36674 191227 -283229 100234 -28670 -17167 -216902 239483 -213938 144994
21912 83966 -254428 -83979 -358884 -51201 77481 40880 76769 -467856 -263167 -402977 -40292
21900 -79967 75643 -177754 -125394 157568 -91875 -162732 51006 3032 87019 -1767 -200908
21889 -200908 -93924 127843 77566 -16887 -114085 134224 -127239 62849 -119401 144216
21878 -261996 -59755 -91193 -39105 24944 -260260 -239044 -204151 125667 -118803 54921 113206
21867 113206 94780 4667 -99903 -119663 -42643 54933 -471187 -68529 -284654 171930 34329
21855 -31758 -155545 -19855 -157493 -171302 -357784 -137454 225920 -237191 36467 163050
21845 163050 131728 -245125 -28840 -172765 -59682 -144703 3899 -174229 1264 -245903 -190687
21834 -190687 -16251 -104420 -156510 320823 34727 -188535 -14416 59511 49618 -192406 -73110
21822 -19978 107511 -164811 -405350 -163259 -1460 -1475 -149185 -324506 -71246 -147943 128493
21810 -419144 40590 -58087 -58531 -479 50337 -112909 -117230 38382 -44268 -112017 -213535 -44607
21797 -387118 -291973 -100972 92173 -474388 219451 -100739 -67226 75525 242621 164735
21787 164735 -355798 -227719 -98817 228045 170313 117229 -394392 -132342 -29361 86352
21776 -79622 -367596 148884 -38131 -151364 8373 22198 -59563 -109407 -314065 -73387 97068
21764 -194952 -437917 50104 -234483 -97052 16858 -83517 117619 -97917 -75511 -34915 54716
21752 -12554 -113969 140142 -78466 -197882 -265520 -50389 77574 -48573 193802 -107543 -115243
21741 -115243 -63546 -106340 -127377 65158 297431 160716 471225 -37353 -167672 50659 -53643
21729 -61966 21335 52937 52550 378436 -233377 -227949 -139787 37391 -42145 61214 36999 8894
21716 -78618 80696 50132 -72204 16123 350 4491 7916 -32231 -116741 -286285 212054 -406607
21703 -189377 -183854 113411 91050 53220 -83024 -137065 314177 -215306 101080 -386691 -74526
21691 -242389 13668 -158902 111465 8790 79240 428924 162582 41227 -33283 39458 -335776
21679 -77182 -69528 -88806 -26961 -353123 -202008 99241 72572 -260532 -85926 19109 -106556
21667 167474 88858 247623 -115631 351873 124676 -314139 -229415 -256473 -176546 248876
21656 96353 83863 76174 -61600 -331236 -54128 69593 123695 -128668 -20623 -78665 -215122
21645 -215122 -308607 -21324 173653 63904 -126952 -311491 65533 2012 7068 -243773 -87295
21633 -80693 -104851 -163519 -210156 -272144 191169 11408 -40016 -113580 -349942 39076 196361
21622 196361 -290783 -70652 -255934 -88113 -179755 -37468 69588 -62600 -86805 -209116 110680
21610 -164850 -177438 -114777 -232987 -275385 -307299 186344 -117326 -261944 -37456 -271261
21600 -271261 305282 121083 -219776 -179220 -142643 185492 15697 -105809 81616 42458
21590 42458 -183572 -239417 213887 -102392 -32090 -87541 408858 92422 -19077 -10208 -17584
21579 -17584 -23284 43488 36824 -121215 -346191 -149589 -307718 126318 -54714 -96372 -106166
21568 -106166 -43862 24 -223234 -3314 224013 58756 85711 -104508 -147521 -320526 -52710
21556 229571 -279594 53931 39821 2053 -150286 -168987 20860 -268793 18327 -384809 -117632
21544 -239754 -116878 174012 18336 64103 80474 32786 -79012 270242 -102094 121796
21533 -149295 -197054 -217108 126571 -105208 63519 -363955 -333948 170989 -35146 -122517 -245381
21522 -245381 260262 61799 -41586 168593 87389 -175284 -306830 104145 -91789 65303
21511 185553 91631 -284607 -186109 4668 113496 -61700 -149011 87529 -39557 45941 -266350
21499 -84767 -35543 135888 388588 -81346 104717 -257560 -183456 81203 145430 28056 -238626
21487 -8983 52904 189356 63544 -37708 -443415 80922 263552 -315376 171659 -184987 -288255
21476 -288255 -383161 52902 -122049 -299736 82612 117007 -284256 -415111 -40687 -158650
21466 -158650 55218 61797 36641 -39272 -263230 165280 -393232 -6192 -139363 -125855 21608
21454 340613 -206375 148093 -310896 -297790 421575 5513 -56252 -135627 -319961 -83264 -173552
21443 -173552 -343287 -191394 -131300 147980 -241714 105959 -66927 -106250 219681 -112608
21432 149184 -110046 288842 -368098 -145791 10268 131549 92059 457743 16889 179602
21422 179602 544413 842275 620936 650534 573076 440426 104386 160289 -96263 -49220
21412 -49220 167364 -243820 119657 -242332 263563 -41004 -206813 -417355 -144126 154858
21401 -286431 324595 143902 382884 -186025 -280518 9410 -260544 -102281 82237 -35913
21390 52022 25917 -163349 -16431 41209 -95846 -147162 -258724 -15131 -103480 -241332 -288886
21379 -288886 215999 64270 -134377 -129173 -236171 -87642 -218029 -312096 84551 -157900 34370
21367 62725 160037 -318118 -63003 205160 -33922 -96053 -151113 108293 -145056 109940 48750
21355 -139009 -33384 -61216 -16111 216179 -393962 -235213 33223 -138841 161664 -22181
21344 -21065 118010 23828 137288 29768 -236220 -126869 -140542 99200 -101783 -198340 -67978
21332 81010 -152923 10000 202533 174005 181913 -62177 148514 -80438 -99203 -281669 -285442
21321 -285442 -123327 -13954 -11572 -51906 251360 -20041 -146610 194186 -202584 172155
21310 201609 -219161 -217676 -64016 -95211 -27148 -27243 13989 -117526 16954 -5030 -118808 -162744
21298 -162744 -174012 67672 85137 28637 211234 -15423 -221971 30054 -114493 -12038 -31554
21287 -31554 -233719 17722 -17078 135614 -202354 -91706 13506 187886 -72721 -27541 79244
21275 -178236 148460 -294325 102751 10521 341156 -68542 97899 -83878 -201927 129679
21264 -86052 -211998 -243405 -115450 143841 -182879 -237220 -265726 18619 -35683 -251385 -271208
21253 -271208 -81969 -176922 -20539 270781 -71268 -30526 11708 46408 -375280 179479 -82242
21241 -80848 -10236 70311 137235 -160505 -211412 -154235 -95215 -215306 -130459 307117 79757
21229 -207461 180334 -95910 -214224 -77911 -75331 84702 -154559 -320916 145416 -107437
21218 45296 -268997 28687 192823 9757 2159 -48787 106334 -401619 -320044 -77953 -100772
21207 -100772 -142938 -199006 895 -9837 80904 265018 -74429 -105078 -299759 -102207 253312
21195 -271676 21118 -114176 39010 -296234 91980 -270612 133024 161098 -86062 -115010 16330
21183 -28849 -91433 -125913 78372 59129 -112682 -67860 -101138 -234982 -216148 284364 -123256
21171 165163 -94416 33517 -3462 -13614 -62330 -153304 84207 97113 -96127 -133544 -175408 -59928
21158 142016 124115 46121 96825 -207526 120396 -295815 -460301 -435263 -248436 29295
21147 -60885 -131298 -117987 58517 -422110 -182899 -245058 97828 293969 79724 202858 14559
21135 241362 126023 -417204 -220419 -79690 -20247 -235679 119484 -367487 -92771 -458483
21125 -458483 -125276 223889 -152212 -48324 214871 -330528 -197752 -139332 37791 -220534
21114 -123842 -149556 -62187 -174952 -147457 -418351 -147329 224242 -159342 54539 -18973
21103 -181888 -138391 -114504 36516 -252145 89013 165425 -221452 2647 -151128 -154894 199198
21091 40732 380487 -117984 -237587 27135 -47767 110794 -14672 164484 -48446 -20678 9883
21079 -63474 -263021 55484 -312470 40510 -167199 -158307 135012 -147184 -63511 18310 -76481
21067 186737 -12068 105601 130566 -184243 -126567 -64819 -211552 117541 -64359 -135652 -139177
21056 -139177 -100713 -12605 -253466 125448 22782 321484 81876 -181284 102089 -1209 -52726
21045 -52726 117562 -60012 4893 6875 267342 -287887 -301258 -7576 201807 246807 -130121
21033 160337 52956 -223651 164369 -111314 85339 131820 263875 -15643 187139 229650
21023 229650 -90466 -460028 -119365 169086 137154 15 -272129 -82213 -11225 -103303 73667
21011 3200 -71723 -304976 -116991 160718 61219 74853 -289596 -286208 117634 263620 375471
21000 375471 -65728 -125610 176295 450668 662205 365536 -111577 273030 78283 -274274
20989 194202 77340 19627 51794 -283015 -143799 395980 -29584 304211 253776 -16613 -78772
20978 -78772 -8263 -55092 -12284 65527 54572 -61418 -512525 165759 -255421 -874 433523
20966 -61386 -89864 -157530 183021 -55381 228715 128734 35484 71185 -48430 336267 -301754
20954 32027 -45285 261860 234923 31835 144258 83888 25999 -26986 -22032 -388072 55343
20942 141822 -179013 281557 41934 12144 54907 -20998 170525 225774 407808 62391 491163
20931 491163 333499 392131 -272010 -326005 -140437 -101800 -4862 -97333 -231654 1115 -210952
20919 72098 10169 46707 -111651 220141 273215 267725 17614 11578 144394 -130410 -21068
20907 -7930 -214915 -13999 -324237 323215 -268072 238010 -51153 133433 40827 -329854
20896 -96578 20918 -279908 61727 134430 392349 151090 261198 246307 -108453 -119009 -153882
20885 -153882 -138991 -221854 -128451 -9662 -24852 -44080 181019 -59655 16475 -128307 -216053
20874 -216053 -14379 -350135 -21816 150594 -172225 28741 -34690 -223935 60058 44868 -121315
20862 -255858 -101307 213132 -152878 194089 -299322 260158 -283511 -65894 51657 -117679
20851 -70026 -169283 -13266 -145367 -191852 -14123 -90958 -172499 -122750 -36728 -30952 -18129 375220
20838 -53604 147367 -224069 174338 272954 120318 -290602 152355 -262512 354417 -214043
20827 102111 -139994 63903 -382 70962 -258745 45688 -285464 -370660 -10129 -131986 20566
20815 -219361 -122069 -26414 -105773 -133698 18402 -142809 61494 -210061 -156640 -192833 -239320
20804 -239320 -97068 41470 -154205 -62613 -225046 -103013 -205093 -419705 -194635 179716
20793 51291 -43694 145246 -221697 -105355 -240525 -62689 -193524 -144586 7173 -190345 387158
20781 392279 -25070 -115757 -73102 13008 38276 -164091 -156504 160344 -187398 -79267 -82497
20770 -82497 -107756 52348 -203687 144743 -33405 -29108 206878 110585 117109 -521985 -33715
20758 -18143 -97712 313709 -244545 46722 67555 -406066 -44398 -73310 -49788 -332172 -110836
20746 -104791 -48662 -279021 -146068 -219845 -226297 23783 -29227 117284 -70513 -122748 149813
20734 -155981 -156657 314289 235774 65213 -76298 -104923 93335 -15970 105266 -272146 -123105
20722 -151814 137891 5219 63265 -306294 -11672 -82030 43503 94144 -63325 -100484 53351
20710 41349 -176624 135346 -154534 241994 102624 -377632 225836 -104036 -74446 40011
20699 -297638 173080 -83158 -155386 -169839 -121666 -105249 -86302 5570 18686 -398163 -194083
20687 105470 -59481 -61701 -71314 -137863 -370885 -56761 13211 -208228 -256093 104536 -241327
20675 141897 -240452 79055 -209254 -447290 43616 99138 -122268 285860 174760 -118762
20664 78891 84841 -175186 25485 141438 94218 -63585 -187116 -144026 -21433 92513 -75241
20652 -31757 -114670 330649 -244704 22865 219012 90806 188613 -640242 -12404 -231406 -140297
20641 -140297 -246678 -422243 149513 46995 -112231 -418740 -167050 327000 -15895 291332
20630 -752 -7361 -20825 84314 237109 -123122 175681 118431 -190481 9471 -225737 96668
20618 -224202 -30279 -75048 -235734 -38442 -128877 -312859 -101229 204611 52294 125088 -121251
20606 -261694 167281 -273658 -369227 127034 -113558 49737 -68982 -186192 -32093 -136704
20596 -136704 -267134 -153129 69330 -125982 405992 118467 -83731 -66311 -165237 1126 3500
20585 3500 54130 55271 -201143 -391884 -33424 10329 216846 260934 163010 -124581 62527
20573 -80422 -241243 -301703 95408 -171683 57787 -134832 323020 -13583 -10746 -14749 -195192
20562 -195192 -104290 1280 -186741 -509273 101898 -356436 -353245 -254585 -216519 -53888 -242216
20551 -242216 -49309 81003 25557 67334 -255813 133731 4493 243467 -100155 48953 101553
20540 101553 -416994 -63084 93516 108134 -202908 195510 37989 -17755 -291589 -260984 191379
20528 170316 -105458 243502 -85777 18540 -55201 13512 -77960 -11354 -72666 -11221 -58035
20517 -58035 105408 2416 -184232 252565 25638 -235737 -37246 -94017 -149910 44692 -44893
20505 -205428 71935 -187727 -83522 -128233 -97439 -256217 345345 -264251 -37592 255950
20494 60760 -273941 -221938 -27213 -32250 43535 -76062 10944 75757 -53032 8463 12936 -123744
20481 -136824 58658 77382 -84885 -90796 43927 194816 64610 -178375 -484802 -160055 4405
20469 -360334 52809 1353 -135006 -95347 148903 12895 104625 -160482 -83495 129032 29506
20457 -74163 22878 211668 -81978 59166 -352436 39227 226721 -99055 -118005 47043 20996
20445 -192133 313144 -34903 -343390 -83122 252806 -148892 -213485 -110053 -232319 -239680
20435 -239680 35057 322366 -342869 150332 -119601 8497 -104885 57641 43962 -61200 -35615
20424 -35615 -17153 272878 -68103 -58684 -200785 -26225 71857 -52548 195691 82901 107434
20413 107434 -241421 -129852 -351343 6711 54885 144931 -119204 65591 -12461 -263773 16658
20401 -146056 -189857 -418043 -204968 -122251 45274 -152463 68932 10765 11898 -290498 146645
20389 19922 -94699 8001 -370150 -197320 -370700 2127 275045 -251792 32654 -145988 -25559
20377 -129147 -182464 131403 -233655 -106490 -157736 175230 -322144 -46660 -97899 126107
20366 33334 -340449 175664 204282 -95864 341533 129372 -46042 176046 132141 -378526
20355 -176705 -59964 349228 -245002 -51951 -275196 99056 204745 151157 208547 -50050 -157889
20344 -157889 91394 219447 204207 109170 311312 -175881 109749 -113797 -232528 95855
20333 -166087 -218516 -251354 113431 65389 245429 242636 68314 45089 1827 99364 52348
20322 52348 -46980 -534631 1725 -226478 -36202 -107771 -148441 -510853 13702 -9980 61830
20310 216794 -198711 -77829 -19777 -245939 -238644 -363807 -472669 -138096 -89670 -162489 5599
20298 -30385 96916 -55046 -388885 204989 90377 -34428 263847 5417 133892 278538 -158731
20286 104450 -363542 -283939 -385101 92529 39242 2845 55061 6201 157659 -113254 237315
20274 -166384 228759 123307 22987 -506634 -128734 -104 44308 -267515 -281631 -129215 -141987
20263 -141987 34467 13133 -24677 -3238 187179 8047 -33680 95772 -65723 67654 10660 25297
20251 25297 -2577 -66125 -186138 144972 -225964 118897 -194460 -102530 227864 -138300
20240 -250178 82909 169823 -48071 188449 249795 -81303 245368 -229032 -274897 196132 91220
20228 -148046 -383206 -214544 -215816 -260938 -123822 -42185 223990 129388 -180450 -92300 139786
20216 28744 -57503 148521 -226693 -147407 183727 508344 -541750 -227843 -275214 -157770
20206 -157770 58609 7471 -134417 82441 -40131 -282600 -60159 -249434 292606 -175665 156542
20194 -135142 -290768 -280947 -200831 287569 159693 47348 -294285 136959 -121279 -131121 14750
20182 -345533 55723 -1213 -159862 -182512 23579 -48358 21056 105524 208212 14923 71391
20171 71391 238653 66231 -173399 88593 184567 -23617 189905 -12003 46306 -71875 59368
20159 125971 -242228 218025 -277364 215096 182799 21106 37634 190825 370438 148151
20148 258069 245485 -166977 74574 239120 360661 229476 -105240 73313 -89268 123697
20137 89780 92072 -2939 564704 701736 481374 406150 185743 -6699 233552 300932 649370
20126 649370 274843 363010 64830 315397 -18420 -187862 -22869 -7106 -62217 -19013 -272558
20115 -272558 -89603 -163379 -169466 -460707 26741 -189337 -108180 -324974 -313110 225782 -226137
20103 135024 -103554 -150194 -148349 20793 -224753 58049 -123412 -62002 -560135 149891 -322039
20091 -85391 99165 86926 -113193 -13016 10781 161266 -286259 26852 306137 -8347 182296
20079 -182147 100618 265771 -163866 -318498 -242452 58651 46497 -173832 73377 24405
20068 65045 -37899 -256634 -99502 -20193 -240493 98750 -88253 -1468 49353 -161266 257313
20056 -222627 54905 -84805 -97493 45808 110666 -58853 23671 -31057 44949 -68791 -393276
20045 -393276 205698 -33893 102089 -164785 -274829 152711 -367071 -91965 -75279 6547
20034 155402 57895 -377447 -169043 -220304 -52462 327273 -154120 159944 213314 -129004
20023 83163 58093 -24787 -12616 3230 -90497 214810 -8251 245838 -35276 273958 -71945
20011 -145976 110061 179187 -180742 312541 -123721 -185630 262482 61230 -4987 -226360
20001 -226360 235784 -276430 -217227 -273909 -292256 53471 39457 -100454 172435 114253 14997
19989 269143 -51780 -81662 -21859 35383 -156057 59153 8021 254088 23188 -110778 205239
19977 211411 141216 378911 -188960 314137 -44768 11034 313905 265800 431079 354554
19967 354554 -104427 97264 -30995 -175630 97253 13551 71883 -227913 -250185 31419 -269272
19955 -162395 -5777 47107 -32914 191342 76731 301137 74453 244312 476769 281048 302233
19944 302233 265940 -65293 269357 296465 47193 194979 -86391 -30572 250201 -224523 -210360
19933 -210360 -166478 -61801 -107624 -241320 125870 -35979 23399 -302679 -36392 20385 -85665
19921 -311261 -254747 -99471 -148546 -377684 85654 19280 -328769 293110 -433046 -428810 -237910
19910 -237910 158705 -17734 31518 -230289 4568 144381 263408 185025 2019 -195323 -65089
19898 -153078 -171994 -143383 -63138 104553 -104183 80519 225068 -195123 55753 -40505 77477
19886 254058 -197537 -290784 27333 -44639 -284424 21971 -62586 -310563 -11065 23484 48978
19875 48978 -153592 3948 -219270 74399 -5417 -469952 -17047 117653 -224037 48608 11308
19863 26510 -70263 -32766 -57439 64273 26032 165361 -146569 72103 -329731 79518 278475
19852 278475 -47210 129422 -14634 141694 -12202 145577 -166875 -5105 -474955 -128367
19841 -50994 114271 -106444 -230549 -93235 187769 117036 -69198 -312034 16155 7845 -166092
19829 -105723 116185 -147947 -276831 -39556 111872 -193967 -7792 -143674 -26258 306679
19818 -275131 68338 159423 -248583 -249250 -170388 60615 -164537 -263029 -127083 -134551 -56055
19806 159760 -162822 -110757 -389593 -149155 99968 -128324 -158989 -147598 -173665 -175909 -206425
19795 -206425 -201920 -128441 -97065 -179884 -511711 -125317 18055 121068 159128 95737 -69552
19783 -277769 -73686 -240658 -313238 -240079 -210627 -211345 259460 99045 -96237 2324 285825
19772 285825 42325 37829 -56963 78760 41469 -218648 65723 191020 -169780 -100326 113257
19760 -6563 35731 -156637 151974 208008 -202566 69569 65197 206064 -119406 -135981 -346681
19749 -346681 -172478 -113667 -105444 276025 175723 -93562 174098 230446 13963 223828 -265133
19737 120523 -12987 125377 219951 52116 186075 -98511 17086 250815 279818 194044 -34911
19725 -166729 -220628 76487 71014 108303 400536 778952 580409 393452 154107 -153163
19714 43306 25633 -56835 285080 149495 504 39841 48443 -181336 119482 -35464 45757
19702 -75076 390777 -77625 -149772 19047 255580 462464 496065 119160 -80575 229068 -1533
19690 -250872 -117981 350534 345616 584758 20631 472708 -420209 568495 36488 216240
19680 216240 -225316 -317659 -144353 83155 213718 -95124 50537 165148 -10129 -252805
19670 -252805 200044 219053 188509 -86778 7587 204295 -12856 105899 -202768 -116793 -218876
19659 -218876 101635 34432 -279757 -57375 -9064 163791 189655 80630 -260633 -69497 -73462
19648 -73462 1729 96400 -110068 -30283 197627 -47997 36515 -217910 -179176 -323603 -111758
19636 61534 250673 -97663 -153702 -27609 120486 -93283 -17098 57134 -261944 129583 199802
19625 199802 93207 -250881 -208988 -213841 -61437 -29757 8976 -276973 -65501 -251643 95428
19613 -23715 6641 -260502 -75446 -242195 223824 -253451 -30617 -9289 -111881 -230048 -16715
19601 67141 -192679 -111154 -44921 -266377 107547 140054 -52587 -103974 -69426 138682 138272
19590 138272 132813 -21603 -53063 -114352 -638428 -161801 115500 63711 -208805 -121017 46808
19578 -168711 39359 -96276 -21088 262976 261253 -151132 11496 216021 84852 -90325 -41393
19566 108005 -330516 -296117 -72857 217882 191774 -445844 239541 -131526 272994 -92095
19555 -116261 -264913 -303837 19547 44964 -51171 74412 -213323 -77754 -97838 -133981 -257304
19544 -257304 -75635 167284 141773 -230015 -16429 -116060 66502 -53082 -201661 27853 -11103
19532 -192061 -251728 -44093 133816 227792 -293676 -91658 -259005 19271 167831 90322 -250290
19520 -70069 -109493 23757 -101252 -236375 -285155 -74580 -25236 152394 233766 -106135 118262
19508 -123140 24524 134977 -144593 104373 228083 -305081 -4979 -56303 74847 -76368 235470
19496 236640 109006 -248301 56907 -88269 86719 15019 -104680 -278795 -280787 -127601 35604
19484 -111920 -63724 -283799 -225281 29179 -29252 52560 -563 -308048 81768 -94961 200618
19472 -115885 -101144 -262438 220257 12979 -115725 77502 166709 381463 -49081 -85796 -27982
19460 -426821 8411 -152560 -165102 -71431 133996 138007 -135654 -220407 6221 102155 147075
19449 147075 81952 340071 -91269 -119892 -178965 77058 -80431 -128675 -128016 196537 -39863
19437 73322 -102294 -149057 -24653 22469 -112536 34549 -93402 107330 189787 -176443 19196
19425 -310679 22456 -302596 -258766 -136343 -64111 -88213 -115697 -35372 -368369 -82908 -135135
19414 -135135 -594016 -32063 209104 166828 -19667 -98912 51733 -139384 -95615 75243 -454537
19402 77152 44339 -106819 84345 59566 -310803 -227868 -67321 192341 -114845 117182 -177259
19390 -753552 187158 -51717 -411594 31280 -61177 133704 180482 -20629 -142992 -102732 -208148
19379 -208148 -174700 -61784 159339 16145 -285975 41823 -88805 -48057 94216 -204330 333029
19367 41211 -334506 115992 -33266 -236889 -211828 -53585 28011 -69375 -395615 -605867 -155598
19355 -189444 -420763 -207105 -84180 -57939 -72509 -226120 -85634 -147481 -45277 -40395 226431
19343 -113035 102389 -53171 -33775 -42858 -49183 -193087 -139830 -65619 44904 -461232 129208
19331 -130689 258107 -293983 -145302 114658 -42950 -150162 136564 -249989 -354902 -57480
19320 -369106 -253383 17092 29511 30746 -204613 33522 -56194 -269540 -24120 -117659 -78294
19309 -78294 -310545 209422 -195156 -208121 110915 -161613 135568 -34379 -46490 -415680
19299 -415680 129040 -148039 -368824 -91101 -22351 -35977 -107945 -268373 -291612 -296039 131717
19287 -48153 181133 83515 -194681 -25542 -235233 -459995 143400 -62502 -146756 375189
19276 -537955 389226 112079 -526 -174407 -64595 45622 3643 -312465 -128591 96793 205306
19265 205306 -96675 -161214 -34872 -191635 11213 -267536 -200812 205304 -120151 -186328 -209336
19254 -209336 -92495 -153279 -265449 214787 54681 -165549 -123620 -83380 -131040 -165095 -60134
19242 72195 -398694 -253797 15213 -215294 -205017 -157560 -220812 -127549 -117169 237833 -70156
19230 -174737 -83642 -69378 -273586 -58716 278385 -162703 -470873 -21845 -105227 -574 -116387
19219 -116387 90240 -220487 -249847 133687 -132608 -97137 -188325 -32379 61959 -205402 -115664
19208 -115664 266172 -122187 -176981 -241646 -343866 176706 118122 74448 161790 474021
19198 474021 -98818 -282998 -223096 -305201 61139 -264016 82736 -260538 233365 -365742
19187 -225736 -232638 -420689 111167 129854 195242 -41756 60812 29292 -106617 59912 120149
19176 120149 -162012 -257482 11682 -145993 -302904 114513 -99725 378815 -90710 -53767
19166 -53767 -31626 -11245 -99138 105888 -69073 35437 -93459 74387 -315706 88508 73913
19155 73913 -111102 -75409 -73874 52146 -14552 151329 -299242 339534 31178 -71567 -65758
19144 -65758 52351 -168623 354540 -229092 -91968 -7289 -16329 -196987 248545 -179910 -74125
19132 247603 -235765 -81239 2074 -178914 117958 -149146 -385960 -192346 79607 -88501
19121 12015 -51467 78113 -98577 -109717 -53417 -258690 -72096 -64317 -189710 152192 204130
19110 204130 118057 -32459 -358137 405862 148875 -60129 -160333 -228011 -397077 -34485
19099 263001 -48772 -334436 17939 119535 -411379 -7620 -365512 -79216 128853 -119618
19088 -217176 100263 -34239 -150705 -191884 -31649 -15384 108865 -329789 -323028 9685 -117918
19076 164459 -242243 -76 -463089 -23233 -49786 41229 65573 180355 -112598 -326567 -5765
19064 384675 -48755 137925 123321 -38183 -502077 -234661 -132277 226381 -88208 29835
19053 -108897 91958 -19170 -319205 -60964 130552 35452 -118024 242667 205871 -60257 108293
19041 58602 -66059 37580 24074 39333 213572 -124633 9331 -101758 211265 -279437 -29352
19029 -52323 -3511 -214132 124015 -3835 -300216 -20258 163785 -71808 83953 -23737 -55855
19018 -55855 336829 -33982 -64690 118254 219875 -469230 162996 -26900 207235 47674
19007 44505 -140838 127631 -153625 176965 -110153 -30459 -162358 -5099 -158357 -205039
18997 -205039 32625 347844 174115 -159318 39347 5834 -61753 -76243 220852 102440 -74446
18985 65082 -82814 6066 46278 -182178 275555 28798 -329068 -189840 -31444 194526 -120984
18973 -395399 -86472 -13185 -434943 4541 125874 -42611 -7735 -136021 -115362 209226 130336
18962 130336 736423 629806 399902 574365 -260430 -275034 -92973 11194 -278695 225534
18951 105313 242491 -156990 155401 -396572 -182832 129852 -274292 -195718 -164142 -86334
18941 -86334 -133362 -116933 -48485 -168137 -310925 -19037 -7838 33315 145750 126109 129442
18930 129442 -243235 -116020 -246251 -404449 -85522 206517 171954 -317254 286544 354795
18920 354795 3113 198742 -145155 -8821 184350 -206589 -112773 -294446 -102359 -292119
18910 -292119 306948 79799 30693 -83774 -190334 125225 352935 72330 -169074 -26075
18899 152312 395776 650608 474015 268829 -109135 121619 162845 153105 -169669 25595
18888 -22120 -56493 -225578 -195102 -84662 -238910 -78208 -59756 -66776 138112 122105 -324271
18876 -446667 51481 -263376 -81966 201714 -60110 168389 12575 -185669 56969 -55520 -181016
18865 -181016 -260132 81189 75498 2880 -6362 -71274 61708 139185 -321552 -133278 243293
18853 -297022 -286335 -14463 -234871 45521 -271986 -165525 -150115 -14233 -93100 -247002 53875
18841 -150409 -8133 -55803 3501 -402424 30776 -98133 -42666 -332917 150649 18794 -118162
18829 18128 -85762 -211585 -411159 -67922 -142028 -256741 30491 -214318 -296766 -235615 -218967
18818 -218967 181837 -162410 -62077 243604 293120 -274589 7392 170343 -61389 -135284 971
18806 -73990 -222869 113495 10881 -119246 -257765 53887 231338 -142081 40963 -54524
18795 98831 -192966 12894 -90869 -79132 -92887 -54235 138025 204108 -141068 -43933 26691
18783 -79225 -247313 17995 -48712 92808 -163875 -113753 90694 39641 90288 353623 -261633
18771 -42691 172605 148429 22206 138778 111667 33375 80453 -55622 20435 -170561 4347
18759 374267 49250 -396135 -155133 -17872 -186914 -47616 -162498 -251158 -240404 126968
18748 26299 -56018 203815 190188 -327543 -208937 -138864 -66838 275769 -126777 -10326 -271435
18737 -271435 -114741 58497 -72412 -72574 -66558 -40003 -106410 45140 -166757 -299917 -257591
18726 -257591 309899 -324775 -20833 -21486 93398 -18520 -158896 126518 -85539 74842 17413
18714 -227628 -178013 -201911 -254445 -182113 -140001 -158108 -46706 186368 87485 109049 -4435
18702 -45136 -361795 65049 -122087 -205126 173357 139162 -124330 -70504 -79470 -3796 -166779
18691 -166779 -197751 -119636 -130665 -19988 38894 -278701 89208 -68195 114215 100729 63847
18680 63847 -321883 -65480 289249 -1803 -1692 -262587 70539 -226610 -41069 -51527 27661
18668 -248722 143714 84142 -1508 -196921 -112998 -133039 -126412 4586 -91131 24650 -273703
18656 156598 8017 -110249 -142924 -368079 -80591 49289 -237210 -8141 -160715 328986 -11221
18644 4442 -15019 -35708 -84800 363894 -171773 22439 -114957 62895 -129535 103589 70518
18633 70518 -273582 551 -302906 -4759 -198356 -188029 -71400 13093 483947 -59802 108476
18621 -37794 71659 11358 -245525 72676 -17348 -180064 -291648 -43657 -285987 165376 381801
18610 381801 -276682 54918 4074 115829 -300203 -313225 109028 169535 169638 52831 15145
18598 35842 28709 -150899 102812 205701 36941 71363 26083 -25499 -64110 -303603 -250294
18587 -250294 178107 19968 -334131 43076 -25042 -244468 -46263 -84735 -230270 213589
18576 -156433 -350220 246040 -351747 -417483 -393387 -121247 -203090 -278325 -465741 -377324
18566 -377324 17173 -118819 -134153 313147 -85334 -64460 125329 -458361 -12139 -15910 -97443
18555 -97443 154427 -115258 -364278 -151434 119882 302410 98306 -7870 -78199 201619
18544 77802 -353984 -8702 48575 -261480 -265661 -156264 -254996 -125973 318106 164169 211031
18533 211031 -102096 -28482 90818 69608 -139266 -141528 -174787 72741 285744 281566 226102
18522 226102 129870 -203019 -280997 -294074 -328391 -91632 37075 -185058 -300906 -182456 -282949
18511 -282949 -73808 -157680 268765 -81781 -80498 106885 28677 -24179 301071 35938 37049
18500 37049 217508 -374785 153930 -5959 -27394 -439568 -91000 146063 72696 -92453 57758
18488 -89117 -53361 -22906 241014 -210103 198143 -402342 -55438 -302137 -54528 -469579
18478 -469579 115934 129258 112593 -71866 -163211 -333234 -371726 -93685 -117591 -98909 -206660
18467 -206660 -154560 -196582 -311289 -146982 -197917 -24310 51355 -263010 -392293 -356119 -18567
18455 208106 17570 48946 -79783 -392116 -63431 191592 -302265 -155769 -34316 -87348 148452
18443 209332 9020 -113199 16797 -137518 56004 86895 -359137 -79838 -53465 178024 -173738
18431 -126446 -87450 29723 -25193 70633 -119149 -140846 62408 183738 143799 91652 -28504
18419 372711 36442 -197459 -253195 -230898 -299365 167443 151997 -45 -69598 -101518 53837 -25663
18406 -306056 -38122 206883 193659 24776 -244318 -96394 76276 -15659 -33030 36129 50466
18395 50466 129785 144037 61517 40244 -27139 -44900 34530 -49590 56174 82194 -134450
18383 287412 -68777 73726 -367806 -122474 -314165 16576 172594 37268 -58713 -47108 -83499
18372 -83499 -343893 -30471 34084 -93706 78588 -121596 -14610 -8790 -199009 -388831 141745
18360 -63727 50364 -475350 -220100 -110513 328166 190838 -349412 282231 -259052 -63808
18349 -191800 -87329 32806 -257831 141332 -332775 -7010 -151448 -30212 -83306 -82147 -31630
18337 -325605 -5603 -108321 164700 333127 10066 -94123 12113 249691 149960 59842 -80184
18325 263386 -84774 172929 151948 -275716 -164904 -19674 -225603 -85233 -347548 -222039
18315 -222039 -156874 -111977 -114325 -309684 -5296 -150696 -355708 -71989 -59032 -90842 9166
18303 58256 -8663 138474 170330 -19348 -395480 -209098 -120372 -20665 -76278 -53507 -83188
18292 -83188 -115062 24588 35037 -189127 219473 264738 -90102 -216247 253324 -357969 11459
18280 107894 42893 -29303 180759 130497 51409 -60760 428543 78038 11264 142930 246159
18269 246159 -3543 -309115 64427 3541 -101589 -164726 -191037 -122951 -75308 48256 123000
18258 123000 83809 165295 48038 136519 -26118 114612 -156473 194843 -65356 -70813 -368370
18247 -368370 -105101 -126739 -99128 118172 45834 -268673 -180704 -40587 -74723 -11716 -172170
18236 -172170 55070 108426 -106198 43308 -26331 -182931 51692 -198235 377154 93809 128006
18225 128006 -71486 -109063 112212 -308807 -208108 -240143 -70695 301727 -7566 -107941 -99718
18214 -99718 116491 -315674 -3516 -50012 3720 -3801 -215388 46400 91051 -298264 -75311
18202 117181 21201 -247806 -73412 -455535 179156 -20531 257445 375660 17822 -491413
18191 -104741 77410 -280460 -92438 -310495 -125014 46349 -450328 -182509 -119840 61998
18180 185352 -23033 -76020 -254677 132058 131570 6384 175483 -119516 17013 156879 169672
18169 169672 26613 -188038 291024 238108 5625 143384 -232773 -238075 -42661 135319 129363
18158 129363 -347502 -142442 88161 -94146 -101240 181586 -319513 134646 65849 -50893 -160136
18147 -160136 -72876 -31366 -99026 -215927 -199762 -326345 50014 -229091 101244 -76413 -200219
18136 -200219 -34881 -425732 384281 -168041 -134131 177315 -70450 -34830 -144044 88582
18125 -32942 -80412 240291 -184521 322133 22827 51680 147565 243374 140490 67137 -40683
18113 160956 -99035 -217944 -8785 222306 -330314 -61749 -61299 19098 -94793 148638 53884
18101 55082 56888 -155141 41404 68182 262637 -13163 260159 108550 287654 -130020 -129935
18090 -129935 -100649 30852 -369774 59031 -149363 -19932 121168 -139315 -3142 -32904 -13975
18078 260184 32336 -53997 229503 6848 -20409 -23692 -157528 -72578 -235723 66946 240595
18067 240595 -255521 394180 176379 171014 -87406 27820 -117576 -57761 110899 -51465 -320061
18056 -320061 -146549 -97997 -79502 -56219 -93958 -98781 -54515 -268374 68378 201292 -290765
18044 -86952 54376 242696 89397 170033 108629 -177418 -14259 217637 -200564 252080 -206889
18032 333777 -43745 -49602 103899 49875 215870 82198 -116879 -472842 -261308 -25191 -182694
18021 -182694 65257 245252 -105147 -51262 -307463 43542 -220020 17084 330046 223444
18011 223444 -240726 -13464 247041 -100643 -283815 -137917 19187 80915 -75034 -190294
18001 -190294 119343 82831 -95774 -446562 -104959 267175 -52024 143970 -100803 -150296
17991 -150296 -49075 -219248 -9755 37649 -45760 -32134 403206 90608 172921 -47528 157084
17979 -124670 59659 183509 -40685 302070 -47550 -199205 -390404 -53195 236836 3887 -222408
17967 186714 18284 -127335 -151795 97320 148906 -459167 25924 41418 204472 -189216 -244213
17956 -244213 79016 11646 185667 71796 -334182 169879 -279609 120183 -110562 2476
17945 -217777 -147528 128558 -239522 -46570 71854 -39106 -103132 136981 -259689 52166 -78774
17933 121885 -27184 145366 -118457 -178894 -42398 -113923 -10040 -77102 -229314 -129926 9161
17921 144327 28105 70118 49785 -164068 -37345 13857 54555 116788 210723 -155121 65804
17909 -237014 83109 -33070 136918 164634 19162 145508 -35536 -143962 254782 281421 145505
17898 145505 38032 -36275 -114123 188179 77080 -65616 68202 -74745 129428 -206260 -100725
17886 -33352 -144986 187283 90457 -141352 -35604 499577 -88481 -45248 -47315 -214980 8251
17874 300452 141604 277836 13000 -96901 52989 -125723 187042 219865 -158225 51064
17863 -44255 343877 93307 117621 -91649 358848 2181 73016 120124 -326063 10757 -85505
17851 -7196 94051 84961 64336 -52613 17068 -252464 -527696 -58381 236469 67469 -89716
17839 101629 -55171 217357 148481 116746 98018 -31214 147322 -189555 347661 254275 177282
17828 177282 79992 -3976 42032 -121949 77357 232186 -181036 42917 -54599 -38706 84013
17816 -144221 331742 269915 -372525 -10558 -222 -314179 27650 114193 12147 -114449 84396
17804 -16319 13351 145644 114658 141875 151877 100525 67615 85328 7041 224737 171181
17793 171181 25118 156675 173630 -5437 242643 -283337 263709 97920 -169921 -58650 372685
17781 197350 63180 -190629 -151996 220991 256993 13272 -98142 49089 213840 204244 -124576
17769 5500 96544 -98032 125670 -253074 44501 208291 -55764 89652 102013 -235086 57901
17757 105834 201787 -206060 17452 125491 385240 110725 -7576 -203209 -231678 -308282 126235
17745 -311856 152317 270366 170439 366096 86017 -70501 -337844 -47350 -83349 141958
17734 -216320 325858 127944 290337 82514 220154 102472 63284 86610 -44312 71057
17723 177053 -247909 -70227 -70731 -131785 -359291 156767 42685 129610 5694 41043 -50459
17711 -151443 -267363 -39320 -10069 -279336 158310 151211 116666 216518 -229983 21968 243774
17700 243774 16691 188616 -74801 404812 57746 82829 -249081 123312 215330 179115 -209037
17688 60597 48501 47568 102301 59722 62870 352377 65063 357098 86226 -104976 101178
17676 261816 270148 29394 -61833 -22678 23283 -104701 -94802 -105844 408576 142812 134252
17665 134252 341744 96623 231823 -255189 -8462 -26579 173093 88556 312561 93395 66199
17654 66199 334021 -146308 -27447 -64921 171767 457191 89711 48594 202045 45206 -223530
17642 65865 -132452 68442 238543 -95130 345602 -104935 193599 -25077 41474 63339 197972
17631 197972 -199452 -141794 260393 180575 -39106 201074 272563 -97915 49709 297805 161253
17620 161253 179608 -125311 289270 21688 120611 351069 -10921 -82675 -136987 129281 430702
17609 430702 358829 133288 -24424 -49210 161795 210982 154574 305218 101022 201670
17599 201670 -307495 274758 138042 -180796 314186 -119955 -32087 -50834 33153 293358
17589 293358 235395 -146580 74932 153817 221251 415830 336781 111349 8794 224763 78573
17577 29437 224602 18984 -29582 406974 -56399 497726 -248894 -157936 348397 -15487 55554
17565 -111327 81507 283881 122886 -43159 336367 48206 385916 96781 136921 -46594 23275
17553 220016 308360 -126418 378933 450394 173848 269752 280619 493717 203209 530379
17543 530379 192612 462 -11575 -111271 607842 294058 258518 248227 11990 295997 369851
17532 369851 15536 144717 343645 26924 203021 165966 511245 555925 412466 621090
17522 621090 667451 558613 104708 43896 243243 334173 307421 180467 206243 430869
17512 430869 54465 544809 592604 415711 330910 557806 420198 737388 606868 561566
17502 561566 59181 417814 299793 608648 410770 154016 446981 367089 123327 248796
17492 248796 462088 226119 416233 383292 263801 19402 224052 223188 242765 337652 342780
17481 342780 494360 340931 156110 376426 233923 232620 607039 279206 -47389 307428
17470 -182383 175701 355980 281540 522825 340951 220577 466088 425099 3931 266800
17460 266800 401243 301958 194242 336344 112509 369296 129156 342539 268875 230964
17450 230964 384173 596037 207245 272850 319476 141586 453481 225078 526699 216216
17439 166047 147793 260095 286253 365521 370003 490679 155395 292003 400062 556360
17429 556360 153376 104555 449686 286847 -14354 477419 354988 416255 139482 82932
17419 82932 436733 811992 274451 240102 463265 150698 300967 245969 347717 494826
17409 494826 428799 133365 -5173 566963 104807 357189 121200 381143 47949 120652
17399 120652 697221 235697 164549 -88695 115115 94217 300225 350438 389849 521780
17389 521780 507896 434925 307703 -16603 327471 324803 234661 279372 224182 197562 240266
17378 240266 85314 22128 188832 223063 -143395 348067 175325 277790 -42824 332415
17367 -1826 94922 206881 559621 341093 100434 169267 403164 85589 12908 -6999 241262
17355 297335 117813 548085 422159 286773 315707 -91060 161859 77980 164121 -15115
17344 714048 157485 169595 56671 73576 73054 323371 112773 504591 270925 -219048 41284
17332 19064 -105974 114324 331349 349346 90416 416783 318034 314198 273359 247808 500909
17321 500909 -254673 587683 236424 360623 281752 391344 305672 314982 -58762 395486
17310 71191 222484 279408 252488 43855 380370 463889 306375 205280 302106 319725 212432
17299 212432 54930 486331 379036 110110 470571 61933 385700 7733 287245 477841
17289 477841 141802 195937 341459 537527 445201 360816 223642 574961 177905 15654
17278 269680 30037 176801 278111 698419 572399 471121 35105 196356 466002 155983
17267 242038 81181 406020 162821 336290 207767 96988 62259 292335 258956 343537
17257 343537 746178 85217 384596 573923 89427 705120 146697 307951 424025 567294
17247 567294 636998 215435 308940 579030 278783 498673 369073 310923 152084 304944
17237 304944 433550 769730 395484 577610 326518 328275 235692 322493 447489 481553
17227 481553 489604 120283 418913 438376 470537 433293 308446 324165 438863 77274 563184
17216 563184 81810 474489 341921 148829 313539 338623 442304 161576 390529 344523
17206 344523 199270 188516 461758 343594 23800 40921 438264 500011 861199 261397
17195 427957 457917 327891 691133 492544 655178 503324 -6197 411808 437003 545893
17185 545893 686736 788510 461627 534862 3910 285781 342117 521453 466246 551903 608088
17174 608088 566385 464080 247543 380169 500915 591125 565557 636235 444549 467951
17164 467951 370156 418498 390635 760398 340985 503940 649968 746116 492036 533130
17154 533130 480846 525470 574803 466807 703547 674496 343645 718767 553800 367474
17144 367474 737170 600813 325147 647058 377008 537250 505384 667297 572383 867888
17134 867888 474470 288366 542248 382856 695248 266874 870726 513722 774070 848508
17124 848508 646169 754000 595483 236989 477761 817993 745535 806864 615246 363594
17114 363594 618055 525993 523872 547726 411633 832459 1005590 358516 741461 823716
17104 823716 755028 829513 828028 725495 397213 836736 907927 787394 663407 682875 563566
17093 563566 674659 505247 1024646 819110 696031 518350 958882 612750 971502 679555
17083 679555 762920 664520 435153 716087 841228 673686 939658 534895 875192 839689
17073 839689 876806 829500 806369 1110382 589255 885852 867573 696051 1051704 1114497
17063 1114497 822623 645067 1083183 719753 859565 716160 1097631 929633 838925 906765
17053 906765 771757 1156231 929714 1202156 1206862 647891 1133669 934506 989915 996427
17043 996427 1102050 829725 852649 1117842 1446841 1140490 810289 1224575 639810 929550
17033 929550 780696 993848 1116874 897424 1100318 1320374 885538 1025421 905405 749977
17023 749977 1016021 1263620 1126896 1061435 1061778 1221562 1270382 1050687 1284311 1139380
17013 1139380 1448154 1057251 1558281 1040242 1012257 1150122 1273991 1123425 1338712 1183757
17003 1183757 1445204 1358637 1274965 1334002 1214569 1752494 1616224 1049098 1282473 1529666
16993 1529666 1441484 1605559 1326544 1184532 1392779 1376183 1402875 1413572 1766613 925255
16983 925255 1674877 1541884 1390986 1518542 1435009 1533732 1736022 1623119 1501400 1689501
16973 1689501 1679723 1572566 1672944 1631006 1664202 1519239 1453931 1938572 1630680 1589697
16963 1589697 1835516 1588796 1656909 1589029 1739014 1922650 1903789 2228840 1960777 1794247
16953 1794247 1532115 1910970 1771245 1799091 1921503 1790872 1609375 1909263 1944155 2012394
16943 2012394 2001031 2024024 1881604 2217077 2032700 2275297 2218697 2465890 2046492 2100102
16933 2100102 2041110 2241145 2281641 2390265 2473431 2209950 2479185 2403329 2446166 2374406
16923 2374406 2303608 2706890 2257801 2592392 2578958 2707174 2416851 2547050 2911792 2531536
16913 2531536 2511611 2573522 2687611 2718033 2861443 2849220 2720317 2832568 2864924 3093676
16903 3093676 2951535 3008547 2789292 3070542 3545810 3100788 3141348 3303856 3432150 3138865
16893 3138865 3355310 3366824 3690876 3516060 3717606 3753199 3227774 3550820 3794617 3933111
16883 3933111 3842499 4066604 3815742 4095009 4006962 3976219 4129478 4308975 4054458 4255910
16873 4255910 4626720 4539106 4605158 4458719 4621842 4682309 4750100 4931267 4750138 4624359
16863 4624359 4752131 5083211 5004810 4880120 5614100 5187167 5443659 5670257 5112595 5968340
16853 5968340 5715728 5658576 5890493 6064970 6043330 6297676 6215399 6294323 6406636 6633197
16843 6633197 6740788 6811317 7138779 6609362 6969943 7291843 7439044 7597890 7781723 7434247
16833 7434247 8010870 8341269 8154228 8065381 8276975 8541290 8847257 8903465 8936310 9045520
16823 9045520 9053957 9790563 10017309 9825424 9935977 10193622 10233838 10765599 10474819 11242879
16813 11242879 11462710 11390500 11856711 12031148 12472972 12571557 12946116 13057980 13531674 13635862
16803 13635862 13957773 14065427 14603901 15047081 15213072 15645695 15980332 16211432 16485517
16794 16485517 16867850 17787870 18105369 18596722 19165806 19628187 20013019 20608596 21161508
16785 21161508 21400961 22325035 22611833 23128058 24124974 24817657 25433350 26141750 27351988
16776 27351988 27498672 28563471 29616610 30725070 31272913 32321765 33169520 34452680
16768 34452680 35138745 36449019 37579151 38703018 40073758 41722469 42791684 44108643
16760 44108643 45497085 47067528 48422229 50203849 51848597 53558408 55446443 57507181
16752 57507181 59638523 61592554 63723726 65900600 68150320 70195848 72420902 74811078
16744 74811078 77143834 79473888 82274125 84583185 86568609 89368699 91829405 94518830
16736 94518830 96580337 98696736 100879462 102781123 104713007 106366955 107942131 109324269
16728 109324269 110368312 111279700 112002842 112511895 112417651 112499120 112014908 111560176 110408133
16719 110408133 109660210 107857556 106651912 105189975 103096433 100938265 98675660 96817537
16711 96817537 94423487 91807086 89530695 86757839 84418597 81768422 79659241 76937180
16703 76937180 74752531 72014034 69956431 67382530 65197117 62930595 60823624 58738816
16695 58738816 56940418 55156151 52933655 51172453 49680854 47790325 46393926 44764620
16687 44764620 43375783 41554466 40251775 38691798 38031658 36613798 35285221 34055736
16679 34055736 33406892 32188482 31035158 30307191 29387073 28391409 27677150 27011843 26063080
16670 26063080 25502899 24487432 23718202 22975085 22354661 21907289 21898424 20633727 20354618
16661 20354618 19546007 19050071 18669732 18594289 17725722 17565795 16929603 16502974 15622112
16652 15622112 15682625 15151691 15001333 14534032 14157069 13955292 13773145 13291679 13080768
16643 13080768 12706557 12519530 11978377 12154710 11859618 11354246 10998348 11227491 10758143
16634 10758143 10424536 10519838 10008450 9560540 9739586 9707561 9066197 9374207 8976687 8762484
16624 8762484 8823486 8589835 8283470 8008554 8146757 7789070 7911490 7883058 7601211 7460010
16614 7460010 7449525 7345844 6886428 6907022 6503786 6726132 6341300 6636926 6481793 6072970
16604 6072970 6041710 5986521 6070133 5752902 5648786 5401798 5867876 5457571 5174568 5520859
16594 5520859 5304416 5373410 5256072 5058177 4787984 4714012 4718425 4794359 4825603 4655980
16584 4655980 4719369 4621199 4313051 4254618 4329625 3951262 3969646 4030381 4329085 3939277
16574 3939277 4002727 3995593 4207071 3873723 3610034 3607285 3658270 3492975 3299976 3803720
16564 3803720 3668684 3210004 3502756 2792238 3253844 3357171 3291431 3234649 3227391 3175496
16554 3175496 3145152 3272689 2887078 2964259 3171211 3322321 2968849 3054714 2641548 2777396
16544 2777396 2551069 2864808 2805288 2646757 2693491 2404874 2571805 2441356 2510812 2553456
16534 2553456 2228323 2513748 2342796 2201751 2531687 2346918 2151298 2241559 2303473 2390873
16524 2390873 2341236 2212373 1862213 2249623 2070112 1956609 2165719 2222599 1904453 1815660
16514 1815660 1880852 1714733 2035771 1865697 1767450 1856591 1721780 1653429 1630744 1533400
16504 1533400 1787972 1861264 1554107 1786104 1659303 1916179 1973550 1651930 1657593 1719890
16494 1719890 1865036 1756348 1871998 1793200 1774861 1694372 1719535 1482980 1374802 1584669
16484 1584669 1628416 1212712 1501481 1413257 1442149 1348286 1579003 1444613 1541028 1430413
16474 1430413 1314710 1532090 1354997 1449905 1459268 1470694 1314831 1234825 1088397 1221074
16464 1221074 1356823 1170338 1452180 1153323 1181455 1214861 1395389 1327684 1066492 1420026
16454 1420026 1196352 1522054 1154025 1177493 1312079 1190873 919588 1161417 1157253 878217
16444 878217 967758 1350362 1179528 1197797 1303565 881669 750700 1070635 1238763 956754
16434 956754 797825 1031262 1009972 1076058 677597 1090384 865824 779323 658116 870544
16424 870544 929165 827794 972726 1238460 1115819 929292 957175 1046228 831918 844837
16414 844837 588744 605397 1167720 835025 814957 1389561 485806 881368 1046618 845881
16404 845881 559113 772885 931315 686332 902926 901302 884749 833735 889868 746250
16394 746250 676490 642613 820186 911766 815349 765592 720891 756749 640740 855850 585442
16383 585442 513604 623975 505078 640449 622969 657043 805406 762281 491968 506125
16373 506125 431234 824362 395696 989021 754540 432431 706183 865926 743643 1130346
16363 1130346 672256 280347 257600 556047 738231 657201 870964 551634 489847 307339
16353 307339 508329 428834 636763 869337 448998 728558 318311 304806 673958 471362
16343 471362 459486 331712 578207 400140 462065 645122 944696 792616 285273 532526
16333 532526 381049 308946 641853 726613 537714 676045 664664 339589 165592 247113
16323 247113 350710 531226 468639 405335 333658 233003 437495 93512 382455 675660
16313 675660 405578 600116 334718 573983 572934 331452 397949 621356 543515 355096
16303 355096 402840 665837 373520 653451 649786 350181 475953 267447 486866 461745
16293 461745 640584 192344 429160 217759 452511 539953 512395 380653 313025 364656
16283 364656 669208 454364 529933 244827 338049 279010 567933 245385 601983 265054
16272 725260 462845 147037 204926 286622 304764 417472 680303 409963 387930 596559
16262 596559 282748 372609 285627 381103 316459 351233 158275 208121 399547 119539 227105
16251 227105 417511 427641 389520 384630 399503 77840 410111 226751 227885 419354 606733
16240 606733 385267 399545 242229 -7978 192787 21750 417787 410585 543702 492580 32918
16228 320697 722541 270707 330724 88270 329410 406973 523060 -114508 141180 -54336
16217 -76547 561496 379606 125159 81410 90721 582219 461179 29835 -35282 592742 174259
16205 205346 337739 102123 232325 297671 283557 312573 303646 126035 172878 186259 97581
16194 97581 -65102 113796 261056 -80511 305089 224827 208888 73979 310264 386682 195884
16183 195884 573585 241481 234651 201482 114033 606519 453663 82263 488201 52457 91650
16172 91650 33498 139431 355323 508582 436688 -15684 295739 104271 28674 221917
16162 221917 278718 65451 360660 168058 -78091 525501 -44415 307076 221261 140124 429386
16151 429386 231466 -60637 -61320 71149 -13310 118736 230902 -117095 424739 234745 138453
16140 138453 325864 463345 -205094 -91770 104158 165237 472047 -27342 -268322 -187600
16130 -187600 145805 -27369 -167890 247799 111182 75331 174765 185516 -19935 23676 4839
16118 -89255 -64250 -303616 121767 -69771 260765 -23531 221244 285275 133817 251039
16108 251039 54787 -1646 -104598 -45274 42013 48698 116860 328111 259952 -88259 67397
16096 -102985 51707 110189 279381 214959 -173977 -74506 223506 -30980 60640 136536 179203
16085 179203 -30139 227461 -15866 106378 112703 99091 -89667 103046 -37513 133820 -30938
16073 317510 89936 381367 114179 112456 -37310 18909 141172 68452 25300 51414 352450
16062 352450 -52186 144822 78379 -324687 92349 75964 433955 311310 216755 -96929 85534
16050 147262 -173190 -55989 334827 -139366 18752 32177 177798 78195 -113545 -5169 174722
16038 -139599 -26434 -76774 234624 2990 121822 -13839 391110 159386 -67649 379076 -88893
16026 225158 -107064 -106824 -193807 -65510 280992 174747 270611 8147 239458 63111 -5367
16014 58260 -287058 -200378 137839 -274070 -74281 91678 -227302 203599 -29910 103747
16003 -72169 -160121 -194645 -67513 -101277 -287238 7880 192511 92800 -158020 46739 18507
15991 54545 -137949 -115635 -11238 335061 258513 209972 346833 302999 169284 415265 367346
15980 367346 66165 328318 749707 702858 1295786 781286 787076 290408 168812 370502
15970 370502 29300 177506 -25886 191298 -153298 170013 205095 283687 107274 254484
15960 254484 -213165 51344 127086 113414 -128405 -71543 -7783 399538 187528 -229434 -224610
15949 -224610 342149 33700 -34408 210550 80048 -114990 -344945 -67247 116798 -72652
15938 191111 -71727 -142877 53187 131639 10046 -143276 255957 -131670 113625 -3641 53743
15926 -95741 -207490 -76696 -241328 295613 128418 56098 176466 -83624 57384 206071
15916 206071 165277 80195 -141215 -199292 122147 -125995 118868 -236134 54709 -261322
15905 -179367 -209202 35523 93383 90615 503869 76850 324742 -108487 1456 -37920 -99191
15894 -99191 151827 -127094 -178396 -308380 10293 17958 -57523 -37762 -193722 141462 5081
15882 -23015 -276871 273149 -9588 -7590 -52734 126865 -82838 218142 148662 -120400 -147683
15871 -147683 -41508 97354 -125537 142102 -135154 97518 221420 182628 -178734 70278
15860 -198215 -59621 280834 68283 -41376 -20916 180216 -224417 243155 185381 133552 7604
15848 -223921 -181169 -657331 98416 -142495 141013 230311 175234 -179963 6596 120031 36940
15836 74492 -215022 -334566 28240 40874 325449 58241 236603 181704 232033 212544 -43074
15824 166633 -274446 -250046 -73525 16177 -28273 74952 -90373 159576 -55974 -4058 141923
15812 -26725 -509591 227133 78576 -379893 -265370 -76725 102141 21078 -124471 -252418
15802 -252418 40027 -172820 164391 283156 -134380 180445 147173 -36700 -137320 135219
15791 -68867 74308 -7709 70483 77733 10351 26682 5020 -223994 31731 148828 -230243 33863
15778 95552 -293732 102268 -147533 55660 -54115 -93576 247524 -19629 233402 237403 -486683
15766 -117225 -5940 463242 2510 13813 -230219 -150535 -24102 79145 -351442 186213 -70127
15754 -67696 29094 132751 241339 -207978 5659 280035 -34602 -133297 -30325 -102458 -226147
15743 -226147 -27807 -46795 -191175 -12702 82067 22027 -169730 81532 -61967 -7233 -259274
15732 -259274 -342082 -176360 186649 123061 -356958 85131 -52079 121041 -36253 -160296
15722 -160296 -275373 -47873 -45713 -23367 -143585 100830 -162251 125245 -145487 364781
15711 110039 92700 114561 310917 -221187 42079 -302986 26891 142596 -56008 479228
15700 59299 153785 -48898 6759 -255102 -119521 -142945 279209 -157497 -218917 193996 -299626
15688 277974 -32400 -118086 174807 -254351 302626 -4797 251060 123019 -107905 -38085
15677 280023 -22381 252445 137607 -345648 -107003 96548 -224781 -150717 93867 -56814
15666 101990 15922 25741 -1772 -69731 -207307 3636 47618 -127089 71812 27508 -1481 -206974
15654 -206974 -63022 -147464 -115323 -389780 338790 -23387 -391940 224628 -286443 -450622
15644 -450622 -95152 67452 51171 -9264 -113754 -411520 -191862 154236 9029 -38570 187554
15632 11058 -42427 -46943 -194218 -257130 -42531 15387 -409893 -87862 210066 64428 -308159
15620 -331056 -105684 -177071 507160 -283853 205443 305323 199787 183442 44351 189143
15610 189143 -39192 -312883 21239 -79841 -108617 -30169 -53935 37773 -52498 -119411 -197952
15599 -197952 93857 -188698 215469 -26392 -78363 60315 -356787 410093 -264511 34564
15588 145005 -81254 -290274 212893 -86803 -178485 -413272 155272 -215007 99737 45549
15577 246036 238817 -258534 624163 -85825 -308659 99078 -212127 44288 143518 9622 -46476
15565 35713 -2715 -193679 -184657 -86415 -165218 -304565 -37867 46585 -117116 142474 251626
15554 251626 -254023 -10766 8401 -227819 34540 274570 77676 129884 195656 41826 189019
15543 189019 79739 638580 120389 362113 485500 334927 435893 -102975 428271 -99000
15532 149951 -337901 207105 65158 366312 393929 89653 522456 250298 55090 80461
15522 80461 20629 192037 405890 334828 258419 197210 228795 -95434 265966 -188566 172487
15510 78296 447178 231039 381997 332085 -71423 51234 -82035 -37218 233498 -322685 45713
15498 21203 225778 13483 52543 -59445 157223 188533 -403559 57737 40276 415991 30673
15486 -91166 -74255 146238 -80659 263159 71834 276209 41177 305541 192806 154629 123763
15475 123763 42667 414477 488171 229355 212097 322783 151281 26990 -13879 380254
15464 -124854 43197 -38119 -2876 54661 235753 48638 -101159 140034 -60837 -8205 52630
15452 -93906 -2267 156110 -228482 54435 125859 51453 48073 149327 218302 144404 390518
15441 390518 766511 675425 410851 10894 91891 218918 300861 156421 156372 46388 144508
15430 144508 -251615 282160 108035 40737 104983 -20162 2790 -404008 -396961 -167752 -83113
15418 340230 -93577 189163 200387 -41194 -133318 121341 74313 141921 -159385 -274915 95085
15406 -78929 -308027 -156828 -8810 -222748 83078 -244993 49765 -161863 236156 -8877 -111403
15395 -111403 217463 -357890 -46380 80421 145275 32273 167403 54522 -250030 49659 -336425
15383 285970 166349 299633 51853 18075 135644 9574 339805 130498 241463 336931
15373 336931 372232 175798 -39817 -161480 193741 213584 -86887 -155639 178305 -366659
15362 261680 105301 6836 211558 -150558 112755 -41638 187122 118474 60076 -68637 93041
15350 10759 188723 321452 197605 15960 -250092 309876 333333 250948 175889 202998 49026
15338 104814 -70013 -79436 199517 -47243 129542 166280 110300 67327 -301982 94390 218995
15327 218995 246421 -66220 5678 -4787 73782 31644 3306 -210110 354134 150157 -204158
15315 -10632 -183978 133212 186539 221228 314874 117627 18550 100017 -123734 -115763 -128935
15304 -128935 112949 242166 98439 -166111 267886 12091 155041 -200845 61486 -66417
15293 134413 -173042 -11774 -63883 -162892 -30196 171192 -97916 355642 -67442 -138487 -211922
15282 -211922 275414 344079 326063 74754 -32983 36621 134608 -100273 75325 -67729 398842
15270 180148 -85378 -44371 69661 -88970 -114129 75551 67658 206460 -130581 119964 -202044
15258 100765 69072 -10954 -30299 -46386 -142183 -129978 3431 -234668 -118110 -192707 70456
15246 212824 -38447 -127072 495183 151426 207193 -207958 261389 123937 155487 386228
15236 386228 -760 305485 96126 863242 828393 2294357 4650729 2706012 3607371 3028760
15226 3028760 946279 345807 150487 198766 320430 366348 420229 -88427 -114371 -58958
15216 -58958 -2095 59294 191285 -160838 -50596 -75374 -246002 -327307 -81147 172332 -207702
15204 70938 211376 630 -39635 349768 84933 -180147 86406 -153846 -59487 -90325 328478
15192 -99631 308530 241572 -7975 -127091 -86884 75503 351348 204590 -129401 -21753 -227679
15181 -227679 145391 -578 -12975 216315 61989 -282848 80537 54953 17064 -173017 43016
15169 189554 86993 218525 212458 86410 -108023 8383 -5269 36121 -166117 79802 -192678
15157 392449 277245 88285 88207 -312168 29645 230769 127053 -2248 -956 239203 304628 -21898
15144 157972 -62164 221112 -38716 382424 41649 -92409 51467 291073 151906 22748 108725
15133 108725 166547 222888 37516 -179219 312464 5112 238909 385321 374647 -89446 24094
15121 -65520 178768 69040 202082 -9550 80176 354702 224175 168753 259433 390101 445627
15110 445627 754639 951383 448302 264395 -33586 249817 38958 164621 228919 8009
15099 299972 150447 -200404 -65952 -82077 116894 252678 246621 -14259 224022 101328
15088 240566 258934 -169606 319180 101828 142957 390272 60015 521138 77969 368008
15078 368008 -98632 -195971 97650 45864 -6636 76426 93637 97550 18064 467412 184877
15066 243005 400751 304025 373705 -50107 7374 125589 209194 226784 507427 12362 582923
15055 582923 109033 248390 21979 15388 365580 69060 127315 115328 1931 87370 -158170
15043 154859 540238 474507 326928 323357 339173 330972 529526 308447 407252 204626 406280
15032 406280 257749 531671 366090 734728 725663 367143 222681 295725 423115 385492
15022 385492 206039 320877 175776 116836 705452 423031 238114 453264 497930 17951
15011 442937 325458 572397 227385 508550 142622 770407 139276 447533 10565 310814
15001 310814 368660 456689 369385 400305 315879 170442 186304 216115 249883 536569 -38267
14989 244873 359210 300744 209982 461875 239637 342044 382511 641160 454780 608741
14979 608741 330219 626113 327178 127918 -6362 187586 434969 327829 704352 436485
14969 436485 436982 217775 375730 308891 25280 245515 203338 463155 12234 35700 226016
14958 226016 477621 225320 311599 67734 252178 309735 367195 386923 18957 119978 103281
14947 103281 110937 454718 493517 318558 396394 547387 480293 445689 541754 552407 307133
14936 307133 299219 194687 553877 591319 329330 593531 800933 823616 558536 363564
14926 363564 1260747 764313 1140727 812513 783517 943257 897498 885370 1006755 987306
14916 987306 1051053 1064203 939077 959258 443026 677601 496122 186733 607308 -20539
14905 519031 450299 93396 290603 266329 393551 269273 284966 205584 429048 48699 360383
14894 360383 132790 351170 597048 111465 288550 373071 264155 792256 533162 789154
14884 789154 474622 604774 532514 899663 740015 595907 419048 587602 725918 448170
14874 448170 459546 516784 488600 598437 447136 444644 494772 543026 643104 697802 335234
14862 744642 441814 489433 581955 593047 585015 369215 369494 261838 444469 442159 591052
14851 591052 274371 327710 273048 394311 492028 403463 782114 839199 653536 684333 864025
14840 864025 398648 890428 819459 616702 778481 423719 799704 512567 225533 684792
14830 684792 737611 935084 685318 645652 244366 565653 511347 722797 757170 569355
14820 569355 412406 750348 455282 610317 896397 740800 584211 503216 586508 663091
14810 663091 669135 593143 551960 167205 883881 656488 808039 605929 446023 722465
14800 722465 860083 599425 837530 752373 687637 677864 652642 626944 758772 719516 566908
14789 566908 599761 786296 523677 648671 519197 589388 730014 602019 496909 722029
14779 722029 682049 398986 971537 742101 288320 526599 963224 533615 218795 665284
14769 665284 485620 585017 806676 287184 880420 594198 802753 591416 429923 467890
14759 467890 570089 323437 449274 344041 784063 587423 669476 498174 414110 749391
14749 749391 922196 667027 475216 772909 882215 643294 558143 846764 660201 715948
14739 715948 545952 471678 716711 642239 512155 882139 647884 786965 628883 562228
14729 562228 992805 1193291 878765 1482362 1274194 1351883 1161137 1049908 830131 778845
14719 778845 803722 559382 872089 953803 1486068 739953 849949 902896 851790 900944
14709 900944 886453 1022137 1110278 879324 632998 1235404 1092354 1402679 1567550 1071388
14699 1071388 1389585 1198031 986720 953931 755380 670392 567472 781857 1221252 783077
14689 783077 680594 556237 1132671 866660 701643 1013812 824287 994175 881562 1104156
14679 1104156 934419 1029938 835449 962548 793093 970419 1200260 766105 1264209 1027373
14669 1027373 853217 885719 1082609 809266 907944 1253494 743869 943934 1083184 764259
14659 764259 1123075 1063319 1117711 1069961 1251699 1329272 1135746 1118522 1651574 1224770
14649 1224770 1106292 942261 1028152 832529 1154735 1251364 1183811 1384406 1298132 1452364
14639 1452364 1024534 1325434 1235162 1496858 1391659 1385202 1290576 1343800 1090383 1216888
14629 1216888 1018762 1448177 999671 1175166 1225254 1562024 1631508 1268536 1464834 1215847
14619 1215847 1112216 1295369 1369104 1296349 1485515 1242454 1037347 1012129 1403549 1502598
14609 1502598 1549628 1604032 1170472 1723769 1802777 1299083 1504551 1389334 1816040 1142565
14599 1142565 1753951 1634318 1502213 1419255 1529031 1695437 1674999 1854247 1770183 1591981
14589 1591981 1729788 2101247 1818999 1791695 1928859 2161390 1609568 1865844 1572309 1938330
14579 1938330 1962139 2075162 2102581 2104083 2179510 2089745 1949809 2181991 2422417 2294752
14569 2294752 2302083 2241524 2427383 1883042 2340936 2179703 2216258 2544300 2856445 2545728
14559 2545728 2782844 2747665 2970036 3191739 3255096 3479271 3604979 4024866 4632431 5306971
14549 5306971 7208659 10630430 18204782 39978451 48654382 18444535 7108379 3797309
14541 3797309 2371227 1859145 2151067 1876629 1884442 1987802 1985794 2347836 2200424 1932230
14531 1932230 2379043 2407551 2869740 3039623 3871223 6238763 10157073 4654524 2969691
14522 2969691 2529477 2296087 2897334 2288559 2269098 2689735 2275847 2652978 2366102 2579340
14512 2579340 2525464 2797310 2745032 2428469 2495243 3171061 3118331 3283490 3120062 2888306
14502 2888306 3071914 3151874 3204111 3084416 3025903 2844555 2932161 2898193 3072176 3149685
14492 3149685 3474720 2963955 3467367 3487117 3707448 3753786 3630499 3614203 3332485 3608424
14482 3608424 3521567 3830695 3659699 3764299 4143301 4194418 4123734 3718884 4324179 4018490
14472 4018490 4254221 4163799 4336559 4555784 4307522 4454615 4118534 4298102 4231228 4283019
14462 4283019 4969889 4767253 4926368 5064373 5086484 4592641 5039422 5053288 5102094 5073585
14452 5073585 5255523 5108195 5259168 4963953 5504466 5622169 5503883 5397815 5605461
14443 5605461 5671356 6039402 5702886 5937026 6048202 6072003 6076734 6326936 6476770 6320132
14433 6320132 6525270 6556273 6970024 6759011 6545871 6686960 7215921 7362592 7554621 7489952
14423 7489952 7512916 7865436 7610698 8119014 8199918 8408966 8030997 8257734 8477393 9003963
14413 9003963 8803853 8655957 8701674 9267793 9039467 9229673 9682967 9819142 9688379 10217391
14403 10217391 9909236 10470314 10228557 10623707 10618165 10727554 10725051 11092444 11359703 11762834
14393 11762834 11562000 11854151 11999829 12243148 12333741 12730819 12877550 13177206 13292392
14384 13292392 13596311 14003985 14115458 14284059 14897778 15262272 15345675 15497155 16040947
14375 16040947 16105753 16440224 16641681 16939280 17415598 17536789 17960426 18420612 18719572
14366 18719572 19628970 19657138 20110936 20733453 20881195 21216788 21515941 22192088 22960329
14357 22960329 22940351 23801767 24356081 24875562 25432745 26130479 26838953 27474999 27815232
14348 27815232 28625344 29240338 30236546 30567829 31359652 32646963 33544401 34403044 35136909
14339 35136909 36375781 37529862 38269310 39661419 40657090 41492223 43249195 44549384
14331 44549384 45420098 47206075 48432512 50228071 51794901 53620023 55343598 57353885
14323 57353885 59168986 61037669 63170871 65443905 67822073 70087568 72745295 75412170
14315 75412170 78135079 81272527 84316724 87787824 91291799 95329813 98942917 102909877
14307 102909877 107280268 111788234 116627703 122143564 127460059 133290927 139743811 146361106
14299 146361106 153132540 160278441 167701768 175992227 184711090 193978027 203342911 213358876
14291 213358876 223842689 235331967 246957291 259645752 272055399 285277602 299076633
14284 299076633 313173817 327360122 342161951 357139543 371718665 386165809 400027163
14277 400027163 413468307 426199144 436972316 446327079 452376653 455798309 458405300
14270 458405300 459520837 458760659 456093947 452879366 447027863 438107140 427028169 414659011
14262 414659011 400675611 385994847 370523609 354542663 339272647 323631598 308453288
14255 308453288 293400867 278878802 265269091 251808631 239401421 227288923 215617224
14248 215617224 205074191 194794027 185050794 175931662 167891469 159832547 151920778 144921597
14240 144921597 137800689 131161841 125660949 124506437 119525386 113152600 107419129 102654467
14232 102654467 98640292 94704555 90889049 87063755 83699025 80535357 77476654 74422205
14224 74422205 71577745 68958853 66769285 64398057 62395248 60230094 58371257 56420420
14216 56420420 54388885 52493552 51150918 49908005 48480617 46526589 44999841 44200575
14208 44200575 42733840 42259623 41128532 39710833 38165112 36931440 36075503 35526145
14200 35526145 34893941 33699798 32457344 31436057 31177933 30029238 29409802 28800326 27681665
14191 27681665 26992573 26469295 26014567 25327950 24822684 24126947 23364205 23437418 22387877
14182 22387877 22077602 21779434 21214287 20977384 20100099 19790748 19358284 19105414 18916448
14173 18916448 18511776 17817738 17540663 17623170 17029226 16735655 16193991 16185855 15717316 15372539
14163 15372539 15252197 15064090 14740702 14596977 14156423 13601552 13557896 13283682 13320783 12838560
14153 12838560 12720335 12444104 12296646 11941232 11585778 11411594 11510355 11143529 11055553 10682948
14143 10682948 10824608 10748508 10767527 10343980 10353701 10034261 9844093 10014657 9866294 9557027
14133 9557027 9356180 9172313 9121967 8739088 9060114 8826219 8350619 8362996 8368019 8243844
14123 8243844 7975719 8098888 8193794 7903553 7366270 7433632 7271673 7583969 7292843 7283389
14113 7283389 7326951 7111717 6993905 6924952 6718344 6815287 6596202 6607262 6462576 6478273
14103 6478273 6311072 6387083 6018942 6156172 5981860 6187951 6178105 5775019 5848155 6107849
14093 6107849 5845571 5668870 5617972 5615518 5134623 5088642 5234371 5013844 5261110 4919625
14083 4919625 5316021 4842156 5094743 4959399 4668097 4389926 4853575 4625541 4467163
14074 4467163 4377657 4645870 4393778 4364662 4598225 4205953 4308399 4239736 3905311 4173444
14064 4173444 3969172 4093084 4018703 3873848 4296953 4016888 3811866 3917143 3943382 3847537
14054 3847537 3769895 3762228 3399184 3808158 3513459 3685916 3584702 3622649 3510078 3527915
14044 3527915 3524003 3391534 3360971 3329410 3239598 3380552 3177936 3463372 2947692 3227003
14034 3227003 3122916 2817687 2822092 2894524 2919921 3105923 3093416 2882425 3025938 2958693
14024 2958693 2733133 2874620 2709064 3097478 2792687 2903295 2633692 2711364 2787267 2565837
14014 2565837 2572421 2314204 2469468 2445568 2380325 2517809 2488200 2543638 2218912 2617124
14004 2617124 2354355 2277286 2428267 2096652 2288381 2217684 2433874 2108178 2065808 2100240
13994 2100240 2051296 2285307 2301031 2619978 2236788 3398356 5867340 10945992 29931011
13985 29931011 52486658 27295517 12863625 7813760 5538830 4536556 3782904 3599796
13977 3599796 3339484 2983565 2974095 2806320 2584334 2698156 2796623 2612128 2379656 2527058
13967 2527058 2489201 2177780 2804888 2293921 2469061 2223309 2384483 2146644 2094379 2302341
13957 2302341 2199898 2121462 1818725 2110243 1870922 2041364 2146862 2158359 1955848 1897302
13947 1897302 1937715 1938000 1907266 1795344 1950269 1924839 1694042 2005347 1850436 1683438
13937 1683438 1856955 1631950 1554133 1729846 2050253 1951582 1428658 1935363 1447948 1660611
13927 1660611 1984068 1653668 1466915 1792281 1708240 1332970 1366750 1540359 1642652 1730661
13917 1730661 1599930 1745719 1413106 1493670 1354264 1518438 1194998 1444056 1479478 1428606
13907 1428606 1610620 1304812 1693552 941708 1380910 1267841 1497522 1461968 1671546 1305938
13897 1305938 1540260 1345475 1362305 1461233 1303013 1128896 1198241 1655867 1380808 1008270
13887 1008270 678735 1408799 1344111 1155692 993073 972465 1298233 1128085 1198439 1036754
13877 1036754 1045256 1185057 851129 1246235 861098 1041099 1249860 1240524 1127685 1321799
13867 1321799 940796 1320787 1500724 1340148 1303975 1238803 952367 777048 1142976 946426
13857 946426 1308011 1168585 1194702 794046 1087168 1320902 1041885 747875 580297 1141581
13847 1141581 771135 1431676 1045692 870435 1178592 963557 870887 770828 950926 1081589
13837 1081589 1038319 1196777 1331265 846807 852918 747096 1111305 914377 945140 1048070
13827 1048070 825713 791292 925023 863151 889294 1101434 833220 1081554 1184417 1066795
13817 1066795 807004 890307 662859 763064 1025787 1079270 499697 507179 790648 765034
13807 765034 957120 932898 785105 888437 1199125 723220 548437 730297 771567 699847
13797 699847 1152275 952760 913605 738316 781048 672203 734216 961015 956396 862949 662541
13786 662541 984349 533827 560913 954478 637262 695959 921471 684087 849767 712878
13776 712878 681091 584756 728157 676453 755902 587012 827624 1080501 674980 850141
13766 850141 759499 757083 797544 537430 773362 273829 855694 731301 564340 504837
13756 504837 517276 620583 846014 666747 518226 749041 511937 692902 764001 612611
13746 612611 513952 822564 540628 463600 843202 380254 764007 830635 575860 715657
13736 715657 756283 390816 519185 299690 571123 637836 300562 217084 339397 490564
13726 490564 562434 361829 685113 387902 550783 499716 681511 651826 732000 426167
13716 426167 305946 515103 642703 790957 907060 561998 300426 708641 348948 622226
13706 622226 332889 644533 555690 649384 422566 812474 460004 736599 690111 255496
13695 441686 11755 585554 260443 876732 501933 384148 573890 442140 174557 324100
13685 324100 568903 536354 356118 591135 453256 477023 583555 350260 489645 538714
13675 538714 578709 273176 470932 512904 465219 481471 568168 568537 590615 230315 582625
13664 582625 555395 529090 429773 517453 224770 241879 340939 576044 289421 565684 593734
13653 593734 646925 523643 176514 331202 581192 380369 653775 588446 372876 346092
13643 346092 507556 297430 635608 220359 386437 650032 324064 436425 207974 499650
13633 499650 276682 655261 486338 209304 1009 356959 524634 391225 667300 414220
13623 414220 245457 300744 465139 406875 430435 181561 379745 385716 319805 163826 513003
13612 513003 408635 372085 464140 300421 481045 407950 23379 55884 497670 212281
13601 345984 177882 366885 564575 353513 333868 430558 199570 165530 349673 349440 581471
13590 581471 766916 573026 188210 442969 555838 142176 188750 351674 265680 691674
13580 691674 371364 375169 282013 460577 362814 368862 28657 292480 131969 371151 486878
13569 486878 581491 621239 267007 253544 553768 605283 488912 345823 193561 301744
13559 301744 145141 716787 362166 562770 414088 276447 351856 280224 195638 233357
13549 233357 174564 524394 586392 343615 224138 296220 389465 454669 581042 279882
13538 180628 242083 464307 63360 9005 281763 66511 346850 159044 421886 165302
13527 45822 270980 136722 197208 68883 496372 162077 444031 -48354 380316 551152
13517 551152 441776 228778 271142 142218 108265 447300 459936 129195 213112 15730
13506 429257 252108 99102 371111 312085 64041 113472 396153 372299 72011 198227 34340
13494 151334 378211 212451 411199 233646 422771 32288 -104280 377930 113824 40023
13483 172279 118726 516845 -52900 262095 58034 -155642 353381 174484 -247721 599220
13472 145349 160402 210142 626387 341600 137656 170661 437535 151965 314175 82907
13461 323636 196848 76092 196066 371906 268327 148644 -103777 -33339 225926 139226
13451 139226 354832 175633 251414 75119 97281 -72157 109301 171175 471407 320625
13441 320625 308858 39615 251078 275842 150268 62001 350523 155379 140841 214799 340333
13430 340333 315684 266090 90156 47391 243482 123281 429784 388167 389199 114726 110796
13419 110796 312298 95837 158275 148669 171746 45619 184706 344019 321978 296422 -41307
13407 141888 153280 -76742 110568 160790 30557 -141 344168 291018 -343 -26761 363377 339331
13395 339331 81813 231269 154533 328534 138761 147604 230465 266225 313010 123763 83665
13384 83665 116551 233539 251305 413348 -52427 229735 -2312 141536 113743 122284 55610
13372 429244 486720 414987 412203 201317 354219 264034 485873 293381 272709 285893 40179
13360 191974 325922 337404 473366 19745 125422 195019 117290 64688 246444 191463 -108600
13348 456004 402976 142974 126563 184673 143012 34991 7731 185577 -583 310814 412582
13337 412582 -151864 303401 748097 -25929 464692 176630 174812 93102 339503 191789
13327 191789 128786 270493 191660 322555 -121535 58384 31151 115075 379726 36372 70478
13316 70478 74623 381433 536726 463658 608088 316667 278455 531233 -9420 418093 -8031
13304 -97436 141990 216637 -5196 167832 -24917 156082 187566 93254 98909 292767 445722
13293 445722 164299 106147 196461 51772 -24910 324929 -4059 75615 -59168 150533 310654
13282 310654 214100 43260 192568 -173096 30623 73681 398263 -251569 76829 169634 365290
13271 365290 26553 23792 -110249 -113124 80598 1370 332136 534816 21712 -25168 315728
13259 239606 -51782 329406 118512 -143609 -6870 -52771 96198 24341 438869 148942 46917
13247 -106190 -40262 189295 135231 74221 506462 -10841 730898 -47655 93396 53983 309956
13236 309956 -9967 -35305 -189476 37665 -168548 -211071 -64433 135806 106013 57732 52627
13225 52627 238101 -266625 94554 234564 -62904 239782 18399 288919 -9986 156481 230254
13214 230254 233940 221716 64781 -149514 116316 306805 502683 4216 48005 228663 -61938
13202 -130554 31575 90915 -95072 -93167 247389 -237111 483256 -33240 85196 -66737 230493
13190 137741 60221 -172241 -19678 198158 92977 93347 237934 153782 154099 228580 122526
13179 122526 400154 337744 -18127 -142869 167675 147501 221966 81193 5656 164110 162210
13168 162210 116366 -109857 55755 46662 58551 24467 82231 -95647 -69838 58097 -85537
13156 -37608 -115452 76747 28631 -109727 -189484 23257 93889 203211 -397260 435692 85481
13144 -454 345895 -229344 35050 -173300 -40661 102415 54344 125726 206076 138956 -284782
13132 152529 -42411 342494 327419 76525 -237713 -313060 218215 -101551 115415 165941
13122 165941 12133 -50927 -379051 -255538 323862 -83290 452623 254704 46109 114153
13112 114153 -250260 257559 -72728 229435 93885 -286733 164703 -93236 242218 -58680
13101 -13416 38802 3303 280064 132695 90040 89192 -214873 -26171 -113458 11207 103964 240235
13089 240235 -90440 -211165 12665 -19292 273095 417837 -200322 161238 201918 133782
13079 133782 -175115 -21536 458860 319196 76110 30857 97203 216376 92152 -144215
13068 -218009 -96352 -142067 -47682 -142049 126249 -143815 -43113 230523 -105398 357162
13057 -238187 -6840 -152420 40117 -62555 -54995 -119546 -19490 265060 29368 67468 148776
13046 148776 203899 149781 126010 36813 -352796 78156 36699 19644 208857 -95350 -56040
13035 -56040 -239730 -52221 -170859 155904 -12589 142051 -14932 218699 125489 -87948 320860
13023 193710 -205437 252244 -226693 -30823 -62037 122825 13118 116289 73420 -217844
13012 282338 49005 -62513 -32080 -82679 167993 -195887 152348 78538 56784 74670 -25992
13000 -178279 -47613 366067 -45552 -46388 261327 62838 -94603 291439 -19016 181734 -93471
12988 -16941 -187644 302391 193430 -141776 179687 59966 220061 123859 119415 171453 28107
12976 -48924 158696 -21630 -48173 53806 210624 282115 -96152 114480 10414 175327 -34754
12964 37960 -220153 -133910 90070 109567 274440 242067 -240369 -291128 54194 -182516 285650
12952 83485 -176619 -142795 222039 34486 -125935 -215782 -304312 28754 -62143 147568 235970
12941 235970 -60220 -196986 342323 -82603 -42702 -33835 -16384 -16478 199492 138496 156292 -123096
12928 -284911 -90460 27418 117187 60302 -184489 51384 -104799 191395 332040 53740 -276472
12916 169764 40440 -53004 165237 -74862 144206 424816 -15220 -276028 -46299 233887
12905 50033 -67011 22056 371255 -287658 -240766 -127779 -384792 147020 -166165 95951
12894 95138 66640 -124719 -98254 184787 -181286 -84399 -113147 217291 -130646 11239 238555
12883 238555 248755 197039 -26478 -237443 -154580 -5704 -317862 74000 58597 -59002 9531
12871 163703 -8491 141695 241873 -17388 -27260 -35420 100720 203699 33238 -106520 2433
12859 122996 431752 -65472 24336 -6295 35521 -110678 23093 -46187 97118 -194517 8040
12847 -181353 -71782 54180 165924 101045 -90704 -42438 -149932 88921 87324 180087 -162121
12835 35878 -136791 90041 -274604 -9928 159202 198009 -63052 47638 231484 -409611 196642
12823 -80405 -602 177835 60838 -61355 327903 43665 -223378 2848 -86771 -179236 -140979 222061
12810 -1403 -37580 23798 -85632 -30997 -134587 53025 32741 -239731 -46375 76786 28886
12798 143788 185843 79919 -30449 1756 -117041 -6954 78064 61478 25073 -187917 -350608
12787 -350608 -246515 -374689 -92819 176123 -143647 -167995 -312987 -160860 15803 -22157
12776 -252555 137770 -308947 43780 162239 -206198 16792 101844 14451 236688 -151814
12765 -25529 136556 429300 -238189 36147 -25074 -154456 -161729 -79648 89880 -31598 -74051
12754 -74051 957 45838 -261654 125638 35283 80045 -299843 8051 159572 248626 -129986
12742 -155009 213407 -194389 238845 -44411 -188388 -101357 3778 126233 113355 -236918
12731 -370542 -147507 206423 471237 100856 -130737 63759 17456 -43609 169426 -99583
12720 198287 275823 368385 542573 146226 243994 -34697 9775 124751 -32508 161718 100031
12709 100031 -29307 -222363 -124256 88146 140522 187907 -176282 327284 -109565 67122 -48022
12697 -51143 150834 373934 42916 266489 28237 134865 108176 280603 112805 274691
12687 274691 -253258 176390 -275437 -196174 -100812 42188 47095 51076 -303751 -98969 -75472
12676 -75472 -26937 459496 -167845 43553 3679 -87187 -44398 196544 -306763 -75180 42356
12664 -35351 215280 367254 -64208 -10133 -235369 -125083 -10600 76624 89929 148333 25736
12652 118336 484278 3785 -14340 -29063 114874 47088 -114790 -423836 248470 138949
12642 138949 299581 47761 104753 114249 -275158 215875 -178737 177392 -54912 256931
12631 -85563 72518 66306 103205 105694 -286412 60574 -41194 134351 153226 143945 432839 -63919
12618 333498 384054 147219 21689 196777 -85193 233074 -200926 -295953 222452 -44073
12607 -254684 -63907 39762 -232046 167195 -41341 378823 132567 -7302 -33707 229151 35819
12595 238380 302882 131709 212862 147540 276840 -279764 -139681 133339 245170 160251
12585 160251 188982 20709 137599 -167938 890 -350671 -152478 -71401 -280289 83744 108582
12574 108582 332175 203759 69977 16212 127717 -33045 358173 -1233 141802 95351 -70397
12562 131036 72130 113825 141713 -191302 47757 -320006 268877 23396 211365 -154247
12551 185523 -192130 -208687 -254011 58672 51379 92281 -1922 -152975 -300938 -212006 56690
12539 136064 172151 150642 139528 -58100 -32619 11859 47534 320092 250273 -335144 319763
12527 240834 -14352 437952 118573 11473 -147784 39713 -84167 410560 53962 -226530
12516 450645 424141 191337 -261334 129014 397514 313650 -241877 33471 -199743 24508
12505 -19917 -231089 -41421 125163 -178289 124836 279909 79153 -159563 173897 -194756
12494 -205422 -68449 47233 56643 229381 202722 151598 -2457 217010 -37931 197639 146259
12483 146259 235092 449270 268334 -74335 233172 173904 123690 99017 184652 129810 317926
12472 317926 50199 46478 178619 179952 182868 114170 45062 -53293 -76787 23819 -226541 -115199
12460 -115199 -118836 434077 271814 110197 57424 412875 286358 26879 -120981 196703
12449 29011 -198975 87557 -43768 161058 -190185 -72432 -37875 -36922 -81695 82885 96818
12438 96818 3850 -194586 -16323 -237583 -90864 103675 -107362 276980 248196 -199933 -242975
12427 -242975 -63782 121954 148700 -88059 111950 322464 135139 -707 -233703 -63010 76119
12415 146966 221360 -200759 -137283 50177 -62577 -56384 -36816 113391 197531 -28563 -190061
12404 -190061 -87251 68579 -252501 -14019 128423 6107 -15228 300953 52900 -10002 163923
12392 156891 -2269 109915 -195824 -25724 216503 -82260 -64788 68167 239172 272650 6102
12380 233146 39462 49178 370638 21334 1256 -57118 86207 311758 44450 -203140 -75865
12368 -4 33163 85991 -186284 -76357 18144 -85944 249781 7024 97380 -42071 91628 20606
12355 -189914 31704 38163 -164350 5154 77396 -196717 -3449 38196 30254 303713 96773 -458560
12342 41489 -207154 13180 155944 121706 143463 244454 88471 235502 497487 134981
12331 137010 271845 -141229 33070 23856 65863 189981 201600 229347 -151869 398108 93395
12319 132816 266928 479081 285875 -121610 16867 -104368 88095 283190 92597 286954
12309 286954 439116 -198148 -56558 23425 169462 -119705 252799 -130319 163022 193137
12299 193137 133311 270178 102413 87643 10359 151201 -313362 -168400 7386 93573 159144
12288 159144 -149203 -307246 192694 383314 113400 -34684 96967 193296 -35427 132317
12277 88651 -86090 -41061 7529 -89094 96952 109018 221917 -231282 233589 154378 78950
12266 78950 -157239 71201 255805 -80922 570694 79547 113950 38196 225107 16415 -57805
12254 -29228 -219706 105668 -76418 358199 21158 295991 163527 94850 -43929 -17236 46455
12242 144037 260724 330383 -24767 205163 50060 92205 -34901 233474 -23142 144344 198954
12231 198954 122315 257214 185345 103004 148056 27865 192500 272466 101122 260634 60336
12219 404264 65184 507217 15376 535667 371631 357868 -91506 168317 276405 123100
12208 87361 -148393 304431 71753 167383 -62913 117396 370136 93754 71203 82732 -40823
12196 154259 102873 -174604 320249 350065 171248 334246 500440 400779 80048 239022
12186 239022 363242 389668 150180 89990 236774 -6670 272947 386506 379462 213427 237597
12175 237597 296528 250769 319795 230197 275648 45467 228801 401008 58216 234046 387636
12164 387636 105401 -74904 -55370 241508 233181 -88124 153940 138085 54131 122565 235187
12153 235187 118302 141047 125313 215454 468671 -7305 6985 162643 135137 265243 225386
12142 225386 51995 264720 75308 350468 413049 259556 141663 207946 222169 184502 161170
12131 161170 191744 168302 214581 197023 103873 157451 253665 218691 92348 -106473 190353
12119 -175987 265178 301308 113359 380874 -50173 -11687 437716 -171345 17354 219453
12109 219453 69654 74738 157180 265643 71656 264306 186826 99821 -55536 -66748 147113
12097 10065 300926 -99907 94882 40341 4009 -47687 247809 1789 239071 -37841 138554
12085 39373 -426587 278546 -92366 261138 -188376 111900 -57252 75378 -175681 -18303
12074 53747 -71523 10376 -65214 117655 -196205 354813 291923 221897 103100 -10534 -35702
12063 -35702 106699 -218121 18401 303620 123738 169256 38031 -37480 -251010 -133218
12053 -133218 -90163 -183775 37643 -85990 212088 6906 68409 49606 19340 -245785 211536
12041 -70646 281444 -70589 -45183 -116659 -29743 -144525 -202289 -225983 -119477 -78110 255779
12029 52528 55184 -205225 258942 46786 13977 642 165584 459771 184465 23256 -55448
12017 -24402 -143692 -392640 -409141 -36929 231778 -305408 -149496 -464665 -217845 -45272
12006 14036 167698 239186 -69950 -148918 310715 100009 22552 278967 231520 426156 145831
11994 -286321 -59836 394566 93780 -273474 -233438 -294892 -276773 118711 -89690 -275861 46247
11982 226919 203983 121888 12197 -138957 -46495 319523 34342 -119310 -517874 -67154 257201
11970 -203962 -133555 -222378 -156282 145355 5416 52026 34367 340349 206807 99981 -85188
11958 191164 -139238 162309 102403 129470 -208505 -320609 -356729 -199139 173191 -247374
11947 -205723 -218547 -158468 28614 -221490 3621 14705 22569 -208111 261880 -107988 -208736
11936 -208736 163580 -29380 52828 69915 -109144 179856 -349406 -38756 -10146 26523 125035
11925 125035 -165645 -266696 -17755 -92432 -161370 -159168 -276 280592 -236459 -150021 -296394
11914 -296394 382090 -149689 -64821 -105637 -97218 -65187 19385 49315 45421 340568 -11574
11902 -358965 28529 -6751 191253 84709 -279376 327776 -42945 87577 -117758 -25794 -55999
11891 -55999 -370995 47247 208562 -146118 6723 242905 74 137566 -153964 131140 65427
11879 17332 190447 -77600 -481219 -129916 -76323 -223217 66747 -119023 -97320 165 -234475
11867 104792 -48492 16123 -141561 20106 -37759 -298005 -135299 108625 -102155 -61576
11857 -61576 76410 -274511 291771 -101725 107680 -183027 -61434 -270986 45187 -35370
11846 38570 -452770 -54194 144332 -188507 223518 -487 -161386 72102 -254151 108313 -160578
11834 448068 -229486 -40870 110454 -425209 -122916 -362834 20504 -304293 -429050 -36525
11823 45011 -157759 -54231 86536 -113007 -45441 -114036 78769 60957 201213 -131214 73344
11811 -479452 3044 244188 -244414 54568 -89600 405165 -20440 -53595 -258974 234607 -38484
11799 -40746 -222690 149459 52439 199652 -314114 56116 -15311 -204991 -507735 -101011
11788 127127 132636 -139422 -44657 126251 213316 -143505 18484 16550 -489885 -141161 -422835
11777 -422835 -278566 -10004 56534 -180681 -97266 -305058 -138857 -22462 480418 -154060
11766 -360248 224994 227014 112425 -50681 143047 -93832 -267527 -446572 -208224 119011
11755 369087 -424345 26944 -133269 -261048 -86994 47375 73871 -204473 119152 119835 -178323
11743 -258151 160810 -60032 -191771 75419 167913 287984 -296354 -147913 -163343 197663
11732 163598 42074 -140235 -211592 -132310 23628 -203969 159181 -127061 44661 130285 -25593
11720 24679 122235 271257 -104263 34483 -207916 153135 288593 -90562 -78344 17333 -149322
11708 314021 28124 -142720 -208195 -86539 148881 45241 -133714 -78447 133377 331557
11698 331557 156550 -229844 -355073 218404 -192525 133294 -247350 -59422 -202890 -129405
11688 -129405 -10809 -74291 -95170 83650 -29913 83449 238524 -192529 302669 11353 -186003
11676 -218900 166529 -58350 -207438 -72103 -61508 -234972 -357830 24072 107991 120037 -10525
11664 -306690 302908 39426 -92919 64181 -120980 137325 -164448 -126011 -65149 -57239 -395909
11653 -395909 -7028 -11464 -127428 -33006 -76660 -205336 -161019 -242941 -19347 -485926 -98692
11641 -217450 -9759 -233688 -250386 27605 -91915 -126220 -110781 92386 29071 183459 7939
11629 -121613 -65818 -48131 99187 -80890 51679 -75723 140404 -183849 -56180 339321 218875
11618 218875 -46133 -375183 -14441 -139603 22388 211148 9827 -86330 165519 -86905 5388
11606 -159034 70858 294014 -14175 47877 -73885 305956 -123271 -172474 171784 -221182
11595 148332 -289183 -237686 -272662 -150749 49697 220346 142932 -40244 169288 -51093 126719
11583 85566 -225288 88692 -316143 -129621 101850 -576213 31899 97199 -187059 -108557
11573 -108557 -69672 2039 -34258 -70396 65666 -23094 103774 277035 264073 -14056 -38172
11562 -38172 91369 -199768 -282775 -188258 -159155 121642 -202132 -161656 -17173 255240 -88795
11550 240509 -136142 -162449 -341870 -204552 -59626 -109785 36346 66258 56931 -274481 147104
11538 -125113 31008 -31609 -67414 -18646 140992 -157947 66613 -191410 -566479 389303
11527 -65034 142279 64084 69328 -101168 29656 358411 353721 55033 -133293 -83660 -42435
11516 -42435 -114815 420932 -328731 54678 280699 152876 -4726 -17265 75920 -70756 28414
11504 -77031 517725 133054 105435 -130301 46430 69096 -93322 213365 168833 249475 -98439
11492 5229 6984 198487 229755 209355 -165324 47502 -100177 109860 -8893 68988 -51721
11480 57368 212067 308929 220453 139228 41213 326535 63591 233033 -177314 363957 186052
11469 186052 41869 79479 211343 216017 -145319 48522 -89090 32572 184905 521712 -20137
11457 72586 94222 -219523 239080 73320 194993 11800 15018 238116 193177 15140 9616
11446 9616 -309386 110319 268915 363909 120670 109675 77759 10645 374946 -474807 -280821
11435 -280821 -27400 -287714 -197013 302926 -264102 91982 -100948 42424 155640 -115862
11424 55664 29450 316683 -200866 117406 134377 56323 -79438 122536 -82059 56751 -186568
11412 -282460 -163621 -166952 172693 254169 -141326 97110 117284 71279 276704 -182457 -126128
11401 -126128 -30174 -356463 -28734 -35405 -99931 -103786 70650 -71585 86727 265494 82260
11389 130516 48807 -79274 -280474 -133509 -110860 -215296 -285392 -104880 -154312 -136948 -242539
11378 -242539 -127465 -367800 -275495 -221429 134216 -34802 -112472 34006 -54758 -101708 -218983
11367 -218983 -106165 -230289 -129761 411488 -69005 131418 147226 -103685 -78190 96613
11356 -13673 258956 -8527 -119322 -216582 -5788 -234661 -14059 -283572 -146054 126850 -8835
11344 -17678 -73329 -3285 -110756 -176296 -232948 -80500 -226316 -96749 -56879 -249738 -315929
11333 -315929 -15681 108595 -66284 -343117 -273798 -209275 -37818 -20223 -142243 -149470 48096
11321 -14555 -161902 -69011 137947 12882 -268321 -223848 -241428 -64935 -8376 -340812 -161903
11309 -160425 226823 170653 -58361 -60232 -227181 -123382 -197971 27712 39867 226393 30902
11297 -45906 -98410 70571 228629 -263553 37736 36190 3189 -42744 139658 10516 25821
11286 25821 -261180 72109 56984 -91387 -208027 -107428 -51236 163146 -25074 360808 -86302
11274 345425 -154950 85685 -327254 -59287 -13947 -266159 89951 131999 67539 -29524 25744
11262 235111 -73917 11182 -48904 -62082 -155326 -72707 -163028 -222275 208107 145403 4462
11250 -270853 -48814 51468 304714 -180477 -28447 7177 153821 -349084 210206 54418 -104074
11238 -64168 169520 305482 -160681 -118033 18441 -51826 -214372 -94730 -328340 53113 -129480
11226 -278526 -321807 -30811 -2577 -295097 26355 -19360 126193 62117 -15473 141010 -210665
11214 -78681 -211725 -184755 249289 87675 -442020 -138370 81317 -350563 -135213 -7879 -169243
11203 -169243 9975 122610 108210 340923 -142156 231890 12438 -107998 241196 -225188
11192 -42441 16336 -235088 -493645 -17842 -265371 115682 -77961 219211 -259837 61832
11181 296938 287419 32806 18359 -111984 -68238 -126341 -164327 -24131 -77964 97129 -149391
11169 -48012 196613 -54303 533335 -108797 92809 -60860 -349517 -177565 -254185 -99041 -140115
11158 -140115 -116150 229954 175780 2060 -440372 68289 -211395 57339 108277 -317430 156859
11146 -169110 -66221 32869 -164931 -311522 -459626 -190820 -247893 222619 347596 -296489
11135 249038 59700 244949 56360 -141570 -80445 -182802 36062 -117226 110129 52661
11124 107867 -28625 167237 55318 -112644 103151 104294 194413 -285685 116107 -158926
11113 41275 -33429 173757 136623 79030 -217848 174232 -48350 -27150 227560 111379 304050
11102 304050 -120064 17131 20346 219509 24526 231272 -243486 110033 190747 236290 438004
11091 438004 325011 401948 23861 -131365 -7305 -21459 9471 53445 302648 125708 1947
11079 248388 131915 87162 377973 202630 -137250 139382 140876 302209 -10668 249668
11068 -17072 270316 210721 -72047 51530 159263 272141 471966 455553 385935 370845 128427
11056 339396 704825 531468 653216 420845 595003 645342 609817 532557 822195 712219
11046 712219 779751 981795 711699 506705 768548 913537 933030 564930 766514 848651
11036 848651 637730 644516 658184 938870 697077 782331 714369 805231 838444 507262 493903
11025 493903 861014 490910 1031436 834137 668408 785341 773139 465800 701213 622244
11015 622244 333058 394929 633066 724788 574927 368620 665808 692425 655521 644775
11005 644775 660141 791171 798467 575595 708563 614860 413335 325571 587486 77607 488032
10994 488032 682973 835189 619028 607506 680443 487574 535938 575521 717779 491075
10984 491075 515695 879532 515465 842093 670555 993632 724680 1020001 728470 1023564
10974 1023564 1021262 1363166 1641079 1971862 2038401 2234863 2210605 2624951 2471560 2827560
10964 2827560 2844832 2951148 2685282 2295201 2358340 1779924 1510901 1505294 1203823 828785
10954 828785 860910 924762 793166 864538 716162 1028720 498594 449013 154841 138092
10944 138092 184939 186132 19992 192106 -32323 308560 209634 5505 407143 71581 41709
10933 41709 143107 325022 -31875 64462 144820 80527 198322 -104689 -111549 -63237 221330
10921 65952 30906 45890 174755 3116 265057 273565 71567 -542 10763 -190966 147644 -21274
10908 45260 -113962 -126740 -397183 67915 -113810 -215377 -105346 -114681 -47953 -237125 280053
10896 110696 198569 46998 155175 -36407 -210268 381928 -210986 -539893 -98841 185750
10885 300128 -260344 -156866 -312375 -329171 299845 89994 -105518 -375840 -21248 -184244
10875 -184244 -209722 133838 -42677 -78131 19842 197869 -279594 -117875 35387 -56003 -444590
10864 -444590 38297 152515 163052 -139191 251591 259709 -227906 -96800 -212736 -133840 43786
10852 473804 -375139 -98773 -25968 275297 184224 -122333 -72515 46263 -145576 217429
10841 -138223 -270036 -236889 -140504 -15259 20735 -85182 -89985 49832 -339640 -47270 -8823
10829 71172 -202988 868 49134 -43356 103540 5181 -53303 -97429 18378 199450 -220752
10817 29954 200243 -142481 122741 -297759 64964 177796 -112677 -100958 -443574 147901
10806 -300950 61559 -225058 56721 -477876 113317 -215835 108976 -113168 -221114 -87257
10795 -309862 -278305 -95523 -283066 -223145 -200380 67131 138950 16464 -299192 -206599 -92893
10783 -77524 32629 -265237 -405373 -250630 -68197 40110 6591 -30141 237019 -81796 4851
10771 259170 110037 2032 -158787 -64134 -61301 -292944 24873 198201 34216 124451 -163609
10759 247074 -84029 -3230 18614 -161768 -220118 214941 -4076 -261252 -14886 -240186 -89603
10747 35741 2209 -273165 65190 -43796 -141265 -105186 -193860 34531 -100691 106661 -119969
10735 -407564 181485 -18899 204768 -294015 217945 -67541 344205 -152047 116153 -101183
10724 201355 42926 16254 -110168 -104069 304488 129118 -187476 38675 322076 37814 -46483
10712 18192 -87952 -545063 110735 -59309 -67349 -60048 -152500 -150848 -214934 -103898 -237258
10701 -237258 96152 -319027 -179806 -28222 231710 -151679 146868 -244190 -128950 114919
10690 -68715 -243875 356055 9776 -109923 29390 -324450 -242044 -176106 16334 -65345 -381724
10679 -381724 -405273 -160047 240838 -89114 -88832 91050 -54731 -53869 250495 -347149 -199264
10668 -199264 20370 52382 93399 163465 51656 62066 -140212 150547 -442196 73978 -341889
10656 85111 -166257 20103 -171826 9919 -69842 123530 -414919 -103280 27739 71475 -47083
10644 174410 220670 -115561 -181909 170937 -92560 144921 -558499 -97950 -229560 -115869
10634 -115869 244276 -83902 35640 76820 -134671 -313207 51552 32181 -159548 307652
10623 283624 116388 54972 -98631 3880 -305951 -73630 -124306 -257889 197489 -313618 124768
10611 206216 -42327 93308 -73938 -134047 -151918 -178140 -54421 320611 -176045 105850 12933
10599 53642 9820 -381680 -5810 157266 -258173 -196665 -128208 200193 -87278 -13714 233171
10587 49150 -320081 -220358 -160077 -27634 -33194 -158693 -70234 -211485 -101786 51332 19262
10575 -47493 -72037 53321 33445 -182799 -312651 250296 -18261 -10363 150091 -43650 -309364
10564 -309364 3022 -154206 -17910 164852 115330 -176336 -149186 -136545 -158551 -22669 -128387
10553 -128387 -226293 -17655 -17056 -167154 -78877 14275 295597 98579 -119334 128590 -24335
10541 -84118 -134561 211599 3808 96723 185204 164144 -141619 38468 -185037 132341 245321
10530 245321 -155699 -11061 -45748 -323689 -198809 -46671 218128 -398358 257219 -4320
10519 -57305 -298977 -155567 -130863 81389 -144397 -43995 -256598 -179410 -95549 -107651 -186974
10508 -186974 24348 -265485 154418 54938 -92008 -275739 -349981 195831 24005 -66752 -34634
10497 -34634 20191 -255438 -149133 -81907 34975 -115018 -127228 138273 174143 -200185 136204
10485 -218723 -58889 -325366 -226382 120030 -34414 88936 -598067 -261768 183256 -120398
10474 -402485 18314 -202716 -51951 -288107 29647 -615901 -85166 -67357 -20470 -283046 -270986
10463 -270986 121870 119001 -169883 -301668 -197964 38708 -242683 -325028 297602 -295676
10452 146082 173200 -391559 -265947 38943 -218442 -350877 27759 23436 14769 -245735 -317412
10441 -317412 -133382 -26034 100461 156430 -18504 -32084 45922 71840 -169858 -79836 135650
10429 -783 -171754 -160644 -11056 -47064 -258950 94324 -268763 241101 -171366 57457 -423246
10417 200700 -100388 -251214 -280628 88051 168257 -105723 -12367 143108 148974 -269264 110425
10405 -128252 -157817 -51520 54449 3833 -194673 -109927 -391699 34036 -34156 141975 219789
10394 219789 -153173 215005 222066 171967 -263874 -38788 39344 199545 200643 10887 246460
10383 246460 -108756 213488 -64750 85095 133216 63081 255372 226042 308093 151226 289423
10372 289423 110151 80345 -203396 10955 29610 467022 313810 615993 215239 226107
10362 226107 391871 440035 634750 249026 354838 22952 209451 160657 -104879 67214
10351 392170 48029 152619 312334 349254 445712 769706 629751 387527 124152 85050
10341 85050 -46352 -30615 32317 140967 -12721 274575 -22497 380312 354435 414769 413221
10330 413221 202566 54847 -254664 -14917 359234 289483 84015 -31832 70287 129958 188049
10319 188049 -11529 566240 122263 -177842 613873 107342 29976 2577 -44829 -53728 52303
10307 -224631 -109424 -114164 -160944 -145324 211731 -149110 -72739 -129691 -104469 -270576 -89672
10295 134980 82528 -98868 -101240 -77257 -208650 -170656 267081 -113434 -56840 17981 -112665
10283 -41672 -91663 71537 153348 -87414 -201377 -82444 -58158 -126236 -38038 -240077 -1246
10271 -53776 14529 -56857 -121974 149649 17628 -6561 -117455 140332 -159226 -330937 235742
10259 -196277 -316533 -115896 204533 -209523 37654 85936 88955 -87983 -172353 -315728 225939
10247 -83581 231029 -8797 51948 -17221 107060 322434 153097 -73083 -104070 92832 -41930
10235 -69752 52146 59740 42321 43684 -180709 -321432 21255 -161485 42216 93919 -15543
10223 -29320 -24062 -328709 -177074 125146 -78521 -119773 -35875 -322263 122929 215040 -325304
10211 -174903 50303 -335962 124959 -216 -81980 -88756 72285 -210913 -127285 -45508 306656
10199 -90203 4052 32303 119113 129844 -524280 -110043 -75857 -93707 13343 324426 -274363
10187 275761 88041 -51732 134078 -161132 -204561 -77133 -205049 308750 108708 -116364
10176 55578 -97033 -37978 -195686 45760 162194 229411 -982 -344612 130853 165538 -280526
10164 162069 272434 -363732 -265676 -14478 -151851 -188340 -215413 54387 89614 -55615 -141129
10153 -141129 36082 41152 220283 -16786 -350530 -1258 -172598 -2911 100376 -182469 -309752
10142 -309752 -389037 228393 -278950 -171174 12266 16249 -140835 -42704 -318482 303767
10131 -93197 283906 -109597 -174969 -165465 151195 -62428 -142434 -180926 30730 58177 -137206
10119 -394583 -159014 -187161 -289014 -130000 -107784 -271766 301663 -127072 239429 76713
10108 -218329 -95420 -64012 -154332 143793 62334 -144718 -17502 -209882 -7033 -176535 27334
10096 -19547 137299 -53728 -46103 -176840 15316 -68243 100022 34280 54561 31426 -5532
10084 144440 -21163 -168271 -304619 -459378 -264833 22200 -447410 31170 -192443 -246397
10074 -246397 -189010 -416439 67527 14616 -181696 -35049 67949 -148366 -61070 134114 -296563
10062 -12830 -452337 -257990 -169086 -65307 -234051 13655 -286489 -83265 35289 -63829 133030
10050 173205 181127 267438 -336201 48357 -221424 -128697 -169865 11789 51164 -15311 57255
10038 -191736 71057 -35159 -183136 275613 125094 99270 -224752 100265 -103630 -69971
10028 -69971 -783 -25739 -527688 -495827 117133 -76056 -170475 -379859 -53603 64699 -57694
10016 136463 -64573 -289479 -176116 -102838 37596 -180105 -217345 -150919 189312 -189470
10005 -12774 -237148 73237 -112573 -22773 229024 79734 -98597 391064 66200 63484 138039
9994 138039 -38701 -134240 113846 -156358 250722 64064 54917 -129882 50217 -65574 57630
9982 -17634 -142102 -109576 392202 -45049 -69623 -202184 115500 73101 151591 125770 223511
9971 223511 -174585 -33662 -71403 235054 -55333 -320883 -18053 -174676 -57897 -216607 105668
9959 235937 -147769 -63931 -417984 -177438 91420 -411001 101032 58527 -219477 -381416
9949 -381416 153387 152541 -19116 -162397 -135524 -362244 -158344 -46784 -89832 -295994 -102949
9937 -59435 -449128 78299 26169 191702 139639 4822 -26925 269604 45219 103856 -336812
9925 -75846 -90420 -45798 -24470 -58300 33407 174670 200386 -245105 -114246 -182436 -14485
9913 380683 95983 269345 245783 -411862 -72540 -198190 -53854 101915 64968 -220954 -406593
9902 -406593 -59400 79464 -92845 -217191 16557 -137739 -255416 202440 -97498 -135898 -194193
9891 -194193 17596 -62078 -179399 -141418 -197197 239217 -361184 -347480 73731 -200980 -154188
9880 -154188 -31208 -271970 -357422 -147559 -238242 349754 -42952 339386 -80240 -52601 153584
9868 -198291 8500 -93898 -299127 -69646 -126243 -166030 -4142 3934 -300983 -35342 125544 -109311
9855 72696 68621 285075 250306 -122167 114140 -116995 -448820 -315803 -325963 -131523 -21627
9843 169787 144298 -49279 110917 -4139 -26214 -194824 -29750 -95242 8300 174617 -162555
9831 -134351 -68313 -48700 62748 -331110 -50058 175658 -11600 410773 64307 70275 172242
9820 172242 15803 113657 -258609 -212561 -78349 -185728 -185735 -160412 34614 -391949 -332046 34858
9807 158017 -135158 -271409 -69243 52012 -225521 57761 -277979 -35095 125512 34545 -120110
9795 -217881 314632 15515 19466 7085 146396 120135 23663 98321 98413 -139115 50380 -103422
9782 181253 -427698 -205941 50649 -590473 -145206 -6600 -135074 -128774 -134977 -201152 -152804
9771 -152804 -477943 -129263 -186254 -142468 -25562 -170242 8632 -300396 -198962 -86198 44246
9759 -158766 -228159 -228610 -99253 -119156 64098 277595 -249902 8923 -55998 -196538 -270115 186449
9746 3704 -179477 -194757 -103257 -28452 199818 -31136 -119972 -191773 -4102 -18621 -207696 -76785
9733 -148872 -280710 -137710 211070 -74901 -24863 -248953 -59057 -213158 -162008 -26706 157183
9721 4962 -55741 -120766 -121746 -347176 -67091 39900 -381282 -18551 146151 -229910 -12199 -37762
9709 -37762 -91992 -93890 -361075 -356090 95397 49769 62528 54516 53470 -192764 -12356 -79181
9697 -79181 -234144 -12203 -28361 -225161 -94877 -96868 208939 174896 -79661 155487 60751
9685 -202336 69673 133258 366987 -66503 -26153 14961 -316974 60415 4468 -89263 -413433
9674 -413433 -6553 185304 -8962 -188878 -326222 219918 -163923 -218627 -143713 -366400 -94339
9662 -126234 59700 -219691 192309 23649 -54162 -320734 14337 209294 -269151 -411537
9652 -411537 47743 -141369 283266 -19962 -437120 -167451 -271670 134638 -193946 89013
9641 -396415 70907 283252 177896 -198080 -196652 -81131 280901 199876 89466 -144373 -39763
9629 162074 -134058 47915 -94466 -318275 -103963 55353 26327 -73912 -235491 -142783 -80643
9618 -80643 10969 -57817 24695 -327053 -50434 -191520 -71090 63181 -100654 63963 -5742
9606 -177943 -6636 190653 -148298 39380 -83044 61057 -274005 80916 -183341 91429 47930
9595 47930 -198948 132062 -121800 -58730 -265631 -153996 121031 8774 -88741 -358033 -268026
9584 -268026 -269145 201354 139189 78634 -71579 53155 -303557 36710 -266502 2568 145263
9573 145263 -90724 -236198 -142751 -338420 86539 -300597 17299 -251168 -218533 142280 -216349
9561 -386795 13925 -53224 -66302 -169384 66395 -294170 111833 30784 -109070 280437 -153239
9549 -340500 10441 -159664 142579 -240950 213860 -306954 -77107 -181189 -39733 267466
9538 -307344 -60132 27668 -151905 -70093 -59937 65747 -21009 -3671 -263551 -298773 121244
9526 -241516 19819 -92586 -148461 106067 -139628 -105753 9593 -128484 -177036 -9241 219929
9514 -50304 119541 -75844 45718 -288327 1392 417184 4477 -316168 -243091 -64900 -134024
9503 -134024 -231609 -129897 -101600 -214952 -163273 120109 -141371 154286 233987 63041 -12912
9491 111273 -124553 -38571 22224 34523 223716 -226867 -205475 -93949 211565 90564 -86396
9479 -278146 -161819 -24760 -137610 18422 297644 105699 184368 57708 -75135 -126370 -69282
9468 -69282 -241469 81618 -166570 -12863 494665 21416 -10907 384578 -355803 -285894 -289209
9457 -289209 241858 -44205 -371561 -15685 -266501 -208743 112368 50754 110721 -45738 -20669
9445 -142441 -29491 -12147 -6202 -214561 48945 -2252 100072 -4602 248849 59319 -209687
9433 56967 66033 -219524 13597 51425 125778 97445 -190503 -276021 -264450 -342118 -207588
9422 -207588 -50549 -6108 -90403 232743 -79307 164894 -136427 274655 -5111 -315294 114527
9410 -60255 92480 176468 169731 -311237 321518 197442 -123866 216379 -319324 -50377 207653
9398 -402835 -176545 -291519 251416 141491 -154356 -131495 -94410 -3313 -3715 -9843 37913
9386 -38356 177240 11384 -9919 -250712 58708 13792 -179711 52859 -318698 -341754 156738
9374 -273243 -161716 -90150 -459603 -63060 -6405 -119368 -295475 -205995 -115566 38732 11278
9362 -181523 -42678 -274217 -350075 3210 -361617 1360 75789 -55223 168637 -184888 -113198
9351 -113198 45147 -35297 -301344 -36267 -186105 69435 402925 38879 -124079 91126 -152015
9339 -113061 -137909 -22562 -16713 128059 261583 -160369 -90548 61449 87452 -122076 -148536
9328 -148536 -224236 -312909 -21161 -336139 -117655 -40678 -85235 -163008 -62803 -265205 -240716
9317 -240716 -42443 -244896 -300463 -379864 258853 41687 -172943 -1429 -88311 -260171 160779
9305 -43635 134096 106109 -1399 -188839 8250 -164454 -105307 -11518 -171808 -244819 16919
9293 -399744 343263 -182469 39159 196000 41247 -60242 20474 -572142 11013 -138695 8245
9281 184752 -225740 54246 124164 -191039 -13525 77420 -56762 -39134 -139062 241639 -77302
9269 -86075 -251207 -28498 259762 151532 249903 -64283 -68309 -55552 106464 -65020 47791
9257 -458121 -40896 114020 -133664 -219652 58927 -295730 -116624 53150 88963 -318998 -290436
9246 -290436 -147685 -106306 -383966 -337767 16830 -347318 -201943 -11581 -388401 -84851 17231
9234 -309719 158115 -26139 48314 -190346 -34304 -181690 -207028 59790 89534 57958 -171260
9222 -159090 -26080 -391205 -73577 134311 175386 -209058 -409219 -469974 293128 -129053
9211 -154966 31826 217870 126479 201230 143852 -163220 128513 -150819 -324145 7400 -100691
9199 -356995 -49893 151011 4284 31452 258325 30319 -65018 -142586 -95850 -36996 -166290
9188 -166290 258979 -101319 203436 60873 6075 -289093 -265243 -162889 -292333 49463 -154824
9176 -153594 -6585 -187018 -31879 -228831 50301 -125675 -149140 -2338 178439 -149416 81517
9164 -132452 -107403 -191933 -94492 -202508 156711 -4558 -129562 207746 -7047 -168213 -177491
9153 -177491 27526 -247127 -81577 226633 -19036 -45489 -76380 153268 -325009 90164 -154032
9141 271213 -149096 -58911 -99952 99900 -7822 -153679 215389 -230436 174881 -199017 -33683
9129 -165524 267592 467098 -231680 114920 125378 -248179 46654 96360 73543 -277314
9118 322414 -113201 141415 220323 7315 46456 21095 -362659 7032 183487 54734 91489
9107 91489 -275993 99552 13802 -75523 -112996 -13126 154704 -53602 -397109 -365764 -93440
9095 151752 355204 -121485 174968 -54549 -109987 -188699 210833 -406953 -505160 29899 -8525
9083 -76252 250958 -280576 -54181 -183932 -105608 113632 -30297 214732 -42310 -28581 -139066
9072 -139066 -133822 -107222 -182084 19616 -93145 -15718 -154414 -195324 28804 47548 110166 -382484
9059 105525 -122143 -233985 31883 -251702 329340 -17301 -424480 -410561 -106229 -59725
9049 -59725 134177 -281419 -92249 -182416 -233020 -153048 24857 73780 -156698 15325 -39678
9037 -190711 -393115 36104 45654 -197876 -119930 -85973 137493 218219 235106 -174093 -214003
9026 -214003 -5614 -225581 -9785 -50087 -366943 -195540 5552 -49188 -200822 272155 -364046
9014 176520 256714 82978 -109564 85706 -361867 4615 129554 75759 26371 273517 178206
9003 178206 -103779 -32214 -4541 -390656 153780 38566 -221571 -29290 136985 -356539 -307259
8992 -307259 138784 17405 139902 -148501 -128160 -416337 -114342 141392 16530 -62044
8981 211912 25403 -142665 137334 165737 -40720 155344 -48609 -164298 -159525 -88482 201494
8969 476 142064 5544 -16930 -215723 -167607 -8972 -177868 -150986 -233811 -290098 -31792 -18394
8957 -18394 -77800 302662 -263880 122585 -193193 -61938 -168439 -179720 -273727 -341170 -19304
8945 88573 -201511 -335951 14078 80331 140320 -147967 238334 -161979 1654 95316 -79316
8933 99405 203206 -27264 102682 -181480 183966 -22784 -54395 237310 -346217 269544
8922 249077 83510 689051 947138 4502936 8117967 2147751 626301 1905 77700 119966
8912 119966 -236008 139697 288314 -244547 237977 -243064 59017 27121 201840 330293
8902 330293 -216586 -200533 -309728 154045 -147465 408265 70875 312870 283479 173797
8892 173797 -54344 -45930 124865 -269412 105175 91505 -119138 60587 91537 275713 206198
8881 206198 36656 -140512 -42981 -32480 89886 -66137 33636 -47143 200466 -100444 113191
8869 -35601 -7349 208985 -172946 -68069 -134922 116931 -47698 17449 29900 -334 147068 -132983
8856 -41808 35010 29639 197396 -96395 133545 -116983 -41878 -295698 -48344 -228744 -37652
8844 -257076 -50447 -247674 20951 167003 -61590 114005 -307512 -43534 72321 -159166 324361
8832 20257 -67921 17858 -42237 -339977 -85779 -266060 -217645 174927 -422039 129182 -4769
8820 129246 13136 145359 -51134 76868 91378 212919 -35599 -257004 -65562 233651 -246358
8808 27802 -207046 -180691 -9304 34933 61563 47625 2599 -92737 -129421 340377 -141875 33479
8795 139217 -231489 185694 -118508 41630 -100037 60068 -224150 11656 -113469 -62549
8785 -62549 -30258 -234072 203294 -145694 84197 -205003 -85732 -413692 406353 -35385 -115748
8774 -115748 -146875 -190427 -256556 -10145 -130646 -33935 75982 -498658 91552 282737 -201986
8762 5441 100643 25092 -43560 -104808 -174434 -168109 95245 14547 -202061 -12424 49725 -103109
8749 -135203 -160249 -135337 -265959 82013 -177779 260939 170755 15458 23131 -104670 37682
8737 -84196 68310 124837 19990 -156878 56145 -92495 22511 -1711 69215 -14405 -137202 -192212
8725 -192212 -318138 -269457 58127 -30310 91884 -275917 -135746 -206458 -273562 -255061 -14457
8713 -546686 -43332 -21416 -27290 302680 155827 182320 114981 -240622 -77744 201859 -23270
8701 184242 -148722 -483318 -82841 67915 324530 -51852 157255 271244 26027 312025
8691 312025 105837 -186916 17843 -303718 -26452 134611 -63893 -191334 -31969 -135129
8681 -135129 39936 395 -88151 -39587 -94666 -111288 -238373 -199467 230670 278825 91034 -374028
8668 319904 127333 18697 14769 53810 -88372 -106629 -45914 -233123 -4573 -333876 -92508
8656 108246 99103 -62067 44125 -66097 -249313 -31003 57223 146941 43303 -42846 -107463 61379
8643 -324592 -102843 -405338 -99089 -123935 -216288 -276378 12421 -89988 315160 -344942 -232764
8632 -232764 34854 161529 82459 18291 -142409 -41897 -97043 283181 159674 12058 -66938
8620 -155758 -225568 51178 -212661 -209389 -35520 236173 -153590 176299 -127082 -95104 107999
8608 -330130 -140851 -246916 117932 -249581 -31606 206383 64638 156831 110636 29902 -145230
8596 11984 -262391 -71392 -132343 -99727 142474 -124276 161121 -27047 126279 76268 114422
8585 114422 -17257 -82721 177335 -112431 223020 245394 -75035 -147902 43191 -162636 15820
8573 42013 -194858 201128 122744 -231390 -242466 172229 183 -136974 -130135 -174264 -310255
8562 -310255 -247495 -58332 44779 123216 -33818 -153120 182916 310824 -22388 -62733 -126911
8551 -126911 -240789 240816 -297759 94547 28719 -3306 95607 -103267 12594 58037 -368457
8539 -218434 201852 -368907 -68087 -32542 -68537 -19448 -201013 -205878 -404262 -278688 -67419
8527 86380 -304130 -156198 115605 214129 146319 -6968 52286 -105600 -106963 -69307 -186941
8516 -186941 -106209 130883 89243 -25323 273641 -117412 -30893 301561 -232410 -225351 -52117
8504 227923 163327 -228499 161924 -238619 220129 120983 25093 -182347 116812 -94117
8493 -54200 179151 -612016 -264780 -66945 -298629 217572 39121 119643 158068 100231 -180977
8481 81656 -68016 88917 -158476 -364505 150102 -89325 -12731 -290556 -41689 252336 -540759
8469 -77667 -182188 127534 -4606 -148332 187480 -254178 -306680 -79583 -188539 -201048 69783
8457 171548 -55180 87082 -20296 -164087 125942 -357506 5216 128057 -21939 -93225 92858
8445 -93797 -85776 -105457 23844 -100904 45192 -89240 -208430 -28915 345135 -396789 -202676
8434 -202676 -97508 -40649 -39714 -60853 -235893 85633 185499 -20976 4389 -299128 -178164 -14777
8421 -50508 19596 217205 17738 -59912 137829 185449 -4418 -262347 -109871 2476 29630
8410 29630 23673 175493 -118204 -167170 10234 -160593 64707 -301628 176198 -142325 95990
8398 -232279 181863 -237092 -191019 -249454 -15156 -54371 -177461 87557 333316 -66995 144277
8386 -12681 -51877 -85248 -106250 -334417 199592 -204568 -30129 371804 -355819 81557 346202
8375 346202 -230652 -15021 7602 -75029 -290763 -227231 -117788 71831 -26191 -277442 95620
8363 -98769 -48955 115029 140532 60948 -114911 -210455 -326497 111544 25847 -193557 -172981
8352 -172981 -116234 -56425 103759 -316897 62855 -267851 262346 86225 -84198 256615 -485171
8340 -173364 -76058 -249844 134349 -131230 229495 -115206 -72178 -290640 -271301 19936
8329 245739 -278624 -8619 -85635 125391 300242 -209113 100431 181624 -33773 -76811 -37139
8317 -123931 299659 53604 126562 28610 166145 -137739 -47560 -97304 -156923 137306 -187713
8305 -65857 -166447 188722 -205142 -9987 -25510 -68739 118918 -45705 27140 152230 -137961
8293 -174122 -165727 -325547 -69464 -219060 137015 -175800 22309 43434 -240088 -330091 -72088
8281 101590 -399318 44884 184014 -116952 91925 197593 -315319 -147495 -3220 40623 273006
8270 273006 142285 -137222 -103130 216929 162372 140883 -280280 34740 255626 -113371
8259 -4632 -47154 100604 -33322 13883 -65896 -1466 -228640 -98925 -188941 -199312 -90640 -277492
8247 -277492 -192689 -32798 -20457 24108 272032 147798 -15163 -126219 -337272 -250868 -22528
8235 175856 9588 129787 79841 -259749 259994 175945 -176840 -51926 -68079 -163643 119264
8223 -26825 162752 172522 88507 -341900 233676 -372822 139636 37689 -208802 -186666 -18338
8211 70273 -55323 89358 -29366 11427 -73551 -353263 71965 -242355 -126708 -45884 -115240
8200 -115240 -15406 -34343 737 86059 -171513 -54490 -26353 51900 -59759 -282127 -293840 -140415
8187 -141080 6023 -235828 -63034 -21086 -187332 -397218 -235170 -49877 -322103 30794 124446
8176 124446 -244335 -516947 -444898 -430671 22680 -13184 -247616 51725 212034 -318423 99429
8164 165709 -77375 -41633 39369 -137088 8478 94592 220104 -365929 -206260 -33701 -18256
8153 -18256 150602 -126539 -44395 215559 -12115 -295295 -189969 -207765 220151 -292166
8142 -114189 155932 -121366 165671 -71749 -288914 151170 -256069 -236095 -122595 -99123
8132 -99123 -134368 90768 92251 -8760 -110532 56969 -20305 185019 28869 76233 -85135 44317
8119 -201295 62122 12476 122685 -140162 72820 -465363 -105556 -219861 -89890 -108263 -37105
8107 -146683 100375 -224087 169866 112474 -86898 204694 -176692 -66429 -107737 -71849 -7078
8095 -25993 107093 -33171 -416707 -457452 165437 1826 -188850 418872 29783 -111825 -122419
8084 -122419 178396 78937 437960 3780 -27022 -8803 203362 323274 -39483 151556 -35646
8072 -71134 -18672 -99815 -200992 -41452 -432715 -19256 216922 73499 -35804 -173546 35240
8060 309181 -92575 -26421 -119135 -79961 -100368 -267098 -312767 22631 -31344 113105 108746
8049 108746 241626 -248241 -53288 172174 -316018 -125309 91309 12735 116157 -62921
8038 144845 -139502 49110 -12151 -194145 43609 111983 -234286 -247268 -16425 -20700 -278578
8027 -278578 -138784 -290035 262617 7842 -217468 40563 -170522 108641 232246 188697
8017 188697 -117396 110542 -132035 215652 299585 48696 43038 -160966 -98110 -121226 -48107
8005 -277944 -327186 31597 -258625 142351 81543 103946 -126997 -121521 5214 -190226 137411
7993 341958 -154242 -388903 -254244 41303 7785 30373 -81550 179699 -106362 56939 119491
7982 119491 -40222 -92503 -161839 -64742 121273 -84256 -5407 62480 -430577 -74204 19093
7970 62179 14856 -265865 -199984 -28246 -196738 -213824 -309343 -216748 100035 -135074 -220865
7959 -220865 -370496 178001 73122 -294062 -380281 -72660 208938 -105879 71744 117135 -115769
7947 48898 -149627 -142357 1619 173635 94787 -125721 78129 -73315 -23946 -351474 -169373
7935 15850 -190669 75771 -214147 -97003 -175267 -192048 -476893 -227210 40808 -80962 30008
7923 -90244 -255367 -55993 249059 -61303 147043 -65918 -86812 170740 56753 -47410 -33040
7912 -33040 80691 40161 -46555 350824 -259081 358206 47640 -37353 -103079 -9126 15485
7900 356284 -61418 -106240 -298734 -136928 130276 357967 93771 -23445 -126889 -100128 -142115
7889 -142115 -62475 61817 167052 91329 22993 -215966 -31844 -51253 -240879 -123821 -337763
7878 -337763 182736 281518 252994 -361147 -23570 -9890 67988 -18450 455 -281814 -120256
7866 -45641 86935 -120072 111926 -41830 -49674 -131754 -106491 281237 -153628 -66952 79261
7854 -143372 -36582 -239061 -77870 -128441 -325116 -70401 169311 27177 -118182 40182 -71457
7842 127676 -169414 -9163 -128933 -201071 -292033 21147 -243878 -275878 -54395 -14209 376382
7830 170501 50748 -176676 235754 -220892 -293385 106328 -142360 267907 -15029 -358281
7820 -358281 -136756 -256720 -379696 -280578 -60805 -119061 18547 -213382 -5120 9383 120583
7809 120583 113761 90841 194163 -95321 51201 11135 -231989 -174675 409148 115440 220318
7798 220318 47655 -90677 -291376 -240360 -69893 -161747 -192482 -116047 -156240 342598 -170451
7786 -98608 303875 221306 -125137 -24771 -176116 -128073 -38647 -59067 -20256 -142597 -175139
7775 -175139 -357985 133534 -254753 172103 -42672 91971 28184 70714 -429102 -173527
7764 261374 216000 -95260 65111 -413072 -274773 -107271 229182 43041 27756 -186757 46542
7752 -144193 -169075 -53521 -32299 -92839 301268 -24829 -169578 257421 63283 23042 -292813
7740 -281344 75154 -75199 121653 61547 53150 -12045 56415 -101254 283460 65047 -289576
7728 224240 67688 -50680 127782 -332557 175874 93513 -127098 38285 256399 -397482
7717 -132061 170974 -250898 -289430 -221842 -91318 48271 -107071 -37193 -100417 30173 -104168
7705 247110 -120073 -47000 45061 460380 -163146 397741 -348662 -126982 283782 289146
7695 289146 -78511 -76567 345544 105576 112124 -91669 75802 -241128 136167 -7956 -30334
7684 -30334 -77934 -13397 -143086 41785 -49337 -155407 -91962 -342463 -144742 -158868 -88925
7673 -88925 -43060 -236166 38313 268612 -53941 -17227 213485 -14766 74448 -155552 -188184
7662 -188184 258781 -68356 -78043 -262920 302789 146857 -77526 80026 -188529 -128334 -26118
7650 2667 -319210 99706 -120905 -302806 -165765 -78977 277193 -380447 83124 94987 -201617
7638 -372751 -166330 195901 -139931 -71385 -235467 9266 -298666 71756 547990 -104641
7627 743 -393725 -306167 -141644 41649 -128945 -213397 -92380 348770 103103 215521 -251756
7615 19638 20184 -117514 -41835 -394705 -190752 -74832 -190781 -85549 10184 25496 -58128
7603 72106 102428 -158444 -161076 -210303 266588 134033 -52566 131674 -241963 -90754 221248
7591 -4768 165139 -153833 155502 123472 -39999 -1762 126231 69653 32569 -80669 -144552
7580 -144552 -97852 -74610 37220 -70924 115423 153632 -297284 -805 -93399 -61681 -121974 -226479
7568 -226479 -23710 -312940 -115369 146111 -110356 -141539 191705 -236349 -59821 -293856
7558 -293856 334904 -136257 82588 33628 -11450 -124303 -361144 26151 26762 -15712 2435
7546 176291 -36245 -19386 -393286 -23351 -4536 247215 143878 -52561 125746 72048 171480
7535 171480 -152442 2040 -134227 -6336 100425 -87637 -330200 101157 31916 -325120 -218640
7524 -218640 4024 45377 295940 -81464 32468 -175353 259938 -272471 -278689 -253859 -29771
7512 186242 262499 35152 -68859 -107242 101242 159493 -49003 -87461 196011 -273240 70670
7500 26730 156304 -95042 162312 103697 -21136 17814 79168 -25023 -275762 97676 -131836
7488 170815 171183 72007 67117 -367836 -73004 12063 -127550 27318 -106259 -59808 -85098 353123
7475 -429424 -55793 311934 -229319 96320 193620 -13685 193774 -227265 68313 227081 -133607
7463 -282823 75329 204410 -224809 139976 3584 -1570 -22914 8572 -23476 -243974 -202560
7452 -202560 -362625 -133035 -51407 -212969 88969 123990 -60336 -34129 54311 -96326 212739
7440 88937 -202011 39230 -154033 107482 -27938 -241579 222433 94621 97388 132241 -330073
7428 30211 -17109 -31990 -28060 -323731 -247749 -23782 120386 159110 -212780 -184736 -182540 45307
7415 -214544 -74426 -221839 37091 -383589 -192274 157087 -258952 -44360 -107781 333457
7404 309442 350463 110731 -25433 348320 -107910 67350 -156917 377455 -103814 -196000
7394 -196000 170502 -102268 15937 -154723 290703 91446 -232405 -180379 9494 -125459 -88850
7383 -88850 -173368 370585 215816 121337 95974 173299 71566 271963 304305 -69223 -65117
7372 -65117 -28061 24047 -79687 150690 11041 -67322 -101506 137224 57794 -23371 67767
7360 65686 -11356 -135460 -174448 -20579 -164793 -270153 2912 -105181 -330854 66876 -270341
7348 -398902 47103 -178667 -267699 -138710 -1457 -97716 -49723 175523 -308805 -361588 284430
7336 78916 -42113 259973 -110070 114609 196696 -240240 89837 -246318 -74682 -333965 -283227
7325 -283227 -409909 146186 -135309 137781 41929 -432403 -82122 -153352 -40564 94874 -144491
7313 57561 -252511 -130492 -175292 -111747 15506 -353511 149261 -4559 -380529 437290 65278
7301 368121 68426 -202518 -220036 93662 84151 155246 -165160 -15310 329228 83189 -34011
7289 69323 98788 205086 29810 -139452 -312510 120249 -94107 -47109 349410 -71091 267667
7277 -281182 -92174 -114194 394311 9352 -288609 146919 57208 10944 -42664 -140003 -36739
7265 -307268 98733 159328 -155045 112812 147227 -87648 97306 28501 -213785 -94554 -91255
7254 -91255 -276975 -331201 214719 148584 146654 -110427 -143924 68304 -139516 -197893 240096
7242 -232667 159376 -15424 -143829 -157752 -302547 28723 111101 270736 14886 -146805 62134
7230 -231342 -132010 55697 41889 218638 -148530 54959 73198 -69243 15172 123651 135997
7219 135997 -221908 181803 181018 -290594 -92485 -87768 -46927 393808 -403522 -163053 324070
7207 -107192 -196427 -137333 76982 259923 -65965 2874 86731 411547 117240 -330924 -85547
7195 -96547 -152445 -135339 287888 -262055 220004 33608 -52099 280953 -257584 179881 -25587
7183 -304431 160637 -20293 108230 -44217 -165592 381498 -104075 -332036 379938 167833
7172 -368590 -53947 -137690 -209005 -1121 208311 -56760 -89968 162312 -180495 -341870 274385
7160 -207687 -18284 -65982 -59479 -110732 -770 22651 -12703 137625 190402 -29398 135839 -62981
7147 -329489 20299 283759 -154537 46051 -183766 236373 399478 94734 -113515 -34477
7136 269803 49045 -58898 221589 201882 -38073 -194600 -70076 260236 -134984 74650 -306314
7124 163792 -12911 -142751 -21909 -236060 -71129 312516 -88158 -238052 -32405 39656 -199891
7112 199024 -170494 196083 -37362 198355 -2663 -138037 -345343 -77480 28705 -25764 187344
7100 23802 8693 171442 54141 -38309 71484 -1938 123173 5797 -359736 229905 -78697 37373
7087 -192646 -94967 -78707 106927 -188968 140567 -419328 -194558 59993 376020 -47952
7076 -280047 10224 140159 124649 -277086 78673 -429253 -46357 171459 -115162 80902 -188716
7064 3095 -117012 44850 42727 134384 -141444 6724 -141268 7954 31217 226104 -88490 271656
7051 -239450 -275324 -73989 162659 31645 217723 260492 -198970 -488825 -222898 -120473
7041 -120473 110233 -133934 62519 54038 49983 184799 -98560 -143801 37310 212458 -9213
7029 -192300 150630 216297 -177003 34917 -124463 48393 103162 8822 -168066 7174 142737
7018 142737 44474 -120509 75826 220146 -204642 100774 243065 -480734 -85639 281661
7007 84081 -255654 -154331 -29910 35859 -217866 -96508 -12146 -388448 66073 -422658 -22962
6995 -53441 -67140 44772 -115511 184285 68901 -4339 -98414 -148613 306754 -263369 -175365
6984 -175365 50133 97558 119587 -236591 -215032 367897 -12656 -73354 71251 85910 -193163
6972 9531 -85029 -7620 -110811 -9241 -34591 -24488 -434473 81139 2908 -119408 -384236 50276
6959 -90084 52636 -357920 179130 63146 57767 -122694 -30924 -87731 -11597 51919 402031
6948 402031 -207472 36594 13227 -21055 -141802 33907 -60843 102486 28804 271181 -559381
6936 -2561 -27559 106825 -61684 150448 27898 159894 -21584 -94308 213373 45827 -23981
6924 -91312 -304365 -3146 41754 -15839 179248 112339 -122347 -72004 113105 162434 -474641
6912 24767 -87327 -221824 -432978 -213768 -26273 -91933 -225570 -225167 -29854 -230014 -22855
6900 109332 103775 -77625 106537 148506 -81827 -21812 77297 289574 252768 83569 -167881
6888 57452 -90573 -36094 472510 -183538 -174810 -4539 -21097 -395050 11032 -269365 315664
6876 -413438 -241310 143401 -58471 -150123 -27134 -60854 101749 57314 35063 558 74793
6865 74793 -159325 136459 -17117 147220 3008 -67018 242 184976 -37674 -60642 -327536
6854 -327536 -49365 -109617 234450 89775 100373 -188295 57550 -28624 -93020 -137034 -203878
6843 -203878 194573 -85515 -201959 -151920 -79305 -257240 -128936 -152233 54474 199026 -175467
6831 25337 12444 24357 -209936 155202 557 -267360 195696 -11558 1899 -40325 144880
6819 -254626 141763 -127743 42130 -22473 66845 -83645 121665 -41344 103190 16290 326604
6808 326604 172956 380391 65649 -159056 49403 21360 -117790 190298 -140754 20683
6797 -330170 -49931 -46761 -137910 340140 213698 -120613 -209658 -66533 -8487 -19512 187035
6785 -89439 -189086 66932 254303 -112267 -232592 -328301 -251076 152959 68847 235203 102041
6773 -78034 278067 225709 -44402 -51030 -210343 -156993 -23787 -163230 -274674 247398 73657
6761 -45699 58753 -63251 298024 212693 210080 -372251 -202775 245732 257939 -144951 -206663
6750 -206663 -44262 330509 130830 -115556 -293551 -24210 -182965 -119644 -145666 -345520
6740 -345520 86954 23921 -96938 121631 142448 78623 -101010 -125232 216151 -62899 -8127
6728 271604 80111 -132270 323475 15914 261231 -27736 -121116 25630 -36147 170054 -261631
6716 147137 -34876 209873 153541 270995 67360 362951 95328 61116 -332778 -27329 232035
6704 -132917 -36766 187203 -143167 48645 53728 109966 -54378 224479 -114776 -93330 68803
6692 44892 -101257 -313428 10411 -202342 110349 103613 -34687 143855 301792 -56348 -318918
6681 -318918 -284310 325542 196388 -330123 -55615 -305054 95200 81239 197518 188631 -373493
6669 16408 300926 -169156 -145889 -313215 210354 41724 -13684 -8086 66527 -326194 -180830
6658 -180830 -159609 81138 -125344 -106840 -30950 -122815 -189488 -145431 -226626 -141566 -128582
6647 -128582 -496084 -108258 56726 -20778 200707 201646 -253696 -163759 375134 -23830 51052
6635 22935 -394839 178760 -404010 -47450 187587 36069 -21221 82438 7626 -121163 139577
6623 -504134 90542 -255129 81092 -241813 63624 -409851 -108110 18108 -60101 153314 -438639
6611 37774 234990 -301578 -216743 94086 -44120 51186 -77237 -206445 19315 157845 -266378
6599 -17179 128750 -14006 109790 -254915 -162118 -7714 -161081 184392 190197 168043 -181497
6587 95566 -57800 -330961 224582 145055 166063 264882 -51373 -156702 109233 42129 60048
6576 60048 29995 87507 26415 -58502 -10653 342868 11307 -261288 19573 120724 -9619
6564 223031 -290538 15772 -360668 93688 -160998 -272950 -49072 -11111 -54366 151693 189641
6553 189641 -40678 -188418 -164435 -150718 -69405 194416 -76909 150325 34103 324470 35374
6541 -85200 -141081 -102752 199919 151438 352340 10224 -286200 -7522 -470889 -8796 57256
6529 -296221 167497 39789 219046 94791 142968 170954 -82564 -183433 78557 147213 75869
6518 75869 163494 -79718 -65468 -138208 274673 501671 12987 236969 -102778 16993 -227862
6506 -167518 -184875 95066 -62522 -87756 -69140 119007 -28703 183825 -59799 68993 -212489
6494 82001 47276 19804 -131926 107547 -86862 199188 -90165 57578 73211 140489 18429
6482 156048 100107 31271 13955 -27604 -48770 64527 -117006 -306761 -110074 -8144 -134502
6471 -134502 -189016 -219487 -152860 -59225 120858 122026 46220 -79073 86066 180822 199067 -219478
6458 -41498 -133503 51127 3215 -23412 151109 114746 -64435 175146 -103576 -117548 45229
6446 278559 155097 131000 -251734 -38400 -23637 157231 -60595 -90400 181774 85901 349578
6435 349578 141017 139434 96704 -219373 -87952 131235 -145595 53860 28837 -196930 389171
6423 92227 -117687 -225769 59637 -268143 -119661 132765 122748 306514 15138 50348 -60089
6411 -148542 186888 -90832 210541 221669 157078 -342877 -26438 -120335 -267737 -316623 -95087
6399 117060 -232637 -102005 -131082 24637 127806 63717 -359782 -43953 -126644 -25807 -262037
6388 -262037 -90674 -130903 -210912 95275 32007 187510 1476 203018 207494 -183983 262490
6376 -263904 268786 -156689 40170 -181769 220313 62714 -191063 -23112 -49012 -265880
6366 -265880 33443 -186159 -76797 -37165 128137 -58981 -155802 -9135 182010 248688 -4213
6354 -84898 -157515 307394 321102 197232 -188952 -107563 261411 368276 -1537 283669 -60213
6342 -55498 -214236 234102 -271395 78106 -10338 199120 182268 140966 106629 336851 -165784
6330 162231 -57941 143549 -76806 82119 -50483 -25255 -217355 -16925 178136 -80807 -295075
6319 -295075 -2337 -211249 -27895 -5839 -303253 79950 140192 -60103 70805 263013 99159
6307 70628 205511 116786 49137 57748 281043 51731 92601 211735 -50822 -115811 -39614
6295 200508 37424 -292087 105748 -350 -238070 -206727 -229995 209189 57692 -155396 200124
6283 82222 -155689 -31072 -107397 -45913 39493 -18663 -7972 -294258 -152021 -47139 -272463
6272 -272463 -178611 78015 38672 -151721 366891 -161546 -133109 109071 39055 39832 93095
6261 93095 135520 258139 -100696 -27221 108650 211759 17985 174669 -7412 -2557 58119
6249 -354680 40345 -1560 -202774 113495 136609 182449 132464 -111192 18381 87552 102459
6238 102459 115244 -10094 64982 -34578 -137535 333917 -86779 243987 28270 -46434 106280
6226 168345 -63074 -113554 103750 88090 -11267 331755 -115829 -155306 144728 224340 -199395
6214 -105004 -99598 -79891 -63410 321518 -197559 178281 3282 -110399 -27859 70754 -241851
6202 121383 125818 93580 281204 116573 288358 -114839 -216739 200826 144268 -132462
6191 -181496 -122797 -83325 24695 -35211 91934 -124055 83730 18649 -46023 87827 -34013
6179 44738 -121216 -153802 220226 124892 -89415 84424 -140306 149080 32443 43617 82320
6168 82320 -51863 79493 -26890 -39985 -187008 216952 406500 7193 -281528 244498 -174531
6156 179834 -7701 16209 -24353 -70222 -83990 -132808 14611 -40825 -238774 112876 12545
6144 -81842 43122 375875 -300698 -24139 119325 108486 115998 200120 -2660 27855 71077 -255719
6131 -8519 -2697 -248306 -86074 47044 -311582 -43372 94768 -322543 -105175 50083 8178 -135254
6118 -44352 108021 45485 -31574 62886 -121004 136711 34012 64871 -71090 -10754 -16350
6107 -16350 -234036 -56034 -15413 -31086 -185024 109886 -263222 19807 87162 -358745 174197
6095 240652 -91575 -51839 -199249 330777 -93991 45114 -161732 84194 61126 -63881 -100733
6084 -100733 -322081 102896 -109765 21860 -272967 -248459 -84466 -176513 64515 -147106 -47904
6072 -95926 337895 400816 61588 186462 -22566 -318056 376647 -5324 1642 -255205 1624
6060 83380 70660 7987 128861 -82347 -111514 -152796 -156462 89374 186112 210766 -35348 417766
6047 105507 -334317 -89856 -91594 200073 -42658 -7771 -133322 37047 -25834 -39744 -33990 95014
6034 152320 -114385 166769 124362 -169273 -94345 -186455 27821 13148 219309 -127465 86593
6022 -133471 375766 26234 -182175 167475 -296247 182362 -232330 50940 -182086 -113614
6012 -113614 251153 -60603 -152534 32505 -34862 120164 -16671 132929 -294022 -36089 -45414
6001 -45414 -156785 92141 -212434 153059 56231 304006 -59434 198165 -4375 181664 -269127
5989 -253481 -131544 -43678 172714 -34397 -297341 138769 -101967 223968 277999 230918
5979 230918 200003 -89996 285908 227429 148930 -34831 125996 -194182 -76917 -253097 274857
5967 98071 11378 234370 -203309 -201884 49502 -161371 -390881 44751 242699 37761 28822
5956 28822 -77835 90113 239829 252337 202718 287626 -122467 231204 192896 -98800 13726
5944 39044 -66088 -354162 6329 245253 27128 103794 -59195 -2264 -127012 66547 -47596 -242802
5932 -242802 141641 -14622 168571 -113528 -60596 -212276 -109282 -151445 -1654 152605 -3367
5920 -90034 194796 -202948 36381 -39342 84924 194541 -31148 -559427 102798 117568 132211
5909 132211 -51889 -158600 146902 -94055 92136 166292 247057 131794 44555 166355 83526
5898 83526 -60770 8416 -113224 -98984 29233 -71526 -376844 -130272 30072 -64763 -247503
5887 -247503 -22369 58008 76003 -197666 131628 -51968 95423 -236818 -211595 -62301 208356
5875 -321552 -17126 98588 -57567 -55767 49798 72371 8692 -146339 131015 -110460 -87112
5864 -87112 -361450 -5734 146429 -135910 -93712 -40119 -164739 357583 96683 70758 -17053
5852 -88583 126784 -336907 44066 -139090 -19495 73119 -122886 33416 122287 100010 -71475
5840 -30583 43774 -45644 35072 82626 -173495 201408 292347 -124971 -200441 -182261 130756
5828 231189 153356 -128509 -196473 125241 -190038 182211 -10864 28922 -93702 178150 -184045
5816 145051 142824 -168003 -22838 99973 120757 128489 -93558 -4697 -32708 -230907 104078 -23360
5803 63031 -178064 -442775 -67695 167604 443 424851 -56936 -10042 196902 -80061 118332
5791 169253 132493 28523 -106200 18753 -159412 136538 -20099 -59294 -19293 108932 -319095
5779 -181894 -290508 61560 -25486 -93481 -71522 -306798 130010 284718 -357190 129211
5768 -76919 -222938 2851 -157260 -25700 331884 63623 211 46264 -208745 -319472 -121231
5756 -357166 126250 -128655 -44916 -6891 -45824 -71382 264132 38926 51452 76547 -8476
5744 137185 -197269 292691 -215820 73810 -200388 -134823 -129360 -83831 -236668 325918 99694
5732 255419 416582 13288 -308437 -208759 -302268 28492 24525 -25402 -92411 272574 180152
5721 180152 -263691 -1391 190674 185617 317777 -118354 -194882 -93967 251793 222071 -217845
5709 58458 125697 63737 -35503 -62256 -488335 62149 -116414 3947 223213 154225 213 51886
5697 51886 229575 -68678 388904 3179 130173 -89963 -122222 84526 -158331 194288 179309
5686 179309 30685 -209141 -215547 -1912 63443 -25015 199644 130058 214155 143968 -343141
5674 -107891 -77408 194503 386914 -56903 -141935 -257618 94873 102047 -84793 -184882 -230869
5663 -230869 -161266 -91062 -92763 -165977 126226 -119393 -50191 234586 -70967 -288916 -285727
5652 -285727 -20211 -304000 91111 130014 -278617 173120 144778 87367 43406 236507 85344
5640 163007 118139 236878 -10919 12507 39033 7074 -134388 276921 310508 -33360 164795
5628 332833 -253455 -157607 -147254 -220667 299206 -228454 155988 -170118 17258 14156 97787
5617 97787 -217249 -82335 -131763 -121103 -63080 -7021 230868 302850 -180437 -115748 -272256
5606 -272256 212886 -221767 18113 218369 135159 -303181 -380432 103159 -119649 -91342
5596 -91342 -135457 147221 -155915 83402 -173217 -88751 37654 8091 -22529 56278 2992 80898
5584 80898 27040 -207701 33005 -142680 -116855 309512 156534 -82267 -270382 28054 20969
5573 20969 3646 -121520 -170597 -47150 -84197 219507 208960 178406 -146753 -331762 98403
5561 395905 139229 -168771 145140 -66299 1227 -176966 204127 -13011 -114260 -16546 125201
5549 -134320 -74058 24958 44462 -176210 -306965 -116865 142131 197096 -30635 -181546 137429
5537 -134052 -46823 -184156 128142 -60483 -207864 90167 -212713 58982 12477 329629 -2846
5525 84946 279327 -142219 -72640 119444 -399886 220642 59781 -674 131629 227503 -129121
5513 273863 147814 -155142 -28852 105600 -39509 340748 265572 56112 -69328 387595 358882
5502 358882 34575 70646 -254154 278991 116634 14623 48844 357012 -216928 92468 -79403
5490 -309414 306351 -111103 164826 212329 -25212 -36358 -51574 73809 104258 204164 -35758
5478 255910 216042 131515 34596 -41665 -244250 -8744 -53898 233107 21530 156369 10502
5466 -161397 51880 -239380 -146738 -60575 52182 -108908 -83358 -138425 -83166 572467 68963
5454 -213766 339367 -231368 8108 -211679 -126716 46545 -79401 224046 300129 -250462 -123742
5442 -23963 229237 9600 -174334 6506 -238190 -295290 117279 357841 -217736 34738 -50363
5430 -28763 75642 -89675 -72812 51206 -80481 42720 189704 201096 -177626 96696 49279
5419 49279 -202519 -191029 144507 -131603 128044 -187495 -56522 -349163 125720 -167478
5408 -152096 31215 -38094 -87343 -327561 142511 -227407 80951 -201189 191189 -118646
5397 -3424 -169124 77590 76537 -128033 363614 95670 12555 129877 -17077 -227634 -60940
5385 26533 29007 315546 7098 2189 -40079 403737 -225490 -171650 -5184 250433 84099 -131995
5372 -114742 40800 -308019 -398463 253824 207517 87424 380558 62502 327856 46408 -172641
5360 -240931 -357599 -319902 -14712 -211202 171488 300412 70193 131986 -4584 303506 -169013
5348 -35316 -117108 -168464 -122985 55975 -224755 -67208 -68749 -68058 24497 133184 23421 35405
5336 35405 -152032 -224403 76735 -190462 -227499 -84508 -103464 -106856 -277181 137933 -155316
5324 -155287 229973 23045 74064 200832 246961 95594 3300 7307 157781 -235550 172913
5312 133063 -155183 299945 47787 -327858 -62195 325404 40365 67664 -131278 -95735 -125935
5301 -125935 -220996 172131 -38638 -78995 -74051 -122314 -28066 104949 -8568 -139327 151348
5289 -42969 244187 -210191 15546 157767 133212 90426 -145907 -93496 21611 212181 142235
5278 142235 -344017 95172 -144549 116469 5478 66866 205548 203051 -603318 -10527 -91862
5267 -91862 -167362 348422 8049 190437 202845 -201720 72555 35597 90830 177845 148638
5256 148638 201196 145363 -4105 132304 212561 -88532 -133326 -124435 -175164 165781 17270 -14773
5243 -253609 -58796 147813 163266 119217 -114498 -298824 282937 184297 32686 48360 43886
5232 43886 -275530 126830 161378 170696 199405 7506 -108970 -76787 167354 20265 394873
5221 394873 -31363 314745 74777 197551 111846 -91628 141866 74749 -59851 237279 -73354
5209 274105 24385 359579 162338 91072 -5642 -193718 -300304 128502 -45496 103349 -99238
5197 -89908 54795 -54116 211005 -28418 8003 -237229 107255 57384 -262054 190309 388869
5186 388869 27247 155165 -178342 201323 -201985 -170952 197290 -276027 -141471 184417
5175 -203766 66714 159988 149505 102784 -67229 -184793 -176552 101930 31383 15725 -32980
5163 35339 33339 -101545 56557 -17241 -193584 -3723 -129134 128468 123428 -117373 67975
5151 -27192 182383 56101 407273 321813 -96862 87043 12087 492825 -203306 -92284 -316818
5140 -316818 61766 -13505 201426 -71823 103134 -15688 -3416 23529 -192281 39611 -63992
5128 -56510 -57908 -491678 -110692 194572 -317837 31501 -133195 5019 -117028 22680 135513
5117 135513 -63493 18985 246799 -211170 4077 -114467 -168127 298196 -161854 13579 427103
5106 427103 116294 -236822 -294068 -12914 43254 42429 -139193 74369 -20625 163291 -106885
5094 46052 51390 95534 -87343 -180301 -280856 -181207 -253679 177266 179732 -335673 -97106 387660
5081 -34935 344436 -52477 -232023 -425 40026 -300607 -141733 -149172 110442 81300 67433
5070 67433 -52609 40360 -190515 184822 265823 -97681 -249913 129810 -16651 16368 233456
5059 233456 67982 -257146 160411 12196 111698 -128454 -98798 27017 -4183 207320 -175820
5047 290898 255424 -18386 49548 -16311 205756 1225 -8090 213730 100060 -120213 112825
5035 111139 -3581 -17450 58817 40798 -64752 266719 20860 -137182 108642 108278 77236 -231069
5022 -43502 66088 -70981 -194131 73518 -437818 104141 -115497 -364254 7614 -66253 276206
5010 -91069 -108465 -32420 -120509 45914 -66612 131584 -254794 138298 -51565 -188952 -199715
4999 -199715 67811 16028 499824 120641 -20567 172475 -178769 32267 234469 -195367
4988 -34990 95146 162187 -170856 -17794 41433 -155684 -17517 -63928 -318552 173062 50388
4976 -163922 8836 -108542 30405 -365826 132014 224743 265051 318876 -251550 123002 67667
4965 67667 36239 259197 -132642 63945 -202520 10592 -165465 78775 107611 -134374 -152403
4954 -152403 259259 -108488 -107011 73179 49066 316252 -280589 137965 -45100 25064 -211161
4942 -163022 117928 -55695 24291 250014 131040 262382 17917 76109 -150736 -102793 -287190
4931 -287190 -93447 -123402 -284371 204579 14252 -106995 140652 94335 80836 -264162 90036
4919 997 -125736 -29824 272339 -60090 57876 87042 185941 67174 80281 120411 70887 -152497
4906 -167066 103973 17806 226144 94117 65449 257469 -134993 -89245 69400 -26009 199078
4894 57719 52899 309987 -47408 41104 68785 209779 -109619 -34127 127362 -74131 198763
4882 335153 264621 -83498 -217136 -113890 178968 -151691 51136 -210383 -269092 262476
4871 106971 74419 108026 -197852 -313729 -22060 -20685 -71576 333974 -222788 -74389 12853
4859 11312 48437 72953 -145059 -112917 121575 -86425 34915 -96834 110680 59050 -93741
4847 223838 -12372 -54295 -166151 195676 -44032 155415 -99545 -207508 123781 123479 13650
4835 -267952 -248215 247140 -155301 161051 59979 -249904 107970 43252 -43242 -22650 -6754
4823 -46675 -27443 -143207 -10219 338530 -150142 138115 13872 -106749 184563 -1382 204557
4811 -260557 -311391 179909 148530 -262728 211856 -120519 154675 7322 -52106 332814 140759
4799 -60786 50019 7030 129750 -530342 -25720 42132 424575 70251 112887 225119 -8751
4787 -113433 -19326 34280 -171333 -71449 -197878 -91809 19300 -64874 194829 297838 -102849
4775 15797 372398 -82387 336937 -59762 6322 277567 342713 152740 462757 94523 76720
4764 76720 94766 237565 -81974 -77358 -306726 -195032 -205035 100042 -4025 -20119 -44068
4753 -44068 450972 -81653 69649 -257803 4028 -129515 8065 -115284 38352 124783 -23887
4741 45912 201831 -63325 -256083 21230 -101315 262482 -81475 -90325 -409408 92607 117915
4730 117915 -35683 166186 -128582 137330 277322 -30911 -151860 -149371 -47288 194206 -57969
4718 -58524 255682 167644 -114288 -130371 -238198 741 -274500 -99162 123255 -282417 231075
4706 -90970 307564 97869 189603 12611 56054 77388 89933 -400848 -94082 8835 -310938
4694 -334584 194700 235881 -292748 -16648 37964 -164835 289451 37077 -154774 -183558 10900
4682 47887 65797 -112262 -226907 8185 103566 23522 -198955 171017 87333 33273 283504
4671 283504 179135 54927 67389 -201193 -1534 -122173 55015 73086 -154657 -18885 -93226
4660 -93226 -13254 170746 -71059 11671 151212 25159 -76471 94107 -3022 -259211 137363
4648 -187127 -358383 118527 -45329 83491 46255 348246 312232 299624 -45038 55299 7534
4636 10273 -78960 -11006 115712 16625 101942 -38681 275006 -89032 35695 -14965 156864
4624 126808 121625 318672 157456 170794 -116079 19668 219458 -58352 43472 81101 32920
4612 -56882 -7383 -273074 -58677 -67622 303338 -279079 -23503 -197031 178225 -23673 -18059
4601 -18059 170066 -207968 -69121 7151 -42108 23007 395261 -51439 -103395 230607 103179
4589 -82785 -54467 23863 -85045 149770 -317877 57370 209911 -39854 501224 216484 221176
4578 221176 -209130 -400946 32705 -18253 351973 -35917 59516 242594 -2747 -137174 72844
4566 12223 39701 -20573 265064 91630 107300 72360 48778 38470 -249877 -182338 -598449
4555 -598449 237227 -394059 159094 5495 -32542 -82482 -135507 -113268 56514 169830 162300
4544 162300 -108898 -90492 -71483 -175392 22418 233536 196274 41931 -128786 181558 293600
4533 293600 102014 292736 84857 -1244 -168934 257067 99324 -81958 203322 256791 -31019
4521 -93621 -141531 128136 -54526 248283 121142 142991 -34260 -92888 -297177 632592 172862
4509 61298 -77181 81911 73047 58984 9060 -47998 437204 -123165 36432 -232403 63690 158108
4497 158108 -19878 370079 -3451 -155604 143171 225195 312977 115684 186633 203075 -26582
4485 -133888 -130268 -259163 -257057 -15714 172373 -85436 -460522 94591 333055 148316 -81116
4473 -42839 411194 22272 264291 70286 -79338 -132465 248772 122141 -159688 -73529 -221654
4462 -221654 85606 -394264 132249 -9489 -187614 51905 -280484 24612 -133985 71267 -187354
$$ [...]
##END NTUPLES=NMR SPECTRUM
##END=
