
##TITLE=AC1295_UGARS11106_6534052_0wtJG578sq
##JCAMPDX= 6.0         $$ Bruker NMR JCAMP-DX V2.0
##DATA TYPE= NMR SPECTRUM
##DATA CLASS= NTUPLES
##ORIGIN= BRUKER
##OWNER= Administrator
$$ 1.72 TOPSPIN		Version 2.1
$$ 2012-07-17 04:40:54.625 -0500  Administrator@TOPSPIN
$$ Compression mode = diff/dup
##.OBSERVE FREQUENCY= 400.02188249412
##.OBSERVE NUCLEUS= ^1H
##.ACQUISITION MODE= SIMULTANEOUS (DQD)
##.ACQUISITION SCHEME= undefined
##.AVERAGES= 8
##.DIGITISER RES= 22
##SPECTROMETER/DATA SYSTEM= spect
##.PULSE SEQUENCE= zg30
##.SOLVENT NAME= COFFEE_meoh
##.SHIFT REFERENCE= INTERNAL, COFFEE_meoh, 1, 14.98509
##AUDIT TRAIL= $$ (NUMBER, WHEN, WHO, WHERE, PROCESS, VERSION, WHAT)
$$ ##TITLE= Audit trail, TOPSPIN		Version 2.1
$$ ##JCAMPDX= 5.01
$$ ##ORIGIN= Bruker BioSpin GmbH
$$ ##OWNER= Administrator
$$ $$ C:\Bruker\TOPSPIN/data/COFFEE/nmr/AC1295_UGARS11106_6534052_0wtJG578sq/20/pdata/1/auditp.txt
$$ ##AUDIT TRAIL=  $$ (NUMBER, WHEN, WHO, WHERE, PROCESS, VERSION, WHAT)
(   1,<2012-07-17 04:40:47.765 -0500>,<Administrator>,<TOPSPIN>,<go>,<TOPSPIN 2.1>,
      <created by zg
	started at 2012-07-17 04:39:41.296 -0500,
	POWCHK enabled, PULCHK disabled,
       configuration hash MD5:
       6B 1B 68 BB D9 2E 58 E2 7F 35 AD 54 07 DF 0E 41
       data hash MD5: 64K
       1F 49 5C 65 4B C0 6B D3 29 E3 DF 2D 60 E1 97 E5>)
(   2,<2012-07-17 04:40:50.453 -0500>,<Administrator>,<TOPSPIN>,<proc1d>,<TOPSPIN 2.1>,
      <Start of raw data processing
       efp LB = 0 FT_mod = 6 PKNL = 1 PHC0 = 0 PHC1 = 0 SI = 32K 
       data hash MD5: 32K
       BC 79 4D 67 9B 6C 40 B3 60 A5 1C 95 5A C0 BD 80>)
(   3,<2012-07-17 04:40:50.796 -0500>,<Administrator>,<TOPSPIN>,<proc1d>,<TOPSPIN 2.1>,
      <pk PHC0 = 182.3566 PHC1 = 0 
       data hash MD5: 32K
       C1 EB 92 F4 2F B0 70 D8 96 13 58 DF A6 F2 2D 15>)
(   4,<2012-07-17 04:40:50.921 -0500>,<Administrator>,<TOPSPIN>,<proc1d>,<TOPSPIN 2.1>,
      <abs ABSG = 1 
       data hash MD5: 32K
       85 26 55 69 3E 8A 30 B6 87 03 CE 87 29 A1 6D D2>)
(   5,<2012-07-17 04:40:50.984 -0500>,<Administrator>,<TOPSPIN>,<proc1d>,<TOPSPIN 2.1>,
      <abs ABSG = 2 
       data hash MD5: 32K
       08 C1 45 F6 46 5B 64 D9 80 F0 B4 53 3D CC 0B B1>)
(   6,<2012-07-17 04:40:51.015 -0500>,<Administrator>,<TOPSPIN>,<proc1d>,<TOPSPIN 2.1>,
      <abs ABSG = 3 
       data hash MD5: 32K
       B6 A4 09 ED 31 1E 70 3D DE AB FB 72 D0 BB 0A CD>)
(   7,<2012-07-17 04:40:51.031 -0500>,<Administrator>,<TOPSPIN>,<proc1d>,<TOPSPIN 2.1>,
      <abs ABSG = 4 
       data hash MD5: 32K
       7A F8 F4 6F 29 1F 2D 34 40 EA DC 8B 59 03 DA 97>)
(   8,<2012-07-17 04:40:51.062 -0500>,<Administrator>,<TOPSPIN>,<proc1d>,<TOPSPIN 2.1>,
      <abs ABSG = 5 
       data hash MD5: 32K
       46 CC 87 36 35 84 28 17 33 16 94 00 C5 CF 82 4D>)
$$ ##END=
$$ 
$$ $$ hash MD5
$$ $$ F3 34 98 F5 5C 61 61 62 0C DC 05 16 88 6F A9 AC
##$RELAX= 
##$RELAX= 
##$RELAX= 
##$RELAX= 
##$RELAX= 
##$RELAX= 
##$RELAX= 
$$ Bruker specific parameters
$$ --------------------------
$$ [...]
150 150 150 150 150 150 150 150
##$TP07= 0
##$TPNAME0= <>
##$TPNAME1= <>
##$TPNAME2= <>
##$TPNAME3= <>
##$TPNAME4= <>
##$TPNAME5= <>
##$TPNAME6= <>
##$TPNAME7= <>
##$TPOAL= (0..7)
0.5 0.5 0.5 0.5 0.5 0.5 0.5 0.5
##$TPOFFS= (0..7)
0 0 0 0 0 0 0 0
##$TUNHIN= 0
##$TUNHOUT= 0
##$TUNXOUT= 0
##$USERA1= <user>
##$USERA2= <user>
##$USERA3= <user>
##$USERA4= <user>
##$USERA5= <user>
##$V9= 5
##$VALIST= <valist>
##$VCLIST= <CCCCCCCCCCCCCCC>
##$VD= 0
##$VDLIST= <DDDDDDDDDDDDDDD>
##$VPLIST= <PPPPPPPPPPPPPPP>
##$VTLIST= <TTTTTTTTTTTTTTT>
##$WBST= 2048
##$WBSW= 25
##$XGAIN= (0..3)
0 0 0 0
##$XL= 0
##$YL= 0
##$YMAX_a= 517436
##$YMIN_a= -661553
##$ZGOPTNS= <>
##$ZL1= 120
##$ZL2= 120
##$ZL3= 120
##$ZL4= 120
##$ABSF1= 14.98509
##$ABSF2= -5.573092
##$ABSG= 5
##$ABSL= 3
##$ALPHA= 0
##$AQORDER= 0
##$ASSFAC= 0
##$ASSFACI= 0
##$ASSFACX= 0
##$ASSWID= 0
##$AUNMP= <proc_prof1d_extract_pilot.lims>
##$AXLEFT= 0
##$AXNAME= <>
##$AXNUC= <1H>
##$AXRIGHT= 0
##$AXTYPE= 0
##$AXUNIT= <>
##$AZFE= 0.1
##$AZFW= 0.1
##$BCFW= 0
##$BC_mod= 0
##$BYTORDP= 0
##$COROFFS= 0
##$CY= 15
##$DATMOD= 1
##$DC= 0
##$DFILT= <>
##$DTYPP= 0
##$F1P= 0
##$F2P= 0
##$FCOR= 0.5
##$FTSIZE= 32768
##$FT_mod= 6
##$GAMMA= 0
##$GB= 0
##$INTBC= 1
##$INTSCL= 1
##$ISEN= 128
##$LB= 0
##$LEV0= 0
##$LPBIN= 0
##$MAXI= 10000
##$MC2= 0
##$MEAN= 0
##$ME_mod= 0
##$MI= 0
##$NCOEF= 0
##$NC_proc= -8
##$NLEV= 6
##$NOISF1= 0
##$NOISF2= 0
##$NSP= 0
##$NTH_PI= 0
##$NZP= 0
##$OFFSET= 14.98509
##$PC= 1
##$PHC0= 182.3566
##$PHC1= 0
##$PH_mod= 1
##$PKNL= yes
##$PPARMOD= 0
##$PPDIAG= 0
##$PPIPTYP= 0
##$PPMPNUM= 2147483647
##$PPRESOL= 1
##$PSCAL= 4
##$PSIGN= 0
##$PYNMP= <proc.py>
##$REVERSE= no
##$SF= 400.02
##$SI= 32768
##$SIGF1= 0
##$SIGF2= 0
##$SINO= 400
##$SIOLD= 32768
##$SPECTYP= <>
##$SREGLST= <1H.CDCl3>
##$SSB= 0
##$STSI= 32768
##$STSR= 0
##$SW_p= 8223.68421052631
##$SYMM= 0
##$S_DEV= 0
##$TDeff= 65536
##$TDoff= 0
##$TI= <>
##$TILT= no
##$TM1= 0
##$TM2= 0
##$TOPLEV= 0
##$USERP1= <user>
##$USERP2= <user>
##$USERP3= <user>
##$USERP4= <user>
##$USERP5= <user>
##$WDW= 1
##$XDIM= 32768
##$YMAX_p= 468623652
##$YMIN_p= -736910
##$CURPLOT= <Network HP LaserJet P1505>
##$CURPRIN= <$Network HP LaserJet P1505>
##$DFORMAT= <normdp>
##$LAYOUT= <+/1D_H.xwp>
##$LFORMAT= <normlp>
##$PFORMAT= <normpl>
##$SURQMSG= 1
$$ End of Bruker specific parameters
$$ ---------------------------------
##NTUPLES= NMR SPECTRUM
##VAR_NAME=  FREQUENCY,     SPECTRUM/REAL,   SPECTRUM/IMAG
##SYMBOL=    X,             R,               I
##VAR_TYPE=  INDEPENDENT,   DEPENDENT,       DEPENDENT
##VAR_FORM=  AFFN,          ASDF,            ASDF
##VAR_DIM=   32768,         32768,           32768
##UNITS=     HZ,            ARBITRARY UNITS, ARBITRARY UNITS
##FACTOR=    0.250966925370066, 1,           1
##FIRST=     8223.43324360094, 209427,       -114695
##LAST=      0,             -82629,          -38949
##MIN=       0,             -736910,         0
##MAX=       8223.43324360094, 468623652,    0
$$ Real data points
##PAGE= N=1
##DATA TABLE= (X++(R..R)), XYDATA
$$ [...]
19547a82119I6107a66441G2247N9234A5298b1194B16825K9199b05105Q8057k03704
$$ -182119 96107 -166441 72247 131481 15298 -21194 216825 246024 -205105 -117048 -320752
19536c20752a51145B09955a54594G7830L8998l8464c47519a49852E5482K50908
$$ -320752 -151145 209955 -154594 77830 116828 78364 -347519 -149852 55482 306390
19526C06390a30526p929B75295c22469B13054i4047A10889j7281a32194F5675
$$ 306390 -130526 -138455 275295 -322469 213054 -94047 110889 93608 -132194 65675
19515c14527c1968A38863d3339k21715i1002p694A5077c2431B80289a69893D4954
$$ -314527 -31968 138863 -43339 -265054 -91002 -98696 15077 -32431 280289 -169893 44954
19503B50970b03104j69129a75140H9479b36890A0094R7514J34110b31633c8464
$$ 250970 -203104 -372233 -175140 89479 -236890 10094 107608 241718 -231633 -38464
19492c56335F4411c43951l3908C03183j39933a1368k12025E7291D622b23995e6044
$$ -356335 64411 -343951 -377859 303183 163250 -11368 -223393 57291 4622 -223995 -56044
19480A813b32544O5498j0470J7309O5519H3560p997J27908c4887k01157a0850
$$ 1813 -232544 -167046 -177516 -160207 -94688 83560 75563 203471 -34887 -236044 -10850
19468H2545f9442m8731C0827b24461i840A30973b79876H6936i7759j61468i2349
$$ 82545 -69442 -118173 30827 -224461 -9840 130973 -279876 86936 -97759 -259227 -92349
19456c5485B47700A02230a93887J4285O1770A06815b83674O6009R9631B52615
$$ -35485 247700 102230 -193887 -179602 -117832 106815 -283674 -217665 -118034 252615
19445a46011L3657b1974k34563N7883H5281j2698b39966a15247j95781b3985k05263
$$ -146011 -112354 -21974 -256537 -198654 85281 72583 -239966 -115247 -311028 -23985 -229248
19434b29248b7531B3919d03243g4713j74348E7822e8528m3278I2464e0667j59811
$$ -229248 -27531 23919 -403243 -74713 -249061 57822 -58528 -101806 92464 -50667 -210478
19423b10478C64154a16549C8741K00826c46447D7318J16900b04850d0521j65709
$$ -210478 364154 -116549 38741 239567 -346447 47318 164218 -204850 -40521 -206230
19413b06230D1464O6013a12247A31267b61369B7864J08189a36606A58293c40191
$$ -206230 41464 107477 -112247 131267 -261369 27864 136053 -136606 158293 -340191
19402I4573M070b09339j5919A04017b2808k7847j15881B42164g4664m1910A02536
$$ 94573 98643 -209339 -225258 104017 -22808 -50655 -166536 242164 -74664 -116574 102536
19390a14659M2497q2195j51399a01481A12740a17482j97804A5248a78626h1971
$$ -114659 -72162 -154357 -305756 -101481 112740 -117482 -315286 15248 -178626 -81971
19379B42842F41a50881m2791N1954j19831P1964j02267B0310h5721j0194B36277
$$ 242842 641 -150881 -193672 -141718 -261549 -189585 -291852 20310 -85721 -95915 236277
19367b66221k1094g7684m1425M5913m4402p0072j69608J73928j12950A42154L3646
$$ -266221 -287315 -77684 -119109 -73196 -117598 -187670 -357278 -183350 -296300 142154 175800
19356A75800a85136G7327f6466j51852G5956a381j66445j4957A71367A0408N653
$$ 175800 -185136 77327 -66466 -218318 75956 -1381 -167826 -182783 171367 10408 16061
19345A6061J23986L6861f6993j67621E8593K4053a71168A19131E0121a23679q4049
$$ 16061 140047 176908 -66993 -234614 58593 82646 -171168 119131 50121 -123679 -207728
19334b07728e1927n5400r5691h7095M094j7826d0134D6051a21114A23456c39765
$$ -207728 -51927 -107327 -203018 -87095 -83001 -100827 -40134 46051 -121114 123456 -339765
19322e416j02064c5j65028D1490c29457d8954B9457b55148A13691D8219b05348
$$ -5416 -107480 -35 -165063 41490 -329457 -48954 29457 -255148 113691 48219 -205348
19310d3199H7729a69455B59270q5423l414m3989c56803k9238A80173b95707F9743
$$ -43199 87729 -169455 259270 173847 170433 126444 -356803 -386041 180173 -295707 69743
19298g1911m1029k85496G0914A773R2436b7761B54560a21497M8412a859q8648
$$ -71911 -112940 -398436 70914 1773 94209 -27761 254560 -121497 -73085 -1859 -90507
19287i0507F7307i8852k6270G2029j8357K3976a79127g620D43e177A4242L2045
$$ -90507 67307 -98852 -125122 72029 53672 77648 -179127 -7620 443 -5177 14242 46287
19275D6287a16063A76623i0880I704L4506J39574b75840e1329k29082A2709a20853
$$ 46287 -116063 176623 -90880 9704 44210 183784 -275840 -51329 -280411 12709 -120853
19263c78293g9423B37902a43885M9506k98579i8739q1224I1096b87613A22604
$$ -378293 -79423 237902 -143885 -94379 -392958 -98739 -179963 91096 -287613 122604
19252B65580h3062H7256b33428K8488f0536B27998a04660G9427l3340P5348a10790
$$ 265580 -83062 87256 -233428 -204940 -60536 227998 -104660 79427 46087 121435 -110790
19240C97327a89170A4423d3481C377N8151c2458C68366b62241J03896K788A9736
$$ 397327 -189170 14423 -43481 3377 61528 -32458 368366 -262241 -158345 -155557 19736
19228h7180k32228i7339j06382D3486J18033G128f8794k43190A32556i2880A74280
$$ -87180 -319408 -97339 -203721 43486 161519 7128 -68794 -311984 132556 -92880 174280
19216a61450H5472M5340N7241a013l27108F9811M1322c16622B0375c5124F335
$$ -161450 85472 130812 188053 -1013 -328121 69811 111133 -316622 20375 -35124 6335
19204b25107N5035j34035b8270m3964A39971E2453L3338a54573A6666i3915A6201
$$ -225107 -170072 -304107 -28270 -72234 139971 52453 85791 -154573 16666 -93915 16201
19192A48197e094l23422a7643m20211J63586J01553B75471b17817B76877A12462
$$ 148197 -5094 -328516 -17643 -437854 -274268 -172715 275471 -217817 276877 112462
19181e6912o3366j26565B32541a94390h7012a8209H5170d82171i3104A72083e6254
$$ -56912 -120278 -246843 232541 -194390 -87012 -18209 85170 -482171 -93104 172083 -56254
19169c43883f8732J0309G0775b7675A24606E1895h0899h912k05021k907C2191
$$ -343883 -68732 -58423 70775 -27675 124606 51895 -80899 -8912 -213933 -216840 32191
19157b969k66914G3949a66069I2817a4049j57427H0143f8087B23774B7055b27280
$$ -2969 -269883 73949 -166069 92817 -14049 -171476 80143 -68087 223774 27055 -227280
19145e1913A01456e67616a58126F0167i7317B17270C6407i8708p369D2201b51426
$$ -51913 101456 -567616 -158126 60167 -97317 217270 36407 -98708 -106077 42201 -251426
19133f4535K4949j93636q6677R3927a04446d7069D3579b4577H3329A2282a11826
$$ -64535 -39586 -233222 -319899 -225972 -104446 -47069 43579 -24577 83329 12282 -111826
19121d2076a0446j03386L2285j34492j28376h5059l50129J73650N7584c8770j28232
$$ -42076 -10446 -113832 -81547 -216039 -344415 -85059 -435188 -261538 -203954 -38770 -167002
19110a67002d1405n1949J2898j69669I231b92924D446K16774C0363D644f3474
$$ -167002 -41405 -93354 -80456 -250125 9231 -292924 4446 221220 30363 4644 -63474
19098h5551L5285p3050C2990I245b94456p509J48396j98982B73221D9512A6440
$$ -85551 -50266 -123316 32990 9245 -294456 -301965 -153569 -352551 273221 49512 16440
19086a02684A66608A016J42585R8808m357b81893R6847Q6285j9053A57312h5699
$$ -102684 166608 1016 143601 242409 238052 -281893 -185046 -98761 -117814 157312 -85699
19074D8455B2406M1086K16018e7792j22500N9381A70429G7146C1777b61143G0644
$$ 48455 22406 63492 279510 -57792 -180292 -120911 170429 77146 31777 -261143 70644
19062H330J57096d6343G7498k4245b67355I8044b58277C54350a75318B80708a38445
$$ 8330 165426 -46343 77498 53253 -267355 98044 -258277 354350 -175318 280708 -138445
19050A06309a08480d5246k02529E5640O815f6573H4202l0947h6343B2328g299
$$ 106309 -108480 -45246 -247775 55640 62455 -66573 84202 53255 -86343 22328 -7299
19038B13060A8564k310a2437E170N5582c849m4536m861m9085G5708a44521j4977
$$ 213060 18564 16254 -12437 5170 60752 -3849 -48385 -53246 -102331 75708 -144521 -159498
19026a59498A6383D515h8951j6901b9156A61804L4896J17584E7112a68421A15433
$$ -159498 16383 4515 -88951 -105852 -29156 161804 196700 314284 57112 -168421 115433
19014B098c03319J18108C2785e0660J9450j29914k4455B54821M2458p7601c47004
$$ 2098 -303319 -185211 32785 -50660 -31210 -161124 -185579 254821 297279 219678 -347004
19002B76614A35135h6321B094a6100o980I5487b9999j29333a9985F2492O430a48111
$$ 276614 135135 -86321 2094 -16100 -23080 95487 -29999 -159332 -19985 62492 68922 -148111
18989B4752f3227A90328g732k59797A23059b87045A39465D3892a13522m9166a9473
$$ 24752 -63227 190328 -7732 -267529 123059 -287045 139465 43892 -113522 -162688 -19473
18977A25482a65741a4208m52198J85448A54817A1879J82605E290a32625D63794
$$ 125482 -165741 -14208 -466406 -280958 154817 11879 194484 5290 -132625 463794
18966a82619n9388i6958G6522b53508j12658e8800M695l50966B42565E8284b96313
$$ -182619 -242007 -96958 76522 -253508 -366166 -58800 -54105 -405071 242565 58284 -296313
18954H793J34849C4939j4069a91502k19848A83490b3538k87726b4485I7374A1220
$$ 8793 143642 34939 20870 -191502 -411350 183490 -23538 -311264 -24485 97374 11220
18942a19361J1925d1364H096d8277j07914f6156j55690K168l9628d9887B45707
$$ -119361 -107436 -41364 8096 -48277 -156191 -66156 -221846 -219678 -259306 -49887 245707
18930c5384C57492A4885J33110F7636J59947a69889H078P3516a87706o8824F7134
$$ -35384 357492 14885 147995 67636 227583 -169889 8078 81594 -187706 -256530 67134
18918B299a51161d1308k21968E7803A3033i0346A28028J31510H4513a37802B85088
$$ 2299 -151161 -41308 -263276 57803 13033 -90346 128028 259538 84513 -137802 285088
18906b06536A7854b7142C12600I2791c06419a32607M2564G0991a20793k73984
$$ -206536 17854 -27142 312600 92791 -306419 -132607 -90043 70991 -120793 -394777
18896c94777A58061e29520a33488d9924G0195c9413k05512g4720K8309p1519E6949
$$ -394777 158061 -529520 -133488 -49924 70195 -39413 -244925 -74720 -46411 -117930 56949
18884D0655o418R4508a65835I9887K7465K2181K79642A5936P5637b23173B7102
$$ 40655 34237 128745 -165835 99887 127352 149533 429175 15936 91573 -223173 27102
18872b34426O795c1264j31870g7074A8716J59871a22883b460r4185k18570H4841
$$ -234426 -227631 -31264 -163134 -77074 18716 178587 -122883 -2460 -96645 -315215 84841
18860E3778a88065K2095F6866J11712c71283J42285d6235K0205j6591o7479j04366
$$ 53778 -188065 -165970 66866 178578 -371283 -228998 -46235 -26030 -42621 -110100 -214466
18849b14466i4147j9682l4822b8508A24657Q8256a33304b208j20991H6114b3635
$$ -214466 -94147 -113829 -148651 -28508 124657 212913 -133304 -2208 -123199 86114 -23635
18837e2539A23088i0571A942J87643c23369a4700q5739C1971a52668c0972j88869
$$ -52539 123088 -90571 1942 189585 -323369 -14700 -100439 31971 -152668 -30972 -219841
18826b19841C8150R0506a14986a4022n0336A09567g4332A05256c89037a5237I9683
$$ -219841 38150 128656 -114986 -14022 -64358 109567 -74332 105256 -389037 -15237 99683
18814b2258l5414n7605M9787l2378j9695j9048E2654K71329a06989P894A88896
$$ -22258 -57672 -115277 -65490 -97868 -117563 -136611 52654 323983 -106989 -99095 188896
18802B56360F262Q476a7380k22010f558H2802J6967a87541B35612A5191K63160
$$ 256360 6262 14738 -17380 -239390 -6558 82802 99769 -187541 235612 15191 278351
18791B78351b5072j7028I5864o708a78623I7967g3662A00J99579a28546q3972
$$ 278351 -25072 -42100 95864 89156 -178623 97967 -73662 100 199679 -128546 -212518
18780b12518A2149L18939b94937a08169C09852j36167c24541J37040A2760a16651
$$ -212518 12149 331088 -294937 -108169 309852 173685 -324541 -187501 12760 -116651
18769a05688Q97o6242C56228a59490M0588o195H007a23531O0240p1873o9371k755
$$ -105688 -104791 -171033 356228 -159490 -118902 -125097 8007 -123531 -63291 -135164 -204535 -207290
18757b07290d3396C6852a14410L5086m5887j7466I9496d1226o7129A18721a53882
$$ -207290 -43396 36852 -114410 -79324 -125211 -142677 99496 -41226 -108355 118721 -153882
18745B9054a01460k7809N1526k00769B49622a95351f8803j68774N6221M4809o6194
$$ 29054 -101460 -129269 -77743 -278512 249622 -195351 -68803 -237577 -181356 -136547 -202741
18734b02741M477B8331g5253j16680a4185k24844b6376p3185m6383a0182k12376
$$ -202741 -198264 28331 -75253 -191933 -14185 -239029 -26376 -99561 -145944 -10182 -222558
18723b22558B48334B7893K94263a70064C0847N9713J6744L3817f3096m276r8155
$$ -222558 248334 27893 322156 -170064 30847 90560 107304 141121 -63096 -67372 -165527
18712a65527A4512i7490k5819C9240g0057K4502F9828j8910i1857G2598j7098
$$ -165527 14512 -97490 -123309 39240 -70057 -45555 69828 50918 -91857 72598 55500
18701E5500k0434a8796j04832m97853h3442A23910b41249n2273B28483a28995
$$ 55500 35066 -18796 -123628 -621481 -83442 123910 -241249 -293522 228483 -128995
18690F9323K09543o9283p2869J3481d9051j59355A69598n1313b12204E9648b50720
$$ 69323 278866 209583 136714 150195 -49051 -208406 169598 118285 -212204 59648 -250720
18678a47643o9879a0807k76574A5425a78674a2051B86054c8588j42141C63614
$$ -147643 -217522 -10807 -287381 15425 -178674 -12051 286054 -38588 -180729 363614
18667B21017f8826l11895i1874k40375i2857B22458h501j89385J5396B1988c05421
$$ 221017 -68826 -380721 -91874 -332249 -92857 222458 -8501 -197886 -182490 21988 -305421
18655a50855G0669M8594a41524B17557H9847j1702j176e379r3044j04541b7262
$$ -150855 70669 119263 -141524 217557 89847 78145 76969 -5379 -98423 -202964 -27262
18643i3697b9783A45642D5656J4485J2416A6847e2658p4071C1632c4580j50629
$$ -93697 -29783 145642 45656 60141 72557 16847 -52658 -126729 31632 -34580 -185209
18632a85209E2274A715b87908P6116E5J28979k0755b91654G1347c6734m885b547
$$ -185209 52274 1715 -287908 -211792 55 129034 108279 -291654 71347 -36734 -41619 -2547
18619a45399j0039B6831b52175Q6553F5890J70372p5565a21169I8630b80940d7982
$$ -145399 -155438 26831 -252175 -165622 65890 236262 160697 -121169 98630 -280940 -47982
18607d54248G8748a27623l49891D3447Q3003b91919Q8430o6350F2066J13486b14385
$$ -454248 78748 -127623 -477514 43447 126450 -291919 -203489 -269839 62066 175552 -214385
18595B09076a10320o3118k25482B04176a46410i497j21664a2500j51039A32489
$$ 209076 -110320 -173438 -398920 204176 -146410 -9497 -131161 -12500 -163539 132489
18584D15710b49896J05985p4728A14560g3251k38743e69A35875a07180c4906k71131
$$ 415710 -249896 -143911 -218639 114560 -73251 -311994 -569 135875 -107180 -34906 -306037
18573c06037k2086A98894a13285m1768A20350l0733k1014J01089b75317a37586
$$ -306037 -328123 198894 -113285 -155053 120350 89617 68603 169692 -275317 -137586
18562g6444m18D1190h0312H343d90347A25932c98414D4508b83332B20678b62192
$$ -76444 -76862 41190 -80312 8343 -490347 125932 -398414 44508 -283332 220678 -262192
18550F2953f5846k02408G818b5047B30038C6108a5695A55139l009a48461B53662
$$ 62953 -65846 -268254 7818 -25047 230038 36108 -15695 155139 152130 -148461 253662
18538i1844D19381a11610A43296J83209a02097A76639E9150a25147B75870c70863
$$ -91844 419381 -111610 143296 326505 -102097 176639 59150 -125147 275870 -370863
18527a170l66748d0441B18922F8866b16632A14958A8974M7790H50J4630J33224
$$ -1170 -367918 -40441 218922 68866 -216632 114958 18974 66764 850 15480 148704
18516A48704h7735B02948a49839n043A25682i3012b3380A37855d19460a12945
$$ 148704 -87735 202948 -149839 -154882 125682 -93012 -23380 137855 -419460 -112945
18505c27293A27892n6699k5901c12870h4775m2066k6615A64325l8070e9709B05272
$$ -327293 127892 71193 45292 -312870 -84775 -126841 -153456 164325 126255 -59709 205272
18493b24131A34936m0067m93m4321b20419B535a74769A4978J01298b28070b9501
$$ -224131 134936 94869 94376 50055 -220419 2535 -174769 14978 116276 -228070 -29501
18481D4153A8043b96853a46080e6735C31055a87989j11467C0345d2333j79886
$$ 44153 18043 -296853 -146080 -56735 331055 -187989 -299456 30345 -42333 -222219
18471b22219e7412o5279f0327K0298A40922J62124a16175L4030j06914f4335D8793
$$ -222219 -57412 -122691 -60327 -40029 140922 303046 -116175 -82145 -189059 -64335 48793
18459i4519r8906K3641k11859e3836B3207c19682C480O8483N141K74099F619a02825
$$ -94519 -193425 -169784 -381643 -53836 23207 -319682 3480 71963 77104 351203 6619 -102825
18446A9971a24982A13556a8781j4062j85549r8166a46395A47270J46323c65740
$$ 19971 -124982 113556 -18781 -32843 -218392 -316558 -146395 147270 293593 -365740
18435e1181j9331I8021O7130E2586a23576A08100b27553b363q7571l9485O0479
$$ -51181 -70512 98021 165151 52586 -123576 108100 -227553 -2363 -89934 -129419 -68940
18424f8940o5965F286L70226A03750a76529A87317l8614B2962A1465a2610CP6893
$$ -68940 -134905 6286 376512 103750 -176529 187317 148703 22962 11465 -12610 3 76896
18412G6896a21800k2917B36174E4105a20145j89440E179c2852I797K16028d70306
$$ 76896 -121800 -144717 236174 54105 -120145 -309585 5179 -32852 9797 225825 -470306
18400a36843c9179j75501j03897J20602j97325A90316b22429F6182b19092L6817
$$ -136843 -39179 -214680 -318577 -197975 -395300 190316 -222429 66182 -219092 -182275
18390a82275A14418n6667K13539G3203a63857g610j83456m9299k770o3811a44591
$$ -182275 114418 57751 271290 73203 -163857 -7610 -191066 -240365 -243135 -306946 -144591
18378A08453J24386b55434A77160b6813p9304k2507B9263K10208e3863H0613B6033
$$ 108453 232839 -255434 177160 -26813 -106117 -128624 29263 239471 -53863 80613 26033
18366d11746b1978j95174R3408J5865C3827f8929A24291a54628f9291j81941N9353
$$ -411746 -21978 -217152 -123744 -107879 33827 -68929 124291 -154628 -69291 -251232 -191879
18355a91879D4973m632K25896f6880j23210c9026B23844p2750N6046n7819i2234
$$ -191879 44973 40341 266237 -66880 -190090 -39026 223844 151094 207140 149321 -92234
18343A11815J04761d00888A46461j3430n1973b05726C8691J76403G6715c60910
$$ 111815 216576 -400888 146461 133031 81058 -205726 38691 215094 76715 -360910
18332a34862B1187b52201A4325K4371K80498f8772H7079g7431q7783h669j06461
$$ -134862 21187 -252201 14325 38696 319194 -68772 87079 -77431 -165214 -8669 -115130
18321a15130d770C5313k608c12899J43005c9680j46985A63055m9186g1055j47655
$$ -115130 -4770 35313 32705 -312899 -169894 -39680 -186665 163055 113869 -71055 -218710
18310b18710j28152a12971J2270D7181a71179B01194K7573d0978p2679A113d482
$$ -218710 -346862 -112971 -100701 47181 -171179 201194 228767 -40978 -113657 1113 -4482
18298E6200a92972a3460q4295A27050a5811I7572A2233h6125A26888f1856d276
$$ 56200 -192972 -13460 -97755 127050 -15811 97572 12233 -86125 126888 -61856 -4276
18286A52965b554j48446M4737b4471p307I2428a22365M5422C6526b7659p7450
$$ 152965 -2554 -151000 -106263 -24471 -31778 92428 -122365 -76943 36526 -27659 -105109
18275a05109A66724a42020C23709e9045A54601b80552A97676J50428C3182K91342
$$ -105109 166724 -142020 323709 -59045 154601 -280552 197676 348104 33182 324524
18265C24524a84426B78199K15241c4364J1403B71650m0503F0853Q9615A7686J38810
$$ 324524 -184426 278199 493440 -34364 -22961 271650 231147 60853 150468 17686 156496
18254A56496b11820P7986j62665B19142b26366A643a95894e530o1097B14481P860
$$ 156496 -211820 -133834 -296499 219142 -226366 1643 -195894 -5530 -66627 214481 222341
18243B22341a25645p6855P8981A32654K1810J11769a31777A25084a55027A56759
$$ 222341 -125645 -202500 -123519 132654 154464 266233 -131777 125084 -155027 156759
18232b86553e345l30247A64161a17529g519j06188K5931A93279o9495J02534a13094
$$ -286553 -5345 -335592 164161 -117529 -7519 -113707 -87776 193279 123784 226318 -113094
18220a6496k57739Q9488n2138C8976c04119A2997a57855A35780a11942A06757
$$ -16496 -274235 -184747 -236885 38976 -304119 12997 -157855 135780 -111942 106757
18209g7861K2970l43251c6080p2737L2955n7023j35531I8247J1515g3234B1492
$$ -77861 -54891 -398142 -36080 -108817 -75862 -132885 -268416 98247 109762 -73234 21492
18197d1195n4187j44553i5478F3753b7157B10487G4606d2755B45670h7756o8743
$$ -41195 -95382 -239935 -95478 63753 -27157 210487 74606 -42755 245670 -87756 -156499
18186a56499c932A70946a50103A76325b01518C8088h3923c1196o4905j7775C12433
$$ -156499 -3932 170946 -150103 176325 -201518 38088 -83923 -31196 -96101 -113876 312433
18174e2864k64053a6262A30815m0548a29994a3585E4850P4727f6727B18625G1594
$$ -52864 -316917 -16262 130815 90267 -129994 -13585 54850 129577 -66727 218625 71594
18162C8649a33177A56454J67335g9012D27472k05558b23164A34978c7547m2766
$$ 38649 -133177 156454 323789 -79012 427472 221914 -223164 134978 -37547 -80313
18152h0313j1454m4909p9671b63k38450B34091c67260a4193k11775N9093A071
$$ -80313 -91767 -136676 -216347 -263 -238713 234091 -367260 -14193 -225968 -166875 1071
18140c36673a55944e2544A8826a08569J4990p9022n796F4443A5271J79565a39283
$$ -336673 -155944 -52544 18826 -108569 -93579 -172601 -178397 64443 15271 194836 -139283
18128A2452J70075J11418A31348A1023g2499j61212a4478F32J02314a43111K867
$$ 12452 182527 293945 131348 11023 -72499 -233711 -14478 632 102946 -143111 -140244
18117a40244A40536a38811l33234h5664c8375j41050d6A07008M1653J0911R3138
$$ -140244 140536 -138811 -472045 -85664 -38375 -179425 -46 107008 148661 159572 252710
18106B52710q3240e1188A73035a42969e4453k11652c1745A08702K3788a50764
$$ 252710 169470 -51188 173035 -142969 -54453 -266105 -31745 108702 132490 -150764
18095B53183j16356J37960e8300j10328C7840J3798d09517A58722C4684b5868
$$ 253183 136827 274787 -58300 -168628 37840 51638 -409517 158722 34684 -25868
18084b30609A27646o1902A8388J49054j3626A5300O1246L8445C6684c565m07811
$$ -230609 127646 65744 18388 167442 153816 15300 76546 114991 36684 -3565 -411376
18073d11376i841k02110R7146o1844Q4239F2989K2660k9331A908L68462d2799
$$ -411376 -9841 -211951 -114805 -176649 -92410 62989 85649 56318 1908 370370 -42799
18061i5297C0544c05907J41670F482f9111l6385I2646J86202d6087m52476B58617
$$ -95297 30544 -305907 -164237 6482 -69111 -105496 92646 278848 -46087 -498563 258617
18049d7899j94395C9591K86271i1718B06644b14687F7838a20893B64945A10932
$$ -47899 -242294 39591 325862 -91718 206644 -214687 67838 -120893 264945 110932
18038a48771f8954A32823d85254a51557A0301b81193A25591K3706c03952i2135
$$ -148771 -68954 132823 -485254 -151557 10301 -281193 125591 149297 -303952 -92135
18027H2807l181c1481A2615M7124a13748c5938f628A87830l3998i7678A665L8080
$$ 82807 79626 -31481 12615 59739 -113748 -35938 -6628 187830 153832 -97678 1665 39745
18015C9745b1425k94194A25200a06318D8123L7239m32J10346b8067A83286F5573
$$ 39745 -21425 -315619 125200 -106318 48123 85362 84930 195276 -28067 183286 65573
18003C0218a43394I6596E460J76643a43522A75171k0874a1025A39366J2543A5346
$$ 30218 -143394 96596 5460 182103 -143522 175171 154297 -11025 139366 151909 15346
17991A537J7245e1577j5796H0143a72977n5647H501K13981i3722A0466a74385
$$ 1537 18782 -51577 -67373 80143 -172977 -228624 8501 222482 -93722 10466 -174385
17979b06768A0748c54740a51919k4857F9884a49130D0323h2094F2330e8857D6581
$$ -206768 10748 -354740 -151919 -176776 69884 -149130 40323 -82094 62330 -58857 46581
17967h4971q331c3947A25078m7501e7411G299b260j47784B17496H3501l3390c433
$$ -84971 -93302 -33947 125078 77577 -57411 7299 -2260 -150044 217496 83501 50111 -3433
17954B90749P5195a70426M4243l4584M9863l96718b114A91801p7819A5879h5070
$$ 290749 365944 -170426 -126183 -160767 -110904 -507622 -2114 191801 113982 15879 -85070
17942g121B9615e48486E23097g7796c6p9472A36021c13137J45840A52107a98866
$$ -7121 29615 -548486 523097 -77796 -36 -79508 136021 -313137 -167297 152107 -198866
17930a99459G1060c49615J59675d1253A808J58442b13341C5319c7549p5814M0466
$$ -199459 71060 -349615 -189940 -41253 1808 160250 -213341 35319 -37549 -113363 -72897
17919g2897B24068K801a26337C9151c72688a84164E7742b25954L1709A31856C9871
$$ -72897 224068 226869 -126337 39151 -372688 -184164 57742 -225954 -194245 131856 39871
17907B0452b67322r8972h2090M0772A29014B3436K05804n6289i5858M0153C03133
$$ 20452 -267322 -366294 -82090 -41318 129014 23436 229240 172951 -95858 -55705 303133
17895B84534p9380k9291M8228d5429E2439J04065K49623A35546P7731a79721o6867
$$ 284534 205154 175863 224091 -45429 52439 156504 406127 135546 213277 -179721 -246588
17884b46588l3556R2258E893J58590a27720C40028A24340L4339C7341Q5928a79530
$$ -246588 -280144 -187886 5893 164483 -127720 340028 124340 158679 37341 123269 -179530
17872E6052O5342c3547k47695h5832j4498I8404b80680d1563E9662d60474g4802
$$ 56052 121394 -33547 -281242 -85832 -100330 98404 -280680 -41563 59662 -460474 -74802
17860G4512k1611a41751A23388l1132N4522I955b8950B44134c6899n0723A56886
$$ 74512 52901 -141751 123388 92256 146778 9955 -28950 244134 -36899 -87622 156886
17848I2090O3172A5607b3070j56210B82909l8086i1828F1942b0869D31721h762
$$ 92090 155262 15607 -23070 -179280 282909 244823 -91828 61942 -20869 431721 -8762
17836a09987k2085a5013A75356a81293A10822i9012c969B2071c3499B50627a18469
$$ -109987 -132072 -15013 175356 -181293 110822 -99012 -3969 22071 -33499 250627 -118469
17824a13271j29476E0122J3357a12590N6167A48561F1752B6496J20856E7695a3584
$$ -113271 -242747 50122 63479 -112590 -56423 148561 61752 26496 147352 57695 -13584
17812c5327o3367q8289D9304L1212g5189J7382A14379A881L35378a76462C7762
$$ -35327 -98694 -186983 49304 80516 -75189 -57807 114379 1881 337259 -176462 37762
17800a79570P9826D7271c35501B93450a624j06198A81526A4778a4492l97998a18667
$$ -179570 -99744 47271 -335501 293450 -1624 -107822 181526 14778 -14492 -412490 -118667
17788I7301K19760b23072E3295a73885A57955J02559f759A04971M2988L38163
$$ 97301 317061 -223072 53295 -173885 157955 260514 -6759 104971 147959 486122
17778D86122b86139J37611m2126P9500k52005J25226R4433H9701c68221C48490
$$ 486122 -286139 -148528 -190654 -111154 -363159 -237933 -143500 89701 -368221 348490
17767A87818c1677a3665k4936B90691A38958a29179B71296a54049P5422E1852
$$ 187818 -31677 -13665 -38601 290691 138958 -129179 271296 -154049 -78627 51852
17756B6929a59860c8686p6593C27726F0789i3374b5272I6894K37815k7733M9322
$$ 26929 -159860 -38686 -115279 327726 60789 -93374 -25272 96894 334709 306976 356298
17745C56298c10966A07982d9210j28047o7336F2799K64072f744j01628a1584A07310
$$ 356298 -310966 107982 -49210 -177257 -244593 62799 326871 -6744 -108372 -11584 107310
17733d2264p190B77326A06910b55025A04807a57400A76002A7162K62761J10941
$$ -42264 -49454 277326 106910 -255025 104807 -157400 176002 17162 279923 390864
17723C90864A6015K7751J01790b80603C80820F4958c70523e9676A5290J6015a47549
$$ 390864 16015 43766 145556 -280603 380820 64958 -370523 -59676 15290 31305 -147549
17711a31263A83090q9739a15029L1439j38685D1058L0567c5910A10327f8445c2135
$$ -131263 183090 93351 -115029 -83590 -222275 41058 71625 -35910 110327 -68445 -32135
17699A32594B862J1156J04788L72454B18801a52661C0194J71543r5958d6403k25736
$$ 132594 2862 14018 118806 491260 218801 -152661 30194 201737 105779 -46403 -272139
17688b72139E5058A2753b7516j07305A89725L2061j02611c3088B7562N2398d11197
$$ -272139 55058 12753 -27516 -134821 189725 221786 119175 -33088 27562 79960 -411197
17676B431J63012J32749g0973I2882N6286h664l0229j9924A82387a24952A08454
$$ 2431 165443 298192 -70973 92882 149168 -8664 -38893 -58817 182387 -124952 108454
17664g2000A22945a84969g1697j29850A73853b06278c4499B3935g9624j15058
$$ -72000 122945 -184969 -71697 -201547 173853 -206278 -34499 23935 -79624 -194682
17654a94682B51060A24092b45299A32280N5195O2850A04136O2599a25056k58011
$$ -194682 251060 124092 -245299 132280 187475 250325 104136 166735 -125056 -383067
17644c83067B31847a82258A26775k4565e2116B29655f098j97963G7761e0333k489
$$ -383067 231847 -182258 126775 102210 -52116 229655 -6098 -204061 77761 -50333 -52822
17633e2822G0199d6907B00333p2290J24791B5371J36671a31631k00846A35941
$$ -52822 70199 -46907 200333 128043 252834 25371 162042 -131631 -332477 135941
17622D2946J26271k1434a49067A57921b1666F1625D748M44199F8423c14098G0779
$$ 42946 169217 147783 -149067 157921 -21666 61625 4748 448947 68423 -314098 70779
17610C66761A33112D3566J3979R5875J8334M2226e9351o984b7124D2005a12021
$$ 366761 133112 43566 57545 153420 171754 213980 -59351 -66335 -27124 42005 -112021
17598B8629d6082B63641j0313n8116a74681k24273D7963b92322i0789j83981F957
$$ 28629 -46082 263641 253328 195212 -174681 -398954 47963 -292322 -90789 -274770 6957
17586C7178R3059A6133i4546A6763b46776f5619J6193B48204j04631o5124G437
$$ 37178 130237 16133 -94546 16763 -246776 -65619 -49426 248204 143573 78449 7437
17574b35217B59282A06079B1801h4624A34641G492M5833c83913a40931A15605
$$ -235217 259282 106079 21801 -84624 134641 7492 53325 -383913 -140931 115605
17563C16663D3703a47941A87133G257R746a29982n256C50433a55625F4899B9055
$$ 316663 43703 -147941 187133 7257 17003 -129982 -135238 350433 -155625 64899 29055
17551H6475a8763j61715B50694R813I3613Q992b78058i1711B95178E9170J04329
$$ 86475 -18763 -180478 250694 260507 93613 102605 -278058 -91711 295178 59170 163499
17540A63499g7420b3431A84037a48829G5768R8854q5334K23034a39777A40198
$$ 163499 -77420 -23431 184037 -148829 75768 174622 89288 312322 -139777 140198
17529a18799A55952J1360A2252K56471p9208G6476c37359I1207M5935a24265B07397
$$ -118799 155952 167312 12252 268723 189515 76476 -337359 91207 137142 -124265 207397
17517A61560o8767j4273J07242b85337A33700c76920A55555C4815J30653M6484
$$ 161560 92793 78520 185762 -285337 133700 -376920 155555 34815 165468 211952
17507B11952I8513J93313j38757N0765b18026A96484Q7420b75679G2011a84922
$$ 211952 98513 291826 153069 203834 -218026 196484 283904 -275679 72011 -184922
17496g655C01396e5873k58310B9252a8280A92557p7910l5852J49401c4409h407
$$ -7655 301396 -55873 -314183 29252 -18280 192557 114647 78795 228196 -34409 -8407
17484A21858J11497J0575D4960M9964J60770i0624k0332N1785q9569C42718H9122
$$ 121858 233355 243930 44960 94924 255694 -90624 -110956 -59171 -148740 342718 89122
17472G6983K76779A55594K04922j80095J65938j02221l3910A01576j951L40123
$$ 76983 353762 155594 360516 180421 346359 244138 210228 101576 99625 439748
17462D39748l3223A65868J33397J37580A73088P114M2966j01829K59931K03078
$$ 439748 406525 165868 299265 436845 173088 180202 223168 121339 381270 584348
17452E84348B58177i8421K5994F0958N5978Q3778J81470H8714b70001A21217K5752
$$ 584348 258177 -98421 -72427 60958 116936 200714 382184 88714 -270001 121217 146969
17441A46969D9569K58896o7765o882k1106L6672J0870O361Q0748j29509l7134
$$ 146969 49569 308465 240700 233818 212712 249384 260254 266615 347363 217854 180720
17430A80720j9654Q1353h2248C97423A39550K09766Q2651D3365j4233K11115D3054
$$ 180720 161066 242419 -82248 397423 139550 349316 431967 43365 29132 240247 43054
17418G1026K95112L35356A40170J93648A19146B6309J75666E4277k3271d7679
$$ 71026 366138 701494 140170 333818 119146 26309 201975 54277 31006 -47679
17407A33074R0579R6716j48258J04132g346k05838G7114N4389N0191J84438A42471
$$ 133074 223653 320369 172111 276243 -7346 -213184 77114 131503 181694 366132 142471
17395h0352B93207J07940j84600b4291F6967f3248A59778J68655g6071A08350
$$ -80352 293207 401147 216547 -24291 66967 -63248 159778 328433 -76071 108350
17384B12853C4946e4248A34332J60301r0433J13035J74593A09461k2751b9572
$$ 212853 34946 -54248 134332 294633 204200 317235 491828 109461 86710 -29572
17373B10730q9084j9394J70267n1883q6349J06924a57104D28449j24741r7959
$$ 210730 121646 102252 272519 220636 134287 241211 -157104 428449 303708 205749
17363B05749K588A01814K71360i1767c5484D0118P8984N4914P1654a56279E1582
$$ 205749 208337 101814 373174 -91767 -35484 40118 119102 174016 245670 -156279 51582
17351A35224c5440A84531M557k278m608J76855q8016n7415J74447I0995a4032
$$ 135224 -35440 184531 189088 186810 182202 359057 271041 213626 388073 90995 -14032
17339c52582H0535L08905A34678N01315A97255r199n3936l0417a08912B47944
$$ -352582 80535 389440 134678 635993 197255 188056 134120 103703 -108912 247944
17328B66786A17834J08109d6880B49751P4045r4075l7F063J98582E0214L62928
$$ 266786 117834 225943 -46880 249751 323796 229721 229684 6063 204645 50214 413142
17317D13142B6854J95841a1705D72188a74324C43743I5557K98097C2601a64046
$$ 413142 26854 222695 -11705 472188 -174324 343743 95557 393654 32601 -164046
17306A17521L96786a8199D41546E4224L2188J40006D6454d3326A93538a91200
$$ 117521 514307 -18199 441546 54224 86412 226418 46454 -43326 193538 -191200
17295A11253L23779J57425B10313j03958P2188J35872A8720L140K78769H6626
$$ 111253 435032 592457 210313 106355 178543 314415 18720 21860 300629 86626
17284E33374j95052J0516j48467q9926K14433q4133I5525J48290b0332C27640
$$ 533374 338322 348838 200371 110445 324878 240745 95525 243815 -20332 327640
17273E24045A60098j1725c1301D04270a4138l9482C90157j47264c8441B58185
$$ 524045 160098 148373 -31301 404270 -14138 -53620 390157 242893 -38441 258185
17262B95487a55434A38797N2334H8040K80643J44986A948L82163I069d338C27635
$$ 295487 -155434 138797 191131 88040 368683 513669 1948 384111 9069 -4338 327635
17250B45714o2970F7222a31089j85593D11379L05178A76406c8427B2616J78955
$$ 245714 182744 67222 -131089 -316682 411379 716557 176406 -38427 22616 201571
17240B01571J78618A22324a02019G4861i1615C52c3444A98833a01240A84436J70607
$$ 201571 380189 122324 -102019 74861 -91615 352 -33444 198833 -101240 184436 355043
17229C55043A54884A7149J20717h8233A95115O3914N3653m3045L9525A8076J44770
$$ 355043 154884 17149 137866 -88233 195115 259029 312682 269637 309162 18076 162846
17218A62846o3191J03849a65830D17447k05033M7161k6686o9975n4481K10525
$$ 162846 99655 203504 -165830 417447 212414 259575 232889 162914 108433 318958
17208C18958D8904J18708P6794r1735m6535L8706a33971A67994P8101G6362d9556
$$ 318958 48904 167612 244406 152671 106136 144842 -133971 167994 246095 76362 -49556
17196C22852A43435P9390A02130J63586n4791J5098J21909j53046m312E895L98242
$$ 322852 143435 222825 102130 265716 210925 226023 347932 194886 190574 5895 404137
17185D04137A77372Q552J39386J51424B7515J08784L07887j05781j21643J8378
$$ 404137 177372 185924 325310 476734 27515 136299 444186 338405 216762 235140
17175B35140l7505K21068j94085k6448m5734J40641J3579P1748j72257J47342
$$ 235140 197635 418703 224618 198170 152436 293077 306656 378404 206147 353489
17165C53489A07875J7351L17416j81967L1419q1951K44363A50622J89226o5004
$$ 353489 107875 125226 442642 260675 292094 210143 454506 150622 339848 274844
17155B74844J52575j16035A1962J73424o2000L51127p1810J8345K22741k73543
$$ 274844 427419 311384 11962 185386 123386 474513 402703 421048 643789 370246
17145C70246J41627P6230A89619J9372K58906o2576j85409A08759a35608C67756
$$ 370246 511873 588103 189619 208991 467897 405321 219912 108759 -135608 367756
17134D03157j67475p9189J46515p6908L18910J73923k48374j89405L8733m9638
$$ 403157 235682 156493 303008 226100 545010 718933 470559 281154 319887 270249
17124B70249R7466r2886M42631B0591M70055o2896M5344C6878K23419j21552J91276
$$ 270249 367715 274829 717460 20591 490646 427750 473094 36878 260297 138745 330021
17113C30021K44223k67216P7550q6873N8031K0611L05255k13406J07609j57378
$$ 330021 574244 307028 384578 297705 355736 376347 681602 468196 575805 418427
17103D18427A18388E6252M16813k12148j27634K37002J43863r5169A20432L80546
$$ 418427 118388 56252 473065 260917 133283 370285 514148 418979 120432 500978
17093E00978M2267q4718B21853N90650l32593b070C70189K55063B03069L00595
$$ 500978 543245 458527 221853 812503 479910 -2070 370189 625252 203069 503664
17083E03664E785L35439J21430K492j02126n1155p10K90840q2112q5206J42373
$$ 503664 5785 341224 462654 465146 363020 311865 311155 601995 519883 434677 577050
17072E77050K80054A98265M90667q0840b8447C03403l1136L52554j24611l3281
$$ 577050 857104 198265 688932 608092 -28447 303403 272267 624821 500210 466929
17062D66929J72445C18606K68585K78759l95565l94k1521j03398J96439k3851
$$ 466929 639374 318606 587191 865950 470385 469991 448470 345072 541511 517660
17052E17660k13969J58468G6600L02812J43489q8936J50502j51816M3163n4722
$$ 517660 303691 462159 76600 379412 522901 433965 584467 432651 475814 421092
17042D21092J92809j33337N2120k9569J72222m2412M8654J13596C22778K22085
$$ 421092 613901 480564 532684 503115 675337 632925 681579 795175 322778 544863
17032E44863J17997J43122l54652K13291j54649o0750J46790j86349L5534O7732
$$ 544863 662860 805982 451330 664621 509972 449222 596012 409663 445197 512929
17022E12929P2802J80309l25119A61355M14458q4572J3017N138k7864j7938j12270
$$ 512929 585731 766040 440921 161355 575813 491241 504258 509396 481532 463594 351324
17011C51324M71701R603k59960j60475M78535j10250j84575J97736j37540K66427
$$ 351324 823025 832628 572668 412193 890728 780478 595903 793639 656099 922526
17001I22526j50268C07402M48998n2431M0646B92523O42441k81676L42259k01624
$$ 922526 772258 307402 756400 703969 744615 292523 934964 653288 995547 793923
16991G93923k50265l5305M41057r3496k9256O8349J95723k48898k21822J40821
$$ 793923 543658 508353 949410 855914 826658 895007 1090730 841832 620010 760831
16981G60831J28413j2249j04777p6491J89384l07548Q1067L72808l12501N5996
$$ 760831 889244 876995 772218 695727 885111 577563 658630 1031438 718937 774933
16971G74933J43399p8475Q8122k65454L00958J05827j77657q5233l1128L00708
$$ 774933 918332 839857 927979 662525 963483 1069310 891653 806420 775292 1076000
16961A076000l53426K96749q0485K07638k51326J5729P2604o154N6962l04497
$$ 1076000 722574 1019323 938838 1146476 895150 910879 983483 977329 1034291 729794
16951G29794L41817K49325q3092l99356N44046m00346o4282J53871P8404n7337
$$ 729794 1071611 1320936 1237844 838488 1382534 982188 917906 1071777 1150181 1092844
16941A092844k96258J08368K36029n8485J18319R6082O1253l33773K22958j00807
$$ 1092844 796586 904954 1140983 1082498 1200817 1296899 1358152 1024379 1247337 1146530
16931A146530K86620m8082k00732j20539r0644J38439k20865K44874J53607j71078
$$ 1146530 1433150 1385068 1184336 1063797 973153 1111592 890727 1135601 1289208 1118130
16921A118130K05258K6803l8002R4393J96374j84012k13802j63975L99233j27591
$$ 1118130 1323388 1350191 1312189 1406582 1602956 1418944 1205142 1041167 1440400 1312809
16911A312809O74202p60656J16874L33807j27566m6555K0507J95324k03493J98331
$$ 1312809 1987011 1226355 1343229 1677036 1549470 1502915 1523422 1718746 1515253 1713584
16901A713584j73001J80538o484J39810k46596p4618P6998K14869l19487O1045
$$ 1713584 1540583 1721121 1714637 1854447 1607851 1533233 1610231 1825100 1505613 1566658
16891A566658K62220K24734j68997j27574j14978L16131m31561L87141o7582q8615
$$ 1566658 1828878 2053612 1884615 1757041 1642063 1958194 1526633 1913774 1846192 1757577
16881A757577O2055M70070k19806o333O8036J10773l96858M42914m5818J13214
$$ 1757577 1819632 2289702 2069896 2063563 2131599 2242372 1845514 2288428 2242610 2355824
16871B355824r6310L08146k05775J63520P8591j80632p7216j52827K42019K9220
$$ 2355824 2259514 2567660 2361885 2525405 2603996 2423364 2346148 2193321 2435340 2464560
16861B464560J30136j87388Q7444M74944p2803l9092j26279J08674N0079k0594
$$ 2464560 2594696 2407308 2494752 2969696 2896893 2857801 2731522 2840196 2890275 2869681
16851B869681J28120o8950J39409k0499L84977k28662p8708j89409k2484M41015
$$ 2869681 2997801 2928851 3068260 3047761 3432738 3204076 3125368 2935959 2913475 3354490
16841C354490L33488j79708J56574k8172N5071M03614l80370J36362j53141K61680
$$ 3354490 3687978 3508270 3664844 3636672 3691743 4095357 3714987 3851349 3698208 3959888
16831C959888L66038j72911K09491J04529l69588O23067j36098K6484O6207L18876
$$ 3959888 4325926 4153015 4362506 4467035 4097447 4720514 4584416 4610900 4677107 4995983
16821D995983O975j67439N31689l24417K49834J31449j40954M50720K3005K24038
$$ 4995983 5002958 4835519 5367208 5042791 5292625 5424074 5283120 5733840 5756845 5980883
16811E980883O8341K60168m17338M35234M7781J10722L0101R4804M89931L29607
$$ 5980883 6049224 6309392 5892054 6327288 6375069 6485791 6515892 6610696 7100627 7430234
16801G430234j67453N64520k20613L23783L29049l6980L38294L93854j93399L02255
$$ 7430234 7262781 7827301 7606688 7930471 8259520 8222540 8560834 8954688 8761289 9063544
16791I063544K29955P13117k36246O31654j35386L59377N71821K09278P8034K99382
$$ 9063544 9293499 10006616 9770370 10402024 10266638 10626015 11197836 11407114 11485148 11784530
16781A1784530M13835M53522L64150J01443O10762N61071N48114K88227R45907
$$ 11784530 12198365 12651887 13016037 13117480 13728242 14289313 14837427 15125654 16071561
16772A6071561K89691O04487O23425q1415J223664L10143P83553J273250N94022
$$ 16071561 16361252 16965739 17589164 17507749 18731413 19041556 19825109 21098359 21692381
16763B1692381Q26536Q25786J083951J026218Q82988R18366J433566J196903J289192
$$ 21692381 22518917 23344703 24428654 25454872 26337860 27256226 28689792 29886695 31175887
16754C1175887J301872J350105J806685J834785J889955J906315J962440K000769
$$ 31175887 32477759 33827864 35634549 37469334 39359289 41265604 43228044 45228813
16746D5228813K637536K875981K641878K936092L080343L761686L548169M391697
$$ 45228813 47866349 50742330 53384208 56320300 59400643 63162329 66710498 71102195
16738G1102195M194867M848659M929337N367024O182227O477871O801099P372559
$$ 71102195 75297062 80145721 85075058 90442082 96624309 103102180 109903279 117275838
16730A17275838P539170Q133952Q298444Q994215Q992226R266023R125651Q487362
$$ 117275838 124815008 132948960 141247404 150241619 159233845 168499868 177625519 186112881
16722A86112881Q283811Q049990N846383N420183L116610J937040L41418j660610
$$ 186112881 194396692 202446682 208293065 213713248 216829858 218766898 219108316 217447706
16714B17447706l523505m559417o437850p350584q173154q663301q978083r316650
$$ 217447706 213924201 209364784 202926934 195576350 187403196 178739895 169761812 160445162
16706A60445162r195912r207873q867568q580438p996794p687803p094543o211669
$$ 160445162 151249250 142041377 133173809 124593371 116596577 108908774 101814231 95602562
16698I5602562o334130n695071n448011m650363m708044m354784l348578l757562
$$ 95602562 89268432 83573361 78125350 73474987 68766943 64412159 61063581 57306019
16690E7306019l140804k941507l117676k541543k522592k409796j651320k327935
$$ 57306019 54165215 51223708 48106032 45564489 43041897 40632101 38980781 36652846
16682C6652846j817943j602991j505216j182160j682096j423370j443967r89304
$$ 36652846 34834903 33231912 31726696 30544536 28862440 27439070 25995103 25005799
16674B5005799j013559q25949j035057j047699n11544r96990p77863p49523o47548
$$ 25005799 23992240 23166291 22131234 21083535 20571991 19575001 18797138 18047615 17400067
16665A7400067o97122o28552m94363p08125m97605m89163k83681m29219n22783
$$ 17400067 16702945 16074393 15580030 14871905 14374300 13885137 13601456 13172237 12649454
16656A2649454n1400m69025m80037o50854j60239l86172j44165m08934l09990
$$ 12649454 12598054 12129029 11648992 10998138 10837899 10451727 10307562 9898628 9588638
16647I588638j20493m09978l65598l29729o6075p8682m50369k3841k32982O3q5286
$$ 9588638 9468145 9058167 8692569 8362840 8296765 8218083 7767714 7743873 7510891 7510954 7425668
16636G425668n68966O3283m18446j1412l08385r3700l6493l15207K25462j35686
$$ 7425668 6856702 6919985 6501539 6490127 6181742 6088042 6051549 5736342 5961804 5826118
16626E826118m66843m02384J38394j62727M1903L55398j06516q41463M64190m51984
$$ 5826118 5359275 4956891 5095285 4932558 4974461 5329859 5223343 4381880 4846070 4394086
16616D394086j15247j758r9005l3712p7022l4281k71017M39824k81525j56866
$$ 4394086 4278839 4277081 4178076 4144364 4067342 4033061 3762044 4201868 3920343 3763477
16606C763477o1889m954k92213L74454n75497L18245l57422p2990K34635l90110
$$ 3763477 3701588 3696634 3404421 3778875 3203378 3521623 3164201 3091211 3325846 2935736
16596B935736L04469m13919k96125L78010J66792m53220j77753L39079l50398
$$ 2935736 3240205 2826286 2530161 2908171 3074963 2621743 2443990 2783069 2432671
16587B432671L68982m00146L16220m0732k65662k34658L25724j29747k68002N8426
$$ 2432671 2801653 2401507 2717727 2676995 2411333 2176675 2502399 2372652 2104650 2163076
16577B163076j65997L16161j76124K8192j70443j01258K85961j56395m19891J65247
$$ 2163076 1997079 2313240 2137116 2165308 1994865 1893607 2179568 2023173 1603282 1768529
16567A768529L0722J20871j87859o8465r857K54968k54075K68568Q4681m09961
$$ 1768529 1799251 1920122 1732263 1663798 1653941 1908909 1654834 1923402 2008083 1598122
16557A598122r0929K59740n4533J34195o5673m46870J56560J75259l25996K7595
$$ 1598122 1507193 1766933 1712400 1846595 1780922 1334052 1490612 1665871 1339875 1367470
16547A367470q303L15530l83681J64225j93796J55565l54291J53373l7703j7635
$$ 1367470 1359167 1674697 1291016 1455241 1261445 1417010 1062719 1216092 1178389 1160754
16537A160754L96469p9689J88937l58152q3275n1936L57583m86724L46481J2052
$$ 1160754 1557223 1477534 1666471 1308319 1225044 1173108 1530691 1043967 1390448 1402500
16527A402500j33774k93499j4399J08226J43458k46962L57561k71245l02845L30605
$$ 1402500 1268726 975227 960828 1069054 1212512 965550 1323111 1051866 749021 1079626
16517A079626j06569R6709j98794J16919K14184k43357j25330J60932p9944J24017
$$ 1079626 973057 1069766 870972 987891 1202075 958718 833388 994320 914376 1038393
16507A038393q2032K2444j69101J11255j15997M59581m61748R1890j4537k60274
$$ 1038393 956361 978805 809704 920959 804962 1264543 802795 894685 880148 619874
16497F19874l345N08011m07665K78748l10481O6363K04886m69630K15291L2072
$$ 619874 616529 1124540 716875 995623 685142 751505 956391 486761 702052 734124
16487G34124M1006k34115L70233m12005K56673k29872K22368K6923j18170Q7710
$$ 734124 775130 541015 911248 499243 755916 526044 748412 775335 657165 744875
16477G44875J15301j58640J90622l40713K5396k65226L55331j61210k4525j53621
$$ 744875 860176 701536 892158 551445 576841 311615 666946 505736 481211 327590
16467C27590J23166K52528J14603k18497L04975D08174M77148k79622Q0640k47243
$$ 327590 450756 703284 817887 599390 904365 408174 885322 605700 686340 439097
16457D39097J1259J9827m2972J03590l3462N1189J66058j39142k65477L89972
$$ 439097 450356 470183 427211 530801 497339 548528 714586 575444 309967 699939
16447F99939k67445R0369r7373L62744j80999K76557C97280K12196n1344k01522
$$ 699939 432494 522863 425490 788234 607235 883792 397280 609476 558132 356610
16437C56610p7122j12596R8375J32814O01083D85856j03168P784j17234A09703
$$ 356610 279488 166892 265267 398081 999164 485856 382688 390472 273238 109703
16426D62034R1304j57292l3735K86375A95564J34762Q1994k8220K19781A90512
$$ 462034 553338 396046 362311 648686 195564 330326 412320 384100 603881 190512
16415D09850j18560j21927L09036n3695K5447j65867J04938O169l1758L0819j49575
$$ 409850 291290 169363 478399 424704 450151 284284 389222 395391 363633 394452 244877
16404B44877M74J29407Q8283j51375k537A17779K78417n7609k6987Q6618j30556
$$ 244877 245351 374758 463041 311666 309129 117779 396196 338587 311600 398218 267662
16393B67662J33213A28944K08479K150m2244L00199B39126K51664j07051L161
$$ 267662 400875 128944 337423 339573 297329 597528 239126 490790 383739 386900
16383C86900j48752B817K68581n7473K49767j47084A15290M97913A05051J75714
$$ 386900 238148 2817 271398 213925 463692 316608 115290 613203 105051 280765
16373B80765R1487a07381C75027j47394k6486K70316G5972M8808J38903K70602
$$ 280765 372252 -107381 375027 227633 201147 471463 75972 124780 263683 534285
16363E34285k51254M50182C06075K17373A24144K73619o6183L39817B41739K5822
$$ 534285 283031 733213 306075 523448 124144 397763 331580 671397 241739 267561
16353B67561K4436A13239B0004O7369J42007K16782j50800p6647C5349L84052
$$ 267561 291997 113239 20004 87373 229380 446162 295362 218715 35349 419401
16343D19401q8985o8245j7891j21024K67409l5419K6650j51750f8620D04076q1766
$$ 419401 330416 262171 244280 123256 390665 355246 381896 230146 -68620 404076 322310
16332C22310k9227H5132M96101f0619A95260J16416E3795J80045J76257F7108
$$ 322310 293083 85132 581233 -60619 195260 311676 53795 233840 410097 67108
16321A71319b31273F9521J2621l1580J52314B1155K9913L48632A80004M18558
$$ 171319 -231273 69521 82142 50562 202876 21155 51068 399700 180004 598562
16311E98562f849C23411q8734A03344N0488L31477j15730b21169A9282c726F6251
$$ 598562 -6849 323411 234677 103344 153832 485309 369579 -221169 19282 -3726 66251
16299E75121h2832C79657A08870Q4302r6002Q4372J43595A55019N9656J18370
$$ 575121 -82832 379657 108870 193172 97170 181542 325137 155019 214675 333045
16289C33045Q8113j66042I3235J72438q693B254h4152B15303n7290G7174K28215
$$ 333045 421158 255116 93235 265673 256980 2254 -84152 215303 158013 77174 305389
16278C05389J48567a97072C93338j42471j01391J11202a01156E2852J76472n6481
$$ 305389 453956 -197072 393338 250867 149476 260678 -101156 52852 229324 172843
16268A72843C4900M2445J70833j00611L52151H8612B6714M0990K7800J20367I9721
$$ 172843 34900 77345 248178 147567 499718 88612 26714 67704 95504 215871 99721
16256B75911P9269J02933j66357J1724b2623C42284j06920j09388J86741A16503
$$ 275911 355180 458113 291756 303480 -22623 342284 235364 125976 312717 116503
16245A16493b36190a09420h860B6575J29281c13870a7883B06370d72053A5475
$$ 116493 -236190 -109420 -8860 26575 155856 -313870 -17883 206370 -472053 15475
16234a59054A58925L16170C4605Q5650K02336f005I2642l7567h7631B82801k9867
$$ -159054 158925 475095 34605 120255 322591 -6005 92642 55075 -87631 282801 252934
16223B52934i9339A8905J34166R119a33567A64106L896m2901C2450P201M56437
$$ 252934 -99339 18905 153071 162190 -133567 164106 168002 125101 32450 39651 496088
16212D96088a30461F5677K24497r2248a63393M9024A68077q3665K59432A1367
$$ 496088 -130461 65677 290174 197926 -163393 -114369 168077 84412 343844 11367
16201a75364A22572a01310A16403J48495g5352D8780P0274b68685h3942E2450
$$ -175364 122572 -101310 116403 264898 -75352 48780 119054 -268685 -83942 52450
16190A03139a35897E7671J57212g1879j51382B57330F5533q605J55698b49680
$$ 103139 -135897 57671 214883 -71879 -223261 257330 65533 56928 212626 -249680
16179b42850C3585b20338d8389p4568A92467a15345B50671j03634j3781J46152
$$ -242850 33585 -220338 -48389 -122957 192467 -115345 250671 147037 133256 279408
16169B79408b17653A77478l8066o5782J41895A9640P9539L59903A5311J59446
$$ 279408 -217653 177478 139412 73630 215525 19640 99179 459082 15311 174757
16159A74757b84603A08458a757A22917a71618A49211C5197K87601A35132Q8119
$$ 174757 -284603 108458 -1757 122917 -171618 149211 35197 322798 135132 223251
16149B23251H4195a1625A54399J19124j31127a3225A13437K35270b66816F0865
$$ 223251 84195 -11625 154399 273523 142396 -13225 113437 348707 -266816 60865
16138B55730b3765A93577h3439m9668E9792b35562A31356a36262j24475i6628
$$ 255730 -23765 193577 -83439 -133107 59792 -235562 131356 -136262 -260737 -96628
16127A65774d63861a31020A71031P455K12564b57628O5277D5913k2271L22062
$$ 165774 -463861 -131020 171031 178486 391050 -257628 -192351 45913 23642 345704
16117C45704J45534F7231a1280k79631n6876N9488A39875A8229K2111J78585E6249
$$ 345704 491238 67231 -11280 -290911 -347787 -288299 139875 18229 40340 218925 56249
16105e0114m6678K5316j67897h3088E7614J75078A07007l229J2736d4850H0807
$$ -50114 -96792 -71476 -239373 -83088 57614 232692 107007 103778 116514 -44850 80807
16093C00191d350B61546g5294C1745b21206G9991f3522m8306L1251G3395c80703
$$ 300191 -4350 261546 -75294 31745 -221206 79991 -63522 -111828 -80577 73395 -380703
16081a48662I4277e0804I3936a26041d9914j13815o0981a8571E6101d10980A14570
$$ -148662 94277 -50804 93936 -126041 -49914 -163729 -224710 -18571 56101 -410980 114570
16069i6743A44908a45756j74759L9701A15604J0151c20758j15805B92876C491
$$ -96743 144908 -145756 -320515 -280814 115604 125755 -320758 -436563 292876 3491
16058A56391a03236A33442D9197a80160L5666A41980b31012A41860J19004E4583
$$ 156391 -103236 133442 49197 -180160 -144494 141980 -231012 141860 260864 54583
16047b00563A0872Q0004K50017G2297e6330A07975a03373e573B47337e36172B88649
$$ -200563 10872 90876 340893 72297 -56330 107975 -103373 -5573 247337 -536172 288649
16035b83857d8740j13727G3487a93143f1214K5540k67551F4643J3059J2142A2748
$$ -283857 -48740 -162467 73487 -193143 -61214 -35674 -303225 64643 77702 89844 12748
16023a6760r7632B25465j09138b35064a6385C07834b28500h1219A4591h8846j55588
$$ -16760 -114392 225465 116327 -235064 -16385 307834 -228500 -81219 14591 -88846 -244434
16012b44434j2984B26673c31626A93449a46684G5426K50781b86116m4423h882
$$ -244434 -257418 226673 -331626 193449 -146684 75426 326207 -286116 -330539 -8882
16001A04466b49904c2136k1104A10629d8614c052o20453g1306E0168b550q2345
$$ 104466 -249904 -32136 -53240 110629 -48614 -3052 -623505 -71306 50168 -2550 -84895
15990h4895H3927b18617B4120J4230b59672D03769G627J15649J74405J21047l3371
$$ -84895 83927 -218617 24120 38350 -259672 403769 7627 123276 297681 418728 385357
15979C85357A42218R4198F5638J56311l4952g2235m2111E7690b71771g7117J8507
$$ 385357 142218 236416 65638 221949 186997 -72235 -114346 57690 -271771 -77117 -58610
15968e8610E1595L0045h0731k33955J21418A09471a13552j65660B53277b5761
$$ -58610 51595 81640 -80731 -314686 -193268 109471 -113552 -279212 253277 -25761
15957a0085A50592A6343a41448d1383A51392i2740B30472a71841M0859r6918b0737
$$ -10085 150592 16343 -141448 -41383 151392 -92740 230472 -171841 -130982 -227900 -20737
15945a20630m4354B01129b49081B44996g7538A00418N1829A4689a1508r5793J732
$$ -120630 -164984 201129 -249081 244996 -77538 100418 152247 14689 -11508 -107301 -105569
15934a05569M572l98863K33995k38540a19989d5505F4415G283b42263N6433L8721
$$ -105569 -100997 -499860 -265865 -504405 -119989 -45505 64415 7283 -242263 -185830 -147109
15923a47109J1812m2744l3100h981j52514A88278D3207k0240a64111B60143c59404
$$ -147109 -135297 -178041 -211141 -8981 -161495 188278 43207 22967 -164111 260143 -359404
15911A32763m8252j7504h5001A35979b37535f8646p1736M5410A05619J9728B4346
$$ 132763 84511 67007 -85001 135979 -237535 -68646 -140382 -94972 105619 125347 24346
15899a52542C2583i4648o1491j59435K2446F6722b18365I0564l4857b77537g1677
$$ -152542 32583 -94648 -156139 -315574 -293128 66722 -218365 90564 55707 -277537 -71677
15887B4949c62662J66854L7184A14033O0163D8983a80636j19919C5741L4061a63892
$$ 24949 -362662 -195808 -158624 114033 174196 48983 -180636 -300555 35741 69802 -163892
15875a48497B55284a57586m0792C06591e4101p2537m5456h0514b6882k81005f5961
$$ -148497 255284 -157586 -198378 306591 -54101 -126638 -172094 -80514 -26882 -307887 -65961
15863d07605a38183C7138J79656N0325C6700b0249A7542b40857C01190a7845F6505
$$ -407605 -138183 37138 216794 267119 36700 -20249 17542 -240857 301190 -17845 66505
15851A2354L5158R953A1246M0493J48348a25387j2223B94478B7076K94019c76167
$$ 12354 47512 57465 11246 51739 200087 -125387 -137610 294478 27076 321095 -376167
15839A18258e8049k39884B90384A21016J00935b021A35218b23281d2201k8391
$$ 118258 -58049 -297933 290384 121016 221951 -2021 135218 -223281 -42201 -70592
15829g0592j20457B15803a90441m0546h9286l59656A37770a40482r6114K4201
$$ -70592 -191049 215803 -190441 -230987 -89286 -448942 137770 -140482 -236596 -212395
15819b12395n721a00856p835j41892D8641J18422d7673k69866H3655a7955B31625
$$ -212395 -218116 -100856 -108691 -250583 48641 167063 -47673 -317539 83655 -17955 231625
15807a21172A59322p1321b97694B07985c03659j9621h1733A92134A0780a61124
$$ -121172 159322 88001 -297694 207985 -303659 -323280 -81733 192134 10780 -161124
15796E6220a97989L4958F7331h8849m739k17170i0117a6238B53513A24041a32299
$$ 56220 -197989 -163031 67331 -88849 -93588 -310758 -90117 -16238 253513 124041 -132299
15784A01296a86969G5037C0970M4939M9383L8174D8400B3172c49530e1531r0048
$$ 101296 -186969 75037 30970 75909 125292 163466 48400 23172 -349530 -51531 -141579
15773a41579l9624E1683j5855a79578b7519D6821b52935C4875b46132M7216g5572
$$ -141579 -181203 51683 35828 -179578 -27519 46821 -252935 34875 -246132 -198916 -75572
15761a48145a2239k10117J6534p9882A26133l0446E189a1198k29627B24516q3606
$$ -148145 -12239 -222356 -205822 -285704 126133 95687 5189 -11198 -240825 224516 140910
15750A40910b64637A42607a46k37942C85727a16855B15604A7822f1326q3973A68036
$$ 140910 -264637 142607 -146 -238088 385727 -116855 215604 17822 -61326 -145299 168036
15738D2807d9000E3878J42895e3111k6343j88129m4724O3789a9434A09497b51353
$$ 42807 -49000 53878 196773 -53111 -79454 -267583 -312307 -248518 -19434 109497 -251353
15726H6888f6359q5017a288C68062a25423A7271J45732c4968j0620m305l7736
$$ 86888 -66359 -151376 -1288 368062 -125423 17271 163003 -34968 -45588 -49893 -87629
15715h7629G7807c73211C9536a22735a526A00691h6515n3747A60910b02674A20801
$$ -87629 77807 -373211 39536 -122735 -1526 100691 -86515 -140262 160910 -202674 120801
15703H1440b02913B18896a45245A33278c32608j02048D6090J69260p0326D0658
$$ 81440 -202913 218896 -145245 133278 -332608 -434656 46090 215350 145024 40658
15692D4287a63411a6642k6985j01156A5560i2204G1585c8088j13461A87314d07199
$$ 44287 -163411 -16642 -43627 -144783 15560 -92204 71585 -38088 -151549 187314 -407199
15680A02027O5403G9697b14209k8098C0258J58293a43375C35652C4171K1088R3289
$$ 102027 167430 79697 -214209 -242307 30258 188551 -143375 335652 34171 55259 148548
15669A48548F4370J7645f4194k20313R3876A7445b66981G8831j2479k0098J14850
$$ 148548 64370 82015 -64194 -284507 -190631 17445 -266981 78831 66352 46254 161104
15658A61104a54110f2388A02952b57752R7478M067c7598A60392g7433o514A2328
$$ 161104 -154110 -62388 102952 -257752 -160274 -156207 -37598 160392 -77433 -83947 12328
15646i8170C78844C9311R6196a33898c3326A38976A745J43991c53567c3159j00041
$$ -98170 378844 39311 135507 -133898 -33326 138976 1745 145736 -353567 -33159 -133200
15635a33200B4658K96740f7883m3000B26849a16003r1368D7387B152M0451j5943
$$ -133200 24658 321398 -67883 -110883 226849 -116003 -207371 47387 2152 42603 26660
15624B6660Q3493O1842c9264B21480a2856A63263a74306E4889f0526l2051A60383
$$ 26660 110153 171995 -39264 221480 -12856 163263 -174306 54889 -60526 -92577 160383
15612a42623k76302B80629a55871M1887F7792a08663j20557J6489C6908l834K5866
$$ -142623 -418925 280629 -155871 -113984 67792 -108663 -229220 -212731 36908 33074 58940
15601E8940a53816H7709c17479D7708g871j93074D7443R5696J0712f417j90536
$$ 58940 -153816 87709 -317479 47708 -7871 -200945 47443 143139 153851 -6417 -196953
15590a96953f4081A45981i5731D05515g3631C6318P6506b27110R7531B37480h2531
$$ -196953 -64081 145981 -95731 405515 -73631 36318 112824 -227110 -129579 237480 -82531
15578f8833B47385B3023c9654k24205A01592a69258h3768c6445p6822d0046C4263
$$ -68833 247385 23023 -39654 -263859 101592 -169258 -83768 -36445 -113267 -40046 34263
15566A6719a04529m2691C75368g0320D6036e11840b152B2839J37134a40521j03873
$$ 16719 -104529 -147220 375368 -70320 46036 -511840 -2152 22839 159973 -140521 -244394
15555b44394E7371J16197a88808M6037B21274a44954k5197k53655a48645E8101
$$ -244394 57371 173568 -188808 -142771 221274 -144954 -170151 -423806 -148645 58101
15544a76716A36020B4467c5423j19265n106A68577D0286A7457a12358j63296J2669
$$ -176716 136020 24467 -35423 -154688 -159794 168577 40286 17457 -112358 -275654 -262985
15533b62985q5527A68204f7968A47523C1780J8719a38819L2972A00372D6525A9020
$$ -262985 -348512 168204 -67968 147523 31780 50499 -138819 -105847 100372 46525 19020
15521B65026i7242A88517j8203a99979c5570B6315c56325I1238a75775B18396
$$ 265026 -97242 188517 170314 -199979 -35570 26315 -356325 91238 -175775 218396
15510G8457J63769j0476A799J32115a61613k16509J69846M092E3021f3203J1280
$$ 78457 242226 231750 1799 133914 -161613 -378122 -208276 -204184 53021 -63203 -51923
15499e1923B28917c86845I0491b34865A10455g5852n6955j13118B69076b98743
$$ -51923 228917 -386845 90491 -234865 110455 -75852 -132807 -245925 269076 -298743
15488e8942p6241B21783g399j19479A87840A8809L0860b69006H8052h4533B7821
$$ -58942 -135183 221783 -7399 -126878 187840 18809 49669 -269006 88052 -84533 27821
15476B02795b10795A58042J89523E2233J58911j4229d1686p6348A37463e3744
$$ 202795 -210795 158042 347565 52233 211144 196915 -41686 -118034 137463 -53744
15465A74983k1933h4780j90202B55812e7402D8539A4054n160g7853C8708K13564
$$ 174983 153050 -84780 -274982 255812 -57402 48539 14054 8894 -77853 38708 252272
15454B52272G0283K27819n5484H237J57637B1412Q1151Q2744a515q5539B06804
$$ 252272 70283 298102 242618 8237 165874 21412 102563 185307 -1515 -87054 206804
15442a74088O6544B01950l6544B7265L88401o5793A36293f2420C5478b81438H6572
$$ -174088 -107544 201950 165406 27265 415666 349873 136293 -62420 35478 -281438 86572
15430a23973I1744c09063i4404A31977h9821B65068a02158j58523A04331J33763
$$ -123973 91744 -309063 -94404 131977 -89821 265068 -102158 -260681 104331 238094
15420B38094b49685A92657g3332p5931F944a6643E6109K83224a11420F1848K4650
$$ 238094 -249685 192657 -73332 -149263 6944 -16643 56109 339333 -111420 61848 86498
15409H6498j5815M1153j5816K97868j59971J049a47723A09188L22653a84313A61112
$$ 86498 70683 111836 96020 393888 233917 234966 -147723 109188 431841 -184313 161112
15397B86910b03022R5647A38247c6120E3662J09189a63392f3312j31582G7359
$$ 286910 -203022 -107375 138247 -36120 53662 162851 -163392 -63312 -194894 77359
15386a25298A44448b6454A92598K23845A86167a280k3234I603J47574a3323m4834
$$ -125298 144448 -26454 192598 416443 186167 -1280 -24514 9603 157177 -13323 -58157
15375e8157j5840H5075C3806h5973A05268i8856A6522R3955a29667L7641G01K37773
$$ -58157 -73997 85075 33806 -85973 105268 -98856 16522 110477 -129667 -92026 701 238474
15363B38474a29643A00806g2541F2121c3935J5796H644h420j28340L2468D2572
$$ 238474 -129643 100806 -72541 62121 -33935 -18139 8644 -8420 -136760 -104292 42572
15351C28645a79141j11701j62660a34848d2315o3612K4637C8178A7574J09502
$$ 328645 -179141 -290842 -453502 -134848 -42315 -105927 -81290 38178 17574 127076
15341A27076d2573k6158D6332J61331h1253b0940j13500B5781f2133A49643i165
$$ 127076 -42573 -68731 46332 207663 -81253 -20940 -134440 25781 -62133 149643 -9165
15329a39275C70838h4604R764A01127B4883M19395I189j413K46449H1523B9495
$$ -139275 370838 -84604 -74840 101127 24883 444278 9189 7776 254225 81523 29495
15317I7234m93b54301b7102A34219a9621I1047h0109n2282H992L18092l5562c84450
$$ 97234 96741 -254301 -27102 134219 -19621 91047 -80109 -132391 8992 327084 291522 -384450
15304A10234L0557O0141p1316J6508P3258h1938A56709a11145a9998I7320p640
$$ 110234 140791 200932 129616 146124 219382 -81938 156709 -111145 -19998 97320 89680
15293H9680J92135J35100b20888j69228A24069A0761a74084F9862B6042g2676
$$ 89680 281815 416915 -220888 -390116 124069 10761 -174084 69862 26042 -72676
15282A19036Q2809a66242L4722B6576Q6202j029P700a01478B62303a0108C45849
$$ 119036 201845 -166242 -131520 26576 112778 111749 119449 -101478 262303 -10108 345849
15270B6431d8080k6921A07577a35813B06273G6100L9601P5921k918C2944L48697
$$ 26431 -48080 -75001 107577 -135813 206273 76100 115701 191622 188704 32944 381641
15259C81641m409i4861A93054M5906c2083D49443J68381a26490f1401F7922J28955
$$ 381641 377232 -94861 193054 238960 -32083 449443 617824 -126490 -61401 67922 196877
15248A96877E3352L81974Q65226Q95500K33595k33097O71902A205129m57503B21037
$$ 196877 53352 435326 1300552 2196052 2429647 2196550 2868452 1205129 747626 221037
15237A48699A8079J63014a06476A9788b14476G5345K03318q7270a22894C8489
$$ 148699 18079 181093 -106476 19788 -214476 75345 278663 191393 -122894 38489
15226A05073K90032a10665A20880R8468a42416I0545O2968G0845a09621A77524
$$ 105073 395105 -110665 120880 219348 -142416 90545 153513 70845 -109621 177524
15215c5043C69944j11533a07223E6117a22320B15485c1842B67922a86936f317
$$ -35043 369944 258411 -107223 56117 -122320 215485 -31842 267922 -186936 -6317
15204b4695j1366m6047r088I4053A7165L0846e2398B10542C2874K63080C9121
$$ -24695 -36061 -82108 -91196 94053 17165 48011 -52398 210542 32874 295954 39121
15192D2002D279a20911F3449K73295G971J34285c1726r3387C05373A10301c05599
$$ 42002 4279 -120911 63449 336744 7971 142256 -31726 -125113 305373 110301 -305599
15180H0372k7423L80942D3909j1653J1231a44280B93015A06700m3647K03141g797
$$ 80372 52949 433891 43909 32256 43487 -144280 293015 106700 63053 266194 -7797
15168F2450Q373n641g518A16770J50229l6877e4159A12898J17567F6549O0159
$$ 62450 70823 65182 -7518 116770 266999 230122 -54159 112898 230465 66549 126708
15157A26708Q5676m6449K20813l8602A69387Q4004l0831O9293J24919A80601c12798
$$ 126708 212384 165935 386748 348146 169387 253391 222560 291853 416772 180601 -312798
15145C09352H0564R484a96611B56101B2374K77157l0568A18615a02096A3024K69848
$$ 309352 80564 90048 -196611 256101 22374 299531 268963 118615 -102096 13024 282872
15134B82872j3185A05558a80155C59737D9244M94826k03471j27327m187m5169
$$ 282872 269687 105558 -180155 359737 49244 544070 340599 213272 209085 163916
15124A63916j3175L70289O264B58494E6886P1187n5068J25506n4868J5171J52738
$$ 163916 150741 521030 527294 258494 56886 128073 73005 198511 143643 158814 311552
15113C11552a93571A34428J75589A01130K3020N5139b62715C07582l5818a44355
$$ 311552 -193571 134428 310017 101130 124150 179289 -262715 307582 271764 -144355
15102A03045J06237J21958j48422J06078K6324p6045A03509D4517J9434J75045
$$ 103045 209282 331240 182818 288896 315220 239175 103509 44517 63951 238996
15092B38996E0474Q5313K7234j8905j994D3691M2789J13951E1383L5920M87407
$$ 238996 50474 135787 163021 144116 142122 43691 86480 200431 51383 87303 574710
15081E74710k70313A00502b8715A08854O8349b33881B38550B3237f1366C21825
$$ 574710 304397 100502 -28715 108854 177203 -233881 238550 23237 -61366 321825
15070D73129k01550J34207P316A65232g1654C8335J98612J5625g9887I1671O4047
$$ 473129 271579 405786 413102 165232 -71654 38335 236947 252572 -79887 91671 155718
15059A55718J32569j31998r39j0101f883A5254c3659A93580J84338P902A89229
$$ 155718 288287 156289 155350 145249 -6883 15254 -33659 193580 377918 385820 189229
15047A66703J47830K0481j44212N3681K6683G9355N9073F6057L55987r1776A38660
$$ 166703 314533 335014 190802 244483 271166 79355 138428 66057 422044 330268 138660
15035D51044A25810L54055F6941j9166J20610a07169B06250K54633A12473K41776
$$ 451044 125810 479865 66941 47775 168385 -107169 206250 460883 112473 354249
15025C54249N3446j85286P198b060A51043Q679e1955A15236j1301K68187d722
$$ 354249 407695 222409 229607 -2060 151043 159722 -51955 115236 103935 372122 -4722
15013E23653j27846A37227F5584E581L41521j17256K7344j9970q9746K83356P4645
$$ 523653 395807 137227 65584 5581 347102 229846 257190 237220 147474 430830 505475
15002E05475D512K60190J14877j19268M2550a4145C83142p5086K46377B54778
$$ 505475 4512 264702 379579 260311 302861 -14145 383142 308056 554433 254778
14991B06621d7487B30415K84689k12460l6290L02058a7746E1132J40015c7442
$$ 206621 -47487 230415 515104 302644 266354 568412 -17746 51132 191147 -37442
14980A92310K89999A28052b82816B14970K95344B03722o1107h6730b3688C24518
$$ 192310 482309 128052 -282816 214970 510314 203722 142615 -86730 -23688 324518
14969B73190j22756k9691L21891a3709C05267K94J74505B30663o8380M70080j64250
$$ 273190 150434 120743 442634 -13709 305267 305561 480066 230663 162283 632363 468113
14958D68113k10474J21135O639j04683j33966C029M09502j31162K23062k05884
$$ 468113 257639 378774 385413 280730 146764 3029 412531 281369 504431 298547
14948B98547O917g3630J7084B43079L59R5889r2847L00231k70632l2749J41157
$$ 298547 305464 -73630 -56546 243079 243438 339327 246480 546711 276079 243330 384487
14937C84487J38646j29187A40576k0070K96839j28310L072E6851L88770B15622
$$ 384487 523133 393946 140576 120506 417345 289035 292107 56851 445621 215622
14926C11534D6279K94122J46291k31935L39958j07288r2431M4615J89j711Q2854
$$ 311534 46279 340401 486692 254757 594715 487427 394996 439611 439800 438089 520943
14915E20943k39285G7941O8108C8641L70759A53709L10048k16908J99261r0386
$$ 520943 281658 77941 146049 38641 409400 153709 463757 246849 446110 355724
14905C55724j63042r5094J77174P6583l5191A53705G2330L00691j20849m0538
$$ 355724 192682 97588 274762 351345 316154 153705 72330 373021 252172 211634
14895B11634L74511A47320M21965j76165M4785j69289K73842J62609l04256r28
$$ 211634 586145 147320 569285 393120 437905 268616 542458 705067 400811 399883
14885C99883p1751j21191K98842J48516P3978l33448A81869L44600m9486A67112
$$ 399883 328132 206941 505783 654299 728277 394829 181869 526469 476983 167112
14874C1098J8846L03532J80548o8219L36026A31521K88235q9812Q8360M2410K41662
$$ 31098 49944 353476 534024 465805 801831 131521 419756 329944 418304 460714 702376
14863G02376j89940j15945N3454j69583K76894n9702j01838N68888D41622J00288
$$ 702376 512436 396491 449945 280362 557256 497554 395716 964604 441622 541910
14853E41910J127r9009o0811l3372L4128N296K48145k75394L74615A89194N46858
$$ 541910 543037 444028 383217 349845 383973 389269 637414 362020 736635 189194 736052
14842G36052A81035O3493l2865R7262L69821j19712j06897j9990K56798N173j44930
$$ 736052 181035 244528 211663 308925 678746 559034 452137 432147 688945 694118 549188
14831E49188j55501O086L61154p7022J13472j86761j79602q801K85639J82479
$$ 549188 393687 399773 760927 683905 797377 610616 431014 422213 707852 890331
14821H90331l14434l1809P6727l03493K09073K75702l60845L2125L13862j61611
$$ 890331 575897 544088 620815 317322 526395 802097 441252 473377 787239 625628
14811F25628j33170K7632J31599L63834l77276k04775K56807j9792k42479J07773
$$ 625628 492458 520090 651689 1015523 638247 433472 690279 670487 428008 535781
14801E35781m6975j05932L98029J53594C23352N5684L16539j83853J06965M2040
$$ 535781 488806 382874 780903 934497 323352 379036 695575 511722 618687 660727
14791F60727r5653j30576J27801K6854L9929O1280l9521L0790n8630k34435N35703
$$ 660727 565074 434498 562299 589153 629082 690362 650841 681631 623001 388566 924269
14780I24269A37528N44147B60902J15272K65878K97404k88214L6786B95059K82750
$$ 924269 137528 681675 260902 376174 642052 939456 651242 688028 295059 577809
14770E77809K93314l38465r8321J38118j06141K26897k43052K14318j23825O8810
$$ 577809 871123 532658 434337 572455 466314 693211 450159 664477 540652 609462
14760F09462J68676r4011K31477m29436A84026M37057K76993n6093l3731k57680
$$ 609462 778138 684127 915604 486168 184026 621083 898076 841983 808252 550572
14750E50572J06127j75997K39555p3382R8719k29147L5097N0511j09945J03180
$$ 550572 656699 480702 720257 646875 745594 516447 551544 602055 492110 595290
14740E95290q684J9671K30701j01145j71657K48384o6886j4006J61051j6479J05963
$$ 595290 586606 606277 836978 735833 564176 812560 745674 731668 892719 876240 982203
14729I82203k28975K14527j12371j72962N19167m86484J23677K87680p1352m66015
$$ 982203 753228 967755 855384 682422 1201589 715105 838782 1126462 1055110 589095
14719E89095K05485m6178j6686R2356p5839L00709l50083J45497J55395Q9556
$$ 589095 794580 748402 731716 824072 748233 1048942 698859 844356 999751 1089307
14709A089307l35049n1378L4933n5792J56847K77438l13480J93199J67586J1238
$$ 1089307 754258 702880 737813 682021 838868 1116306 802826 996025 1163611 1174849
14699A174849k69631j96451J57985K29051j78063J59998k43148M23594l61129
$$ 1174849 905218 708767 866752 1095803 917740 1077738 834590 1258184 897055
14690H97055J27398j00462M49669l50798K13512l53378L05848j93163j09333p9098
$$ 897055 1024453 923991 1373660 1022862 1236374 882996 1188844 995681 886348 807250
14680H07250L24386j02312J73938l80583O40381l61814K05880o0095j80894K14416
$$ 807250 1131636 1029324 1203262 822679 1463060 1101246 1307126 1247031 1066137 1280553
14670A280553j74121L5312K0643P7888j99009r7561L16730O4720j02583m59212
$$ 1280553 1106432 1141744 1162387 1240275 1041266 943705 1260435 1325155 1222572 763360
14660G63360O26623j08569j55594r1841L42912k14186j89048K49887q1884J08321
$$ 763360 1389983 1281414 1125820 1033979 1376891 1162705 973657 1223544 1141660 1249981
14650A249981m6870J76936q2242J38365p1951j65447m9636M05361l53335k49891
$$ 1249981 1203111 1380047 1297805 1436170 1364219 1198772 1149136 1554497 1201162 951271
14640I51271M55404k55041Q7754k1233J19394J89394m56798M57469m9356r6561
$$ 951271 1406675 1151634 1239388 1218155 1337549 1526943 1070145 1527614 1478258 1381697
14630A381697J33292P767J15172m16922M06452l4913j77146j21284M24305p860
$$ 1381697 1514989 1522756 1637928 1221006 1627458 1592545 1415399 1294115 1718420 1710560
14620A710560k20898j92326r254R5323K97337k87718L37990j60021J16275n9522
$$ 1710560 1489662 1297336 1288082 1383405 1680742 1393024 1731014 1570993 1687268 1627746
14610A627746L8M3946j86867J41160r0141q6949J05274K84935j52553m9379P2832
$$ 1627746 1627784 1671730 1484863 1626023 1535882 1448933 1554207 1839142 1686589 1637210 1710042
14599A710042j28599J58750J39565J919r9011M3882K84901k87076M77022m13250
$$ 1710042 1581443 1740193 1879758 1881677 1782666 1826548 2111449 1824373 2301395 1888145
14589A888145K7192k0016L50527k28594J63954n8159j54470K01455l0567J011
$$ 1888145 1915337 1895321 2245848 2017254 2181208 2123049 1968579 2170034 2139467 2140478
14579B140478L42136o02674L26807K04672J88088l21060J40336m3415k21934j23452
$$ 2140478 2482614 1879940 2206747 2411419 2599507 2278447 2418783 2375368 2153434 2029982
14569B029982M42730m9833L87885j43759M81945m92113N4223j51453L62083l645
$$ 2029982 2472712 2422879 2810764 2667005 3148950 2656837 2711060 2559607 2921690 2918045
14559B918045K60513m3648K53988J85181Q9558L4453Q27983k38409Q64813R89078
$$ 2918045 3178558 3134910 3388898 3574079 3663637 3698090 4526073 4287664 5152477 6141555
14549F141555K112468M408807J1965203J6601302m779394j7021262r664924l202231
$$ 6141555 8254023 12662830 24628033 41229335 36449941 19428679 9763755 6561524
14541F561524M62266J297514l337338j634772p52456k01850k32005k3885n8290
$$ 6561524 7023790 8321304 4983966 3349194 2596738 2394888 2162883 2138998 2080708
14532B080708M49037m3988k6642k02839J8969L57455l43334J93310L6615m0758
$$ 2080708 2529745 2485757 2459115 2256276 2275245 2632700 2289366 2482676 2519291 2478533
14522B478533L1994K15033J92002k76584k346L22598k76428N1411l9957M69562
$$ 2478533 2510527 2725560 2917562 2640978 2638632 2961230 2684802 2736213 2696256 3165818
14512C165818R6999m9973l61149M24028j04160j02660L76633j40074k47336L97257
$$ 3165818 3262817 3212844 2851695 3275723 3171563 3068903 3445536 3305462 3058126 3455383
14502C455383k82651M58813l20556K19910l2912j04666P8926K36451j87811n8910
$$ 3455383 3172732 3631545 3310989 3530899 3497987 3393321 3472247 3708698 3520887 3461977
14492C461977K5905N96583l98259J05344n2458j34642J73162N38066j81077n7702
$$ 3461977 3487882 4084465 3686206 3791550 3739092 3604450 3777612 4315678 4134601 4076899
14482D076899K3202K04419j41570j16928j15510L85356j28757K73838K62542j44030
$$ 4076899 4100101 4304520 4162950 4046022 3930512 4315868 4187111 4460949 4723491 4579461
14472D579461Q7194j83598K01519j28377K98294j13373J43535n7928K18715k93689
$$ 4579461 4666655 4483057 4684576 4556199 4854493 4741120 4884655 4826727 5045442 4751753
14462D751753j1104O31425M1831m74215M86009k4813l52995N05231P7279q3404
$$ 4751753 4740649 5372074 5413905 4939690 5425699 5400886 5047891 5553122 5630401 5546997
14452E546997L06191J9185r0030J88916P4014O2271k95174J53855k8883J09516
$$ 5546997 5853188 5872373 5782343 5971259 6045273 6107544 5812370 5966225 5937342 6046858
14442F046858J39452O04565n03163M11541l01020N41640l1109j23253K12942O127
$$ 6046858 6186310 6790875 6287712 6699253 6398233 6939873 6908764 6785511 6998453 7004580
14432G004580L44136k27296K82957Q5887J82915K84094k27674L43835n721r9493
$$ 7004580 7348716 7121420 7404377 7490264 7673179 7957273 7729599 8073434 8067713 7968220
14422G968220J41212N03475j84954K36287L18745k19014L46713J33869J33957
$$ 7968220 8109432 8612907 8427953 8664240 8982985 8763971 9110684 9244553 9378510
14413I378510M4839J57956J15811K13556j8678J43432K8826Q3152O21998q8054
$$ 9378510 9423349 9581305 9697116 9910672 9891994 10035426 10064252 10147404 10769402 10681348
14403A0681348K9085K79026J05952K27010K5971K83106J77239J92163L52984J01614
$$ 10681348 10710433 10989459 11095411 11322421 11348392 11631498 11808737 12000900 12353884 12455498
14393A2455498M7711j2985N93283K87044O9128L31664q1145N52623N29162J54305
$$ 12455498 12503209 12490224 13083507 13370551 13439679 13771343 13690198 14242821 14771983 14926288
14383A4926288K65828K7981L13169M63219K64056L3512Q49327j62486K46163N65243
$$ 14926288 15192116 15220097 15533266 15996485 16260541 16294053 17143380 16980894 17227057 17792300
14373A7792300L05111M73530L52385L05522M23053M78478J96215K75435M21503
$$ 17792300 18097411 18570941 18923326 19228848 19651901 20130379 20326594 20602029 21023532
14364B1023532P71507K718M50533J253596j29076N70799N71050P75495N76078
$$ 21023532 21795039 21797757 22248290 23501886 23372810 23943609 24514659 25290154 25866232
14355B5866232M26731M98496Q37629N80511N06691J175064K20064Q28997O11564
$$ 25866232 26292963 26791459 27629088 28209599 28716290 29891354 30111418 30940415 31551979
14346C1551979Q33035J081248R89247O74443R15053J332865M08459J193516J241007
$$ 31551979 32385014 33466262 34455509 35129952 36045005 37377870 37786329 38979845 40220852
14337D0220852J238424J229144P15302J436975J180324J367973J099578K165723
$$ 40220852 41459276 42688420 43403722 44840697 46021021 47388994 48488572 50654295
14329E0654295J341445J701182J884856J575941J982652J639769K182245K315860
$$ 50654295 51995740 53696922 55581778 57157719 59140371 60780140 62962385 65278245
14321F5278245J856697K212563K644720K885533K462989L101837K654038L481776
$$ 65278245 67134942 69347505 71992225 74877758 77340747 80442584 83096622 86578398
14313H6578398L336695L389580L424148M153394M158386M224928M854023M413987
$$ 86578398 89915093 93304673 96728821 100882215 105040601 109265529 114119552 118533539
14305A18533539N225399N488845N421673O229221O465388O665219P066584P630525
$$ 118533539 123758938 129247783 134669456 140898677 147364065 154029284 161095868 168726393
14297A68726393Q205438Q501686Q577878R502150J0097005J0585207J0727018
$$ 168726393 176931831 185433517 194011395 203513545 213610550 224195757 234922775
14290B34922775J1997828J1633130J2781414J3542158J3384373J3998643J4215536
$$ 234922775 246920603 258553733 271335147 284877305 298261678 312260321 326475857
14283C26475857J4684727J4774195J4662291J4884362J3967602J3772581J3100046
$$ 326475857 341160584 355934779 370597070 385481432 399449034 413221615 426321661
14276D26321661J1752172J0419700R329356O904703L896060j74033k419394k155401
$$ 426321661 438073833 448493533 457822889 464727592 468623652 468449619 466030225 463874824
14268D63874824l083145l708415n866659o838178q770352r964528j2012707j3492205
$$ 463874824 460791679 457083264 451216605 444378427 435608075 425643547 413630840 400138635
14260D00138635j3814627j5128313j5149238j5314504j5280410j5215633j4601640
$$ 400138635 386324008 371195695 356046457 340731953 325451543 310235910 295634270
14253B95634270j4145111j3788215j1313937j1763134j2136577j1336983j1178057
$$ 295634270 281489159 267700944 256387007 244623873 232487296 221150313 209972256
14246B09972256r940446r103168r014406q132473q370180p567915p285465o440481
$$ 209972256 200031810 190928642 181914236 173781763 165411583 157843668 150558203 144117722
14238A44117722o147914n930340n521240n684979n246283m528876m534232m086977
$$ 144117722 137969808 132039468 126518228 120833249 115586966 111058090 106523858 102436881
14230A02436881l721455m269892l490815l428015l335707l192511k924592k936679
$$ 102436881 98715426 94445534 90954719 87526704 84190997 80998486 78073894 75137215
14222G5137215k631112k282209k098699k445287k214503k039774k166338j559133
$$ 75137215 72506103 70223894 68125195 65679908 63465405 61425631 59259293 57700160
14214E7700160j824340j418489k263665j377557j936345j315582r29175j081810
$$ 57700160 55875820 54457331 52193666 50816109 48879764 47564182 46635007 45553197
14206D5553197j161087j672723r61153j081720j310422q91732n56994j161555
$$ 45553197 44392110 42719387 41758234 40676514 39366092 38474360 37917366 36755811
14198C6755811j313847r14598q42454p27691q52623o72948j236019l96292q03616
$$ 36755811 35441964 34527366 33684912 32957221 32104598 31431650 30195631 29799339 28995723
14189B8995723m87350p76841j062191p0098n66107n01518j037210K56051j122973
$$ 28995723 28508373 27731532 26669341 26599243 26033136 25531618 24494408 24750459 23627486
14180B3627486N5603j231058l53880k64784m07567m89233o26943j78590o78155
$$ 23627486 23683089 22452031 22098151 21833367 21425800 20936567 20309624 20131034 19452879
14171A9452879k06810l34162l45086n83793N0047o29991k24342k11939l71262
$$ 19452879 19246069 18911907 18566821 17983028 18033075 17403084 17178742 16966803 16595541
14162A6595541j43259o57069n6882m14327k63753k60187k10505J12669n62804
$$ 16595541 16452282 15795213 15738331 15324004 15060251 14800064 14589559 14702228 14139424
14153A4139424m45176j44288k12431Q8682k77267j79172m9192p38135N5029k99694
$$ 14139424 13694248 13549960 13337529 13426211 13148944 12969772 12920580 12182445 12237474 11937780
14143A1937780j42981R847j60761m30031O4460k39168j50979n83608K10795j31471
$$ 11937780 11794799 11804646 11643885 11213854 11278314 11039146 10888167 10304559 10515354 10383883
14133A0383883o5978l30880q7849l34202P1058k53655n14115J69239K42395j87458
$$ 10383883 10317905 9987025 9899176 9564974 9636032 9382377 8868262 9037501 9279896 9092438
14123I092438j59111J39258n97682J03200k38711n7611r8258K0467l45778j58083
$$ 9092438 8933327 9072585 8474903 8578103 8339392 8281781 8183523 8203990 7858212 7700129
14113G700129R0497j27008j62637L8376J6343n09885J10199j47282J33355n2828
$$ 7700129 7790626 7663618 7500981 7539357 7555700 7045815 7156014 7008732 7142087 7089259
14103G089259m85142K91556l24297j58171r9300j04356k5958L53643m15791J47516
$$ 7089259 6604117 6895673 6571376 6413205 6313905 6209549 6183591 6537234 6121443 6268959
14093F268959J46190m3042l00531m70545J66391k36104O3612N6553j0548j05226
$$ 6268959 6415149 6372107 6071576 5601031 5767422 5531318 5594930 5651483 5640935 5535709
14083E535709j20488L4592k34543j67934J6336M19609n23219r3368L63851n5129
$$ 5535709 5415221 5449813 5215270 5047336 5063672 5483281 4960062 4866694 5230545 5175416
14073E175416n39056L40815J9038l53714K25186k07846p2049j687m01104L79662
$$ 5175416 4636360 4977175 4996213 4642499 4867685 4659839 4587790 4586103 4184999 4564661
14063D564661k90212j27556L59097j54046J05511k76943K56872n28263J83971
$$ 4564661 4274449 4146893 4505990 4351944 4457455 4180512 4437384 3909121 4093092
14054D093092l09189J99063p9003k84744K93552J96963m94262K27556j35728O7181
$$ 4093092 3783903 3982966 3903963 3619219 3912771 4109734 3615472 3843028 3707300 3774481
14044C774481p0652J80740n05145Q7549K8434L0635k14315L20352k93036r3629
$$ 3774481 3703829 3884569 3379424 3466973 3495407 3526042 3311727 3632079 3339043 3245414
14034C245414K51002m40347j9169l24088P27584Q7056P8734k94685k32582L92878
$$ 3245414 3496416 3056069 3036900 2712812 3440396 3527452 3606186 3311501 3078919 3471797
14024C471797l40312j88312J28582j10404J54161l44390M4074R6143j5256j10548
$$ 3471797 3131485 2943173 3071755 2961351 3115512 2771122 2815196 2911339 2896083 2785535
14014B785535O5381k02569J9859j07175k18555M00780N2827l84150J26274k8901
$$ 2785535 2850916 2648347 2668206 2561031 2342476 2743256 2796083 2411933 2538207 2509306
14004B509306j03024L1007l21912L84242j5761k99479L69175o27371M78996j34918
$$ 2509306 2406282 2437289 2115377 2499619 2483858 2184379 2553554 1926183 2405179 2270261
13994B270261Q455K28985L5681L10959K62944J016303L454618J0135694J9114538
$$ 2270261 2278716 2507701 2543382 2854341 3117285 4133588 7588206 17723900 36838438
13985C6838438K680018j4990868j0175742n130996k310562j287320j180560l18195
$$ 36838438 39518456 24527588 14351846 9220850 6910288 5622968 4442408 4124213
13977D124213k92764m52389m1803k49571j53631J29026l83145L50240k28234j11732
$$ 4124213 3831449 3379060 3337257 3087686 2934055 3063081 2679936 3030176 2801942 2690210
13967B690210L8186l35467K09642n5408l35039L70413o12127L41085J55291p5942
$$ 2690210 2728396 2392929 2602571 2547163 2212124 2582537 1970410 2311495 2466786 2390844
13957B390844l48037L2581J82825O1379j43713j72550L22425l28130j17892K62157
$$ 2390844 2042807 2075388 2258213 2319592 2175879 2003329 2325754 1997624 1879732 2141889
13947B141889j39014p3504J66563P3706p7278p1044k53312M3502J53151n1304
$$ 2141889 2002875 1929371 2095934 2169640 2092362 2021318 1768006 1811508 1964659 1913355
13937A913355J68361n7708J2574j97930j30807M8638j01182L33122m87891L05698
$$ 1913355 2081716 2024008 2036582 1838652 1707845 1756483 1655301 1988423 1500532 1806230
13927A806230j76670q3686K0275J72370l72526N5075K62335l99472N05531l26929
$$ 1806230 1629560 1545874 1566149 1738519 1365993 1421068 1683403 1283931 1789462 1462533
13917A462533J16744J52860k0744l43399k1794L08560N3755Q4049J38598m71736
$$ 1462533 1579277 1732137 1711393 1367994 1346200 1654760 1708515 1792564 1931162 1459426
13907A459426J33016j44660j06431p4793m1070K69331R0839j47355k27319L6862
$$ 1459426 1592442 1447782 1341351 1266558 1225488 1494819 1585658 1438303 1210984 1247846
13897A247846L35350j75071L41K7083n9888k28466J97274j92410K32881r1429
$$ 1247846 1583196 1408125 1408466 1435549 1375661 1147195 1344469 1152059 1384940 1293511
13887A293511J85294R1376k08630K96980n74161K94281k22410K39032L09043n51445
$$ 1293511 1478805 1570181 1361551 1658531 1084370 1378651 1156241 1395273 1704316 1152871
13877A152871P4702k81511N12893o6410j14222k54114K77818p9940j53581J28595
$$ 1152871 1227573 946062 1458955 1392545 1278323 1024209 1302027 1222087 1068506 1197101
13867A197101k19791L08920k96987K80065P3488j61719r9745L0358J50586j77031
$$ 1197101 977310 1286230 989243 1269308 1342796 1181077 1081332 1111690 1262276 1085245
13857A085245l1703K87192q6236n52526M25629k18025J6257L08709l60614K6466
$$ 1085245 1053542 1340734 1254498 701972 1127601 909576 925833 1234542 873928 900394
13847I00394M60235l43301N1692J39508N0617k48751l8737J37667J89796k13729
$$ 900394 1360629 1017328 1069020 1208528 1259145 1010394 971657 1109324 1299120 1085391
13837A085391p6406j56948K12433K27284n60122L62874l35883K78373k12177K40517
$$ 1085391 1008985 852037 1064470 1291754 731632 1094506 758623 1036996 824819 1065336
13827A065336J35143j95250J27169k27064L83511k84846J65308k30841j54000
$$ 1065336 1200479 1005229 1132398 905334 1288845 1003999 1169307 938466 784466
13818G84466K77242R5755l54526J53915m0017K9768j50851L88026l08792J85811
$$ 784466 1061708 1157463 802937 956852 916835 946603 795752 1183778 874986 1060797
13808A060797k72771M26122l98586r8813K75596n4549J41987M5149k7472n16437
$$ 1060797 788026 1214148 815562 716749 992345 937796 1079783 1124932 1097460 581023
13798E81023R9710J12270J44944J18371l50874o5463L06868l37906N78435n47825
$$ 581023 680733 793003 937947 1056318 705444 639981 946849 608943 1187378 639553
13788F39553J55592o7506j32285J60674L97790E48711J48667j17601P2791K19541
$$ 639553 795145 727639 595354 756028 1153818 548711 697378 579777 652568 872109
13778H72109J02462L1118k77816j89298j78251K13316L56710J04472j74798j31199
$$ 872109 974571 1005689 727873 538575 360324 573640 930350 1034822 860024 728825
13768G28825j30121R5033k5176M752l22822M22532B61719K25279M45906k50192
$$ 728825 598704 693737 668561 673313 350491 773023 261719 486998 932904 682712
13758F82712J04322m952L48398n37350M39335l38952k59351J43654k46412M11735
$$ 682712 787034 782082 1130480 593130 1032465 693513 434162 577816 331404 743139
13748G43139j4780K97844n0619m82462J56658k9934Q8941k04432J6634P6339N6996
$$ 743139 728359 1026203 975584 493122 649780 619846 708787 504355 520989 597328 654324
13737F54324m2769L6890K63521j11127k11805J28731q2608J2753N4926j38957
$$ 654324 611555 648445 911966 800839 589034 717765 635157 647910 702836 563879
13727E63879n015L07677j88979l3921j69461n1280R0040n8623k8183J26463j24529
$$ 563879 558864 866541 677562 643641 474180 422900 512940 454317 426134 552597 428068
13716D28068M68643j93323M3744j97233Q8597r516m7944M7219k9380A82648J62973
$$ 428068 896711 703388 747132 549899 638496 628980 581036 628255 598875 182648 345621
13705C45621J3424L77289Q5955k81390j98584m896K24907K1940B76312K86209
$$ 345621 359045 736334 822289 540899 342315 337419 562326 584266 276312 562521
13695E62521R3900j91453K26888j58195k02969J32178J86736j365J13353B41219
$$ 562521 656421 464968 691856 533661 330692 462870 649606 648241 761594 241219
13684E25493j21855p9044L18427k18343K26578k55977Q8441j02305j43805K96044
$$ 525493 403638 324594 643021 424678 651256 395279 483720 381415 237610 533654
13674E33654q5772L049B10706P8259M91118R5554D14607J46171B42812L01703
$$ 533654 447882 450931 210706 288965 780083 875637 414607 560778 242812 544515
13664E44515O9314r5495j62387K83778O045j43710j15602M19634j02766C10840
$$ 544515 613829 518334 355947 639725 645770 502060 386458 806092 703326 310840
13653E78340j57979L5208I9803M13660A53030J91365A20658J48920K54400P8446
$$ 578340 420361 455569 99803 513463 153030 344395 120658 269578 523978 602424
13643F02424P8085A48345L50505j48917K05849A37118K96208j21714N8480M96729
$$ 602424 680509 148345 498850 349933 555782 137118 433326 311612 370092 866821
13633H66821C93263J41524j95798K83466j19796J95867l16403p1042C8911M52722
$$ 866821 393263 534787 338989 622455 502659 698526 382123 311081 38911 491633
13623D91633o614K27850k82258K15016k65695j1401j31709M83426D0955J58953
$$ 491633 485019 712869 430611 645627 379932 368531 236822 720248 40955 199908
13613A99908B20M0779M46918j25838L25434C15386K03312B34227o8343J20262
$$ 199908 220 40999 487917 362079 687513 315386 518698 234227 165884 286146
13603B86146P5884J72312p0959M7269R929j33301j37789J01129k0526J29917k17474
$$ 286146 362030 534342 463383 510652 520581 387280 249491 350620 330094 460011 242537
13592B42537J16863r9735M5658K06049j74199o8709R8689n570M87181B77715n286
$$ 242537 359400 259665 305323 511372 337173 268464 367153 361583 848764 277715 272429
13581B72429r5084k5616N3380L7227P0293P5282j04772j14225J1825Q5466L98222
$$ 272429 177345 151729 205109 242336 312629 387911 283139 168914 180739 266205 664427
13570F64427A86602M34422A95765J62397J1161A62915J79508d982B86661J62886
$$ 664427 186602 621024 195765 358162 369323 162915 342423 -4982 286661 449547
13560D49547j14824K6983C7983M45988B31533A09388K64553j65794N05535B93959
$$ 449547 334723 361706 37983 483971 231533 109388 373941 208147 713682 293959
13549C76175A19396M23013r9988A21898K20011r1021j8453K37969B27412Q4204
$$ 376175 119396 542409 442421 121898 341909 250888 232435 470404 227412 311616
13539C11616j0207r2084q7587N41895j50398F0521K43545J34071F7246K96913
$$ 311616 301409 209325 121738 663633 513235 60521 304066 438137 67246 364159
13529C64159j4994r5648M05709l02122A63691L52035A44116J58292r7090o4736
$$ 364159 349165 253517 659226 357104 163691 515726 144116 302408 205318 140582
13519A40582J45381g771A43433K318J59532B8687L09111p1138Q0830I2860M00040
$$ 140582 285963 -7771 143433 145751 305283 28687 337798 266660 347490 92860 492900
13508D92900J8632A06262J68347D853c4020E29004A59493J42063P8047j35624
$$ 492900 511532 106262 274609 4853 -34020 529004 159493 301556 379603 243979
13498B43979O8256M6303j18863K0626J356K45324A95922G7045R0772G2975K14805
$$ 243979 312235 358538 239675 260301 261657 506981 195922 77045 167817 72975 287780
13487B87780J59435a8400C03015A34566O7850J22265o3596K50156n7667A42575
$$ 287780 447215 -18400 303015 134566 202416 324681 261085 511241 453574 142575
13476B59596L847p265o218N2320P4003j68624k3007O0819J42024K6055P4465j62105
$$ 259596 263443 256178 249960 302280 376283 207659 184652 245471 387495 413550 488015 325910
13464C25910m7411J19823f9504A90662J63248A31362a11105A92861N5103J25348
$$ 325910 278499 398322 -69504 190662 353910 131362 -111105 192861 247964 373312
13454C73312o8762J8301K0205A54637K57913J0280A52189L00043A45494A3712
$$ 373312 304550 322851 343056 154637 412550 422830 152189 452232 145494 13712
13443I9074J07606J24391K32642B04755J1151o5621e1175B25578f2034A93826
$$ 99074 206680 331071 563713 204755 215906 150285 -51175 225578 -62034 193826
13432f4791E485J11523k1882g2814D47662k11169j05453B1036J95889K59966l4461
$$ -64791 5485 117008 95126 -72814 447662 236493 131040 21036 216925 476891 442430
13421D42430B08146K90483k18729Q0128A38555J75507p1682J5141J26422b1219
$$ 442430 208146 498629 279900 360028 138555 314062 242380 257521 383943 -21219
13410G9265L60429a34047F3682J49715B9339J89073M5358Q819J47646A36160J27814
$$ 79265 439694 -134047 63682 213397 29339 218412 263770 272589 420235 136160 263974
13399B63974j21549P9852f4287A97143P2748P8476o7271F3242J852I922J74024
$$ 263974 142425 222277 -64287 197143 269891 348367 281096 63242 65094 9922 183946
13388A83946j4115K2202J39824j27457R2889n32f1277m2780B56534o4901J42856
$$ 183946 169831 192033 331857 204400 297289 296757 -61277 -104057 256534 191633 334489
13377C34489C124b31781C11832j7027O1905K99261l26928n0532K72784A33672
$$ 334489 3124 -231781 311832 294805 356710 655971 329043 278511 551295 133672
13366B85474l7955p1246p304L06820j66908o7140O5560j46929J33820A00547L3799
$$ 285474 247519 176273 168969 475789 308881 241741 307301 160372 294192 100547 134346
13355A34346J46331k2200J61604A31490O2294d2134E34542k52905A24275L10850
$$ 134346 280677 258477 420081 131490 193784 -42134 534542 281637 124275 435125
13345D35125j21232n2929Q8710j70245l4620M21201A98115L58997A96343N1838
$$ 435125 313893 260964 349674 179429 144809 566010 198115 557112 196343 248181
13335B48181L7755A21966L16093m9686E8240h485B74067e2501A02048K64340r0544
$$ 248181 285936 121966 438059 388373 58240 -8485 274067 -52501 102048 366388 275844
13324B75844F3148c6125J1314A92698r5014B216K60182r7261Q0395J43250O7342
$$ 275844 63148 -36125 -24811 192698 97684 2216 262398 165137 245532 388782 456124
13313D56124A61404h5176B25074b51390Q6260B01118K00493m972J0577I9527K20824
$$ 456124 161404 -85176 225074 -251390 -165130 201118 401611 396639 407216 99527 320351
13302C20351j13196P794p6946J74423a07432E66306h3376B66294P7238A46542
$$ 320351 207155 214949 138003 312426 -107432 566306 -83376 266294 343532 146542
13291A48654h1376A48126A3247K52962I3653K54154G5912a6878p5204B0677Q4187
$$ 148654 -81376 148126 13247 266209 93653 347807 75912 -16878 -92082 20677 104864
13280A04864J19142C7276Q8863c0936k46346C82128A78837P8505r3750O9719M8750
$$ 104864 224006 37276 126139 -30936 -277282 382128 178837 257342 163592 233311 282061
13269B82061F497J92212G5722I011L34145I1794a00751A51099J46332j41065n8547
$$ 282061 6497 198709 75722 9011 343156 91794 -100751 151099 297431 156366 97819
13258I7819k1331i0892C07496j18042P3815c7399j36972h6434j14806P080c3014
$$ 97819 76488 -90892 307496 189454 263269 -37399 -174371 -86434 -201240 -194160 -33014
13246i6130C00584f1522A22247b92572D20752A55934n403g1268D4216J16516J91769
$$ -96130 300584 -61522 122247 -292572 420752 155934 150531 -71268 44216 160732 352501
13235C52501c2094A78720a6784j30086c954A17878J44955b2436D1635J62531K85557
$$ 352501 -32094 178720 -16784 -146870 -3954 117878 262833 -22436 41635 204166 489723
13224D89723I3673J49932i7381K4241K8190n921a4252C13485A45088K27099A21052
$$ 489723 93673 243605 -97381 -73140 -44950 -50871 -14252 313485 145088 372187 121052
13212B59302N113A31375B7492i6204A54070M1921l8889E4169K96756a03980j25428
$$ 259302 264415 131375 27492 -96204 154070 195991 157102 54169 350925 -103980 -229408
13201b29408H8757K40489I7811J7243a4373r1740D40959A73751j0454a51161a6591
$$ -229408 88757 329246 97811 115054 -14373 -106113 440959 173751 163297 -151161 -16591
13189A64118K23952c6586J0675D5448i984o7987D34499B13312a2937A63506J98122
$$ 164118 388070 -36586 -25911 45448 -9984 -77971 434499 213312 -12937 163506 361628
13178C61628H8682B8733J80807e5930A51715F772a42507B52899d7620A48724a03092
$$ 361628 88682 28733 209540 -55930 151715 6772 -142507 252899 -47620 148724 -103092
13166A55421J87316E592K8004F991K3677K32585p1902r4326J75996B8528f1804
$$ 155421 342737 5592 33596 6991 30668 263253 191351 97025 273021 28528 -61804
13154A1032b319B19686f0822D04342j74145K7082A9091J0908K80225a47703j59543
$$ 11032 -2319 219686 -60822 404342 230197 257279 19091 29999 310224 -147703 -307246
13143c07246D06871j22682B2077L3949L14533D3507K19647b1362o511I2429b68697
$$ -307246 406871 284189 22077 56026 370559 43507 263154 -21362 -27873 92429 -268697
13131B7901J22056m2241K51608j50820Q448H8784a37028A04277h1878j37592B84182
$$ 27901 149957 107716 359324 208504 216952 88784 -137028 104277 -81878 -219470 284182
13119A09770p277O5240J1208R7864J20673q5434b39232E86577A70187a09079c8290
$$ 109770 102493 167733 178941 276805 397478 312044 -239232 586577 170187 -109079 -38290
13107b778B4796J51414b8929A20507N3642a53320D21915I7616e4123C5614M8255
$$ -2778 24796 176210 -28929 120507 174149 -153320 421915 97616 -54123 35614 83869
13096H3869b04192C36745a7057B41273I8567J5048a89184D23440o8954a24158
$$ 83869 -204192 336745 -17057 241273 98567 113615 -189184 423440 354486 -124158
13085b73817C24190h8257B0583J21673B3855A1552L19528E2573j4923J46620a23294
$$ -273817 324190 -88257 20583 142256 23855 11552 331080 52573 37650 184270 -123294
13073F6658c3768k55521D9201J89374G4520K50441A22138n6011Q2189J36687D7028
$$ 66658 -33768 -289289 49201 238575 74520 324961 122138 66127 148316 285003 47028
13061A63663G8188J42692o8508N662C4183J04068a52783B80914j29100F6124N4014
$$ 163663 78188 220880 152372 158034 34183 138251 -152783 280914 151814 66124 120138
13050A20138C3876a5548H1244d3649D27798A02211Q3710H4795l919a03851l22262
$$ 120138 33876 -15548 81244 -43649 427798 102211 185921 84795 80876 -103851 -426113
13039d26113B54490M727I0483J43235j01151L00368d2174B19496j06647J26208
$$ -426113 254490 259217 90483 233718 132567 432935 -42174 219496 112849 239057
13029B39057j03270B1783M12158d1991H8032i7638D77535A66421b4601j05985
$$ 239057 135787 21783 433941 -41991 88032 -97638 477535 166421 -24601 -130586
13019a30586A33210b5287A72680b14763C08387A08541B4111e6334D08101I1304
$$ -130586 133210 -25287 172680 -214763 308387 108541 24111 -56334 408101 91304
13008b42351A73847F8512b77604A0154K47761J93792a82969N0745A41107B4286
$$ -242351 173847 68512 -277604 10154 257915 451707 -182969 -132224 141107 24286
12997E0514A2535J25869E6936j5965j8542f5404C81385b58381j9839I6133Q8594
$$ 50514 12535 138404 56936 40971 22429 -65404 381385 -258381 -278220 96133 184727
12986A84727D4307a85652g707C3229K7906K53920A31758K91077L545i7179l2003
$$ 184727 44307 -185652 -7707 33229 61135 315055 131758 422835 426380 -97179 -129182
12975a29182d477n878A88172C7984L34137a18310j85157N483k0274C44415j66363
$$ -129182 -4477 -10355 188172 37984 372121 -118310 -303467 -297984 -318258 344415 178052
12964A78052a08103A06062b23418A40148J90823b2488A92110p5440a81642C71562
$$ 178052 -108103 106062 -223418 140148 330971 -22488 192110 116670 -181642 371562
12953b89758B58096a90683B53046a23018D766e7931H1911J45225j13263R9711
$$ -289758 258096 -190683 253046 -123018 4766 -57931 81911 227136 113873 213584
12943B13584p7903K9756a4124c589q1694I1635J00810a26693D21278a84863J910
$$ 213584 135681 165437 -14124 -3589 -85283 91635 192445 -126693 421278 -184863 -182953
12932a82953F3320e4343p7635A06546C2223A3260L7262K81044j09656B5342J3014
$$ -182953 63320 -54343 -131978 106546 32223 13260 50522 331566 221910 25342 38356
12921C8356P8292K0865B3736h1470h765j68937G5128C2486b6855j57853G3046
$$ 38356 116648 137513 23736 -81470 -8765 -177702 75128 32486 -26855 -184708 73046
12909g9988C62503o7191a38105A80123A8354a13734j4225D782O490J55592L767
$$ -79988 362503 295312 -138105 180123 18354 -113734 -127959 4782 11272 166864 170631
12898A70631G8964L6277n0396g4759H045K28594a06996e0760A08623J19790E5700
$$ 170631 78964 115241 64845 -74759 8045 236639 -106996 -50760 108623 228413 55700
12886a94346e6380J4091j95406A96494b32963I7606c8684p6698k71872I9953A5639
$$ -194346 -56380 -42289 -237695 196494 -232963 97606 -38684 -115382 -387254 99953 15639
12874a44879b7997C6329L73137d328j25599B72190f0555e638A81977d6346k4314
$$ -144879 -27997 36329 409466 -4328 -129927 272190 -60555 -5638 181977 -46346 -70660
12863g0660A53418J13182a39129I235M741b06392E4539a32395b1348A65057H1643
$$ -70660 153418 266600 -139129 9235 13976 -206392 54539 -132395 -21348 165057 81643
12851e7789A61727b14060A0532P672D947K64500A31088m3280I842J49976E8759
$$ -57789 161727 -214060 10532 18204 4947 269447 131088 87808 9842 159818 58759
12839H6230J10486c8686j10365C49707C7030a45287C0130N2615L67645b28599
$$ 86230 196716 -38686 -149051 349707 37030 -145287 30130 82745 450390 -228599
12828B0006a23082m4062M4619A12276c2572A16876B9625N4423J40522j07059J0852
$$ 20006 -123082 -167144 -122525 112276 -32572 116876 29625 84048 224570 117511 128363
12817A28363e5131j71303R9228k32803J10568A66986K60721b06692j25113A73197
$$ 128363 -55131 -226434 -127206 -360009 -249441 166986 427707 -206692 -331805 173197
12806a85228K9839i257H0328O8163F444c98063a69971B2046d2855p381H5287c2869
$$ -185228 -155389 -9257 80328 148491 6444 -398063 -169971 22046 -42855 -50236 85287 -32869
12793F4263J76303b37966R3521j11065J998B81831b92957a7012n2388A4180K22800
$$ 64263 240566 -237966 -144445 -255510 -253512 281831 -292957 -17012 -69400 14180 236980
12782B36980q1481g2247l16290F476L6696J12332f8718r2741e9475a6861E5712
$$ 236980 155499 -72247 -388537 6476 43172 155504 -68718 -161459 -59475 -16861 55712
12770B35769d57218a76304F7398B1646R9013n9741a74140B90724b11360B76058
$$ 235769 -457218 -176304 67398 21646 120659 60918 -174140 290724 -211360 276058
12759C466i1812A45205k5782b6181j4564O328C9570J79684a61211P0556B3781
$$ 3466 -91812 145205 119423 -26181 -40745 -34417 39570 219254 -161211 -90655 23781
12747A68099K54997c33455a18329G6407K05140f4144m1874E2674K56831B1123
$$ 168099 423096 -333455 -118329 76407 281547 -64144 -106018 52674 309505 21123
12736D7771L09443e2353k90702A50992h5236A51891a43676G8760J47306f1932
$$ 47771 357214 -52353 -343055 150992 -85236 151891 -143676 78760 226066 -61932
12725C06388c8326k21152a3942B51071h035n9640A94940a39729m1884A47771M7154
$$ 306388 -38326 -259478 -13942 251071 -8035 -67675 194940 -139729 -181613 147771 194925
12714A94925m2204b85825a23213A40683m1936K91799A2806J39291a58234K2718
$$ 194925 152721 -285825 -123213 140683 98747 390546 12806 152097 -158234 -135516
12704a35516I3548a04913H2977j4479K81640j74522a1301B32811C1467a04711
$$ -135516 93548 -104913 82977 68498 350138 175616 -11301 232811 31467 -104711
12693A38817a86107A92631b76489A32195g0762j95471H7887d2389k23003A15569
$$ 138817 -186107 192631 -276489 132195 -70762 -266233 87887 -42389 -265392 115569
12682A65267A9547K13744h5252N966A37140J16943k8122a3431k1436A89177F3258
$$ 165267 19547 233291 -85252 -79286 137140 254083 225961 -13431 -34867 189177 63258
12670B08877R1663A04094J15931o3954A4091R4909a29675M6124A58735i9058H0827
$$ 208877 300540 104094 220025 156071 14091 109000 -129675 -83551 158735 -99058 80827
12658b98047A81283h3400H7408L0883a79851B26222j11112J09915c86865A45416
$$ -298047 181283 -83400 87408 118291 -179851 226222 115110 225025 -386865 145416
12647B05607H1074O2685e9705A83906J4220a69530a313j53604m5161K9650A60978
$$ 205607 81074 143759 -59705 183906 198126 -169530 -1313 -154917 -200078 -170428 160978
12635B42037b0715j32958B71624E1520K69912r5567D9073M17733j5910j66893
$$ 242037 -20715 -153673 271624 51520 321432 225865 49073 466806 450896 284003
12625B84003K39559a0549j30164E92025a34327C47195l8271A4518a31868K9587
$$ 284003 523562 -10549 -140713 592025 -134327 347195 308924 14518 -131868 -102281
12615a02281C0301J83306R2854f5897A39618f098A18423K2467e7010i902C47643
$$ -102281 30301 213607 306461 -65897 139618 -6098 118423 140890 -57010 -9902 347643
12603B5702J68636m2382K76591a9273B29057J36078D8206K3424P7088K1890a97380
$$ 25702 194338 151956 428547 -19273 229057 365135 48206 71630 148718 170608 -197380
12591f042k35540H0598f5850j30393k4124C32368A07584h5020g397B40439D854
$$ -6042 -241582 80598 -65850 -196243 -220367 332368 107584 -85020 -7397 240439 4854
12579a12517G1911a31937A60378l0183c1652A7442K03082d3207A62862b96190
$$ -112517 71911 -131937 160378 130195 -31652 17442 220524 -43207 162862 -296190
12568a32704b1118p3631C2923d9824G6261c29676J13359j25057Q8161A44650l1689
$$ -132704 -21118 -94749 32923 -49824 76261 -329676 -216317 -341374 -253213 144650 112961
12557A12961N9896m6238a15416A53402i8294A24127c12120A19245k434n6327b0656
$$ 112961 172857 126619 -115416 153402 -98294 124127 -312120 119245 116811 60484 -20656
12545G0047n239a0588o738B13906D7941b13299C20626a6619C9341J51762p2951
$$ 70047 64808 -10588 -17326 213906 47941 -213299 320626 -16619 39341 191103 118152
12534A18152A1674h1798j44176H1337M7843A3412J41527a18137C77237A62880
$$ 118152 11674 -81798 -225974 81337 129180 13412 154939 -118137 377237 162880
12523B6746J18393b07243B29238C3492N0427j0531a13342o4546E978L76181C9195
$$ 26746 145139 -207243 229238 33492 83919 73388 -113342 -177888 5978 382159 39195
12511B29665L40M5315D5389J72435a3070A84416g2859C19511a65257A87059n5905
$$ 229665 230005 275320 45389 217824 -13070 184416 -72859 319511 -165257 187059 131154
12500A31154O596J29029a49419A21633A3652h8329j42115I1774J9721J67973a88589
$$ 131154 137750 266779 -149419 121633 13652 -88329 -230444 91774 111495 279468 -188589
12488e6168C35698b5161k01032j18448A6341L22666l3935o378q4871b8680j75008
$$ -56168 335698 -25161 -226193 -344641 16341 339007 305072 298694 213823 -28680 -203688
12477b03688B33854Q2962h3724o8578O083a1650j33072N2927d0184k38187C5954
$$ -203688 233854 316816 -83724 -152302 -146219 -11650 -144722 -91795 -40184 -278371 35954
12465A24732l9130a84487c4030k17324p5570F6546k9509O9217e0168a2115j15285
$$ 124732 85602 -184487 -34030 -251354 -326924 66546 37037 106254 -50168 -12115 -127400
12454a27400n96J6765k510E01c5914C4816g1532E2477M3706g9689L538H779a67868
$$ -127400 -127996 -111231 -113741 501 -35914 34816 -71532 52477 96183 -79689 -76151 8779 -167868
12440A58299a51074A216J7279J60064b2425j170A34817C5116b39157A55555f248
$$ 158299 -151074 1216 18495 178559 -22425 -23595 134817 35116 -239157 155555 -6248
12428c8718o1774B19027p8726D6550N8316M43970a96319C49319a8730a940j44303
$$ -38718 -100492 219027 140301 46550 104866 548836 -196319 349319 -18730 -1940 -146243
12417a46243B2360b28297G254J59498k5841i6815F3301a1097A53499c14953C8302
$$ -146243 22360 -228297 7254 166752 140911 -96815 63301 -11097 153499 -314953 38302
12405D104c46131J64302g8018l50283F2811a07992j13112E2816f6871n3829K6059
$$ 4104 -346131 -181829 -78018 -428301 62811 -107992 -221104 52816 -66871 -120700 -94641
12394i4641A87063o3262a88287h5048A37898a77586f9528K5951C00012E2182b77194
$$ -94641 187063 123801 -188287 -85048 137898 -177586 -69528 -43577 300012 52182 -277194
12382a16463j25735C44341a64547J5435e2728p0067j54730I7999J66919a31096
$$ -116463 -242198 344341 -164547 -149112 -52728 -122795 -277525 97999 264918 -131096
12371I9646J30067l52a56533E02796a20032A31197a46095C20243D2466a05687
$$ 99646 229713 229361 -156533 502796 -120032 131197 -146095 320243 42466 -105687
12360b09586p1137i4704G0354q14g0796F130a10437M1107q9259j50745C18604
$$ -209586 -280723 -94704 70354 69540 -70796 6130 -110437 -69330 -158589 -309334 318604
12348e5645q8015A96731R3717G897P1688f6264b9196B4874J48533D3389a72795
$$ -55645 -143660 196731 290448 7897 79585 -66264 -29196 24874 173407 43389 -172795
12336A5368i4560A59969B6210L168K31621b5159n5246b6554k34602a02460e1021
$$ 15368 -94560 159969 26210 29378 260999 -25159 -80405 -26554 -261156 -102460 -51021
12324B5830P7983d00315i1602j85007d1415A38188a69750F3645N2080e4378A8166
$$ 25830 103813 -400315 -91602 -276609 -41415 138188 -169750 63645 115725 -54378 18166
12312a3747I9518J96521G3237H57a25082A75771d5964E9698J95583b88689C6529
$$ -13747 99518 296039 73237 857 -125082 175771 -45964 59698 255281 -288689 36529
12300C0856J3300P1389d6871B73414n238i421j58175c6173m1657k4194c189F7260
$$ 30856 44156 115545 -46871 273414 268176 -9421 -167596 -36173 -77830 -102024 -3189 67260
12287D4618K97729j18300C129N5998f8913b0599B85881A28204a3589l5841q5086
$$ 44618 342347 224047 3129 59127 -68913 -20599 285881 128204 -13589 -49430 -134516
12276a34516O3630k72227B4579J02830J95829r9396N0904c26316A93167H5393
$$ -134516 -70886 -343113 24579 127409 323238 223842 274746 -326316 193167 85393
12265A43884k8256D4351P5180a08132C1520J7038R8946c9955p8705H8175J80151
$$ 143884 115628 44351 119531 -108132 31520 48558 147504 -39955 -118660 88175 268326
12254B68326c0623q4580A9917L41760A8396h5429B21424C1772J11690C6233b96560
$$ 268326 -30623 -115203 19917 361677 18396 -85429 221424 31772 143462 36233 -296560
12242A50840I537M3665K14266A0483a89256d1684D38128A92299B6321a63142c4443
$$ 150840 9537 53202 267468 10483 -189256 -41684 438128 192299 26321 -163142 -34443
12230I7209L5829a74512D5820M07257A2779O6224a03230f674D7120J42013M3914
$$ 97209 133038 -174512 45820 453077 12779 79003 -103230 -6674 47120 189133 233047
12219B33047O2090L3899H0585b34787A15778N7390J21218F1502m535g7323A65051
$$ 233047 295137 329036 80585 -234787 115778 173168 294386 61502 56967 -77323 165051
12207A94705O6566a55960A13804O672J84469j4031E1475J5863L62393q4571k9310
$$ 194705 261271 -155960 113804 120476 304945 290914 51475 67338 429731 345160 315850
12196C15850J18573E4278L39430A65106o6774D2167J05171K28683q3868r101D9251
$$ 315850 434423 54278 393708 165106 98332 42167 147338 376021 292153 283052 49251
12184A66535R443g7214K0848C6826K64621a43766k0706B17734m9736P6727A03187
$$ 166535 175978 -77214 -56366 36826 301447 -143766 -164472 217734 167998 244725 103187
12172B45931J19891A76613H1502K34604g3052k7635B9018J82482i1948C24059
$$ 245931 365822 176613 81502 316106 -73052 -100687 29018 211500 -91948 324059
12161H1332r40J90975j14656B2666J71221b3174A81878L09055c1976A78670b4603
$$ 81332 80392 271367 156711 22666 193887 -23174 181878 490933 -31976 178670 -24603
12149B8349b23106a06E6752g0268l96H3659k5786a75979Q0814n3162f0525H8760
$$ 28349 -223106 -106 56752 -70268 -70664 83659 57873 -175979 -95165 -148327 -60525 88760
12136F0915p085a10085j70232R3920O6179B32222h351A47632J07813j05630q728
$$ 60915 53830 -110085 -280317 -186397 -120218 232222 -8351 147632 255445 149815 141087
12125A41087d10581J47925H7657q849a75333d9819K3590A78206a38237A14379
$$ 141087 -410581 -262656 87657 78808 -175333 -49819 -26229 178206 -138237 114379
12114i467l5243A23176P73i0377j47340A65898B2816K6561J10176D5978B405a29637
$$ -9467 -44710 123176 123949 -90377 -237717 165898 22816 49377 159553 45978 2405 -129637
12101I1036K87119B153b50245k21114A2636a9184C27871b2314j74172L3916q6761
$$ 91036 378155 2153 -250245 -471359 12636 -19184 327871 -22314 -196486 -162570 -249331
12090b49331g7732j37167E1063e6460k49215e7385p0975d0290a2621j06078A22368
$$ -249331 -77732 -214899 51063 -56460 -305675 -57385 -128360 -40290 -12621 -118699 122368
12078c41115d5425C23718a27106A85688a45916J8950h937I3726g9193G7454d32800
$$ -341115 -45425 323718 -127106 185688 -145916 -126966 -8937 93726 -79193 77454 -432800
12066a31633A19636J20273A1545K9411O4197i8892C7882a60128B27366A05789
$$ -131633 119636 239909 11545 40956 105153 -98892 37882 -160128 227366 105789
12055A21802a23934B27115O8555J84845R31591E97869k21974i0833A32103m027
$$ 121802 -123934 227115 295670 480515 1412106 597869 375895 -90833 132103 128076
12045A28076c4454j00141m114M8215E0974c3453r2845A34753a01983B85692a05003
$$ 128076 -34454 -134595 -138709 -90494 50974 -33453 -126298 134753 -101983 285692 -105003
12033b17739G9140J9188l4329Q4902b3738q1915a0815C0701a32981l33641a09204
$$ -217739 79140 98328 63999 148901 -23738 -105653 -10815 30701 -132981 -466622 -109204
12021A39918d8291l00556e7997J4021j47393a0455p9615k5322K524j53938B52362
$$ 139918 -48291 -348847 -57997 -43976 -191369 -10455 -90070 -115392 -112868 -266806 252362
12009B4429d5640a6343m6317B11049G4354M1414A5284G349J1499b94427c7240
$$ 24429 -45640 -16343 -62660 211049 74354 115768 15284 7349 18848 -294427 -37240
11997i9640j7806M942F4133F710J5252o020L1351c7449a4409k65914A9750c06863
$$ -99640 -117446 -112504 64133 6710 21962 15942 47293 -37449 -14409 -280323 19750 -306863
11984A16149a24035G0681j2182a60239j5848g1062n6671F7699c3178j72113B5953
$$ 116149 -124035 70681 58499 -160239 -176087 -71062 -127733 67699 -33178 -205291 25953
11972c32502O9320B86099a97380Q9567F3354J01533c806C1478d236A13965a00351
$$ -332502 -263182 286099 -197380 -107813 63354 164887 -3806 31478 -4236 113965 -100351
11960B42341h6190K0484C0158J84506a30118j6120l8575F7008J7372a05623A82717
$$ 242341 -86190 -65706 30158 214664 -130118 -146238 -184813 67008 84380 -105623 182717
11948A60511J36575c95067I5718a06175B04414d32242i4232q1114k6412L3606
$$ 160511 297086 -395067 95718 -106175 204414 -432242 -94232 -175346 -201758 -168152
11938a68152a073j0018A03930b74461h9839m359o9976f5274A65293a28323E0366
$$ -168152 -1073 -11091 103930 -274461 -89839 -94198 -164174 -65274 165293 -128323 50366
11926b46202A90178h9208C21437b07335R9744a1603q3817L8330A62878F6694b254
$$ -246202 190178 -89208 321437 -207335 -107591 -11603 -95420 -57090 162878 66694 -2254
11914A40792a31416C13942C7341N3530b27359F4070g8461j18386K9091b2222A76863
$$ 140792 -131416 313942 37341 90871 -227359 64070 -78461 -196847 -167756 -22222 176863
11902b16693A97124J05576b99698M5840a03883G0485J40298o1947e4799j98322
$$ -216693 197124 302700 -299698 -253858 -103883 70485 210783 148836 -54799 -253121
11892b53121F3754a53294f7634j45829B3303a02351A64106g5755a3433I501a72425
$$ -253121 63754 -153294 -67634 -213463 23303 -102351 164106 -75755 -13433 9501 -172425
11880A75280b98245B22900a61066b7886e111j06741p46k65049a62204j19212N6943
$$ 175280 -298245 222900 -161066 -27886 -5111 -111852 -112598 -377647 -162204 -281416 -224473
11869b24473j97348a60861j72335J48075q2760b770A41581A1808h9597D64470
$$ -224473 -421821 -160861 -333196 -185121 -267881 -2770 141581 11808 -89597 464470
11858c33284C6191P5359J504M3667n4565g3173l00880A2283J36555k2648n8238
$$ -333284 36191 111550 113054 156721 102156 -73173 -374053 12283 148838 126190 67952
11847F7952N3635B5806c4635A19007k7321a79947A57352a23032B60596q0606n6511
$$ 67952 121587 25806 -34635 119007 91686 -179947 157352 -123032 260596 179990 123479
11836A23479a34519d9897C3345c78468g9696D6061K98223b86319e0219j24816
$$ 123479 -134519 -49897 33345 -378468 -79696 46061 344284 -286319 -50219 -175035
11826a75035c9498A45558a07051A60228G2532g9571I6963H197J2888J56480h2262
$$ -175035 -39498 145558 -107051 160228 72532 -79571 96963 8197 21085 177565 -82262
11814b14920A21731a87738q137h9394o1118H3195j7722d15633D3140c8856A47374
$$ -214920 121731 -187738 -195875 -89394 -150512 83195 65473 -415633 43140 -38856 147374
11802C65172I3601a62139N5080d2147m89290B15332b17252J02637A95696G683
$$ 365172 93601 -162139 -107059 -42147 -531437 215332 -217252 -114615 195696 7683
11791B87990a90609A45692A6764d6041m1120i077o8265j13407N02H2119b50273
$$ 287990 -190609 145692 16764 -46041 -87161 -9077 -77342 -190749 -190247 82119 -250273
11779d94441d8162j14198A45969a44891A53449a75483H8974b40650A18260K91332
$$ -494441 -48162 -162360 145969 -144891 153449 -175483 88974 -240650 118260 409592
11769D09592b23577B19014a07432k0054B35220J69308j65558g8221k91745E4874
$$ 409592 -223577 219014 -107432 -127486 235220 404528 238970 -78221 -369966 54874
11758c1819C7141d2368A15137k2035d63785i5057A57525Q1852A7914d1631A24482
$$ -31819 37141 -42368 115137 93102 -463785 -95057 157525 239377 17914 -41631 124482
11746e8519A85936c16383D0050L3655J2898A1331N9841J51345k0085o6526C8073
$$ -58519 185936 -316383 40050 73705 86603 11331 71172 222517 202432 135906 38073
11734c55562d1939B20790j02774m4297J67452N9915b5149n46478d1502F6593b40881
$$ -355562 -41939 220790 118016 73719 241171 301086 -25149 -571627 -41502 66593 -240881
11722a0171l6129r9908B35412e5754d520A05336c33678B71620a03547g826j062
$$ -10171 -46300 -146208 235412 -55754 -4520 105336 -333678 271620 -103547 -7826 -8888
11711h888j8359A8697O9481c236k55019b2270h632k39527h4959a7327p8927A3321
$$ -8888 -27247 18697 88178 -3236 -258255 -22270 -8632 -248159 -84959 -17327 -96254 13321
11698b58452J16213m9303A32901B6854p755f5337j21608Q5878A36557Q7408C0177
$$ -258452 -142239 -191542 132901 26854 19099 -65337 -186945 -101067 136557 223965 30177
11686F6518J5246C136R7724j8727b71815N2045D1973b50415B2648J56322c9996
$$ 66518 81764 3136 100860 82133 -271815 -219770 41973 -250415 22648 178970 -39996
11674a58473A15924a22529b5979j38939g4403k65535F5041J12256C3274L5122
$$ -158473 115924 -122529 -25979 -164918 -74403 -339938 65041 177297 33274 68396
11664F8396e2964H085c9394j39049f0894E4111J06084c7119n1741B24394a57053
$$ 68396 -52964 8085 -39394 -178443 -60894 54111 160195 -37119 -88860 224394 -157053
11652f6463C12583p6377B6294J388O6444F902O9407b25052E3693I963b74599d053
$$ -66463 312583 236206 26294 27682 94126 6902 76309 -225052 53693 9963 -274599 -4053
11639c80918H4510e9962B40002b24135A31923b29281A81229p5925b43215e3996
$$ -380918 84510 -59962 240002 -224135 131923 -229281 181229 105304 -243215 -53996
11628c35941g017E117b6690k55175k05489e9919j13754I5697c35342a05238q5271
$$ -335941 -7017 5117 -26690 -281865 -487354 -59919 -173673 95697 -335342 -105238 -190509
11617a90509k61372E6768R8770b61006C07107D2318e1543j58206i8717M1558C36982
$$ -190509 -451881 56768 155538 -261006 307107 42318 -51543 -209749 -98717 -57159 336982
11605F1580R32b3801l7007H0587a12797F1858J75842E0625J63244h6068G9056
$$ 61580 62512 -23801 -60808 80587 -112797 61858 237700 50625 213869 -86068 79056
11593I1768j0963b44649B04642H1648i3492H7811R6735G097f5450B26062A10489
$$ 91768 80805 -244649 204642 81648 -93492 87811 184546 7097 -65450 226062 110489
11581b1612j24939B31779c09834l2523a38537J9260H4401i3052o391D3584a70356
$$ -21612 -146551 231779 -309834 -342357 -138537 -119277 84401 -93052 -99443 43584 -170356
11569a4712A70229a76266C59825j52694c1601A89519I3218c7867A31657h3328
$$ -14712 170229 -176266 359825 207131 -31601 189519 93218 -37867 131657 -83328
11558a21250D3833d6998n7780d3959k73616B46766I3174F233h3256a2694E1945
$$ -121250 43833 -46998 -104778 -43959 -317575 246766 93174 6233 -83256 -12694 51945
11546d893A49609h2660k44518a03601B55166G2516J84637c14801B13634H4249
$$ -4893 149609 -82660 -327178 -103601 255166 72516 257153 -314801 213634 84249
11535b74638A12853B9138a32059C12326m9052h1784c3512A64398d57187L9140
$$ -274638 112853 29138 -132059 312326 263274 -81784 -33512 164398 -457187 -418047
11525d18047a05208C58873b28199f6825F9035K2576K38935G4962N3101D9508L92
$$ -418047 -105208 358873 -228199 -66825 69035 91611 330546 74962 128063 49508 49900
11514D9900a70005A82523r0308D2474L60502h3762A11256d15589I1157J86657
$$ 49900 -170005 182523 92215 42474 402976 -83762 111256 -415589 91157 277814
11504B77814k5610a8767A45183Q4478d3501A38754a9558A18015J7256C2509i2426
$$ 277814 252204 -18767 145183 229661 -43501 138754 -19558 118015 135271 32509 -92426
11492G4708J21851E0937K40547A43788c1870A12948g9537H3799J71454K34337
$$ 74708 196559 50937 291484 143788 -31870 112948 -79537 83799 255253 489590
11482D89590A02965O2272l487J41086H2305a48660A28300D4967M3488i6659r3514
$$ 489590 102965 165237 161750 302836 82305 -148660 128300 44967 88455 -96659 -190173
11471a90173f6272c0145D26780j33375H0203O6929a11083C66366j48101f8867
$$ -190173 -66272 -30145 426780 293405 80203 147132 -111083 366366 218265 -68867
11460a18775A26770d16735c4043C22557d76161f1193I7798b76941f537A36566
$$ -118775 126770 -416735 -34043 322557 -476161 -61193 97798 -276941 -6537 136566
11449G8552N1882k9346K83516I1443a38751H2839a68132A72266A1625K8604M4049
$$ 78552 130434 101088 384604 91443 -138751 82839 -168132 172266 11625 40229 84278
11438H4278l3983m132J68980G7728J42167d43046c3954I2834K0519e4978a3423
$$ 84278 50295 46163 215143 77728 219895 -443046 -33954 92834 113353 -54978 -13423
11426a81308C7785a48879l10821D7710b70688P7233h1345C90329A49351N4446
$$ -181308 37785 -148879 -459700 47710 -270688 -193455 -81345 390329 149351 203797
11416B03797G5186j9227J00762D4795J12337a80600a6576B59222c65735h715I8981
$$ 203797 75186 55959 156721 44795 157132 -180600 -16576 259222 -365735 -8715 98981
11404B4828a34588n7567e7505k2335A58949l5133B5845F918J10667n396a97722
$$ 24828 -134588 -192155 -57505 -79840 158949 123816 25845 6918 117585 112189 -197722
11392b77961A69066l4218M81366G5402a22859k20227N806E897f6873D4861P1149
$$ -277961 169066 134848 616214 75402 -122859 -343086 -337280 5897 -66873 44861 116010
11381A16010b3016D48654b37508F5098a19141G7386a8383E2467c84123D6985g6906
$$ 116010 -23016 448654 -237508 65098 -119141 77386 -18383 52467 -384123 46985 -76906
11369A00004A9513J32786d0783k6865A04495K54753c4579j37155A00107b13039
$$ 100004 19513 152299 -40783 -67648 104495 359248 -34579 -171734 100107 -213039
11358b4739N40A23047a35571c6061a478r0184j58139H506c15155A33587c73337
$$ -24739 -24199 123047 -135571 -36061 -1478 -91662 -249801 8506 -315155 133587 -373337
11346a19944A22647a38422m9053G3615b2193k06993k3682a00106A35018a95355
$$ -119944 122647 -138422 -187475 73615 -22193 -229186 -252868 -100106 135018 -195355
11335I8105D7625a71390A6798M6853g7945l5689P284a5907l24157F0476a03013
$$ 98105 47625 -171390 16798 63651 -77945 -113634 -106350 -15907 -340064 60476 -103013
11323B97576G1793l984b04131E1447J81780j00518i5474j12989i6456j36211A98658
$$ 297576 71793 67809 -204131 51447 233227 132709 -95474 -208463 -96456 -232667 198658
11311A4259K89938h7791C480a45457p0978A07115O4138a01792A59104c2519j51783
$$ 14259 304197 -87791 3480 -145457 -216435 107115 171253 -101792 159104 -32519 -184302
11300a84302K1088E7628J10891d4601n2182j75946N4739e6005q0033e9082l4806
$$ -184302 -163214 57628 168519 -44601 -96783 -272729 -217990 -56005 -136038 -59082 -93888
11289i3888B015J4729a91449R2252A0510f4007A56818R0287e8100P45C7477K5241
$$ -93888 2015 16744 -191449 -99197 10510 -64007 156818 247105 -58100 -57355 37477 62718
11277F2718c3178A6931Q6312m3044A963L93893a15138M7862j95858K7798R6299
$$ 62718 -33178 16931 103243 60199 1963 395856 -115138 -67276 -263134 -235336 -139037
11266a39037A81639D2538a50808k24982J57639J3942e2585l70390G4339e83304
$$ -139037 181639 42538 -150808 -375790 -218151 -204209 -52585 -422975 74339 -583304
11255A87189b78158K8349d854j38388k5232l067Q4267n5348D0954e063D0252K4669
$$ 187189 -278158 -249809 -4854 -143242 -168474 -171541 -87274 -142622 40954 -5063 40252 64921
11243F4921J78663D8084e3246b0998B7556K00149a71204A6100J78624J88960m8366
$$ 64921 243584 48084 -53246 -20998 27556 227705 -171204 16100 194724 383684 335318
11232C35318J73179i4885d3237j22306m2754B30803a2040A4072c81699A37388
$$ 335318 508497 -94885 -43237 -165543 -208297 230803 -12040 14072 -381699 137388
11221b50182b8541n0196m3661K5700m5545B9144R9844g811j26728K3962B38342
$$ -250182 -28541 -78737 -122398 -96698 -142243 29144 128988 -7811 -134539 -110577 238342
11209A66408b13487a1374A42479E4488a2368D5809b09191b1965j14737J6241C07180
$$ 166408 -213487 -11374 142479 54488 -12368 45809 -209191 -21965 -136702 -120461 307180
11197b7739p8746F1519A2440M08050A02912b04642A73122C981g6535k85328B8770
$$ -27739 -106485 61519 12440 420490 102912 -204642 173122 3981 -76535 -361863 28770
11185f4258j77892j76791a7893A4176a13160B4380c8766j48863A43411f5623K2471
$$ -64258 -242150 -418941 -17893 14176 -113160 24380 -38766 -187629 143411 -65623 -43152
11174d3152C9672N3688c00159A0233L2156a80280a1384K265B8678h8660l3396
$$ -43152 39672 93360 -300159 10233 42389 -180280 -11384 -9119 28678 -88660 -122056
11163a22056n684C9232O9937c12399l836C2006c27666a60548g858j0774k91708
$$ -122056 -127740 39232 109169 -312399 -316235 32006 -327666 -160548 -7858 -18632 -310340
11152c10340i8663d0715A63104b66990A48219a32132A40465K98981j81266f2459
$$ -310340 -98663 -40715 163104 -266990 148219 -132132 140465 439446 258180 -62459
11141A63706f8440E6251J40706b6293l989l15126d3073B2477K87445j08685D8533
$$ 163706 -68440 56251 196957 -26293 -30282 -345408 -43073 22477 309922 201237 48533
11129A07365e0301D8805L6224a84010H1146J29655d788B42625A429a32005E8199
$$ 107365 -50301 48805 85029 -184010 81146 210801 -4788 242625 1429 -132005 58199
11117e3631J6396b039j6435A42137c9811a5474n111A15637J95222M502J69063
$$ -53631 -37235 -2039 -18474 142137 -39811 -15474 -20585 115637 310859 315361 484424
11106D84424A1240M6973J88659a7521A78244L27141A1365a89868I3735A5044K6575
$$ 484424 11240 58213 246872 -17521 178244 505385 11365 -189868 93735 15044 41619
11095D1619e2737C03420m8068B2154i9830C31579j48235n9474P6706F8713J44180
$$ 41619 -52737 303420 255352 22154 -99830 331579 183344 123870 200576 68713 212893
11084B12893L5500H2662O3836K62821f9383j43483C30787d9415B78638A16940
$$ 212893 248393 82662 146498 409319 -69383 -212866 330787 -49415 278638 116940
11073A91840J15458o6016l6335M3277M0923j20893h9992J4284A70629p438K45452
$$ 191840 307298 241282 204947 248224 289147 168254 -89992 -75708 170629 163191 408643
11062D08643K31510j1628A95624M96645j97156M9368o8088p9005L42981k60209
$$ 408643 640153 628525 195624 692269 495113 544481 476393 397388 740369 480160
11052D80160P4100j62490K78908n1284k02850j41980J165L08180O8235m8523K6886
$$ 480160 554260 391770 670678 619394 416544 274564 275729 583909 652144 603621 630507
11041F30507J7775O9422k75588n5088L28546L0926q388j21632K04790k90476n2163
$$ 630507 648282 717704 442116 387028 715574 746500 738112 616480 821270 530794 478631
11030D78631L2303J7551Q3344k27323M89406C49775K82038O1057k14402j16174
$$ 478631 510934 528485 611829 384506 873912 349775 631813 692870 478468 362294
11020C62294K3544J41109J83638C09311J58327J36960k37403K25767A49956N08046
$$ 362294 385838 526947 710585 309311 467638 604598 367195 592962 149956 658002
11010F58002o9286J01572B01094M34970r7148j17754K53757j07928Q207K30563
$$ 658002 588716 690288 201094 636064 538916 421162 674919 566991 575198 805761
11000H05761l34669j24955L34246C37235J56522j21875J80253j88231K72534K8173
$$ 805761 471092 346137 680383 337235 493757 371882 552135 363904 636438 664611
10990F64611K1684K5740o867N6966L2348L2110Q385l5152l7795K41455j57533
$$ 664611 686295 712035 705168 762134 794482 826592 834977 799825 762030 1003485 845952
10979H45952J58583P9253K29019K02154J46503N13864M610K55865l53460J68768
$$ 845952 1004535 1083788 1312807 1514961 1661464 2175328 2179938 2435803 2082343 2251111
10969B251111l24841k10482p0519k37671j9535l96439J02279j37526p95j94412
$$ 2251111 1926270 1715788 1645269 1407598 1388063 991624 1093903 956377 955582 761170
10959G61170L5363K39347p2750J20129l99743J70941N3538l6514m29282j14919
$$ 761170 796533 1035880 963130 1083259 683516 854457 907995 871481 442199 327280
10949C27280Q4097a8685C05029e6118B01555J2296G2286l3256c2899A21450M7337
$$ 327280 411377 -18685 305029 -56118 201555 213851 72286 39030 -32899 121450 168787
10938A68787i6778M6618B80768M0062P5305b02636A54927E9585a24315e7129B40490
$$ 168787 -96778 -50160 280768 320830 396135 -202636 154927 59585 -124315 -57129 240490
10926A61603a6607M397G2059L25225f888B12278A04548l8724M30863A74078Q5264
$$ 161603 -16607 -12210 72059 397284 -6888 212278 104548 65824 496687 174078 259342
10915B59342I041K9101K73633A37355O9641n0152o8499b91014b3050r8863C02186
$$ 259342 9041 38142 311775 137355 206996 156844 88345 -291014 -23050 -121913 302186
10903D3632b53531e0472C0252e4802j60788g1006i217j2888j87980g0860k49206
$$ 43632 -253531 -50472 30252 -54802 -215590 -71006 -9217 -22105 -210085 -70860 -320066
10892c20066J4067A6718J48315m7720a33810j07893f7208I547K14616c3870q9280
$$ -320066 -305999 16718 165033 117313 -133810 -241703 -67208 9547 224163 -33870 -123150
10881a23150c9656I670h7988B94185r0234q6049b47343A00671b26386C47412I5677
$$ -123150 -39656 9670 -87988 294185 203951 117902 -247343 100671 -226386 347412 95677
10869c0423j14213l80L7873c8428E4460a31358B4684L21018E4115a023o3960A79991
$$ -30423 -144636 -145016 -107143 -38428 54460 -131358 24684 345702 54115 -1023 -64983 179991
10856B47044a50896m9354l6433b6516j8399G0373B9146a42146o8921a04551A79404
$$ 247044 -150896 -200250 -236683 -26516 -44915 70373 29146 -142146 -211067 -104551 179404
10844A56868a83341A6310b35091h3812A66069H1780O3219o4288c92874G0520h7134
$$ 156868 -183341 16310 -235091 -83812 166069 81780 144999 80711 -392874 70520 -87134
10832E9014a5981n913j98214e4291C6246J67847J09636q4106A09205b05237E2740
$$ 59014 -15981 -21894 -220108 -54291 36246 204093 313729 229623 109205 -205237 52740
10820b47274l2150I7215a72767A03825d803I9282f849k94493J06710P9823l2280
$$ -247274 -279424 97215 -172767 103825 -4803 99282 -6849 -301342 -194632 -114809 -147089
10809a47089M7338m3413a0568A02719b42576R8691C6252b15727E9639J23352H8549
$$ -147089 -99751 -143164 -10568 102719 -242576 -143885 36252 -215727 59639 182991 88549
10797b12055a04628A78939a14422k01934E3575d9879l20832P1284b1403q4056
$$ -212055 -104628 178939 -114422 -316356 53575 -49879 -370711 -299427 -21403 -105459
10787a05459n9023g3215A53734e9671o8137d6145k80423i210k6346p931B97210
$$ -105459 -164482 -73215 153734 -59671 -127808 -46145 -326568 -9210 -35556 -43487 297210
10775H2583a46280r0570e1740H1350h6583J1876l9659c8980m5186H8873a81103
$$ 82583 -146280 -236850 -51740 81350 -86583 -74707 -114366 -38980 -84166 88873 -181103
10763a4255k24908A55051B0528J0880a12364A02991a45009P1205j56651B94417
$$ -14255 -239163 155051 20528 31408 -112364 102991 -145009 -73804 -230455 294417
10752A10131A8216J11965a57373p348H4230d7882A8020J21192a3228B31195c7679
$$ 110131 18216 130181 -157373 -164721 84230 -47882 18020 139212 -13228 231195 -37679
10740H1519a307q723b435j62923a5562n6303D33466a24811D7901i2817j28001
$$ 81519 -1307 -10030 -2435 -165358 -15562 -71865 433466 -124811 47901 -92817 -220818
10729b20818I422a41192H6805a24850I5724a37353o8628e8348F3977a26393A99941
$$ -220818 9422 -141192 86805 -124850 95724 -137353 -205981 -58348 63977 -126393 199941
10717a77929g5207k29933A62282G7424g5533k14959a2858k64243i7295k27946
$$ -177929 -75207 -305140 162282 77424 -75533 -290492 -12858 -277101 -97295 -325241
10707c25241L1114R6266P1274B30235l4974q6406e714j43988A3941J47481E277
$$ -325241 -294127 -197861 -126587 230235 195261 108855 -5714 -149702 13941 161422 5277
10695a51405c078C1747K58252G4591a52159O0608n0174b8141l3606n4968A80254
$$ -151405 -3078 31747 289999 74591 -152159 -91551 -141725 -28141 -61747 -116715 180254
10683B94692b27317A57176C9477N5244b46883b2768A13794j1856J05425b41363
$$ 294692 -227317 157176 39477 94721 -246883 -22768 113794 101938 207363 -241363
10672h5131A84660b01513f0251B61922O5346b20816F5173a53035d7484A1869e2861
$$ -85131 184660 -201513 -60251 261922 327268 -220816 65173 -153035 -47484 11869 -52861
10660C1745q160b4018r6887k96394h8595H5317K06318a51647f8218j79423N3070
$$ 31745 23585 -24018 -120905 -417299 -88595 85317 291635 -151647 -68218 -247641 -194571
10649a94571i3324k16060i7220K182p517m2280e0222o5990q1232M0360C17438
$$ -194571 -93324 -309384 -97220 -95038 -102555 -144835 -50222 -116212 -197444 -157084 317438
10637A77751l4964M5971D7113j4153a10117m1497J8964j04294a14714d5495k13110
$$ 177751 142787 188758 47113 32960 -110117 -151614 -132650 -236944 -114714 -45495 -258605
10626b58605A13605a5924n8132K0402A6640h4131j30746m5749A7051b26034c7891
$$ -258605 113605 -15924 -74056 -53654 16640 -84131 -214877 -260626 17051 -226034 -37891
10614F1600d4151G6814a16991H0199b18309a8600A12022a26241I31K29460A762
$$ 61600 -44151 76814 -116991 80199 -218309 -18600 112022 -126241 931 230391 1762
10602f6513k3369a9785k88389A41911J4155J47424C941g718A76687h6182k23716
$$ -66513 -89882 -19785 -308174 141911 156066 303490 3941 -7718 176687 -86182 -309898
10591c09898R7375O0622L6282d2458j03222N8344j0593I7287d78877K18686A44453
$$ -309898 -212523 -151901 -115619 -42458 -145680 -87336 -97929 97287 -478877 -260191 144453
10579i306E4954B1748e06294A43923o5625p499e1781a8852A56919c66181A16719
$$ -9306 54954 21748 -506294 143923 78298 70799 -51781 -18852 156919 -366181 116719
10567B93265a40995j39415J29020A50324a08960B67747A26582J01099e2349j94117
$$ 293265 -140995 -280410 -151390 150324 -108960 267747 126582 227681 -52349 -246466
10557b46466r0423e9464A05628a20766n9497A06543Q9714h9078j53018N0130B30082
$$ -246466 -336889 -59464 105628 -120766 -180263 106543 196257 -89078 -242096 -191966 230082
10545b02577B24831r8928n0228a8312n2212A28333D3604b3729H2241B8054a91925
$$ -202577 224831 125903 75675 -18312 -70524 128333 43604 -23729 82241 28054 -191925
10533C2645b67512b475A30406b40071A04713a14861M8442A15254f2621p2236A99953
$$ 32645 -267512 -2475 130406 -240071 104713 -114861 -66419 115254 -62621 -134857 199953
10521C6645a06354j75630R6789L8703j41263A83548a56167L9991J9785J7105j51493
$$ 36645 -106354 -281984 -185195 -146492 -287755 183548 -156167 -116176 -96391 -79286 -230779
10510b30779h8015b884A49788b02625J8330f2272I9267c08385A82525a24013A93471
$$ -230779 -88015 -2884 149788 -202625 -184295 -62272 99267 -308385 182525 -124013 193471
10498E2281a89893j4976f9180j21381f8895k41173J38316j75657b3988B72323
$$ 52281 -189893 -204869 -69180 -190561 -68895 -310068 -171752 -347409 -23988 272323
10487A93657H096i248I0434b82508A27097B9259b32050I2570a25947n14j87801
$$ 193657 8096 -9248 90434 -282508 127097 29259 -232050 92570 -125947 -126461 -314262
10476c14262N8130b1596B21738K0388p0835G8135c92907A20320J9668K3497b05576
$$ -314262 -256132 -21596 221738 242126 171291 78135 -392907 120320 139988 163485 -205576
10464B92087b72648B93770a87967f880k23238b6785B66141h1276C76950d1995
$$ 292087 -272648 293770 -187967 -6880 -230118 -26785 266141 -81276 376950 -41995
10453G7899r327f1767M759E6666O0317L5219C4740a93426f9924r7512H9243B930
$$ 77899 68572 -61767 -57008 56666 116983 152202 34740 -193426 -69924 -167436 89243 2930
10440A124e341l4152B91097a85408e7943l250m2157J0795l46041F8893b90272
$$ 1124 -5341 -39493 291097 -185408 -57943 -61193 -103350 -92555 -438596 68893 -290272
10428B76768I1577i2513j29664A8458c65301L2027J37257g0919F4551B515R8575
$$ 276768 91577 -92513 -222177 18458 -365301 -333274 -196017 -70919 64551 2515 101090
10417A01090N2412d9234n9015A85684P0882e773B58056A24180a81511A61002d22796
$$ 101090 153502 -49234 -108249 185684 256566 -5773 258056 124180 -181511 161002 -422796
10405g8788b4078k90478H9323f3538j89677k2629n7175D5672a74638N3278C79525
$$ -78788 -24078 -314556 89323 -63538 -253215 -275844 -333019 45672 -174638 -121360 379525
10393C64762A71832L3472f2251D72347j37515j63635d88093D24651F5083a02105
$$ 364762 171832 205304 -62251 472347 334832 171197 -488093 424651 65083 -102105
10382f2976j77620C65114C7279L3771L26972H6612R3565a08611H7803a1140C14812
$$ -62976 -240596 365114 37279 71050 398022 86612 180177 -108611 87803 -11140 314812
10370D24830D6260M19816B16932p6598K87964D6849J80733A05263J8983k1745
$$ 424830 46260 466076 216932 140334 428298 46849 227582 105263 124246 102501
10360A02501d4536D3720J75243k7626A9802G708R5886L25345n5450J23554J05686
$$ 102501 -44536 43720 218963 191337 19802 7708 103594 428939 373489 497043 602729
10349F02729j98578b16687A70284L41910G5828J78007J54105A985Q7692i7853
$$ 602729 404151 -216687 170284 512194 75828 253835 407940 1985 89677 -97853
10338E9115M75493G3570a15802A37244B3899O5568a50737F8403K18572j21178
$$ 59115 534608 73570 -115802 137244 23899 89467 -150737 68403 286975 165797
10328A65797H0535C2653J58247B0266P0558Q5426L9895a23970k3625A04904a64291
$$ 165797 80535 32653 190900 20266 90824 176250 216145 -123970 -147595 104904 -164291
10316b44733a18148A04803a22680n2517C31525b81595C6098N4956l8965b7911
$$ -244733 -118148 104803 -122680 -175197 331525 -281595 36098 91054 52089 -27911
10305A38043b36878J16821C84963E5334i6799A39140g7658p4200l4788B29726
$$ 138043 -236878 -120057 384963 55334 -96799 139140 -77658 -151858 -186646 229726
10294D3682J02059O1743D9189c31339A9668o129J2536O6542J09350g3275D7815
$$ 43682 145741 207484 49189 -331339 19668 13539 26075 92617 201967 -73275 47815
10282B06247q1865a31723A10774a41060A21739b07860B4065a51578a0928j16739
$$ 206247 124382 -131723 110774 -141060 121739 -207860 24065 -151578 -10928 -127667
10272a27667P269a6127j51894O4044j22797P4378n6810A75877F672i8446A55997
$$ -127667 -120398 -16127 -168021 -103977 -226774 -152396 -209206 175877 6672 -98446 155997
10260D1691K51652a09819D62956a918D45316B04060C073a95245c2019F5590a77149
$$ 41691 293343 -109819 462956 -1918 445316 204060 3073 -195245 -32019 65590 -177149
10248B22431q8138n4421J64904G5131K0424c8250j05407A83386d2043A4528M7445
$$ 222431 134293 79872 244776 75131 95555 -38250 -143657 183386 -42043 14528 61973
10237F1973N1054a18254A2450b02829m656F2402o029f6525k28487q166J50299
$$ 61973 113027 -118254 12450 -202829 -207485 62402 56373 -66525 -295012 -303178 -152879
10226a52879A54955h2753l09938e1402k31193J7053J5003e3792j70858k5160k405
$$ -152879 154955 -82753 -392691 -51402 -282595 -265542 -250539 -53792 -224650 -249810 -252215
10215b52215a23058K8937k09465J31452o4147N2957G2418a51876B0852b79607
$$ -252215 -123058 -94121 -303586 -172134 -236281 -183324 72418 -151876 20852 -279607
10204a36645B80720G6993k8334b63925K4227h3582G4778a6075B50673i9009k10184
$$ -136645 280720 76993 48659 -263925 -239698 -83582 74778 -16075 250673 -99009 -309193
10193c09193A25001l3362J2254f9179A52676l8534a33195M6661I8723a2849C7141
$$ -309193 125001 91639 103893 -69179 152676 114142 -133195 -86534 98723 -12849 37141
10181b16621p4046M5162B9790a72942I4517g5590c999A98416b10280o8983f4196
$$ -216621 -290667 -245505 29790 -172942 94517 -75590 -3999 198416 -210280 -279263 -64196
10169A94158D9622b67788J8911a09847r6742f9241m0440j48434N8498I3941c00645
$$ 194158 49622 -267788 -248877 -109847 -206589 -69241 -109681 -258115 -199617 93941 -300645
10157A5897a98910Q5259B92099j27858G487a42042J2161D18807G1584a7328m6385
$$ 15897 -198910 -113651 292099 164241 7487 -142042 -129881 418807 71584 -17328 -63713
10146f3713q2941d756F7688d24254i1002a1565A89940l605a13804J2030c705C1579
$$ -63713 -146654 -4756 67688 -424254 -91002 -11565 189940 186335 -113804 -101774 -3705 31579
10133b4591o0377j80137f9069o5584B8447a76640A43528E1580c0669G5537k0387
$$ -24591 -84968 -265105 -69069 -134653 28447 -176640 143528 51580 -30669 75537 55150
10122E5150J07193j5636a93356A7018b02486j42677a18458l2341K7718C70569
$$ 55150 162343 146707 -193356 17018 -202486 -345163 -118458 -150799 -123081 370569
10111b8317n4757l4758F7086a26009K7422n2429M4616k00702h9155j80469b3410
$$ -28317 -83074 -117832 67086 -126009 -98587 -151016 -106400 -307102 -89155 -269624 -23410
10099d09021a90003f6142m1366C1066J75105C7596J6100c68114A33077a65774
$$ -409021 -190003 -66142 -107508 31066 206171 37596 53696 -368114 133077 -165774
10088b68000B03019c14344I604O0037d1k05858g7765k35204N8512j32690b5214
$$ -268000 203019 -314344 9604 69641 -41 -205899 -77765 -312969 -254457 -387147 -25214
10076e5512B86308h1958R240r0913a4426B215a32257c9472F3542J08419a47319
$$ -55512 286308 -81958 -72718 -163631 -14426 2215 -132257 -39472 63542 171961 -147319
10064B22549c65115E608c54009h5895l9964L1241c4892A49335b97373F3198b8793
$$ 222549 -365115 5608 -354009 -85895 -125859 -94618 -34892 149335 -297373 63198 -28793
10052i9671b4217A81891e2501q6723C17725c22460J31064A34493d4187k38464
$$ -99671 -24217 181891 -52501 -139224 317725 -322460 -191396 134493 -44187 -282651
10042b82651H3497c9741D4116e7977k18177h0906F2460b48398E2567M15194d45750
$$ -282651 83497 -39741 44116 -57977 -276154 -80906 62460 -248398 52567 467761 -445750
10030i0903j43689A4876b43247o1888c5805j59706K0160h5069J5728A35952a31577
$$ -90903 -234592 14876 -243247 -305135 -35805 -195511 -175351 -85069 -69341 135952 -131577
10018f7412o908p8679B63845E0208R4023F1397b18514A70485j060I684f7279B37099
$$ -67412 -74320 -152999 263845 50208 144231 61397 -218514 170485 169425 9684 -67279 237099
10005A32771a50973j7045h1058j45910M2161B0831a22838A36976m0872d608j57067
$$ 132771 -150973 -168018 -81058 -226968 -184807 20831 -122838 136976 96104 -4608 -161675
9994a61675H7608f9614f318j18176m6106A39200a08628D166d07738J76128E4034
$$ -161675 87608 -69614 -6318 -124494 -170600 139200 -108628 4166 -407738 -231610 54034
9982b00750O8665A06460c48606f39j31548I8308b17989E9200Q7238b00997A78258
$$ -200750 -132085 106460 -348606 -639 -132187 98308 -217989 59200 146438 -200997 178258
9970B3434a34782j37937a00769k9457C54991b01191l8139A33702a14551n1534
$$ 23434 -134782 -272719 -100769 -130226 354991 -201191 -239330 133702 -114551 -166085
9960a66085A93408D8476c1508k88403R9507A32903E2651a2313l7670j1580A74592
$$ -166085 193408 48476 -31508 -319911 -220404 132903 52651 -12313 -49983 -61563 174592
9948A26982d13219a89127m1874b9266l55687a0223H0453J1289f41041A46598K8725
$$ 126982 -413219 -189127 -231001 -29266 -384953 -10223 80453 91742 -641041 146598 175323
9937A75323n837F1916c31554A8793J39658c5983K984k73223O2523J18253B76066
$$ 175323 169486 61916 -331554 18793 158451 -35983 -32999 -306222 -243699 -125446 276066
9925b27050A8000b64624A17844b01181J2735j09375i7144I0866a35411B67190
$$ -227050 18000 -264624 117844 -201181 -188446 -297821 -97144 90866 -135411 267190
9914A19616e1695b1459A92706b15438B29205b43666g3085B93823a86164q1150
$$ 119616 -51695 -21459 192706 -215438 229205 -243666 -73085 293823 -186164 -267314
9904b67314K8680r3985g1144C38801f2201A06052a17608e4845J4379I5840a98613
$$ -267314 -238634 -332619 -71144 338801 -62201 106052 -117608 -54845 -40466 95840 -198613
9892g9236A38412a53375A21121f5447k66870L4716J45797B1148J00554h7199m945
$$ -79236 138412 -153375 121121 -65447 -332317 -297601 -151804 21148 121702 -87199 -92144
9881i2144I2273c29290n9966D21341C5495b43440R5642A08499C0042c05550a09479
$$ -92144 92273 -329290 -389256 421341 35495 -243440 -147798 108499 30042 -305550 -109479
9869a08341B16488L0016a89758A75440b03021D869j534b88156C0128h8173A21733
$$ -108341 216488 246504 -189758 175440 -203021 4869 3335 -288156 30128 -88173 121733
9857a42623f2033K8424q2949G2726e1913j138I635b56213c663A80122G0662A0840
$$ -142623 -62033 -33609 -116558 72726 -51913 -53051 9635 -256213 -3663 180122 70662 10840
9844b64797a7561n3832l02891a6492A32072d2219C15715g537B5390M7244J936
$$ -264797 -17561 -71393 -374284 -16492 132072 -42219 315715 -7537 25390 72634 74570
9833G4570e3124k23939A11328h3067A68840p0516k7420J9598d09916p2031f132
$$ 74570 -53124 -277063 111328 -83067 168840 98324 70904 90502 -409916 -481947 -6132
9821e5775D3203a2047D6072Q0587d32382N8660A5775a22100o739j50007d0516
$$ -55775 43203 -12047 46072 126659 -432382 -373722 15775 -122100 -128839 -278846 -40516
9809c21131I8646I861K0094L6733b01065E6220a6032k07281L817D5260L5849b56059
$$ -321131 98646 9861 29955 66688 -201065 56220 -16032 -223313 -219496 45260 81109 -256059
9796d3057E9454L3604j4567J12908b76134a09835j47970O3233D7225b6449j16461
$$ -43057 59454 93058 78491 191399 -276134 -109835 -257805 -194572 47225 -26449 -142910
9785a42910C6366a2674j48870O8978q077F6887a04755k07356A23987C2075b14723
$$ -142910 36366 -12674 -161544 -92566 -100643 66887 -104755 -312111 123987 32075 -214723
9773f0344B552K33a76750K4412A25472a06141d8961m8249B0737b0912j17339j45748
$$ -60344 2552 2785 -176750 -152338 125472 -106141 -48961 -97210 20737 -20912 -138251 -283999
9761b83999G1627i6642m9697M1337j039k54628A96596K13272A37922o0723B2833
$$ -283999 71627 -96642 -146339 -105002 -106041 -360669 196596 409868 137922 77199 22833
9749a48657L0225A54173B8161g36910B00248q5882b12119J4111D8722b1241C2689
$$ -148657 -118432 154173 28161 -736910 200248 114366 -212119 -198008 48722 -21241 32689
9737B3536L4694g5926K0913j21038C8286q303b93867M9323I8976b82666f4827
$$ 23536 58230 -75926 -55013 -176051 38286 29983 -293867 -244544 98976 -282666 -64827
9725C9807L6296J09294p3006b09950B0408M9389c5350k60268O6523A70088b13271
$$ 39807 76103 185397 112391 -209950 20408 69797 -35350 -295618 -229095 170088 -213271
9713C1675d6607p4044a618j46645g2304A4152b47204B28483e15797A55342d08213
$$ 31675 -46607 -120651 -1618 -148263 -72304 14152 -247204 228483 -515797 155342 -408213
9701b78139A66159b17128o8252k3796a22191B13752b31170F5668c27552a29200
$$ -278139 166159 -217128 -285380 -309176 -122191 213752 -231170 65668 -327552 -129200
9690A252b10165j0323E4787c35048L2202B34654b20162G5252b53913a21208A00340
$$ 1252 -210165 -220488 54787 -335048 -302846 234654 -220162 75252 -253913 -121208 100340
9678g1006G7474c3609j29828B81711c48199A15814b69181J06709o190d0808q9608
$$ -71006 77474 -33609 -163437 281711 -348199 115814 -269181 -162472 -168662 -40808 -130416
9667a30416N5690o9523A87376C034c1857B65970f0025m7051j39063A31801Q025
$$ -130416 -74726 -144249 187376 3034 -31857 265970 -60025 -107076 -246139 131801 139826
9656A39826o0280a63260F8702K0344P5523b83587K7401j45796D8261c3016B14668
$$ 139826 79546 -163260 68702 89046 164569 -283587 -256186 -401982 48261 -33016 214668
9644b69838A5040a90857l4841B65800f0161D1238b39706J1807H3700b17531H8989
$$ -269838 15040 -190857 -225698 265800 -60161 41238 -239706 -227899 83700 -217531 88989
9632a22898n2638I890J28561e00868b20239c8589r008k99376a07069A43814c71158
$$ -122898 -175536 9890 138451 -500868 -220239 -38589 -47597 -346973 -107069 143814 -371158
9620a16880n4172D2544i3001n1517K8983c1748A01998R6252G4672R578e9179k9397
$$ -116880 -171052 42544 -93001 -144518 -115535 -31748 101998 198250 74672 84250 -59179 -88576
9608h8576H3714f3340F0642B4137Q9422D8499g4900J2750r0754l12819A35731
$$ -88576 83714 -63340 60642 24137 113559 48499 -74900 -62150 -152904 -465723 135731
9596f3902A26186O3325b71443b0427A83659n9064a84484M4790a730j0104j20144
$$ -63902 126186 189511 -271443 -20427 183659 124595 -184484 -139694 -1730 -11834 -131978
9585a31978e6330k55957I4875h3721G27K63557f0560k70865a3209C02191a22624
$$ -131978 -56330 -312287 94875 -83721 727 264284 -60560 -331425 -13209 302191 -122624
9573A28851a80427h1968r7729B0711b65155c4044j44425P9690M2997m02433A52628
$$ 128851 -180427 -81968 -179697 20711 -265155 -34044 -178469 -98779 -55782 -458215 152628
9561a41880k23036d075o8895m3892N1184k92572G7662G681c72270J02701p8240
$$ -141880 -364916 -4075 -72970 -116862 -65678 -358250 77662 7681 -372270 -269569 -347809
9550c47809j0349O5905M4822J22625r5429Q2363A97626G6820a54853o459A34954
$$ -347809 -358158 -292253 -247431 -124806 -220235 -137872 197626 76820 -154853 -161312 134954
9538F3708C0428f0590D4455a54334K9533C8918R6032b44535E0227d04233i8640
$$ 63708 30428 -60590 44455 -154334 -124801 38918 134950 -244535 50227 -404233 -98640
9526G8525b27040j71692D8222A6170J59470j1218a72829j38010C00312e12897
$$ 78525 -227040 -398732 48222 16170 175640 164422 -172829 -310839 300312 -512897
9515E7776e2251k92538A7843R4195f9701l3941j11132Q4673J3693l202B62525
$$ 57776 -52251 -344789 17843 112038 -69701 -103642 -214774 -130101 -116408 -119610 262525
9503a81422A9019i6595I3624b44898d2264J7479m82570a44864A36314b67211G2413
$$ -181422 19019 -96595 93624 -244898 -42264 -24785 -507355 -144864 136314 -267211 72413
9491e0311B1255Q9389J76310a76948A2109a873j01975b2139r5494A08799d1888
$$ -50311 21255 110644 286954 -176948 12109 -1873 -103848 -22139 -117633 108799 -41888
9479a16458I4630P4204b3220n3122I8937k447a05486D7752g8006J7157k38855
$$ -116458 94630 168834 -23220 -76342 98937 96490 -105486 47752 -78006 -60849 -299704
9468b99704d8971D3272b00404f1093A53124a25683C06036B8305a00025r0189R0999
$$ -299704 -48971 43272 -200404 -61093 153124 -125683 306036 28305 -100025 -190214 -99215
9457i9215j4552N5594k11007D1878O6712a15385J092l0756M0863A93711J02900
$$ -99215 -113767 -58173 -269180 41878 108590 -115385 -114293 -145049 -104186 193711 296611
9446B96611a16272M8232A28463C8704J54164H432d9601m5464m4355m4678C6848
$$ 296611 -116272 -68040 128463 38704 192868 8432 -49601 -95065 -139420 -184098 36848
9434A20977b78536E8284a9229n4795r5739e4968b2378k43339q004c133F3715b4260
$$ 120977 -278536 58284 -19229 -74024 -169763 -54968 -22378 -265717 -273721 -3133 63715 -24260
9421B69615N1861c25287g1122J3523p1586k8850c6178A04807b6362a0466j26186
$$ 269615 321476 -325287 -71122 -57599 -129185 -158035 -36178 104807 -26362 -10466 -136652
9410a36652j56754C9328b58642J02141B0460K0509b28835b9576j74606I4972a7950
$$ -136652 -293406 39328 -258642 -156501 20460 40969 -228835 -29576 -204182 94972 -17950
9398b24046I2712b47693J17397r1655m964a09023Q212a0825H5020k4159g5508
$$ -224046 92712 -247693 -130296 -221951 -226915 -109023 -100811 -10825 85020 60861 -75508
9386a28187p3091k2047B11567a54268M3314m2262F9552h7443F9026d8041B04216
$$ -128187 -201278 -223325 211567 -154268 -110954 -153216 69552 -87443 69026 -48041 204216
9374a05044A44851o0652d21001r586A1045b13693d258B38595b51454b9117j58379
$$ -105044 144851 84199 -421001 -430587 11045 -213693 -4258 238595 -251454 -29117 -187496
9363a87496M6498A62881d223j96580D4326a58974k8024i0931m00806B06553a18043
$$ -187496 -140998 162881 -4223 -200803 44326 -158974 -186998 -90931 -491737 206553 -118043
9351F3984c12020c3098j88958A13360a23385O0855k35040A12845a45998L7216
$$ 63984 -312020 -33098 -222056 113360 -123385 -62530 -297570 112845 -145998 -108782
9341a08782F459c7190k79700C04587b820l0824E0692j549h0008A35447a10574
$$ -108782 6459 -37190 -316890 304587 -2820 -33644 50692 49143 -80008 135447 -110574
9329g2322F328L9668b25772A15051H68b17091j07258a48956A5869P620c04643
$$ -72322 6328 45996 -225772 115051 868 -217091 -324349 -148956 15869 23489 -304643
9317c26446a43413a3654j27170C2737a3113j22548C88928G4251a27771c5061n9291
$$ -326446 -143413 -13654 -140824 32737 -13113 -135661 388928 74251 -127771 -35061 -94352
9306i4352j3712F7911J19653J42723a58933C00418g8326c6151j37922A26376J39896
$$ -94352 -108064 67911 187564 330287 -158933 300418 -78326 -36151 -174073 126376 266272
9295B66272H1997c0827k73240D73509b68199c9379B5617d1091l92275B21453c59732
$$ 266272 81997 -30827 -304067 473509 -268199 -39379 25617 -41091 -433366 221453 -359732
9283g1388A54033a87944N2658j51463B28715B3959a56216F9351a39867k6517L0141
$$ -71388 154033 -187944 -135286 -286749 228715 23959 -156216 69351 -139867 -166384 -136243
9272a36243j29281K4341H4664P1131C090c53621a02965B27882h6844a4990A24615
$$ -136243 -265524 -241183 84664 155795 3090 -353621 -102965 227882 -86844 -14990 124615
9260e4946H8461d68077A90756b3500j63957A55476a47083C4918b98707P8062R6757
$$ -54946 88461 -468077 190756 -23500 -187457 155476 -147083 34918 -298707 -220645 -123888
9249a23888P945A51891F0452j5818A04a14562I6368i9306c829B01137b41343J3233
$$ -123888 -115943 151891 60452 44634 104 -114562 96368 -99306 -3829 201137 -241343 -228110
9237b28110p3297P1062c4055C35964d6923j39090Q9406l9084d1974p9392q6124
$$ -228110 -301407 -230345 -34055 335964 -46923 -186013 -96607 -135691 -41974 -121366 -207490
9226b07490c2679m8883G3386L0372j358b27350G6789j0745b36392A69339e5534
$$ -207490 -32679 -81562 73386 103758 102400 -227350 76789 66044 -236392 169339 -55534
9214a27047a9454j33362r7992L5882B32465i2677C38499G6125g1208F8139a4352
$$ -127047 -19454 -152816 -250808 -214926 232465 -92677 338499 76125 -71208 68139 -14352
9202b10061k5107A28681e5297B34836J171f41630R6818G6272b06278c6039C64121
$$ -210061 -235168 128681 -55297 234836 236007 -641630 -544812 76272 -206278 -36039 364121
9190H6944k315a74278B41858j18903g1798B52927C6143J30807A0932c6916D06065
$$ 86944 84629 -174278 241858 122955 -71798 252927 36143 166950 10932 -36916 406065
9178e83960i6617A73018J06882j37445F2956a22718I7343K11715B2890L5228J48087
$$ -583960 -96617 173018 279900 142455 62956 -122718 97343 309058 22890 58118 206205
9167B06205b79581J30461F055b79966a38352o7245A38865a63790P1410A00237
$$ 206205 -279581 -149120 6055 -279966 -138352 -205597 138865 -163790 -92380 100237
9156D3878K38838c40926a34024A62983a95199k0621e214l37346a32182L8599A67516
$$ 43878 282716 -340926 -134024 162983 -195199 -215820 -5214 -342560 -132182 -93583 167516
9144a43199J7297e6028j7991j11554B64358d35827A96897b35067A00590c6574
$$ -143199 -125902 -56028 -74019 -185573 264358 -435827 196897 -235067 100590 -36574
9133a64115P2406B15928i8197B9725c69734A93498H0431b20273k34643A93183
$$ -164115 -91709 215928 -98197 29725 -369734 193498 80431 -220273 -454916 193183
9122e2345k7837f697q8349j31620i5387Q193p2429m72k23576h3437A183b52443
$$ -52345 -80182 -6697 -95046 -226666 -95387 -87194 -159623 -160095 -383671 -83437 1183 -252443
9109a28157e8690C2289b49066c3611B9597Q7777a85203l0579A66165i0885O650
$$ -128157 -58690 32289 -249066 -33611 29597 117374 -185203 -215782 166165 -90885 -84235
9098h4235j54631P7374j13552N2161N3325f1374E6160d8562A9701J68130F0624
$$ -84235 -238866 -161492 -275044 -222883 -169558 -61374 56160 -48562 19701 187831 60624
9086i2011G4587g6259k21836J42400B06752a15560K0893C0906c22502a10461k00555
$$ -92011 74587 -76259 -298095 -155695 206752 -115560 -94667 30906 -322502 -110461 -311016
9075c11016G4574k1918a50487d4408A23252b2906A8717M6111a95563P3053C43555
$$ -311016 74574 52656 -150487 -44408 123252 -22906 18717 64828 -195563 -122510 343555
9063g3710B5358J58007G1896i9464B32285c02776J50124n1583B35205j5120j09553
$$ -73710 25358 183365 71896 -99464 232285 -302776 -152652 -204235 235205 220085 110532
9052A10532K1812a7534k48241h7465m5757B59609A01348h2674K5814G2216a14589
$$ 110532 132344 -17534 -265775 -87465 -133222 259609 101348 -82674 -56860 72216 -114589
9040b9658j3473b0785A12991a89772i1117c1236A23846c79789a33710a1794j39803
$$ -29658 -43131 -20785 112991 -189772 -91117 -31236 123846 -379789 -133710 -11794 -151597
9029a51597j63986a25209A67199a52956j49529i5668J7114j1234r528A34867n2539
$$ -151597 -315583 -125209 167199 -152956 -302485 -95668 -78554 -89788 -99316 134867 82328
9018H2328c3213p6264L5350F0693c0884j9252I7502B5207a32998C0131h9969B00966
$$ 82328 -33213 -109477 -74127 60693 -30884 -50136 97502 25207 -132998 30131 -89969 200966
9005a28118A7214J231K6334a29989k6680B8463J64685a11107B05779E3763b56791
$$ -128118 17214 18445 44779 -129989 -156669 28463 193148 -111107 205779 53763 -256791
8993a40184d6484B00944a25093e4041j09893k48282G0108c28998Q5669J11991
$$ -140184 -46484 200944 -125093 -54041 -163934 -412216 70108 -328998 -243329 -131338
8983a31338l3574O7341B3776P3553a99693j25549I1726J68948c61967E4039d4741
$$ -131338 -164912 -97571 23776 97329 -199693 -325242 91726 260674 -361967 54039 -44741
8971G6380a04394F516a64806k7989F4317a23453b4204I4399c21169a43467f2506
$$ 76380 -104394 6516 -164806 -192795 64317 -123453 -24204 94399 -321169 -143467 -62506
8959b2437B83490A11709O367a05874H4100c30222B03218H9208e9229b7495C07901
$$ -22437 283490 111709 118076 -105874 84100 -330222 203218 89208 -59229 -27495 307901
8947a9108n1910j27098A98149a2716q3947I2795c6710k75908b9324G3653a42448
$$ -19108 -71018 -198116 198149 -12716 -96663 92795 -36710 -312618 -29324 73653 -142448
8935H5504J70219E5988O9290b71331a13980A43393E136R5837E957J48637R1006
$$ 85504 255723 55988 125278 -271331 -113980 143393 5136 100973 5957 154594 245600
8924B45600J60452K237848M400011k110768B132278G91769B53796M8467a90622
$$ 245600 406052 2643900 7043911 4933143 2132278 791769 253796 302263 -190622
8914b98346M3274I0165a09862A99510b68269A52755J96175a01062c1100H7845
$$ -298346 -255072 90165 -109862 199510 -268269 152755 348930 -101062 -31100 87845
8903b6373B8285J51240D7742c47905a11277a4711k17593e9251m7392a3946j90430
$$ -26373 28285 179525 47742 -347905 -111277 -14711 -232304 -59251 -106643 -13946 -204376
8892b04376P8613N1070r4721c7245j86770i0187A83366o1458C7430b31519B5734
$$ -204376 -125763 -74693 -169414 -37245 -224015 -90187 183366 121908 37430 -231519 25734
8880a1325l6794k5791B42776a17839A38251L3211L3722b90648A56254b70979f123
$$ -11325 -48119 -73910 242776 -117839 138251 171462 205184 -290648 156254 -270979 -6123
8868a56624b7690I5616e143k5319A9177d6417k10427a14122M7407B0941d2237
$$ -156624 -27690 95616 -5143 -30462 19177 -46417 -256844 -114122 -66715 20941 -42237
8856G3062b61177J12847A37589a67122G2570l2784A5197b30288a14155A0330d9379
$$ 73062 -261177 -148330 137589 -167122 72570 39786 15197 -230288 -114155 10330 -49379
8844A35021b28307N4916J3744B03285J11302a3091B8441c27960A32280a77953
$$ 135021 -228307 -173391 -159647 203285 314587 -13091 28441 -327960 132280 -177953
8833I6463d08491J53023N6694D2650a84479A41352a02431C1771e4962D5146g9550
$$ 96463 -408491 -255468 -198774 42650 -184479 141352 -102431 31771 -54962 45146 -79550
$$ [...]
##END NTUPLES=NMR SPECTRUM
##END=
