
##TITLE=AC1296_UGARS11108_6615178_16VFo8Pvjh
##JCAMPDX= 6.0         $$ Bruker NMR JCAMP-DX V2.0
##DATA TYPE= NMR SPECTRUM
##DATA CLASS= NTUPLES
##ORIGIN= BRUKER
##OWNER= Administrator
$$ 1.72 TOPSPIN		Version 2.1
$$ 2012-08-02 18:12:38.390 -0500  Administrator@TOPSPIN
$$ Compression mode = diff/dup
##.OBSERVE FREQUENCY= 400.02188249412
##.OBSERVE NUCLEUS= ^1H
##.ACQUISITION MODE= SIMULTANEOUS (DQD)
##.ACQUISITION SCHEME= undefined
##.AVERAGES= 8
##.DIGITISER RES= 22
##SPECTROMETER/DATA SYSTEM= spect
##.PULSE SEQUENCE= zg30
##.SOLVENT NAME= COFFEE_meoh
##.SHIFT REFERENCE= INTERNAL, COFFEE_meoh, 1, 14.98509
##AUDIT TRAIL= $$ (NUMBER, WHEN, WHO, WHERE, PROCESS, VERSION, WHAT)
$$ ##TITLE= Audit trail, TOPSPIN		Version 2.1
$$ ##JCAMPDX= 5.01
$$ ##ORIGIN= Bruker BioSpin GmbH
$$ ##OWNER= Administrator
$$ $$ C:\Bruker\TOPSPIN/data/COFFEE/nmr/AC1296_UGARS11108_6615178_16VFo8Pvjh/10/pdata/1/auditp.txt
$$ ##AUDIT TRAIL=  $$ (NUMBER, WHEN, WHO, WHERE, PROCESS, VERSION, WHAT)
(   1,<2012-08-02 18:12:31.437 -0500>,<Administrator>,<TOPSPIN>,<go>,<TOPSPIN 2.1>,
      <created by zg
	started at 2012-08-02 18:11:24.859 -0500,
	POWCHK enabled, PULCHK disabled,
       configuration hash MD5:
       6B 1B 68 BB D9 2E 58 E2 7F 35 AD 54 07 DF 0E 41
       data hash MD5: 64K
       22 30 39 F7 17 90 C3 85 34 34 96 C4 D1 4D C8 EB>)
(   2,<2012-08-02 18:12:34.218 -0500>,<Administrator>,<TOPSPIN>,<proc1d>,<TOPSPIN 2.1>,
      <Start of raw data processing
       efp LB = 0 FT_mod = 6 PKNL = 1 PHC0 = 0 PHC1 = 0 SI = 32K 
       data hash MD5: 32K
       D4 03 74 B7 D3 6A E0 46 08 8E 50 C8 62 86 A0 82>)
(   3,<2012-08-02 18:12:34.640 -0500>,<Administrator>,<TOPSPIN>,<proc1d>,<TOPSPIN 2.1>,
      <pk PHC0 = 180.8185 PHC1 = 0 
       data hash MD5: 32K
       78 75 02 C7 EC 0F 63 2B 40 C0 F0 09 09 2B 84 6D>)
(   4,<2012-08-02 18:12:34.812 -0500>,<Administrator>,<TOPSPIN>,<proc1d>,<TOPSPIN 2.1>,
      <abs ABSG = 1 
       data hash MD5: 32K
       00 34 11 82 EC 94 B9 42 BE 0A 78 7E 4D A3 B6 4B>)
(   5,<2012-08-02 18:12:34.859 -0500>,<Administrator>,<TOPSPIN>,<proc1d>,<TOPSPIN 2.1>,
      <abs ABSG = 2 
       data hash MD5: 32K
       50 8D 7C CE B1 99 27 67 E0 CB 0B 4C 42 B6 E6 EB>)
(   6,<2012-08-02 18:12:34.890 -0500>,<Administrator>,<TOPSPIN>,<proc1d>,<TOPSPIN 2.1>,
      <abs ABSG = 3 
       data hash MD5: 32K
       37 F4 57 3A AB 8F 07 F9 5E AD 3B AD AF 1F F6 56>)
(   7,<2012-08-02 18:12:34.906 -0500>,<Administrator>,<TOPSPIN>,<proc1d>,<TOPSPIN 2.1>,
      <abs ABSG = 4 
       data hash MD5: 32K
       C6 05 60 5C 53 2A 88 F1 68 43 72 C3 31 E3 4A 21>)
(   8,<2012-08-02 18:12:34.937 -0500>,<Administrator>,<TOPSPIN>,<proc1d>,<TOPSPIN 2.1>,
      <abs ABSG = 5 
       data hash MD5: 32K
       28 E0 AE 4D 13 F9 19 CC 86 C0 2A 01 35 C5 21 70>)
$$ ##END=
$$ 
$$ $$ hash MD5
$$ $$ 60 06 9C 3C 5F 17 04 29 56 0D 1A 82 AF 36 0F 0F
##$RELAX= 
##$RELAX= 
##$RELAX= 
##$RELAX= 
##$RELAX= 
##$RELAX= 
##$RELAX= 
$$ Bruker specific parameters
$$ --------------------------
$$ [...]
##$TP= (0..7)
150 150 150 150 150 150 150 150
##$TP07= 0
##$TPNAME0= <>
##$TPNAME1= <>
##$TPNAME2= <>
##$TPNAME3= <>
##$TPNAME4= <>
##$TPNAME5= <>
##$TPNAME6= <>
##$TPNAME7= <>
##$TPOAL= (0..7)
0.5 0.5 0.5 0.5 0.5 0.5 0.5 0.5
##$TPOFFS= (0..7)
0 0 0 0 0 0 0 0
##$TUNHIN= 0
##$TUNHOUT= 0
##$TUNXOUT= 0
##$USERA1= <user>
##$USERA2= <user>
##$USERA3= <user>
##$USERA4= <user>
##$USERA5= <user>
##$V9= 5
##$VALIST= <valist>
##$VCLIST= <CCCCCCCCCCCCCCC>
##$VD= 0
##$VDLIST= <DDDDDDDDDDDDDDD>
##$VPLIST= <PPPPPPPPPPPPPPP>
##$VTLIST= <TTTTTTTTTTTTTTT>
##$WBST= 1024
##$WBSW= 4
##$XGAIN= (0..3)
0 0 0 0
##$XL= 0
##$YL= 0
##$YMAX_a= 490088
##$YMIN_a= -639355
##$ZGOPTNS= <>
##$ZL1= 120
##$ZL2= 120
##$ZL3= 120
##$ZL4= 120
##$ABSF1= 14.98509
##$ABSF2= -5.573092
##$ABSG= 5
##$ABSL= 3
##$ALPHA= 0
##$AQORDER= 0
##$ASSFAC= 0
##$ASSFACI= 0
##$ASSFACX= 0
##$ASSWID= 0
##$AUNMP= <proc_prof1d_extract_pilot.lims>
##$AXLEFT= 0
##$AXNAME= <>
##$AXNUC= <1H>
##$AXRIGHT= 0
##$AXTYPE= 0
##$AXUNIT= <>
##$AZFE= 0.1
##$AZFW= 0.1
##$BCFW= 0
##$BC_mod= 0
##$BYTORDP= 0
##$COROFFS= 0
##$CY= 15
##$DATMOD= 1
##$DC= 0
##$DFILT= <>
##$DTYPP= 0
##$F1P= 0
##$F2P= 0
##$FCOR= 0.5
##$FTSIZE= 32768
##$FT_mod= 6
##$GAMMA= 0
##$GB= 0
##$INTBC= 1
##$INTSCL= 1
##$ISEN= 128
##$LB= 0
##$LEV0= 0
##$LPBIN= 0
##$MAXI= 10000
##$MC2= 0
##$MEAN= 0
##$ME_mod= 0
##$MI= 0
##$NCOEF= 0
##$NC_proc= -8
##$NLEV= 6
##$NOISF1= 0
##$NOISF2= 0
##$NSP= 0
##$NTH_PI= 0
##$NZP= 0
##$OFFSET= 14.98509
##$PC= 1
##$PHC0= 180.8185
##$PHC1= 0
##$PH_mod= 1
##$PKNL= yes
##$PPARMOD= 0
##$PPDIAG= 0
##$PPIPTYP= 0
##$PPMPNUM= 2147483647
##$PPRESOL= 1
##$PSCAL= 4
##$PSIGN= 0
##$PYNMP= <proc.py>
##$REVERSE= no
##$SF= 400.02
##$SI= 32768
##$SIGF1= 0
##$SIGF2= 0
##$SINO= 400
##$SIOLD= 32768
##$SPECTYP= <>
##$SREGLST= <1H.CDCl3>
##$SSB= 0
##$STSI= 32768
##$STSR= 0
##$SW_p= 8223.68421052631
##$SYMM= 0
##$S_DEV= 0
##$TDeff= 65536
##$TDoff= 0
##$TI= <>
##$TILT= no
##$TM1= 0
##$TM2= 0
##$TOPLEV= 0
##$USERP1= <user>
##$USERP2= <user>
##$USERP3= <user>
##$USERP4= <user>
##$USERP5= <user>
##$WDW= 1
##$XDIM= 32768
##$YMAX_p= 459836492
##$YMIN_p= -723173
##$CURPLOT= <Network HP LaserJet P1505>
##$CURPRIN= <$Network HP LaserJet P1505>
##$DFORMAT= <normdp>
##$LAYOUT= <+/1D_H.xwp>
##$LFORMAT= <normlp>
##$PFORMAT= <normpl>
##$SURQMSG= 1
$$ End of Bruker specific parameters
$$ ---------------------------------
##NTUPLES= NMR SPECTRUM
##VAR_NAME=  FREQUENCY,     SPECTRUM/REAL,   SPECTRUM/IMAG
##SYMBOL=    X,             R,               I
##VAR_TYPE=  INDEPENDENT,   DEPENDENT,       DEPENDENT
##VAR_FORM=  AFFN,          ASDF,            ASDF
##VAR_DIM=   32768,         32768,           32768
##UNITS=     HZ,            ARBITRARY UNITS, ARBITRARY UNITS
##FACTOR=    0.250966925370066, 1,           1
##FIRST=     8223.43324360094, 20185,        60857
##LAST=      0,             -146261,         3636
##MIN=       0,             -723173,         0
##MAX=       8223.43324360094, 459836492,    0
$$ Real data points
##PAGE= N=1
##DATA TABLE= (X++(R..R)), XYDATA
$$ [...]
19490b28980a74j69470g7068O87E0698a76334c9153l75378a5835a717A91899h6024
$$ -228980 -174 -169644 -77068 -76381 50698 -176334 -39153 -414531 -15835 -1717 191899 -86024
19477h6780r6436d9230k01742A04512c02376J47200k8114m1833k74961a31242
$$ -86780 -183216 -49230 -250972 104512 -302376 -155176 -183290 -225123 -500084 -131242
19466b16742R4786L7185C7824d1187j43924m6864r8265J46419m8753l34198e1469
$$ -216742 -121956 -84771 37824 -41187 -185111 -231975 -330240 -183821 -232574 -566772 -51469
19454A87220A4865b4690E7965c6536j75349B57899g7565j60981N1773A89618a14345
$$ 187220 14865 -24690 57965 -36536 -211885 257899 -77565 -238546 -186773 189618 -114345
19442A28849l4725a88739e2855I5654a11199A09056r892b36472C93198i7787j44800
$$ 128849 94124 -188739 -52855 95654 -111199 109056 99164 -236472 393198 -97787 -242587
19431b42587A26817l7220a66178K3627j92887a45221A34728a50761j28354h8072
$$ -242587 126817 89597 -166178 -142551 -335438 -145221 134728 -150761 -279115 -88072
19420g5266K5458l8027j42743G6237a79363C5036g9560j66185a574j53222P3034
$$ -75266 -49808 -87835 -230578 76237 -179363 35036 -79560 -245745 -1574 -154796 -81762
19409h1762L3064j37259e276D6839d19295B99743c6101B18619c96444a9766n9458
$$ -81762 -48698 -185957 -5276 46839 -419295 299743 -36101 218619 -396444 -19766 -79224
19398g9224q7369B33645n2354b03712P4653m5677h5479L8293o1171A99925J10749
$$ -79224 -166593 233645 181291 -203712 -129059 -174736 -85479 -47186 -108357 199925 310674
19387C10674A050b73314f9239A93344D2465a63751A44420e8154B7358L25562a57354
$$ 310674 1050 -273314 -69239 193344 42465 -163751 144420 -58154 27358 352920 -157354
19375A65217b88323A93247b17280a5267A74760C5808g7238E402h577j57944l9835
$$ 165217 -288323 193247 -217280 -15267 174760 35808 -77238 5402 -8577 -166521 -206356
19364b06356A50639i993o3659j09304d3950Q502r2074A59924a61078j0711E1602
$$ -206356 150639 -9993 -73652 -182956 -43950 -35448 -127522 159924 -161078 -171789 51602
19352D4916J480b35319d421A08686e000k10340K5374G7615C780R8481h7089j4784
$$ 44916 46396 -235319 -4421 108686 -5000 -215340 -189966 77615 3780 102261 -87089 -101873
19340a01873K9162j90350A32509M6881b95579A48214b00548G4769a00153c6334
$$ -101873 -72711 -263061 132509 179390 -295579 148214 -200548 74769 -100153 -36334
19329B65406b26067j01032B734a75199J9916L5987j06472i9389R570a8820r1478
$$ 265406 -226067 -327099 2734 -175199 -155283 -119296 -225768 -99389 -89819 -18820 -110298
19318a10298F9096i740A39934D9890b56344N9485g5412D5423g7136a510o6970
$$ -110298 69096 -9740 139934 49890 -256344 -196859 -75412 45423 -77136 -1510 -68480
19307f8480C8976c18367B149N0571b63790A48322a89299e9509I9120h2147C41157
$$ -68480 38976 -318367 2149 52720 -263790 148322 -189299 -59509 99120 -82147 341157
19295A68661J4538a66542q3264D8121b68152d8733o6971K0100c5140p8113A6988
$$ 168661 183199 -166542 -249806 48121 -268152 -48733 -115704 -95604 -35140 -113253 16988
19283a45372j2038j49736a27929D35a58013B4141h4052k1696f483k27713A62707
$$ -145372 -157410 -307146 -127929 435 -158013 24141 -84052 -105748 -6483 -234196 162707
19271G4960a65207a2368m92011J13232A37729J60570A17288e02326A9869c14362
$$ 74960 -165207 -12368 -504379 -391147 137729 298299 117288 -502326 19869 -314362
19260G1236a98112G941b35049j04558q140J38569I380c3903k90967q0485A5277
$$ 71236 -198112 7941 -235049 -339607 -347747 -209178 9380 -33903 -324870 -405355 15277
19248c93822D5641J53809c31765J26991E1952b46835J19050f0528F3338d28529
$$ -393822 45641 199450 -331765 -204774 51952 -246835 -127785 -60528 63338 -428529
19237A34793a78142C518a24593j46168a7144k10959g3068C4123d60915O459b15447
$$ 134793 -178142 3518 -124593 -270761 -17144 -228103 -73068 34123 -460915 -454456 -215447
19225a66907J3474j3605k77301c2023j29428l7242g8775E5289i2795K852l3003
$$ -166907 -153433 -167038 -444339 -32023 -161451 -198693 -78775 55289 -92795 -89943 -122946
19214a22946k6599r3316B9496i8960L0508J8728k02265B74055d41313C5219b22444
$$ -122946 -149545 -242861 29496 -98960 -68452 -49724 -251989 274055 -441313 35219 -222444
19202a85944A02897J33435d3484k02395C61179c81014h6185E5764c13474N0130
$$ -185944 102897 236332 -43484 -245879 361179 -381014 -86185 55764 -313474 -263344
19192b63344e6866j40247d7601C74683a45819B9066a86223j5706A23612e2779
$$ -263344 -56866 -197113 -47601 374683 -145819 29066 -186223 -201929 123612 -52779
19181B38456j14226J05366c26661a28858A9221b12623R6309b1454k94226a04665
$$ 238456 124230 229596 -326661 -128858 19221 -212623 -116314 -21454 -315680 -104665
19170E3565c62054B04679K6091g2236k15717i3820D5339e6657B7548J26710c35690
$$ 53565 -362054 204679 230770 -72236 -287953 -93820 45339 -56657 27548 154258 -335690
19158b20488E2960J5030c9118A93857a70149c2317k32981G5878J96290c60274
$$ -220488 52960 67990 -39118 193857 -170149 -32317 -265298 75878 272168 -360274
19147a72453A16911b72075I4175a60579A36788b03614E6700d5747D13174j9950
$$ -172453 116911 -272075 94175 -160579 136788 -203614 56700 -45747 413174 393224
19137C93224i6626m3778a0505m62261B53414f6453a4390A09096a23116j97275
$$ 393224 -96626 -140404 -10505 -472766 253414 -66453 -14390 109096 -123116 -320391
19127c20391H5987d0499G3956Q6223a5186e831B04989I142a29669E4423a74441
$$ -320391 85987 -40499 73956 160179 -15186 -5831 204989 9142 -129669 54423 -174441
19115b03404C2549o17J56358B1829L0323a06406j6686E1429J60606J40242I1643
$$ -203404 32549 31932 188290 21829 52152 -106406 -123092 51429 212035 352277 91643
19103B2633J21729O1624h0095q6654O0171j86472G347i3982r9251B09306P2757
$$ 22633 144362 205986 -80095 -166749 -106578 -293050 7347 -93982 -193233 209306 282063
19092B82063I8541b45394L5207g3072k15703k1577J5593A40944d3735a5689n6109
$$ 282063 98541 -245394 -210187 -73072 -288775 -310352 -294759 140944 -43735 -15689 -71798
19081g1798j56778a0349o7472A44654D1926b78789i7444l1498j95053J48726h081
$$ -71798 -228576 -10349 -77821 144654 41926 -278789 -97444 -128942 -323995 -175269 -8081
19069b23447C04326I5720b00109C09079E074K52511h818B75094E9658P5048a63449
$$ -223447 304326 95720 -200109 309079 5074 257585 -8818 275094 59658 134706 -163449
19057D6386a43368B15650p9767b09823j7431n0102k3066J37850C10867b42609
$$ 46386 -143368 215650 135883 -209823 -227254 -277356 -300422 -162572 310867 -242609
19046h5545b4589B0083K04079m2318B0039c11153e4081k81085C43622A29698a50055
$$ -85545 -24589 20083 224162 181844 20039 -311153 -54081 -335166 343622 129698 -150055
19034a87564H7718a50920o7408f0477k02934a23896A70835b07798f3945A64104
$$ -187564 87718 -150920 -218328 -60477 -263411 -123896 170835 -207798 -63945 164104
19023a74935g4808B8480R5487a42042b8846E5331c25874k80086b63144A64989
$$ -174935 -74808 28480 123967 -142042 -28846 55331 -325874 -605960 -263144 164989
19012g1015A32977a15408C4408o363M2803B4064J38533e7871A85258c88412i4171
$$ -71015 132977 -115408 34408 28045 70848 24064 162597 -57871 185258 -388412 -94171
19000f4927a3114B0766b10075A4472J01846M20838A53805E6562g8947D5316b08874
$$ -64927 -13114 20766 -210075 14472 116318 537156 153805 56562 -78947 45316 -208874
18988A78519E6078A3443a00976G7919J71664D0606i5619D9288a93797B8701J70773
$$ 178519 56078 13443 -100976 77919 249583 40606 -95619 49288 -193797 28701 199474
18977A99474P4713f1560j1990k07894A11926a79439j40097P9848c3380j09235
$$ 199474 274187 -61560 -73550 -281444 111926 -179439 -319536 -239688 -33380 -142615
18967a42615A85691b06644A05209n0409N0958a6518q7806A90004K15485L40934
$$ -142615 185691 -206644 105209 54800 105758 -16518 -104324 190004 405489 746423
18957G46423A40673n2589a08256N2786H6846J08070C224R7934i9693j90834I5964
$$ 746423 140673 88084 -108256 -55470 86846 194916 3224 101158 -99693 -290527 95964
18945B26247A4355J9980b14478J9114F9220A6696a04579c5487j37738Q0322A47857
$$ 226247 14355 34335 -214478 -195364 69220 16696 -104579 -35487 -173225 -92903 147857
18933C50635F2347b20842C26470b5862A86823a88080E2809a7437n6216j7992H0466
$$ 350635 62347 -220842 326470 -25862 186823 -188080 52809 -17437 -73653 -91645 80466
18921A40938o6605a60371c9626k2152p5668L4173l2833A00102A0094Q0786a23286
$$ 140938 74333 -160371 -39626 -61778 -137446 -103273 -136106 100102 10094 90880 -123286
18909c70992J16252J14598n24D4092b18021B95105b81942N1058A23196g7893A80505
$$ -370992 -254740 -140142 -140666 44092 -218021 295105 -281942 -230884 123196 -77893 180505
18897b7120m798E35847J14708j55019j98871A41604F583a25690b4727A42966M7618
$$ -27120 -31918 535847 650555 495536 296665 141604 6583 -125690 -24727 142966 190584
18886A90584F5433c77035a43117j24631a8688F5028P2610E4384b8443k80844D2330
$$ 190584 65433 -377035 -143117 -267748 -18688 65028 137638 54384 -28443 -309287 42330
18874A62371k6052f8393E5309f1198l89770a69758r6063J28670E5063e2373J3808
$$ 162371 136319 -68393 55309 -61198 -450968 -169758 -265821 -137151 55063 -52373 -38565
18863c8565n0825E8693L1949K0904b8805j83161N0882j56268f6447r1146H1242
$$ -38565 -89390 58693 90642 111546 -28805 -211966 -161084 -317352 -66447 -157593 81242
18851a63747d4263D46824C4548e6802n4679q1716D2360g5166r0774g4809L2503
$$ -163747 -44263 446824 34548 -56802 -111481 -193197 42360 -75166 -165940 -74809 -42306
18840d2306I1373A3962f1099j62161A28924N3859a97432G9192b88694B34937c13052
$$ -42306 91373 13962 -61099 -223260 128924 182783 -197432 79192 -288694 234937 -313052
18828b51227f4833A30921a19440O542c060D654i2575n0925L1648e3359a3382l05325
$$ -251227 -64833 130921 -119440 -112898 -3060 4654 -92575 -143500 -111852 -53359 -13382 -318707
18816c18707d8617k35F0367b1492j77420A9829J61381j327p3737a19274L4629
$$ -318707 -48617 -48852 60367 -21492 -198912 19829 181210 179883 106146 -119274 -84645
18805h4645H2678A9954c00706A5908b27200i2183K3739A08660g5553K5720K2936
$$ -84645 82678 19954 -300706 15908 -227200 -92183 -68444 108660 -75553 -49833 -26897
18794b6897F2137M04295a95204f7291F2793B9578N8727i6088I8815j8833g9341
$$ -26897 62137 466432 -195204 -67291 62793 29578 88305 -96088 98815 79982 -79341
18782B272e5081B26155r351a81650L2566a3661q1584p0677A07896j4197d9990
$$ 2272 -55081 226155 216804 -181650 -149084 -13661 -95245 -165922 107896 93699 -49990
18770F1826b29490G3203a04123o5997A3c35668B04603c58672A09507a47819j64049
$$ 61826 -229490 73203 -104123 -170120 13 -335668 204603 -358672 109507 -147819 -311868
18759c11868F3434b04354E1087b19635j26997B24547d60642i8806o8716J6700
$$ -311868 63434 -204354 51087 -219635 -346632 224547 -460642 -98806 -167522 -150822
18749a50822A7091g4013d758j42076l8380G0592b15793c775B66028e41493K48204
$$ -150822 17091 -74013 -4758 -146834 -185214 70592 -215793 -3775 266028 -541493 -293289
18738b93289n1407h4748G5280R7169c63843d9290C20925j25000H1912f7020F3609
$$ -293289 -344696 -84748 75280 172449 -363843 -49290 320925 195925 81912 -67020 63609
18726F5388c49374b2510j70708B70981a98816B67176l7587h6275A4211a56690
$$ 65388 -349374 -22510 -193218 270981 -198816 267176 229589 -86275 14211 -156690
18715A5300b93083i5255j23852a5928B22132g7248D2142a54858A33517a4845k14178
$$ 15300 -293083 -95255 -219107 -15928 222132 -77248 42142 -154858 133517 -14845 -229023
18704b29023f2121l81594Q4128H0836K8792a14369e0013n6582C8519c14425H0638
$$ -229023 -62121 -443715 -359587 80836 109628 -114369 -50013 -106595 38519 -314425 80638
18692f3548B6045K5317b85205G2330N8506b70612C850K20768D2875g97k80094
$$ -63548 26045 51362 -285205 72330 130836 -270612 3850 224618 42875 -797 -280891
18681b80891n0279J35522q3639R7720g5336q6942I3108N8241E1922b37317m6233
$$ -280891 -331170 -195648 -279287 -181567 -75336 -162278 93108 151349 51922 -237317 -283550
18670b83550d7188j8555l1729A70331a52712B27200A0022b74216a21212a4589
$$ -283550 -47188 -65743 -97472 170331 -152712 227200 10022 -274216 -121212 -14589
18659g6032j5203j45897b5230F1810N1032d10582a29205m2041j26387E5578J12617
$$ -76032 -91235 -237132 -25230 61810 112842 -410582 -129205 -171246 -297633 55578 168195
18648A68195b36168q8143L2153M0601q2207D5445a26663j32482k725L3746K9663
$$ 168195 -236168 -324311 -292158 -251557 -333764 45445 -126663 -259145 -261870 -228124 -198461
18637a98461i0074j46845A66581E4168i1242d0609j59762a4681D8737q303d24387
$$ -198461 -90074 -236919 166581 54168 -91242 -40609 -200371 -14681 48737 40434 -424387
18625a8989a852l93739E5770d60372B1843a49691A70846C2470M1796b39841L0519
$$ -18989 -1852 -395591 55770 -460372 21843 -149691 170846 32470 74266 -239841 -209322
18614b09322B2043d9690Q166C9608L2510c04115J0511d824G3963j0894e7721I5339
$$ -209322 22043 -49690 -41524 39608 72118 -304115 -293604 -4824 73963 63069 -57721 95339
18601a72441A61274j2025M78001a09597q4765m4064C7730a73130q5022b0804Q423
$$ -172441 161274 149249 627250 -109597 -194362 -238426 37730 -173130 -258152 -20804 -12381
18590a2381F9634c7082j41076A43903a38590k64546a00600A0698O6793a23939
$$ -12381 69634 -37082 -178158 143903 -138590 -403136 -100600 10698 77491 -123939
18579c45825j134e4977B20962c79131a87588B1410d3141A3278h4543B07563a08367
$$ -345825 -346959 -54977 220962 -379131 -187588 21410 -43141 13278 -84543 207563 -108367
18567f03163e0280a4240j76026f5700j64850O0309A89132f5862q7578A58699a45445
$$ -603163 -50280 -14240 -190266 -65700 -230550 -170241 189132 -65862 -153440 158699 -145445
18555H0156C6051a7342B53935m3920a0559A10301J48740F0983d69358a44685E9202
$$ 80156 36051 -17342 253935 210015 -10559 110301 259041 60983 -469358 -144685 59202
18543E5949a93340j81170Q7125M1765q9751A25526b058D5763P060b05131a02300
$$ 55949 -193340 -374510 -287385 -245620 -335371 125526 -2058 45763 52823 -205131 -102300
18531a07132B76364i29o400B18715a18114k31039a7773C19014j52755c13082d3356
$$ -107132 276364 -929 -7329 218715 -118114 -349153 -17773 319014 166259 -313082 -43356
18519g4263C8696N2434a20812A93328M7433e6668q9828j15214a22386m198m9553
$$ -74263 38696 91130 -120812 193328 240761 -56668 -146496 -261710 -122386 -126584 -176137
18508a76137M4267k86885D0262J25212a5242l71285D8631d74382D1897j4861a00424
$$ -176137 -131870 -418755 40262 165474 -15242 -386527 48631 -474382 41897 27036 -100424
18496A65726b35944f4682A4622J11969L5921a66897l0126Q7293A54546f3508H6008
$$ 165726 -235944 -64682 14622 126591 162512 -166897 -197023 -109730 154546 -63508 86008
18484b16108d8711J6059j36004F1276b29999b9479A92635a24238J0917a1699A77780
$$ -216108 -48711 -32652 -168656 61276 -229999 -29479 192635 -124238 -113321 -11699 177780
18472B58301G4142f4407n7624N2800A06518e9700k30449A08652b15812r3121A59226
$$ 258301 74142 -64407 -122031 -69231 106518 -59700 -290149 108652 -215812 -308933 159226
18460i8170q372j18895e0411I1761i5454a5799A26319D7249a47677e0452A16485
$$ -98170 -106542 -225437 -50411 91761 -95454 -15799 126319 47249 -147677 -50452 116485
18448b94069j21j12100B09726Q9470j00168A6386a37726O5531m3426C08987a6484
$$ -294069 -294190 -406290 209726 299196 199028 16386 -137726 -72195 -115621 308987 -16484
18436g9805B9843Q5713a42329I7577a47785j12393B06895a53767D3714e02863
$$ -79805 29843 115556 -142329 97577 -147785 -260178 206895 -153767 43714 -502863
18425A71801c9494E3093P9302E4358i9228E6907L23468a65626p6580g2131a2498
$$ 171801 -39494 53093 132395 54358 -99228 56907 380375 -165626 -242206 -72131 -12498
18413I722M006f8526F2019b61409J9911L35l843n2789E8779a53871M5243j59686
$$ 9722 13728 -68526 62019 -261409 -241498 -241163 -245006 -297795 58779 -153871 -108628 -268314
18401b68314A99202a37881k12822I5670J082c2398j6552B7102j2459a69676j62296
$$ -268314 199202 -137881 -350703 95670 96752 -32398 -48950 27102 14643 -169676 -331972
18390c31972A78614c44586A32446a18459k32707e2236A64699c21846a32565j4761
$$ -331972 178614 -344586 132446 -118459 -351166 -52236 164699 -321846 -132565 -147326
18380a47326D3517i3230p0097n4864j80427A4500a25729A17816c38095A9899a57565
$$ -147326 43517 -93230 -163327 -218191 -398618 14500 -125729 117816 -338095 19899 -157565
18368A51240E7396a43303F0027c06042f7367j12993j9487C13556b13017A18205
$$ 151240 57396 -143303 60027 -306042 -67367 -180360 -199847 313556 -213017 118205
18357a85799Q0439D14726I9505J71376b17966C1025M5950N4378n2249c4888k2174
$$ -185799 -105360 414726 99505 270881 -217966 31025 76975 131353 79104 -34888 -57062
18346e7062A08471K1585E4903a05056I1537b36804h4194c0332A51788R1860j13337
$$ -57062 108471 130056 54903 -105056 91537 -236804 -84194 -30332 151788 243648 130311
18335A30311b16508A1580a04298C8044J11146i7722j14637A96638a01698M3261
$$ 130311 -216508 11580 -104298 38044 149190 -97722 -212359 196638 -101698 -58437
18325e8437m2471D4380g2623b2762j49490a1785q7021L160j53232f4797I8809
$$ -58437 -100908 44380 -72623 -22762 -172252 -11785 -98806 -95646 -248878 -64797 98809
18313a76098G200J01496C2396O3837a08220q4144A29079f2728A07558a31859M6412
$$ -176098 7200 108696 32396 96233 -108220 -192364 129079 -62728 107558 -131859 -85447
18302h5447A59024a06366n7732j5846F8177J23861E8639i7141j54853O1284A98267
$$ -85447 159024 -106366 -164098 -179944 68177 192038 58639 -97141 -251994 -190710 198267
18290e4839B57229a59274j45007J42269A72710a446C17139j50096l8474c8048
$$ -54839 257229 -159274 -304281 -162012 172710 -1446 317139 167043 128569 -38048
18279C8682a01177A33191O2596a68819K1128a6278A27747c95255A37340i7675
$$ 38682 -101177 133191 195787 -168819 -147691 -16278 127747 -395255 137340 -97675
18268a46887A88894c02385D7780K47566A14777J71341c5594B0571b43912F4820
$$ -146887 188894 -302385 47780 295346 114777 286118 -35594 20571 -243912 64820
18257a00632k92073a50081j05866f918A22471a8648j5763l41381M2307H9583a00379
$$ -100632 -392705 -150081 -255947 -6918 122471 -18648 -34411 -375792 -333485 89583 -100379
18245d69916e2932A2141a85295e4201H1136a83916L1272b8663p8875A78925a27913
$$ -469916 -52932 12141 -185295 -54201 81136 -183916 -152644 -28663 -107538 178925 -127913
18233b11675J9834N1210L9781L0105K0442j80923I5022K52161g7560k1153n8982
$$ -211675 -191841 -140631 -100850 -70745 -50303 -231226 95022 347183 -77560 -98713 -157695
18222a57695P5444B22358i5180B34345a65127I1628C9422b16261b8591J4294G1918
$$ -157695 -82251 222358 -95180 234345 -165127 91628 39422 -216261 -28591 -14297 71918
18210A40810J26478a52376j93246B73737f286j42085M636j79985A3043a38008
$$ 140810 267288 -152376 -345622 273737 -6286 -148371 -143735 -323720 13043 -138008
18199b67407H7379b29798A81885n7585a39746J2216n0200d8465A24727P4696D7846
$$ -267407 87379 -229798 181885 124300 -139746 -127530 -177730 -48465 124727 199423 47846
18187C98037a79173n1241K1641n435a1419F657L08277i8272D04443H5842a29664
$$ 398037 -179173 -230414 -208773 -214208 -11419 6657 314934 -98272 404443 85842 -129664
18175i7815A58973a36807B7790i5387A60355n1474J79172a50812n5785A46569
$$ -97815 158973 -136807 27790 -95387 160355 108881 288053 -150812 -206597 146569
18164C15294a73725B08925b11627C8171a63501D34Q7756a1203A54660a8101B31978
$$ 315294 -173725 208925 -211627 38171 -163501 434 88190 -11203 154660 -18101 231978
18152b85582A00896a19k03369A9196b03472F860b01384A26170l684b55441c3038
$$ -285582 100896 -119 -203488 19196 -203472 6860 -201384 126170 122486 -255441 -33038
18140F8306R9871j474d8056A3640c07793F3400K63688a30077d0417j31834H1024
$$ 68306 168177 166703 -48056 13640 -307793 63400 327088 -130077 -40417 -172251 81024
18128a29443b7560k17446K3589g20l43984J13602e3200q7033A56869M1693n7716
$$ -129443 -27560 -245006 -221417 -720 -344704 -231102 -53200 -140233 156869 198562 140846
18117A40846a10190B39875k0556K67112b57490F9229h9490j58577P3437j72051
$$ 140846 -110190 239875 219319 486431 -257490 69229 -89490 -248067 -174630 -346681
18107c46681f7741L2434J1271O720m1940A80411J02561P41g4148j43490f260n0005
$$ -346681 -67741 -35307 -24036 -17316 -59256 180411 282972 283713 -74148 -217638 -6260 -56265
18095e6265l2106j50498O1600B72399a31245k4385B45229A12060K0156j4878L4384
$$ -56265 -88371 -238869 -177269 272399 -131245 -155630 245229 112060 132216 117338 151722
18084A51722b8862A72613f2484F869i3629k31622i4880C10148a3373C8727J1229
$$ 151722 -28862 172613 -62484 6869 -93629 -325251 -94880 310148 -13373 38727 49956
18073D9956c7679m513j57893c0898j55469e5506q0137p7011h7213q9038A81438
$$ 49956 -37679 -42192 -200085 -30898 -186367 -55506 -135643 -212654 -87213 -176251 181438
18061D53654b10009D5928i6022o6787C2380a14052o2513d2376A78868b6391C7678
$$ 453654 -210009 45928 -96022 -162809 32380 -114052 -176565 -42376 178868 -26391 37678
18049I9470m8372L45698b34871k8588J9732J059d4136J2301A10294j9807b32102
$$ 99470 51098 396796 -234871 -263459 -243727 -242668 -44136 -31835 110294 90487 -232102
18037I5165A7961a03179B26627j05037a17537A47586m6664B1770K4982a43763
$$ 95165 17961 -103179 226627 121590 -117537 147586 100922 21770 46752 -143763
18026b20790a7951B12251M6783m2239b09412f9831o8678B30104D8006J5340a58355
$$ -220790 -17951 212251 259034 216795 -209412 -69831 -138509 230104 48006 63346 -158355
18014B73631I3749L2016B7051c1281F5503b04500a5118p4554j86706B15062b55382
$$ 273631 93749 125765 27051 -31281 65503 -204500 -15118 -89672 -276378 215062 -255382
18002a36498d4509j85577J6131H1327j9444a94115B10316G4528k2382M27714e4389
$$ -136498 -44509 -230086 -213955 81327 61883 -194115 210316 74528 52146 479860 -54389
17990I889L05090A53490a15520o8459J7432H7933d8576C79922A71584d9778l09671
$$ 9889 314979 153490 -115520 -183979 -166547 87933 -48576 379922 171584 -49778 -359449
17979c59449A06550a12302L3135o1911F7835k4886E258g386o829H4926a30927
$$ -359449 106550 -112302 -79167 -141078 67835 42949 5258 -7386 -14215 84926 -130927
17967B75533c16570B9352d1750j18093A99466a37431A81029a56576a325m441H911
$$ 275533 -316570 29352 -41750 -159843 199466 -137431 181029 -156576 -1325 -5766 8911
17955a65103L1034A35076C5924O8482C4899D607b35123B15858b6127A33193J6516
$$ -165103 -134069 135076 35924 104406 34899 4607 -235123 215858 -26127 133193 149709
17944A49709k1459M6184b32463A91589D3550J66253c39574f6250C3000a23781
$$ 149709 128250 174434 -232463 191589 43550 209803 -339574 -66250 33000 -123781
17933a47140i399A05080P7290M1866P4501E6559J508g6534C800J27031g0373H8092
$$ -147140 -9399 105080 182370 224236 298737 56559 58067 -76534 3800 130831 -70373 88092
17920A59534o8668P4900l0679a76120C6425K64007A2512J65173c17411i1448C96810
$$ 159534 90866 165766 135087 -176120 36425 300432 12512 177685 -317411 -91448 396810
17908G9365R0238b00840c1951G9183O8316a94777j25914A18288N23d1436A58360
$$ 79365 169603 -200840 -31951 79183 147499 -194777 -320691 118288 118811 -41436 158360
17896A5524n430L3905N2714b10628Q3761B18716a17735j0594B08157a8800A04003
$$ 15524 10094 43999 96713 -210628 -126867 218716 -117735 -128329 208157 -18800 104003
17884H4701c83400E7925b7857A19518i1512B33965m9853m4430a00894D9451J9759
$$ 84701 -383400 57925 -27857 119518 -91512 233965 184112 139682 -100894 49451 69210
17873F9210e6722G9380C7342a402H0954M3298B9607J36073J30113G3492a59517
$$ 69210 -56722 79380 37342 -1402 80954 124252 29607 165680 295793 73492 -159517
17861b2279A68609K07335F5620R7003L0015c1896B05547a35781D0437J15969b17292
$$ -22279 168609 375944 65620 162623 192638 -31896 205547 -135781 40437 156406 -217292
17849B80818A10699H442J366J63260a0254B24597C9145j3554a17780j6927I940
$$ 280818 110699 8442 9808 173068 -10254 224597 39145 25591 -117780 -134707 9940
17837B53578F1379J79182C1798a6695n4083j9176A54087a43377A55434c7720k78109
$$ 253578 61379 240561 31798 -16695 -70778 -89954 154087 -143377 155434 -37720 -315829
17826c15829G5626c8641C352b33841C9079M3324h1444G2411Q67L0865J06368i8851
$$ -315829 75626 -38641 3352 -233841 39079 82403 -81444 72411 73278 104143 210511 -98851
17813a86804k32454a6234l5110a3605k3604A64707h1431A36108a8478q5201A06186
$$ -186804 -419258 -16234 -51344 -13605 -37209 164707 -81431 136108 -18478 -103679 106186
17801A0770b0050D72952E7886d8512D2675J50628L29208A75189J05193g8170B12718
$$ 10770 -20050 472952 57886 -48512 42675 193303 522511 175189 280382 -78170 212718
17789A09478k5882a87020B12937a30717B11986h1622B93221j07240A8880a74252
$$ 109478 83596 -187020 212937 -130717 211986 -81622 293221 185981 18880 -174252
17778h9197n0753B5698a15592B15910b405B85165j5554A25694e4116l1778A12655
$$ -89197 -139950 25698 -115592 215910 -2405 285165 269611 125694 -54116 -85894 112655
17766d26612A23207b59617d9835J299E3848A1758b13894A57898a56080D5106J79654
$$ -426612 123207 -259617 -49835 -48536 53848 11758 -213894 157898 -156080 45106 224760
17755B24760c18698D43521l8062a73947r8980h5235E3728b69463C077g5825A11963
$$ 224760 -318698 443521 405459 -173947 -272927 -85235 53728 -269463 3077 -75825 111963
17743A20970J45528m8665b22455E8197q251b00838R9981F0112b24779a06872A82314
$$ 120970 266498 217833 -222455 58197 49946 -200838 -100857 60112 -224779 -106872 182314
17731G2850J67344p9095b7579A3459O4229b01599a1181B4085c02785B15681f5039
$$ 72850 240194 161099 -27579 13459 77688 -201599 -11181 24085 -302785 215681 -65039
17719D14582A47463e6628b5191B63819H2189P339K88792j45469H5304J99385D4380
$$ 414582 147463 -56628 -25191 263819 82189 89528 378320 232851 85304 284689 44380
17707A49269F7988a78754O553G1855B7570J86728a43556A33484a89022B26109
$$ 149269 67988 -178754 -172201 71855 27570 214298 -143556 133484 -189022 226109
17696d36028A50933Q3215O8011C8786i9738A48541m211r983a6577A62967h4619
$$ -436028 150933 234148 302159 38786 -99738 148541 144330 134347 -16577 162967 -84619
17684D485K17614a17745C00837A46208K13317A38848c02849Q5292C25713j56738
$$ 4485 222099 -117745 300837 146208 359525 138848 -302849 -217557 325713 168975
17674A68975F1850a23473B21058a09547B46307p7479J27960A02008D7738a6854
$$ 168975 61850 -123473 221058 -109547 246307 168828 296788 102008 47738 -16854
17663I2594b7911q9316b0844A08207K13290J08077E516K07057a16994A5315K21818
$$ 92594 -27911 -117227 -20844 108207 321497 429574 5516 212573 -116994 15315 237133
17652B37133a03827A14061K64226A52018A1914K63957n5339a21894b2302B39502
$$ 237133 -103827 114061 378287 152018 11914 275871 220532 -121894 -22302 239502
17641a87884A78805G3833K87699j55333q7382a30830a1806l2977k984D2171K09087
$$ -187884 178805 73833 361532 206199 118817 -130830 -11806 -44783 -47767 42171 251258
17630B51258c11085E0055O0860D9070J03062b7638j48957D12825e8011m7518B88585
$$ 251258 -311085 50055 110915 49070 152132 -27638 -176595 412825 -58011 -105529 288585
17618A68506E0989b53929A85330d0810j57686A54863C0283a24826B26279q8130
$$ 168506 50989 -253929 185330 -40810 -198496 154863 30283 -124826 226279 138149
17608A38149a0011A69439L0496K6507k8253R0575Q98c6468i027B15222b11060
$$ 138149 -10011 169439 199935 226442 198189 288764 289662 -36468 -9027 215222 -211060
17596C58089F9030l735a23020A37739a23707G1133J13373J20087J7264H4113K6677
$$ 358089 69030 65295 -123020 137739 -123707 71133 184506 304593 321857 84113 110790
17585A10790B5637M0160L49830A15377J01972j2826O6329j28304J64538r2549
$$ 110790 25637 65797 415627 115377 217349 204523 270852 142548 307086 214537
17575B14537f341G6119c1870B77197D2688a54970B74204a50193A11631O064J06779
$$ 214537 -6341 76119 -31870 277197 42688 -154970 274204 -150193 111631 117695 224474
17564B24474E3053J83211Q7919E6525a53486A22649K9475e0080B62287p5980a25052
$$ 224474 53053 236264 324183 56525 -153486 122649 152124 -50080 262287 186307 -125052
17552G4659J3082O6725E5750B813f847A18415m5157N08544E226J19488M0734K2228
$$ 74659 87741 154466 55750 2813 -6847 118415 73258 581802 5226 124714 165448 187676
17540A87676E8906J48403N2366J02721k1951F8004K81899j20930o3567G4197L45506
$$ 187676 58906 207309 259675 362396 340445 68004 349903 228973 165406 74197 419703
17529D19703B6818K3110P3234L64185r0600R7832K98910J1013A98911K35332l6658
$$ 419703 26818 49928 123162 487347 396747 494579 793489 804502 198911 434243 397585
17518C97585l7013J65475A05068L52143k00481E9972L51047j45204P6134K98148
$$ 397585 360572 526047 105068 457211 256730 59972 411019 265815 341949 640097
17508F40097R7631j08997j60203j95313o7258J92794A3291L27930A10598L9621
$$ 640097 737728 628731 468528 273215 205957 398751 13291 341221 110598 150219
17498A50219J86039J3678A30386J71725J3067Q1534J3192A32114K71068p1212
$$ 150219 336258 349936 130386 302111 315178 396712 409904 132114 403182 331970
17488C31970A29766M72279k10943A30085J02017K62406j73652p0070l0343M00596
$$ 331970 129766 602045 391102 130085 232102 494508 320856 250786 220443 621039
17478F21039A46208E4615K94115J9293J75859j59396j71075J93806k76r401O2276
$$ 621039 146208 54615 348730 368023 543882 384486 213411 407217 406941 397540 459816
17467D59816J84517C08974A08119J83663Q2396j29437l6666j2613M8606A20962
$$ 459816 644333 308974 108119 291782 374178 244741 208075 195462 244068 120962
17456B00557e6758K0508H1955J13192J46828J775m4977r1749J86371L3846j30211
$$ 200557 -56758 -36250 81955 195147 341975 343750 298773 207024 393395 427241 297030
17445B97030K48141r1273L0743l0388c3281D92787j85086K7707P1604l5304K77744
$$ 297030 545171 453898 484641 454253 -33281 492787 307701 335408 407012 371708 649452
17434F49452B60797k9386m6664L472m4127M8600L63449A37556L13029K5206j63470
$$ 649452 260797 231411 184747 188219 144092 192692 556141 137556 450585 475791 312321
17423C12321J54136b34906A56065J28302m4367D1198K70752j7589K21367j11910
$$ 312321 466457 -234906 156065 284367 240000 41198 311950 294361 515728 403818
17413D03818j18546O367J30071P6111j92075o024L49348k08526l4805j63605k4105
$$ 403818 285272 291639 421710 497821 305746 299722 649070 440544 405739 242134 218029
17402B18029J2594a17305A15333J17806A09705K5860a4814C74092a33343B09607
$$ 218029 230623 -117305 115333 233139 109705 135565 -14814 374092 -133343 209607
17391A18481J2714L54722k25801e5266B95457d9252B92483H8420C1365L55384
$$ 118481 131195 485917 260116 -55266 295457 -49252 292483 88420 31365 386749
17381C86749A31458b26031D54449q9710p7541J6198l9036j15766J14706r9614
$$ 386749 131458 -226031 454449 364739 287198 303396 264360 148594 263300 163686
17371A63686J34976C1230K19147a15249B91543L8128B2540L51898G8309L60746
$$ 163686 298662 31230 250377 -115249 291543 329671 22540 374438 78309 439055
17361D39055F762J71022L9738G461J05711N5048J86717I3262E791a54635C10251
$$ 439055 6762 177784 217522 7461 113172 168220 354937 93262 5791 -154635 310251
17349A75661O5257K0788L9427j25546g8837A91143J82311l9378A2940O8823J43877
$$ 175661 240918 261706 301133 175587 -78837 191143 373454 334076 12940 81763 225640
17338B25640r2888c7449H3060M03150k31749L69223j39682A08313J82903A35125
$$ 225640 132752 -37449 83060 486210 254461 623684 484002 108313 291216 135125
17327E15967l1319j49094A49156K14500A76532O0501J66946j00564a15954C35504
$$ 515967 484648 335554 149156 363656 176532 237033 403979 303415 -115954 335504
17316A83546J82493A55595C5732M52158j36130K06170k72697J37707j15625R2797
$$ 183546 366039 155595 35732 487890 351760 557930 285233 422940 307315 400112
17306D00112A70009K04640K8401m7369m0212R4408o855a02624H4244M7161J52745
$$ 400112 170009 374649 403050 355681 315469 409877 403022 -102624 84244 131405 284150
17295B84150R4142j02030o8148J01971b2928j7157A29562L02590p7314L87869
$$ 284150 378292 276262 208114 310085 -22928 -40085 129562 432152 354838 742707
17285G42707l34318q5618O1328j26842M514K80401n5057A08938K23064j49003
$$ 742707 408389 322771 384099 257257 261771 542172 487115 108938 332002 182999
17275A82999Q6860L515E5824K43017j39164L0367k4446P9548N6549N2368R4998
$$ 182999 269859 273374 55824 298841 159677 190044 165598 245146 301695 354063 449061
17264D49061m3746K66130l8969j90092j47195O151Q0129J2256D1267M06669A40483
$$ 449061 405315 671445 632476 442384 295189 301340 381469 393725 41267 447936 140483
17252D35753g244B33294J92698r6274I0492J46877J58403N9682J4888i5716C05128
$$ 435753 -7244 233294 425992 329718 90492 237369 395772 455454 470342 -95716 305128
17240B36916A17553K95906j09774L3610K93180m5823k38171J0847A37408L02808
$$ 236916 117553 413459 303685 337295 630475 584652 346481 357328 137408 440216
17230D40216j65493J40300J43961k14812R5558J9559q8359G2633M08389n3574
$$ 440216 274723 415023 558984 344172 439730 459289 370930 72633 481022 427448
17220D27448L28140c9705F51551j52122j71667A50736N2647J11714M22646k06514
$$ 427448 755588 -39705 651551 499429 327762 150736 203383 315097 737743 531229
17210E31229j02712j34425j15935L35863q0346n3953j9027P0227j96908K90761
$$ 531229 428517 294092 178157 514020 433674 379721 360694 430921 234013 524774
17200E24774B13466L70362B50635L57988J18038j26490O7994k1384C07699K45443
$$ 524774 213466 583828 250635 608623 726661 600171 668165 646781 307699 553142
17190E53142o2943j81763K42128J60482l47640l0732L64369j26798m7797K7404
$$ 553142 490199 308436 550564 711046 363406 332674 697043 570245 522448 549852
17180E49852C4375L47848J55624k1337j99580J42415j33479K51936q9301P4340
$$ 549852 34375 382223 537847 516510 316930 459345 325866 577802 488501 562841
17170E62841l6277k01582K22264J48679A03305L94394k21026L04352k28955K8127
$$ 562841 526564 324982 547246 695925 103305 497699 276673 581025 352070 380197
17160C80197J70923M6248k69447j312L82578k03662Q7120j07983K15299A62600
$$ 380197 551120 597368 327921 326609 709187 505525 592645 484662 699961 162600
17149B75963j32635M21391j26869P0113A80553K26098L91872B94532J94275L78599
$$ 275963 143328 564719 437850 507963 180553 406651 798523 294532 488807 867406
17139H67406l38887j58586L28138n7748j25446j08625K4006P1419k6471K04778
$$ 867406 528519 369933 698071 640323 514877 406252 430258 501677 475206 679984
17129F79984k31367p4534J08658J79456j46812K55519j54961l5667J4841J01507
$$ 679984 448617 374083 482741 662197 515385 770904 615943 580276 595117 696624
17119F96624N4112k77901K89510k48979L0508Q4054K1603j2773O1406J10801l09481
$$ 696624 750736 472835 762345 513366 543874 627928 649531 636758 698164 808965 499484
17108D99484j6067A11061L02745p1798N27691C20203L73605n3709M4553n3991
$$ 499484 483417 111061 413806 342008 869699 320203 693808 640099 684652 630661
17098F30661j43543J59213K79574j04754k91769K28804j38654l5850l4332r9826
$$ 630661 487118 646331 925905 821151 529382 758186 619532 583682 549350 449524
17088D49524M80039N2083j7111m18391K90660q9270j47103J51850k24478K20831
$$ 449524 929563 981646 964535 546144 836804 747534 600431 752281 527803 748634
17078G48634k4668J32521m2817j34369K34907l5769j1195j41867K89366l33362
$$ 748634 723966 856487 813670 679301 914208 878439 867244 725377 1014743 681381
17068F81381J77069K09159l83661L14134k66258K79441l31527M25966l83730m3210
$$ 681381 858450 1067609 683948 998082 731824 1011265 679738 1105704 721974 678764
17058F78764K70248j52710q5451O4450J90166J02485j34398K5601j2605n5725
$$ 678764 949012 796302 710851 775301 965467 1067952 933554 959155 946550 890825
17048H90825J75610k33924N5967J58771j92918K94273k11691K71077k98656J40791
$$ 890825 1066435 832511 888478 1047249 854331 1148604 936913 1207990 909334 1050125
17038A050125j90393l9930N8667M5341k73293N52082j77732J17489L484M8476
$$ 1050125 859732 819802 878469 923810 650517 1202599 1024867 1142356 1145840 1194316
17028A194316J24473m66435L27983D67347N08288M09004n26303P9806K06789J81965
$$ 1194316 1318789 852354 1180337 467347 975635 1384639 858336 938142 1144931 1326896
17018A326896m09574M30398p1464L3517m92185L82475Q1930k93066L23406j57139
$$ 1326896 917322 1347720 1276256 1309773 817588 1200063 1281993 988927 1312333 1155194
17008A155194j1142j58301J71078L0529j5674L1747R2299l49678N01412j56044
$$ 1155194 1144052 985751 1156829 1187358 1171684 1203431 1295730 946052 1447464 1291420
16998A291420K29373K45152m90268J93960l77084J04219L59793m01982L33025
$$ 1291420 1520793 1765945 1275677 1469637 1092553 1196772 1556565 1154583 1487608
16989A487608j23428L4508J19530o3899j67210k23391L79455Q652k36224J79591
$$ 1487608 1364180 1398688 1518218 1454319 1287109 1063718 1443173 1451825 1215601 1395192
16979A395192J73735j49640M04850j74869l20946M92752j63787K68614n76333
$$ 1395192 1568927 1419287 1824137 1649268 1328322 1821074 1657287 1925901 1349568
16970A349568R6774M64832J5600k35267J51080n55009N66365m19458L70975j62676
$$ 1349568 1446342 1911174 1926774 1691507 1842587 1287578 1853943 1434485 1805460 1642784
16960A642784J8051J39178j64201j35478J31601K85296q4113J17386P9613j91647
$$ 1642784 1660835 1800013 1635812 1500334 1631935 1917231 1833118 1950504 2030117 1838470
16950A838470K15656l01924k102K1933J1288K66526l82272M01252j71808K13743
$$ 1838470 2054126 1752202 1750100 1772033 1783321 2049847 1667575 2068827 1897019 2110762
16940B110762j45769l1612J55084p1403J24310j53665J70925k6722M57144l79127
$$ 2110762 1964993 1933381 2088465 2017062 2141372 1987707 2158632 2131910 2589054 2209927
16930B209927n5005J25303J19285j76639K15468k41952K76561P3285l39151K47997
$$ 2209927 2154922 2280225 2399510 2222871 2438339 2196387 2472948 2546233 2207082 2455079
16920B455079k37200Q3526J52594L95845l54991J0198L64524k51050p9646J34627
$$ 2455079 2217879 2301405 2453999 2849844 2494853 2505051 2869575 2618525 2538879 2673506
16910B673506k8546L59193l70509o1264M09222l28771L13831M2658l15919J83823
$$ 2673506 2644960 3004153 2633644 2572380 2981602 2652831 2966662 3009320 2693401 2877224
16900B877224J17420N6008j712P9124n0758K62949M108m94932N61474k41777M77431
$$ 2877224 2994644 3050652 3048940 3128064 3077306 3340255 3344363 2849431 3410905 3169128 3646559
16889C646559l2990j10424J06214Q5085Q0975k22116J13990N745K81886k63880
$$ 3646559 3613569 3503145 3609359 3694444 3775419 3553303 3667293 3673038 3954924 3691044
16879C691044L43769k46951L87523N2542j61922K64893l23332K25832J15413r6979
$$ 3691044 4034813 3787862 4175385 4227927 4066005 4330898 4007566 4233398 4348811 4251832
16869D251832M56637l02642J81878K40597j60014J26972k58764J08528J6070J72676
$$ 4251832 4708469 4405827 4587705 4828302 4668288 4795260 4536496 4645024 4661094 4833770
16859D833770K28282J32607j51894K1042M14911j25807N1205o7447O4716M17413
$$ 4833770 5062052 5194659 5042765 5063807 5478718 5352911 5404116 5336669 5401385 5818798
16849E818798K43043m5502o9337L12163n592k04209K14464L81310j02051J49276
$$ 5818798 6061841 6016339 5947002 6259165 6253573 6049364 6263828 6645138 6543087 6692363
16839F692363o845K77959l2079M6917N80392j87911n5684K2166L47494K46730
$$ 6692363 6685518 6963477 6931398 6978315 7558707 7370796 7315112 7337278 7684772 7931502
16829G931502j45671K10291J40679J41323M02962k26738r3008Q55334m39478M70170
$$ 7931502 7785831 7996122 8136801 8278124 8681086 8454348 8361340 9216674 8777196 9247366
16819I247366J78234K66521R3704L39816L71100j46084M85725J39503J62937K27620
$$ 9247366 9425600 9692121 9785825 10125641 10496741 10350657 10836382 10975885 11138822 11366442
16809A1366442J38982N85916L75395n46327O41132J59459N52492K78267J35655
$$ 11366442 11505424 12091340 12466735 11920408 12561540 12720999 13273491 13551758 13687413
16800A3687413J08773O11249L92243M47474K62282J68854N61395M07070j20531
$$ 13687413 13796186 14407435 14799678 15247152 15509434 15678288 16239683 16646753 16526222
16791A6526222P04463P19204N04218J80738K56044P07797N53633M31230L57174
$$ 16526222 17230685 17949889 18454107 18634845 18890889 19598686 20152319 20583549 20940723
16782B0940723O91578P72673Q85182J98228O04485Q90992P76859P64462M80331
$$ 20940723 21632301 22404974 23290156 23488384 24092869 24983861 25760720 26525182 27005513
16773B7005513J137868J169563P73445Q59617R17639Q39931J177159R16053J276599
$$ 27005513 28143381 29312944 30086389 30946006 31863645 32703576 33880735 34796788 36073387
16764C6073387J489556O00650J648924J353515J040144J736351J579369J302042
$$ 36073387 37562943 38163593 39812517 41166032 42206176 43942527 45521896 46823938
16756D6823938J518583K037483J392715J967703J864327J964113J953943K087849
$$ 46823938 48342521 50380004 51772719 53740422 55604749 57568862 59522805 61610654
16748F1610654K185359K240424K167171K099655K737645K781945K310616K651590
$$ 61610654 63796013 66036437 68203608 70303263 73040908 75822853 78133469 80785059
16740H0785059K263163K908078K372867K930192K329744K610659K443850K657874
$$ 80785059 83048222 85956300 88329167 91259359 93589103 96199762 98643612 101301486
16732A01301486K183013K278335J915772K045345J847335J410185J713041N17753
$$ 101301486 103484499 105762834 107678606 109723951 111571286 112981471 114694512 115212265
16724A15212265J076697K77284L50367q0533m68520k53498r66508j346418j614063
$$ 115212265 116288962 116566246 116916613 116836080 116367560 116114062 115147554 113801136 112187073
16715A12187073j349869k056474j703308k083480k258321k584307k625375k593209
$$ 112187073 110837204 108780730 107077422 104993942 102735621 100151314 97525939 94932730
16707I4932730k469320k652744k971600k152821l225521k546049k351116k448704
$$ 94932730 92463410 89810666 86839066 84686245 81460724 78914675 76563559 74114855
16699G4114855k624264k662525k194627k469746j860105k396479k141921j959518
$$ 74114855 71490591 68828066 66633439 64163693 62303588 59907109 57765188 55805670
16691E5805670j984483j652813k236819j349615j601241j890228j518493j401195
$$ 55805670 53821187 52168374 49931555 48581940 46980699 45090471 43571978 42170783
16683D2170783j557936j101605j298057j573088j076821j224840j401944p24713
$$ 42170783 40612847 39511242 38213185 36640097 35563276 34338436 32936492 32211779
16675C2211779q28777j041652r58844r70736o78845r72287r93993n76900o68182
$$ 32211779 31383002 30341350 29382506 28411770 27732925 26760638 25766645 25189745 24521563
16666B4521563n21590o66735q92401l92459q88020o15703l26743m19342o70479
$$ 24521563 23999973 23333238 22440837 22048378 21160358 20544655 20217912 19798570 19128091
16657A9128091o61892m91286l07264l46771m66821o15612m67427l75764k71298
$$ 19128091 18466199 17974913 17667649 17320878 16854057 16238445 15771018 15395254 15123956
16648A5123956n04705j26967r1294o65750l00040l10814l99194j16914n85882
$$ 15123956 14619251 14492284 14400990 13735240 13435200 13124386 12725192 12608278 12022396
16639A2022396L03070p64418j10068k51296m88469j47658o0915j55606l91955
$$ 12022396 12325466 11561048 11450980 11199684 10711215 10563557 10502642 10347036 9955081
16630I955081O2958l74277M9323k05936J7856n96840J31667m93494J09906n89821
$$ 9955081 10018039 9643762 9693085 9487149 9505005 8908165 9039832 8546338 8656244 8066423
16620H066423k07545J47698Q3012l95007k51776l11709L04095l99037j4924m6953
$$ 8066423 7858878 8006576 8089588 7694581 7442805 7131096 7435191 7036154 7021230 6974277
16610F974277j32392l38361K53081m43184m0032p0456j78603p3895J33225k65693
$$ 6974277 6841885 6503524 6756605 6313421 6273389 6202933 6024330 5950435 6083660 5817967
16600E817967p690J13940n84567k04274J04248M40759o53108K40007m40904J94578
$$ 5817967 5810277 5924217 5339650 5135376 5239624 5680383 5027275 5267282 4826378 5020956
16590E020956m1300l32900J98120r5383l28897J04217j92281O7748j57048M19279
$$ 5020956 4979656 4646756 4844876 4749493 4420596 4524813 4332532 4400280 4243232 4662511
16580D662511j57430j83948l06114j32927k82164L71995K962j43095K64393j41496
$$ 4662511 4505081 4321133 4015019 3882092 3599928 3971923 3974885 3831790 4096183 3954687
16570C954687k73573J12387j22316N6980m19792L35031j48704k01147K19155n5112
$$ 3954687 3681114 3793501 3671185 3728165 3308373 3643404 3494700 3293553 3512708 3457596
16560C457596l05062J5496j40776M5490N3566l09078J10575j18918j19158q035
$$ 3457596 3152534 3168030 3027254 3072744 3126310 2817232 2927807 2808889 2689731 2681696
16550B681696K33991K18497j72715k78674L91724k06307l45615Q9711L34925r5239
$$ 2681696 2915687 3134184 2961469 2682795 3074519 2868212 2522597 2612308 2947233 2851994
16540B851994j74873j78873K19540K54363o21657K78666k43434N5613q882q8057
$$ 2851994 2677121 2498248 2717788 2972151 2350494 2629160 2385726 2441339 2432457 2344400
16530B344400j78140J41826k70649K08504M55810o34902J29106k0733m30217N32343
$$ 2344400 2166260 2308086 2037437 2245941 2701751 2066849 2195955 2175222 1745005 2277348
16520B277348n03738J75635K59777p8853j08399j51137n0916K25765o55997L20314
$$ 2277348 1773610 1949245 2209022 2130169 2021770 1870633 1819717 2045482 1389485 1709799
16510A709799K40361l74243J89293K9477J37926J65887j03312k73150K76392k40413
$$ 1709799 1950160 1575917 1765210 1794687 1932613 2098500 1995188 1722038 1998430 1758017
16500A758017P1018M5590J18837l47023o3720j4791L4730q3549M6478K74883j75080
$$ 1758017 1829035 1874625 1993462 1646439 1582719 1567928 1602658 1519109 1565587 1840470 1665390
16489A665390j02773j64882K17945M9250k49259J05818n7880j07616k0852L71551
$$ 1665390 1562617 1397735 1615680 1664930 1415671 1521489 1463609 1355993 1335141 1706692
16479A706692m72954K87460l98833J92883K73293j11704l79351L59484l08487
$$ 1706692 1233738 1521198 1122365 1315248 1588541 1476837 1097486 1456970 1148483
16470A148483K21876J72388j83145r4910N3993K98430k42950j20180j55817J23255
$$ 1148483 1370359 1542747 1359602 1264692 1318685 1617115 1374165 1253985 1098168 1221423
16460A221423J29231l6918n7582l11698K6482R2874K10325k63551J57909k60169
$$ 1221423 1350654 1313736 1256154 944456 970938 1063812 1274137 1010586 1168495 908326
16450I08326K31002P4884j84407L0120j35392L41863j36999j80162k6268J61321
$$ 908326 1139328 1214212 1029805 1059925 924533 1266396 1129397 949235 922967 1084288
16440A084288K69928k69699O3223l75429K68120M20620p28260L20785j33629l110
$$ 1084288 1354216 1084517 1147740 772311 1040431 1461051 732791 1053576 919947 916837
16430I16837M6004l2595J62528m05554J32166P9902p8900J64967l25371J60469
$$ 916837 962841 930246 1092774 687220 819386 899288 820388 985355 659984 820453
16420H20453l0862J51597K9435o4095K12657l40513N0612j10762o6803K67762
$$ 820453 789591 941188 970623 906528 1119185 778672 829284 718522 651719 919481
16410I19481n0278r940l4638p8076L00288l65077K14637j67882j66439K99152
$$ 919481 869203 859263 824625 746549 1046837 681760 896397 728515 562076 861228
16400H61228l7967n3619J52861B60662M99998R1897k59288K13188m1581l23847
$$ 861228 823261 769642 922503 260662 760660 852557 593269 806457 764876 441029
16390D41029K78632K94543r8155k64387M2766J33674j36428l3359L9715J12544
$$ 441029 719661 1014204 916049 651662 694428 828102 691674 658315 698030 810574
16380H10574j69725n6984q7914J5491J10853k82308J58717L61024l21704L55592
$$ 810574 640849 583865 495951 511442 622295 339987 498704 859728 538024 893616
16370H93616C44354J95785R9273j26884K56806l76579K39247k65454K28535P3581
$$ 893616 344354 540139 639412 512528 769334 392755 632002 366548 595083 668664
16360F68664k56052J67344J41234k76892j87449N05754n5328k01896J530n4059
$$ 668664 412612 579956 721190 444298 256849 762603 707275 505379 506909 452850
16350D52850r2080M7283K11572k36378K96877C39950J49730j05611J7794L1592
$$ 452850 360770 408053 619625 383247 680124 339950 489680 384069 401863 433455
16340D33455J25798j73954J21294B15687J01894L1913J23342q6260Q5454j65422
$$ 433455 559253 385299 506593 215687 317581 349494 472836 386576 472030 306608
16330C06608L5055K42119O4415A88550M15866j87648j71877N21237j13980K06633
$$ 306608 341663 583782 648197 188550 604416 416768 244891 766128 652148 858781
16320H58781C19121Q3704J57384p0319j69245J76295N3151j27984J56419j06292
$$ 858781 319121 402825 560209 489890 320645 496940 550091 422107 578526 472234
16310D72234M9930j58744l7355R481b7433D19472l8169N0272j69621l0134J19317
$$ 472234 522164 363420 326065 335546 -27433 419472 381303 431575 261954 231820 351137
16299C51137m261J37286k8676k12535l7146L82487A83506L11669p0415K9202A78149
$$ 351137 346876 484162 455486 242951 205805 588292 183506 495175 424760 453962 178149
16287C33546J81316j81825a64398A12856K12778J44521b1975B37717K61141J02596
$$ 333546 514862 333037 -164398 112856 325634 470155 -21975 237717 498858 601454
16277F01454A45169J22734L66933k57616A81926L23955B06396K49122l9916L5629
$$ 601454 145169 267903 634836 377220 181926 505881 206396 455518 415602 451231
16267D51231k02444l1804R0453J25505a35230D22660A65773J09265j04274J68321
$$ 451231 248787 216983 307436 432941 -135230 422660 165773 275038 170764 339085
16257C39085n2490L2304a62788C22461K869A49745R8716k1852M4591J67776p6542
$$ 339085 286595 318899 -162788 322461 325330 149745 248461 226609 271200 438976 362434
16246C62434p7743M10470k90540J92400k68360J63442j53965A20669K1069J15342
$$ 362434 284691 695161 404621 597021 328661 492103 338138 120669 141738 257080
16236B57080F58M92062A95982M9294K32342f159E21896D9137R3544J08078g1933
$$ 257080 658 492720 195982 245276 477618 -6159 521896 49137 142681 250759 -71933
16224A30299a21402C05653A18883K49796A49322d7957B42462a844D03066j65519
$$ 130299 -121402 305653 118883 368679 149322 -47957 242462 -1844 403066 237547
16214B37547l8259J97083A11789J31905A02916c1167D3887R6817B7041P0595K6476
$$ 237547 199288 396371 111789 243694 102916 -31167 43887 140704 27041 97636 124112
16203A24112m1242J00441M856P6958h5194A2236L00489M2181A20707Q4498J91294
$$ 124112 82870 183311 188167 265125 -85194 12236 312725 354906 120707 205205 396499
16192C96499A3907f1368I592J22234A5606K73777J04404j09112J34206d6032A33909
$$ 396499 13907 -61368 9592 131826 15606 289383 393787 284675 418881 -46032 133909
16180B25094O6903b8661A36351J817o351a76898C03886D492J57097l7281N1553
$$ 225094 291997 -28661 136351 138168 131817 -176898 303886 4492 161589 124308 175861
16169A75861Q3861a73136G1127Q2340K69039j22029a9161C54118A57372r919P7294
$$ 175861 259722 -173136 71127 153467 422506 300477 -19161 354118 157372 147453 224747
16158B24747p2920J76364A11570a03490B06589B4085K13910Q1347D654J71621
$$ 224747 151827 328191 111570 -103490 206589 24085 237995 319342 4654 176275
16148A76275d6131B43722o396A04131J76089R2606j27103m6410n1179J72952f5362
$$ 176275 -46131 243722 237326 104131 280220 372826 245723 199313 148134 321086 -65362
16136b0082o0644A60099p0427J44463O3839L0702d4449B99776p4598j9530K7118
$$ -20082 -80726 160099 89672 234135 297974 328676 -44449 299776 225178 205648 232766
16125B32766M9341j7628l0216H4907O159L2693J15405K1075D6454J4052L08308
$$ 232766 282107 264479 234263 84907 91066 123759 239164 260239 46454 60506 368814
16114C68814c3125l4531a0714k07211g2452m1189D4634J49779J28944I3906e0836
$$ 368814 -33125 -67656 -10714 -217925 -72452 -113641 44634 194413 323357 93906 -50836
16102a37481G3130J92239q583p3247j0005c18073E1947a4888B60538a493q3637
$$ -137481 73130 265369 256786 183539 173534 -318073 51947 -14888 260538 -1493 -85130
16091h5130A96065p6314j2082A7791b6859B66527a92070A43268e8222B65964e9817
$$ -85130 196065 119751 107669 17791 -26859 266527 -192070 143268 -58222 265964 -59817
16079a64418A68480b10112B12869A8038N5012b40059A13400A2065L16445A05053
$$ -164418 168480 -210112 212869 18038 73050 -240059 113400 12065 328510 105053
16068C48107f2145E7355M79391f7472B8880h2760j99100q9624J39936B29754J93209
$$ 348107 -62145 57355 536746 -67472 28880 -82760 -281860 -371484 -231548 229754 422963
16057D22963j97780j07628a09712B4815K4182E660e7727K6117G5327a04556J7345
$$ 422963 225183 117555 -109712 24815 48997 5660 -57727 -31610 75327 -104556 -87211
16046h7211j1668B07105D172K73389A01074J08366a66752C03192l9024i9562g000
$$ -87211 -98879 207105 4172 277561 101074 209440 -166752 303192 264168 -99562 -7000
16034b40838A1394a13056A12827J06133n3036a30674b5056l600B56604I6364J9330
$$ -240838 11394 -113056 112827 218960 165924 -130674 -25056 -28656 256604 96364 115694
16023A15694n4884a30563A89084a81084b399q3485j49797M6115I2697i8314H1407
$$ 115694 60810 -130563 189084 -181084 -2399 -85884 -235681 -189566 92697 -98314 81407
16011A83472q485l1714J40752A6057J02672a50304A70872K22652a13474a4696
$$ 183472 174987 143273 284025 16057 118729 -150304 170872 393524 -113474 -14696
16000A72527j0145R2489c75663D6818b37940A45075J91450b80348A30473E3423
$$ 172527 162382 254871 -375663 46818 -237940 145075 336525 -280348 130473 53423
15989c19555B61163j30177g8899A78223a26738e1485A59133b06203d1978C15286
$$ -319555 261163 130986 -78899 178223 -126738 -51485 159133 -206203 -41978 315286
15978E17206k44670K84584J38117M15141l85682j50909O6655A00981Q0959K6745
$$ 517206 272536 557120 695237 1110378 724696 573787 640442 100981 181940 208685
15968B08685J28530b5555A19570a65513a900j9885l6735b150A27588Q5601a43641
$$ 208685 337215 -25555 119570 -165513 -1900 -21785 -58520 -2150 127588 213189 -143641
15956a96609K9308A99696O1989l7316a83605B33970a55494d681j25443B87618
$$ -196609 -167301 199696 261685 224369 -183605 233970 -155494 -4681 -130124 287618
15945c8241k13348A40590d21801E7165f1998p0032E9247b17475B10482H1986P6196
$$ -38241 -251589 140590 -421801 57165 -61998 -132030 59247 -217475 210482 81986 158182
15934A58182m7283K49331b04588A1222a52981O2073B58111n6028b4915m63114
$$ 158182 110899 360230 -204588 11222 -152981 -90908 258111 202083 -24915 -488029
15924d88029a17132E1674a9124A06438L5810N1598h7825n9297D3216M4380c7621
$$ -488029 -117132 51674 -19124 106438 142248 193846 -87825 -147122 43216 87596 -37621
15912D10420G3669a38865N5206A41175a52630A07056c76378G905K43672c1374
$$ 410420 73669 -138865 -83659 141175 -152630 107056 -376378 7905 251577 -31374
15901I234a24745B8083f2999H132J39961a28358l8955G3318L8915a4811C67508
$$ 9234 -124745 28083 -62999 8132 148093 -128358 -167313 73318 112233 -14811 367508
15889A32530a36461A05961d5324j06413e3840j05405j8658f3528m0728o9481G3672
$$ 132530 -136461 105961 -45324 -151737 -53840 -159245 -177903 -63528 -104256 -173737 73672
15877a46842M7461p9231B83957c66403I1896b7986k2816r479A64571F0886P6080
$$ -146842 -99381 -178612 283957 -366403 91896 -27986 -50802 -60281 164571 60886 136966
15866A36966a53697m4482j65932f8305A62148c18884a1100B60971r3201k5700
$$ 136966 -153697 -198179 -364111 -68305 162148 -318884 -11100 260971 167770 142070
15856A42070e4715B75358a17750k16370B18065K4035r307a0469D0282h6844j40880
$$ 142070 -54715 275358 -117750 -334120 218065 242100 232793 -10469 40282 -86844 -227724
15845b27724H2496Q7431O771N7130c7252j27634e3099B48593I5795c58405B4766
$$ -227724 82496 169927 176698 233828 -37252 -164886 -53099 248593 95795 -358405 24766
15833B18967I3387l0004g0332j9125A20633k5657l5148J3490c35933C197K70690
$$ 218967 93387 63383 -70332 -89457 120633 94976 59828 73318 -335933 3197 273887
15822B73887b39869A27394b64699C2814P8670a81753B14464m0158O912a90754
$$ 273887 -239869 127394 -264699 32814 111484 -181753 214464 174306 181218 -190754
15811A02587a65416h0125C05537a10427A9088i0665j4452b3787H5494i9380B41492
$$ 102587 -165416 -80125 305537 -110427 19088 -90665 -105117 -23787 85494 -99380 241492
15799a31497l4244o5355e298j1840e389k34265B13340b19608a02261H4330N0083
$$ -131497 -165741 -231096 -5298 -17138 -5389 -239654 213340 -219608 -102261 84330 134413
15788A34413g1903j78568c2001l22862C83241F6170d11727A49170E5873K09004
$$ 134413 -71903 -250471 -32001 -354863 383241 66170 -411727 149170 55873 264877
15778B64877d8269j7490b5020j90746R5126A99982A7948K29461I4999C1461J06467
$$ 264877 -48269 -65759 -25020 -215766 -120640 199982 17948 247409 94999 31461 137928
15767A37928e815p7028j57404P9788m6894m4697P8886j0064A26387i3093r2730
$$ 137928 -5815 -82843 -240247 -160459 -207353 -252050 -173164 -183228 126387 -93093 -185823
15756a85823A08144c17411A54099a96550B4454g1216l1289j54240A31662L048
$$ -185823 108144 -317411 154099 -196550 24454 -71216 -102505 -256745 131662 134710
15746A34710h1416m9680a134l88188d1102j32497j5393A13177d6277m7415o8492
$$ 134710 -81416 -131096 -1134 -389322 -41102 -173599 -188992 113177 -46277 -93692 -162184
15735a62184A41495b00466j12208a29972B6459H21c32039d2801a3151o6426L7086
$$ -162184 141495 -200466 -312674 -129972 26459 821 -332039 -42801 -13151 -79577 -42491
15724d2491j9603C00249d2731A45981B8267J88701h0674k06165L7956d5797k21105
$$ -42491 -62094 300249 -42731 145981 28267 216968 -80674 -286839 -248883 -45797 -266902
15713b66902A76528i7943j7882L3836a7883k16207J10243M7124F8348c13475B08517
$$ -266902 176528 -97943 -115825 -81989 -17883 -234090 -123847 -76723 68348 -313475 208517
15701a91421B4987b252j04316G9034c1669A21580K401Q6659B4617a57560a8685
$$ -191421 24987 -2252 -106568 79034 -31669 121580 123981 210640 24617 -157560 -18685
15689a20469k4010C7366b12657j22767H5400f640j19172G5502C2212b79060A07247
$$ -120469 -144479 37366 -212657 -335424 85400 -6640 -125812 75502 32212 -279060 107247
15677A09008b13233A22406C6732a72871c5241j02003K5019j53466D3078h8801
$$ 109008 -213233 122406 36732 -172871 -35241 -137244 -112225 -265691 43078 -88801
15666b10486B6692g6857D2447J54512O9336o8905i1341A05774k0166l1670O783
$$ -210486 26692 -76857 42447 196959 266295 197390 -91341 105774 85608 53938 60721
15655F0721K7317J20199g6352j06387h3272k6226A23637O6752A8219J21939g1197
$$ 60721 88038 208237 -76352 -182739 -83272 -109498 123637 190389 18219 140158 -71197
15643b7946o8204A31773b5267n0723r479h057j66369k0676B3082J1165i3456K7169
$$ -27946 -96150 131773 -25267 -75990 -85469 -8057 -174426 -195102 23082 34247 -93456 -66287
15631f6287A1332a1428l67287i2934B83125c5815m07008c4248m13220Q8160B1782
$$ -66287 11332 -11428 -378715 -92934 283125 -35815 -442823 -34248 -447468 -359308 21782
15619c66536I3077a38803B06641a47307j4014j9034A13800p12e3908k77307h6066
$$ -366536 93077 -138803 206641 -147307 -161321 -180355 113800 113088 -53908 -331215 -86066
15607d64696G3996d21033E4461Q4772A5843M2441c08316A40185a37326k34670
$$ -464696 73996 -421033 54461 139233 15843 58284 -308316 140185 -137326 -371996
15597c71996A92709J28911p5226D9797L9931K94700c2505m6702E2973i418A29967
$$ -371996 192709 321620 246394 49797 89728 384428 -32505 -79207 52973 -9418 129967
15585a73627I5078G920b85790b1883A14919B8713e6421Q854b2055j6834C33354
$$ -173627 95078 7920 -285790 -21883 114919 28713 -56421 -47567 -22055 -38889 333354
15573b37405F7453A6406E191M6724a95874d4471B04150j5848q8309J6237b29311
$$ -237405 67453 16406 5191 51915 -195874 -44471 204150 188302 99993 116230 -229311
15561B23770g8617J7300H0475K67500k6330f0385E9091J93158k9363h0813l6720
$$ 223770 -78617 -61317 80475 347975 321645 -60385 59091 252249 222886 -80813 -117533
15550a17533I0068M6673l1306l1994a72470A82046J0866g2679B99749c6112C1646
$$ -117533 90068 136741 105435 73441 -172470 182046 192912 -72679 299749 -36112 31646
15538C86795A13715M609J20576B0553L0143a30528C18330m3203R1598A43352J94989
$$ 386795 113715 118324 238900 20553 50696 -130528 318330 275127 366725 143352 338341
15527C38341C122M75504k09418E3922K20420M6862k6107e0581H0987J51745J78543
$$ 338341 3122 478626 269208 53922 274342 321204 295097 -50581 80987 232732 411275
15516D11275A2219L21117h4896H8110D4014i241j02061B72076C652J48280J52597
$$ 411275 12219 333336 -84896 88110 44014 -9241 -111302 272076 3652 151932 304529
15505C04529B5627e8761F2236i8021J9696I9413J52652e9750d594r0985q6642
$$ 304529 25627 -58761 62236 -98021 -78325 99413 252065 -59750 -4594 -95579 -182221
15494a82221h3212G2034A5770a53572A98347e7935A02537J47861a21071J2479
$$ -182221 -83212 72034 15770 -153572 198347 -57935 102537 250398 -121071 -108592
15484a08592L3467J465C2792J30250c63032A81355H1197c2318G3460M5835K79110
$$ -108592 -75125 -73660 32792 163042 -363032 181355 81197 -32318 73460 119295 398405
15473C98405j37454N08447A70735R2270k0076m2811a26082A70191K18748a10529
$$ 398405 260951 769398 170735 263005 242929 200118 -126082 170191 388939 -110529
15462A25144a05397D5687P4824c4978D19768d6975E1706A191a99680A80974G5326
$$ 125144 -105397 45687 120511 -34978 419768 -46975 51706 1191 -199680 180974 75326
15450g3136k26638a44848A52048F8608b43731C38270p4256J67794B10302N38868
$$ -73136 -299774 -144848 152048 68608 -243731 338270 264014 431808 210302 749170
15440G49170J7694l45983K2692L5302j48814H6034J10104O1404f6903k20203A10007
$$ 749170 766864 420881 443573 478875 330061 86034 196138 257542 -66903 -287106 110007
15428b28914B01319m7257p0897j5098c21153i3261B61825C1152a41688d395k6670
$$ -228914 201319 154062 83165 68067 -321153 -93261 261825 31152 -141688 -4395 -31065
15417c1065j50338n1911L0131J5544P8264n3289o86B8013f040A13038i7170D2992
$$ -31065 -181403 -233314 -203183 -187639 -109375 -162664 -163350 28013 -6040 113038 -97170 42992
15404H7625h2104k16521c2301D7139g3070a5266c653H446K6028b18078f3082k77200
$$ 87625 -82104 -298625 -32301 47139 -73070 -15266 -3653 8446 34474 -218078 -63082 -340282
15392c40282E9343a7052A74389P4116c90410A45878N4523a43962N4674B20764
$$ -340282 59343 -17052 174389 248505 -390410 145878 200401 -143962 -89288 220764
15381I3845A6174a04294G5008R9831c7551j5153a8804B57886P3537d358A54550
$$ 93845 16174 -104294 75008 174839 -37551 -52704 -18804 257886 331423 -4358 154550
15369c26162P7286A43864K64582I840i5387q6792B21241a53369B31696e8374b1890
$$ -326162 -248876 143864 408446 9840 -95387 -182179 221241 -153369 231696 -58374 -21890
15357a21325C22349j26681J26922E1895b20991f3164j05247C24118d213j8142
$$ -121325 322349 195668 322590 51895 -220991 -63164 -168411 324118 -4213 -22355
15347b2355A90827A0433h045D22171I176a3449C60643j30849h2469C04691a0809
$$ -22355 190827 10433 -8045 422171 9176 -13449 360643 229794 -82469 304691 -10809
15335A86879B7555a9287F6827K22012H4548a68223B27694B496Q9291C8247L34118
$$ 186879 27555 -19287 66827 288839 84548 -168223 227694 2496 91787 38247 372365
15324C72365A76592m1850c9469l8688A17538a26817a7558j00419k6105C5837b01659
$$ 372365 176592 134742 -39469 -78157 117538 -126817 -17558 -117977 -144082 35837 -201659
15312h6301C660J38907Q3168m4364E2396J1390J5713b00808F0075O906a22j02630
$$ -86301 3660 142567 225735 181371 52396 63786 79499 -200808 60075 66981 -122 -102752
15300a02752C57079j40310a42535G4872J8368E872a7927H6805g3505o3144O6709
$$ -102752 357079 216769 -142535 74872 93240 5872 -17927 86805 -73505 -136649 -69940
15289f9940a1136B18765A607a61044d2417B92523a20941D49892a730C57731A69514
$$ -69940 -11136 218765 1607 -161044 -42417 292523 -120941 449892 -1730 357731 169514
15277a71683i204l018H528J1496J70250a49287A83607a08582L1056e090q3055
$$ -171683 -9204 -12222 8528 20024 190274 -149287 183607 -108582 -77526 -5090 -88145
15266h8145j16647C7758N300e4366A37358f5925E9749A6888R8783b80107A09631
$$ -88145 -204792 37758 43058 -54366 137358 -65925 59749 16888 115671 -280107 109631
15254I1008J59775L4197a45770C34833E5514a2313n7623A01047a00785M5357A0453
$$ 91008 250783 284980 -145770 334833 55514 -12313 -69936 101047 -100785 -55428 10453
15242A10422K46664M1230d9800A83058J63479I5178j4523K69317j45376N58956
$$ 110422 357086 398316 -49800 183058 346537 95178 80655 349972 204596 763552
15232G63552B78367N70888Q53948K679165j391687L6525R04198A638303F27527
$$ 763552 278367 849255 1703203 4382368 2990681 3027206 3931404 1638303 627527
15222B79606r5974K5064a11123A99725a34244a7699H5715k4982O819K35352A7504
$$ 279606 183632 208696 -111123 199725 -134244 -17699 85715 60733 67552 302904 17504
15210A52080a52968B0246f6993k77312B08483b26266A3256b58038h9037C65518
$$ 152080 -152968 20246 -66993 -344305 208483 -226266 13256 -258038 -89037 365518
15199G2627b98561h8919C80522A30615o0417R3125n1879a31083M7208m3057A57010
$$ 72627 -298561 -88919 380522 130615 70198 163323 111444 -131083 -83875 -126932 157010
15187C28416A35900a97629D48062f0144K0414I7916P7191J1787a33053D40105
$$ 328416 135900 -197629 448062 -60144 -39730 97916 175107 186894 -133053 440105
15176d68660H4751l3112N184O9518J19675o0637H9253d6287A00919l9863P9183
$$ -468660 84751 51639 56823 126341 246016 185379 89253 -46287 100919 61056 140239
15165A40239a45361G9350b8042A12176c38552A30480D1122a22589B77450j17741
$$ 140239 -145361 79350 -28042 112176 -338552 130480 41122 -122589 277450 159709
15155A59709B175K4164J10017H640a14641B59382j25035b66888B8632K20440B154
$$ 159709 2175 26339 136356 8640 -114641 259382 134347 -266888 28632 249072 2154
15143B29214p3096j3880K51489j53787d3357j2181A97157E2624J44153N2204B3422
$$ 229214 156118 142238 393727 239940 -43357 -55538 197157 52624 196777 248981 23422
15131A66656F6103b86526A37487d23947C16719j24679k8781H0290k9019J7781
$$ 166656 66103 -286526 137487 -423947 316719 192040 163259 80290 51271 69052
15121F9052a18728A91121L5586K17836k9117O0863k8670J62969B52229B2546J91419
$$ 69052 -118728 191121 226707 444543 415426 476289 447619 610588 252229 22546 213965
15110B13965K66324N1314K44410M7630j64258B45440J36269a7933C40068m6061
$$ 213965 480289 531603 776013 823643 659385 245440 381709 -17933 340068 294007
15100B94007b20214C47534a72826A74714b1014m1914B71378a17552J3588A38401
$$ 294007 -220214 347534 -172826 174714 -21014 -62928 271378 -117552 -103964 138401
15089B1390K36369o0755I1580j9852J2016J28434I8939M833K0764J75282a6848
$$ 21390 257759 197004 91580 71728 83744 212178 98939 103772 124536 299818 -16848
15077c0628D72620B13182J12516j08094a99499B96866A07238L17877A76325B7058
$$ -30628 472620 213182 325698 217604 -199499 296866 107238 425115 176325 27058
15066D0755N77888A26223J21763A00652K01989j25800p4456i1113B76707N3009
$$ 40755 618643 126223 247986 100652 302641 176841 102385 -91113 276707 329716
15056C29716r530G1066L9547K73093L8458A08227J44287l4260n2137O6064L2802
$$ 329716 320186 71066 110613 383706 422164 108227 252514 218254 166117 232181 264983
15045B64983p8649J64665j74531J43420J17782o7617A42301E6839K72834j60692
$$ 264983 186334 350999 176468 319888 437670 370053 142301 56839 329673 168981
15035A68981K87540q0237P9161B02180K56385k21477K02086B08122j1737M01014
$$ 168981 456521 376284 455445 202180 458565 237088 439174 208122 196385 597399
15025E97399B84855j25614d8998B37604K03949B17149L71628I5903Q5126D2027
$$ 597399 284855 159241 -48998 237604 441553 217149 588777 95903 181029 42027
15014B24074C6966K01530K36179A37955J81984L10205k24428A1838J67805K38151
$$ 224074 36966 238496 474675 137955 319939 630144 405716 11838 179643 417794
15004D17794A59794J32880a429B87589D9368J54195J4535J73444O6755j45678
$$ 417794 159794 292674 -1429 287589 49368 203563 218098 391542 458297 312619
14994C12619A08785m8439J62804j1434J78710A1737K99528q2086L11593k19618
$$ 312619 108785 60346 223150 211716 390426 11737 311265 229179 540772 321154
14984C21154A38948K22587l812J34403R4740L4464A63776M32783A48286J7227
$$ 321154 138948 361535 357723 492126 586866 621330 163776 596559 148286 165513
14974A65513L07002j66551A46997K48027K22007I8184M11934J2210a4636A58735
$$ 165513 472515 305964 146997 395024 617031 98184 510118 522328 -14636 158735
14963B75124B7577a9214C01846J6720A42425K17920H7538K06913g8995C12232
$$ 275124 27577 -19214 301846 318566 142425 360345 87538 294451 -78995 312232
14952B75967M8733A10347K19421J63339N1071j85804A77475l7416L00419j54188
$$ 275967 324700 110347 329768 493107 544178 358374 177475 140059 440478 286290
14942B86290K04160o1338K67363A78544K33812j84312P4618j39924J20283m0677
$$ 286290 490450 429112 696475 178544 412356 228044 302662 162738 283021 242344
14932B42344J32055m3666K15423K65713r1517j36063J58510L07522k90233R2622
$$ 242344 374399 330733 546156 811869 720352 584289 742799 1050321 760088 852710
14922H52710j97575Q1612J22920j22882K60190L74316k10424K77139l90237j56202
$$ 852710 655135 736747 859667 736785 996975 1371291 1160867 1438006 1047769 891567
14912H91567m42978J00184J08445k07033Q5785j17853A37103M07406P6184k46983
$$ 891567 448589 548773 657218 450185 535970 418117 137103 544509 620693 373710
14902C73710i3336C22041K22773j9086j44927L21057k93447K90182A37903L58060
$$ 373710 -93336 322041 544814 525728 380801 701858 408411 698593 137903 495963
14892D95963j10575J26098k7597q3095J83632k6368n6766R4483R3846k75047J36224
$$ 495963 385388 511486 483889 400794 584426 558058 501292 595775 689621 414574 550798
14881E50798M8436j64537r3409P1961M5377J3385K36471l8367C11860J44404j43062
$$ 550798 599234 434697 341288 413249 458626 472011 708482 670115 311860 456264 313202
14870C13202Q820L29400l13321K57823R2511K2565k58531P6683B27781M105J32388
$$ 313202 322022 651422 338101 595924 688435 711000 452469 529152 227781 231886 364274
14859C64274K70271C16205L27626j76787A22348L56803B09038J79483J85893R9989
$$ 364274 634545 316205 643831 467044 122348 479151 209038 388521 574414 674403
14849F74403l25852A50702M31273P9078k46029J10210m4901K28570m4178k89510
$$ 674403 348551 150702 581975 661053 415024 525234 480333 708903 664725 375215
14839C75215O36543l03630J07723k3263j69298J52136j49654k5505B14184N12131
$$ 375215 1011758 708128 815851 792588 623290 775426 625772 600267 214184 726315
14829G26315B16313O02269C97093K89689P5354j7055k7541J58308l16010j77422
$$ 726315 216313 818582 397093 686782 762136 745081 717540 875848 559838 382416
14819C82416K93095j33113J80824O724k01716k23345K89018o6277R809q7159J11564
$$ 382416 675511 542398 723222 729946 528230 304885 593903 527626 537435 450276 561840
14808E61840p9528L03346l33298J59017L40104l91864K00405r4206k35159J24645
$$ 561840 482312 785658 452360 611377 951481 559617 760022 665816 430657 555302
14798E55302K85384k96635K77701m7489K068j24441n4115J80879C80507J00003
$$ 555302 840686 544051 821752 774263 776331 651890 597775 778654 380507 480510
14788D80510O9114A89427L18107L21351L5778q7194M3656l28306K46632l03032
$$ 480510 549624 189427 507534 828885 864663 777469 821125 492819 739451 436419
14778D36419K45316L92582l43219J85417j89293J2665p1253J89208C51613J30295
$$ 436419 681735 1074317 731098 916515 727222 739887 668634 857842 351613 481908
14768D81908Q4167k57400K60322j94497q0265J039O13907m04097k39255L84777
$$ 481908 566075 308675 568997 374500 294235 295274 909181 505084 265829 650606
14758F50606Q5319k23911K4876n4178K12290j80376Q162L46903N1016l82486A6684
$$ 650606 735925 512014 536890 482712 695002 514626 522788 869691 920707 538221 16684
14746H27690k05337j61366N4756K1786J85479r9183J33783j07460P6491K86765
$$ 827690 622353 460987 515743 537529 723008 623825 757608 650148 726639 1013404
14736A013404j34645l10425K04145j58792K51450C99775N99263j95172L03846
$$ 1013404 878759 568334 772479 613687 865137 399775 999038 803866 1107712
14727A107712j4271L34692l01431J67967L8180m39255k5215J3829N4375k32230
$$ 1107712 1093441 1428133 1126702 1294669 1332849 893594 868379 882208 936583 704353
14717G04353J12958J75048j9212j83599l5124j06504L11402j46351r4276m230
$$ 704353 817311 992359 973147 789548 754424 647920 959322 812971 718695 714465
14707G14465r8854K53203J0109N8058J8122N46459j94075K18188j88634p43k34465
$$ 714465 615611 868814 878923 936981 955103 1501562 1307487 1525675 1337041 1336298 1101833
14696A101833L01317k52015m04025O6386R4346J44293l0489k71072J44544J05214
$$ 1101833 1403150 1151135 747110 813496 907842 1052135 1021646 750574 895118 1000332
14686A000332j28612J15564J62000k50070L36674o2655j38026o9575j83390K35789
$$ 1000332 871720 987284 1149284 899214 1235888 1173233 1035207 965632 782242 1018031
14676A018031j80553o903N36380n09772m2969M4137R8005O5798j83069K24314
$$ 1018031 837478 830575 1366955 857183 814214 858351 956356 1022154 839085 1063399
14666A063399o1162J24098j78484N6856J89055p2705K1915l8989j23120r626L38771
$$ 1063399 1002237 1126335 947851 1004707 1193762 1121057 1142972 1103983 980863 971237 1310008
14655A310008o0373l78121M65096n34418L68601Q0868j4162l92524L30272L43517
$$ 1310008 1249635 871514 1336610 802192 1170793 1251661 1237499 844975 1175247 1518764
14645A518764m28687O7005Q9984K2964k25881K25472L3264k38630L09035j67825
$$ 1518764 1090077 1157082 1247066 1270030 1044149 1269621 1302885 1064255 1373290 1205465
14635A205465J32963N468n9238n1580j6695L02272j24181l6434n9731k1639L786
$$ 1205465 1338428 1343896 1284658 1233078 1216383 1518655 1394474 1358040 1298309 1276670 1280456
14624A280456O4707O5335n3456j88443J22190L394n779K40258n81346M55908p3887
$$ 1280456 1345163 1410498 1357042 1168599 1290789 1294183 1288404 1528662 947316 1403224 1329337
14613A329337L38739O8108k08406j80303j1575L10631O2409k28049Q0182k58514
$$ 1329337 1668076 1736184 1527778 1347475 1335900 1646531 1708940 1480891 1561073 1302559
14603A302559J47997K51514J40194j69049Q2735l86797L43201l75849K04946o8882
$$ 1302559 1450556 1702070 1842264 1673215 1755950 1369153 1712354 1336505 1541451 1472569
14593A472569Q4962J48275K34587j82506K71384j37299k03966M68k7451K36852
$$ 1472569 1557531 1705806 1940393 1757887 2029271 1891972 1688006 1688474 1661023 1897875
14583A897875j62051J93309n7636K68520Q3898l61281j71650J47140K26619L06069
$$ 1897875 1735824 1929133 1871497 2140017 2223915 1862634 1690984 1838124 2064743 2370812
14573B370812j14216k00797O3176M7878r7507K07904l22142K55443K44362k34409
$$ 2370812 2256596 2055799 2118975 2166853 2069346 2277250 1955108 2210551 2454913 2220504
14563B220504K39337N1450N9749L19712j30394k04840P23075l00355l1658M44485
$$ 2220504 2459841 2511291 2571040 2890752 2760358 2555518 3278593 2978238 2946580 3391065
14553C391065K90753K61084M32739R97261K202463L128892P702577K2483829N316987
$$ 3391065 3681818 3942902 4375641 5372902 7575365 10704257 18406834 40890663 46207650
14544D6207650B0229747G894721l869321j089428n52279m23641R0789j81123K46036
$$ 46207650 20229747 7894721 4025400 2935972 2383693 1960052 2050841 1869718 2115754
14535B115754l33688J34824K27512J24497L59600R4961l88288L05694P02690K82524
$$ 2115754 1782066 1916890 2144402 2268899 2628499 2723460 2335172 2640866 3343556 3626080
14525C626080J945169N090837m063162l099656o44710l74480n3163o1978J42494
$$ 3626080 5571249 10662086 6598924 3499268 2854558 2480078 2426915 2364937 2507431
14516B507431J39017m0376K56448k80693k91937L43877K05090n1031j46570L12423
$$ 2507431 2646448 2606072 2862520 2581827 2289890 2633767 2838857 2787826 2641256 2953679
14506B953679l9524n2667j31292J16505K99180K00004l07253o5103O5961J91762
$$ 2953679 2914155 2861488 2730196 2846701 3145881 3345885 3038632 2973529 3039490 3231252
14496C231252m1897J84095M3875R2401m59240L59260j5001J27114j65428L86606
$$ 3231252 3189355 3373450 3417325 3509726 3050486 3409746 3394745 3521859 3356431 3743037
14486C743037j0425P15j65509K13072j14440J34534J25753J39367l00587J69361
$$ 3743037 3732612 3733327 3567818 3780890 3666450 3800984 3926737 4066104 3765517 3934878
14476C934878p673r2131K63615q5840L17201k80567O09620j05202J0399j11179
$$ 3934878 3927205 3835074 4098689 4012849 4330050 4049483 4659103 4553901 4564300 4453121
14466D453121n4416K13910k28807K00163J16029K9524N84767m74171k9198K13870
$$ 4453121 4398705 4612615 4383808 4583971 4700000 4729524 5314291 4840120 4810922 5024792
14456E024792J4419j9129L43988l36405K22115J46361j25826L54281l00326L13251
$$ 5024792 5039211 5020082 5364070 5027665 5249780 5396141 5270315 5624596 5324270 5637521
14446E637521k52612M19650J28252L65554l96908J5839O7400n8484J63695K08817
$$ 5637521 5384909 5804559 5932811 6298365 5901457 5917296 5984696 5926212 6089907 6298724
14436F298724K32434J10026k2947L11118n5803k73570N87651k59252J68009P8066
$$ 6298724 6531158 6641184 6618237 6929355 6873552 6599982 7187633 6928381 7096390 7174456
14426G174456M29956k8183M5470j02017K04394L92288p2709P498M97070R1346
$$ 7174456 7604412 7576229 7621699 7519682 7724076 8116364 8043655 8051153 8548223 8639569
14416H639569o3701j5407J86921M59522k06228L39500P3005p1134J42809K11020
$$ 8639569 8575868 8560461 8747382 9206904 9000676 9340176 9413181 9342047 9484856 9695876
14406I695876N46855k93224J73015M6288L60748n5027M76607j67327M23456k0202
$$ 9695876 10242731 9949507 10122522 10168810 10529558 10474531 10951138 10783811 11207267 11187065
14396A1187065N20579l3861L9983K22182K95083j73732M09524N13613P9187K38110
$$ 11187065 11707644 11673783 11713766 11935948 12231031 12057299 12466823 12980436 13059623 13297733
14386A3297733L68805L12328N258L69825R1990J89801O25225k06320M44251M21469
$$ 13297733 13666538 13978866 13984124 14353949 14445939 14635740 15260965 15054645 15498896 15920365
14376A5920365J52321K50002K49211M37569K37379M41255j12613Q12726L5742
$$ 15920365 16072686 16322688 16571899 17009468 17246847 17688102 17575489 18388215 18423957
14367A8423957N87545O21745N95152j33228M69498N60321K39516R83001L27343
$$ 18423957 19011502 19633247 20228399 20095171 20564669 21124990 21364506 22347507 22674850
14358B2674850J29472N89097R66880L37094N22207P5146R81326Q93581L96297
$$ 22674850 22804322 23393419 24360299 24697393 25219600 25294746 26276072 27169653 27565950
14349B7565950R05101N29920O09825Q03869J115857N37015R93578P17874O37437
$$ 27565950 28471051 29000971 29610796 30414665 31530522 32067537 33061115 33778989 34416426
14340C4416426J572571R27753Q58055J105149J186673R37859J398497J372121
$$ 34416426 35988997 36916750 37774805 38879954 40066627 41004486 42402983 43775104
14332D3775104J005367R74644K132959J388675J591488J480432J761293J558498
$$ 43775104 44780471 45755115 47888074 49276749 50868237 52348669 54109962 55668460
14324E5668460J736078K068486K302635K278978J885010K411622K313168K697597
$$ 55668460 57404538 59473024 61775659 64054637 65939647 68351269 70664437 73362034
14316G3362034K849029K644251K973912L304252L300564L471692M185848L686635
$$ 73362034 76211063 78855314 81829226 85133478 88434042 91905734 96091582 99778217
14308I9778217M174238M541118M691120M808528N543834N198609O035873O132949
$$ 99778217 103952455 108493573 113184693 117993221 123537055 128735664 134771537 140904486
14300A40904486O337642P236031P281526P695628Q117278Q794245R103169R605798
$$ 140904486 147242128 154478159 161759685 169455313 177572591 186366836 195470005 205075803
14292B05075803J0026035J0966483J1201388J1984474J2225465J3103753J3438461
$$ 205075803 215101838 226068321 237269709 249254183 261479648 274583401 288021862
14285B88021862J3787262J4335488J4694903J4723769J4755706J4968264J4395374
$$ 288021862 301809124 316144612 330839515 345563284 360318990 375287254 389682628
14278C89682628J4105269J3531240J2225387J0997589Q534418M769837K681368
$$ 389682628 403787897 417319137 429544524 440542113 449076531 453846368 456527736
14271D56527736K122107J186649j483899l655277m124806o100079p993047r598228
$$ 456527736 458649843 459836492 458352593 454697316 450572510 444472431 436479384 426881156
14263D26881156j1300987j2926641j3992673j4904516j5423059j5308509j5472041
$$ 426881156 415580169 402653528 388660855 373756339 358333280 343024771 327552730
14256C27552730j5226350j4732568j4391631j4192928j3393510j2616927j2063481
$$ 327552730 312326380 297593812 283202181 269009253 255615743 242998816 230935335
14249B30935335j1608666j0776104j0229058r809937r249511q323685q375398
$$ 230935335 219326669 208550565 198321507 188511570 179262059 170938374 162562976
14242A62562976p719270p114764o929695o535844o410338n518434j916165l158195
$$ 162562976 154843706 147728942 140799247 134263403 127853065 122334631 120418466 117260271
14234A17260271o078258n472767m961444l626645m043522l648390l979195l508361
$$ 117260271 111182013 105709246 100747802 97121157 93077635 89429245 85450050 81941689
14226H1941689k545949l457882k507258k538331k982217k031473j983854k155748
$$ 81941689 79395740 75937858 73430600 70892269 67910052 65878579 63894725 61738977
14218F1738977k000278k362667j787279j905959j357861j340498j747955j815629
$$ 61738977 59738699 57376032 55588753 53682794 52324933 50984435 49236480 47420851
14210D7420851r96868j850788q51531n08769j276550j521286j569885j034162
$$ 47420851 46423983 44573195 43721664 43212895 41936345 40415059 38845174 37811012
14202C7811012q55623p36392p57215j117077j345212n10876q51113p99052o55087
$$ 37811012 36955389 36218997 35461782 34344705 32999493 32488617 31637504 30838452 30183365
14193C0183365p15921q36769q13334p64985k51009p62267p82029o41587l00460
$$ 30183365 29467444 28630675 27817341 27052356 26801347 26039080 25257051 24615464 24315004
14184B4315004p00457k69552m90453o83195n47970l62951m42387m34639p2506
$$ 24315004 23614547 23344995 22854542 22171347 21623377 21260426 20818039 20383400 20310894
14175B0310894o10740n14091n47180j20269k10487n83789m91419k52370l76025
$$ 20310894 19700154 19186063 18638883 18518614 18308127 17724338 17232919 16980549 16604524
14166A6604524m71713k2047l01305m77712n99677J31903m69144m09242N24598
$$ 16604524 16132811 16110764 15809459 15331747 14732070 14863973 14394829 13985587 14510185
14157A4510185q25613m6436m48031J5125o2148k60958o57891N07028n52557n9942
$$ 14510185 13684572 13638136 13190105 13205230 13143082 12882124 12224233 12731261 12178704 12118762
14147A2118762m21845J52226p27351J29555m86323J08540L9829l00354l58780
$$ 12118762 11696917 11849143 11121792 11251347 10765024 10873564 10913393 10613039 10254259
14138A0254259m9947J15908o69298J77196j68429n8214j03860o9929k97216M2302
$$ 10254259 10204312 10320220 9650922 9828118 9659689 9601475 9497615 9427686 9130470 9172772
14128I172772j34751r2625k92964k61167m020k65851J12652m3954l27690J08185
$$ 9172772 9038021 8945396 8652432 8391265 8387245 8121394 8234046 8190092 7862402 7970587
14118G970587p40818O27685j76836k54671n1078J5673l19432L59015k58843n0169
$$ 7970587 7229769 7857454 7680618 7425947 7374869 7390542 7071110 7430125 7171282 7121113
14108G121113k629l61358J71462l23205M47342k86547o39233K55374o5073K9464
$$ 7121113 7118484 6757126 6928588 6605383 7052725 6766178 6126945 6382319 6317246 6346710
14098F346710k09485k33626J83733Q6115m90099J69193l29987J5548j10868J27004
$$ 6346710 6137225 5903599 6087332 6173447 5683348 5852541 5522554 5538102 5427234 5554238
14088E554238l1511l67719K38063j13807m4933N7140m17459J11978k4933k24461
$$ 5554238 5522727 5155008 5393071 5279264 5234331 5291471 4874012 4985990 4961057 4736596
14078D736596K51078j83977o6733o1939K31481m24578L15213j70155l8136N3081
$$ 4736596 4987674 4803697 4736964 4675025 4906506 4481928 4797141 4626986 4588850 4641931
14068D641931l03830k2022j13785l5262J73859k96123J52725K68262n13506n4812
$$ 4641931 4338101 4316079 4202294 4167032 4340891 4044768 4197493 4465755 3952249 3897437
14058C897437K13732r1504o0404r9595O6663l3920l25656M92216l31876P445j1750
$$ 3897437 4111169 4019665 3959261 3859666 3926329 3892409 3566753 4058969 3727093 3734538 3722788
14047C722788j63432J00683J91131o16122J62488k37915L63549q8051l81089L00952
$$ 3722788 3559356 3660039 3851170 3235048 3397536 3159621 3523170 3435119 3054030 3354982
14037C354982k42658j05146K89177j37960q7283j24070O50799n51950r5976P3705
$$ 3354982 3112324 3007178 3296355 3158395 3071112 2947042 3597841 3045891 2949915 3023620
14027C023620R8067k345j59695K2615J94530k14890J44565l067j35641k64121
$$ 3023620 3121687 3119342 2959647 2982262 3176792 2961902 3106467 3103400 2967759 2703638
14017B703638K20724k93194L33832j05163k98601j20963K90837j88916n9901k26553
$$ 2703638 2924362 2631168 2965000 2859837 2561236 2440273 2731110 2542194 2482293 2255740
14007B255740N30076m51853K02430l56051K30256o2698l32090N73146j88929k0422
$$ 2255740 2785816 2333963 2536393 2180342 2410598 2347900 2015810 2588956 2400027 2379605
13997B379605k83716J3851q2945J8029K90249j73600j15092P34519R07637J799070
$$ 2379605 2095889 2109740 2026795 2044824 2335073 2161473 2046381 2780900 3688537 5487607
13987E487607N620129J9105326K0871304k2976807A3753173n617536k019644j262579
$$ 5487607 11107736 30213062 51084366 28107559 13753173 8135637 6115993 4853414
13979D853414q39797m23225j97153j62748j56013M8118j66413k11661k52154M06010
$$ 4853414 4013617 3590392 3393239 3230491 3074478 3122596 2956183 2744522 2492368 2898378
13969B898378m59759j27172J00377k29667J38625k5134j21477J72488k18351K10007
$$ 2898378 2438619 2311447 2411824 2182157 2320782 2295648 2174171 2346659 2128308 2338315
13959B338315J3081Q4596p35522N11630P6127j47366k79462j54566N88212k88480
$$ 2338315 2351396 2435992 1700470 2212100 2288227 2140861 1861399 1706833 2295045 2006565
13949B006565j9737l8746J97117l54619K06034k64244J2617K47380n2594k8719
$$ 2006565 1986828 1948082 2145199 1790580 1996614 1732370 1744987 1992367 1939773 1911054
13939A911054p8599J58341k36537K73262j82217n6601k56391m5673J18879K6168
$$ 1911054 1832455 1990796 1754259 2027521 1845304 1788703 1532312 1486639 1605518 1631686
13929A631686j68774Q5034J57007k19975K27544K81342l24320J07034j43125r4391
$$ 1631686 1462912 1547946 1704953 1484978 1712522 1993864 1669544 1776578 1633453 1539062
13919A539062R4309R491J39853p1830k7892J02214m43178O1164J62228l49851
$$ 1539062 1633371 1642862 1782715 1710885 1682993 1785207 1342029 1403193 1565421 1215570
13909A215570L85522J84542k50306K48501l10033K5288O6468k74797N21335o04446
$$ 1215570 1601092 1785634 1535328 1783829 1473796 1499084 1565552 1290755 1812090 1207644
13899A207644N8950j7696K23519k56832o71J47533L78017p44598j03933P43034
$$ 1207644 1266594 1248898 1472417 1215585 1214914 1362447 1740464 995866 891933 1634967
13889A634967n1456k26937o4238o544J34004j15816j99405K0731N2095K14473
$$ 1634967 1583511 1356574 1292336 1285792 1419796 1303980 1104575 1125306 1177401 1391874
13879A391874j06778M2152R5256k54079k63792J37194L37072m4149l17524K87968
$$ 1391874 1285096 1327248 1422504 1168425 904633 1041827 1378899 1334750 1017226 1305194
13869A305194l19166J77680q1734r4357J95335j41036R730M006J33148k52705
$$ 1305194 986028 1163708 1081974 987617 1182952 1041916 1051646 1055652 1188800 936095
13859I36095O4340M7887j35340M73795k39367O3743k22798J07465L1707j18824
$$ 936095 1000435 1048322 912982 1386777 1147410 1211153 988355 1095820 1127527 1008703
13849A008703J98182n2904k11330J28799J91043l27553K09487j97901N6180K52568
$$ 1008703 1206885 1153981 942651 1071450 1262493 934940 1144427 946526 1002706 1255274
13839A255274n25609j17648L47893J84220m12230l9913J88056M63215l58140N4115
$$ 1255274 729665 612017 959910 1144130 731900 691987 880043 1343258 985118 1039233
13829A039233k9329J27229o9k53371J51599j93268J62103j07082O4872D79016
$$ 1039233 1009904 1137133 1137064 883693 1035292 842024 1004127 897045 961917 479016
13818A084097k19059j352K43760k41289j74736J00301J41916K57590j41166k56037
$$ 1084097 865038 863686 1107446 866157 691421 791722 933638 1191228 1050062 794025
13808G94025J2874j87620L29570j03909M32634m09762j62690K36693k70501K31751
$$ 794025 806899 619279 948849 844940 1277574 867812 705122 941815 671314 903065
13798I03065M4797k39444M51735k01011j67460J981j21955R2242Q6344p4757K21670
$$ 903065 947862 708418 1160153 959142 791682 793663 671708 763950 850294 775537 997207
13787I97207k89155J94963j57156O5165r0918L71319n35370O37649E58984j77377
$$ 997207 708052 903015 745859 811024 720106 1091425 556055 1193704 558984 381607
13777C81607K73946L44408l21081o0542k572J02501m7050J80832N6577p5920k0397
$$ 381607 655553 999961 678880 618338 615766 718267 671217 852049 908626 832706 812309
13766H12309q2659j23104K3455j00149L2985l9126M90031j40828j97059k57231
$$ 812309 729650 606546 630001 529852 562837 523711 1013742 872914 675855 418624
13756D18624K95147m3895k0544j886K1484j06328P0999k08992M50482l18567o0451
$$ 418624 713771 669876 649332 647446 668930 562602 633601 424609 875091 556524 496073
13745D96073n6525O34577l21220K38339k94721B35571P01712p7137l66755J69356
$$ 496073 439548 1074125 752905 991244 696523 235571 937283 860146 493391 662747
13735F62747C07157L02113J15665r9142R4827k20336m7216K47418l15375P2266
$$ 662747 307157 609270 724935 625793 720620 500284 453068 700486 385111 457377
13725D57377K94541k92647p9816L5164K08706K6645j26386R6652k92298K67591
$$ 457377 751918 459271 379455 414619 623325 649970 523584 620236 327938 595529
13715E95529K83174l73609K26707p4078B23062O06602j43202k79155J07562k15412
$$ 595529 878703 505094 731801 657723 223062 829664 686462 407307 514869 299457
13705B99457K46798k09601n3154K88542j40519J96878r8754p3796o1365L54731
$$ 299457 546255 336654 283500 572042 431523 628401 529647 455851 394486 749217
13695G49217k8050j67927L7105k27189L65958B72433K77148K6887B70161K42806
$$ 749217 721167 553240 590345 363156 729114 272433 549581 576468 270161 512967
13685E12967q5144m317K68697B79145M35301k57512p2722J39322R443q1610n3890
$$ 512967 427823 423506 692203 279145 714446 456934 384212 523534 532977 451367 397477
13674C97477J88801j20726R0909q671j38232P7654j11617N5915J23688J64469
$$ 397477 586278 465552 556461 547790 409558 487212 375595 431510 555198 719667
13664G19667C23479K54194m0396k42335L49848k12863j66340p3174J62321J44385
$$ 719667 323479 577673 537277 294942 644790 431927 265587 192413 354734 499119
13654D99119K20275A76781N46022B5060N50425j36718J97176o045j85065M2734
$$ 499119 719394 176781 722803 25060 575485 438767 635943 629898 444833 487567
13644D87567q243K20749q1158B25437J09115J73650k17147M91429l13462K9461
$$ 487567 479324 700073 618915 225437 334552 508202 291055 782484 469022 498483
13634D98483j36715K58743j85601k03334L67690j61530J96001L6585k13144J16371
$$ 498483 361768 620511 434910 231576 599266 437736 633737 670322 457178 573549
13624E73549j86371q974K09190q1386J52787p1176A76076J57026J27441k8782
$$ 573549 387178 378204 587394 506008 658795 587619 176076 333102 460543 431761
13614D31761m7178G3448O49247C10647L38191B04435J6337L3451p407J90450j0926
$$ 431761 384583 73448 722695 310647 648838 204435 220772 254223 246816 437266 426340
13603D26340R1511j69230K12961k32611A64249K37782j37912J07152n5186Q7016
$$ 426340 517851 348621 561582 328971 164249 402031 264119 371271 316085 403101
13593D03101J82092q3141j84301J23270k01563K24085A07346L81164L25942b8223
$$ 403101 585193 502052 317751 441021 239458 463543 107346 488510 814452 -28223
13582D89003j5122l6840F7110N3630J99666o1059n606B8339J0750J97019j08466
$$ 489003 473881 437041 67110 120740 320406 259347 253741 28339 39089 236108 127642
13571A27642K37481j42149P473j14931L33255k05828J01373J4492r3102O944o846
$$ 127642 365123 222974 230447 115516 448771 242943 344316 358808 265706 272650 265804
13560B65804K91750j64188j7148A85028K51715I5759K08448K05409A07652J37101
$$ 265804 557554 393366 376218 185028 436743 95759 304207 509616 107652 244753
13550B44753k9P2625j50657f331C27556n5334m1763K84671j41006A41664K50069
$$ 244753 244724 317349 166692 -6331 327556 272222 230459 515130 374124 141664 391733
13539C91733i2230B51554K44254p5854j49119q4187J14861e1629D84094B31591
$$ 391733 -92230 251554 495808 419954 270835 186648 301509 -51629 484094 231591
13528D29955A75735P207K53088j58594k1265m4774K67341A38764K27249r5031
$$ 429955 175735 182942 436030 277436 256171 211397 478738 138764 366013 270982
13518B70982J82826o0770A17012J91524G5594J59585E9058n576L12447j60797
$$ 270982 453808 393038 117012 308536 75594 235179 59058 53482 365929 205132
13508B05132J47421r9467L10257F2419J07315R8913I5178l8228M17349k0359B7503
$$ 205132 352553 253086 563343 62419 169734 268647 95178 56950 474299 453940 27503
13496D44441q6157j8980A59284p3058O89444l84375A41606L55768B40469G9349
$$ 444441 358284 339304 159284 86226 775670 391295 141606 497374 240469 79349
13485a53254c5817C34437A38975K50329j62235F2443k1647J66908l5579C4384
$$ -153254 -35817 334437 138975 389304 227069 62443 40796 207704 172125 34384
13474B96359A14872C4811L29806D4160M44738I2773J68784K4817K15862f8513
$$ 296359 114872 34811 364617 44160 488898 92773 261557 286374 502236 -68513
13463F66734j64477j22074L8557F0977J20245R4009A04070O8167C6748J21973
$$ 666734 502257 380183 418740 60977 181222 275231 104070 172237 36748 158721
13453A58721L03435k20276K54521A51613M266k9727J00960B8702K03594K44445
$$ 158721 462156 241880 496401 151613 155879 126152 227112 28702 232296 476741
13443D76741A41679J99551O7669D0246K10305L65259B83481A27347b0482D21347
$$ 476741 141679 341230 408899 40246 250551 615810 283481 127347 -20482 421347
13432C67737j33809k3012K8105I7486k9286J21485Q9062I1300j3819f5620A64450
$$ 367737 233928 210916 239021 97486 68200 189685 278747 91300 77481 -65620 164450
13420A63795L50095H5354L43668A17908O8251a37051A71583m3618K226k9587L19067
$$ 163795 513890 85354 429022 117908 186159 -137051 171583 127965 130191 100604 419671
13409D19671j27347j5743A13645L5580R3986J69228k02368j1802B5153N7457L85625
$$ 419671 292324 276581 113645 149225 243211 412439 210071 198269 25153 82610 468235
13398D68235A38770P1706R462Q7284b16469d0837B47074a16848F2206K01911H528
$$ 468235 138770 210476 219938 307222 -216469 -40837 247074 -116848 62206 264117 8528
13386B16919k9367G3139Q3522L18682A73255a13388B11036A02361Q3235M81675
$$ 216919 187552 73139 156661 475343 173255 -113388 211036 102361 185596 667271
13376F67271A18106M935A984J63704M2919b09379A59228K16622j49504K7994A5128
$$ 667271 118106 123041 1984 165688 208607 -209379 159228 375850 226346 254340 15128
13364D22602G4892J74669Q1071k4130A41523P4693Q9753C8236O26001B37906j07825
$$ 422602 74892 249561 330632 306502 141523 216216 305969 38236 664237 237906 130081
13353A30081n6337M3392k5847L0063K06136j20838o5818J66287a4074F37415L3955
$$ 130081 73744 117136 91289 121352 327488 206650 140832 307119 -14074 637415 671370
13342F71370A07436A2118Q1549J64246Q558K7230l4505J12694K32218j69225J35061
$$ 671370 107436 12118 93667 257913 266471 293701 259196 371890 604108 434883 569944
13331E69944A77806L61993A73537L43484d1210C57067A08832J24927K00469j26522
$$ 569944 177806 539799 173537 517021 -41210 357067 108832 233759 434228 307706
13321C07706J62681B34230I1456i7016b5793A07660J35786o3490Q7110B76N3831
$$ 307706 470387 234230 91456 -97016 -25793 107660 243446 179956 267066 276 54107
13310E4107K82502n4017l637J97912a02140j18907C04510b15533A74376J92313
$$ 54107 336609 282592 278955 476867 -102140 -221047 304510 -215533 174376 366689
13300C66689A26548l9512b65182d3647l5009B72707l5003C3463J26312b70099
$$ 366689 126548 87036 -265182 -43647 -78656 272707 237704 33463 159775 -270099
13289b04332A98698C7920Q6936F534A992J67971a06600E8003A0803i1453B7953
$$ -204332 198698 37920 124856 6534 1992 169963 -106600 58003 10803 -91453 27953
13277C29300q9634m2302k4031q3397Q9656e5935A33836M4423O3917G2321f4738
$$ 329300 239666 197364 173333 89936 179592 -55935 133836 178259 242176 72321 -64738
13265H4538I174J17124Q6144J48485c1595e047k920G1648P9376k5161J62811I5306
$$ 84538 9174 126298 212442 360927 -31595 -5047 -7967 71648 151024 125863 288674 95306
13252A03884O500B0838K95430A00851a28411j06776A46352K81959a2872D3067
$$ 103884 110384 20838 316268 100851 -128411 -235187 146352 428311 -12872 43067
13241D9219P1170m0882J60285r2829J38894a56401B03425b1469l715D87556A27740
$$ 49219 120389 79507 239792 146963 285857 -156401 203425 -21469 -25184 487556 127740
13229C5809J54006q2431D645K85866A25669J01642J46533j42104g7414A445K12261
$$ 35809 189815 107384 4645 290511 125669 227311 373844 231740 -77414 1445 213706
13218B13706Q1784A00350c3417C66382j47060c20j30362E6196J5296R4826Q1214
$$ 213706 295490 100350 -33417 366382 219322 -320 -130682 56196 71492 166318 247532
13207B47532E5659R6624K01955J10125D3002j3814K62670j39981D6811L12336
$$ 247532 55659 152283 354238 464363 43002 29188 291858 151877 46811 359147
13197C59147A48563O8728g8413A6263Q3233J70542G3190J67887a03728j348N1520
$$ 359147 148563 217291 -78413 16263 99496 270038 73190 241077 -103728 -105076 -53556
13186e3556E50020B32086o4740k7038J66772G2878L13555F9632b13438B26938
$$ -53556 550020 232086 167346 140308 307080 72878 386433 69632 -213438 226938
13175E9829a83427q5057C62647d0054j68596d7428j52501A80982h0803b3436A1377
$$ 59829 -183427 -268484 362647 -40054 -208650 -47428 -199929 180982 -80803 -23436 11377
13163I5725c2287m3543C4520L6199k9010b5530A47678b4583B85443a4068k09838
$$ 95725 -32287 -75830 34520 70719 41709 -25530 147678 -24583 285443 -14068 -223906
13152b23906B34139h6642A95753A5643L3250a92988C68356j36773a20043j7651
$$ -223906 234139 -86642 195753 15643 48893 -192988 368356 231583 -120043 -137694
13142a37694D5254b48376A64855J51616f0463B33801j15041k7448O9525J15049
$$ -137694 45254 -248376 164855 316471 -60463 233801 118760 91312 160837 275886
13132B75886n3624a55328H9836e2058B91435I758J88742I0756M5088E4892a66670
$$ 275886 222262 -155328 89836 -52058 291435 9758 198500 90756 135844 54892 -166670
13120C03335q4188C6475J98022f2189B09008a69185A9169b30905B15216o5685
$$ 303335 219147 36475 234497 -62189 209008 -169185 19169 -230905 215216 149531
13110A49531O07p1731K5025P2732K01457e1260B94459d5266D0988R6469J66082
$$ 149531 150138 78407 103432 176164 377621 -51260 294459 -45266 40988 137457 303539
13099C03539G0562c0973j7793C71458e7320e429D9243J1300J24258m4645R9302
$$ 303539 70562 -30973 -48766 371458 -57320 -5429 49243 60543 184801 140156 239458
13088B39458a42371b7656D1043J50830J17891c01610b8447A10357N9164d0483
$$ 239458 -142371 -27656 41043 191873 309764 -301610 -28447 110357 169521 -40483
13077g6231A72019a75138P5560C82923f6694I8096b08418h6196C25415I2020M9064
$$ -76231 172019 -175138 -99578 382923 -66694 98096 -208418 -86196 325415 92020 141084
13066A41084a14029B23121h3070J9782C68016b77967A93385d1292D9316a26740
$$ 141084 -114029 223121 -83070 -63288 368016 -277967 193385 -41292 49316 -126740
13055B16929m5992f0412o5434D6490N4601b5309B99440a53683e3853l1778A12280
$$ 216929 170937 -60412 -125846 46490 101091 -25309 299440 -153683 -53853 -85631 112280
13043B09701F1863L93519b18201f7999D71726c08745a47685C46749m0627E4851
$$ 209701 61863 455382 -218201 -67999 471726 -308745 -147685 346749 306122 54851
13032a76695A06399L3582J0293a13573B67740a72956Q5027l7879A08510K27352
$$ -176695 106399 139981 150274 -113573 267740 -172956 -87929 -125808 108510 335862
13022C35862j00736b13111L7898j82871F3183L9519B6481O6058l866b4059k4680
$$ 335862 235126 -213111 -175213 -358084 63183 102702 26481 92539 88673 -24059 -48739
13011d8739j3737A41056g8049C34719c70635b3701l0742C03958j13306E0191a3435
$$ -48739 -62476 141056 -78049 334719 -370635 -23701 -54443 303958 190652 50191 -13435
12999A21374E3587f067A85453b9973A71746p5272m8037a67709B83978o3238b0334
$$ 121374 53587 -6067 185453 -29973 171746 96474 48437 -167709 283978 220740 -20334
12987D9859b7057B2308J78836c2099J3592l0728a2966F6321K6604L03728A12803
$$ 49859 -27057 22308 201144 -32099 -18507 -49235 -12966 66321 92925 396653 112803
12975d16287A09469j3439J7782c03105A45472g1450I4388f5195C76349G0592A6267
$$ -416287 109469 96030 113812 -303105 145472 -71450 94388 -65195 376349 70592 16267
12963B69176I3447J22332e1627G2708j2262a05586D4300a49581D88416A59757
$$ 269176 93447 215779 -51627 72708 60446 -105586 44300 -149581 488416 159757
12952a78400A41734a90442r2504J39611D239J77896i7218B488M46282j69523G9865
$$ -178400 141734 -190442 -282946 -143335 4239 182135 -97218 2488 448770 279247 79865
12940C7261d7525B4527J10638b78666g267k14545M236G3747h2279A3558P6300
$$ 37261 -47525 24527 135165 -278666 -7267 -221812 -217576 73747 -82279 13558 89858
12929H9858a98103G9084C2029h6701D003b08020j22579C03423b2074B09991a37063
$$ 89858 -198103 79084 32029 -86701 4003 -208020 -330599 303423 -22074 209991 -137063
12917b81420f15A95577f9629a5365q098j21903N5161A7984g3505A24801B9900
$$ -281420 -615 195577 -69629 -15365 -23463 -145366 -90205 17984 -73505 124801 29900
12905A95680a33267L7283B7542d1472D9657R8657a63591j48973b4451B6798a25503
$$ 195680 -133267 -95984 27542 -41472 49657 148314 -163591 -312564 -24451 26798 -125503
12893h1596F3220A2870b46581h8819o8413A20384m184E3468i4112a790j38862
$$ -81596 63220 12870 -246581 -88819 -157232 120384 116200 53468 -94112 -1790 -140652
12882a40652D9401J2476a30706A46142g9412A4774c61741J38630P8082A49150
$$ -140652 49401 61877 -130706 146142 -79412 14774 -361741 -223111 -145029 149150
12871A77211K27035f4333A15305a74202A22612K0569C9662f6022r5667j26819
$$ 177211 404246 -64333 115305 -174202 122612 143181 39662 -66022 -161689 -288508
12861b88508A26406K07625a29718J9827b2324r6844b4471j00400m6021O0124C28448
$$ -288508 126406 334031 -129718 -109891 -22324 -119168 -24471 -124871 -170892 -110768 328448
12849B7214a45592e271l1107F1929a18556B53806e6327c250C632H88J08707J50331
$$ 27214 -145592 -5271 -36378 61929 -118556 253806 -56327 -3250 3632 888 109595 259926
12837B59926a29150D3246J34614e9733H6366a13890A19136n5161c11582H6301
$$ 259926 -129150 43246 177860 -59733 86366 -113890 119136 63975 -311582 86301
12826f6514A96916b2100F3792a80539C9810J2164J40966b20970A05721a20566
$$ -66514 196916 -22100 63792 -180539 39810 51974 192940 -220970 105721 -120566
12815F651e2109D6090b06123K8252a2486B68910r7807a03493l24532K06936B42450
$$ 6651 -52109 46090 -206123 -177871 -12486 268910 171103 -103493 -428025 -221089 242450
12803B0402g1898A01358a23719A39139a19283D0800Q0218e9116A8886b16435G3764
$$ 20402 -71898 101358 -123719 139139 -119283 40800 121018 -59116 18886 -216435 73764
12791B07138K38509B13745H9459j3607J331P2321J15189b0510j10343B96692a24065
$$ 207138 445647 213745 89459 75852 77183 149504 264693 -20510 -130853 296692 -124065
12779b04385C31707q6220b9725p6409m9819M285B68969q7970l8288a84410A89333
$$ -204385 331707 245487 -29725 -106134 -155953 -151668 268969 180999 142711 -184410 189333
12767C62424b15681A7865L05519A23128a04376A04061M43e7466E9408b13705E4902
$$ 362424 -215681 17865 323384 123128 -104376 104061 104504 -57466 59408 -213705 54902
12755f0263A20452d8212r7864O0482A76897L7928a13398L611D7871c37458a18139
$$ -60263 120452 -48212 -146076 -85594 176897 214825 -113398 -109787 47871 -337458 -118139
12743A66208c5473a0886l3813B56620O4195b69830l8755A05431K90186A43394
$$ 166208 -35473 -10886 -44699 256620 320815 -269830 -308585 105431 395617 143394
12732i0735B81661o3853m7997J10171M8867A4894K20007b48057f0634j11578O4416
$$ -90735 281661 217808 169811 279982 328849 14894 234901 -248057 -60634 -172212 -107796
12721a07796A1291K8503c42023B2384K3812N530d9115l2933B24563d0571F9967
$$ -107796 11291 39794 -342023 22384 46196 51726 -49115 -82048 224563 -40571 69967
12709A09648D9821Q7572E4452J34028N1853a77947K6121d2358B14229C8779M3872
$$ 109648 49821 137393 54452 188480 240333 -177947 -151826 -42358 214229 38779 82651
12698H2651c7556j54500a2856B47968d945r9422D9250K82706f2614B45983c35180
$$ 82651 -37556 -192056 -12856 247968 -4945 -104367 49250 331956 -62614 245983 -335180
12686C62721a01472C2665j1355e4769A88696D0817a02685A18248h0177A64641
$$ 362721 -101472 32665 21310 -54769 188696 40817 -102685 118248 -80177 164641
12675a33627M938A19934a92622A65851l0570d8153j89513Q7743A02041a08299
$$ -133627 -128689 119934 -192622 165851 135281 -48153 -237666 -149923 102041 -108299
12664B56943e448D05189A29072Q3406j00228c3335I3027K07568d04501c4712l4204
$$ 256943 -5448 405189 129072 212478 112250 -33335 93027 300595 -404501 -34712 -68916
12653f8916k72985B01501G6523K07870j07178b3508A86284a32697A02080K84957
$$ -68916 -341901 201501 76523 284393 177215 -23508 186284 -132697 102080 387037
12643C87037A6528g8473k22587A91132a27770A23584n251L2788R4316H2602d0558
$$ 387037 16528 -78473 -301060 191132 -127770 123584 118333 151121 245437 82602 -40558
12631B10846J06106K6751c4879j35804B57481d5337k95813G151K46528J14401
$$ 210846 316952 343703 -34879 -170683 257481 -45337 -341150 7151 253679 368080
12621C68080A35999K35940i6935a2197j81053Q0929e1368A43591J79248A60022
$$ 368080 135999 371939 -96935 -12197 -193250 -112321 -51368 143591 322839 160022
12610A41534l9261f1291A88170K28609a97933B52964b14926c2931B8489b5580
$$ 141534 102273 -61291 188170 416779 -197933 252964 -214926 -32931 28489 -25580
12599E0783L45135a13479I8055L8014c8937D53450j63400A43829h6738A31532
$$ 50783 395918 -113479 98055 136069 -38937 453450 290050 143829 -86738 131532
12588B29584l1714a26656G1495d53D7838B2278N4014C5804J68699f3348A71961
$$ 229584 197870 -126656 71495 -453 47838 22278 76292 35804 204503 -63348 171961
12576f4982F1734g8392I7766e7924I400L1585c9452J1665A01229O58k5356d6609
$$ -64982 61734 -78392 97766 -57924 9400 40985 -39452 -27787 101229 101887 76531 -46609
12563a54497H4647B133e9813l26344H8668h6651J9169p1515q3038A65008k6989
$$ -154497 84647 2133 -59813 -386157 88668 -86651 -67482 -138997 -222035 165008 138019
12552A38019m6952K6397J22467H3331f8686C3138J71874P8891d7878j9229j4739
$$ 138019 91067 117464 239931 83331 -68686 33138 205012 283903 -47878 -67107 -81846
12541h1846A43003K10280I275h4746j03624B20311q7000e4065J4770A66976c26307
$$ -81846 143003 353283 9275 -84746 -188370 220311 133311 -54065 -39295 166976 -326307
12529E1766b60959i0997n2402C20259j14780G8600a5534H073J20839J14880J86021
$$ 51766 -260959 -90997 -143399 320259 205479 78600 -15534 8073 128912 243792 429813
12518D29813a24796a7914F2963K6272b56881B02638G3237a84733H798b85225a32672
$$ 429813 -124796 -17914 62963 89235 -256881 202638 73237 -184733 8798 -285225 -132672
12506I7244d1684A10094n0035B1234J22458J09194k8582M6943c287G9010J17674
$$ 97244 -41684 110094 60059 21234 143692 252886 224304 271247 -3287 79010 196684
12495A96684D6856J47156K95132B28615P6097p8832J81281b45078A26984C2406
$$ 196684 46856 194012 489144 228615 304712 225880 407161 -245078 126984 32406
12484D1986J86890R1543A20080i5727j03388i2957a5512m6163B14230g2985G1908
$$ 41986 228876 320419 120080 -95727 -199115 -92957 -15512 -61675 214230 -72985 71908
12472B214J15947a16135f744j00531L104C3851e8719H353K52229C6152L7661l6450
$$ 2214 118161 -116135 -6744 -107275 -104171 33851 -58719 8353 260582 36152 73813 37363
12460C7363P1383f8669b3471j85963R6699B36723n8695D2451N4992L0037c53878
$$ 37363 108746 -68669 -23471 -209434 -112735 236723 178028 42451 97443 127480 -353878
12448A47475m4393J41536A06836h3265B16671J72104K1980b85052a37959M5479
$$ 147475 103082 244618 106836 -83265 216671 388775 410755 -285052 -137959 -92480
12438i2480j24043B16291g7209A20324f7259k05551A15223J98359a82759H1103
$$ -92480 -216523 216291 -77209 120324 -67259 -272810 115223 313582 -182759 81103
12427b8023j00408e8572g593B10779Q4199B7572a10258B69995C9508r567J7285
$$ -28023 -128431 -58572 -7593 210779 294978 27572 -110258 269995 39508 29941 47226
12416D7226a80285O4295B69413a48142M2598l46C39214b60434P9775A0115a8290
$$ 47226 -180285 -115990 269413 -148142 -105544 -105890 339214 -260434 -180659 10115 -18290
12404a97113K8375A70085H926a13793B57750j10832b44360A55769L4686N562q9986
$$ -197113 -168738 170085 8926 -113793 257750 146918 -244360 155769 190455 196017 106031
12393A06031m7572J26921J02037i4720A14354J32000a20416E22934A66919A1971
$$ 106031 58459 185380 287417 -94720 114354 246354 -120416 522934 166919 11971
12382C31239a57117D0187J99845C2182a6310B46313q7789J0336e4546C65837H9422
$$ 331239 -157117 40187 240032 32182 -16310 246313 158524 168860 -54546 365837 89422
12370A22717a19448B02895m6033a99958C70966c5146F5360c44265A64839b91317
$$ 122717 -119448 202895 156862 -199958 370966 -35146 65360 -344265 164839 -291317
12359A33311K4017M7107e4654F2732P5690O0745a90322Q1804D05787g75A09246
$$ 133311 157328 204435 -54654 62732 138422 199167 -190322 -108518 405787 -775 109246
12347I7489J74303B2931d302B61856Q643B4237a00002A19087N2760R8921K20507
$$ 97489 271792 22931 -4302 261856 270499 24237 -100002 119087 171847 270768 491275
12336D91275a7214B51256J45947C2406K87604J22243A42871a75142A9905Q7562
$$ 491275 -17214 251256 397203 32406 320010 442253 142871 -175142 19905 107467
12326A07467J41436J00070o0865m1095H3948N4103n2778L02818l7457A02557R8185
$$ 107467 248903 348973 288108 247013 83948 138051 85273 388091 350634 102557 200742
12315B00742n8185E7178K78279p7774B6361K75216A10659C9407Q1858M0959J10288
$$ 200742 142557 57178 335457 257683 26361 301577 110659 39407 121265 162224 272512
12304B72512a4741q0709A16747n7788J92780g445j32572k1688A39788k0415A4613
$$ 272512 -14741 -95450 116747 58959 251739 -7445 -140017 -161705 139788 119373 14613
12292B25975l6242q371O1438h605j45985C26278q7113J3554I9379a24687b3497
$$ 225975 189733 181362 242800 -8605 -154590 326278 239165 252719 99379 -124687 -23497
12280D40617A44151d9560j0935G1164O9350J02095R6785A4939g6684C3067J52246
$$ 440617 144151 -49560 -60495 71164 140514 242609 339394 14939 -76684 33067 185313
12269A85313a59423B87716j12025m8904c26889e1041q9847B01890F3782J61597
$$ 185313 -159423 287716 175691 126787 -326889 -51041 -140888 201890 63782 225379
12259B25379J06276G3547C4194C1R370C403Q7716g912j39164B33181M1343B0066
$$ 225379 331655 73547 34194 31 9401 3403 91119 -7912 -147076 233181 274524 20066
12246A09476R2646Q9067J4769A07973K16460J71626A88304m8445d7042l4438B82445
$$ 109476 202122 291189 305958 107973 324433 496059 188304 139859 -47042 -81480 282445
12234B2542N597i6969k61245A60889J38269A31384P4931a7801C08233L5774j25117
$$ 22542 28139 -96969 -358214 160889 299158 131384 206315 -17801 308233 344007 218890
12223B18890J56208A15276K75921j61878K9221K14356j96473A29257K8701M7916
$$ 218890 375098 115276 391197 229319 258540 472896 276423 129257 157958 205874
12213B05874O1356B2659O618M18720B2892K83513F7752Q5163J07066E6994A8937
$$ 205874 267230 22659 29277 447997 22892 306405 67752 152915 259981 56994 18937
12201D077J6323e73B12038d1040A83318l1181J64112L0575b062D37719B2643f9181
$$ 4077 20400 -573 212038 -41040 183318 152137 316249 346824 -2062 437719 22643 -69181
12188E08743k14480a11023D53556B00968L6243J50373a34817D24082r6264E3374
$$ 508743 294263 -111023 453556 200968 237211 387584 -134817 424082 327818 53374
12177A93457O3479o1154e9612B97237a0272C18466A36013a10553B59177J29926
$$ 193457 256936 195782 -59612 297237 -10272 318466 136013 -110553 259177 389103
12167C89103j20684m4225L84511B78291D5637J62375n0653a33508B08079a4112
$$ 389103 268419 224194 608705 278291 45637 208012 157359 -133508 208079 -14112
12156H0319i3980J6792q939B8964M62993a64359H7475b9149B63766A12517L1431
$$ 80319 -93980 -77188 -86127 28964 491957 -164359 87475 -29149 263766 112517 143948
12145A43948M8636J74088E4845K85050I0496K31466j57318K1147M5813b9035H0128
$$ 143948 192584 366672 54845 339895 90496 321962 164644 185791 231604 -29035 80128
12133B64328n3987J06625D5194N159N88856J19599B48346I3910J21205P0109Q5210
$$ 264328 210341 316966 45194 50353 639209 758808 248346 93910 215115 285224 370434
12122C70434a83052c2701B83176j21810a50653B50526P7248j22795J57651a45076
$$ 370434 -183052 -32701 283176 161366 -150653 250526 327774 204979 362630 -145076
12111A25853J01736D8688J6294L29437j85788O3904h0203C9758M96297d0711j48457
$$ 125853 227589 48688 64982 394419 208631 272535 -80203 39758 536055 -40711 -189168
12100a89168E1892R0365c28701B45205q8964d6802C68543j07780A6281O5180O1265
$$ -189168 51892 142257 -328701 245205 156241 -46802 368543 260763 16281 81461 142726
12089A42726M8415J0803G2213C2591Q9974k9420K15912E7710k4598q396O2996
$$ 142726 191141 201944 72213 32591 122565 93145 309057 57710 33112 24716 87712
12078H7712b00580F2087K02329G4283J68541a86316A49889b06150B82988q1215
$$ 87712 -200580 62087 264416 74283 242824 -186316 149889 -206150 282988 201773
12068B01773d3213A70760a21453a7418E6430b39057K2902I3235D2212e5217k22397
$$ 201773 -43213 170760 -121453 -17418 56430 -239057 -216155 93235 42212 -55217 -277614
12057b77614d2090F2251k7242J63081f4225B41380b51068A21463e4435B03485
$$ -277614 -42090 62251 35009 198090 -64225 241380 -251068 121463 -54435 203485
12046b6376j70707b89n7070F6962i9725A2830K17783E3243K29690N6865c56954
$$ -26376 -197083 -289 -57359 66962 -99725 12830 230613 53243 282933 339798 -356954
12034a34655B12319I4325Q912a56896j83395A48775D6921K64834d8799o2100j9741
$$ -134655 212319 94325 103237 -156896 -340291 148775 46921 311755 -48799 -110899 -130640
12023a30640H8572b43567r8989g0763K5455H5409A1389c37085A05090a23658b304
$$ -130640 88572 -243567 -342556 -70763 -45308 85409 11389 -337085 105090 -123658 -2304
12011i3501B27878c196A07811g0068A74040c0980A63122E4833J21708b563D8946
$$ -93501 227878 -3196 107811 -70068 174040 -30980 163122 54833 176541 -2563 48946
11999d4661m3750j19248P0361C3132J11097O7462b07799j16506a30128r0481L4128
$$ -44661 -88411 -207659 -137298 33132 144229 211691 -207799 -324305 -130128 -220609 -186481
11988a86481C6678c7231C7712J51470b7596A79102n7212b51359D8205b7715r8242
$$ -186481 36678 -37231 37712 189182 -27596 179102 121890 -251359 48205 -27715 -125957
11977a25957c1216j07290L7544L0129A27910i1901p903b594n25002e543H6328
$$ -125957 -31216 -138506 -100962 -70833 127910 -91901 -99804 -2594 -527596 -5543 86328
11965a68184P1937B5630f5718q6012p9902l2858F8782b48402Q8183A98161a70666
$$ -168184 -96247 25630 -65718 -151730 -231632 -264490 68782 -248402 -160219 198161 -170666
11953B19696b74893a17707m3321J8698f492C43666a64907K8576j47361B28252
$$ 219696 -274893 -117707 -161028 -142330 -6492 343666 -164907 -136331 -283692 228252
11942e2648E0922J96318b30581A90118a57110A32584b32384A1901J76180G9560
$$ -52648 50922 247240 -230581 190118 -157110 132584 -232384 11901 188081 79560
11931I2968L5185F1575k4066a01649j5919m9036C9753M521i6940k11891B19167
$$ 92968 128153 61575 37509 -101649 -117568 -166604 39753 44274 -96940 -308831 219167
11919h9895A49641k5416a53623a0516B9656b86843d7859B84066C5833c32637J21184
$$ -89895 149641 124225 -153623 -10516 29656 -286843 -47859 284066 35833 -332637 -211453
11908b11453A34233b525H778c6776G3348J2235J17034e7194J5884j44193B8050
$$ -211453 134233 -2525 8778 -36776 73348 85583 202617 -57194 -41310 -185503 28050
11896b75182N6819b4387A5016a99318D1096L39168d45841F0038k796a12801M8423
$$ -275182 -218363 -24387 15016 -199318 41096 380264 -445841 60038 57242 -112801 -64378
11885f4378j6667A06700N8657b62282B36606l6894i590l81044c5436j3679o2841
$$ -64378 -81045 106700 165357 -262282 236606 199712 -9590 -390634 -35436 -49115 -111956
11874a11956J9075A7788h4110j72839q2139A31463K4406D8455b0777A26750c02543
$$ -111956 -92881 17788 -84110 -256949 -339088 131463 155869 48455 -20777 126750 -302543
11862b07205P5190f4734m494A35043a1133n0120o103A8715b32427A34204J02027
$$ -207205 -132015 -64734 -69228 135043 -11133 -61253 -67356 18715 -232427 134204 236231
11851B36231a65668l2176C7249J07959a09856A21652a08582A6863J66618E5862
$$ 236231 -165668 -197844 37249 145208 -109856 121652 -108582 16863 183481 55862
11840a87796A49304c52725g0474n54272h3862n8595E4316d8707j0671C2965K4273
$$ -187796 149304 -352725 -70474 -624746 -83862 -142457 54316 -48707 -59378 32965 57238
11829E7238e4051k41219c7142j56849A1092c78615R8131C6569a1755k82419q8555
$$ 57238 -54051 -295270 -37142 -193991 11092 -378615 -280484 36569 -11755 -294174 -382729
11818c82729J57807j3065f260A10745D8761d95180K27435J22709f6597o4164J2558
$$ -382729 -224922 -237987 -6260 110745 48761 -495180 -267745 -145036 -66597 -130761 -118203
11807a18203L074r1544R0532B80255D7308P2665c1130o0250m33333i5750J8303
$$ -118203 -115129 -206673 -116141 280255 47308 119973 -31130 -91380 -524713 -95750 -77447
11796g7447j91238a3824j43886G0956a60628l59201b3777b589j89529i5013A3925
$$ -77447 -268685 -13824 -157710 70956 -160628 -519829 -23777 -2589 -192118 -95013 13925
11784a38307q2460N9862g3115q1734f2072b1104n3870A18263c31519G0550O3569
$$ -138307 -220767 -160905 -73115 -154849 -62072 -21104 -74974 118263 -331519 70550 134119
11773A34119b19120r5123J44762K4292B34810a97187i4974p1108A00216e4105
$$ 134119 -219120 -314243 -169481 -145189 234810 -197187 -94974 -166082 100216 -54105
11762c5371a0245j56879J2653k86668B16389N0158C2341a77016Q0181A17002c53031
$$ -35371 -10245 -167124 -154471 -441139 216389 266547 32341 -177016 -96835 117002 -353031
11750C5347c32839C5270g2453B24713a79717A62498m497a47925B91217d0269H4023
$$ 35347 -332839 35270 -72453 224713 -179717 162498 158001 -147925 291217 -40269 84023
11738B23219L4077b37527J11840J3072a4883o2067A32889a0151l54004C5755d5917
$$ 223219 257296 -237527 -125687 -112615 -14883 -76950 132889 -10151 -364155 35755 -45917
11726a81154j816B39890f9694H6949B1054f2743B45061a26222j14173F5325P5668
$$ -181154 -182970 239890 -69694 86949 21054 -62743 245061 -126222 -240395 65325 140993
11715A40993c02473g1864c3596k911A09515a79929b469A33504e7012b3207o5977
$$ 140993 -302473 -71864 -33596 -36507 109515 -179929 -2469 133504 -57012 -23207 -89184
11704h9184g186A19717J48445a95829E8507K1115R2733b62718A32448b38644B89010
$$ -89184 -7186 119717 268162 -195829 58507 79622 172355 -262718 132448 -238644 289010
11692g2126o7370I8749B4984L4104b23167J09829l1077B6147a77023l0591B48122
$$ -72126 -139496 98749 24984 59088 -223167 -113338 -144415 26147 -177023 -207614 248122
11680A29308b21036B28593p721b94230A7121a36999c2071I5998c9808C1440C024
$$ 129308 -221036 228593 220872 -294230 17121 -136999 -32071 95998 -39808 31440 3024
11668a0548D76107A72298a7670j5409j76485A22326c9397J2088I4423C7090L10716
$$ -10548 476107 172298 -17670 -33079 -209564 122326 -39397 -27309 94423 37090 347806
11657C47806B9578b69118j04556a69135A04428J35021h1385j24975Q5632c4376
$$ 347806 29578 -269118 -373674 -169135 104428 239449 -81385 -206360 -120728 -34376
11646a67482N3470I6289a78806C01184d1224H1015a97245O1597d2615k42091A44101
$$ -167482 -114012 96289 -178806 301184 -41224 81015 -197245 -135648 -42615 -284706 144101
11634A02093a75860A13508D47b20306B2890a51600C50590j03256D7215A6770d81804
$$ 102093 -175860 113508 447 -220306 22890 -151600 350590 247334 47215 16770 -481804
11622A31662b62303b7042B43613i7489B07793Q2552J0084B7440a97056A85497
$$ 131662 -262303 -27042 243613 -97489 207793 290345 300429 27440 -197056 185497
11611b15516B48831I5964c41873A03966b2325A08629a28923j08041B13835F5039
$$ -215516 248831 95964 -341873 103966 -22325 108629 -128923 -236964 213835 65039
11600F0839P4896n2640g4729j68383a18758j18546k7794E912J9776N8978i7251
$$ 60839 135735 83095 -74729 -243112 -118758 -237304 -265098 5912 25688 84666 -97251
11588A01029o165d6722j47260B798b64494l5044B91693c99300J04704o714F0411
$$ 101029 94864 -46722 -193982 2798 -264494 -299538 291693 -399300 -294596 -301310 60411
11576a67644j73244a51816i012j25172j96626b0799D48622a45812H9201a40216
$$ -167644 -340888 -151816 -9012 -134184 -330810 -20799 448622 -145812 89201 -140216
11565B86508a12318M1949j58232E0446h2419B27698h8100B86484b2699A669b1987
$$ 286508 -112318 -70369 -228601 50446 -82419 227698 -88100 286484 -22699 1669 -21987
11553b9470m7938j29421B03347a77549N7041d1603m5435j6373m2480l8819E4729
$$ -29470 -77408 -206829 203347 -177549 -120508 -41603 -87038 -103411 -145891 -184710 54729
11541e1249j9259D9073a52077l41851h2974A48505o9212f0617G7480a98142c6835
$$ -51249 -70508 49073 -152077 -493928 -82974 148505 79293 -60617 77480 -198142 -36835
11529A237J00877a10714A87111a6213A78488I251K13451d1175D98010a33148r2860
$$ 1237 102114 -110714 187111 -16213 178488 9251 222702 -41175 498010 -133148 -226008
11518b26008c669C0906j484K26657i0164B57037I6236Q2733H5220N5690j1740
$$ -226008 -3669 30906 29422 256079 -90164 257037 96236 178969 85220 140910 129170
11507A29170J53118A7137i739j57240A0707L6880b79751a36234C0381b71289a29739
$$ 129170 282288 17137 -9739 -166979 10707 47587 -279751 -136234 30381 -271289 -129739
11495E5313K9644Q2326L8061C6851K18019J29942j41691a30543A14742O8161j8122
$$ 55313 84957 167283 205344 36851 254870 384812 243121 -130543 114742 182903 164781
11484A64781R3587K7429J49376A80575F0955J48538D548R5324P4146F6008Q9332
$$ 164781 258368 285797 435173 180575 60955 209493 4548 99872 174018 66008 155340
11473A55340R6225A5900O6804c30191E27353j01543A95702K24449J21828A39585
$$ 155340 251565 15900 82704 -330191 527353 425810 195702 420151 541979 139585
11462a00792E5134L8478j3269b5450H0085a85341A09366c3940C39355H1437K35434
$$ -100792 55134 93612 80343 -25450 80085 -185341 109366 -33940 339355 81437 316871
11451C16871J642j15691o5414A3821P0271N2680i7347k95882b1956o3193B1304
$$ 316871 318513 202822 137408 13821 84092 136772 -97347 -393229 -21956 -85149 21304
11439H8753l6484K34604j05077b59626B13138p7859n6749h0991A05134J748g2581
$$ 88753 52269 286873 181796 -259626 213138 135279 78530 -80991 105134 106882 -72581
11427a39554I3956M0892J32621r9542a15153j90439J28507G9419O6902L3850F4402
$$ -139554 93956 134848 267469 167927 -115153 -305592 -177085 79419 146321 180171 64402
11415d6616j70810j91247A34945d0006q4114b8123H0150R6413h2221A2265M003
$$ -46616 -217426 -408673 134945 -40006 -124120 -28123 80150 176563 -82221 12265 16268
11404A6268d34115c6607B82517K9838b14188A54066E1999J31183a14631E4475
$$ 16268 -434115 -36607 282517 312355 -214188 154066 51999 183182 -114631 54475
11393i0106d2509j61468j65107A77212q1430h2218j61462P9643C65062a15938
$$ -90106 -42509 -203977 -369084 177212 95782 -82218 -243680 -164037 365062 -115938
11382B10956b37363D607J21300P5212J57533r3904a937F3871M9013a27087c2950
$$ 210956 -237363 4607 125907 201119 358652 264748 -1937 63871 112884 -127087 -32950
11370i9532j6046j80387B8213L16037k3022g4170j1342a4374k73784E8844L74944
$$ -99532 -115578 -295965 28213 344250 321228 -74170 -85512 -14374 -288158 58844 433788
11359D33788a53880A61965a472j49258d4710j0238F0341a60393M5856F33a79054
$$ 433788 -153880 161965 -1472 -150730 -44710 -54948 60341 -160393 -114537 633 -179054
11347d4995k8948A9661J19220b21105E7907h1476m8120A61980a95614B38363b81598
$$ -44995 -73943 19661 138881 -221105 57907 -81476 -129596 161980 -195614 238363 -281598
11335d4665B02260C1082e8539k97772b121j70766c8631J7605k83221c7228m61486
$$ -44665 202260 31082 -58539 -356311 -2121 -172887 -38631 -21026 -304247 -37228 -498714
11324d98714b11421b9713l36744J30648B62311c11625i2191j95213I2861c3502
$$ -498714 -211421 -29713 -366457 -235809 262311 -311625 -92191 -287404 92861 -33502
11313f1317G5288G472J21291l6630b8176l30182G1807B4211c7973m4047r5799
$$ -61317 75288 7472 128763 92133 -28176 -358358 71807 24211 -37973 -82020 -177819
11302a77819I0425b42400C25394J90911A75842b5293A19144R4770p0110l0744
$$ -177819 90425 -242400 325394 516305 175842 -25293 119144 213914 143804 113060
11292A13060J13278a40701G5442d2997A29666c14994B7737M3040O1193a33126
$$ 113060 226338 -140701 75442 -42997 129666 -314994 27737 70777 131970 -133126
11281A1241i5112q6162q8982J27600q0941c8457o6590B8922j1949a94496k0999
$$ 11241 -95112 -181274 -270256 -142656 -223597 -38457 -105047 28922 16973 -194496 -215495
11270b15495A2955a94493A73238l268J63740e1222j66401A28445D3343b46044
$$ -215495 12955 -194493 173238 169970 333710 -51222 -217623 128445 43343 -246044
11259b06905B9708a21103o5110P3465p4135A0407J75476b43226J1281I770e1194
$$ -206905 29708 -121103 -186213 -112748 -186883 10407 185883 -243226 -231945 9770 -51194
11247e906A4588J8736N3275K1997C568M7487K3462a34357J7989p8263B28552c93145
$$ -5906 14588 33324 86599 108596 3568 51055 74517 -134357 -116368 -194631 228552 -393145
11234i4024j28998D8102P4276a59224O8330j0788A02167a8301F3924J04346a30501
$$ -94024 -223022 48102 122378 -159224 -90894 -101682 102167 -18301 63924 168270 -130501
11222c20282A29171R9000b07709L2724p038P5090J4695j00077M8054q4815k24349
$$ -320282 129171 228171 -207709 -174985 -182023 -106933 -92238 -192315 -144261 -229076 -453425
11211d53425A8322a69595g116j64585A57300b5137o7664d3618l7281j62682e4583
$$ -453425 18322 -169595 -7116 -171701 157300 -25137 -92801 -43618 -80899 -243581 -54583
11199B42756e2974C4700L5131O0707c3796J5208j60009G4325a36397B630a80309
$$ 242756 -52974 34700 69831 130538 -33796 -18588 -178597 74325 -136397 2630 -180309
11187d2755q8585A55884d9039A44793l3060a75699c3136F2980l0126a98682f2088
$$ -42755 -131340 155884 -49039 144793 111733 -175699 -33136 62980 32854 -198682 -62088
11175C7866M0286h0987B84112A22945a01216I6887B7800i0887k29939B68580g6441
$$ 37866 78152 -80987 284112 122945 -101216 96887 27800 -90887 -320826 268580 -76441
11163b41976O4152d3724k88790a47991D02840a69271B2869a43234O9850m07499
$$ -241976 -177824 -43724 -332514 -147991 402840 -169271 22869 -143234 -73384 -480883
11153d80883A07737b08068C7656q619J24754a97672d2171a034A59379j4784e6100
$$ -480883 107737 -208068 37656 29037 153791 -197672 -42171 -1034 159379 144595 -56100
11141a75008E8190J60673a57333A88027A421a07844C50903a37145j06348L7569
$$ -175008 58190 218863 -157333 188027 1421 -107844 350903 -137145 -243493 -205924
11131b05924A0566d74147b04302J00808L4581k39632f9372B45708F630J04843
$$ -205924 10566 -474147 -204302 -103494 -68913 -308545 -69372 245708 6630 111473
11121A11473O4436M24054G0011K10354I3745h5758D00450j07112j9355A00612
$$ 111473 175909 599963 70011 280365 93745 -85758 400450 293338 273983 100612
11110c0058l2953C7173O4320a51275P2002E0834J2292B2649L5761b38707H1067
$$ -30058 -63011 37173 101493 -151275 -79273 50834 63126 22649 58410 -238707 81067
11098f3451j35765C71095a35198H3367a4484A68224E7306J78917a02421A61087
$$ -63451 -199216 371095 -135198 83367 -14484 168224 57306 236223 -102421 161087
11087e5337A41208b5225B81941K9984G3566K26926A37107J57643J64916P6188
$$ -55337 141208 -25225 281941 311925 73566 300492 137107 294750 459666 535854
11077E35854A47121J5490C2846J38054m0543K02265Q3895J2176j94665o5529J52011
$$ 535854 147121 162611 32846 170900 130357 332622 416517 428693 234028 168499 320510
11066C20510L53235l25432J80939G1466J83103J33310l741q9592Q5810J34780
$$ 320510 673745 348313 529252 71466 254569 387879 384138 294546 380356 515136
11056E15136L2343A89979K58382j17760M4349P9253K16605j08760P5135l2029
$$ 515136 547479 189979 448361 330601 374950 454203 670808 562048 637183 605154
11046F05154j6239L69647j14m06585L83692r5259l28035L70980M1108r0258j90107
$$ 605154 588915 958562 958448 551863 935555 840296 512261 883241 924349 834091 643984
11035F43984K30886j03849J03906j94807K4383J25308P2296K94880k62591D45441
$$ 643984 874870 771021 874927 680120 704503 829811 902107 1196987 934396 445441
11024A090578m52430L53428l34657J28742j30283K1210k9567N9614k31869R5762
$$ 1090578 638148 991576 656919 785661 655378 676588 647021 706635 474766 570528
11014E70528R7146k13362J44642K7204K0266j06838j17049j42452M10130K36922
$$ 570528 667674 454312 598954 626158 646424 539586 422537 280085 690215 927137
11004I27137k86140N4579Q762j17942k05875M93912l54447Q7321J85667k96150
$$ 927137 640997 695576 704338 586396 380521 874433 519986 607307 792974 496824
10994D96824K85924j42395K58426p6569j58202j89520K50384k73056J51136J00103
$$ 496824 782748 640353 898779 822210 664008 474488 724872 451816 602952 703055
10984G03055N68805m91115M0650j11291K45968p7764K61457l05289K07763J07708
$$ 703055 1271860 780745 821395 710104 956072 878308 1139765 834476 1042239 1149947
10974A149947m6751L33551J85735Q7893L39098N73295j13291J58347J23590P6220
$$ 1149947 1103196 1436747 1622482 1710375 2049473 2622768 2509477 2667824 2791414 2867634
10964B867634K83236p2668K41537n84499l72735k33272o68544m36712K96897m09551
$$ 2867634 3150870 3078202 3319739 2735240 2362505 2129233 1460689 1023977 1320874 911323
10954I11323P7752r4120M5474J71656l79559K6744K35003m68842M8068B57888
$$ 911323 989075 894955 940429 1112085 732526 759270 994273 525431 573499 257888
10943B71335l7522F6117K56913j41446i8309F5767b0957A39554J80306a15188
$$ 271335 233813 66117 323030 181584 -98309 65767 -20957 139554 319860 -115188
10932E5222M9245K75884p8860E8176O4778b9884j72063c7246A42420J21154j16760
$$ 55222 104467 380351 301491 58176 122954 -29884 -201947 -37246 142420 263574 146814
10921A46814d0883p8811B85993b61417a8492B45773b28465A03437a44084G3302
$$ 146814 -40883 -119694 285993 -261417 -18492 245773 -228465 103437 -144084 73302
10910E9898b21467B46993c40675g7884o7254M6764k31808a64628A23436b95455
$$ 59898 -221467 246993 -340675 -77884 -145138 -98374 -330182 -164628 123436 -295455
10899a03692C1800Q5705b1756j52956d2434J4652j14854D4141a46728F8304K5981
$$ -103692 31800 117505 -21756 -174712 -42434 -27782 -142636 44141 -146728 68304 94285
10888I4285R2207d1184r554A34222b2367D4796J14458b67574A05648j0128g725
$$ 94285 186492 -41184 -50738 134222 -22367 44796 159254 -267574 105648 95520 -7725
10876h2833K4246B0845J42042h6016o3468p4764o0383R4289B02198e3854j24642
$$ -82833 -58587 20845 162887 -86016 -149484 -224248 -284631 -190342 202198 -53854 -178496
10865a78496P8069j76322D3372L66608b10077G9818J9830d43684a27271k6429
$$ -178496 -100427 -276749 43372 409980 -210077 79818 99648 -443684 -127271 -153700
10855a53700A47797b68254O42a03014A19134A2292L72856i6914l4322N1971p304
$$ -153700 147797 -268254 -267612 -103014 119134 12292 385148 -96914 -131236 -79265 -86569
10844h6569k6364j18983I9932d2187F5991a68102D31942A23683B4502J60074J22181
$$ -86569 -112933 -231916 99932 -42187 65991 -168102 431942 123683 24502 184576 306757
10833C06757A37289C3583Q7139b0441j40355k08515J74540j79610a29719n421
$$ 306757 137289 33583 120722 -20441 -160796 -369311 -194771 -374381 -129719 -135140
10823a35140C7772a1617q3347f222G7622b33702A3769b09777A78500P3291b65625
$$ -135140 37772 -11617 -94964 -6222 77622 -233702 13769 -209777 178500 251791 -265625
10811a67652l9954a6321B63995b26254g9323K4990k29838A71693b86574C5136
$$ -167652 -207606 -16321 263995 -226254 -79323 -54333 -284171 171693 -286574 35136
10800H181K27097H8923a44576A46072b01234D8886K95552i3324k9569b9079E0735
$$ 8181 235278 88923 -144576 146072 -201234 48886 344438 -93324 -122893 -29079 50735
10788f5009D1452J02345i7603j55622O8144D657b51548M6394B48559a29066a46
$$ -65009 41452 143797 -97603 -253225 -185081 4657 -251548 -205154 248559 -129066 -146
10776I3518b19731h3112q0890A43158b15553A0304K09795h2616A42721i9685k32185
$$ 93518 -219731 -83112 -164002 143158 -215553 10304 220099 -82616 142721 -99685 -331870
10765c31870b9999j9044O557m06880f6519j21701k2025M8618C9769K62793j05711
$$ -331870 -29999 -49043 -42486 -449366 -66519 -188220 -210245 -161627 39769 302562 196851
10754A96851b07892g9646A715c05238a52593D4774a89975a686l1295M244A52110
$$ 196851 -207892 -79646 1715 -305238 -152593 44774 -189975 -1686 -32981 -28737 152110
10742b03773P6276o7130k6650B09839c48351J42316B7260c06417E4864a56001
$$ -203773 -127497 -194627 -221277 209839 -348351 -206035 27260 -306417 54864 -156001
10731a44489G4436q924b6605G6387e9166j70260j64221J15654c4967B05306a0769
$$ -144489 74436 65512 -26605 76387 -59166 -229426 -393647 -277993 -34967 205306 -10769
10719a13017j49711F6930f7244I2528A39M4010b53606Q8829B00661J49547c5550
$$ -113017 -262728 66930 -67244 92528 139 44149 -253606 -164777 200661 350208 -35550
10707d8448l45401a75698B548a12360k07611A09394b27671A2105O3421j4045c39593
$$ -48448 -393849 -175698 2548 -112360 -319971 109394 -227671 12105 75526 61481 -339593
10695b10011O6762a2084C9602A7095R6186g5676B97572b41536D7150a14545L3551
$$ -210011 -143249 -12084 39602 17095 113281 -75676 297572 -241536 47150 -114545 -80994
10684h0994o9198j30652A35157l3628e4064a3535A27781h5982B65275c4739A7020
$$ -80994 -150192 -280844 135157 101529 -54064 -13535 127781 -85982 265275 -34739 17020
10672A01787b56233B17431d9936k671k44190a161l08304l9154J20917A1142a7148
$$ 101787 -256233 217431 -49936 -52607 -296797 -1161 -309465 -348619 -227702 11142 -17148
10660A24378b69649r603B03988a91972p5084J4946C3823R1695m5005J1793b13385
$$ 124378 -269649 -279252 203988 -191972 -267056 -252110 33823 125518 80513 92306 -213385
10648H4246a72271O1742n5781K6344k49575J60514A73223d94569A7392J05065
$$ 84246 -172271 -110529 -166310 -139966 -389541 -229027 173223 -494569 17392 122457
10638A22457N6705d3133A13239a16984J8152B05266m2085c06532a07495G7704
$$ 122457 179162 -43133 113239 -116984 -98832 205266 163181 -306532 -107495 77704
10627A36558e8944k15327I4589b96958h0192A51572c21295J32697k46311a78579
$$ 136558 -58944 -274271 94589 -296958 -80192 151572 -321295 -188598 -434909 -178579
10616A8416L5613A948a52761j91387A07988P1201c4952F1372a20320j99393e1782
$$ 18416 54029 1948 -152761 -344148 107988 179189 -34952 61372 -120320 -319713 -51782
10604B7961M4434e25165a21097K2504m215r809A43839c5231n6282m5208l6530
$$ 27961 72395 -525165 -121097 -98593 -102808 -112617 143839 -35231 -91513 -136721 -173251
10593a73251A23199b06712E5136L6628a15001A07205i4151B0093b61058B3401
$$ -173251 123199 -206712 55136 91764 -115001 107205 -94151 20093 -261058 23401
10582b80210i3074c2119q4741B9395g9931A36700E8265c57669B580a48560A10892
$$ -280210 -93074 -32119 -116860 29395 -79931 136700 58265 -357669 2580 -148560 110892
10570A198a52481l5046k10277J70922A21437c5842j74637M5927l51385B86028
$$ 1198 -152481 -187527 -397804 -226882 121437 -35842 -210479 -164552 -515937 286028
10559a81975f8824q092E646J05460D5623a58678b3049j76653n400j1672k16098
$$ -181975 -68824 -76916 5646 111106 45623 -158678 -23049 -199702 -205102 -216774 -432872
10548d32872A47907c53324H2559e317D0271c3952p2223A0917a1165G839J83036
$$ -432872 147907 -353324 82559 -5317 40271 -33952 -106175 10917 -11165 7839 190875
10537A90875a15636E2814J0759a37303A26426b67088J28408m3918A00432Q9864
$$ 190875 -115636 52814 63573 -137303 126426 -267088 -138680 -182598 100432 190296
10527A90296a56044f5096l6336q6143C61406b00567J3368m8117O521B0624a68154
$$ 190296 -156044 -65096 -101432 -187575 361406 -200567 -187199 -235316 -228795 20624 -168154
10515A19663a65963F3370a67023B0036b03282j64799d8482l5261l94853a16929
$$ 119663 -165963 63370 -167023 20036 -203282 -368081 -48482 -83743 -478596 -116929
10504B23996a39395O4650C04553d30534E4866K8367J2887L1963b80167C5912a36600
$$ 223996 -139395 -74745 304553 -430534 54866 83233 96120 128083 -280167 35912 -136600
10492d9329R018j96219O912d3190k15051C8416a1580D8061e5368k02022A29751
$$ -49329 -40311 -236530 -229618 -43190 -258241 38416 -11580 48061 -55368 -257390 129751
10480G8411M016j0974b03780C06770I996M7123a34945m6723B00818a16818C14430
$$ 78411 82427 71453 -203780 306770 9996 57119 -134945 -181668 200818 -116818 314430
10468G2881a05815g24l56445a40990k45482A66486B7510a742A10472g102j47768
$$ 72881 -105815 -724 -357169 -140990 -386472 166486 27510 -1742 110472 -7102 -154870
10457a54870L8862C33727j29825n2495a84905j68889H1836b09726l9990B31274
$$ -154870 -116008 333727 203902 151407 -184905 -353794 81836 -209726 -249716 231274
10446e21308A3317e1794J7422j11462j37022j31455B71566f140q0709q4143o7062
$$ -521308 13317 -51794 -34372 -145834 -282856 -414311 271566 -6140 -86849 -170992 -238054
10435b38054E601b79154B1455c4669m0356A56137a44782o7900L3153N05j75333
$$ -238054 5601 -279154 21455 -34669 -75025 156137 -144782 -212682 -179529 -179024 -354357
10424c54357F1250A6715b28677k59482d3627e018j30180A04191J13731B6127b54744
$$ -354357 61250 16715 -228677 -488159 -43627 -5018 -135198 104191 217922 26127 -254744
10412b08104d2568c468m87709a46428l34665A46568k7841l0502i6988A61273a78064
$$ -208104 -42568 -3468 -491177 -146428 -481093 146568 118727 88225 -96988 161273 -178064
10400A66131d03768c9264j90118A84072i9868D66514G7211h3728G8404e089A8863
$$ 166131 -403768 -39264 -229382 184072 -99868 466514 77211 -83728 78404 -5089 18863
10388B91474M15741l03453L8752j37260e7352k9084E5910O0527b01051a311G5414
$$ 291474 707215 403762 442514 305254 -57352 -86436 55910 116437 -201051 -1311 75414
10376A25316n3931r559c9359B89940Q5776Q0846a86611D06518l5430q1988J3359
$$ 125316 71385 61826 -39359 289940 375716 456562 -186611 406518 371088 289100 302459
10365C02459m7128J05821J51083r8250O5151K9986B46478r4531g744B05450p3893
$$ 302459 255331 361152 512235 413985 479136 509122 246478 151947 -7744 205450 131557
10354A31557J8814a8048F073K27656J84712P7504k10910O30089k67716A78243
$$ 131557 150371 -18048 6073 233729 418441 495945 285035 915124 647408 178243
10343C33785J03863K14032f1090C64916j32772B7821J47333M0734f8391B45566
$$ 333785 437648 651680 -61090 364916 232144 27821 175154 215888 -68391 245566
10332f6232A38264f7247B94693r6833a62929A38547C0675L07481A44397m4689
$$ -66232 138264 -67247 294693 197860 -162929 138547 30675 338156 144397 99708
10322I9708J0318J14278E6900L05276L3300j14666B3030K55962a44357D0530i8447
$$ 99708 110026 224304 56900 362176 395476 280810 23030 278992 -144357 40530 -98447
10310A51280L7262d62638C4254f1383r8810K9847A39507a49236E8340J15911e4923
$$ 151280 188542 -462638 34254 -61383 -160193 -130346 139507 -149236 58340 174251 -54923
10298A2573b68088h0555J9632j42473L3094A63583d5619G4771K6232k8657c2394
$$ 12573 -268088 -80555 -60923 -203396 -170302 163583 -45619 74771 101003 72346 -32394
10286C3566f7110m4925k3923C7526g3461j41493Q027f1387j76140i949A68485
$$ 33566 -67110 -112035 -135958 37526 -73461 -214954 -206927 -61387 -237527 -9949 168485
10274A24486P5239a21410K3929k33764c7132n7626o1574P0453n1201I9013J9925
$$ 124486 199725 -121410 -97481 -331245 -37132 -94758 -156332 -85879 -137080 99013 118938
10263A18938c4388j27392B36551h7142k75397C327f2079B20989a14609I0624B9080
$$ 118938 -34388 -161780 236551 -87142 -362539 3327 -62079 220989 -114609 90624 29080
10251c33165b1473k09118A19815J67618c3241A7737c5696B14464J2770E701L2416
$$ -333165 -21473 -230591 119815 287433 -33241 17737 -35696 214464 227234 5701 38117
10240C8117g7217r2513A75175O0232H3868b64640A73505h14j26579N0327C4797
$$ 38117 -77217 -169730 175175 235407 83868 -264640 173505 -814 -127393 -77066 34797
10228C4171K39257a29692A088a86851M2441o2865D6433J12766p9396b16779A50790
$$ 34171 273428 -129692 1088 -186851 -144410 -207275 46433 159199 79803 -216779 150790
10216a44716b6248q6551b4323j74803M0783H9031K27173b86862J43377r9457B90340
$$ -144716 -26248 -112799 -24323 -199126 -158343 89031 316204 -286862 -143485 -242942 290340
10204c12072R1369A04881E0688b72829h0754j23413k69577a18540D8354B2575
$$ -312072 -220703 104881 50688 -272829 -80754 -204167 -473744 -118540 48354 22575
10193A78011E0171b80445J4209c0738D5334J4603d7358l742B72330G504J34470
$$ 178011 50171 -280445 -266236 -30738 45334 59937 -47358 -51100 272330 7504 141974
10182A41974M7845a89851A88690b0960j33991A5421i5280n0468B054b39909r6765
$$ 141974 189819 -189851 188690 -20960 -154951 15421 -95280 -145748 2054 -239909 -336674
10171c36674B40981I8106C6732a36718a4708j91715A14258g0125H1313B9781N732
$$ -336674 240981 98106 36732 -136718 -14708 -206423 114258 -70125 81313 29781 35513
10160C5513i6602j64920D899K14566a77210r4084J14615b5647k0984l21288a07274
$$ 35513 -96602 -261522 4899 219465 -177210 -271294 -156679 -25647 -46631 -367919 -107274
10148a05205k42205A16150f0556j20439r0084K5504j27064A83058b56815A1741
$$ -105205 -347410 116150 -60556 -180995 -271079 -245575 -372639 183058 -256815 11741
10137i8421A13199P1970O2400F1590i4719K9311j13705F0944Q2445J5257D4236
$$ -98421 113199 185169 247569 61590 -94719 -65408 -179113 60944 143389 158646 44236
10125a50019C5610c17760o9498I8405a0988J638j07738j10070q2069J12868A06077
$$ -150019 35610 -317760 -387258 98405 -10988 -9350 -117088 -227158 -309227 -196359 106077
10113i8838A46617C5365J72605g2978K8273o8606k19156f5055l9667n1222e0185
$$ -98838 146617 35365 207970 -72978 -44705 -113311 -332467 -65055 -104722 -155944 -50185
10101D7719K2578h1478B78389c51508h9508n6130n8517f9542E9091E388K4270
$$ 47719 70297 -81478 278389 -351508 -89508 -145638 -204155 -69542 59091 5388 29658
10090B9658c357A46380b00871L3325g0488o0987H8817a0373l07990R3961B19643
$$ 29658 -3357 146380 -200871 -167546 -70488 -131475 88817 -10373 -318363 -224402 219643
10078d00163C8904c0426k41727a13241a9814l39446A04432g3613j81186A38678
$$ -400163 38904 -30426 -272153 -113241 -19814 -359260 104432 -73613 -254799 138678
10067F3120a75319A11074a41247B47837k3678b01763o3937e7693A8360N9345j0908
$$ 63120 -175319 111074 -141247 247837 224159 -201763 -265700 -57693 18360 77705 66797
10056F6797l037a30481l134N414B28813B7813b35109A02143a74384k5594Q1901
$$ 66797 63760 -130481 -133615 -128201 228813 27813 -235109 102143 -174384 -199978 -118077
10045a18077d4456I437a46423c3857I3211j7802d1679j74694h9070B7070c38854
$$ -118077 -44456 9437 -146423 -33857 93211 75409 -41679 -216373 -89070 27070 -338854
10033B80727a05212p3454J8694K586a5659p0309j54632d7124A77904b1810j87057
$$ 280727 -105212 -178666 -159972 -157386 -15659 -85968 -240600 -47124 177904 -21810 -208867
10022b08867d264B7975G565b2650j96108o8174J18633F9594a09778A54133b20188
$$ -208867 -4264 27975 7565 -22650 -218758 -286932 -168299 69594 -109778 154133 -220188
10010a63107j0851H8126c98082a62598G3800c45494B5259e4637p7679k33996a55964
$$ -163107 -173958 88126 -398082 -162598 73800 -345494 25259 -54637 -132316 -366312 -155964
9998D3637N8114c8870o4556M8337B56248b81570G1668c41598J51286A05256E1626
$$ 43637 101751 -38870 -103426 -55089 256248 -281570 71668 -341598 -190312 105256 51626
9986A09248a32783l5938b5571A48768J12213h2053j71655f5838C34485a90876
$$ 109248 -132783 -168721 -25571 148768 260981 -82053 -253708 -65838 334485 -190876
9975d7533j0718b4533D2585J60504J0524h2379M337l33215J0765a31971k6709
$$ -47533 -58251 -24533 42585 203089 213613 -82379 -78042 -411257 -400492 -131971 -158680
9964a58680K511j82924J55226h0938A54210b20757i2084B584b18762B07381F8425
$$ -158680 -156169 -339093 -183867 -80938 154210 -220757 -92084 2584 -218762 207381 68425
9952B12320g5255B39500b2011k1324A9201i0936h606B2503D581b8135j07199G8678
$$ 212320 -75255 239500 -22011 -43335 19201 -90936 -8606 22503 4581 -28135 -135334 78678
9939A83405f648n3891A45496c00036A28355a5002n22126I0626b50772a5245A28293
$$ 183405 -6648 -60539 145496 -300036 128355 -15002 -537128 90626 -250772 -15245 128293
9927F6129g5826p5778B969L24421g8573E7859f1418l04777G3168a77810C7011
$$ 66129 -75826 -151604 2969 327390 -78573 57859 -61418 -366195 73168 -177810 37011
9915B25955B9870a21249I0923E86J67183A9864D150J92894a40109m3772F6523
$$ 225955 29870 -121249 90923 586 167769 19864 4150 197044 -140109 -183881 66523
9903b13433O7768a0360C71893c58865J31205F2519f5857I8445A982R5039K17248
$$ -213433 -145665 -10360 371893 -358865 -227660 62519 -65857 98445 1982 97021 314269
9892C14269b28870G872J40351b70461e778C12091A10097d38725K00137j46328
$$ 314269 -228870 7872 148223 -270461 -5778 312091 110097 -438725 -238588 -384916
9882c84916a9794B8334b06865A2156K14046c7812Q663A19028e5240l45793J76650
$$ -384916 -19794 28334 -206865 12156 226202 -37812 -29149 119028 -55240 -401033 -224383
9871b24383J4650H3431B1796a55935O0043H9778c25103a01627A68549a57462h380
$$ -224383 -209733 83431 21796 -155935 -95892 89778 -325103 -101627 168549 -157462 -8380
9859c46417F2183c63211J71078b8036I7525C2074b63511a21368H2959D0210P3756
$$ -346417 62183 -363211 -192133 -28036 97525 32074 -263511 -121368 82959 40210 113966
9848A13966a38726e9826E801c68883C18390a85400C3074c1028J4339p7535C307
$$ 113966 -138726 -59826 5801 -368883 318390 -185400 33074 -31028 -16689 -94224 3307
9836A36656g7133G5390c31640q947A51974p0731J5624e0083A849b50234b3517
$$ 136656 -77133 75390 -331640 -340587 151974 81243 96867 -50083 1849 -250234 -23517
9824a08394D3378d56747J98025E5540c27477A41343f6502a494l47335P7653C295
$$ -108394 43378 -456747 -258722 55540 -327477 141343 -66502 -1494 -348829 -271176 3295
9812A1994d4560F6122O8497A5205L10745a84706B29908r1644h8999B3466o736
$$ 11994 -44560 66122 134619 15205 325950 -184706 229908 138264 -88999 23466 16730
9801A6730a91414L5942I4281e7350n8997M1797j22079B99686e6889r7022A89506
$$ 16730 -191414 -155472 94281 -57350 -116347 -74550 -196629 299686 -56889 -153911 189506
9789a77248r0460J02907e4760A07968f32461B42407a57217L0415o8933R991A09210
$$ -177248 -267708 -164801 -54760 107968 -632461 242407 -157217 -126802 -195735 -185744 109210
9777c52597L4841B4081M3067a69946b1160G9080a09835n0126J126i796A14134
$$ -352597 -317756 24081 67148 -169946 -21160 79080 -109835 -159961 -158835 -9796 114134
9765d2452B4374A1077i3378C16553f2566C0896b51763N6321d8010I0536a4828
$$ -42452 24374 11077 -93378 316553 -62566 30896 -251763 -195442 -48010 90536 -14828
9753a99648C69238c65380a45711f1819k7688j59812b6919A35437a8366l17235
$$ -199648 369238 -365380 -145711 -61819 -89507 -249319 -26919 135437 -18366 -335601
9743c35601K5028P4148b7631A69614a84836I1595b5850A80505e33967A30592N2439
$$ -335601 -310573 -236425 -27631 169614 -184836 91595 -25850 180505 -533967 130592 183031
9732A83031E4024Q5314d3252p2641F0179K93404f2250b8000k17164b2851I1970
$$ 183031 54024 139338 -43252 -115893 60179 353583 -62250 -28000 -245164 -22851 91970
9720b40192E0586a05116b727o696B00830D641Q9163j4090a3237k5230A02035k9038
$$ -240192 50586 -105116 -2727 -9423 200830 4641 93804 79714 -13237 -38467 102035 72997
9708G2997d2010l6383L477b2975F5912a80268L0752f1703j66233b7244k91065
$$ 72997 -42010 -78393 -74916 -22975 65912 -180268 -149516 -61703 -227936 -27244 -318309
9697c18309H8329b26547R8726G8567a15908o7351d0271E3558a7090k2471p2089
$$ -318309 88329 -226547 -127821 78567 -115908 -183259 -40271 53558 -17090 -39561 -111650
9686a11650c4997D727f0161B33927a92440B26434h4889I2086k0546k0271g1553
$$ -111650 -34997 4727 -60161 233927 -192440 226434 -84889 92086 71540 51269 -71553
9674f9171K3016j26362h1334K2643l02666J73650e5905C3622E732J29428n5835
$$ -69171 -46155 -172517 -81334 -58691 -361357 -187707 -55905 33622 5732 135160 79325
9663G9325a5358A98333p8215B4099K225J41081g6927A60197a83625A5658a5918
$$ 79325 -15358 198333 120118 24099 26324 167405 -76927 160197 -183625 15658 -15918
9651a01263n84448a51799B45838c46040g351C7129b50080a13066A56788b52800
$$ -101263 -685711 -151799 245838 -346040 -7351 37129 -250080 -113066 156788 -252800
9640f8252k67659Q6231r9319B1851b8583j10983J9631q0211O6984A97132b21301
$$ -68252 -335911 -249680 -348999 21851 -28583 -139566 -119935 -200146 -133162 197132 -221301
9628a07137n6966k7630A04179b96792l9295D9441h5621B6510a10348H7003f3935
$$ -107137 -164103 -191733 104179 -296792 -336087 49441 -85621 26510 -110348 87003 -63935
9616F3781a08130o2526q4710H0704C1933c2107l40738B2858J95629F0712M4929
$$ 63781 -108130 -170656 -255366 80704 31933 -32107 -372845 22858 218487 60712 105641
9605A05641K8737h2826j88422A21244d02255i7154B811P027c25680a1602j04398
$$ 105641 134378 -82826 -271248 121244 -402255 -97154 2811 9838 -325680 -11602 -116000
9594a16000j00356b5354D51401A02599a99766H5621O7612F2746b34744d6786o5031
$$ -116000 -216356 -25354 451401 102599 -199766 85621 153233 62746 -234744 -46786 -111817
9583a11817j68282P7717f2153L100B24382j01890a36598A15435f23j01732j71713
$$ -111817 -280099 -202382 -62153 -59053 224382 122492 -136598 115435 -623 -102355 -274068
9572b74068l7324N8210e2524G1832h6761n2319F7185Q1774h7291p2168A39554
$$ -274068 -311392 -253182 -52524 71832 -86761 -139080 67185 148959 -87291 -159459 139554
9560E6951J76911C5331h0218F9766b09915A56980b31008a01763j56088h0749n0060
$$ 56951 233862 35331 -80218 69766 -209915 156980 -231008 -101763 -257851 -80749 -130809
9549a30809N7431a7209j77688l32359a59711C1514J13431a41560A89636n5215
$$ -130809 -73378 -17209 -194897 -527256 -159711 31514 144945 -141560 189636 134421
9539A34421B1190c46475N899a38682M3183d0241f190A31540n3729A255b98619
$$ 134421 21190 -346475 -340576 -138682 -95499 -40241 -6190 131540 77811 1255 -298619
9527d25118b6780A8207f5017A10054a34472c4846J1160H8856a29568j61201d0130
$$ -425118 -26780 18207 -65017 110054 -134472 -34846 -23686 88856 -129568 -290769 -40130
9515E3017a41871a659n927j16884C1616c5779j44893G0238C2706d55632J66282
$$ 53017 -141871 -1659 -7586 -124470 31616 -35779 -180672 70238 32706 -455632 -289350
9504b89350O6072m6534j26833f8854k54116B54643l7964f7170m1192A28837L4807
$$ -289350 -223278 -269812 -396645 -68854 -322970 254643 216679 -67170 -108362 128837 163644
9493A63644i3251c3364A20922n8860a6147A21960b86520I074c20046j08364D6623
$$ 163644 -93251 -33364 120922 62062 -16147 121960 -286520 9074 -320046 -428410 46623
9481I547a07832c0761a3296j97016o7327A4994a34382c1722A05667O71a74084
$$ 9547 -107832 -30761 -13296 -210312 -277639 14994 -134382 -31722 105667 106338 -174084
9469C26506A3153b00721i2528B70355j19280a42473A94967N8648a60072B35585
$$ 326506 13153 -200721 -92528 270355 151075 -142473 194967 253615 -160072 235585
9458b12924a9782j1181j88753q711B32530b36467B8859f3172F1907J7192b29812
$$ -212924 -19782 -30963 -219716 -228427 232530 -236467 28859 -63172 61907 79099 -229812
9446c80524A17325b17429B89650a04732H2260b41751A0847g6625A38772K14983
$$ -380524 117325 -217429 289650 -104732 82260 -241751 10847 -76625 138772 353755
9436C53755I1953k7847b18930B4196N2141k4420a23192l0511h912j23867B9737
$$ 353755 91953 64106 -218930 24196 76337 51917 -123192 -153703 -8912 -132779 29737
9424a08416k15856G1002c9342o8178C9862b43222j80151d8710I9425l3832g6208
$$ -108416 -324272 71002 -39342 -107520 39862 -243222 -423373 -48710 99425 65593 -76208
9412A48002C9584A4413d09099A807a36786L4802B23837a74603k2450e8828l7602
$$ 148002 39584 14413 -409099 1807 -136786 -101984 223837 -174603 -197053 -58828 -96430
9401i6430q0331c836l04876C0281h9924l14205a47859A11430J52620l0306a07479
$$ -96430 -176761 -3836 -308712 30281 -89924 -404129 -147859 111430 264050 233744 -107479
9389a90996E7496a3689l58715a19066k37162a045n2706G1645l0888b70656o0308
$$ -190996 57496 -13689 -372404 -119066 -356228 -1045 -53751 71645 40757 -270656 -330964
9378c30964B22339I8441b41290l023H2557b60837A61195d01979c3437J4223j76037
$$ -330964 222339 98441 -241290 -244313 82557 -260837 161195 -401979 -33437 -19214 -195251
9367a95251B78889b21248A7570J81995b08008a1255q8833j31428I7913R6757g1384
$$ -195251 278889 -221248 17570 199565 -208008 -11255 -100088 -231516 97913 194670 -71384
9355b80907c1307A62243n3958c84056G2487e34860J56925e9854q8164A11227d53838
$$ -280907 -31307 162243 108285 -384056 72487 -534860 -377935 -59854 -148018 111227 -453838
9343G380c85107A51023C9644f8749k2632d0226r2403r6q7935r6702h5292j12124
$$ 7380 -385107 151023 39644 -68749 -91381 -40226 -132629 -132725 -220660 -317362 -85292 -197416
9331a97416D6495d24839A4003A912K57353i0421A12578f4740j83601g1101j87409
$$ -197416 46495 -424839 14003 1912 259265 -90421 112578 -64740 -248341 -71101 -258510
9320b58510A02665j3428b96380A90199b16454h3827b1376j08777j11326K4598
$$ -258510 102665 89237 -296380 190199 -216454 -83827 -21376 -130153 -241479 -216881
9310b16881K0325B22271b6461N731k37521a3947q9573l99455i890k27861A1555
$$ -216881 -196556 222271 -26461 -20730 -258251 -13947 -103520 -502975 -9890 -237751 11555
9298b17683c8454j59795O7920K752C52947d37736b16364a02403C8037c59947B4983
$$ -217683 -38454 -198249 -130329 -127577 352947 -437736 -216364 -102403 38037 -359947 24983
9286a1858j6658N661j27344K9219E3031g2465I6254b87518a455p3111j04315b5392
$$ -11858 -28516 -22855 -150199 -120980 53031 -72465 96254 -287518 -1455 -74566 -178881 -25392
9273b8131j52787a6650D4130Q4296b87394H018b10079k7080E3064b03706I5283
$$ -28131 -180918 -16650 44130 128426 -287394 8018 -210079 -237159 53064 -203706 95283
9261A64437k7128A333h3405d449A25911n0832K33779E4774K0448a50067G7380
$$ 164437 137309 1333 -83405 -4449 125911 75079 308858 54774 75222 -150067 77380
9249a42692K9169B31743c44938J18309C13738H8717n561f849B04355a25203D7054
$$ -142692 -113523 231743 -344938 -226629 313738 88717 83156 -6849 204355 -125203 47054
9237B44302B2785h3048b0837n5736B37437b4782A19964a78279P2428D0900J20952
$$ 244302 22785 -83048 -20837 -76573 237437 -24782 119964 -178279 -105851 40900 161852
9226A61852i4997R746C74470C7385a97729m8375A3791a86263C35972A07595a11311
$$ 161852 -94997 -85251 374470 37385 -197729 -246104 13791 -186263 335972 107595 -111311
9214b78159H2722k6221a88313g2938k06859j86284a29064j17228J12477C3986
$$ -278159 82722 56501 -188313 -72938 -279797 -466081 -129064 -246292 -133815 33986
9203e0353A78404g7236k32899k6872A23138e35307i232D6750j3205J36075a10861
$$ -50353 178404 -77236 -310135 -337007 123138 -535307 -9232 46750 33545 169620 -110861
9191a36927k83876a79565d041j56957j56694D8937P177J39499a08507C5151c6926
$$ -136927 -420803 -179565 -4041 -160998 -317692 48937 56114 195613 -108507 35151 -36926
9179C5199c00356K8312j7835a10392m1167A39477K80844c12715c4658B99335c02748
$$ 35199 -300356 -272044 -289879 -110392 -151559 139477 420321 -312715 -34658 299335 -302748
9167h2727H2489A1212b80628i1107j89837B58438j16792m7702O3618E6612a93029
$$ -82727 82489 11212 -280628 -91107 -280944 258438 141646 93944 157562 56612 -193029
9155A531J1348a04516j2721E0169a07407A42482m3977a89416c1118G2587a03829
$$ 1531 12879 -104516 -117237 50169 -107407 142482 98505 -189416 -31118 72587 -103829
9143a42048f0390l44535B380N5497b58494G3521a66339j4640p5469B35972I4351
$$ -142048 -60390 -404925 2380 57877 -258494 73521 -166339 -180979 -256448 235972 94351
9131d9328K3180k12364K3230A15489c17109d1613k75763F3570h7991B61377c17865
$$ -49328 -26148 -238512 -215282 115489 -317109 -41613 -317376 63570 -87991 261377 -317865
9119d2847m8779m8873F998O0330c27549I0669R2792b67664i1746j07418c3679
$$ -42847 -91626 -140499 6998 67328 -327549 90669 183461 -267664 -91746 -199164 -33679
9107G3909a98862A61020J0081h4944n1202j5117n7896A5328c6279j8447k10276
$$ 73909 -198862 161020 171101 -84944 -136146 -151263 -209159 15328 -36279 -54726 -265002
9096b65002P8008D0286M9059F895b44068F8255b91628c654F3310a75859k10868
$$ -265002 -186994 40286 89345 6895 -244068 68255 -291628 -3654 63310 -175859 -386727
9085c86727B79511o8227b32095a13874p0976A14870h8629j004b3175C2798c1576
$$ -386727 279511 211284 -232095 -113874 -184850 114870 -88629 -89633 -23175 32798 -31576
9073A12122D1058c19304J297C448K18717c35909H4772b9410B04213c11584g5981
$$ 112122 41058 -319304 -318007 3448 222165 -335909 84772 -29410 204213 -311584 -75981
9061c78506F3237b19153G2607c91973h8639H8473P8374i4759F7876d0914D1749
$$ -378506 63237 -219153 72607 -391973 -88639 88473 166847 -94759 67876 -40914 41749
9049d7740n4949A68297i0319A5577a45284A101c17277E8431a6476k07722b2969
$$ -47740 -102689 168297 -90319 15577 -145284 1101 -317277 58431 -16476 -224198 -22969
9037G3789a80755M046m6932f9396A67136b60050m7394k29242a97719G4433R3913
$$ 73789 -180755 -176709 -223641 -69396 167136 -260050 -307444 -536686 -197719 74433 168346
9026A68346m8671c73607H8865b15220d9283j3098H008b2370j16636p3787g4941
$$ 168346 119675 -373607 88865 -215220 -49283 -62381 8008 -22370 -139006 -212793 -74941
9014c68346J51945A45096c1818B63779a16351A16586c9999j10588C14102F6990
$$ -368346 -216401 145096 -31818 263779 -116351 116586 -39999 -150587 314102 66990
9003b26415C0614O3481a58422j41f0689A47834a72464l7939b5813j02796B01690
$$ -226415 30614 94095 -158422 -158563 -60689 147834 -172464 -210403 -25813 -128609 201690
8991d05987a94680d988k1728A65331e0061n7016C9903A0705b01512j11332R5123
$$ -405987 -194680 -4988 -26716 165331 -50061 -107077 39903 10705 -201512 -312844 -217721
8980b17721A55420j1783c5508o1238B84846I5311b93290B16051K93981e1843D9227
$$ -217721 155420 143637 -35508 -96746 284846 95311 -293290 216051 510032 -51843 49227
8968a08345A28641a96426j3381e9087j06605K6096r9733A2139Q5378a97215j38839
$$ -108345 128641 -196426 -209807 -59087 -165692 -139596 -239329 12139 97517 -197215 -336054
8957c36054A94972a32164l1786C25846F1149a82738A2426P9a10461A31006E1526
$$ -336054 194972 -132164 -163950 325846 61149 -182738 12426 12505 -110461 131006 51526
8945G2870a95937B0989a28365j82040C93484A52904l7533P5502F1056b76653I539
$$ 72870 -195937 20989 -128365 -310405 393484 152904 115371 190873 61056 -276653 9539
8933c96706I8663a09311B19224J73042A26985b6305j24579A21808j9332i4730
$$ -396706 98663 -109311 219224 392266 126985 -26305 -150884 121808 102476 -94730
8922A82023a25840B23185N52695J875010M064561B198772C79710b22126A08815
$$ 182023 -125840 223185 775880 2650890 6715451 2198772 379710 -222126 108815
8912A38577J97333a57871A13455K74856a11316j09379D27690J95537F0005d73120
$$ 138577 335910 -157871 113455 388311 -111316 -220695 427690 623227 60005 -473120
8901b00467p7346m6940e5019A97723b41856A28822a85712A79341q7427C7577a2641
$$ -200467 -277813 -324753 -55019 197723 -241856 128822 -185712 179341 91914 37577 -12641
8889I1050C3732L3472P2801f9251A4206J98488j02170E2126M7809J30085i6264
$$ 91050 33732 67204 140005 -69251 14206 212694 110524 52126 99935 230020 -96264
8877D1427c5273l34943a77037d0457l1667j06022o6890J08287J5320B01311J49397
$$ 41427 -35273 -370216 -177037 -40457 -72124 -178146 -245036 -136749 -121429 201311 350708
$$ [...]
##END NTUPLES=NMR SPECTRUM
##END=
