
##TITLE=AC1296_UGARS11108_6615178_16VFo8Pvjh
##JCAMPDX= 6.0         $$ Bruker NMR JCAMP-DX V2.0
##DATA TYPE= NMR SPECTRUM
##DATA CLASS= NTUPLES
##ORIGIN= BRUKER
##OWNER= Administrator
$$ 1.72 TOPSPIN		Version 2.1
$$ 2012-08-02 18:25:43.781 -0500  Administrator@TOPSPIN
$$ Compression mode = diff/dup
##.OBSERVE FREQUENCY= 400.02188249412
##.OBSERVE NUCLEUS= ^1H
##.ACQUISITION MODE= SIMULTANEOUS (DQD)
##.ACQUISITION SCHEME= undefined
##.AVERAGES= 64
##.DIGITISER RES= 22
##SPECTROMETER/DATA SYSTEM= spect
##.PULSE SEQUENCE= noesygpps1d.comp
##.SOLVENT NAME= COFFEE_meoh
##.SHIFT REFERENCE= INTERNAL, COFFEE_meoh, 1, 14.9629
##AUDIT TRAIL= $$ (NUMBER, WHEN, WHO, WHERE, PROCESS, VERSION, WHAT)
$$ ##TITLE= Audit trail, TOPSPIN		Version 2.1
$$ ##JCAMPDX= 5.01
$$ ##ORIGIN= Bruker BioSpin GmbH
$$ ##OWNER= Administrator
$$ $$ C:\Bruker\TOPSPIN/data/COFFEE/nmr/AC1296_UGARS11108_6615178_16VFo8Pvjh/12/pdata/1/auditp.txt
$$ ##AUDIT TRAIL=  $$ (NUMBER, WHEN, WHO, WHERE, PROCESS, VERSION, WHAT)
(   1,<2012-08-02 18:25:38.500 -0500>,<Administrator>,<TOPSPIN>,<go>,<TOPSPIN 2.1>,
      <created by zg
	started at 2012-08-02 18:14:08.296 -0500,
	POWCHK enabled, PULCHK disabled,
       configuration hash MD5:
       6B 1B 68 BB D9 2E 58 E2 7F 35 AD 54 07 DF 0E 41
       data hash MD5: 64K
       20 46 D4 2B F8 B4 F5 F1 77 09 CE DF DC 0D 1C 03>)
(   2,<2012-08-02 18:25:41.531 -0500>,<Administrator>,<TOPSPIN>,<proc1d>,<TOPSPIN 2.1>,
      <Start of raw data processing
       efp LB = 0.3 FT_mod = 6 PKNL = 1 PHC0 = 0 PHC1 = 0 SI = 128K 
       data hash MD5: 128K
       84 DC A5 16 70 58 76 F8 1B 2B A1 BF A9 53 E8 D8>)
(   3,<2012-08-02 18:25:42.671 -0500>,<Administrator>,<TOPSPIN>,<proc1d>,<TOPSPIN 2.1>,
      <pk PHC0 = 2.911377 PHC1 = 0 
       data hash MD5: 128K
       07 F5 C0 D9 3F 60 D3 1A B1 BA FB 33 AB 9A 33 8A>)
(   4,<2012-08-02 18:25:43.421 -0500>,<Administrator>,<TOPSPIN>,<proc1d>,<TOPSPIN 2.1>,
      <abs ABSG = 1 
       data hash MD5: 128K
       E7 EA 27 C7 7D 88 F5 8D 59 A7 B0 AE FE E5 F0 D8>)
(   5,<2012-08-02 18:25:43.500 -0500>,<Administrator>,<TOPSPIN>,<proc1d>,<TOPSPIN 2.1>,
      <abs ABSG = 2 
       data hash MD5: 128K
       06 A0 78 EB 76 F3 43 4A CC D6 21 8A 7D FC F4 25>)
(   6,<2012-08-02 18:25:43.562 -0500>,<Administrator>,<TOPSPIN>,<proc1d>,<TOPSPIN 2.1>,
      <abs ABSG = 3 
       data hash MD5: 128K
       69 E7 1F C6 3F D0 17 0E 85 71 24 CD CD CA 6F B5>)
(   7,<2012-08-02 18:25:43.625 -0500>,<Administrator>,<TOPSPIN>,<proc1d>,<TOPSPIN 2.1>,
      <abs ABSG = 4 
       data hash MD5: 128K
       C3 06 E0 6E 74 8D 5B 1E 27 C2 F7 0F 79 21 33 75>)
(   8,<2012-08-02 18:25:43.687 -0500>,<Administrator>,<TOPSPIN>,<proc1d>,<TOPSPIN 2.1>,
      <abs ABSG = 5 
       data hash MD5: 128K
       64 1A 9A 75 9D 26 B0 3E BE DB EA 21 A2 22 A6 F9>)
$$ ##END=
$$ 
$$ $$ hash MD5
$$ $$ E8 7E F5 49 9E 02 CE 83 97 C8 E2 BD 21 70 DC 5D
##$RELAX= 
##$RELAX= 
##$RELAX= 
##$RELAX= 
##$RELAX= 
##$RELAX= 
##$RELAX= 
##$RELAX= 
$$ Bruker specific parameters
$$ [...]
150 150 150 150 150 150 150 150
##$TP07= 0
##$TPNAME0= <>
##$TPNAME1= <>
##$TPNAME2= <>
##$TPNAME3= <>
##$TPNAME4= <>
##$TPNAME5= <>
##$TPNAME6= <>
##$TPNAME7= <>
##$TPOAL= (0..7)
0.5 0.5 0.5 0.5 0.5 0.5 0.5 0.5
##$TPOFFS= (0..7)
0 0 0 0 0 0 0 0
##$TUNHIN= 0
##$TUNHOUT= 0
##$TUNXOUT= 0
##$USERA1= <user>
##$USERA2= <user>
##$USERA3= <user>
##$USERA4= <user>
##$USERA5= <user>
##$V9= 5
##$VALIST= <valist>
##$VCLIST= <CCCCCCCCCCCCCCC>
##$VD= 0
##$VDLIST= <DDDDDDDDDDDDDDD>
##$VPLIST= <PPPPPPPPPPPPPPP>
##$VTLIST= <TTTTTTTTTTTTTTT>
##$WBST= 1024
##$WBSW= 4
##$XGAIN= (0..3)
0 0 0 0
##$XL= 0
##$YL= 0
##$YMAX_a= 15523044
##$YMIN_a= -8083831
##$ZGOPTNS= <>
##$ZL1= 120
##$ZL2= 120
##$ZL3= 120
##$ZL4= 120
##$ABSF1= 14.9629
##$ABSF2= -5.595282
##$ABSG= 5
##$ABSL= 3
##$ALPHA= 0
##$AQORDER= 0
##$ASSFAC= 0
##$ASSFACI= 0
##$ASSFACX= 0
##$ASSWID= 0
##$AUNMP= <proc_prof1d_extract.lims>
##$AXLEFT= 0
##$AXNAME= <>
##$AXNUC= <1H>
##$AXRIGHT= 0
##$AXTYPE= 0
##$AXUNIT= <>
##$AZFE= 0.1
##$AZFW= 0.1
##$BCFW= 0
##$BC_mod= 0
##$BYTORDP= 0
##$COROFFS= 0
##$CY= 15
##$DATMOD= 1
##$DC= 0
##$DFILT= <>
##$DTYPP= 0
##$F1P= 0
##$F2P= 0
##$FCOR= 0.5
##$FTSIZE= 131072
##$FT_mod= 6
##$GAMMA= 0
##$GB= 0
##$INTBC= 1
##$INTSCL= 1
##$ISEN= 128
##$LB= 0.3
##$LEV0= 0
##$LPBIN= 0
##$MAXI= 10000
##$MC2= 0
##$MEAN= 0
##$ME_mod= 0
##$MI= 0
##$NCOEF= 0
##$NC_proc= -2
##$NLEV= 6
##$NOISF1= 0
##$NOISF2= 0
##$NSP= 0
##$NTH_PI= 0
##$NZP= 0
##$OFFSET= 14.9629
##$PC= 1
##$PHC0= 2.911377
##$PHC1= 0
##$PH_mod= 1
##$PKNL= yes
##$PPARMOD= 0
##$PPDIAG= 0
##$PPIPTYP= 0
##$PPMPNUM= 2147483647
##$PPRESOL= 1
##$PSCAL= 4
##$PSIGN= 0
##$PYNMP= <proc.py>
##$REVERSE= no
##$SF= 400.020008876481
##$SI= 131072
##$SIGF1= 0
##$SIGF2= 0
##$SINO= 400
##$SIOLD= 131072
##$SPECTYP= <>
##$SREGLST= <1H.CDCl3>
##$SSB= 0
##$STSI= 131072
##$STSR= 0
##$SW_p= 8223.68421052631
##$SYMM= 0
##$S_DEV= 0
##$TDeff= 65536
##$TDoff= 0
##$TI= <>
##$TILT= no
##$TM1= 0
##$TM2= 0
##$TOPLEV= 0
##$USERP1= <user>
##$USERP2= <user>
##$USERP3= <user>
##$USERP4= <user>
##$USERP5= <user>
##$WDW= 1
##$XDIM= 131072
##$YMAX_p= 445497127
##$YMIN_p= -11140
##$CURPLOT= <Network HP LaserJet P1505>
##$CURPRIN= <$Network HP LaserJet P1505>
##$DFORMAT= <normdp>
##$LAYOUT= <+/1D_H.xwp>
##$LFORMAT= <normlp>
##$PFORMAT= <normpl>
##$SURQMSG= 1
$$ End of Bruker specific parameters
$$ ---------------------------------
##NTUPLES= NMR SPECTRUM
##VAR_NAME=  FREQUENCY,     SPECTRUM/REAL,   SPECTRUM/IMAG
##SYMBOL=    X,             R,               I
##VAR_TYPE=  INDEPENDENT,   DEPENDENT,       DEPENDENT
##VAR_FORM=  AFFN,          ASDF,            ASDF
##VAR_DIM=   131072,        131072,          131072
##UNITS=     HZ,            ARBITRARY UNITS, ARBITRARY UNITS
##FACTOR=    0.0627417313425164, 1,          1
##FIRST=     8223.62146879497, 2295,         -46303
##LAST=      0,             2345,            -46924
##MIN=       0,             -11140,          0
##MAX=       8223.62146879497, 445497127,    0
$$ Real data points
##PAGE= N=1
##DATA TABLE= (X++(R..R)), XYDATA
$$ [...]
64475 65283 64742 64049 63157 62025 60978 60586 60880 61216 61294 61710 62901 64146 64447 63936 63470 63213 62693 62041
64457 62041 62015 62726 63399 63636 63968 64858 65996 66990 68011 69245 70181 69978 68401 66123 64223 63384 63411 63547
64439 63547 63407 63299 63446 63393 62759 62123 62348 63297 64050 64317 64733 65725 66925 67870 68551 69097 69540 70083 71002
64420 71002 72129 73003 73669 74785 76760 79286 81841 84167 86194 88024 90079 92727 95668 98161 99920
64405 99920 101281 102513 103592 104697 106246 108255 110269 112152 114388 117387 121013 125033 129481 134312
64391 134312 139200 143939 148676 153465 158018 162154 166209 170625 175314 179588 182679 184297 184770 184615 183854
64376 183854 181962 178609 174171 169253 164090 158751 153432 148026 141818 134380 126477 119406 113677 108989
64362 108989 105191 102344 100016 97495 94780 92579 91286 90674 90512 90617 90301 88762 86216 83860 82445
64347 82445 81651 80972 80415 80060 79743 79565 80052 81411 83111 84427 84946 84502 83191 81617 80573 80325 80726
64330 80726 81920 84218 87286 90232 92589 94520 96065 97137 98361 100871 104949 109678 114300 119033
64316 119033 124126 128930 132517 134609 135462 135269 134056 131739 128115 123264 118023 113413 109501 105560 101418
64301 101418 97827 95360 93755 92578 91696 90937 90153 89802 90481 91736 92395 92363 92847 94357 95730 95836 95071
64284 95071 94342 93651 92686 91907 91975 92721 93657 94951 96977 99426 101668 103542 105064 105932 106121 106451 107665
64267 107665 109329 110449 110840 111087 111551 112196 113093 114275 115293 115635 115479 115399 115472 115210 114289 112921 111593
64250 111593 110668 110015 108942 106970 104793 103754 104073 104377 103473 101753 100355 99770 100050 101480 104051 106757
64234 106757 108477 109230 109797 110451 110842 110821 110634 110598 111175 112908 115640 118314 120244 122064 124655 127732 130403
64217 130403 132548 134577 136261 136995 137034 137362 138386 139722 141134 142719 144232 145245 146075 147661 150372
64202 150372 153686 157175 161054 165702 171355 178419 187389 198218 210216 222641 234986 246803 257749
64189 257749 267795 276901 284646 290696 295447 299601 303184 305629 306729 306892 306442 305166 302544 298019
64175 298019 291247 282544 272850 262769 251971 240139 228054 216888 206702 196630 186419 176849
64163 176849 168580 161476 155206 149737 145064 141120 138082 136162 135002 133909 132708 131754 131052 130095 128674
64148 128674 127232 126211 125575 125070 124461 123513 122277 121431 121743 123190 125054 126838 128486 129926 131141 132598
64132 132598 134705 136827 137798 137554 137317 137810 138244 137535 135739 133644 131633 129633 127775 126388 125482 124727
64116 124727 123853 122785 121535 120227 119082 118197 117438 116621 115614 114278 112647 111205 110629 111081 112027 112845
64100 112845 113392 113953 114865 116194 117571 118430 118681 118974 119939 121372 122728 124174 126408 129388 132075 133764
64084 133764 135062 137104 140205 143682 146726 149138 151386 154198 157939 162215 166202 169364 171719 173495
64070 173495 174795 175617 175843 175235 173699 171577 169422 167545 166021 165000 164546 164261 163534 162220 160679 159222
64054 159222 157955 157116 157002 157412 157727 157673 157583 157721 157807 157487 156969 156865 157599 159145 161175 163318 165405 167552
64036 167552 169932 172555 175407 178685 182607 187037 191559 195865 199881 203621 207186 210742 214218 217138
64022 217138 219113 220355 221382 222310 222787 222503 221458 219867 218066 216354 214688 212791 210862 209760 210061
64007 210061 211317 212806 214557 216971 219787 222230 223993 225312 226324 227224 228860 232153 236788 241364
63993 241364 245058 248389 252171 256500 261046 265635 270195 274656 279077 283445 287276 289970 291626 292889
63979 292889 294012 294872 295926 298204 302019 306548 311098 316018 321868 328403 335006 341586 348383 355290
63965 355290 361993 368577 375545 383386 392445 402899 414518 426705 439164 452411 467288 484089
63953 484089 502342 521372 540994 561778 584705 610460 638992 669773 702249 735913 770367
63942 770367 805849 843448 884229 928241 974963 1024432 1077228 1133467 1192871 1256165 1325674
63931 1325674 1404155 1493457 1594559 1708485 1837096 1983565 2152323 2348253 2575938 2840108
63921 2840108 3146451 3500964 3908042 4369461 4884815 5451838 6066156 6721937 7413573
63912 7413573 8136232 8884097 9647910 10413575 11161945 11870117 12515059 13078240 13547660
63903 13547660 13916051 14178158 14329877 14368420 14291768 14098276 13788176 13366246 12843406 12236302
63893 12236302 11565321 10851531 10113587 9366339 8621677 7890003 7180800 6502630 5863281
63884 5863281 5269575 4726465 4236259 3798732 3411654 3071376 2773733 2514842 2290715
63875 2290715 2096305 1926012 1775646 1643149 1526911 1424247 1332148 1248794 1173437 1105247
63865 1105247 1043002 985550 931935 881305 833304 788243 746406 707458 670978 637099 606020
63854 606020 577196 549713 523294 498499 475982 455892 437756 420781 404614 389988 378075
63843 378075 368878 360866 352588 344013 335818 328102 320582 313383 306719 300154 293096 285789 279023 273036
63829 273036 267473 262205 257386 252791 247888 242636 237513 232708 227898 222903 218036 213628 209692 206138
63815 206138 202944 200002 197094 194092 190973 187679 184270 181151 178839 177473 176694 175959 174883 173459 172100
63800 172100 171241 170750 170037 168888 167875 167648 168150 168805 169163 169038 168355 167277 166197 165250 164018 162050 159478
63783 159478 156890 154868 153759 153525 153562 153116 152162 151405 151129 150575 148943 146493 144105 142195 140612 139227
63767 139227 138025 136856 135586 134287 132928 131295 129600 128572 128411 128278 127550 127002 127786 129647 131210
63752 131210 131908 132506 133637 134885 135685 136290 137323 138834 140365 141703 143106 144805 146561 147911 148881
63737 148881 150264 152914 156872 161520 166473 171732 176992 181697 186122 191579 198956 207758 217207 227560
63723 227560 239555 253190 268008 284043 301383 319107 335767 350751 364063 374825 381212 382181
63711 382181 378381 371060 360933 348437 334284 319189 303550 287847 272944 259613 247997 237849
63699 237849 229024 221572 215515 210702 206741 203091 199456 196040 193229 191086 189472 188515 188536 189446 190588
63684 190588 191272 191345 191314 192075 194373 198213 202900 207866 213291 219695 227219 235605 244635 254249 264462
63669 264462 275542 287932 301560 315481 328731 341220 353235 364257 372897 377935 378935 375942
63657 375942 369224 359346 346984 332637 316858 300671 285309 271477 259212 248389 239013 231107
63645 231107 224654 219591 215584 211987 208348 204828 201897 199860 198904 199202 200607 202593 204893 207819 211537
63630 211537 215507 219144 222672 226741 231613 237264 243813 251170 258746 266243 274320 283700 294082 304858
63616 304858 316468 329885 344998 360711 376684 393869 413157 434401 457070 480986 506079
63605 506079 531962 557919 582770 604720 622030 634064 641292 644393 643903 640564 635239 628480 620759
63592 620759 612927 605655 598514 590406 580842 570021 557876 544053 528803 512855 496306 478712
63580 478712 460443 442959 427372 413608 401243 390250 380675 372471 366017 361903 359776 358248 356447
63567 356447 354967 354867 356460 359494 363795 369219 375537 382742 390979 399945 409088 418622 429572 442479
63553 442479 456911 472567 489918 509233 529907 551451 574330 599052 625116 651610 678102
63542 678102 703975 727421 746238 759562 768162 773233 775652 776258 776139 776528 778740 783919 792258 802518
63528 802518 812748 821395 827384 829506 826372 817099 801663 780631 754879 725504 693651 660366
63516 660366 626749 594107 563659 536057 511292 488985 468735 450359 433954 419640 407269
63505 407269 396610 387741 380863 375621 371071 366541 362286 359066 357391 357280 358415 360209 361954 363234
63491 363234 364185 365319 367146 369973 373847 378685 384591 391932 400838 410849 421469 432917 445822
63478 445822 460245 475624 491660 508604 526441 544302 560932 575285 586423 593317 595176 591930
63466 591930 584338 573720 561493 548559 535139 521373 507901 495483 484323 474235 465262 457522
63454 457522 450708 444440 438981 434844 431718 428597 424965 421193 417812 415158 413680 413658 414563 415530 416568
63439 416568 418423 421305 424831 429291 435675 444082 453275 462387 471996 482960 495272 508729 523705
63426 523705 540427 558357 577191 597727 620853 646320 673409 702252 733580 767543 803544
63415 803544 840828 878403 914669 947823 976494 999528 1015690 1024313 1026019 1022240 1014222 1002955
63403 1002955 989683 975851 962614 950636 939943 929611 918017 903890 886960 867546 846165
63392 846165 823800 801789 780840 760671 741019 722382 705329 689850 675956 664248 655183 648327
63380 648327 643023 639261 637288 636918 637874 640241 643932 648339 653265 659560 668017 678261 689599 702380
63366 702380 717419 734460 752289 770182 788298 806844 825854 845786 867531 891633 917945
63355 917945 945888 974540 1002702 1029364 1053823 1074934 1090816 1100068 1102896 1100453 1093520 1082630
63343 1082630 1068936 1053929 1038492 1022968 1007782 993114 978263 962299 945139 927191 908250
63332 908250 887717 865657 842619 818674 793755 768827 745536 724538 705144 686674 669241
63321 669241 653086 638197 624797 613243 603144 593460 583876 575248 568291 562494 556801 550805 544800
63308 544800 539112 533811 528793 523847 518748 513350 507496 500979 493941 487068 480950 475431 470078 464999
63294 464999 460521 456340 451791 446928 442458 438523 434354 429394 424036 419027 414712 411126 408228 405748
63280 405748 403228 400519 397944 395802 394010 392311 390523 388570 386561 384741 383039 380873 377926 374923
63266 374923 373002 372362 372141 371561 370516 369123 367476 366001 365264 365143 364776 363634 362155 361111 360757 360807
63250 360807 360825 360484 359792 359208 359167 359488 359641 359512 359370 359194 358730 358308 358818 360619 363044 365265 367101 368733
63232 368733 370239 371773 373717 376206 378867 381520 384813 389687 396343 404040 411872 419494 427097 434880
63218 434880 442578 449511 455014 458771 460852 461699 462073 462507 462534 460994 457610 453876 451723 451569 452318 453013
63202 453013 453655 454426 455041 455217 455167 455254 455541 455980 456700 457862 459425 461195 463002 464818 466822 469228 471870
63185 471870 474253 476276 478636 482137 486876 492530 499069 506586 514691 522823 531097 540213 550558 561977
63171 561977 574350 587792 602235 617304 632582 647589 661735 674827 687443 700186 712764
63160 712764 724399 734893 744607 753649 761922 769745 777462 784496 789692 792622 793599 792491 788590 781875
63146 781875 773316 763626 752631 740155 726589 712156 696668 680649 665847 653763 644124 635425
63134 635425 626652 617927 609824 602601 596046 589781 583738 578310 573874 570329 567398 565122 563539 562250
63120 562250 561101 561004 563042 566754 570418 573163 575755 579081 583036 587351 592388 598404 604847 611081 617121
63105 617121 623139 629009 634934 641725 649686 657844 665030 671225 677192 683235 688988 693921 697400 698594
63091 698594 697035 693100 687535 680801 673221 665263 657228 649063 640938 633499 627043 620935 614477 608002
63077 608002 602556 598709 596147 594154 592175 590209 588965 589291 591180 593849 596944 601033 606563 613139
63063 613139 620350 628538 638019 648215 658329 668303 678301 687811 696196 703692 710899 717572 722851 726423
63049 726423 728499 728858 726984 723149 718387 713220 707250 700180 692436 684507 676365 667873 659230 650685
63035 650685 642232 633823 625546 617446 609510 601943 595071 588867 582924 576975 571053 565073 558746 552118
63021 552118 545723 539918 534453 529043 524006 519897 516677 513763 510852 508259 506328 504989 504176 504302 505781
63006 505781 508154 510277 511604 512879 515278 519218 524359 530417 537388 545123 553331 562069 571770 582601
62992 582601 594236 606394 619279 633343 648852 665701 683297 700596 716709 731585 745775
62981 745775 759461 772123 783274 793037 801811 809791 817021 823549 829232 833630 836258 836752 834738 829850
62967 829850 822005 811335 797839 781417 762276 740907 717633 692608 666242 639162 611729 584115
62955 584115 556855 530731 506081 482852 461350 442181 425315 409979 395700 382682 370873
62944 370873 359579 348460 338124 329202 321532 314787 309184 304860 301203 297500 293821 290546 287491
62931 287491 284252 281081 278636 277029 275714 274237 272592 270986 269603 268480 267375 266051 264843 264437
62917 264437 264840 265157 264819 264387 264588 265164 265378 265118 264735 264188 263154 261736 260261 258564 256257 253623 251589
62900 251589 250769 251040 252024 253497 255288 257122 258545 258930 257916 256074 254708 254562 255121 255538 255687 255775 255555
62883 255555 254727 253692 253072 252753 252182 251395 250948 250983 251193 251596 252579 254191 256101 258254 260882 263922 267163
62866 267163 270996 276137 282401 288528 293650 298392 304076 311159 318857 326066 332304 337795 342878 347460
62852 347460 351118 353646 355258 356154 356219 355364 353820 351751 348864 344875 340176 335529 331182 326655 321386
62837 321386 315291 308854 303011 298766 296448 295259 293911 291781 289295 287230 285810 284472 282435 279562
62823 279562 276641 274608 273540 272714 271639 270493 269477 268407 267209 266232 265668 265169 264430 263636 262922 261951
62807 261951 260503 259003 257881 256870 255500 253906 252610 251878 251730 252102 252470 251911 250228 248494 247755 247621
62791 247621 246976 245688 244691 244615 245157 245698 245746 244916 243226 241362 239998 238956 237659 236238 235471 235732 236638
62774 236638 237602 238078 237447 235465 232792 230435 228656 226990 225167 223362 221680 220116 219007 218798 219358
62759 219358 220170 221108 222390 223823 224867 225525 226455 227960 229500 230425 230762 231139 232295 234687 238138 241791
62743 241791 244773 246982 249038 251561 254698 258148 261385 264140 266903 270524 274937 278828 281033 281760
62729 281760 281876 281632 280858 279801 278796 277499 275415 272857 270417 267817 264383 260418 256927 253964 250516
62714 250516 246222 242206 239793 239173 239602 240222 240467 240238 239931 239879 239858 239624 239723 241115 244115 248363 253577
62697 253577 259527 265560 271173 276958 284038 292595 301915 311822 322955 335514 348836 362538 377157
62684 377157 393393 411572 432056 455248 480879 508042 536239 565641 596123 626785 656636
62673 656636 684957 710757 732746 750230 763374 772259 776289 774807 767771 755669 739278 719551
62661 719551 697175 672233 644883 616168 587444 559158 531085 503563 477482 453201 430585
62650 430585 410080 392455 377353 363318 349524 336319 323937 312038 300888 291586 284467 278481
62638 278481 272703 267341 262667 258204 253683 249658 246377 243106 239383 235946 233574 231941 230534 229728
62624 229728 229964 230672 231019 231020 230945 230357 228772 226744 225296 224709 224688 225177 226103 226782 226553 225717 225137 225210 225894
62605 225894 227235 229051 230569 231166 231118 230914 230351 229194 228202 228425 229744 231141 232304 233921 236362 239033
62589 239033 241302 243324 245562 247999 250109 251455 252163 252946 254550 257049 259728 261766 262819 262910 262225
62574 262225 261222 260506 260231 259931 259140 257832 256117 254070 252076 250778 250299 250018 249417 248581 247527 245785
62558 245785 243192 240552 238859 238290 238426 238955 239576 239697 238910 237477 235902 234392 233116 232466 232471 232424 231691
62541 231691 230514 229517 228865 228425 228270 228390 228338 227832 227371 227575 228279 228902 229431 230341 231729 233142 234170 234763
62523 234763 235124 235590 236402 237374 238165 239057 240803 243391 245758 247369 249309 252958 258135 263451 268088 272297
62507 272297 276482 280791 285531 291110 297521 304568 312596 322419 334476 348509 363971 380322 397097
62494 397097 414170 431847 450261 468832 486650 503126 517905 530492 540438 547612 551862 552782
62482 552782 550291 545058 537871 528954 518364 506598 494263 481589 468850 456787 445905 435798
62470 435798 425859 416239 407401 399259 391621 384957 379621 374713 368974 362769 357965 355668 355119 355045 355045 355169
62454 355169 355144 354732 354365 354713 355809 357047 357910 358430 359007 359994 361415 362993 364470 365869 367367 368967
62438 368967 370361 371144 371178 370832 370690 370797 370400 368790 366186 363222 359844 355640 351231 348158 346976 346521
62422 346521 345685 344954 345409 346988 348701 350022 351180 352577 354753 358489 364045 370629 377428 384803 393588
62407 393588 403574 413632 423252 433069 443852 455643 467923 480113 491946 503683 515720 527696
62395 527696 538414 547050 553907 559536 563833 566608 568294 569255 569062 567426 565247 563659 562490 560768
62381 560768 558437 556475 555602 555943 557740 561291 566288 572224 579377 588469 599582 612375 627168 644718
62367 644718 665118 688020 713791 743201 776020 811273 849077 890989 938160 990180 1045987
62356 1045987 1104776 1165646 1227434 1289519 1351878 1413614 1471967 1523307 1564769 1594776 1612802
62345 1612802 1619265 1615317 1602285 1581268 1553218 1518984 1479239 1434701 1386405 1335457 1282755 1229346
62333 1229346 1176765 1126425 1078937 1034624 994293 958692 927496 899728 875005 853438 834547
62322 834547 817376 801745 788360 777582 769006 762334 757779 755386 754844 756057 759048 763170 767263
62309 767263 770797 774090 777386 780496 783385 786155 788382 789450 789586 789541 789141 787364 784129 780828 778588
62294 778588 777122 775871 775224 775828 777512 779724 782435 785924 790135 794884 800382 807073 815216 824811 835531
62279 835531 846598 857334 868027 879702 892791 906675 920741 935210 950672 967438 985663
62268 985663 1005538 1027132 1050549 1076259 1104527 1134553 1165214 1196962 1231916 1271603 1315584
62257 1315584 1362899 1413880 1469617 1530317 1595080 1662790 1732270 1801713 1868618 1930262 1984019
62246 1984019 2027702 2060187 2081585 2092499 2093448 2085317 2069874 2049229 2024826 1997283 1967001 1934658
62234 1934658 1901231 1867765 1835005 1803294 1773080 1745454 1721732 1702384 1686772 1674021 1663788
62223 1663788 1656202 1651513 1649838 1650810 1653471 1657033 1661742 1668495 1677600 1688468 1700465 1713369 1727010
62210 1727010 1741178 1756066 1772148 1789473 1807669 1826727 1847142 1869216 1892853 1918157 1945551
62199 1945551 1975196 2006883 2040515 2076071 2113161 2151337 2190880 2232580 2276852 2323863 2374193
62188 2374193 2428243 2485068 2543107 2602198 2663416 2726540 2788946 2847659 2901346 2949792 2992630
62177 2992630 3029620 3061370 3088941 3113275 3135557 3157535 3180920 3206910 3236543 3270691 3309421
62166 3309421 3352232 3399310 3451589 3509137 3570427 3633711 3698104 3762685 3825462 3884059 3936748
62155 3936748 3982334 4020023 4050196 4074481 4094245 4109523 4119880 4125386 4126059 4121433 4111685 4098537
62143 4098537 4084090 4069278 4054125 4038816 4023638 4008481 3993281 3978564 3964935 3952505 3941239
62132 3941239 3931106 3921337 3910515 3898268 3886044 3875298 3865674 3855913 3845802 3836063 3826928 3818006
62120 3818006 3809196 3800663 3792208 3783640 3775512 3768581 3762699 3757015 3751029 3744753 3738150 3731196 3724180 3717271
62106 3717271 3710053 3702163 3694038 3686326 3678961 3671509 3664080 3657162 3650789 3644561 3638244 3631876 3625589 3619762
62092 3619762 3614875 3610776 3606635 3602088 3597772 3594269 3591274 3588457 3586220 3584837 3583803 3583038 3583854 3587473
62078 3587473 3593214 3599328 3605003 3610172 3613740 3613483 3607829 3596789 3581257 3562359 3541351 3519233 3496383
62065 3496383 3473085 3450001 3427494 3405049 3382271 3359881 3338631 3317640 3294843 3268693 3238449
62054 3238449 3203407 3163350 3119510 3073762 3026876 2978665 2929593 2880928 2833370 2786945 2742371
62043 2742371 2701302 2664981 2633517 2606227 2581202 2554488 2521573 2480743 2434263 2385994 2338914
62032 2338914 2295296 2257506 2226705 2200807 2174752 2143318 2103756 2056261 2002665 1945052 1885514
62021 1885514 1826488 1770293 1717851 1668490 1621508 1577325 1536560 1498745 1463098 1430063 1400903
62010 1400903 1375894 1353962 1334097 1316205 1300715 1288365 1280316 1277390 1279037 1283934 1291652 1302790
61998 1302790 1317361 1333946 1350538 1365278 1376192 1381267 1379283 1369980 1353266 1329062 1298075 1261978
61986 1261978 1222496 1180963 1138838 1097857 1059299 1023669 991214 962131 936187 912779 891553
61975 891553 872408 855019 839080 825009 813520 804402 796538 789180 782354 775946 769506 763243 758171
61962 758171 754752 752242 749907 748146 747798 748980 751148 753837 756843 760168 764250 769930 777764 787638
61948 787638 799215 812432 827428 844492 864222 887281 913762 943169 975008 1008867 1043901
61937 1043901 1079015 1113877 1149149 1185379 1222151 1258584 1294165 1328832 1362703 1395929 1428385
61926 1428385 1459251 1487319 1511944 1533455 1552740 1571012 1589981 1611554 1637088 1667425 1703783
61915 1703783 1747981 1801638 1865764 1941371 2029875 2132604 2250437 2384089 2534148 2700647
61905 2700647 2883388 3083155 3302116 3542647 3806188 4093288 4403534 4733925 5076695
61896 5076695 5418330 5740068 6019447 6233287 6362244 6395153 6330941 6177752 5950533 5668087
61886 5668087 5349906 5013325 4671917 4335509 4011203 3704232 3417989 3153790 2911425
61877 2911425 2690474 2490902 2312350 2153445 2012395 1887886 1778803 1683387 1599519 1525800
61867 1525800 1461709 1406678 1359618 1319461 1285694 1258283 1237486 1223696 1216952 1216607 1221806 1232222
61855 1232222 1247980 1269113 1295499 1326951 1362774 1401584 1442333 1485190 1530545 1577249 1622722
61844 1622722 1664607 1701465 1732002 1754861 1769485 1776329 1776000 1769085 1756998 1742137 1726768 1712408
61832 1712408 1700455 1692535 1689780 1692362 1699981 1712172 1727798 1744822 1760927 1774004 1782080 1783558
61820 1783558 1777767 1764694 1744164 1716086 1681605 1643038 1602258 1559973 1516971 1475206 1436857
61809 1436857 1402868 1372973 1346798 1324438 1306234 1292489 1283284 1278373 1277431 1280434 1287555 1298818
61797 1298818 1314211 1333941 1358013 1385746 1416460 1450591 1489359 1533418 1582752 1637930 1700473
61786 1700473 1771692 1852089 1942255 2043545 2157575 2285843 2430275 2593413 2777757 2985653
61776 2985653 3220224 3485699 3786483 4126588 4510217 4941810 5424592 5959034 6542116
61767 6542116 7165942 7814863 8463139 9075501 9610580 10026491 10288172 10374760 10283377 10027642
61757 10027642 9633137 9132672 8561711 7953669 7336375 6731016 6152705 5611306 5112439
61748 5112439 4658769 4250737 3886488 3562187 3273348 3015934 2786450 2581823 2399640
61739 2399640 2237925 2094346 1966219 1851606 1749753 1660037 1581047 1511113 1449177 1394735
61729 1394735 1347413 1306981 1273249 1245536 1222536 1202829 1184946 1166946 1146856 1123990 1099085
61718 1099085 1072752 1044587 1014282 982717 951226 920420 890506 862205 836486 813574 792833
61707 792833 773539 755455 738866 724219 711455 699554 687217 674120 661136 649297 639116
61696 639116 630756 623922 617447 609959 601339 592667 584467 576015 566708 556986 547361 537610 527730 518613
61682 518613 510850 503651 495877 487485 479102 470868 462683 455050 448628 443251 438202 433244 428712 424929
61668 424929 422144 420611 419989 419028 416607 413012 409655 407726 407470 408400 409704 410705 411404 412408 414155
61653 414155 416582 419662 423654 428544 433865 439375 445274 451520 457730 464027 471052 478622 485313 489999
61639 489999 492941 494803 495618 495558 495716 497005 498994 500947 503500 508201 515754 525618 536980 549180 561409
61624 561409 572815 582722 590181 593779 592587 586941 577683 565147 549633 532305 514703 497637 481331
61611 481331 466253 452953 441270 430492 420233 410631 401947 394450 388384 383563 379349 375468 372413
61598 372413 370603 369660 368958 368292 367509 366164 364199 362368 361403 361355 362265 364632 368485 372824 376869 381257
61582 381257 387131 394715 403560 413484 424335 435551 447022 459701 474344 490220 506127 522041
61570 522041 538601 555531 571830 587156 601768 615469 627782 638949 649580 659553 668395 676557
61558 676557 685153 694515 704034 713340 722611 731748 740187 747632 754234 760161 765600 770869 775870 779831
61544 779831 782310 783899 785047 784812 781944 776679 770183 762623 753209 742016 730335 719151 708480
61531 708480 698332 689177 681251 674441 669073 665961 665511 667517 671894 678825 688232 699875 713996 731087
61517 731087 751114 773755 799345 828807 862721 901179 944451 993118 1047779 1109348 1179257
61506 1179257 1258396 1346129 1441336 1544167 1655728 1776047 1903103 2033336 2161846 2282210
61496 2282210 2387571 2472574 2534027 2570208 2580671 2566647 2530571 2475205 2403932 2321496 2233114
61485 2233114 2142641 2052386 1964436 1881031 1803620 1732640 1668341 1610966 1560267 1515869 1478170
61474 1478170 1447924 1424944 1408062 1396244 1388869 1385206 1384788 1388170 1396228 1408707 1424466 1442882
61462 1442882 1463746 1486029 1508235 1530148 1552870 1576896 1601297 1625027 1647835 1669686 1690551
61451 1690551 1711132 1732756 1756175 1781347 1808554 1838650 1871895 1907423 1943991 1980351 2014854
61440 2014854 2045838 2072626 2095298 2113464 2126361 2134155 2137893 2138005 2134084 2126311 2115796 2103188
61428 2103188 2088139 2070537 2051143 2030611 2009027 1986816 1965012 1944170 1924036 1904654 1886728
61417 1886728 1870486 1855291 1840917 1828240 1818099 1810384 1804631 1800593 1797685 1794756 1790963 1786192 1780316
61404 1780316 1772857 1763709 1753365 1742086 1729680 1716421 1703415 1691782 1682291 1676006 1674297 1677961
61392 1677961 1687149 1702400 1724817 1755011 1792908 1838870 1894109 1959696 2036072 2123653 2222768
61381 2222768 2332642 2451461 2577727 2710484 2847785 2985750 3119263 3242561 3349222
61372 3349222 3433223 3490983 3521825 3526617 3507215 3467114 3410621 3340447 3257258 3162111 3057909
61361 3057909 2947806 2833728 2717373 2601353 2488213 2379369 2275899 2179301 2090445 2008738
61351 2008738 1933393 1864720 1803273 1748641 1700043 1657322 1620294 1587781 1558332 1531493 1507657
61340 1507657 1487207 1470570 1458546 1451836 1450569 1454759 1464664 1480164 1500316 1523884 1549683 1576056
61328 1576056 1600886 1622688 1641139 1656309 1668247 1677632 1685727 1693041 1698891 1702806 1705409 1707366 1708486
61315 1708486 1708587 1708336 1708446 1708835 1709276 1710076 1711394 1712595 1712939 1712223 1710315 1706903 1702275 1697386 1692458 1686369
61299 1686369 1678080 1667883 1656586 1644402 1631377 1618115 1605275 1593079 1581903 1572646 1565873 1561366
61287 1561366 1558992 1558998 1560763 1562187 1561105 1556584 1548375 1536261 1520842 1503980 1487457 1471795 1456980
61274 1456980 1443476 1431776 1421809 1413538 1407344 1403277 1401004 1401167 1405568 1415021 1428086 1442968 1459683
61261 1459683 1479202 1501415 1525207 1549924 1575644 1602601 1631425 1663419 1699649 1740126 1784485
61250 1784485 1832842 1885338 1941641 2001464 2064421 2128313 2188353 2239107 2276539 2297579 2299069
61239 2299069 2278758 2236948 2176223 2100215 2013453 1921314 1828534 1737913 1651189 1570397 1497411
61228 1497411 1432881 1376783 1329383 1290619 1259136 1233094 1211532 1194026 1179510 1166530 1154294
61217 1154294 1142719 1131880 1122136 1114255 1108671 1105106 1103429 1104108 1107159 1111549 1116306 1121356 1126567 1131070
61203 1131070 1134445 1137516 1140975 1144307 1147138 1150595 1156009 1163030 1170183 1176465 1181379 1184275 1184872 1183699
61189 1183699 1181050 1176449 1170114 1163794 1158857 1154642 1150035 1145623 1142804 1141792 1142110 1144232 1148955 1155580
61175 1155580 1162096 1166616 1167453 1162732 1151584 1135251 1115660 1093538 1069143 1043842 1019280 995609
61163 995609 972112 948927 926608 904638 882038 858981 836377 814478 793392 774178 757720
61152 757720 743120 728961 715609 704570 696202 689841 685639 684284 685257 687245 690144 694950 701941
61139 701941 710708 721640 735571 752141 770224 789791 811554 834951 858204 880115 899919 915594
61127 915594 924526 926198 922526 915333 905088 892227 877909 863029 847963 833582 821098 810577
61115 810577 800873 791277 782116 773698 765886 758742 752405 746390 740107 733894 728355 722983 716818 710146
61101 710146 704117 698910 693773 688673 684397 681168 678632 677057 677125 678710 681299 685307 691423 698913 706164
61086 706164 712632 718626 723368 725042 722743 716848 707710 695640 681973 668445 655596 643289 632375
61073 632375 623989 617472 610963 604009 597788 592891 588772 585260 582675 580555 578204 576371 576335 577443 577718
61058 577718 576931 576814 578134 579871 581666 584736 589756 595817 602111 608809 615782 622278 628386 635139 642767
61043 642767 650427 657835 665474 673102 679936 686458 694035 702570 710552 717663 725283 734033 742869 750939
61029 750939 758352 764727 769105 771831 774567 777866 780511 781579 781357 779942 776908 772676 768397 764260
61015 764260 759700 755225 751973 749589 746850 744241 743431 744246 744903 745361 747592 752215 757771 763791 771652
61000 771652 781758 792709 803956 816494 830337 844287 858870 876455 897508 919772 942031
60989 942031 965665 991419 1017828 1044041 1071119 1099127 1125923 1150291 1173447 1196149 1217101
60978 1217101 1235530 1252486 1268320 1281707 1292419 1302213 1311964 1320939 1329798 1340898 1354694 1369469
60966 1369469 1385650 1406358 1432454 1461404 1492605 1529208 1572700 1620488 1671316 1728404 1794477
60955 1794477 1868408 1949860 2042450 2148532 2264913 2387096 2513686 2643696 2774700 2907862
60945 2907862 3050269 3208439 3384170 3580343 3804646 4062242 4350248 4664990 5009678
60936 5009678 5390534 5813173 6290094 6844506 7498678 8266078 9164049 10225645 11489335
60927 11489335 12991316 14788025 16978790 19690425 23059806 27260536 32491549 38784391
60919 38784391 45695532 52224857 57209387 59962969 60616923 59897705 58648472 57566735
60911 57566735 57220414 58005172 59862636 62055667 63402281 62908686 60284457 55939167
60903 55939167 50583290 44853975 39196095 33902618 29149850 25004480 21453496 18451248
60895 18451248 15941362 13855716 12122558 10683076 9492128 8505791 7679272 6976366
60887 6976366 6371909 5845147 5378161 4960172 4585928 4249177 3942892 3664846 3416811
60878 3416811 3198143 3005112 2835762 2689621 2562236 2445031 2331487 2219798 2109702
60869 2109702 2001092 1896059 1798072 1708100 1624534 1546960 1476709 1413645 1355906 1303119 1256626
60858 1256626 1216237 1179878 1146742 1117643 1091886 1066978 1042067 1018816 998165 978972 960506
60847 960506 943616 928621 914521 901053 889219 879042 869033 858566 848515 838830 827787 814571
60835 814571 800515 786749 772662 757726 743010 729676 717555 706274 696326 687991 680573 673675
60823 673675 668015 664058 661050 658270 656136 655197 655103 655365 656152 657599 659271 661035 663555 667267 671730
60808 671730 676621 682487 689866 698482 707911 718206 729270 740473 751394 762137 772328 780708 786419
60795 786419 789856 791536 790975 787617 782198 776221 770424 764545 758225 751274 743324 734027 723668 713094
60781 713094 703008 693676 685135 677310 670082 663589 658294 654353 651004 646996 641702 635608 629722 624710
60767 624710 620616 617229 614497 612431 610733 608828 606476 604142 602484 601620 601229 601257 602147 604307 607643
60752 607643 611701 616055 620580 625497 631166 637678 644729 652001 659476 667137 674553 681058 686187 689624
60738 689624 690877 689413 685128 678419 669851 660020 649629 639294 629237 619364 609655 600240 591145
60725 591145 582264 573592 565275 557364 549639 541728 533332 524390 515082 505684 496418 487603 479747 473170
60711 473170 467494 461922 456112 450409 445102 439882 434321 428438 422530 416855 411784 407826 405031 402671
60697 402671 400010 397233 395200 394458 394879 396129 398073 400749 404134 407847 411039 412921 413716 414737 417161
60682 417161 420858 424724 427875 430240 432315 434799 438282 442800 447728 452413 456913 461905 467978 475171
60668 475171 483040 490946 498508 505962 513955 522811 532234 541785 551292 560648 569689 578563 587805 597664
60654 597664 607725 617546 627288 637327 647592 657729 667588 677092 685955 693990 701369 708008 713031
60641 713031 715474 715283 712935 708295 700718 690326 678410 666312 654539 643202 632672 623246 614548
60628 614548 605911 597296 589400 582739 576934 571147 565079 559308 554648 551419 549438 548443 548228 548524 549033
60613 549033 549584 550069 550418 550930 552380 555287 559148 563006 566806 571510 577732 584913 592210 599605 607707
60598 607707 616981 627730 640395 655213 671699 689011 706793 725332 744962 765634 787023 808763
60586 808763 830567 852251 873573 893977 912608 928625 941247 949550 952566 949812 941437 927785
60574 927785 909239 886630 861379 834879 808030 781575 756481 733635 713438 695884 680806
60563 680806 667840 656529 646690 638324 631028 623956 616717 609835 603961 599075 594917 591753 590099 589902
60549 589902 590587 591804 593665 596270 599407 602768 606190 609681 613333 617089 620504 622991 624501 625720
60535 625720 627334 629294 631115 632758 634930 638560 644125 651467 660188 670261 682207 696494 713005
60522 713005 731438 752107 775816 802980 833497 867648 906496 951152 1002177 1059988 1125428
60511 1125428 1199629 1283818 1379560 1488650 1612189 1749623 1898315 2053214 2206731 2349933
60501 2349933 2474878 2576037 2649957 2694980 2712419 2707481 2687843 2660682 2630597 2599220 2565670
60490 2565670 2527409 2481569 2426201 2360868 2286823 2207059 2125699 2046686 1973001 1907104 1851494
60479 1851494 1808313 1778665 1762848 1761097 1773889 1801835 1845661 1906093 1983264 2076006 2181348
60468 2181348 2294085 2406730 2510722 2598459 2664522 2705733 2721480 2714779 2692364 2662845 2634625
60457 2634625 2615169 2610816 2626043 2663115 2723171 2807574 2917979 3055842 3222851 3421961 3657740
60446 3657740 3935981 4263329 4646830 5093230 5608687 6199045 6869192 7620243 8445212
60437 8445212 9324653 10223507 11091254 11867605 12492580 12916013 13103062 13037427 12724635 12193350
60427 12193350 11490967 10674057 9798423 8912232 8052385 7243631 6500207 5828812 5231008
60418 5231008 4704509 4244309 3843984 3496633 3195359 2933636 2705663 2506527 2332410
60409 2332410 2180647 2049062 1934960 1835156 1747214 1670073 1603130 1545281 1495199 1451874 1414263
60398 1414263 1380960 1350769 1323036 1296942 1271109 1244608 1217769 1191227 1164678 1137371 1109347
60387 1109347 1081387 1054076 1027735 1002861 979742 957879 936591 916010 896768 878989 862340
60376 862340 846818 832684 819764 807594 796175 785929 777038 769386 762978 757831 753683 750353 748067
60363 748067 746932 746479 746401 747235 749483 752441 754836 756361 757692 759226 760764 762386 764670 767991 772272
60348 772272 777521 783921 791487 800261 810834 824085 840409 859572 880995 903587 925630 945555
60336 945555 962723 976989 988025 995802 1001346 1006149 1011094 1016693 1023958 1034110 1047668 1064663 1085355
60323 1085355 1109687 1136211 1162593 1187056 1208465 1225336 1235933 1239351 1235549 1224585 1206971 1184675
60311 1184675 1160371 1135450 1109762 1083395 1057538 1033300 1010772 989669 970008 951797 934799
60300 934799 918914 904105 889850 875450 861041 847594 835876 826206 819100 815084 813783 814302 816791
60287 816791 822548 832214 844844 859042 873970 888739 901867 911994 918360 920129 916221 906614 893059
60274 893059 877682 861329 843957 826175 809565 795639 785018 777505 772495 769428 768114 768674 771174
60261 771174 775567 781933 790383 800677 812369 825366 839960 856327 874479 894685 917377 942618
60249 942618 970237 1000646 1034975 1074170 1118279 1166617 1218260 1272410 1328662 1386778 1445861
60238 1445861 1504035 1559530 1611852 1661271 1707532 1749794 1787431 1819930 1846362 1866129 1880073
60227 1880073 1889565 1894500 1893514 1886347 1874560 1859498 1840952 1818614 1793723 1768352 1743869 1720969
60215 1720969 1700609 1684079 1672474 1666641 1667313 1674873 1689334 1710841 1739792 1776259 1819790 1869994
60203 1869994 1926666 1989029 2055304 2123202 2190353 2254210 2312319 2363028 2405491 2439024 2463131
60192 2463131 2478078 2484411 2481723 2468973 2446322 2415645 2378831 2336637 2289761 2239957 2189376 2139764
60180 2139764 2093032 2051608 2017133 1989434 1967787 1952697 1945530 1946822 1955962 1972412 1996399 2028376
60168 2028376 2068311 2115353 2167712 2222989 2279065 2334632 2388742 2440304 2488396 2532724 2573374
60157 2573374 2610549 2644936 2678021 2711549 2746917 2785394 2828486 2877346 2931691 2989480 3047659
60146 3047659 3103344 3154632 3200584 3240575 3274249 3302823 3330213 3362007 3403143 3457245 3527859
60135 3527859 3618731 3731969 3866582 4019369 4186414 4363165 4544104 4723672 4897511 5062283
60125 5062283 5214827 5352415 5473684 5578545 5667049 5738664 5792467 5827541 5843189 5839037 5814863
60114 5814863 5770101 5703700 5614753 5503313 5370739 5219747 5054328 4879338 4699913 4521265
60104 4521265 4348642 4186739 4038919 3907430 3794398 3701968 3631318 3582040 3552646 3541189
60094 3541189 3545435 3563297 3593388 3634626 3685136 3742356 3804384 3870182 3937865 4003609 4062976
60083 4062976 4112864 4151656 4178135 4191140 4190093 4175276 4147700 4109005 4061067 4005204 3941800
60072 3941800 3870926 3793093 3709331 3621011 3529913 3438113 3347525 3259765 3176467 3099290 3029434
60061 3029434 2967517 2913988 2869294 2833666 2807288 2790785 2785101 2790961 2809023 2840387 2886174 2946553
60049 2946553 3020869 3108658 3209660 3322744 3445531 3574880 3706690 3835351 3954743 4060251
60039 4060251 4148930 4217885 4264092 4286370 4286229 4266058 4227536 4172292 4102726 4021266 3929862 3831036
60027 3831036 3728436 3625470 3524228 3426329 3333644 3247226 3166501 3090525 3019249 2952776 2890544
60016 2890544 2832506 2780324 2736194 2701043 2674868 2658075 2651352 2654928 2669147 2695285 2734490 2786136
60004 2786136 2848131 2918359 2994724 3074143 3152738 3227079 3294612 3353157 3400886 3436663 3459803
59993 3459803 3469671 3465917 3448612 3417734 3373259 3316484 3250571 3179024 3104307 3028658 2955289 2887533
59981 2887533 2827292 2775282 2732228 2698671 2674182 2657938 2649781 2649729 2656980 2670565 2690608 2717764
59969 2717764 2751737 2791498 2836557 2886786 2941144 2997864 3055815 3114566 3173228 3230476 3285764
59958 3285764 3339425 3391597 3442191 3492053 3542948 3595989 3650899 3707075 3764386 3822428 3879565
59947 3879565 3933232 3981087 4022009 4056543 4086558 4114359 4142387 4173962 4213670 4266316 4335704
59936 4335704 4424729 4535680 4669279 4823660 4995175 5179740 5372268 5565011 5747679 5909352
59926 5909352 6039716 6129166 6169812 6157669 6093693 5982569 5830905 5646371 5437455 5213165
59916 5213165 4982496 4753544 4532361 4322669 4126950 3947474 3785984 3643138 3519122
59907 3519122 3414405 3329074 3261938 3211292 3176429 3157629 3155056 3168573 3198296 3244231 3305402
59896 3305402 3380151 3466972 3563954 3667543 3772925 3875599 3971516 4055697 4121971 4164639 4179850
59885 4179850 4165476 4120731 4046527 3945755 3822915 3683583 3533713 3378517 3221704 3066020
59875 3066020 2914173 2768614 2630786 2501453 2381609 2272319 2173865 2085839 2007966 1940136
59865 1940136 1881846 1832391 1791395 1758361 1731999 1710890 1694537 1682797 1674468 1667488 1660458 1653065
59853 1653065 1645217 1636881 1628783 1622133 1617516 1614961 1615078 1619049 1627292 1639006 1653129 1668766 1684439
59840 1684439 1697762 1706231 1707899 1701446 1686491 1663967 1635483 1602286 1565400 1526446 1487344 1449268
59828 1449268 1412831 1379084 1349182 1323119 1299979 1279565 1262685 1249722 1240143 1233722 1231056 1232419
59816 1232419 1237208 1245102 1256894 1273521 1294870 1320018 1348055 1378273 1410015 1442639 1475194 1506120
59804 1506120 1533829 1557688 1577849 1594153 1605929 1612878 1615386 1614084 1610031 1605385 1602731 1603329 1606784
59791 1606784 1612713 1621876 1635495 1654389 1679257 1711022 1750389 1797698 1853678 1919827 1997738 2088625
59779 2088625 2193932 2315929 2457376 2620729 2807509 3017386 3246778 3487517 3726026
59770 3726026 3943456 4118006 4230112 4268407 4232988 4134508 3990329 3819589 3638949 3460780
59760 3460780 3293705 3142983 3009436 2889521 2778770 2675709 2581883 2498881 2427047 2366764
59750 2366764 2319023 2284118 2261088 2248870 2246908 2254374 2270005 2293246 2324661 2364879 2414002 2472165
59738 2472165 2539714 2616594 2702548 2798113 2904487 3022241 3151206 3291798 3445475 3613808
59728 3613808 3798165 4000382 4222393 4464782 4726624 5006801 5304024 5615106 5934395
59719 5934395 6255310 6571360 6875528 7160574 7421411 7656924 7869376 8063238 8245101
59710 8245101 8423388 8606811 8802974 9018038 9256166 9518436 9802832 10105422 10420500
59701 10420500 10739410 11050530 11341200 11599199 11812992 11972841 12073190 12113475 12096486 12027239
59691 12027239 11913848 11767697 11601222 11425839 11252029 11089787 10947713 10832418 10749441
59682 10749441 10703862 10699507 10738861 10824651 10960555 11149637 11393200 11691958 12046924 12457775
59672 12457775 12920797 13428813 13971349 14532908 15091191 15618100 16082697 16454021 16704059
59663 16704059 16811704 16766048 16567356 16226653 15764957 15210795 14595520 13949104 13298522
59654 13298522 12667066 12072862 11528010 11039533 10609945 10235704 9905811 9603237 9308145
59645 9308145 9001007 8666221 8296384 7893995 7468453 7031414 6594560 6169092 5764314
59636 5764314 5386031 5036957 4718225 4429752 4170025 3936942 3728719 3543306 3377694
59627 3377694 3229027 3095903 2977576 2872481 2778720 2695484 2622730 2559794 2505486 2459237
59617 2459237 2420874 2389442 2363361 2341661 2323947 2309206 2295555 2281167 2264652 2244720 2220407
59606 2220407 2191574 2158393 2120562 2077939 2031755 1984196 1936739 1889726 1843578 1799491 1758668
59595 1758668 1721475 1687585 1656476 1627684 1601028 1576817 1555660 1538096 1524429 1514661 1508325 1504690
59583 1504690 1503329 1504215 1507169 1511822 1518310 1527290 1538782 1551558 1564102 1575676 1586077 1595113 1602913
59570 1602913 1610227 1617874 1626372 1636465 1649289 1665428 1684448 1705878 1730031 1757451 1788434 1823687
59558 1823687 1864560 1911835 1965105 2024111 2089825 2163377 2244818 2334012 2431847 2539294 2655850
59547 2655850 2780127 2911528 3050085 3194940 3344070 3495212 3646022 3793625 3935181
59538 3935181 4068819 4193284 4307184 4409712 4501763 4585052 4660317 4727791 4789426 4848936
59528 4848936 4908425 4965509 5014770 5052404 5079744 5102817 5128840 5162963 5207620 5263491 5329515
59517 5329515 5401704 5473175 5536303 5584613 5612624 5615167 5587942 5528372 5435429 5309345 5152273
59506 5152273 4968652 4764161 4544597 4316029 4085013 3857556 3638093 3429832 3235407
59497 3235407 3056556 2893882 2747566 2617634 2503071 2401726 2311975 2233637 2166526 2109260
59487 2109260 2060548 2020644 1990183 1968381 1953732 1945842 1945180 1951508 1963933 1982244 2007002 2038576
59475 2038576 2077158 2123385 2177896 2240610 2311496 2391688 2482720 2584884 2697233 2818702 2948078
59464 2948078 3083135 3220838 3358095 3491337 3615621 3725142 3814569 3879467 3916297 3923201
59454 3923201 3900439 3849357 3771631 3670403 3551043 3419238 3278835 3132727 2984941 2840048
59444 2840048 2700823 2568071 2442461 2325054 2216271 2116011 2024774 1943245 1870743 1805429
59434 1805429 1746108 1692700 1645135 1603112 1566831 1536536 1511306 1489566 1470776 1455383 1443290
59423 1443290 1433803 1427150 1424517 1426258 1431238 1438211 1446728 1456614 1467719 1480375 1494978 1511055 1527888
59410 1527888 1546091 1567270 1592139 1620548 1653692 1694301 1743186 1796278 1846306 1887621 1919468
59399 1919468 1945533 1971009 1999816 2033921 2074773 2124890 2187696 2265910 2359775 2465860 2577516
59388 2577516 2688322 2796966 2908654 3030999 3169139 3325435 3502239 3702563 3928168
59379 3928168 4178822 4453679 4751850 5071139 5406959 5752502 6099259 6437984 6760764
59370 6760764 7062587 7340575 7592496 7817233 8016131 8192341 8348828 8488014 8612616
59361 8612616 8725046 8825782 8913526 8986764 9043974 9082617 9099424 9091888 9058845 9000458 8919254
59350 8919254 8820613 8710458 8592491 8468738 8341594 8212854 8080861 7940993 7789340 7624217
59340 7624217 7444313 7247980 7035287 6809067 6573275 6331709 6088508 5847980 5613207
59331 5613207 5386136 5169267 4965519 4776100 4600370 4438350 4291611 4160935 4044828
59322 4044828 3941078 3848294 3765301 3690769 3624460 3567381 3519766 3480163 3447224 3421023 3401796
59311 3401796 3388778 3381283 3379812 3385134 3397236 3415811 3440624 3470651 3503978 3539270 3576339 3614604
59299 3614604 3652098 3686644 3716983 3742153 3760869 3772249 3776097 3771961 3759025 3737525 3709046 3674693
59287 3674693 3634154 3587374 3536066 3482834 3429802 3378956 3332754 3293363 3261863 3238824 3225024
59276 3225024 3221090 3227093 3242812 3267592 3299585 3335943 3373845 3410472 3442049 3464309 3474297 3470533
59264 3470533 3451387 3414890 3360766 3291362 3210034 3119803 3023711 2924870 2825512 2727344 2633091
59253 2633091 2546005 2467310 2395975 2331691 2276145 2230349 2192686 2161077 2135547 2117201 2106055
59242 2106055 2101462 2103658 2113309 2130339 2154498 2186460 2227246 2277230 2336660 2406479 2487807 2581435
59230 2581435 2688580 2811281 2951240 3109145 3285763 3482559 3700446 3938971 4197399
59221 4197399 4475041 4769097 5073218 5379418 5680182 5966939 6226942 6443524 6600436
59212 6600436 6686824 6700048 6645560 6533959 6377141 6186655 5974549 5753446 5534326 5324840
59202 5324840 5130154 4954199 4799235 4665377 4551723 4457382 4380924 4319929 4271904 4234621
59192 4234621 4204931 4178506 4151746 4123001 4091120 4054085 4010146 3959257 3902238 3839395 3771008
59181 3771008 3698311 3622957 3546123 3468845 3392342 3317290 3243778 3172766 3106513 3046722 2993225
59170 2993225 2945176 2902309 2864240 2830002 2799389 2773549 2753059 2736601 2722746 2711904 2705193
59159 2705193 2702476 2702908 2706471 2713574 2723915 2737105 2753794 2775024 2801045 2831708 2867225 2907503
59147 2907503 2951477 2997979 3046412 3095755 3143933 3189082 3230343 3266516 3295179 3314361 3323939
59136 3323939 3324206 3314326 3293505 3262645 3223500 3177277 3125414 3070572 3015324 2960711 2907501 2857796
59124 2857796 2813867 2776310 2744918 2720557 2704636 2697507 2698889 2709083 2728186 2754800 2787070 2824534
59112 2824534 2867681 2916431 2970451 3030183 3095976 3166614 3239958 3314329 3387989 3458116 3521756
59101 3521756 3576987 3621608 3651449 3661810 3650294 3616977 3562502 3487605 3394107 3284834 3162706
59090 3162706 3030854 2892916 2751907 2609319 2466454 2325854 2190235 2061015 1939249
59081 1939249 1826985 1725828 1634919 1552107 1476579 1408722 1348076 1293318 1243936 1200156 1161427
59070 1161427 1126546 1095099 1067356 1042914 1020810 1000692 982681 966401 951366 937911 926548
59059 926548 916911 908447 901489 896371 892070 886991 880528 872839 864007 854726 846786 841425 838001 835686
59045 835686 835373 838419 844702 853727 866379 883464 903481 924071 944748 965896 985980 1002597
59033 1002597 1016015 1029091 1043761 1060091 1078723 1101576 1129306 1160023 1191045 1220300 1245788
59022 1245788 1265531 1278687 1285414 1285454 1278240 1264510 1246515 1226535 1206421 1188302 1174208 1164909
59010 1164909 1160365 1161072 1167655 1179415 1194726 1212547 1232078 1251291 1267378 1278424 1283266 1280335
58998 1280335 1268456 1248574 1223085 1193753 1161718 1128848 1097163 1067269 1039090 1013625 992081
58987 992081 973833 957386 942988 932119 924720 919223 915220 913797 915192 918337 922896 929679 938876
58974 938876 949901 963097 979532 998906 1019624 1041068 1063777 1087281 1109928 1131201 1152110
58963 1152110 1172846 1192002 1208564 1222851 1235124 1245086 1253167 1260561 1267684 1274262 1281048 1289558 1299878
58950 1299878 1310664 1321608 1334027 1348730 1365206 1383345 1404140 1428253 1455570 1486510 1522154
58939 1522154 1562918 1608677 1660176 1718429 1782800 1851669 1924898 2003443 2086616 2172328 2260368
58928 2260368 2352970 2451688 2556311 2667638 2788808 2922860 3071039 3234449 3415286 3615399
58918 3615399 3835473 4076514 4340341 4627906 4938878 5273402 5631898 6012019 6407510
58909 6407510 6810735 7214134 7608112 7979492 8313428 8595675 8812839 8953323 9010378 8983594
58899 8983594 8876880 8696464 8451404 8153778 7816681 7452651 7074030 6692625 6317607
58890 6317607 5954896 5609059 5284120 4981950 4701859 4442788 4204383 3985290 3782503
58881 3782503 3593570 3417864 3254791 3102606 2960109 2827743 2705728 2592632 2487039
58872 2487039 2389242 2300091 2219402 2146537 2081264 2022903 1969680 1919889 1872855 1828257 1785647
58861 1785647 1745188 1707645 1673125 1640960 1611111 1584351 1560841 1540030 1522106 1507861 1496920
58850 1496920 1487950 1480921 1477289 1477577 1480821 1486821 1496783 1511121 1528703 1548923 1572531 1599778 1629873
58837 1629873 1662893 1700105 1741732 1786635 1834948 1888661 1948720 2013881 2083436 2158827 2241543
58826 2241543 2331738 2430014 2538266 2657550 2787292 2927713 3080816 3247952 3428960 3624968
58816 3624968 3839491 4075193 4331901 4609241 4908570 5230419 5572297 5930791 6303313
58807 6303313 6685341 7067777 7439034 7787886 8102379 8368159 8570867 8699840 8748688 8714602
58797 8714602 8599612 8411283 8160258 7857766 7516126 7149044 6768946 6384940 6004510
58788 6004510 5635217 5282906 4949973 4637268 4346259 4077802 3830592 3602802 3393852
58779 3393852 3203026 3028145 2867484 2721471 2590709 2473828 2368819 2274602 2189355 2109084
58769 2109084 2030159 1952111 1876316 1803449 1733950 1669309 1610752 1557941 1510629 1470071 1437067
58758 1437067 1410231 1388003 1370751 1359019 1351433 1346402 1344317 1346036 1350721 1357240 1366240 1378710 1393899
58745 1393899 1410703 1429693 1451676 1475431 1498759 1520311 1538527 1550404 1553603 1548642 1537230 1519969
58733 1519969 1497585 1472557 1447004 1420295 1390995 1359849 1328508 1296554 1262264 1225403 1187139
58722 1187139 1148055 1108243 1068422 1029239 990482 952523 917192 885609 856643 829121 803814
58711 803814 781538 761291 742333 726101 713809 704047 695161 688142 684571 683523 683243 684206 687632
58698 687632 692379 696214 698952 701716 704207 705314 705189 704353 702097 698239 694888 693744 693133 690433 685886
58683 685886 681114 675500 667404 657741 648989 641570 634445 628553 626391 628638 634042 642116 653133 665917
58669 665917 678160 688497 696191 699929 699457 697387 696769 697801 699217 701312 704500 706101 702012 691053
58655 691053 675132 656143 635567 616071 600227 588056 578326 571371 568104 567558 568292 571079 577271
58642 577271 585709 594268 603155 613581 624566 634463 644312 656061 668698 679945 690698 703878
58630 703878 719745 736402 754264 775898 801787 830302 861683 898227 940572 987532 1039589
58619 1039589 1098923 1166050 1239944 1321347 1412362 1512832 1620598 1735071 1856667 1982630
58609 1982630 2106971 2224486 2331232 2421308 2487520 2526020 2537120 2521626 2480263 2416909 2338330
58598 2338330 2249733 2153738 2053852 1955101 1860480 1770131 1684658 1605987 1534527 1468931 1409311
58587 1409311 1357596 1314282 1277998 1248518 1226852 1212047 1201247 1193263 1188814 1187134 1185980 1185286
58575 1185286 1187114 1191504 1195902 1199271 1203142 1208147 1213206 1218837 1227564 1240080 1254154 1267841 1280137
58562 1280137 1287840 1285585 1270391 1243316 1206152 1159904 1107174 1052426 998678 946710 897890 854450
58550 854450 816474 782033 750909 724823 703572 684517 666485 650580 636644 622652 608349
58539 608349 595824 585719 576521 568191 562675 559951 557343 553717 550694 548900 546763 543856 541681 540256
58525 540256 537705 534131 532053 532025 531661 529995 528929 529345 529606 529058 529260 530681 531795 532374 533941 536260
58509 536260 537252 537095 538290 541010 542711 543101 544904 548878 552816 556625 563452 574307 586429 598570
58495 598570 613136 631394 651362 672239 695921 721928 745593 763740 777856 789597 797690 801503
58483 801503 803052 802897 798281 787723 773340 756552 735956 711765 687852 666924 647875 630105
58471 630105 615836 605686 596644 587138 579634 575547 572153 567446 563587 562577 562835 563088 565312 570716
58457 570716 576878 581810 586862 592839 597509 599783 602085 605717 608233 608316 608815 611906 615716 618827 623607
58442 623607 631802 641313 650603 661893 676699 692655 707990 724484 742487 757664 766380 769871
58430 769871 769631 763542 750582 734755 720169 706392 692412 680602 672717 666401 659810 655357 654922
58417 654922 655885 656038 657835 663519 670590 676676 684399 696803 712218 728116 745667 765825 785175
58404 785175 800393 812764 823795 830656 830587 825551 818100 807085 792027 777003 765248 754396 741901
58391 741901 730463 723068 717411 710629 704885 702817 702013 699529 697422 698230 699434 697991 695859 695551 694917
58376 694917 692187 691316 696154 703803 709897 715851 724622 734006 740842 747504 757464 768601 777542 786474
58362 786474 798967 813158 825830 839134 856562 876354 895597 916626 942451 969950 994434
58351 994434 1016685 1038657 1056726 1066529 1070253 1071945 1070015 1061665 1050216 1040500 1031417 1020491 1011039
58338 1011039 1006950 1005056 1000705 996281 996180 998290 998872 1000940 1008895 1019648 1028094 1036645 1050155 1066218
58324 1066218 1080004 1094033 1113320 1135354 1154820 1173860 1197585 1223897 1248037 1272714 1303019
58313 1303019 1335480 1362903 1385914 1408919 1429077 1440634 1446203 1452265 1457464 1456842 1453571 1454540 1458149
58300 1458149 1458496 1457804 1462503 1470880 1477147 1483949 1498080 1517532 1535671 1554421 1579972 1609310 1634767
58287 1634767 1658422 1688147 1722996 1756578 1791132 1833684 1881875 1928553 1976808 2035063 2100760
58276 2100760 2164569 2227163 2295477 2365834 2427673 2480902 2532426 2578644 2609371 2626624 2641640
58265 2641640 2655724 2662204 2664597 2673875 2690006 2705212 2722938 2753876 2795636 2836655 2877884 2929848
58253 2929848 2990871 3050059 3109533 3181196 3263491 3344426 3425497 3518693 3621816 3721708 3820130
58242 3820130 3930756 4052353 4171698 4291269 4425971 4573909 4719709 4865589 5028638
58233 5028638 5208286 5388479 5571355 5775212 5999308 6225866 6457313 6714816 6999231
58224 6999231 7292040 7596226 7935686 8312320 8706215 9120575 9581777 10092444 10632096
58215 10632096 11207516 11852092 12571869 13346440 14187490 15138609 16212766 17393386 18703734
58206 18703734 20208042 21939062 23901066 26153996 28813716 31960444 35636630 39942202
58198 39942202 45028292 50992206 57909540 65996773 75621208 87165008 101082208 118130782
58190 118130782 139357459 165876548 198946642 239990531 289248285 343131295 393052606
58183 393052606 428338882 441737112 432837676 406774007 370315339 329099129 287153786
58176 287153786 247286050 211197873 179575817 152477191 129675461 110722406 94999732
58169 94999732 81925188 71067203 62047823 54478455 48054136 42601478 37976858 34005073
58161 34005073 30554274 27574785 25015754 22779996 20796240 19057521 17549762 16212115
58153 16212115 15001433 13927712 12991465 12149029 11371570 10677315 10073624 9525044 9008982
58144 9008982 8546675 8148705 7784147 7433530 7119535 6855351 6614042 6379073 6174891
58135 6174891 6016888 5879809 5746170 5638084 5570339 5519430 5470660 5449502 5474464 5525216
58125 5525216 5589917 5697495 5868299 6077186 6298789 6543386 6814827 7083689 7342182 7638854
58115 7638854 8020136 8486477 9044669 9747208 10634010 11694061 12937623 14448089 16311644
58106 16311644 18572263 21328724 24802055 29239430 34869573 42049758 51203202 62158626
58098 62158626 73419030 82419376 86909419 86247669 81438426 74132752 65721668 57126311
58090 57126311 48960575 41612110 35236325 29826248 25318626 21622225 18604771 16124859
58082 16124859 14078630 12394183 11001677 9838179 8867531 8067987 7406384 6842902 6353310
58073 6353310 5928295 5555125 5214633 4893262 4586107 4290417 4005965 3739607 3500557
58064 3500557 3291829 3111866 2960848 2837532 2731747 2628001 2517220 2400150 2280193
58055 2280193 2158895 2038747 1924524 1819419 1723044 1634532 1554633 1483540 1419496 1361194
58045 1361194 1309295 1264049 1223453 1185518 1150641 1119900 1092428 1066432 1041739 1019252 998680
58034 998680 978954 960327 943879 929134 914265 898569 882706 866552 849124 830889 813850
58023 813850 798756 784387 770225 757648 747636 739385 732111 726229 721800 717854 714327 712683 713500
58010 713500 715443 717766 721789 728542 736974 745899 755743 766780 777575 786853 795131 802781 808113 809128
57996 809128 805681 798380 786905 771101 752291 731958 710477 688500 667920 649959 633852 618823
57984 618823 605640 594675 584339 573213 562146 552529 544100 536195 529520 524845 521387 518212 515761
57971 515761 514427 513256 511663 510790 511419 512335 512483 512943 514914 517567 519964 523281 528839 535485 541137
57956 541137 545480 548955 550532 548777 543947 537015 527892 516598 504808 494191 484473 475064 467055
57943 467055 461480 457139 452500 448440 446748 447126 447967 448936 450464 451782 451845 451302 451325 451297 449680 446330 442048
57926 442048 436865 430757 425009 420937 418228 416362 416445 419728 425568 432828 441968 453726 467033 480360
57912 480360 493698 507102 518802 527244 533526 539249 543225 543003 538441 531064 521068 507834 492505
57899 492505 477183 462256 447155 432861 420903 410609 400209 390067 382008 376029 370571 365660
57887 365660 362885 362412 362782 363522 365293 367582 368931 369551 371214 374340 377483 379778 381748 383696 385413
57872 385413 387444 390599 394271 397247 399944 403714 408227 411755 413858 415582 417128 417571 416819 415681 413999
57857 413999 410775 406094 400979 395581 389556 383881 380059 377703 375177 372498 371386 372588 375406 379676
57843 379676 385834 393091 399996 406939 415753 426681 437968 448667 459555 471009 482136 492314
57831 492314 501583 509313 514472 517318 518867 518735 515670 510145 504066 497765 489673 479198 467639 455896
57817 455896 443618 431000 419186 408432 397999 388259 380757 375851 372490 370651 371679 375669 380788
57804 380788 385831 391233 396970 401671 404614 406553 407807 407484 405295 402203 398677 394270 389401 385417
57790 385417 382249 378203 372850 367928 364547 361694 358541 356054 355104 354949 354937 355904 358503 361581 363482
57775 363482 363736 362595 360304 357701 356127 355844 355854 355877 357049 360065 364300 369507 376695 386448 397944
57760 397944 410471 424361 439647 455447 471544 488919 507698 526017 541824 554393 563278 567455
57748 567455 566551 561553 553430 542408 529350 516178 503961 492030 479908 468599 459000 450597 442781
57735 442781 436001 430562 425624 420539 415988 412856 411159 410905 412672 416433 421075 425856 431129 436998
57721 436998 442742 448247 454423 461410 467950 473281 478031 482365 485128 485926 486315 487767 490125 493184 497969
57706 497969 504995 512925 520535 528589 538315 549418 561211 574478 590624 609980 632281 657858
57694 657858 687124 719860 756047 796200 839875 885199 931090 978680 1029566 1084244 1143496
57683 1143496 1209600 1284501 1368172 1460286 1561971 1673963 1794055 1917914 2041141 2158827
57673 2158827 2264444 2351485 2415981 2456393 2472574 2466865 2445500 2417009 2389470 2370321 2367663
57662 2367663 2389951 2444101 2532787 2649372 2772277 2867153 2900979 2858309 2745756 2583391
57652 2583391 2393706 2195755 2003433 1825279 1665745 1527006 1409362 1310958 1228957 1161297
57642 1161297 1106564 1062832 1027971 1000773 980563 966154 956429 951483 951956 957655 967946 982875
57630 982875 1002658 1026631 1054017 1085316 1121832 1164509 1214324 1272817 1340705 1416633 1498721
57619 1498721 1586715 1681158 1781195 1884531 1988474 2089008 2179459 2252262 2302202 2326885
57609 2326885 2325089 2296818 2244760 2173759 2088649 1993731 1893592 1792505 1692995 1596416 1504500
57598 1504500 1418860 1339495 1265631 1197659 1136502 1081465 1030753 983890 941737 904235 870180
57587 870180 839260 812246 788928 767690 747555 728952 712197 696871 682977 671080 660849
57576 660849 650948 640829 631335 623212 616325 610529 605947 602100 598051 593676 589666 586249 583122 580584
57562 580584 579276 578859 578435 578341 579876 583110 586613 589648 592969 597066 601207 604849 608657 613529 619717
57547 619717 627254 636114 645733 655574 666387 679606 695381 712573 730850 751256 774445 799879
57535 799879 827286 857454 891091 928219 969176 1014921 1065873 1121676 1182432 1248846 1320835
57524 1320835 1397400 1478111 1563004 1650280 1735563 1814073 1882190 1936358 1972296 1986731 1979088
57513 1979088 1950833 1904326 1843048 1771660 1694548 1614730 1534527 1456253 1381581 1311164 1245554
57502 1245554 1185673 1131917 1083734 1040613 1002600 969450 940365 915051 894025 877403 864360
57491 864360 854224 847002 842426 839630 838239 838603 840476 842736 845025 848456 854082 861751 871049 882182
57477 882182 895265 910041 926922 947148 971220 998506 1029071 1064388 1105300 1150735 1199771
57466 1199771 1253721 1314769 1383317 1457917 1536973 1619081 1702096 1782900 1857763 1922224 1971260
57455 1971260 2000699 2008508 1994623 1960429 1908946 1844601 1771840 1694161 1614527 1535662 1459461
57444 1459461 1387008 1319672 1259092 1205598 1157839 1114693 1076384 1043089 1013795 987571 964774
57433 964774 945855 929994 916060 903976 894004 885550 877866 871183 866012 862041 858764 856504 855707
57420 855707 855878 856225 856772 857878 859327 860873 862965 865977 869394 872709 876390 880966 886004 891075 896910
57405 896910 904275 912435 920107 927451 935693 945125 954797 964013 972960 981955 991170 1001055 1012058 1023930
57391 1023930 1036042 1048283 1060945 1073964 1086982 1099983 1113192 1126508 1139514 1151859 1163279
57380 1163279 1173660 1183394 1193152 1203000 1212385 1221267 1230382 1240004 1249445 1258313 1267181 1276335 1284961 1292333
57366 1292333 1298757 1304578 1309445 1313444 1317685 1322719 1327676 1332126 1337367 1344398 1351917 1358157 1363633 1370199
57352 1370199 1378268 1386917 1396036 1406313 1417439 1428325 1438982 1450402 1462710 1475034 1487165 1499754
57340 1499754 1512936 1526268 1539996 1554848 1570627 1586472 1602508 1619760 1638337 1657135 1675419
57329 1675419 1693335 1710813 1727391 1743380 1759871 1777361 1795448 1813965 1833192 1852875 1872318
57318 1872318 1891576 1911390 1931874 1952553 1973803 1996809 2021724 2047097 2071581 2095196 2118587
57307 2118587 2142095 2165945 2190369 2215127 2239646 2263938 2288596 2313745 2338764 2363210 2387246
57296 2387246 2411070 2434736 2458585 2483031 2507845 2532424 2556738 2581280 2606222 2631429 2657110
57285 2657110 2683517 2710256 2736933 2764252 2793228 2823398 2853030 2881145 2908161 2934475 2959668
57274 2959668 2983340 3005589 3026344 3045156 3061906 3076894 3090098 3101244 3110717 3119524 3128362 3137508
57262 3137508 3147485 3158833 3171337 3184547 3198881 3215058 3232612 3250302 3268013 3286935 3307692
57251 3307692 3329587 3351929 3374888 3398807 3423739 3449849 3477162 3504889 3532169 3559538 3588366
57240 3588366 3618697 3649047 3678576 3708043 3738250 3768902 3799469 3829959 3860314 3890134 3919434
57229 3919434 3948599 3977335 4004794 4031049 4057250 4084030 4110984 4138071 4166129 4195521 4225621
57218 4225621 4256262 4288474 4323094 4359698 4397507 4436373 4476311 4517022 4558311 4600058 4641487
57207 4641487 4681540 4720258 4758605 4796697 4833534 4868838 4903664 4938663 4973216 5006960 5040735
57196 5040735 5075124 5109386 5142649 5174976 5206408 5236100 5263338 5288347 5311322 5331749 5349487
57185 5349487 5365473 5380581 5394858 5408659 5423307 5439648 5456937 5474010 5490615 5506825 5522301
57174 5522301 5537116 5552329 5568810 5586366 5604692 5624111 5644563 5665002 5684678 5703903 5722680
57163 5722680 5739852 5754701 5768168 5781304 5793571 5803967 5812837 5821257 5829403 5836737 5843066 5848282
57151 5848282 5851812 5853293 5853018 5850814 5845459 5836201 5823781 5808956 5791293 5770593 5748152 5725101 5700879
57138 5700879 5675110 5649814 5627692 5609095 5592694 5578439 5567703 5560980 5557598 5557561 5561694 5569950 5581357
57125 5581357 5595559 5612710 5631858 5651246 5670280 5689609 5709402 5729414 5750904 5776703 5809041
57114 5809041 5848959 5898064 5959040 6034020 6124236 6231816 6360267 6512745 6691792 6901762
57104 6901762 7150208 7446666 7802415 8232883 8758921 9404978 10198089 11169891 12357586
57095 12357586 13801403 15543364 17630700 20118063 23062361 26513853 30509800 35068322
57087 35068322 40178546 45792654 51825600 58153821 64604953 70957248 76976308 82473750
57079 82473750 87326917 91428414 94619276 96689237 97454086 96835249 94876016 91706528
57071 91706528 87508209 82495957 76901122 70948373 64840412 58756053 52849387 47243161
57063 47243161 42024625 37248915 32943194 29107865 25721363 22750952 20161022 17913747
57055 17913747 15968594 14286059 12830864 11570491 10474022 9515256 8674865 7937112
57047 7937112 7286212 6707721 6191062 5728084 5310660 4931849 4587614 4274934 3989522
57038 3989522 3727356 3486848 3267215 3066046 2880658 2710424 2555394 2413742 2282801
57029 2282801 2161521 2049724 1946047 1848953 1758781 1676474 1601101 1530784 1465168 1404674 1348240
57018 1348240 1294208 1242823 1195468 1151950 1110858 1072059 1036471 1003735 972426 942385 914755
57007 914755 889928 867367 847072 829173 812518 795696 779105 764102 750706 738127 726771
56996 726771 717415 709112 700414 692004 685529 680535 675449 671203 670727 675025 682901 694638 712657 737822
56982 737822 767638 798223 825315 843626 849094 842963 830886 817391 803921 792232 785700 786255
56970 786255 793524 808030 831611 863634 900781 942110 990617 1048625 1116222 1196007 1294439 1416160
56958 1416160 1562297 1736984 1949158 2203876 2499062 2837257 3235097 3717009 4311064
56949 4311064 5059522 6009709 7150500 8340464 9326397 9872735 9893634 9469996 8759041
56940 8759041 7901920 6997242 6115327 5305369 4591895 3979971 3467535 3049842 2716948
56931 2716948 2455656 2254570 2102735 1984363 1880597 1777922 1672086 1564099 1455818
56922 1455818 1349433 1247221 1150027 1057804 971916 894578 825796 763424 706739 657321 615607
56911 615607 579245 546139 516760 492011 470812 451438 433599 417722 403599 391160 381166 373807
56899 373807 367888 362646 358989 357706 357955 358955 361675 367281 375286 384947 397272 413936 435435 461887
56885 461887 494009 530568 565625 590958 601652 598185 583931 562653 537966 512804 488691 466461
56873 466461 447480 433037 423047 416715 414114 415924 422228 433089 449859 474514 508147 551568
56861 551568 606888 676691 761010 854910 947703 1024110 1069289 1076550 1050763 1003165 943715 879191
56849 879191 815656 758489 710089 670482 640249 620549 610736 608886 614867 630472 656644 693324
56837 693324 742249 807362 892255 999356 1130227 1281155 1435977 1567008 1647642 1665599
56827 1665599 1625436 1541893 1432403 1312449 1193052 1080593 978797 890199 815782 754968
56817 754968 707133 672338 650104 638792 637102 645459 665455 698928 748132 815683 902901 1006872
56805 1006872 1117413 1216250 1281980 1300352 1271691 1207919 1122955 1027061 928030 832871 746478
56794 746478 670970 607494 556890 518067 488110 465149 449497 441445 440083 445172 458133 480245
56782 480245 511750 553243 605070 663339 718118 757542 773481 763713 731393 683904 630061 575982
56770 575982 523740 474165 429091 390036 356589 327588 302661 281635 263836 248951 237237
56759 237237 228077 219826 211949 205699 201763 198852 195568 191987 188415 184273 179372 174687 170737 166697
56745 166697 162143 158037 154930 151891 148364 145383 143675 142228 140093 137971 136602 135127 132554 129542
56731 129542 127258 125693 124353 123372 122726 121630 119893 118632 118550 118834 118705 118565 118588 117857 116111 114697 114527
56714 114527 114693 114380 114411 115478 116562 116766 117127 118887 121365 123202 124435 125706 126727 127141 127779 129437
56698 129437 131451 132867 133931 135176 136160 136387 136264 136039 135142 133609 132595 132292 131114 128296 125517 124395
56682 124395 124126 123276 122219 122040 122602 123513 125468 128806 132213 134629 136930 139945 142432 143007 142524 142482
56666 142482 142512 141565 140267 139881 140069 139744 139036 138429 137126 134273 130813 128193 126309 124480 123245 123251 123608
56649 123608 123237 122685 122781 122856 122218 121954 123119 124521 124553 123936 124344 125563 126412 127337 129601 132785 135511 137863
56631 137863 140834 144144 146828 149212 152200 155306 157463 158967 160740 162549 163810 165124 167139 169057
56617 169057 170178 171574 174182 176686 177568 177771 178898 180228 180146 179163 178721 178214 176162 173269 171398 170384
56601 170384 168730 166586 165162 164055 162155 160401 160559 161888 162127 161264 161234 162302 162866 162625 162861 163667
56585 163667 163844 163634 164710 167367 170253 172860 175719 178278 179195 178836 178992 180127 181178 181956 183300 185072
56569 185072 186404 187755 190403 194118 197660 201155 205602 210462 214286 217323 220962 225067 228512 231875
56555 231875 236828 243280 249887 256914 265664 275505 284594 293320 303855 316365 328769 340287 352129
56542 352129 364570 376427 387700 399762 412603 424617 435279 445260 453907 459640 462993 466187
56530 466187 469455 470801 469666 467678 465326 461047 454256 446352 438008 428289 417111 405798 394540
56517 394540 381987 368065 354591 342449 330688 318956 308248 298644 288781 278200 267970 258586
56505 258586 249570 241327 234977 230153 225374 220565 216727 213359 209104 204742 202440 202039 201313 199989 200079
56490 200079 201963 203639 204317 205296 206627 206485 204710 203609 204203 204887 204758 205094 206409 207185 206748 206531 207354
56473 207354 208175 208524 209502 211442 213283 214980 217759 221364 223944 225307 227279 230300 232866 234989 238698
56458 238698 244206 249100 252503 256640 262891 269594 275291 281090 288255 296177 304092 312191 319939 326044
56444 326044 331031 337071 344466 351274 357063 363682 371451 378219 383366 389177 396876 404795 411911 419729
56430 419729 428959 437722 444779 451373 458146 463377 465999 467396 468531 468278 466104 463362 460355 455137
56416 455137 446812 436987 426519 414031 399294 384912 372892 362386 352291 343108 334823 326100
56404 326100 317002 309474 303890 298345 292438 288110 285500 281897 276305 271136 267656 263755 258137 252755
56390 252755 249017 245510 241615 239370 239395 238859 235952 232642 230597 228252 224490 221380 220559 220567 220404 221925
56374 221925 225886 229423 230387 230628 232072 233332 233213 233835 236863 240103 241171 241288 242276 243134 242803 242964
56358 242964 244752 245949 244821 243504 244267 245615 245567 245579 247631 250378 251780 252721 254596 256109 255878 255471
56342 255471 256610 258106 258645 259645 262222 264470 264945 265727 268786 272505 275101 278076 282825 287294 289701
56327 289701 292186 296896 301800 304389 306282 310048 314663 318309 322621 329770 338119 345034 351337 358886
56313 358886 366502 372494 378482 386529 395127 402147 408980 417593 426244 432520 437978 445431 454131 461850
56299 461850 469091 476963 483458 486322 487225 488861 490389 489820 488207 487231 485395 481007 476169 473371 470808
56284 470808 465595 458952 453730 449539 444814 440875 439283 438008 434972 432508 433522 436145 437128 437526 439843
56269 439843 442582 443163 443493 446974 452408 456403 459463 464253 470242 475562 481832 491557 503097 513754
56255 513754 525412 541413 560260 578352 596707 618948 644661 670764 697579 727615 760157
56244 760157 792926 827202 865373 905228 942510 977329 1012155 1045519 1073773 1097192 1118131
56233 1118131 1134953 1144167 1146980 1147493 1145938 1139868 1130510 1121681 1113840 1105248 1097380 1093044 1090827 1087596
56219 1087596 1084754 1085708 1089016 1090566 1090690 1092380 1094207 1091948 1085730 1078680 1070004 1056361 1038679 1020616
56205 1020616 1001708 979163 954998 934028 915921 896503 875724 857056 840221 822122 804023
56194 804023 790158 779984 769247 757900 749451 743294 735441 726227 719610 715373 709661 702736 698474
56181 698474 696644 693343 688704 686483 686460 684965 682531 683251 686937 689673 691617 696377 703172 707657 710011
56166 710011 714070 718990 720141 717858 716869 717441 715622 711809 710164 709666 704837 695557 687329 681686 675213
56151 675213 668123 664638 664495 663069 660204 659947 661478 659770 655476 654615 657977 660466 661348 665315 672791
56136 672791 679272 685067 695543 710703 724680 736682 752181 772064 791069 808396 829352 854778
56124 854778 879310 901963 928147 959382 991437 1024413 1064164 1111847 1162702 1217136 1282461
56113 1282461 1361832 1452474 1556893 1684651 1840555 2021621 2227131 2459478 2711957 2967000
56103 2967000 3209659 3432929 3629393 3791324 3922664 4038600 4148974 4251955 4344814 4427342
56093 4427342 4491928 4524631 4521697 4493927 4451727 4397972 4337548 4278367 4217029 4136440 4023447
56082 4023447 3877911 3702014 3495449 3266487 3033720 2810258 2597642 2399043 2224343
56073 2224343 2076942 1949374 1837655 1746587 1675977 1616004 1562055 1520073 1491558 1467715 1444326
56062 1444326 1427619 1419302 1410847 1399090 1392241 1393639 1394901 1392203 1393708 1403406 1413261 1419115 1428544
56049 1428544 1445034 1460258 1470312 1483677 1504779 1525685 1542383 1562877 1590679 1617089 1638512
56038 1638512 1664296 1698521 1731544 1758644 1788937 1826496 1861276 1888628 1918673 1956146 1990657
56027 1990657 2017778 2049532 2092300 2134836 2170350 2209732 2260155 2311668 2358234 2410590 2474323
56016 2474323 2537007 2591506 2650130 2721025 2793155 2859842 2933824 3022932 3114487 3200263 3292603
56005 3292603 3398736 3504489 3601538 3705032 3825299 3948519 4065029 4189412 4331915 4478125
55995 4478125 4618729 4770548 4945428 5127994 5307786 5502447 5724245 5955718 6184778
55986 6184778 6430817 6708662 7001324 7297357 7618938 7982188 8367664 8762757 9193600
55977 9193600 9680433 10203358 10749477 11349974 12031054 12775064 13572769 14464489 15483920
55968 15483920 16614953 17854447 19261642 20892979 22751881 24864048 27336250 30276159
55960 30276159 33728030 37757692 42515803 48138771 54692110 62317723 71341510 82150643
55952 82150643 95130831 110884105 130362542 154663402 184965397 222769435 269258105
55945 269258105 322866771 376922721 420762203 444796255 445497127 426074200 393116416
55938 393116416 352975303 310405365 268777781 230318676 196144840 166552386 141434968
55931 141434968 120446778 103022497 88540113 76504412 66519041 58183008 51136881
55924 51136881 45153046 40081092 35749853 31998547 28746992 25950922 23526311 21383284
55916 21383284 19490972 17842290 16390759 15080800 13904466 12871069 11952149 11108388
55908 11108388 10340250 9661883 9052843 8482385 7954896 7486572 7061987 6656182 6276080
55899 6276080 5939177 5633389 5336919 5056700 4809558 4585221 4364182 4153338 3969041
55890 3969041 3802683 3636735 3477795 3341110 3218525 3093392 2971904 2868982 2777753 2682919
55880 2682919 2590441 2514831 2450041 2381189 2312702 2257390 2209517 2155674 2101345 2060527 2029358
55869 2029358 1995265 1962283 1942731 1933243 1923203 1918166 1931712 1962294 2000219 2048949 2117316 2198162
55857 2198162 2275524 2345101 2407537 2450382 2458335 2434581 2392225 2332029 2248268 2148849 2049042
55846 2049042 1951238 1849993 1750746 1664489 1589810 1518699 1454310 1404837 1365608 1325376 1285045
55835 1285045 1252567 1224815 1192179 1156144 1124928 1096459 1062740 1026570 997126 973185 947038
55824 947038 920626 901448 886662 867522 845837 830148 819341 805839 791415 784051 782355 778628
55812 778628 774444 777995 788847 800331 814422 839473 875711 917056 963801 1017999 1068792 1098202
55800 1098202 1101116 1086131 1058738 1018078 968550 919435 872615 823653 774559 732760 698267
55789 698267 664674 632201 607218 589543 572604 555612 543436 535127 524637 512391 504310 499952
55777 499952 493324 484818 480586 480643 479325 477108 480205 488372 494424 495823 495849 493717 484916 471412 460385
55762 460385 452520 442202 429185 419177 412850 405277 396614 392323 392060 388980 381006 372603 364734 353353
55748 353353 338749 326317 316980 306562 295410 288794 286806 283690 278299 275636 276800 276865 274066 271998
55734 271998 271438 268996 265047 264110 266125 266033 262992 261315 261407 258726 252787 248232 245795 241112 233760 228541
55718 228541 226387 222836 217098 213859 214272 213757 210727 209159 210530 211313 210499 211655 215600 218835 221092
55703 221092 226545 235600 243183 247183 250965 255732 258160 257832 259396 264872 270910 275768 281985 290033
55689 290033 296257 299237 301549 303452 301577 295578 289355 284073 276822 267608 260599 256765 252360 246292
55675 246292 241844 239383 234631 226243 218064 211879 204902 196423 189847 185993 181343 175061 170839 169690
55661 169690 167937 164558 163434 165856 167843 167431 167720 170069 171200 169907 169825 172521 174325 172946 170859
55646 170859 169337 165668 159303 154389 152998 151900 148996 146780 146475 145018 141101 138102 137800 137119 134374
55631 134374 132702 133899 134690 132652 130254 129558 128451 125557 123430 123438 122812 120193 118754 120458 122536 123086
55615 123086 124786 129467 134246 136763 139197 143354 146719 147186 146992 148198 148786 146942 144792 144220 143263
55600 143263 140216 137150 136000 135151 133082 131268 130467 128361 123938 119935 118027 115948 112232 109224 108312
55585 108312 106896 103318 100176 99376 98556 95927 94051 95098 96744 96595 96490 98584 101226 102583 104451
55570 104451 108659 113405 116904 121060 127883 135827 143235 151892 163607 176727 189390 202757 217657
55557 217657 231499 241812 249425 255038 256316 251755 243807 234792 223369 208428 192893 180003 169078
55544 169078 158353 148632 140847 133406 125318 118662 114757 111342 106750 103183 102463 102215 99852 96852
55530 96852 95404 94306 91902 89726 89485 89591 88338 87305 88060 88702 87332 85729 85923 86381 85356 84807
55514 84807 87059 90550 92665 93860 95290 95468 93100 90252 88872 87115 82920 78242 75778 74450 72126
55499 72126 69912 69584 69500 67223 63718 60960 57939 53119 48296 45920 44985 43568 42953 45076 48250 49656
55483 49656 49965 51413 53411 54178 54634 56559 58762 59023 57983 57296 55903 52064 47231 44011 42008 39372
55467 39372 36591 35057 33792 31327 28954 28506 28829 28106 27540 28913 30648 30286 28967 29361 30953 31389
55451 31389 30744 30473 29884 27732 25714 26299 28507 29682 29912 30842 31786 31066 29727 29893 30858 30736 30469
55434 30469 32114 34569 35201 34463 34775 35985 36067 35299 35585 36501 36019 34519 34238 35463 36764 38155 40471
55417 40471 42542 42520 41209 40670 40684 39926 39355 40743 43047 43987 44034 45146 46831 47385 47813 50388 54320
55400 54320 57038 58923 62600 68187 73377 77745 82828 88267 91831 93151 93811 93945 92246 88989 85663
55385 85663 82082 77189 72095 68740 66259 62288 57210 53401 50955 48022 44842 43462 43683 43196 41603
55370 41603 40571 40167 38858 37049 36840 38105 38436 37218 36311 36476 36437 35693 35163 34867 33899 32682 32437
55353 32437 32700 32226 31764 32876 34637 34803 33662 33338 33865 33578 32849 33650 35623 36369 35614 35513 36763
55336 36763 37891 38354 38927 39083 37446 34818 33437 33333 32743 31775 32084 33217 33065 31790 31480 32054 31433
55319 31433 29896 30182 32811 35163 35754 35851 36389 36793 37258 38697 40125 39603 37970 37974 39571 40022 38900
55302 38900 38825 40601 41818 41244 40572 40654 39866 37637 35953 35939 36289 36323 37284 39298 40310 39395 38104 37354
55284 37354 36100 34311 34104 36410 39290 40883 41485 41658 40987 39769 39323 39691 39529 38852 39183 40515 41127
55267 41127 40933 41752 43619 44224 42960 42155 43192 44670 45539 46783 48712 49777 49494 49495 50370 50502 49346
55250 49346 48779 49742 50490 49655 48185 46844 44736 41831 40062 40277 40737 40073 39103 38448 37194 35380 34925
55233 34925 36435 37814 37604 37042 37230 37060 35733 34712 35316 36712 37949 39613 41855 43150 42644 41523
55217 41523 40685 39405 37647 37106 38378 39608 39463 39000 39059 38491 36729 35555 36366 37949 38795 39347 40296
55200 40296 40899 40824 41408 43289 44897 44981 44552 44706 44746 44148 44163 45659 47472 48558 49647 51108 51437 49716
55182 49716 47505 46517 46360 46191 46417 47115 46980 45617 44698 45071 44980 43057 40860 40370 41076 41511 41665 41792
55164 41792 40940 38789 37125 37346 38294 38492 38656 39867 41143 41121 40484 40565 41024 41009 41105 42078 43076 43066 42724
55145 42724 43069 43617 43662 43910 45044 46154 46361 46492 47460 48464 48526 48198 48043 47153 45015 43200 43185 44030
55127 44030 44161 43953 44560 45567 45794 45253 44566 43737 43079 43917 46689 49801 51966 54076 57148 60221 62136
55110 62136 63612 65481 66557 65461 63155 61477 60468 59187 57845 57074 56302 54843 53461 53058 53055 52750
55094 52750 52868 53899 54486 53433 51875 51413 51539 51024 50416 50900 51937 52303 52360 53165 54361 55058 55717 57133
55076 57133 58622 59246 59742 61215 63042 64078 64831 66331 67908 68233 67629 67269 67026 66151 65179 65058 65183
55059 65183 64240 62313 60494 59233 58630 59233 60809 61582 60486 58969 58715 58950 58046 56498 56057 57024 58567
55042 58567 60648 63453 65884 66785 66814 67145 67408 66901 66629 67888 69948 71332 72349 74106 76138 77358
55026 77358 78322 80117 82018 82712 82891 84109 85917 86695 86621 87296 89046 91028 93301 96319 99070 100279
55010 100279 100854 102590 104928 105602 104043 101615 98939 95629 92309 90205 88788 86372 82987 80261 78565
54995 78565 76704 74449 72895 72214 71316 69874 68544 67106 64558 61147 58269 56298 54493 53002 52813
54980 52813 53697 54272 54243 54636 55773 56946 58142 60048 62315 63713 64228 65161 67066 69256 71283 73176
54964 73176 74387 74339 73926 74682 76634 78734 81012 84283 88085 91194 94098 98627 105031 111655 117725
54949 117725 124353 132448 141659 151758 163234 176125 189977 205178 222606 241721 260489 277282
54937 277282 291312 301463 306548 306729 302909 294912 282163 265960 248915 232077 214818 197618
54925 197618 182645 171077 161873 153705 146276 139362 132477 125995 120951 117287 113895 110586 108310 107318
54911 107318 106926 107267 109254 112512 115340 117232 119594 123454 128331 133937 141181 150754 162314 175653
54897 175653 191113 208157 224962 240008 252700 262066 266381 264773 258006 247312 233729 218775
54885 218775 204211 190547 177045 163584 151327 141233 133134 126578 121440 117471 114407 112562 112218
54872 112218 112571 112503 112167 112360 112668 111828 109775 107584 105568 103229 100944 99710 99100 97412 94141 90533
54856 90533 87533 85003 83079 82326 82228 81376 79530 77715 76089 73656 70538 68456 68294 68966 69283 69330 69428
54839 69428 69380 69276 69507 69573 68491 66671 65690 65866 65857 65050 64412 64421 64122 63002 62049 62107 62737 63351 64027 64638
54819 64638 64701 64586 65301 66682 67464 67530 68206 69829 70990 70937 70822 71692 73049 74305 75887 77933 79577
54802 79577 80539 81864 84140 86548 88717 91937 97353 104310 111658 119488 128489 138625 149535 161402
54788 161402 174708 189861 207413 227464 248463 267782 283877 296642 305546 309206 307343 301444
54776 301444 292792 281433 267766 253393 239450 225617 211753 199103 188938 181244 175533 171654
54764 171654 169095 166898 165105 164984 167144 170799 175539 182237 191333 201798 212822 225092 239367
54751 239367 255059 271242 287817 304661 320802 335395 348570 360551 371038 380052 388119 394886
54739 394886 398820 398966 395800 389708 380085 366651 350313 332026 312201 291933 273176 256804 241942
54726 241942 228106 216450 207839 201191 194942 188921 183662 179040 174694 170743 167152 163383 159403 155880
54712 155880 152703 148680 143484 138496 134813 131793 128541 125412 122949 120662 118071 115833 114723 114395
54698 114395 114064 113473 112507 110954 109329 108746 109255 109535 108894 108231 108325 108615 108446 108137 108015 107808 107745 108790
54680 108790 111005 113112 114389 115546 117116 118712 120565 123836 128454 132627 135571 138784 143434 148420
54666 148420 152391 155684 158818 160986 161792 162777 165417 169064 172395 175417 178510 181174 183454 187038 193109
54651 193109 200568 208109 216561 227286 239849 253413 269110 288789 312324 338210 365842 395173
54639 395173 424833 452452 476212 494539 505246 506768 499631 485361 464933 439666 412303 385347
54627 385347 359341 334329 311675 292517 275759 259842 245537 234738 227317 221484 216584 213281
54615 213281 211420 209982 208924 209037 210031 210590 210215 209388 208102 205773 202437 198611 194195 188879 183241
54600 183241 178206 173805 169638 165879 162586 158818 153942 149011 145324 142366 138790 134666 131096 128287
54586 128287 125714 123539 122128 120782 118681 116447 115025 113654 110889 107105 104073 102407 101374 100809
54572 100809 101199 102030 102020 101053 100223 99921 99458 98514 97484 96495 95478 95016 95729 97017 97840 98412 99654 101329
54554 101329 102332 102620 103334 105092 107550 110432 113659 116731 119248 121738 124783 127867 130348 132841 136189
54539 136189 139870 143127 146903 152792 160748 169786 180240 193085 207471 221283 233949 246377 258129
54526 258129 267066 272111 274154 273798 270273 263221 253725 242956 231325 219464 208495 198710 189355
54513 189355 180147 171727 164317 157329 150734 145527 142337 140632 139653 139172 139088 139231 139666 140360 140655 139988
54497 139988 138878 138197 137826 137135 136309 135848 135231 133607 131476 130091 129453 128435 126781 125383 124697 124386
54481 124386 124434 125092 125869 126023 125880 126241 126869 127138 127664 129351 131221 131393 130131 129779 131456 133909 135801
54464 135801 137056 137514 136432 134036 131827 130585 129599 128300 127092 126128 124894 123556 123113 123640 123848 122968
54448 122968 121638 120471 119215 117845 117018 116823 116375 115212 113897 112803 111537 110013 108878 108424 108233
54433 108233 108176 108606 109327 109587 109280 109018 108954 108757 108663 109116 109501 108867 107844 108014 109343 110152 109869 109761 110492
54414 110492 111053 110898 111213 113099 116019 118974 121842 124764 127535 130350 133944 138427 143186 148226 154208
54399 154208 160779 166519 171094 175857 181661 187610 192535 196186 198307 198271 196478 194612 193572 192451 190289
54384 190289 187414 184296 180509 175780 170809 166244 161964 157975 154723 151976 148827 145374 142933 141897
54370 141897 140979 139282 137508 136309 135072 133360 131978 131457 130919 129593 128125 127271 126574 125527 124816 125166
54354 125166 126075 126859 127935 129945 132546 135121 137813 140878 143950 146837 150143 154208 158304 161747 164847
54339 164847 167943 170466 171773 172048 171627 170373 168331 165981 163299 159657 155219 151083 147460 143178 137816
54324 137816 132779 129207 126320 123014 119758 117456 115615 113133 110058 107225 104828 102510 100228 98068
54310 98068 95764 93231 90905 88966 87032 85155 84061 83782 83225 81781 80150 78873 77417 75548 74140
54295 74140 73581 72766 70861 68735 67431 66524 65283 64220 64017 64048 63421 62565 62373 62648 62757 62908 63477 63907
54277 63907 63610 63140 63227 63509 63440 63466 63965 64043 62885 61395 60915 61079 60559 59289 58367 58227 58451 58980 60053
54258 60053 61251 61945 62403 63322 64625 65848 67211 69061 70690 71034 70266 69597 69745 70595 71957 73614
54242 73614 74997 75806 76588 77806 78865 78977 78425 77964 77563 76813 75991 75582 75185 74011 72108 70141 68426
54225 68426 67119 66824 67864 69307 69771 68919 67384 65657 63857 62154 60610 59010 57418 56298 55592
54210 55592 54596 53323 52887 53719 54599 54487 54095 54434 55015 54871 54294 53996 53515 52099 50388 49561 49416 48868
54192 48868 47830 47080 46785 46643 46933 47913 48685 48230 47146 46867 47566 48272 48603 48868 48894 48309 47653 47724 48114
54173 48114 47881 47247 47106 47218 46575 45292 44504 44543 44759 44945 45344 45413 44285 42479 41563 42055 43093 44185
54155 44185 45741 47820 49837 51649 53485 54755 54428 52790 51404 51042 51005 50674 50353 50274 50095 49849 50232
54138 50232 51498 52961 53881 54037 53374 52013 50653 50046 50063 50153 50502 51665 53267 54322 54667 54867 54829 53922
54120 53922 52444 51581 51775 52460 53433 55058 56905 57715 57103 56055 55358 54804 54340 54643 55904 57205 57826
54103 57826 58264 59333 61007 62709 64057 64815 64742 63950 63007 62367 62074 62042 62163 62167 61869 61549 61607 61995 62392
54084 62392 62618 62367 61130 59132 57695 57714 58334 58172 57279 56632 56323 55722 55054 55198 56078 56796 57302 58429
54066 58429 60215 61698 62480 63076 63583 63478 62918 62811 63361 63855 64072 64502 64972 64645 63773 63877 65607 67800
54048 67800 69302 70389 71684 72928 73643 74009 74286 74222 73694 73171 73011 73041 73205 73771 74567 74935 74874 75290 76635
54029 76635 78170 79062 79481 80193 81792 84619 88634 93062 96962 100406 104377 109353 114876 120642 126994
54014 126994 133982 140889 147000 152082 155967 158608 160735 163411 166645 169443 171484 173660 176599 179742
54000 179742 182294 184120 185240 185433 184820 183953 182878 180950 177927 174394 170778 166877 162723 158949 155853
53985 155853 152987 150084 147499 145322 142955 140057 137130 134668 132448 130085 127633 125322 123295 121739
53971 121739 120634 119370 117397 115173 113559 112402 110850 108932 107496 106534 105102 103130 101784 101557 101501
53956 101501 100945 100554 100927 101491 101600 101585 101864 102094 102019 102144 102819 103631 104385 105694 107816 109911 111201 112014
53938 112014 112983 114210 115921 118880 123276 128098 132503 136948 142194 148028 153926 160111 167024 174379
53924 174379 181644 188875 196239 203200 208879 212843 215078 215734 215278 214210 212271 208738 203892 199204 195676
53909 195676 193081 191318 191187 192949 195302 196899 198046 199890 202791 206457 210861 215910 220867 225229
53895 225229 229616 234887 240846 246694 252225 257614 262517 266284 268759 270162 270550 270066 269269 268578 267807
53880 267807 266794 265920 265409 264631 262743 259561 255394 250628 245923 242007 238701 234884 229998 224794 220020
53865 220020 215327 210247 205356 201482 198430 195400 192081 188561 184737 180554 176254 171828 166935 161941
53851 161941 158097 155935 154391 152351 150019 147849 145254 141633 137760 134802 132654 130566 128648 127351
53837 127351 126076 123900 121342 119817 119435 118807 117087 114919 113160 111846 110755 110041 109864 109981 109955 109462
53821 109462 108464 107418 107132 107926 109202 110199 110764 111004 110783 110186 109856 110130 110318 109638 108376 107392 106968 106912
53803 106912 107258 107975 108434 108128 107575 107699 108683 110172 112077 114263 115997 116817 117577 119577 122874 126464
53787 126464 129887 133590 137878 142502 147281 152240 157247 162227 167514 173181 178366 182185 185032 187923
53773 187923 190802 192679 193407 194138 195830 198317 201072 203924 206624 208496 209006 208275 206778 204858 202608
53758 202608 199856 196307 192012 187572 183497 179618 175558 171478 167821 164588 161493 158605 156249 154412
53744 154412 152796 151277 149867 148485 147230 146480 146201 145659 144410 143012 141990 140715 138376 135601 133902
53729 133902 133590 133439 132476 131084 130099 129725 129670 129668 129483 128892 127949 127018 126388 126075 125873 125395 124321 122916 121979
53710 121979 121886 122082 121938 121671 121852 122470 123163 123941 124911 125566 125225 124081 123136 123196 124401 126489 128906 130957
53692 130957 132491 134189 136593 139226 141334 142992 144605 145733 145409 143581 141330 139722 139167 139755 141362
53677 141362 143394 145154 146548 147950 149465 150871 152120 153372 154703 156254 158303 160627 162259 162644
53663 162644 162584 163204 164299 164672 163878 162612 161494 160474 159511 158931 158931 159346 159989 160632 160727 159800 158155 156642
53645 156642 155758 155457 155613 156083 156470 156439 156152 155907 155569 154883 154062 153500 153220 153147 153512 154373 155162 155399 155417 155673
53625 155673 155844 155461 154950 155068 155644 155892 155690 155605 155898 156398 157149 158255 159352 160113 161061 162945 165593 168207
53607 168207 170464 172398 173658 173986 174132 175165 177090 179230 181643 184965 189040 193010 196663 200507 204577
53592 204577 208366 211836 215334 218605 221145 223416 226386 229925 233027 235655 238825 242715 246201 248673
53578 248673 250804 253035 254773 255773 257069 259589 262772 265395 267048 268189 269410 271180 273638 276100
53564 276100 277339 276855 275487 274493 274463 275196 276020 276103 275040 273304 271635 270120 268451 266849 265832 265232
53548 265232 264445 263605 263431 263919 264207 263899 263532 263649 264310 265532 267123 268129 267623 266165 265314 265625 266396
53531 266396 267372 269204 271942 274650 277026 279950 283803 287657 290920 294407 298880 303765 308385 313335
53517 313335 319476 326395 333080 339536 346708 355204 364959 375800 387523 399636 411711 423864 436550
53504 436550 450132 464787 480383 496294 511863 527207 543029 559626 576840 595017 614970
53493 614970 636733 659399 682530 706716 732303 758560 784777 811202 838252 865616 892790
53482 892790 919741 946391 972208 997021 1021572 1046617 1072074 1097668 1123809 1151225 1180198
53471 1180198 1210529 1241664 1272498 1301803 1329267 1355395 1380120 1402547 1422520 1441301 1459797
53460 1459797 1477048 1491441 1502750 1512068 1520390 1528168 1535773 1543408 1550826 1557735 1564123 1569625 1573131
53447 1573131 1573737 1571628 1567446 1561261 1552784 1542024 1529002 1513255 1494469 1473280 1450752 1427293
53435 1427293 1402662 1376752 1349835 1322303 1294645 1267376 1240499 1213357 1185426 1156965 1128544
53424 1128544 1100464 1073086 1047233 1023570 1001813 981026 960562 940402 920844 902263 885020
53413 885020 869370 855601 844222 835616 829539 825487 823500 824003 826944 831906 839108 849328 862651
53400 862651 878266 895737 915498 937737 961901 987760 1015824 1046098 1077472 1109188 1141988
53389 1141988 1176971 1214127 1252810 1292961 1334972 1378977 1425100 1473841 1525403 1579111 1634151
53378 1634151 1690400 1747989 1806736 1866671 1928443 1992432 2058012 2124346 2191332 2259009 2326667
53367 2326667 2393343 2458718 2522822 2585371 2645994 2704525 2760351 2812113 2858849 2900887 2938917
53356 2938917 2972778 3001981 3026847 3048223 3066461 3081454 3093256 3101884 3106913 3107959 3105241 3099027
53344 3099027 3088953 3074335 3054491 3028094 2992986 2947696 2892850 2830469 2762424 2690244 2615668
53333 2615668 2540215 2464414 2388231 2311885 2235704 2159739 2084365 2010722 1939723 1871065 1803972
53322 1803972 1738398 1674608 1612136 1550214 1488939 1429138 1371390 1316007 1263647 1214997 1170042
53311 1170042 1128325 1089698 1054147 1021392 991374 964750 942077 922928 906537 892841 882063
53300 882063 873811 867541 863489 862149 863197 865866 870050 876089 883797 892589 902315 913023 924283 935713
53286 935713 947871 961659 977135 993840 1012030 1032444 1055025 1078903 1103639 1129602 1157152
53275 1157152 1186277 1216954 1249025 1281783 1314391 1346607 1378469 1409550 1439322 1467963 1496007
53264 1496007 1523464 1550053 1575855 1600797 1623843 1643817 1660922 1676510 1691462 1705662 1718818
53253 1718818 1730753 1741005 1749128 1755369 1760179 1763123 1763132 1759685 1752801 1742087 1726851 1707138 1683666
53240 1683666 1656710 1625988 1591673 1554608 1515401 1474183 1431297 1387449 1343086 1298417 1254002
53229 1254002 1210596 1168451 1127504 1088165 1051110 1016377 983388 951711 920904 889882 857533
53218 857533 824005 790489 757643 725111 692599 660507 629391 599635 571808 546568 524134
53207 524134 504334 487014 471761 457541 443549 430238 418583 408499 398950 389410 380114 371011
53195 371011 361702 352478 344228 337102 330305 323371 316612 310173 303711 297282 291476 286325 281049 275247
53181 275247 269424 264011 258729 253295 247962 242969 238196 233648 229550 225686 221429 216695 212212 208477
53167 208477 205146 201774 198520 195747 193405 191100 188431 185212 181733 178771 176829 175549 174321 173125
53153 173125 172060 170510 167841 164682 162341 161028 159791 158191 156751 155621 154085 151808 149520 147942
53139 147942 146982 146336 146025 145989 145937 145917 146224 146604 146491 146180 146717 148286 149833 150648 151312 152555 154265 156224
53121 156224 158875 162529 166602 170401 174123 178424 183439 188721 193729 198019 201377 204033 206241 207576
53107 207576 207282 205427 202971 200545 198018 195398 193123 191107 188513 184971 181140 177537 173668 168945
53093 168945 163720 158767 154417 150744 147907 145715 143435 140638 137721 135138 132694 130080 127499 125225
53079 125225 123055 120730 118488 116785 115790 115442 115539 115556 114948 113886 113115 112838 112386 111242 109756 108557 107872
53062 107872 107623 107487 106725 104820 102551 101496 102072 102982 103037 102584 102560 103113 103840 104533 104957 104638 103663 102969
53044 102969 103091 103270 102595 101357 100419 99848 99092 98080 97184 96359 95217 93801 92564 91617 90617 89359
53028 89359 88008 86850 86152 86059 86296 86196 85383 84208 83204 82417 81608 80832 80410 80457 80695 80658 80029 78928
53010 78928 77800 76762 75322 73247 71404 70919 71622 72190 71851 70996 70060 68948 67873 67597 68309 69166 69506
52993 69506 69653 70000 70244 70176 70376 71338 72609 73483 73910 74156 74278 74570 75757 77976 80285 81877 83192
52976 83192 85095 87622 90308 93126 96276 99615 103101 107263 112350 117512 121728 125148 128594 132042
52962 132042 134548 135546 135377 134573 133325 131707 129856 127852 125704 123426 120887 117827 114253 110561 107105
52947 107105 103922 100931 97962 94637 90921 87803 86511 86763 86787 85469 83491 81862 80474 78921 77640
52932 77640 77091 76597 75217 73230 71683 70806 69924 68624 67050 65314 63511 62164 61789 62050 62063 61476 60731
52915 60731 60355 60509 61015 61435 61338 60864 60641 60857 60911 60386 59729 59475 59461 59420 59663 60402 61019 60853 60269 60078
52895 60078 60298 60257 59618 58605 57542 56809 56840 57494 57847 57309 56475 56202 56317 56055 55337 54748 54549 54531 54616 54957
52875 54957 55585 56459 57511 58268 58056 57111 56761 57808 59442 60552 61322 62537 63996 64819 64880 64830 65039 65502
52857 65502 66426 67857 69147 69782 70415 72001 74270 76153 77408 78758 80682 83242 86868 92036 98111
52842 98111 103578 107498 109931 111137 111398 111434 111838 112089 111093 108742 105972 103381 100879 98717 97671 97942
52826 97942 98769 99413 99778 99962 99907 99630 99127 98074 96240 94037 91887 89359 85854 81945 78913 77044
52810 77044 75527 74011 73044 72780 72538 72013 71788 72108 72167 71283 70023 69427 69582 69584 68672 66998 65428 64749
52792 64749 64929 65223 65175 65213 65869 66772 67061 66535 65700 64908 64152 63488 62897 61942 60429 59222 59463 60999 62453
52773 62453 62856 62417 61760 61299 61372 62002 62530 62322 61885 62333 63736 65048 65833 66922 68965 71289 72730
52756 72730 72912 72268 71436 70938 70938 70960 70350 69194 68266 67933 67688 66941 65754 64609 63904 63715 63703 63260 62149
52737 62149 60833 59741 58653 57446 56897 57728 59160 59596 58652 57377 56460 55463 54017 52641 51930 51817
52721 51817 52014 52399 52714 52681 52645 53324 54671 55791 56213 56521 57451 59142 61481 64440 67821 71353 75175
52704 75175 79568 84133 87992 90904 93378 95657 97465 98872 100518 102753 105311 107889 110174 111382
52690 111382 110796 108858 106753 104812 102455 99708 97422 95730 93639 90662 87638 85399 83801 82599
52676 82599 82049 81924 81105 79084 76907 75764 75393 74704 73249 71334 69311 67534 66413 65851 65114 63778
52660 63778 62296 61254 60739 60739 61353 62170 62357 61854 61540 61670 61179 59311 56981 55629 55443 55611 55669 55687 55704
52641 55704 55834 56479 57715 58902 59546 60011 60728 61304 61141 60372 59541 58853 58387 58435 58980 59409 59467 59815 60941
52622 60941 62236 63076 64097 66270 69165 71303 72002 71839 71389 70509 68983 67021 64960 62994 61265 59845
52606 59845 58676 57805 57419 57316 56815 55712 54908 55396 56890 58110 58305 57899 57735 58201 59085 59875 60214 60235
52588 60235 60332 60557 60631 60647 61143 62160 62901 62843 62635 63253 64658 65901 66259 65758 64869 64212 64314 65195 66336
52569 66336 67322 68211 69003 69280 68742 67742 66852 66258 65909 65844 66043 66366 66932 68102 69777 71303 72340 73199
52551 73199 73971 74101 73328 72358 71969 72055 72145 72273 72688 73274 73916 74907 76383 77839 78792 79406 79926 80186 80303
52532 80303 81148 83265 85795 87331 87470 86876 86244 85873 85769 85548 84729 83710 83778 85445 87548 88767 89310
52515 89310 90082 91015 91468 91673 92418 93575 94273 94381 94586 95057 95240 95007 94938 95311 95745 95966 96157 96448 96824
52496 96824 97459 98386 98953 98515 97574 97284 97775 97934 96993 95421 94054 93165 92738 92869 93490 94170 94539 94608 94571
52477 94571 94637 95011 95591 95747 94866 93106 91207 89702 88756 88473 88736 88894 88328 87292 86612 86664 87192 87988
52459 87988 89002 89901 90269 90243 90292 90389 90095 89515 89403 90161 91318 92211 92746 93312 94264 95539 96554 96685 96130
52440 96130 95954 96821 98077 98661 98514 98334 98290 97947 97298 96957 97247 97861 98497 99146 99749 100171 100466 100553 99906
52421 99906 98304 96686 96275 96901 97162 96323 95094 94422 94480 95103 96195 97277 97443 96342 94661 93257 92294
52404 92294 91497 90727 89990 89362 89129 89593 90553 91407 91875 92109 92144 91867 91607 91973 92830 93164 92343 90950 89986
52385 89986 89696 89629 89441 89232 89292 89801 90637 91380 91678 91624 91529 91492 91492 91728 92353 93024 93307 93463 94219 95782 97696
52364 97696 99613 101492 103038 103720 103523 102957 102207 101048 99805 99454 100351 101542 101924 101566 101395 102022 103406
52347 103406 105319 107593 110041 112475 114759 116763 118425 119859 121096 121785 121560 120660 119674 118716 117498
52332 117498 116195 115513 115645 115935 115887 115851 116288 116896 116989 116275 114868 112954 110872 109130 107911 106911 105982
52315 105982 105539 105873 106507 106749 106622 106700 107268 108152 109195 110289 111040 111021 110483 110289 110896 111826 112454 112949 113951
52296 113951 115531 117061 118251 119723 122156 125261 128177 130706 133478 136867 140419 143515 145993 147845
52282 147845 149046 150099 152017 155122 158390 160744 162525 164870 168034 171274 174230 177399 181136 185008
52268 185008 188391 191076 193076 194363 195038 195372 195580 195860 196548 197846 199418 200712 201581 202170 202368 201974
52252 201974 201351 201264 201992 203055 203858 204246 204475 205079 206647 209270 212328 215221 218058 221162 224210 226580
52236 226580 228340 230137 232226 234287 236164 238104 240323 242881 245788 248711 250927 252242 253593 255867
52222 255867 258547 260523 261892 263747 266396 269087 271481 274043 276832 279209 281030 282896 284898 286334
52208 286334 287123 288274 290414 292917 295091 297201 299657 302161 304397 306741 309616 312808 315990 319270
52194 319270 322757 326235 329680 333303 336733 339146 340703 342834 346413 350599 354194 357232 360384 363657
52180 363657 366733 369921 373749 378060 382332 386455 390424 393820 396444 399019 402402 406405 410155 413284
52166 413284 416019 418418 420272 421580 422546 423299 424085 425286 426758 427687 427726 427735 428643 430004 430551 429774 428116
52149 428116 425896 423048 419890 417287 415856 415485 415649 415804 415543 414838 414056 413439 412737 411671 410478 409616
52133 409616 409164 408855 408383 407385 405530 403019 400553 398427 396134 393284 390300 387630 384945 381910 379119
52118 379119 377298 375960 373891 370815 367638 365086 363064 361423 360412 360039 359669 358651 356934 354893 352844
52103 352844 350904 349018 347066 345134 343585 342594 341741 340444 338660 336806 335083 333361 331645 330202 329117
52088 329117 328148 327131 326322 326210 327103 328853 330886 332599 333902 335306 337359 340088 343036 345667 347733
52073 347733 349454 351374 353819 356526 359164 362085 365954 370630 375066 378534 381258 383541 385032 385418
52059 385418 385283 385565 386457 387408 388047 388615 389621 391329 393505 395519 396953 398123 399621 401386 402843 403982
52043 403982 405530 407872 410573 413238 415913 418279 419485 419454 419445 420478 421973 422801 423023 423602 424882 426340
52027 426340 427463 428122 428362 428539 429225 430277 430507 429092 426799 424913 423454 421518 418984 416738 415227
52012 415227 413807 411616 408413 404585 400916 398163 396297 394428 392066 389952 388921 388479 387542 386203 385582
51997 385582 386113 387074 387765 388123 388185 387993 388097 389185 391001 392445 392792 392096 390437 387736 384423 381293 378441
51980 378441 375131 370940 366294 361656 356938 351928 346577 340672 333860 326223 318226 309942 301018 291539
51966 291539 282261 273792 266137 259181 252885 246801 240103 232494 224548 216924 209722 202841 196390 190428
51952 190428 184745 179200 173890 168834 163885 159087 154712 150800 147091 143578 140648 138435 136397 133832
51938 133832 130605 127220 124297 122019 120058 118106 116481 115839 116152 116452 116004 115124 114326 113254 111289 108821
51922 108821 106987 106330 106496 107068 107853 108516 108802 108983 109288 109153 107991 106476 105942 106545 107122 106903 106221 105521
51904 105521 104870 104612 105209 106081 105872 104379 103028 102830 103036 102542 101546 100889 100650 100412 100218 100257 100125 99362
51886 99362 98384 98024 98372 98797 98886 98713 98397 98048 97969 98325 98714 98585 97992 97508 97467 97687 97883 97974 98054 98294 98803
51865 98803 99366 99475 98872 97967 97567 98130 99315 100223 100290 100052 100752 102750 104666 104814 103295 101833 101522 101783
51847 101783 101825 102027 103150 104934 106414 107234 107814 108406 108729 108565 108156 107895 107940 108213 108602 109091 109725 110440
51829 110440 110982 111151 111046 110853 110552 110158 110064 110634 111571 112288 112822 113681 114815 115573 115904 116665 118354 120291
51811 120291 121634 122523 123555 124756 125825 127040 129043 131804 134523 136611 138293 140118 142305 144768
51797 144768 147524 150735 154299 157582 159884 161283 162708 164947 167880 171031 174443 178408 182789 187482
51783 187482 193337 201476 211514 221500 229919 236785 242363 245922 246562 244550 240925 236233 230479 223984
51769 223984 217548 211790 206828 202453 198284 194008 189841 186546 184667 183961 183754 183501 182808 181485 179961
51754 179961 179126 179315 179842 179980 179871 179975 180141 179859 179033 177837 176108 173659 171024 169171 168443 168362 168466
51737 168466 168769 169303 169676 169391 168413 167205 166162 165068 163330 160905 158763 157970 158360 158733 158397 157824 157584
51720 157584 157450 156981 156306 155714 155032 154063 153232 153098 153543 154057 154587 155502 156950 158770 160800 162741 164025
51703 164025 164435 164652 165584 167329 169334 171294 173149 174363 174106 172331 170006 168010 166334 164595 162864
51688 162864 161515 160498 159118 156671 153217 149677 146988 145177 143394 140903 137784 134601 131833 129857
51674 129857 129065 129573 131035 133083 135653 138517 140769 141341 139994 137447 134637 132072 129737 127271 124413
51659 124413 121545 119585 118985 119133 119144 118935 119032 119572 120177 120717 121474 122467 123289 123895 125074 127794 132316 138098
51641 138098 144272 149955 154364 156973 157625 156379 153373 149021 144210 139933 136501 133283 129547 125590
51627 125590 122673 121617 121773 121667 120456 118437 116412 115048 114717 115300 116158 116785 117464 118709 120177 120927
51611 120927 120807 120691 121082 121412 121232 121187 122060 123523 124595 124911 124795 124515 124291 124682 126138 128231 130027
51594 130027 131076 131436 130957 129356 127039 125102 124317 124645 125821 127769 130196 132288 133301 133323 133262 134108
51578 134108 136223 139132 141906 143821 144740 144939 144775 144559 144564 144941 145701 146799 148099 149271 149991 150296 150408
51561 150408 150250 149538 148413 147464 146914 146283 145144 143683 142193 140521 138496 136532 135271 134861 134934 135050
51545 135050 134840 134078 133021 132399 132679 133563 134477 135236 135907 136425 136798 137399 138624 140386 142262 143877 145030
51528 145030 145772 146531 147713 148985 149562 149481 149908 151740 154553 157432 160120 162683 164723 165791 166173 166478
51512 166478 166805 166990 167229 167656 167731 166888 165478 164335 163701 163397 163611 164573 165715 166219 166274 166873 168418 170419
51494 170419 172526 174897 177452 179646 181234 182557 183884 185118 186288 187707 189495 191374 192984 193983
51480 193983 193982 193018 191943 191639 191920 191867 191186 190386 189655 188473 186580 184508 182808 181357 179781 178044 176245
51463 176245 174220 171711 168746 165691 163015 160913 158978 156524 153524 150899 149405 148600 147544 146179
51449 146179 145243 144999 144886 144455 143896 143600 143759 144366 145009 144826 143374 141401 139996 139096 137718 135555 133333
51432 133333 131513 129751 127931 126755 126762 127504 128133 128235 127752 126763 125745 125447 126038 126772 126859 126288 125512 124738
51414 124738 123866 122795 121563 120427 119884 120291 121391 122521 123248 123509 123286 122604 121697 120670 119143 116818
51398 116818 114192 112043 110495 109244 108467 108519 108922 108757 108076 107837 108290 108473 107594 105911 103990 102071 100505
51381 100505 99848 100073 100503 100844 101360 101807 101361 100063 99216 99642 100608 101212 101792 103033 104562 105586 106258
51364 106258 107320 108806 110104 111040 111961 112939 113650 113932 113838 113274 112240 111239 110869 111020 110922 109983 108362
51347 108362 106874 106347 106708 106668 104974 102195 100424 100784 102031 102227 101001 99304 97658 95813 93803 92245
51331 92245 91491 91235 90984 90413 89362 88017 86956 86511 86247 85619 84865 84642 84975 85276 85286 85357 85754 86322 86898
51312 86898 87512 88085 88382 88386 88376 88508 88589 88328 87571 86322 84820 83569 83044 83313 84073 84993 85904 86789 87704
51293 87704 88596 89093 88818 88046 87700 88400 89792 91055 91711 91575 90384 88051 85209 82948 81914 81919 82374
51276 82374 82818 83098 83288 83514 83786 84057 84404 84893 85257 85015 84106 83066 82447 82316 82445 82599 82451 81654 80289
51257 80289 78929 77981 77336 76878 76874 77511 78396 78995 79289 79609 80002 80136 79756 79006 78408 78514 79284 79806 79118
51238 79118 77368 75672 74748 74448 74760 76277 79003 81549 82466 81949 81394 81599 82200 82629 82783 82737 82530 82348
51220 82348 82397 82537 82498 82440 82923 84270 86266 88431 90325 91691 92536 93031 93152 92684 91667 90549 89661 88990
51202 88990 88636 88986 89964 90666 90333 89343 88642 88547 88777 89389 90830 93062 95255 96578 96892 96595 96105 95592
51184 95592 95065 94660 94793 95715 96875 97222 96429 95349 94959 95303 95864 96426 97006 97383 97373 97253 97301 97131 96084
51165 96084 94085 91656 89312 87472 86589 86776 87504 88198 88892 89767 90399 90191 89276 88312 87560 86859 86317 86280
51147 86280 86695 87200 87789 88736 89881 90695 91037 91259 91573 91911 92331 92929 93339 92963 91786 90378 89101 87866
51129 87866 86689 85857 85488 85467 85788 86392 86712 86183 85294 85391 87044 89160 90095 89317 87723 86686 86982 88390
51111 88390 90011 91092 91587 91963 92622 93695 95092 96420 97076 96844 96260 96050 96438 97381 99027 101315 103433
51094 103433 104452 104451 104319 104524 104745 104667 104403 104131 103944 104102 104759 105398 105280 104537 104136 104585 105397 106038 106634
51075 106634 107386 107905 107697 106882 105942 104988 103739 102180 100928 100757 101731 102887 103127 102558 102517 103934 106130
51058 106130 107706 108197 108135 107881 107327 106650 106412 106736 107122 107220 107198 107281 107509 107974 108653 109025 108577 107710 107399 107923
51038 107923 108680 109357 110417 112201 114348 116346 117946 118807 118534 117467 116728 117102 118401 120096 121865 123291
51022 123291 123850 123597 123226 123070 122717 121929 121144 120663 120117 119280 118712 118982 119833 120646 121198 121443 121182 120521 120085
51003 120085 120189 120327 120050 119784 120102 120735 121018 120886 120706 120540 120303 120315 121004 122279 123775 125418 127220 128905
50985 128905 130362 132014 134040 135669 136140 136039 136759 138812 141571 144504 147669 150953 153859 156317 158843
50970 158843 161606 164075 165934 167670 169767 171972 173862 175700 178139 181277 184537 187369 189681 191527
50956 191527 192786 193412 193934 195400 198563 203125 208067 212846 217984 224294 231870 240237 249202 259059 270033
50941 270033 282099 295324 309903 325766 342604 360383 379332 399303 419602 439706 459611
50930 459611 479185 497606 513890 527580 538507 546174 550070 550452 548168 543580 536190 525515 511847
50917 511847 495962 478441 459657 440128 420486 401251 382883 365779 349968 335039 320784
50906 320784 307698 296376 286657 277945 270258 264160 259606 255713 251992 249046 247529 247122 247204 247934 249741
50891 249741 252091 253790 254567 255464 257412 260062 262333 263649 264289 264729 264925 264261 262298 259656 257802 257538
50875 257538 258010 257747 256462 255138 254476 254145 253693 253282 253127 252912 252310 251605 251224 251010 250480 249624 249018 249295
50857 249295 250761 253353 256664 260100 263290 266278 269227 272152 275014 277857 280685 283438 286228 289374
50843 289374 293051 297140 301561 306461 311912 317672 323581 330016 337708 347156 358368 371112 385289
50830 385289 401093 418807 438389 459441 481933 506841 535619 568829 605583 644524 685151
50819 685151 728013 773802 822398 872766 923722 974723 1025607 1075396 1121774 1162264 1195710
50808 1195710 1222060 1240994 1251628 1253712 1248337 1237137 1221326 1201747 1179235 1154517 1128237 1101495
50796 1101495 1076045 1053533 1034734 1019507 1007133 996541 986804 977738 969628 962306 955168 948460
50784 948460 943879 943368 947772 957149 971751 991902 1017121 1046142 1077776 1111189 1145326 1178593
50772 1178593 1209285 1236158 1258666 1276886 1291165 1301575 1307716 1309147 1305919 1298513 1287317 1272225
50760 1272225 1252627 1227773 1197376 1161948 1122475 1079931 1035391 990339 946186 903408 861802
50749 861802 821760 784596 751277 721470 694346 669858 648733 631547 618324 608766 602409 598684
50737 598684 597194 597886 600845 606181 614167 625076 638737 654727 673147 694651 719452 746868 776108
50724 776108 806723 837748 867093 892631 913578 930191 942507 950064 952676 950877 945712 938493
50712 938493 930492 922421 914397 906807 900826 897649 897634 900722 907266 917763 932058 949514 969858 993240
50698 993240 1019618 1048659 1080094 1113567 1148215 1182914 1216905 1249705 1280398 1307467 1329376
50687 1329376 1345202 1355020 1359935 1361419 1360296 1356784 1351788 1347408 1345456 1345978 1348027 1351213 1355538 1360103
50673 1360103 1363306 1364401 1364001 1363132 1362858 1364913 1371608 1384717 1405213 1434320 1473834 1524817 1586552
50660 1586552 1657176 1734762 1817333 1902342 1986797 2067793 2142924 2210774 2271402 2325939 2375162
50649 2375162 2418569 2455033 2483975 2505569 2520075 2527415 2527316 2519481 2503679 2480081 2449806 2415063
50637 2415063 2378485 2342089 2306907 2273759 2244234 2220454 2203732 2193842 2189845 2191110 2197110 2206611
50625 2206611 2217791 2229049 2239271 2247446 2252666 2254542 2253155 2248601 2240990 2230876 2219292 2207366
50613 2207366 2196214 2187160 2181589 2180593 2185023 2195628 2212504 2234348 2258755 2283360 2306433 2326530
50601 2326530 2342127 2351762 2354143 2348135 2332998 2308590 2274945 2231780 2179028 2117822 2050390 1978850
50589 1978850 1904659 1829307 1754849 1683335 1616081 1553751 1496815 1445559 1399852 1359180 1322902
50578 1322902 1290484 1261666 1236348 1214091 1193776 1174030 1154020 1133742 1113772 1095018 1078396
50567 1078396 1064249 1052184 1041898 1033963 1029206 1027439 1027442 1028258 1029859 1032475 1035927 1039852 1044111 1048796
50553 1048796 1054351 1061836 1072547 1087090 1105270 1127117 1153641 1186286 1225955 1272773 1326445 1386559
50541 1386559 1452738 1524619 1601409 1681343 1761929 1840955 1917149 1989987 2059366 2125768 2190401
50530 2190401 2254796 2320169 2387039 2455115 2523500 2591214 2657655 2722490 2785484 2846877 2907831
50519 2907831 2969892 3033905 3099886 3167964 3238864 3313184 3390550 3469670 3548788 3625837 3698389
50508 3698389 3763769 3819163 3861698 3888757 3898478 3889928 3862899 3817783 3755552 3677653 3586041 3483640
50496 3483640 3374566 3263468 3154643 3051961 2959211 2879763 2815868 2768676 2738635 2725143
50486 2725143 2725895 2737444 2756551 2780362 2805232 2826247 2838325 2837295 2819872 2783590 2727542 2652990
50474 2652990 2562898 2460968 2351074 2236876 2121369 2006837 1895192 1787973 1686013 1589619
50464 1589619 1499267 1415714 1339342 1269829 1206536 1148793 1095941 1047749 1004797 967704 935884
50453 935884 907843 882831 861291 843439 828420 815366 804286 795188 787209 779558 772793 768176
50441 768176 766083 765798 766578 768091 769989 771895 773932 776717 780822 786615 794521 804923 817751 832476
50427 832476 848621 866157 885635 908071 934402 964713 998279 1034671 1074503 1118738 1167535
50416 1167535 1220261 1276399 1335906 1398678 1464084 1531069 1598598 1666210 1734430 1804469 1877100
50405 1877100 1951799 2027137 2101835 2175156 2246483 2314981 2379810 2440413 2496442 2547386 2592288
50394 2592288 2630063 2660325 2683795 2701473 2713234 2717428 2711756 2694166 2663097 2617718 2558575 2487715
50382 2487715 2407779 2321073 2229600 2135584 2041599 1950327 1864289 1785480 1715071 1653675 1601938
50371 1601938 1560492 1529326 1507736 1494964 1490222 1491829 1496935 1502478 1506008 1505331 1498177 1482938 1459446
50358 1459446 1428543 1391244 1348712 1302559 1254482 1205743 1157332 1110295 1065461 1023205 983856
50347 983856 948010 915930 887025 860393 835639 812790 791854 773020 756842 743571 732549
50336 732549 722843 714206 706824 700503 694903 690364 687616 686660 686613 686697 686701 686408 685340 683413 681297 679793
50320 679793 679089 678864 678836 679006 679520 680427 681498 682367 683061 684341 687273 692395 699381 707460 716018 724932
50304 724932 734545 745257 757089 769801 783548 799157 817542 838978 863032 888924 915711 942383
50292 942383 968076 992116 1013864 1032712 1048336 1060719 1069967 1076488 1081159 1084513 1085539 1082029 1072490
50279 1072490 1057115 1036760 1012015 983882 954300 924932 896012 867380 840087 815807 794998
50268 794998 776776 760434 745920 732850 720216 707366 694476 681829 669390 657269 645807
50257 645807 634974 624390 614184 605138 597679 591258 585065 578867 572876 567304 562315 558013 554233
50244 554233 550725 547680 545617 544521 543583 542029 539851 537471 535131 532889 530861 529126 527617 526403
50230 526403 525873 526354 527677 529323 530888 532299 533622 534801 535592 535764 535423 535026 534984 535377 536118 537124 538142
50213 538142 538784 539039 539465 540403 541393 541868 542184 543352 545845 549246 552928 556375 559023 560626 561883 563892
50197 563892 566787 569632 571885 574137 577002 580024 582336 583881 585314 587016 588842 590702 592840 595523
50183 595523 598814 602650 606923 611504 616382 621634 627071 632063 636009 639011 641886 645457 649915 654768
50169 654768 659285 663000 665889 668200 670277 672572 675661 679955 685403 691626 698289 705146 711826 717926
50155 717926 723428 728800 734575 740952 747835 755005 762162 768950 775150 780836 786215 791351 796050 800093
50141 800093 803578 806918 810362 813641 816361 818713 821398 824759 828390 831766 834798 837442 839287 840031
50127 840031 840189 840789 842500 845384 849290 853975 859058 864314 870025 876691 884596 893986 905441 919523
50113 919523 936160 954919 975757 999067 1025183 1054542 1088317 1128144 1175003 1228878 1289709
50102 1289709 1358212 1435507 1522201 1617892 1721103 1829292 1938958 2045886 2145640 2234592
50092 2234592 2311237 2376608 2433100 2482914 2527675 2568801 2607306 2643205 2675510 2702434 2720833
50081 2720833 2725822 2712205 2676916 2619875 2542875 2448667 2341210 2225608 2106926 1989280 1876017
50070 1876017 1769902 1672605 1584514 1505480 1435381 1373832 1320012 1273194 1232909 1198258 1167729
50059 1167729 1140167 1115435 1093689 1074504 1057281 1042010 1028943 1017745 1007574 997854 988487 979449
50047 979449 970724 962563 955349 949103 943424 937952 932753 928232 924773 922372 920531 918647 916573 914632
50033 914632 913103 911996 911474 912089 914296 917912 922321 927064 932089 937566 943674 950495 958006 966265 975539
50018 975539 986001 997329 1008952 1020805 1033498 1047533 1062630 1077966 1092860 1107084 1120802
50007 1120802 1134456 1148575 1163509 1179413 1196459 1214794 1234265 1254523 1275513 1297646 1321378
49996 1321378 1346974 1374848 1405828 1440841 1480437 1524894 1574866 1631902 1698281 1776131 1866607
49985 1866607 1970142 2087505 2219950 2367512 2527227 2693516 2860289 3022445 3176096
49976 3176096 3318822 3450219 3571649 3685047 3792272 3895367 3996209 4095061 4189600 4275475
49966 4275475 4347272 4398926 4424318 4418674 4379788 4308149 4206595 4080007 3934326 3774820 3605229
49955 3605229 3428679 3248756 3069113 2892400 2720300 2554413 2396563 2248363 2110948
49946 2110948 1985089 1871071 1768401 1675979 1592669 1517638 1450254 1389896 1335934 1287822 1245206
49935 1245206 1207781 1174901 1145461 1118504 1093849 1071732 1051866 1033314 1015278 997557 980167
49924 980167 963086 946448 930469 915003 899643 884393 869753 856084 843487 832313 823041 815452
49912 815452 808752 802790 798255 795238 792544 789187 785801 783692 783029 782900 782764 782952 783839 785324 787105
49897 787105 788923 790541 791923 793350 795031 796761 798321 799933 801954 804435 807421 811350 816530 822497
49883 822497 828494 834503 841288 849431 858770 868814 879505 891609 906437 924902 946729 971021
49871 971021 997788 1028394 1064208 1105479 1152183 1205357 1266852 1338051 1419509 1511481 1613860
49860 1613860 1725565 1844413 1967351 2090186 2207552 2314403 2408118 2488899 2558287 2617938
49850 2617938 2669758 2716299 2760292 2803642 2846480 2886459 2918699 2936871 2934895 2908180 2854243
49839 2854243 2773253 2668388 2545235 2410383 2270184 2130151 1994639 1866631 1747853 1639153
49829 1639153 1540806 1452751 1374730 1306150 1245891 1192692 1145925 1105513 1070870 1040469 1012932
49818 1012932 988087 966405 947724 931128 915797 901464 888247 876604 867160 859959 854043 848360
49806 848360 842895 838296 834612 831150 827567 824385 822196 820817 819432 817310 814394 811426 809445 808892
49792 808892 809258 809765 810091 810206 809996 809487 809102 809095 809028 808261 806692 804491 801614 798167 794879 792382 790300
49775 790300 787787 784730 781665 778851 776305 774466 773697 773249 771887 769605 767607 766428 765197 763211 761120
49760 761120 759882 759406 758917 758126 757389 757072 757262 757701 757697 756548 754430 752413 751134 749860 747314 743158 738213
49743 738213 733440 729131 725064 721091 717517 714788 712696 710096 705936 700602 695697 692301 689864 687076
49729 687076 683388 679407 676117 674053 673001 672172 670787 668648 666069 663326 660429 657430 654555 651921
49715 651921 649436 646977 644359 641156 637061 632529 628597 625820 623736 621527 618842 615816 612772 610214
49701 610214 608686 608265 608376 608410 608325 608401 608632 608721 608611 608740 609661 611456 613622 615604 617384 619361 621605 623648
49683 623648 625239 626880 629147 631792 634106 636004 638074 640602 643165 645274 646933 648513 650524 653480
49669 653480 657458 661814 665844 669632 673696 677918 681665 685035 689046 694332 700426 706730 713403 720796
49655 720796 728592 736152 743313 750380 757614 765119 772917 780761 788141 794809 801005 806992 812723 818220
49641 818220 823872 830070 836874 844243 852192 860565 869167 878396 889101 901353 913863 925237 935451
49628 935451 945516 955969 966304 975778 984178 991763 998783 1005194 1010737 1015391 1019774 1024829 1030971
49615 1030971 1037854 1045072 1052674 1060758 1069054 1077359 1085955 1095110 1104428 1113236 1121442 1129515 1137705 1145776
49601 1145776 1153540 1161246 1169342 1178066 1187378 1197144 1207400 1218428 1230414 1243034 1255728 1268548
49589 1268548 1282432 1298354 1316391 1335930 1356511 1378125 1400767 1424134 1447894 1472087 1497201
49578 1497201 1523843 1552203 1581808 1611922 1642286 1673330 1705641 1739450 1774609 1810772 1847461
49567 1847461 1884259 1921141 1958401 1996102 2033842 2071226 2108365 2145776 2183936 2222967 2262469
49556 2262469 2301582 2339514 2376194 2412132 2447604 2482296 2515858 2548355 2579870 2609987 2637938
49545 2637938 2663081 2685082 2703954 2720154 2734338 2746701 2756749 2763907 2768165 2769968 2769768 2767921
49533 2767921 2764751 2760475 2755208 2749194 2742878 2736678 2730950 2726164 2722713 2720437 2718765 2717536 2717335 2718871
49519 2718871 2722480 2728379 2736817 2747599 2759954 2773303 2787792 2803668 2820503 2837575 2854740 2872389
49507 2872389 2890657 2909081 2926976 2943885 2959726 2974620 2988389 3000161 3008823 3014051 3016427 3016358
49495 3016358 3013380 3006880 2996951 2984028 2968233 2949670 2928930 2906526 2882039 2854580 2823997 2791039
49483 2791039 2756407 2720347 2683222 2645781 2608598 2571724 2535096 2498883 2463197 2427787 2392392
49472 2392392 2357236 2322974 2290144 2258777 2228460 2198750 2169573 2141324 2114584 2089739 2066805
49461 2066805 2045485 2025418 2006481 1988866 1972754 1958029 1944504 1932247 1921325 1911292 1901478
49450 1901478 1891833 1882955 1875069 1867497 1859440 1850915 1842555 1834872 1828057 1822222 1817360 1813234 1809580 1806308
49436 1806308 1803346 1800528 1797897 1795812 1794515 1793761 1793151 1792680 1792787 1793930 1796183 1799081 1801860 1804118 1806217
49421 1806217 1808809 1812228 1816785 1823356 1832960 1846053 1863194 1885944 1915082 1947191 1974682 1990956
49409 1990956 1995179 1991324 1983596 1974168 1964408 1956013 1950254 1947237 1946489 1947627 1950251 1953892 1958498 1964622
49395 1964622 1972885 1983373 1995418 2007682 2018726 2028006 2036153 2043993 2051676 2059148 2066884 2075312 2083915
49382 2083915 2091857 2099304 2107174 2115738 2124370 2132759 2141350 2150458 2159856 2169498 2179799 2190765 2201592
49369 2201592 2211671 2221491 2232106 2244062 2257214 2271228 2285861 2300966 2316499 2332429 2348631
49358 2348631 2365067 2382096 2400262 2419709 2440167 2461532 2484112 2508294 2534304 2562351 2592585
49347 2592585 2624798 2658575 2693871 2731060 2770280 2811111 2853126 2896443 2941473 2988285 3036448
49336 3036448 3085469 3135276 3186241 3238683 3292423 3347019 3402414 3458947 3516566 3574508 3632107
49325 3632107 3689549 3747325 3805276 3862700 3919159 3974670 4029273 4082970 4135911 4188129 4239154
49314 4239154 4288305 4335130 4379128 4419441 4455526 4487891 4517387 4543977 4566992 4586431 4603064
49303 4603064 4617122 4627848 4634673 4638202 4639676 4640004 4639554 4638455 4636825 4634981 4633463 4632546 4631993 4631780 4632798
49288 4632798 4636090 4641575 4648350 4656212 4665841 4677435 4690242 4703765 4718445 4734690 4752109 4770251
49276 4770251 4789247 4809126 4829186 4848656 4867390 4885290 4901674 4915886 4927933 4937672 4943807 4944606
49264 4944606 4939533 4929454 4915294 4897153 4874795 4848323 4818038 4783981 4745964 4704059 4658927
49253 4658927 4611493 4562263 4511149 4458129 4403784 4348815 4293305 4237110 4180887 4125889 4072544
49242 4072544 4019914 3966954 3913733 3861105 3809699 3759688 3711094 3663916 3618252 3574555 3533320
49231 3533320 3494281 3456412 3419000 3382188 3346148 3310485 3275040 3240618 3208165 3177612 3148281
49220 3148281 3119958 3092754 3066215 3039537 3012668 2986393 2961234 2937001 2913546 2891223 2870209
49209 2870209 2849876 2829224 2807733 2785616 2763511 2742029 2721316 2700857 2679913 2658390 2637056
49198 2637056 2616740 2597447 2578440 2559118 2539548 2520188 2501333 2482969 2465080 2447815 2431307
49187 2431307 2415509 2400378 2386154 2373209 2361621 2350945 2340462 2329687 2318817 2308752 2300377
49176 2300377 2293586 2287232 2280344 2273170 2266689 2261390 2257050 2253493 2250884 2249194 2248019 2247114 2246594 2246456 2246401
49161 2246401 2246256 2246023 2245279 2243152 2239228 2233973 2227900 2220832 2212524 2203589 2195165 2187779 2180996 2174130 2167005
49146 2167005 2160086 2154059 2149205 2145063 2140919 2136728 2133259 2131175 2130347 2130366 2131403 2134238 2139575 2147501 2157293
49131 2157293 2167457 2176228 2182461 2186069 2187631 2187894 2187661 2187613 2187848 2188010 2188151 2189063 2191371 2194741 2198530 2202822
49115 2202822 2208141 2214323 2220302 2225106 2228573 2231059 2232926 2234426 2235670 2236392 2235960 2233882 2230340 2226112
49101 2226112 2221885 2217612 2212660 2206618 2199763 2192539 2184874 2176514 2167861 2159773 2152369 2144668 2135781 2125954
49087 2125954 2116079 2106589 2097270 2087803 2078060 2068145 2058513 2049815 2042279 2035563 2029525 2024792 2022093 2021293
49073 2021293 2021560 2022305 2023564 2025676 2029030 2033929 2040239 2047253 2054220 2060941 2067579 2074157 2080580 2086836
49059 2086836 2092752 2097749 2101359 2103836 2105770 2107237 2107770 2107074 2105285 2102585 2099021 2094658 2089494 2083276
49045 2083276 2075799 2067397 2058755 2050218 2041683 2033112 2024748 2016746 2009038 2001675 1995016 1989388 1984803 1981105
49031 1981105 1978195 1976015 1974392 1973024 1971674 1970531 1970353 1971972 1975511 1980287 1985635 1991481 1997919 2004686
49017 2004686 2011535 2018780 2026954 2036125 2046097 2057132 2069845 2084406 2100445 2117753 2136554 2156878
49005 2156878 2178201 2200003 2222412 2246041 2271377 2298470 2327041 2356799 2387743 2420170 2454208
48994 2454208 2489432 2525242 2561601 2599014 2637682 2677008 2716169 2754961 2793867 2833463 2873978
48983 2873978 2915304 2957072 2998599 3039001 3077616 3114354 3149448 3182861 3214076 3242558 3268124
48972 3268124 3290707 3310093 3326281 3339939 3352010 3362825 3372050 3379438 3385112 3389052 3390868 3390321 3387564
48959 3387564 3382663 3375389 3365710 3353994 3340433 3324878 3307706 3290332 3274251 3259863 3246676 3234297
48947 3234297 3222681 3211674 3200995 3190661 3181076 3172698 3165818 3160479 3156476 3153716 3152618 3153606 3156021
48934 3156021 3158330 3159933 3162035 3166074 3172012 3179010 3187140 3197233 3209357 3222693 3236987 3253067 3271701
48921 3271701 3292820 3316036 3341195 3368128 3396585 3426647 3458630 3492342 3526957 3561947 3597727
48910 3597727 3635150 3674638 3715883 3758067 3800377 3842667 3885560 3929604 3974572 4020134 4066903
48899 4066903 4115962 4167374 4219914 4272448 4324830 4377370 4430233 4483726 4538511 4595043 4653113
48888 4653113 4712196 4771844 4831644 4891267 4950803 5010629 5070782 5130836 5190359 5248945 5305774
48877 5305774 5359894 5411205 5460485 5508194 5553813 5596644 5636514 5673246 5706110 5734447 5758386
48866 5758386 5778358 5794216 5805328 5811213 5811581 5806042 5794316 5776570 5753133 5724113 5689745 5650884
48854 5650884 5608643 5563555 5515429 5463943 5409025 5350799 5289594 5226102 5161126 5095003 5027524
48843 5027524 4958596 4888950 4820050 4753237 4688938 4626715 4566071 4507070 4450192 4395894 4344557
48832 4344557 4296561 4252008 4210531 4171838 4136350 4104832 4077425 4053568 4032851 4015313 4000896
48821 4000896 3989317 3980701 3975668 3974390 3976190 3980524 3987832 3998818 4013293 4030412 4049768 4071636
48809 4071636 4096253 4123422 4152836 4184217 4217077 4250840 4285402 4321257 4358819 4397825 4437639
48798 4437639 4478023 4519339 4561927 4605480 4649328 4693294 4737935 4783816 4830826 4878532 4926949
48787 4926949 4976531 5027610 5080268 5134674 5190992 5249012 5308444 5369626 5433316 5499617 5567750
48776 5567750 5637127 5708054 5780994 5855658 5931298 6007464 6084002 6160624 6236932 6312603 6387127
48765 6387127 6459569 6528959 6594613 6655748 6711149 6759795 6801616 6837087 6866201 6888414 6903575
48754 6903575 6912361 6915611 6913625 6906269 6893535 6875851 6853952 6828514 6799785 6767585 6731675 6691959
48742 6691959 6648188 6599763 6546229 6487902 6425796 6360955 6294187 6226385 6158721 6092349 6028135
48731 6028135 5966785 5909064 5855694 5807036 5762976 5723157 5687352 5655529 5627536 5602826 5580677
48720 5580677 5560745 5543233 5528403 5516031 5505370 5495505 5485693 5475487 5464698 5453228 5440947 5427752
48708 5427752 5413663 5398691 5382608 5365014 5345680 5324753 5302672 5279950 5256848 5233034 5207838
48697 5207838 5181225 5154333 5128500 5103834 5079317 5054369 5029576 5005692 4982640 4959962 4937620
48686 4937620 4915791 4894350 4873229 4852997 4834335 4816979 4799832 4782208 4764513 4747616 4731994
48675 4731994 4717657 4704551 4692839 4682888 4675038 4669285 4665230 4662485 4661090 4661297 4663042 4665888 4669524
48662 4669524 4674093 4679905 4686967 4694890 4703142 4711358 4719411 4727141 4734030 4739303 4742504 4743816 4743560 4741500
48648 4741500 4736940 4729576 4719949 4708861 4696500 4682328 4665788 4646925 4626218 4603961 4579880 4553376
48636 4553376 4524080 4492179 4458300 4423052 4386655 4348995 4310104 4270516 4231041 4192253 4154385
48625 4154385 4117645 4082273 4048195 4015012 3982541 3951144 3921310 3893164 3866604 3841558 3817832
48614 3817832 3795063 3773289 3753334 3736049 3721350 3708480 3697114 3687599 3680108 3674120 3668923 3664257
48602 3664257 3660374 3657823 3657210 3658811 3662321 3667204 3673300 3680813 3689890 3700529 3712762 3726501 3741424
48589 3741424 3757481 3775332 3795606 3817822 3840683 3863455 3886373 3909772 3933630 3958058 3983387
48578 3983387 4009492 4035776 4062083 4088954 4116652 4144668 4172538 4200537 4229162 4258550 4288786
48567 4288786 4320216 4353025 4387039 4422237 4458869 4496715 4534909 4572995 4611523 4651075 4691242
48556 4691242 4731052 4769868 4807447 4843750 4879301 4915145 4951833 4988889 5025768 5062765 5100390
48545 5100390 5138515 5176890 5215885 5255801 5295863 5334813 5372269 5408714 5444344 5478707 5511294
48534 5511294 5541790 5569887 5595528 5619101 5640792 5659975 5675859 5688429 5698101 5704778 5708045 5707999
48522 5707999 5705029 5698998 5689587 5677310 5663237 5647713 5630270 5610816 5590027 5568354 5545503 5521141
48510 5521141 5495351 5468152 5439261 5408615 5376536 5343109 5307956 5270899 5232298 5192544 5151750
48499 5151750 5110223 5068643 5027390 4986050 4943957 4900950 4857355 4813582 4770017 4727079 4685112
48488 4685112 4644281 4604652 4566228 4528919 4492759 4458209 4425917 4396077 4368124 4341149 4314542
48477 4314542 4288384 4263356 4240135 4218674 4198219 4178120 4158305 4138816 4119333 4099536 4079500
48466 4079500 4059300 4038703 4017787 3997308 3977696 3958120 3937491 3916140 3895428 3875782 3856195
48455 3856195 3835779 3814812 3793909 3773047 3751900 3730448 3708746 3686573 3663717 3640246 3616201
48444 3616201 3591417 3565861 3539815 3513541 3487039 3460202 3432915 3405006 3376484 3347786 3319324
48433 3319324 3290925 3262260 3233602 3205401 3177237 3148163 3118184 3088427 3059555 3030977 3002056
48422 3002056 2973166 2944938 2917263 2889767 2862656 2836356 2810780 2785676 2761316 2738049 2715500
48411 2715500 2692945 2670344 2648332 2627234 2606757 2586704 2567442 2549389 2532417 2516038 2500077
48400 2500077 2484908 2470993 2458307 2446432 2435240 2425171 2416553 2408974 2401798 2395138 2389730 2385840
48388 2385840 2382891 2380293 2378076 2376534 2375793 2375873 2376698 2377695 2377839 2376408 2373534 2369984 2366774 2364883 2364662 2365281
48372 2365281 2365384 2364459 2363050 2361577 2359823 2357840 2356399 2355869 2355418 2354047 2351893 2349802 2348067 2346392 2344746
48357 2344746 2343481 2342795 2342680 2343239 2344473 2345949 2347215 2348376 2349800 2351544 2353556 2356252 2360321 2366130 2373751
48342 2373751 2383306 2394805 2407941 2422558 2438994 2457336 2476734 2496159 2515536 2535249 2554809
48331 2554809 2573024 2589483 2604824 2619304 2632128 2642537 2650650 2656620 2659690 2658783 2653588 2644489 2631857
48318 2631857 2616079 2597969 2578345 2557168 2533708 2507724 2480050 2451808 2423354 2394270 2364183
48307 2364183 2333320 2302310 2271735 2242048 2213705 2187030 2161852 2137544 2113666 2090485 2068597
48296 2068597 2048173 2028789 2010027 1991917 1974737 1958640 1943609 1929581 1916438 1903998 1892190
48285 1892190 1881180 1871212 1862317 1854299 1846954 1840227 1834160 1828824 1824313 1820729 1818066 1816141 1814701 1813606
48271 1813606 1812854 1812428 1812280 1812481 1813270 1814770 1816769 1818939 1821240 1823913 1827022 1830210 1833034 1835441 1837857
48256 1837857 1840798 1844389 1848146 1851281 1853351 1854616 1855628 1856462 1856517 1855105 1852150 1848269 1844255 1840458 1836540
48241 1836540 1831869 1826246 1820177 1814261 1808467 1802271 1795353 1787809 1779725 1771056 1762031 1753184 1744708 1736163
48227 1736163 1727161 1718041 1709459 1701598 1694174 1687086 1680495 1674229 1667650 1660404 1653014 1646330 1640438 1634414
48213 1634414 1627245 1618804 1609750 1600614 1591232 1581094 1570015 1558329 1546555 1535014 1523685 1512261
48201 1512261 1500409 1488085 1475563 1463139 1450935 1439010 1427397 1415906 1404108 1391766 1379104
48190 1379104 1366477 1354036 1342001 1330906 1321101 1312064 1302648 1292050 1280258 1267726 1255056 1242951
48178 1242951 1232037 1222504 1214061 1206208 1198491 1190687 1183061 1176242 1170511 1165366 1160060 1154302 1148113 1141380
48164 1141380 1134167 1127249 1121690 1117950 1115870 1115276 1116020 1117674 1119979 1123485 1129060 1136884 1146623 1158454
48150 1158454 1173122 1191139 1212749 1238679 1270200 1308776 1356524 1416850 1494026 1593165 1721254
48139 1721254 1884369 2077125 2272452 2426831 2502707 2489320 2403491 2273342 2123020 1968721
48129 1968721 1821206 1687349 1570163 1469759 1384982 1314267 1255865 1208017 1168917 1136685
48119 1136685 1109821 1087472 1068770 1052355 1037304 1024087 1013518 1005085 997432 990257 984418 980204
48107 980204 976873 974134 972709 972950 974111 975570 977606 980233 982324 982867 982364 982010 982019 981658 980579 979139
48091 979139 977518 975311 972067 967773 962810 957773 953261 949437 945799 941685 936915 931652 925806 918991
48077 918991 911137 902811 894767 887268 879893 872000 863409 854631 846352 838674 831057 823033 814772 806711
48063 806711 798763 790156 780233 769299 758508 748828 740273 732265 724593 717701 712066 707730 704423 701702
48049 701702 698826 695129 690843 687033 684252 681797 678871 675882 673745 672252 670217 667211 664159 662007
48035 662007 660662 659542 658354 656901 654873 652420 650448 649747 650103 650742 651341 652163 653516 655659 659021
48020 659021 663923 669988 676346 682596 689181 696617 704599 712202 718837 724666 729998 734631 738069 740234
48006 740234 741563 742416 742782 742665 742344 741954 741157 739588 737413 735101 732818 730376 727636 724581 721171 717447
47990 717447 713721 710254 706745 702409 696580 689152 680650 672040 664083 656518 648155 638182 627125 616113
47976 616113 605584 595287 585170 575468 566046 556490 546878 537791 529429 521352 513184 504976 496783
47963 496783 488498 480255 472443 465159 458100 451127 444409 437962 431663 425794 420938 417079 413399 409182
47949 409182 404408 399332 394219 389668 386409 384258 381911 378329 373891 369742 366534 364257 362773 361832
47935 361832 360953 359913 359102 358851 358721 358050 356930 355979 355335 354522 353275 351822 350351 348848 347640 347462
47919 347462 348627 350509 352221 353547 354826 356091 356808 356545 355590 354691 354405 354939 356440 358964 362064 364852
47903 364852 366767 368067 369303 370630 372020 373826 376513 379909 383352 386665 390387 394859 399582 403781
47889 403781 407201 410077 412659 415162 417903 421073 424443 427585 430453 433592 437677 442809 448237 452981
47875 452981 456879 460783 465522 470929 476322 481600 487197 493006 498169 502106 505175 508013 510825 513547
47861 513547 516160 518456 519963 520460 520249 519649 518652 517291 515834 514273 512228 509837 508091 507561 507256 505636
47845 505636 502518 499084 496063 492917 489108 485226 482130 479506 476163 471718 467181 463667 461129 458846
47831 458846 456712 455277 454546 453588 451691 449356 447611 446778 446505 446708 447717 449576 451860 454303 457043
47816 457043 460133 463332 466532 470009 474096 478916 484399 490104 495084 498533 500772 503122 506561 510874
47802 510874 515153 518701 521325 523232 524829 526240 527109 527285 527529 528805 530896 532580 533260 533483 533659 533389
47786 533389 532593 532321 533572 535954 538247 539821 540825 541504 542088 542978 544304 545551 546078 545742 544675 543016
47770 543016 541370 540831 541715 542712 542095 539466 535559 530827 525224 519201 513761 509294 505132 500512 495407
47755 495407 490222 485263 480689 476648 473165 470109 467338 464771 462435 460595 459576 459186 458660 457612 456794
47740 456794 457449 460009 463754 467566 470673 472944 474939 477464 480680 483724 485513 485640 484225 481297 476808
47725 476808 470893 463604 454802 444796 434646 425149 415967 406470 397096 388936 382244 376318 370780 365985
47711 365985 362073 358545 355055 351843 349104 346511 343669 340610 337696 335393 334179 334163 334796 335420 336103
47696 336103 337415 339467 341796 344136 346604 349067 351017 352299 353418 354967 357253 360435 364390 368384
47682 368384 371635 374349 377525 381529 385614 389140 392513 396473 401043 405675 409958 413791 417311 420987
47668 420987 425386 430459 435455 439845 443909 448151 452592 457049 461590 466262 470731 474679 478245 481634
47654 481634 484655 487196 489801 493118 496886 500079 502145 503637 505495 508136 511410 515161 519459 524345
47640 524345 529577 534720 539423 543486 546828 549627 552536 556345 561128 565974 569907 572864 575402 577700
47626 577700 579418 580411 580916 580947 580076 577951 574485 569381 562058 552393 541127 529229 517111 504706
47612 504706 491922 478846 465830 453522 442427 432327 422592 413304 405445 399630 395190 391034 386963
47599 386963 383528 380862 378359 375484 372391 369654 367728 366666 366120 365595 364878 364095 363206 361703 359120
47584 359120 355679 352038 348512 344970 341439 338356 335986 333918 331464 328449 325343 322584 319969 316874
47570 316874 312973 308529 304031 299828 296199 293381 291184 288893 285967 282704 279736 277073 274210 271131
47556 271131 268465 266528 264954 263604 263068 263660 264455 264186 262865 261790 261814 262260 261808 260116 258160 257045
47540 257045 256762 256324 255112 253767 253484 254597 256339 257979 259625 261663 263923 265974 267988 270797 275043
47525 275043 280559 286602 292544 298348 304463 311215 318297 325103 331546 338144 345098 351640 356615 359451
47511 359451 360290 359524 357571 354820 351287 346468 340064 332793 325986 320346 315459 310556 305282 299637 293620
47496 293620 287272 280861 274791 269446 265176 262256 260680 260103 260093 260321 260556 260680 260839 261356 262295 263273 263869
47479 263869 264141 264527 265347 266593 268129 269818 271410 272627 273536 274621 276246 278108 279496 280090 280379 281250
47463 281250 283269 286280 289518 292132 293812 295006 296462 298573 301255 304300 307569 310900 314129 317191
47449 317191 319930 321874 322678 322803 323174 324036 324691 324648 324377 324457 324560 323991 322795 321588 320530 319191 317349
47432 317349 315243 313089 311052 309667 309582 310710 312141 313065 313365 313276 312959 312480 311793 310719 309362 308454 308700
47415 308700 309845 310943 311513 311729 311517 310372 308316 306288 305168 305018 305519 306436 307249 306985 304994 301621
47399 301621 297841 294626 292723 292292 292414 291655 289600 287246 285553 284305 282950 281755 281330 281595 282103 282967
47383 282967 284627 286908 289154 291188 293436 296107 298890 301473 303947 306656 309922 313773 317703 320931
47369 320931 323162 324747 325864 326133 325511 324859 324868 324931 323973 322044 320168 318861 317704 316203 314110 311043
47353 311043 306817 302269 298756 296590 294808 292599 290109 287666 285258 283221 282483 283404 285111 286621 287980
47338 287980 289574 290940 291237 290684 290566 291728 293757 295774 297472 299130 301083 303529 306613 310294 314089
47323 314089 317224 319196 320170 320711 321088 321038 320304 319199 318321 317751 316855 314946 311846 307797 303141 298310
47307 298310 293817 289929 286444 283037 279743 276857 274347 271683 268395 264749 261655 259843 259219 259116 259038
47292 259038 258898 258565 257571 255581 252963 250522 248725 247460 246540 246088 246269 246825 247106 246538 245097 243390
47276 243390 242232 241990 242236 242140 241239 239845 238694 238211 238048 237375 235698 233418 231422 230177 229418 228677 227726
47259 227726 226419 224598 222504 220891 220237 220042 219429 218281 217205 216505 215832 214983 214407 214495 214822 214591 213666
47242 213666 212737 212478 212869 213423 213807 214046 214171 213973 213261 212256 211424 210886 210315 209641 209485 210529 212609 214858
47224 214858 216705 218218 219431 219931 219541 219063 219770 222139 225454 228711 231545 233984 235638 235761 234287
47209 234287 232307 231107 230891 230836 230230 229042 227511 225823 224450 224042 224575 225064 224729 224068 224221 225534 227417
47192 227417 229408 231603 233963 235992 237517 239232 241978 245665 249300 252012 253812 255423 257617 260735
47178 260735 264664 269123 273895 278852 283915 289108 294598 300538 306859 313257 319356 324866 329701 333893
47164 333893 337320 339555 340271 339834 339096 338465 337517 335699 333077 330054 326735 322992 318918 314835 311004
47149 311004 307676 305145 303350 301627 299398 296930 294940 293585 292394 291127 290085 289500 289213 289152 289628
47134 289628 290923 292869 295079 297352 299754 302505 305808 309584 313437 317157 321146 325896 331135 335973
47120 335973 339946 343413 346781 349869 352280 353991 355216 355977 356112 355567 354435 352851 350915 348607 345752
47105 345752 342267 338444 334690 330949 326741 321905 316993 312731 309355 306636 304349 302455 300901 299429
47091 299429 297640 295331 292820 290720 289236 287889 286171 284220 282378 280413 277861 275078 273159 272588
47077 272588 272632 272409 271967 271892 272337 272950 273407 273547 273216 272484 271837 271705 271888 271850 271481 271097 270680 269640 267619
47058 267619 265225 263595 263209 263351 262841 261179 258819 256484 254574 253297 252890 253283 253811 253744 253069 252319 251702
47041 251702 250868 249533 247896 246284 244830 243631 242843 242422 242094 241753 241562 241561 241512 241263 240854 240102 238607 236495
47023 236495 234714 234097 234360 234510 234054 233394 233107 233342 233901 234476 234661 234077 232786 231422 230568 229998 228780
47006 228780 226286 223000 220099 218289 217326 216657 216101 215703 215379 215110 215203 215868 216713 217161 217261 217561 218303 219209
46988 219209 220030 220758 221340 221787 222561 224207 226433 228209 228980 229211 229556 230141 230910 231954 233001 233257 232438
46971 232438 231501 231662 232943 234328 235155 235683 236272 236675 236385 235382 234246 233597 233535 233666 233679 233738 234124 234605
46953 234605 234621 234140 233871 234376 235306 235798 235455 234769 234720 235977 238152 239753 239342 236965 234123 232204 231382
46936 231382 231160 231364 232099 233140 233981 234318 234181 233764 233392 233419 233846 234286 234519 234797 235298 235695 235671 235591 236217
46917 236217 237840 240048 242186 243792 244796 245518 246313 247044 247220 246817 246569 247081 248029 248600 248404 247635 246655
46900 246655 245820 245410 245365 245351 245367 245830 246765 247460 247421 247119 247179 247326 246946 246293 246244 247012 248012 248970 250298 252216
46880 252216 254206 255574 256069 255846 255275 254904 255132 255822 256570 257305 258146 258820 258839 258252 257617 257099 256265 254950
46862 254950 253664 252791 251956 250672 249230 248417 248493 248955 249296 249652 250519 252023 253662 254894 255780 256823 258168
46845 258168 259304 259739 259698 259902 260904 262838 265538 268578 271463 274083 276799 279810 282793 285527 288457
46830 288457 292041 295867 299110 301683 304236 307067 309761 311937 313733 315402 316998 318574 320191 321634
46816 321634 322648 323537 324939 326853 328460 329159 329268 329388 329582 329546 329300 329340 330249 332357 335589 339496 343582
46799 343582 347637 351535 354911 357504 359800 362720 366500 370395 373714 376671 379885 383488 387162 390749
46785 390749 394388 398095 401582 404475 406595 408120 409570 411539 414317 417753 421381 424528 426602 427690
46771 427690 428811 431085 434572 438315 441512 444187 446731 449454 452737 456946 461755 466117 469390 472118
46757 472118 475185 478582 481603 483948 486004 488025 489680 490654 491276 492263 493984 496152 498152 499564 500367
46742 500367 500779 500987 501057 501058 501144 501493 502164 503037 503843 504355 504571 504660 504701 504658 504614 504755 504983 504929 504655 505003 506858
46721 506858 510237 514515 519284 524459 529777 534924 540193 546377 553874 562373 571510 581283 591702 602546
46707 602546 613634 624841 635595 644918 652293 658204 663564 668928 674386 679800 684913 689496 693575
46694 693575 697275 700457 702926 705036 707497 710462 713401 716110 719185 723089 727368 731266 734683 737981
46680 737981 741235 744235 746999 749772 752629 755364 757630 758947 758908 757574 755357 752301 748029 742657 737068
46665 737068 731683 725532 717331 707166 696348 685797 675365 664672 653814 643079 632527 622063
46653 622063 611575 600926 590174 579813 570413 561976 553985 546067 538304 530892 523865 517139 510493
46640 510493 503495 495810 487588 479288 471140 463170 455675 449162 443733 438899 434160 429441 424828 420259
46626 420259 415684 411308 407411 404064 401147 398555 396200 393948 391683 389489 387674 386522 385926 385305 384111
46611 384111 382522 381413 381421 382158 382574 382003 380679 379300 378334 377711 377004 375982 375035 374887 375656 376430 376069 374375
46593 374375 372230 370742 370568 371859 374368 377447 380323 382629 384596 386752 389528 393024 396916 400625
46579 400625 403830 406799 410048 413745 417687 421745 425958 430207 434155 437624 440756 443749 446669 449583
46565 449583 452548 455404 457843 459839 461713 463574 464985 465501 465368 465378 465946 466639 466766 466269 465776 465733 465798
46548 465798 465270 463956 462277 460612 458940 457209 455616 454309 453170 452215 451845 452255 452826 452587 451259 449489
46532 449489 448123 447581 447815 448436 448908 449039 449281 450205 451698 453084 454021 454793 455732 456920 458592 461230 464892
46515 464892 468821 472053 474170 475385 476333 478005 481262 485898 490567 494177 497123 500656 505309 510554
46501 510554 515771 520776 525407 529418 533075 537233 542352 547902 553193 558424 564404 571462 579264 587571
46487 587571 596529 606077 615650 624854 634098 644170 655271 666786 677953 688473 698498 708187 717364
46474 717364 725562 732486 738488 744427 750831 757284 762888 767264 770839 774147 777145 779340 780384 780420 780030
46459 780030 779984 780819 782410 783969 784582 783844 782100 780271 779431 780196 782245 784453 785690 785533 784241 782220
46443 782220 779610 776216 771617 765423 757658 748959 740263 732121 724206 715506 705133 693091 680238
46430 680238 667410 654717 641879 629100 617252 607147 598874 591906 585593 579502 573676 568737 565521
46417 565521 564365 564926 566734 569644 573564 578135 582999 588131 593634 599387 605222 611229 617537 623937
46403 623937 630063 635846 641452 646899 652051 656835 661024 663840 664409 662777 660112 657593 655373 652889
46389 652889 649901 646745 643518 639529 634004 627251 620708 615683 612268 609629 607076 604460 601757 598831
46375 598831 595685 592597 589867 587785 586759 586948 587713 588032 587726 587673 588515 589777 590776 591731 593305 595497
46359 595497 597807 600217 603199 606812 610578 614242 617914 621426 624240 626219 627861 629510 630819 631181
46345 631181 630319 628303 625499 622696 620750 619742 618794 616994 614241 611032 607794 604709 601872 599297 596945
46330 596945 594992 593868 593793 594459 595383 596469 598027 600349 603465 607237 611630 616849 623187 630565 638374
46315 638374 646069 653910 662810 673449 685840 699721 714870 730863 746981 762738 778291 794118
46303 794118 810413 826818 842478 856268 867379 875987 883073 889373 894746 898643 900802 901153 899450
46290 899450 895411 889086 880772 870795 859718 848536 838170 828778 819908 811321 803324 796345 790529
46277 790529 785831 782144 779176 776436 773595 770936 769425 770265 774147 780676 788548 796527 804354 812658
46263 812658 822037 832388 843180 854206 865917 878986 893589 909209 925197 941431 958264 975825
46251 975825 993590 1010740 1026757 1041525 1054964 1066810 1076795 1084913 1091461 1096841 1101252 1104463 1105875
46238 1105875 1104915 1101483 1096091 1089536 1082301 1074163 1064456 1052885 1040024 1026885 1014059 1001537 989356
46225 989356 978029 968048 959153 950480 941491 932530 924377 917467 911752 907191 903964 902045 900837 899638
46211 899638 898436 897900 898520 900149 902536 905809 910088 914904 919530 923731 927794 931946 936208 940750 945884
46196 945884 951680 957916 964441 971130 977576 983380 988811 994597 1000854 1006795 1011818 1016384 1021338 1026727
46182 1026727 1031802 1035975 1039374 1042436 1045352 1047979 1050215 1052450 1055578 1060263 1066171 1072198 1077548 1082271
46168 1082271 1086748 1091188 1095856 1101219 1107454 1114186 1121119 1128484 1136426 1144443 1152026 1159470 1167363 1175565
46154 1175565 1183541 1191539 1200400 1209984 1218766 1225528 1230923 1236765 1244173 1252874 1262022 1271104 1280100 1289224
46140 1289224 1298625 1308187 1317654 1327074 1336969 1347777 1359263 1370787 1382156 1393902 1406562 1419915
46128 1419915 1433129 1445560 1457225 1468608 1480194 1492215 1504601 1517043 1529216 1541080 1552914
46117 1552914 1564949 1577071 1589024 1600801 1612623 1624554 1636396 1647987 1659357 1670485 1681164
46106 1681164 1691267 1700993 1710669 1720504 1730646 1741290 1752475 1763915 1775257 1786432 1797549 1808538
46094 1808538 1819160 1829385 1839484 1849684 1859869 1869694 1878885 1887412 1895460 1903231 1910690 1917585 1923778
46081 1923778 1929460 1934889 1940076 1944974 1949855 1955132 1960770 1966283 1971476 1976799 1982656 1988730 1994511 2000318
46067 2000318 2007106 2015105 2023299 2030681 2037527 2044770 2052494 2059953 2067095 2075087 2084779 2095406 2105523
46054 2105523 2114826 2124209 2134179 2144121 2153261 2161672 2169995 2178678 2187832 2197458 2207519 2217938 2228755
46041 2228755 2240076 2251852 2263953 2276499 2289691 2303271 2316628 2329614 2342739 2356261 2369546
46030 2369546 2381789 2393013 2403916 2415026 2426448 2438246 2450596 2463638 2477452 2491965 2506597
46019 2506597 2520389 2533016 2545514 2559511 2575789 2594005 2613530 2633924 2654624 2674935 2694646
46008 2694646 2714313 2734672 2755942 2777756 2799552 2821034 2842458 2864397 2886959 2909370 2930677
45997 2930677 2950823 2970529 2990210 3009481 3027787 3044964 3061038 3075983 3089921 3103070 3115202
45986 3115202 3125599 3133985 3141245 3148764 3157151 3165911 3174240 3181865 3189135 3196586 3204460 3212573 3220628 3228572
45972 3228572 3236460 3244048 3250889 3256991 3263042 3269644 3276593 3283192 3289057 3294238 3298706 3302301 3305285 3308487
45958 3308487 3312550 3317277 3321949 3326192 3330244 3334417 3338588 3342356 3345442 3347766 3349275 3350015 3350358 3350788 3351263
45943 3351263 3351033 3349328 3346131 3342009 3337323 3331901 3325455 3318020 3309952 3301759 3294039 3287288 3281591 3276653
45929 3276653 3272237 3268401 3265226 3262513 3259893 3257155 3254335 3251617 3249186 3247050 3244862 3242068 3238417 3234229
45915 3234229 3230066 3226225 3222620 3219034 3215265 3211164 3206777 3202406 3198323 3194424 3190419 3186380 3182911 3180529
$$ [...]
##END NTUPLES=NMR SPECTRUM
##END=
