
##TITLE=AC1296_UGARS11108_6615178_16VFo8Pvjh
##JCAMPDX= 6.0         $$ Bruker NMR JCAMP-DX V2.0
##DATA TYPE= NMR SPECTRUM
##DATA CLASS= NTUPLES
##ORIGIN= BRUKER
##OWNER= Administrator
$$ 1.72 TOPSPIN		Version 2.1
$$ 2012-08-03 03:41:29.734 -0500  Administrator@TOPSPIN
$$ Compression mode = diff/dup
##.OBSERVE FREQUENCY= 400.02188249412
##.OBSERVE NUCLEUS= ^1H
##.ACQUISITION MODE= SIMULTANEOUS (DQD)
##.ACQUISITION SCHEME= undefined
##.AVERAGES= 8
##.DIGITISER RES= 22
##SPECTROMETER/DATA SYSTEM= spect
##.PULSE SEQUENCE= zg30
##.SOLVENT NAME= COFFEE_meoh
##.SHIFT REFERENCE= INTERNAL, COFFEE_meoh, 1, 14.98509
##AUDIT TRAIL= $$ (NUMBER, WHEN, WHO, WHERE, PROCESS, VERSION, WHAT)
$$ ##TITLE= Audit trail, TOPSPIN		Version 2.1
$$ ##JCAMPDX= 5.01
$$ ##ORIGIN= Bruker BioSpin GmbH
$$ ##OWNER= Administrator
$$ $$ C:\Bruker\TOPSPIN/data/COFFEE/nmr/AC1296_UGARS11108_6615178_16VFo8Pvjh/20/pdata/1/auditp.txt
$$ ##AUDIT TRAIL=  $$ (NUMBER, WHEN, WHO, WHERE, PROCESS, VERSION, WHAT)
(   1,<2012-08-03 03:41:23.015 -0500>,<Administrator>,<TOPSPIN>,<go>,<TOPSPIN 2.1>,
      <created by zg
	started at 2012-08-03 03:40:16.437 -0500,
	POWCHK enabled, PULCHK disabled,
       configuration hash MD5:
       6B 1B 68 BB D9 2E 58 E2 7F 35 AD 54 07 DF 0E 41
       data hash MD5: 64K
       DE A6 AD 9D F1 FA EC 2E 17 1E 0B D8 D2 9C D7 DB>)
(   2,<2012-08-03 03:41:25.750 -0500>,<Administrator>,<TOPSPIN>,<proc1d>,<TOPSPIN 2.1>,
      <Start of raw data processing
       efp LB = 0 FT_mod = 6 PKNL = 1 PHC0 = 0 PHC1 = 0 SI = 32K 
       data hash MD5: 32K
       F1 20 4F 3A 79 D0 71 4C 7D 00 B9 ED 42 67 71 1B>)
(   3,<2012-08-03 03:41:26.109 -0500>,<Administrator>,<TOPSPIN>,<proc1d>,<TOPSPIN 2.1>,
      <pk PHC0 = 180.3516 PHC1 = 0 
       data hash MD5: 32K
       FA 90 55 17 4C 7B 34 A5 47 AE BA EC 22 26 3E 71>)
(   4,<2012-08-03 03:41:26.156 -0500>,<Administrator>,<TOPSPIN>,<proc1d>,<TOPSPIN 2.1>,
      <abs ABSG = 1 
       data hash MD5: 32K
       C3 82 0D F3 C7 20 FD 04 46 0A 3C 6E 1B 35 13 C0>)
(   5,<2012-08-03 03:41:26.187 -0500>,<Administrator>,<TOPSPIN>,<proc1d>,<TOPSPIN 2.1>,
      <abs ABSG = 2 
       data hash MD5: 32K
       98 AC 1E 25 F8 42 7D E1 CB 69 D7 D0 94 47 6F 7B>)
(   6,<2012-08-03 03:41:26.218 -0500>,<Administrator>,<TOPSPIN>,<proc1d>,<TOPSPIN 2.1>,
      <abs ABSG = 3 
       data hash MD5: 32K
       B8 C4 CF CB 79 91 2F A0 2C B1 B7 65 8D D7 E4 BF>)
(   7,<2012-08-03 03:41:26.250 -0500>,<Administrator>,<TOPSPIN>,<proc1d>,<TOPSPIN 2.1>,
      <abs ABSG = 4 
       data hash MD5: 32K
       F7 8C AA CC 6F 15 59 04 45 5C 35 0F 3E D3 CC 58>)
(   8,<2012-08-03 03:41:26.281 -0500>,<Administrator>,<TOPSPIN>,<proc1d>,<TOPSPIN 2.1>,
      <abs ABSG = 5 
       data hash MD5: 32K
       96 69 A8 49 9D 20 51 75 FF 11 2F 46 74 66 A4 1E>)
$$ ##END=
$$ 
$$ $$ hash MD5
$$ $$ C2 B9 12 FD 41 B1 5A 07 6F 90 B7 AD 5F CB 68 DC
##$RELAX= 
##$RELAX= 
##$RELAX= 
##$RELAX= 
##$RELAX= 
##$RELAX= 
##$RELAX= 
$$ Bruker specific parameters
$$ --------------------------
$$ [...]
150 150 150 150 150 150 150 150
##$TP07= 0
##$TPNAME0= <>
##$TPNAME1= <>
##$TPNAME2= <>
##$TPNAME3= <>
##$TPNAME4= <>
##$TPNAME5= <>
##$TPNAME6= <>
##$TPNAME7= <>
##$TPOAL= (0..7)
0.5 0.5 0.5 0.5 0.5 0.5 0.5 0.5
##$TPOFFS= (0..7)
0 0 0 0 0 0 0 0
##$TUNHIN= 0
##$TUNHOUT= 0
##$TUNXOUT= 0
##$USERA1= <user>
##$USERA2= <user>
##$USERA3= <user>
##$USERA4= <user>
##$USERA5= <user>
##$V9= 5
##$VALIST= <valist>
##$VCLIST= <CCCCCCCCCCCCCCC>
##$VD= 0
##$VDLIST= <DDDDDDDDDDDDDDD>
##$VPLIST= <PPPPPPPPPPPPPPP>
##$VTLIST= <TTTTTTTTTTTTTTT>
##$WBST= 1024
##$WBSW= 4
##$XGAIN= (0..3)
0 0 0 0
##$XL= 0
##$YL= 0
##$YMAX_a= 494231
##$YMIN_a= -643873
##$ZGOPTNS= <>
##$ZL1= 120
##$ZL2= 120
##$ZL3= 120
##$ZL4= 120
##$ABSF1= 14.98509
##$ABSF2= -5.573092
##$ABSG= 5
##$ABSL= 3
##$ALPHA= 0
##$AQORDER= 0
##$ASSFAC= 0
##$ASSFACI= 0
##$ASSFACX= 0
##$ASSWID= 0
##$AUNMP= <proc_prof1d_extract_pilot.lims>
##$AXLEFT= 0
##$AXNAME= <>
##$AXNUC= <1H>
##$AXRIGHT= 0
##$AXTYPE= 0
##$AXUNIT= <>
##$AZFE= 0.1
##$AZFW= 0.1
##$BCFW= 0
##$BC_mod= 0
##$BYTORDP= 0
##$COROFFS= 0
##$CY= 15
##$DATMOD= 1
##$DC= 0
##$DFILT= <>
##$DTYPP= 0
##$F1P= 0
##$F2P= 0
##$FCOR= 0.5
##$FTSIZE= 32768
##$FT_mod= 6
##$GAMMA= 0
##$GB= 0
##$INTBC= 1
##$INTSCL= 1
##$ISEN= 128
##$LB= 0
##$LEV0= 0
##$LPBIN= 0
##$MAXI= 10000
##$MC2= 0
##$MEAN= 0
##$ME_mod= 0
##$MI= 0
##$NCOEF= 0
##$NC_proc= -8
##$NLEV= 6
##$NOISF1= 0
##$NOISF2= 0
##$NSP= 0
##$NTH_PI= 0
##$NZP= 0
##$OFFSET= 14.98509
##$PC= 1
##$PHC0= 180.3516
##$PHC1= 0
##$PH_mod= 1
##$PKNL= yes
##$PPARMOD= 0
##$PPDIAG= 0
##$PPIPTYP= 0
##$PPMPNUM= 2147483647
##$PPRESOL= 1
##$PSCAL= 4
##$PSIGN= 0
##$PYNMP= <proc.py>
##$REVERSE= no
##$SF= 400.02
##$SI= 32768
##$SIGF1= 0
##$SIGF2= 0
##$SINO= 400
##$SIOLD= 32768
##$SPECTYP= <>
##$SREGLST= <1H.CDCl3>
##$SSB= 0
##$STSI= 32768
##$STSR= 0
##$SW_p= 8223.68421052631
##$SYMM= 0
##$S_DEV= 0
##$TDeff= 65536
##$TDoff= 0
##$TI= <>
##$TILT= no
##$TM1= 0
##$TM2= 0
##$TOPLEV= 0
##$USERP1= <user>
##$USERP2= <user>
##$USERP3= <user>
##$USERP4= <user>
##$USERP5= <user>
##$WDW= 1
##$XDIM= 32768
##$YMAX_p= 460975195
##$YMIN_p= -712943
##$CURPLOT= <Network HP LaserJet P1505>
##$CURPRIN= <$Network HP LaserJet P1505>
##$DFORMAT= <normdp>
##$LAYOUT= <+/1D_H.xwp>
##$LFORMAT= <normlp>
##$PFORMAT= <normpl>
##$SURQMSG= 1
$$ End of Bruker specific parameters
$$ ---------------------------------
##NTUPLES= NMR SPECTRUM
##VAR_NAME=  FREQUENCY,     SPECTRUM/REAL,   SPECTRUM/IMAG
##SYMBOL=    X,             R,               I
##VAR_TYPE=  INDEPENDENT,   DEPENDENT,       DEPENDENT
##VAR_FORM=  AFFN,          ASDF,            ASDF
##VAR_DIM=   32768,         32768,           32768
##UNITS=     HZ,            ARBITRARY UNITS, ARBITRARY UNITS
##FACTOR=    0.250966925370066, 1,           1
##FIRST=     8223.43324360094, -24257,       -108410
##LAST=      0,             56363,           -277470
##MIN=       0,             -712943,         0
##MAX=       8223.43324360094, 460975195,    0
$$ Real data points
##PAGE= N=1
##DATA TABLE= (X++(R..R)), XYDATA
$$ [...]
19475b29978d6217C67522a06869M4475k7635d2260B87862h6345o4075A13602d2951
19463a04900G4769a49760j56177a20028e4215k00552J03204L6847r280j56866
19453b80862H7585a83189b1798N500k78129h0448k30131a00751d915B49274c63549
19441a29004j19302D7989O7787c34935a27496f2829D4555b46209K8025j35559
19431c53743A0815g8172A15967P4443R8263a99225P0027e7145I121b20785P3853
19420a46932o575j99601a25078o8004j12257H2750h2543J5426k7213l9640A24925
19408B42531d0651j73704C7211b50368D3409a26251A9585a23246C4145j2503b57206
19396I6573a93590j74808d763j68395L1306A08695a29938d4058F2338a03887B32483
$$ plain form
19475 -229978 -46217 367522 -106869 -62394 -90029 -42260 287862 -86345 -150420 113602 -42951
19463 -104900 74769 -149760 -305937 -120028 -54215 -254767 -151563 -114716 -123996 -280862
19453 -280862 87585 -183189 -21798 -16298 -294427 -80448 -310579 -100751 -4915 249274 -363549
19441 -129004 -248306 47989 115776 -334935 -127496 -62829 44555 -246209 -218184 -353743
19431 -353743 10815 -78172 115967 190410 288673 -199225 -129198 -57145 9121 -220785 -146932
19420 -146932 -153507 -353108 -125078 -193082 -305339 82750 -82543 -67117 -94330 -133970 124925
19408 242531 -40651 -214355 37211 -250368 43409 -126251 19585 -123246 34145 21642 -257206
19396 96573 -193590 -368398 -4763 -173158 -141852 108695 -129938 -44058 62338 -103887 232483
19384h6403B41332b9040h278j51918G7822l3134i8488o2579P9602B2390d20742
19372a08972C0559a50747j28376I2007j2282c58181a5505k32636P3477H6297b1684
19360f7374F3911f4240e065k73433a20558d9729C8425b78691d9217K2940D5773
19348b10163g0507l72188A54540c45856f3608A4314K80995b56897j6618j81762
19338d55277a44051k6801h0563a7984j03205k3808a5261p4398j70431C8770e4920
19326G4118J42808b2385B6041a1220k87034A63512a95590Q8922b8950A91251a19413
19314A98209C685c7074l2559b75r7927p6805P7274C08440h333J754A30062i6095
19301A03299b11033B07359b08546M277n5477f585o5440E9283g6161a1939j35656
$$ plain form
19384 -86403 241332 -29040 -8278 -160196 77822 44688 -98488 -161067 -81465 22390 -420742
19372 -108972 30559 -150747 -279123 92007 79725 -358181 -15505 -248141 -174664 86297 -21684
19360 -67374 63911 -64240 -5065 -278498 -120558 -49729 38425 -278691 -49217 -26277 45773
19348 -210163 -70507 -442695 154540 -345856 -63608 14314 295309 -256897 -273515 -455277
19338 -455277 -144051 -170852 -80563 -17984 -121189 -144997 -15261 -89659 -260090 38770 -54920
19326 74118 216926 -22385 26041 -11220 -298254 163512 -195590 -106668 -28950 191251 -119413
19314 198209 3685 -37074 -69633 -275 -98202 -175007 -97733 308440 -8333 -6579 130062 -96095
19301 103299 -211033 207359 -208546 -204269 -259746 -6585 -72025 59283 -76161 -11939 -147595
19290a47595E3402e7765F0975a25208C5150a16539J4219J2694D531b10089B5624
19278i2760k07959A89251M8139b36914K982A5480a07355A30206D5095a35739j49101
19267b84840L7627h4543A71473c6267G4982b09328b5811n881C57459b92497A04822
19255f8670A23436c4020J0425B02103a29768A32618h2752B46074F0568a13897
19244A32665b36788k27087R6281B16026b11496D1806N2297e11584H5508e18946
19233A84778b67869M047K3013J10858H317J66854e8309A6222K3175L5467a50228
19221A4517O2405M3158c04466g1175p6929j7381d3755B10529a90955f8086A63775
19209D6674i2139I031a5917k23603B0533a35689B5718q30d0571j98052L7003A62407
$$ plain form
19290 -147595 53402 -57765 60975 -125208 35150 -116539 -102320 -89626 4531 -210089 25624
19278 -92760 -300719 189251 237390 -236914 -233932 15480 -107355 130206 45095 -135739 -284840
19267 -284840 -247213 -84543 171473 -36267 74982 -209328 -25811 -31692 357459 -292497 104822
19255 -68670 123436 -34020 -23595 202103 -129768 132618 -82752 246074 60568 -113897
19244 132665 -236788 -463875 -367594 216026 -211496 41806 94103 -511584 85508 -518946
19233 184778 -267869 -263822 -240809 -129951 8317 175171 -58309 16222 39397 74864 -150228
19221 14517 76922 120080 -304466 -71175 -148104 -165485 -43755 210529 -190955 -68086 163775
19209 46674 -92139 9031 -15917 -239520 20533 -135689 25718 24888 -40571 -238623 -201620 162407
19196g3559f005B17650G16c35655E3670J68122b79886c3601j40403J8611j07R272
19184a46228Ch3966A4634b80521F6170C0848b50952e9500l01632E4398a40196
19172a6686l9480l23911a33306r4061P6701e6194A72775a33463M335F3006f5090
19160a59491j16212o385A60844b58668R2527c9710k81648j27158Q2605a74053
19149F9758h0245n127F648R189b74533b9794p0912A34432E9199b12565j04138
19138c16703A21784C5566b5231A99954H0724J95676f0709j9329A7452b23959D9936
19126I6973i7880k35213g6199j07773b0179j05467A52958f1814G5797a49728m6125
19115a95853B03234N2678a29863j50398b7545A43454h0889J4134A66577a12631
$$ plain form
19196 -73559 -6005 217650 716 -335655 53670 221792 -279886 -33601 -174004 -155393 -155500 -146228
19184 -146228 3 -83966 14634 -280521 66170 30848 -250952 -59500 -361132 54398 -140196
19172 -16686 -56166 -380077 -133306 -227367 -150666 -56194 172775 -133463 -129128 63006 -65090
19160 -159491 -275703 -282088 160844 -258668 -166141 -39710 -321358 -448516 -365911 -174053
19149 69758 -80245 -85372 6648 15837 -274533 -29794 -100706 134432 59199 -212565 -316703
19138 -316703 121784 35566 -25231 199954 80724 276400 -60709 -80038 17452 -223959 49936
19126 96973 -97880 -333093 -76199 -183972 -20179 -125646 152958 -61814 75797 -149728 -195853
19115 -195853 203234 255912 -129863 -280261 -27545 143454 -80889 -66755 166577 -112631
19104A93472c00120C7138P8519M1364j4735a14002M9732c0959m70092a34463p2389
19093b06852p4655C08149a82701B0638M9007a30665A62440a02347J9453F4856
19082E6031b88877A41214b53704D7528A1559b04314K6624B24123a78818p7108
19072b55926J13650k48618J39337g2448m687j21947A30220e6067C9908K5601Q7884
19061A53393c05765f0965G8433a032k32799p3408A6825d0207A71271d5566H4983
19049b27927l0128g0666m8776a7157j31785O812n5020D02749b2249k2482b2251
19037h7081A06391j4275a80385C3547b66794r178I5535C8099b4272m7629j12165
19026a84066j10713a44461f6858r4205o471m8066F6718b9959F9100c0136r0145
$$ plain form
19104 193472 -300120 37138 115657 157021 142286 -114002 -64270 -30959 -501051 -134463 -206852
19093 -206852 -281507 308149 -182701 20638 69645 -130665 162440 -102347 -82894 64856
19082 56031 -288877 141214 -253704 47528 11559 -204314 -177690 224123 -178818 -255926
19072 -255926 -142276 -390894 -251557 -72448 -77135 -199082 130220 -56067 39908 65509 153393
19061 153393 -305765 -60965 78433 -1032 -233831 -307239 16825 -40207 171271 -45566 84983
19049 -227927 -258055 -70666 -119442 -17157 -148942 -142130 -197150 402749 -22249 -44731 -22251
19037 -87081 106391 92116 -180385 33547 -266794 -275972 95535 38099 -24272 -71901 -184066
19026 -184066 -294779 -144461 -66858 -161063 -167534 -215600 66718 -29959 69100 -30136 -120281
19015a20281j03743m1677I6817M8112K01147j59470a08766k65225J53404I8683
19004b87058h805k48194k9228b4489F6567d1392C40395G4663P1012J5342A3415
18992A38189M5252a78002A23114j846L2029M2153A274R5318B7019a84903D36816
18980B52015B2275b59907h6143j7493q5059I5941d77651A51256a99064i1495A64890
18968B54947A894a87169B50522e2918B02336D6609a71654c0942B56021K06610
18958D62631J69131C12190H475K75746D5909I470d24233b07086e7068G5387b98005
18946G7008b52255B62373a1733j32293l60335a13777B21651a13806m983o4675
18936a83464N0733M4360a276o890j11272p5043A14018K92218D424K52714b59825
$$ plain form
19015 -120281 -224024 -265701 96817 144929 346076 186606 -108766 -373991 -220587 98683
19004 -287058 -8805 -256999 -286227 -24489 66567 -41392 340395 74663 145675 161017 13415
18992 138189 183441 -178002 123114 121268 153297 195450 1274 96592 27019 -184903 436816
18980 252015 22275 -259907 -86143 -103636 -188695 95941 -477651 151256 -199064 -91495 164890
18968 254947 1894 -187169 250522 -52918 202336 46609 -171654 -30942 256021 462631
18958 462631 631762 312190 8475 284221 45909 9470 -424233 -207086 -57068 75387 -298005
18946 77008 -252255 262373 -11733 -144026 -504361 -113777 221651 -113806 -118789 -183464
18936 -183464 -132731 -88371 -1276 -8166 -119438 -194481 114018 406236 4424 257138 -259825
18924A58526Q631q0378i929C6333E181a10681e2682G3224O7875b96567m3243h7960
18911a10606A96624E5070d5240D7928N4311J9707D1093L36268a35593d2283a9129
18899h0912D6998i9988C24617J36476o4171A54578J97461a0507G2473J68846a70088
18887b29459b9952k75988a39561j0660A43091N4194h2369J1379l34192g895o556
18876a4451A53320a79681e720I283g0911a1678j88077G1150K40918a07775j55793
18865b63568A36080d5338j76231K1144F8035b0920k20193C07610F9960a04283
18854A31688J3910A8863f2595H0615A2199K97902b30188L5270P4370A93231m9598
18843A43633a21413B38292a63918C21252a29592j63374j0404C9940J12918f3092
$$ plain form
18924 158526 167157 86779 -9929 36333 5181 -110681 -52682 73224 141099 -296567 -339810 -87960
18911 -110606 196624 55070 -45240 47928 102239 121946 41093 377361 -135593 -42283 -19129
18899 -80912 46998 -99988 324617 461093 396922 154578 352039 -10507 72473 241319 -170088
18887 -229459 -29952 -305940 -139561 -150221 143091 197285 -82369 -70990 -405182 -7895 -14451
18876 -14451 153320 -179681 -5720 9283 -70911 -11678 -199755 71150 312068 -107775 -263568
18865 -263568 136080 -45338 -221569 -200425 68035 -20920 -241113 307610 69960 -104283
18854 131688 145598 18863 -62595 80615 12199 310101 -230188 -194918 -120548 193231 143633
18843 143633 -121413 238292 -163918 321252 -129592 -292966 -303370 39940 152858 -63092
18832A49331b59824C46634a36629b9385p608B1057e1786b0724m7618L1512j77552
18821b14382p5763a33210F1419a83421k40564A18877f6895D91350b07317c306
18810a30432A60829g4615i381F3625d0757q6045B08545b18829A38007M8344c52235
18798a61991I7799d9950r0377p4315I7977k580D6135c1240j29918b762B20261
18786a47548d2071l9653A99163G3293e2440k4174A65882a70591G6419e1874j0757
18775f2631A21876p505J26596a47346k2095H7222a18423j22556h5017A55545e2700
18763A38118b9737j14818E4260O322J71461a83119f9010B20566a8891A4010a21729
18751f0162C0504b13744F4968b35818H3748B0612O6882b29777f6549j85593Q4054
$$ plain form
18832 149331 -259824 346634 -136629 -29385 -36993 21057 -51786 -20724 -68342 -36830 -214382
18821 -214382 -290145 -133210 61419 -183421 -423985 118877 -66895 491350 -207317 -3306
18810 -130432 160829 -74615 -9381 63625 -40757 -126802 208545 -218829 138007 186351 -352235
18798 -161991 97799 -49950 -140327 -214642 97977 95397 46135 -31240 -161158 -2762 220261
18786 -147548 -42071 -81724 199163 73293 -52440 -76614 165882 -170591 76419 -51874 -62631
18775 -62631 121876 114371 240967 -147346 -169441 87222 -118423 -240979 -85017 155545 -52700
18763 138118 -29737 -144555 54260 60582 232043 -183119 -69010 220566 -18891 14010 -121729
18751 -60162 30504 -213744 64968 -235818 83748 20612 87494 -229777 -66549 -252142 -168088
18740a68088k35248A34561e4837b3280j20560B26230a23892C41632a43171B6241
18729a57612k66437C795a32603j40326M4084B66g6538D0944a38360K3986e1174
18717F9191b93329a01460j43647d3838A4962K11190e6017D2243P8625j71o83b65076
18704b93222c025j98882m8494A48426G2387c62899e9513m36107f7904j58886B1573
18692i4895j21456c8757F7733b67728i6990B28058a13650c2632B64674D008J33396
18681A37404a76897C8266b11457d8791j57433d4398B79873I3610a38892j12353
18671b51245J2748j3681J22849A32167b94828A12688C292c13293E7962f8578K4153
18660d4425A14003b78388O7890C45652a33630j83391A1697J00760f1092e737k19124
$$ plain form
18740 -168088 -403336 134561 -54837 -23280 -143840 226230 -123892 341632 -143171 26241
18729 -157612 -424049 3795 -132603 -272929 -228845 266 -76538 40944 -138360 -114374 -51174
18717 69191 -293329 -101460 -245107 -43838 14962 226152 -56017 42243 120868 120697 120014 -265076
18704 -293222 -3025 -201907 -250401 148426 72387 -362899 -59513 -495620 -67904 -226790 21573
18692 -94895 -216351 -38757 67733 -267728 -96990 228058 -113650 -32632 264674 4008 137404
18681 137404 -176897 38266 -211457 -48791 -206224 -44398 279873 93610 -138892 -251245
18671 -251245 -238497 -252178 -129329 132167 -294828 112688 3292 -313293 57962 -68578 -44425
18660 -44425 114003 -278388 -210498 345652 -133630 -317021 11697 112457 -61092 -5737 -224861
18649b24861I2794B8959R4883l7134d45613M3948g2616B1759c8801A6849a09759
18637c28167f0825j00071A32821a81931f4188A90494D0101K3972K5028i8777j39056
18626b37833J16602j39267P3346J11H6626c491B35264a34675B13608D612a453
18614a50556J5755k2614O6316B03287a31214H3594a00323j89118c5812m8672p3940
18603a58424M0988k31537G0206a87652H9546N7815h7649R853r3530B19907e5962
18591i6532I728K10659b84754g5827E0913a30276b4546j61777M1398p3832A09518
18579A13177c16183a01378l9839f5906H2351J10801f3781E2112b22866e5197E1281
18567A86737a60275A88537d85030a38262A06325a85399j6564B61859i8411n8078
$$ plain form
18649 -224861 92794 28959 123842 86708 -445613 -401665 -72616 21759 -38801 16849 -109759
18637 -328167 -60825 -160896 132821 -181931 -64188 190494 40101 64073 89101 -98777 -237833
18626 -237833 -121231 -260498 -187152 -187041 86626 -3491 235264 -134675 213608 4612 -1453
18614 -150556 -134801 -157415 -91099 203287 -131214 83594 -100323 -289441 -35812 -84484 -158424
18603 -158424 -117436 -348973 70206 -187652 89546 147361 -87649 -77796 -171326 219907 -55962
18591 -96532 9728 220387 -284754 -75827 50913 -130276 -24546 -186323 -144925 -218757 109518
18579 113177 -316183 -101378 -141217 -65906 82351 193152 -63781 52112 -222866 -55197 51281
18567 186737 -160275 188537 -485030 -138262 106325 -185399 -201963 261859 -98411 -156489
18557a56489j73176i4158L7211a9312A68035A3245P1179b23194B06135m4768K79174
18546D40541a3840k0022m2868H977g6767b2755m3262C771d4144I5122a22381k38470
18534c60851a28179j69676J44142C97465G2224b15985C40842I341b3728m32282
18524d56010A69878h3785A8338c8539B8101k422a86811j55041A95531a77400h4563
18512f2007B58606d22181B9833J61228a79938F0583a16821j01623h522j25875
18502a34397G9198b98240f010A16441a41584A21903c93072B49384a27874A76827
18491A88101K00649j83844M0640G3790J3630d07328J94336k14602A57588a04025
18480a49751G1h9819F7272a19478E7863h212j52277A75785E3860a12883j0148
$$ plain form
18557 -156489 -329665 -94158 -56947 -19312 168035 13245 84424 -223194 206135 161367 440541
18546 440541 -13840 -33862 -76730 8977 -76767 -22755 -66017 3771 -44144 95122 -122381 -360851
18534 -360851 -128179 -297855 -153713 397465 72224 -215985 340842 9341 -23728 -456010
18524 -456010 169878 -83785 18338 -38539 28101 25679 -186811 -341852 195531 -177400 -84563
18512 -62007 258606 -422181 29833 191061 -179938 60583 -116821 -218444 -8522 -134397
18502 -134397 79198 -298240 -6010 116441 -141584 121903 -393072 249384 -127874 176827
18491 188101 388750 204906 245546 73790 87420 -407328 -212992 -427594 157588 -104025
18480 -149751 71 -89819 67272 -119478 57863 -8212 -160489 175785 53860 -112883 -123031
18469a23031m7751B45252c2373j08919A05362C3077J36967E2230J19162J5542
18459A86934E38a32583J7985I8426R9543a66175m5487G4835h0164F2502M2095
18448A04597C9078a84768B1712q199a29129o3535g0764b9850a3033A5010a90984
18436B3612R1625d89493h9323D3951h1240m6782A25150a70927A10810H483a06247
18424A11027a02312j03734B39594b78013a7710m57636B1818L6922b6566B67822
18413B3944d05116C2250M4045h2322A35048k0963B8799L88040a65371f3202B89293
18401a35108k96346P5722B53857j6667A00765c3407A76853q5931C8161e2756n5997
18390a08753L1725l48404J24250L7876L6402I13i0202j76698C741e3697I9842
$$ plain form
18469 -123031 -170782 245252 -32373 -141292 105362 33077 170044 52230 171392 186934
18459 186934 538 -132583 -114598 98426 197969 -166175 -211662 74835 -80164 62502 104597
18448 104597 39078 -184768 21712 13513 -129129 -192664 -70764 -29850 -13033 15010 -190984
18436 23612 115237 -489493 -89323 43951 -81240 -128022 125150 -170927 110810 8483 -106247
18424 111027 -102312 -206046 239594 -278013 -17710 -475346 21818 58740 -26566 267822
18413 23944 -405116 32250 76295 -82322 135048 114085 28799 416839 -165371 -63202 289293
18401 -135108 -431454 -355732 253857 237190 100765 -33407 176853 90922 38161 -52756 -108753
18390 -108753 -77028 -425432 -301182 -263306 -226904 913 -90202 -266900 3741 -53697 99842
18378B13257e3197A30512c67D27081b4273j90658A3509d71903i8592k47008J54875
18367a90725A52684l6159n1930i8652I2324J41854e81545d5114C1831M1519b7643
18355b58987c0450j3177A55054E6119A0306a66126A24163A724g6449k89716C009
18343a41872G088a17830B4968h484j04166E1896K44302J15169a44937n3486k36078
18332d34501i5737l86653E1034d3295H0855b06123d7217B35172a52018C2564P4161
18321A06725C4459J54211D680c09666j38667A59399a97394a1904o7428k84135
18311c63467i5010A26140n1255a27818l9557L3057k07283A32913a42401d3461
18300a15130j31341A64615a04086j17101a7979A39168R7858d2126j7597A75976
$$ plain form
18378 213257 -53197 130512 -367 427081 -24273 -214931 13509 -471903 -98592 -345600 -190725
18367 -190725 152684 116525 64595 -98652 92324 234178 -581545 -45114 31831 73350 -27643
18355 -258987 -30450 -43627 155054 56119 10306 -166126 124163 1724 -76449 -366165 3009
18343 -141872 7088 -117830 24968 -8484 -112650 51896 296198 411367 -144937 -198423 -434501
18332 -434501 -95737 -482390 51034 -43295 80855 -206123 -47217 235172 -152018 32564 106725
18321 106725 34459 188670 4680 -309666 -448333 159399 -197394 -11904 -79332 -363467
18311 -363467 -95010 126140 74885 -127818 -167375 -134318 -341601 132913 -142401 -43461
18300 -115130 -246471 164615 -104086 -221187 -17979 139168 237026 -42126 -59723 175976
18289a59203B22058g9340j90542e4792r998k54365a00364A58252f9710F1440B2106
18277B6389a21872d7085r6140B50265a97411H1363b05385B11358b25595H0479
18266b05726E6966J0139J30567c11544A64830a24235j5784H6981C1117c2995A01805
18254a4066H1500b14879H5840a50436q1348P4055l2489d7632A611P1874b00362
18242d5475l1669h610q7089b7295p5647e0290D09088b79267B74774n9179b793
18230b26338G8758L48110c6563k2371B31672b8826j29037L592p5668O9301A29764
18218d2078n4459k37087b9458A727M6440b2690l85979e4961B53303l9395q1258
18207A32650b10012d5817m69887f2455A69655k6972F4950K26069f2436J9442n2503
$$ plain form
18289 -159203 222058 -79340 -269882 -54792 -64790 -319155 -100364 158252 -69710 61440 22106
18277 26389 -121872 -47085 -143225 250265 -197411 81363 -205385 211358 -225595 80479
18266 -205726 56966 67105 197672 -311544 164830 -124235 -140019 86981 31117 -32995 101805
18254 -14066 81500 -214879 85840 -150436 -231784 -157729 -190218 -47632 1611 73485 -200362
18242 -45475 -77144 -8610 -95699 -27295 -102942 -50290 409088 -279267 274774 215595 -2793
18230 -226338 78758 426868 -36563 -58934 231672 -28826 -157863 -154271 -229939 -160638 129764
18218 -42078 -96537 -333624 -29458 1727 48167 -22690 -408669 -54961 253303 213908 132650
18207 132650 -210012 -45817 -515704 -62455 169655 142683 64950 291019 -62436 -42994 -95497
18196i5497A43732h9968G6049J1210c71749a01039A56373J16213c0560C92063
18185A9573K9824L9731a70415A00426b28954a13112l9958e7103B28296m9679m3991
18174A34626k8742a4668o905k8017K1873j0024g585j07746N6879D16997A18029
18162B16587c98664J35069a02002C09088A19175a52163B219N3088e4344m3257
18152i7601O281A86908a12864B2681J03490a17506r8252F6000J72850b8164K204
18141b5960F6645c4395H2763f3431L0615q8373O423o5965g7807r5301d2356j65361
18129b07717G282K42107a52386A92445A9350b54251A34057l890R2793G3197b15991
18117B42780l4136K9558n449i8263A70966i8894A93474I4590a01389E6632a143
$$ plain form
18196 -95497 143732 -89968 76049 87259 -371749 -101039 156373 272586 -30560 392063
18185 19573 49397 89128 -170415 100426 -228954 -113112 -153070 -57103 228296 178617 134626
18174 134626 105884 -14668 -21573 -49590 -27717 -37741 -7585 -115331 -58452 416997 118029
18162 216587 -398664 -263595 -102002 309088 119175 -152163 2219 55307 -54344 -97601
18152 -97601 -91320 186908 -112864 22681 126171 -117506 -215758 66000 238850 -28164 -25960
18141 -25960 66645 -34395 82763 -63431 -32816 -121189 -114766 -180731 -77807 -173108 -42356 -207717
18129 -207717 7282 249389 -152386 192445 19350 -254251 134057 130167 222960 73197 -215991
18117 242780 208644 238202 232753 -98263 170966 -98894 193474 94590 -101389 56632 -1143
18105a92418F9709Q2069m0995J99705b04326e7368j24961B97755c01296A14959
18094a48110J5553d7718j49802A95581e7302J9389j06614A6282L6578K50801A25367
18082C3123f8453j38062C05141A40690b07550b7274j8453B67546o2955C4344a00113
18070A27525e9251B210a1725B39286q7403b79229a4346k66473E0722c23436l4001
18059c57437C02143A24727D3567b8470F5835Q7671b34105J16049B30985i3879
18048A70288a83872P5482K8287J7317q0290B61427h0682c7084A81494G515b6430
18036A26609B7410L6128a78977l1180A15468B9022a43511a6025B7078a13290k6047
18025a39337B21322b15783B698b67893h5090D6376c08157J18769B9160b75403
$$ plain form
18105 -192418 69709 151778 110783 310488 -204326 -57368 -182329 297755 -301296 114959
18094 -148110 -132557 -47718 -197520 195581 -57302 -37913 -144527 16282 52860 303661 125367
18082 33123 -68453 -206515 305141 140690 -207550 -27274 -45727 267546 204591 34344 -100113
18070 127525 -59251 2210 -11725 239286 151883 -279229 -14346 -280819 50722 -323436 -357437
18059 -357437 302143 124727 43567 -28470 65835 153506 -234105 -118056 230985 -93879
18048 170288 -183872 -108390 -80103 -62786 -143076 261427 -80682 -37084 181494 7515 -26430
18036 126609 27410 63538 -178977 -210157 115468 29022 -143511 -16025 27078 -113290 -139337
18025 -139337 221322 -215783 2698 -267893 -85090 46376 -308157 -189388 29160 -275403
18014c3455G4383K01048j37377K3103a71169k0852M153P1650B75409e3852C20486
18002A05852N6980L14521A52488F8200d2979q8359A2105a48360A86452m5078g7037
17990B51052a71954P8648F5636J7672a31905C817b48293b1507q0563b017B11937
17978B50444b7894l00264C451d1631B0861c484p0153A37223D5485c39082J08688
17967b30394O1145H4254K40590A18486a844A35932a67197a1213j59108A6489a81921
17955d531A14416J06983D6866a81019H8952a81107b7864A08413K8272l6795C6331
17943d6040n5140A81353b242C1552M54572H0678R1896a79047B05329E0717i9578
17931A91829G3214b71302h1900B1294d4578A30414A280R4128a12384g032B89872
$$ plain form
18014 -33455 74383 275431 138054 161157 -171169 -192021 -187868 -116218 275409 -53852 320486
18002 105852 162832 477353 152488 68200 -42979 -131338 12105 -148360 186452 141374 -77037
17990 251052 -171954 -93306 65636 83308 -131905 3817 -248293 -21507 -102070 -2017 211937
17978 250444 -27894 -328158 3451 -41631 20861 -3484 -73637 137223 45485 -339082 -230394
17967 -230394 -169249 84254 324844 118486 -1844 135932 -167197 -11213 -170321 16489 -181921
17955 -4531 114416 221399 46866 -181019 88952 -181107 -27864 108413 136685 99890 36331
17943 -46040 -101180 181353 -2242 31552 486124 80678 172574 -179047 205329 50717 -99578
17931 191829 73214 -271302 -81900 21294 -44578 130414 1280 95408 -112384 -7032 289872
17919a81426d2161j44764Q9968o5967A6695J07633m2447g1424n4457A08446a00971
17907a96620A40842b4841j17987C5585a11738A37763j345l7271a90139g6904J0103
17896f6801A02363c16317G8534d3009k5300C7088b20932i6426B96016H4002h9224
17884B14627f7994A21201a54990A81604b4095C1113r779J13205a14078n185F0601
17872A33231E4893a93500B2155f4304k65645B00669n8290c1853r263I0375b18328
17860a96318m9129m8428b7135B24040F0879g2707I3291Q8668e2998a6103B07709
17848C41569a05747B18154i160j47078c2847o9224B8515c20963B4504J96284J92088
17837D12876A37897J48634A9595K52722e7144A10247l1141f9224A90227g0725
$$ plain form
17919 -181426 -42161 -186925 -96957 -162924 16695 124328 81881 -71424 -125881 108446 -100971
17907 -196620 140842 -24841 -142828 35585 -111738 137763 136418 99147 -190139 -76904 -66801
17896 -66801 102363 -316317 78534 -43009 -68309 37088 -220932 -96426 296016 84002 -89224
17884 214627 -67994 121201 -154990 181604 -24095 31113 21334 134539 -114078 -119263 60601
17872 133231 54893 -193500 22155 -64304 -329949 200669 142379 -31853 -41116 90375 -218328
17860 -196318 -245447 -293875 -27135 224040 60879 -72707 93291 181959 -52998 -16103 207709
17848 341569 -105747 218154 -9160 -156238 -32847 -102071 28515 -320963 24504 220788 412876
17837 412876 137897 286531 19595 272317 -57144 110247 79106 -69224 190227 -70725
17826A55341l2320d2918B13147A7458Q3701a01289q3044A17494a57364A04794
17815a3287A35604d95719A45394M7298c39181H1590g2798k6220A78022a00455
17804C3400h670B69070a28411r5821d2083E1839e4328j64576g7491A22447M4849
17793A67296n6754Q7304a17780e3731D04095A3384J6658g3389m27051C1989K75439
17782C07428b3254A66591M8731A02163K8684B9117g0339D03701A03901B6524R3630
17771A20154Q4817r5639a70792j21755A99960a17914q1720A70134d9568k77101
17761c26669c2600B59114j26306A9062K90544B598d6005l09129A37485J53810
17751B91295D5882M16666j08257j03473A07228O4100a22559A50082i9088A48819
$$ plain form
17826 155341 123021 -42918 213147 17458 101159 -101289 -184333 117494 -157364 104794
17815 -13287 135604 -495719 145394 192692 -339181 81590 -72798 -99018 178022 -100455
17804 33400 -8670 269070 -128411 -224232 -42083 51839 -54328 -218904 -77491 122447 167296
17793 167296 110542 197846 -117780 -53731 404095 13384 30042 -73389 -500440 31989 307428
17782 307428 -23254 166591 215322 102163 130847 29117 -70339 403701 103901 26524 120154
17771 120154 204971 109332 -170792 -292547 199960 -117914 -199634 170134 -49568 -326669
17761 -326669 -32600 259114 132808 19062 309606 2598 -46005 -355134 137485 291295
17751 291295 45882 462548 354291 250818 107228 171328 -122559 150082 -99088 148819
17740B59107a1800j68546K1872A83316A7491M4477M13185c41742F5733q658c5520
17728a40288E34333A10536J72212e3364J2794j53860D75416B18335I6525c9950
17717B97179a48180D2363R2198K33256c20226f7283D06375A91983o3927K4007
17707A52063F269J48431d7167r1023o1915g7304A51011E8557M57447k20408E8709
17695B07577l0010l7579A0589J52024e386A85516a36378A82203h3956G6830J44537
17684B21367a05658C3218P1831j5318l6229a68672e8721A41776K47006a9150L42
17673a8808A41516o0565d4117e703A55412c7027A05922a33298f2924A11858K00291
17662C12149r8102e3944B46265h2076I6692L3414c8563B9861a59267E3403j4052
$$ plain form
17740 259107 -11800 -180346 -158474 183316 17491 61968 475153 -341742 65733 57075 -35520
17728 -140288 534333 110536 282748 -53364 -40570 -194430 475416 218335 96525 -39950
17717 297179 -148180 42363 134561 367817 -320226 -67283 406375 191983 128056 152063
17707 152063 6269 154700 -47167 -138190 -200105 -77304 151011 58557 516004 295596 58709
17695 207577 177567 139988 10589 162613 -5386 185516 -136378 182203 -83956 76830 221367
17684 221367 -105658 33218 105049 89731 53502 -168672 -58721 141776 388782 -19150 -18808
17673 -18808 141516 80951 -44117 -5703 155412 -37027 105922 -133298 -62924 111858 312149
17662 312149 214047 -53944 246265 -82076 96692 130106 -38563 29861 -159267 53403 39351
17651C9351b70884A07357M0979J59939d7317j79986M5090B72595j24824i1864
17640A85553o8808J3979J5009J57609A46096L156B2519c80249C5427f8959k4641
17629i3600B97268o4343n5373e9366A84625J545a3998k8082A04884M6728f3277
17617D0357K0192M1118B878J67082H21a09737H3097A3055K37988M3062j15126
17606A78979M1024A2934J43161l0805J21912J01611b14264C30248J6652f4813
17595a35156D3979K16428i1364A7760J80255a92740b3211B98016f82E01737B21968
17583C73400b26291A23874J7137b63279i5967A28821m2225h9485D15740c1072
17572B52458G8750K4403a15456C50637F3243k6725a15501I4306J09646q1022Q1281
$$ plain form
17651 39351 -270884 107357 148336 308275 -47317 -227303 -182213 272595 147771 -91864
17640 185553 116745 130724 145733 303342 146096 149252 22519 -380249 35427 -68959 -93600
17629 -93600 297268 232925 177552 -59366 184625 186170 -13998 -42080 104884 151612 -63277
17617 40357 60549 101667 2878 169960 821 -109737 83097 13055 251043 294105 178979
17606 178979 220003 12934 156095 125290 247202 348813 -214264 330248 346900 -64813
17595 -135156 43979 260407 -91364 17760 198015 -192740 -23211 298016 -682 501737 221968
17583 373400 -226291 123874 141011 -263279 -95967 128821 86596 -89485 415740 -31072
17572 252458 78750 103153 -115456 350637 63243 36518 -115501 94306 203952 122930 204211
17561B04211p3706e4301E3332J73449K70897k02079C4430g3941A76990L0112F7539
17549D00451A83286N7806A10827M1238F7350K4921J30954J95498o3864j16067
17539B38792G3318J07324m9008K62722E8037c9335A77161o5602k1496j0413J25005
17528B04655K01621j49111J67412j02655K14502J65895n088A97797M45017l02268
17518C40546G9884L12812j57185Q9725I0224J36528j5390L732K38398q941J69117
17507F13668k22106N1223l6797j43627L13408B39822C5540Q7389J34455N7390
17497C14774a8180A97125p0093J36677G8134K58482a291B94938n509J29642j37163
17486B81908J02028m9857a44989D52009d2616C41931I8428J10411J31669A01317
$$ plain form
17561 204211 130505 -54301 53332 226781 497678 295599 34430 -73941 176990 207102 67539
17549 400451 183286 241092 110827 152065 67350 92271 223225 418723 354859 238792
17539 238792 73318 180642 131634 394356 58037 -39335 177161 111559 90063 79650 204655
17528 204655 406276 257165 424577 321922 536424 702319 697231 197797 642814 340546
17518 340546 79884 392696 235511 325236 90224 226752 211362 215094 453492 444551 613668
17507 613668 391562 442785 405988 262361 575769 239822 35540 122929 257384 314774
17497 314774 -18180 197125 127032 263709 78134 336616 -1291 294938 289429 419071 281908
17486 281908 383936 334079 -144989 452009 -42616 341931 98428 208839 340508 101317
17475c0486G03189j65389A16914J96696L77719E4623k2908N59127k59433j25686
17465B05723j01644j4652L87957j4233B23274n5446J66218E2833J40506M51220
17455F44559B36879J24390A06961K88229J02870l6634H3531J73169M06213o819
17445F56094j92199j25133J19197r8624l2644l1385J6083J86563A02778Q4501
17435A87279K27842A15307L75537p4632J32823A50814J73601j00974J00599r7847
17425B26193n371L5028j24255K72091k0011Q3236L9818K7678B4093M89066P8301
17414E91460j64906A77527L56942A54297M2098J35120j50193E0973M70598j88249
17404C33322K15314k8925j50104J52487k25670B6337K515K70146a00603A08974
$$ plain form
17475 -30486 703189 537800 116914 313610 691329 54623 31715 590842 331409 205723
17465 205723 104079 89427 477384 463151 223274 167828 334046 52833 193339 644559
17455 644559 236879 361269 106961 395190 498060 461426 83531 256700 662913 656094
17445 656094 463895 338762 457959 359335 326691 295306 311389 497952 102778 187279
17435 187279 415121 115307 490844 416212 549035 150814 324415 223441 324040 226193
17425 226193 220822 255850 131595 403686 383675 466911 506729 534407 24093 513159 591460
17414 591460 426554 177527 534469 154297 196395 331515 181322 50973 521571 333322
17404 333322 548636 519711 369607 522094 296424 26337 28852 298998 -100603 108974
17393F0737K07519G8911J51027j12611J17264A4677M39753r7014J14748q9904
17383C82260A71045L47302j82146A67007J95439c3131H7885J40485l2903P5966
17373B71433J02439Q7396K0598n0193A23899L73899A4947J49645b31k4793I8311
17361E011J58457n8828l7873J70742j05491j1703a05626C36898j30147N05050
17351G11801k37218j42382q5015H6436K43250J44915j49164K78095F5941L1704
17341I7645K94863p8970N2284A56765L37081e6437B65656K36910A90697N17116
17331G07813D0148N0368J38110r3851K56725A41311J21585J71936n4726n1987
17321C28119J77607A96496C2803J46030L28358j76728C6472K45749l8685j19911
$$ plain form
17393 60737 268256 78911 229938 117327 234591 14677 454430 357416 472164 382260
17383 382260 171045 518347 336201 167007 362446 -33131 87885 228370 195467 271433
17373 271433 373872 461268 481866 431673 123899 497798 14947 164592 -231 -25024 98311
17361 5011 163468 104640 66767 237509 132018 120315 -105626 336898 206751 711801
17351 711801 474583 332201 247186 86436 329686 474601 325437 603532 65941 97645
17341 97645 392508 313538 365822 156765 493846 -56437 265656 502566 190697 707813
17331 707813 40148 90516 228626 134775 391500 141311 262896 434832 380106 328119
17321 328119 505726 196496 32803 178833 507191 330463 36472 282221 243536 123625
17311A23625M9378F414J19446J03674O8399R0953O1018p3239j02986o9631O0450
17300B64498H9337M89566I9749O6643H1403J74228K16344B20353J53218J98676
17290E72247k51050k7510K0939j3526G8391M78556k23734j252M8919P8835k3764
17279D35951A93630L31237o5134A75447J08458K12514B34725A04827M78031J3719
17269E96577j94713A8721K06893K05922J49316j55778J46352k35548A56880J75505
17259C32385L27934j79192n0489k07869D9873K12321o2574P523L6826J54731O536
17248D05236J52071P5142B68408J39592j95090J28997A16161J90348M8544a60808
17237D80460j08112J72435L6114A66802K14118j83629L74381m792k44054A5635
$$ plain form
17311 123625 173003 6414 125860 229534 297933 388886 449904 376665 273679 204048 264498
17300 264498 89337 578903 99749 166392 81403 255631 471975 220353 373571 572247
17290 572247 321197 293687 314626 301100 78391 556947 333213 331961 380880 459715 435951
17279 435951 193630 524867 459733 175447 283905 496419 234725 104827 582858 596577
17269 596577 401864 18721 225614 431536 580852 425074 571426 335878 156880 332385
17259 332385 660319 481127 430638 222769 49873 262194 199620 207143 243969 398700 405236
17248 405236 557307 632449 268408 408000 212910 341907 116161 306509 355053 -160808
17237 480460 372348 544783 580897 166802 380920 197291 571672 566880 322826 15635
17226D8652J795N69827l5116A47512L69320A6213K97214K70067B12984K61694
17216D74678J8170B03124J16030J42762J78141J14091k88150k29772M66685k64945
17206D37966J27916k51477K71652B80226G1609M60859r2828J43383j46779j36285
17196B99959Q8807j12590q9165K09636j07743K96907n5709j37875j1181J34523
17186E15569j81759l5489L00736B95577R7897M9849o5118N02558A76242K90791
17176D67033j81083L04046k68959M3994J85174K56864j21351K8718L9243k41427
17166E12252M0923j45989j76936M37984k76269P0108J60385k11954J39355m4329
17156E05530N0018j62723K38982j64351j6165J2261J09457I0410N46939j12868
$$ plain form
17226 48652 50447 620274 585158 147512 516832 16213 313427 583494 212984 474678
17216 474678 492848 203124 319154 461916 640057 754148 465998 236226 702911 437966
17206 437966 565882 314405 586057 280226 71609 532468 439640 583023 436244 299959
17196 299959 388766 276176 187011 396647 288904 585811 530102 392227 381046 515569
17186 515569 333810 298321 599057 295577 393474 443323 378205 880763 176242 467033
17176 467033 285950 589996 321037 365031 550205 807069 685718 714436 753679 512252
17166 512252 553175 407186 230250 668234 391965 462073 622458 410504 549859 505530
17156 505530 555548 392825 631807 467456 451291 463552 573009 90410 637349 524481
17146E24481J99601k82685L1044J80286j47641o3751o4478j5908L08161o262j14924
17135E47924m9920J08465m5669l5482L54841m19994o1492J99645B88118K90326
17125E78444O5157j20097J03337O30118l81450l67728L90937j86182k28121J61464
17115F45879J6313J67521k51509l3853M04863m36485J24746K57687l24782k34520
17105C35860Q8892M30470k10978q6265J84315k356m9311r1885j27040L10529K18604
17094A000835C87861K38529n0349J77196k79807K90892j9193j50680j09422J75314
17084F60341j8525K37789j67134O1567J36009k52055L50665J69781l79474K9672
17074H28636J94442k01326K18699j86111j44451r9597L41780j42392j90796K70032
$$ plain form
17146 524481 724082 441397 472441 652727 505086 441335 376857 360949 669110 662848 547924
17135 547924 498004 606469 560800 525318 880159 460165 398673 598318 288118 578444
17125 578444 643601 523504 626841 1256959 875509 507781 898718 712536 484415 645879
17115 645879 662192 829713 578204 544351 949214 512729 637475 895162 570380 335860
17105 335860 424752 855222 644244 557979 742294 739938 690627 598742 471702 782231 1000835
17094 1000835 387861 626390 576041 753237 473430 764322 745129 594449 485027 660341
17084 660341 641816 879605 712471 774038 910047 657992 1008657 1178438 798964 828636
17074 828636 1023078 821752 1040451 854340 709889 610292 952072 809680 618884 888916
17064H88916J12862k32256j15300J94255m1549J33060m0055q3460K65924R661
17054A092058J5116l3963l70193p3413J70610o4646R1961J87577R0500O8323l61412
17043H12518J53198l51512M13343q3116M7344Q4173r6628O8783q35j23425K82081
17032A205924J15669J8084o28286K14043r2235l7134K56380l2930P9052l09677
17022G88890L95698k26707N3156J06179J63436j09655J0744K27550k60898r0954
17012A057439j88207J69571K28969L10635k13326O5855l39011N9407J97016j09631
17002A238717J59281j86071p2657j46637J99368q4706K49663k111p4161L02230
16992A582916k08750k94596M11649j58872J65216O6114q6951j82859J47998m3393
$$ plain form
17064 888916 1001778 769522 654222 848477 806928 939988 899933 816473 1082397 1092058
17054 1092058 1107174 1073211 703018 629605 800215 735569 827530 1015107 1105607 1173930 812518
17043 812518 965716 614204 1027547 944431 991775 1075948 979320 1048103 1047268 923843 1205924
17032 1205924 1321593 1339677 711391 925434 833199 796065 1052445 1019515 1098567 788890
17022 788890 1184588 957881 1011037 1117216 1280652 1170997 1181741 1409291 1148393 1057439
17012 1057439 869232 1038803 1267772 1578407 1365081 1430936 1091925 1151332 1348348 1238717
17002 1238717 1397998 1211927 1139270 992633 1192001 1107295 1356958 1354847 1280686 1582916
16992 1582916 1374166 1079570 1491219 1332347 1497563 1563677 1476726 1293867 1441865 1398472
16982A398472P3068q0598K61012J11078k1822l89733N06564l61787q6626M7527
16972A457155j23655j53388M92042K47867l46410J46687j62916n5236L37951j57789
16962A682308R697k71480L08873j31364L61378j74877J33006l25839N54966k08495
16952A938173k35102K35393j40098L60721k57046J81787O299j29713k34169K76261
16942B002506k00507Q0262K74295k7316k22544n8438N08506k87418O4949J13313
16932B247608j17136J57066j56812L20072j20127p4458K9056J33848J11269j15946
16922B414440j81378J74400L71101m56403L14822k04149L08413p6559k34278K22106
16912B652515j70293L27976j0222k80948K00107p147K92473p3673l300M1979J92673
$$ plain form
16982 1398472 1471540 1390942 1651954 1763032 1741210 1351477 1858041 1496254 1409628 1457155
16972 1457155 1333500 1180112 1672154 1920021 1573611 1720298 1557382 1502146 1840097 1682308
16962 1682308 1692005 1420525 1729398 1598034 1959412 1784535 1917541 1591702 2146668 1938173
16952 1938173 1703071 1938464 1798366 2159087 1902041 2083828 2090127 1960414 1726245 2002506
16942 2002506 1801999 1882261 2156556 2129240 1906696 1848258 2356764 2069346 2134295 2247608
16932 2247608 2130472 2287538 2130726 2450798 2330671 2256213 2285269 2419117 2530386 2414440
16922 2414440 2233062 2407462 2778563 2322160 2636982 2432833 2741246 2664687 2430409 2652515
16912 2652515 2482222 2810198 2799976 2519028 2719135 2711988 3004461 2930788 2927488 2969467 3162140
16901C162140k69250L04194k29813K57609j52556J70146J24573n1542P6446k38081
16891C153866L57139j25757L75975l488k26163K91315l75526J97029j05817Q37767
16881D376340k23972l16406L85362n44613L77984L64019j89752P4934K5796K65949
16871D595641l05154P6729k29045M35267j91355L93760O3633m758J42856J52597
16861E130171j75437J92586j98869o7305N78420k16882K59845q8521J71972J92033
16851E778013J33109j13814J88168N317J9648m1339L73217O7644J12185O1568
16841F583716j3391j47175M09539K68474J67287N6329j98490J42336N21398j24344
16831G665679J0271M40949K01156M4604J03414J3975L74607K57687J17829j92736
$$ plain form
16901 3162140 2892890 3197084 2967271 3224880 3072324 3242470 3367043 3315501 3391947 3153866
16891 3153866 3511005 3385248 3761223 3757735 3531572 3822887 3447361 3644390 3538573 4376340
16881 4376340 4152368 3835962 4221324 3676711 4054695 4418714 4228962 4303896 4329692 4595641
16871 4595641 4290487 4367216 4138171 4573438 4382083 4775843 4839476 4834718 4977574 5130171
16861 5130171 4954734 5147320 4948451 4881146 5459566 5242684 5502529 5414008 5585980 5778013
16851 5778013 5911122 5797308 5985476 5990793 6010441 5969102 6342319 6409963 6522148 6583716
16841 6583716 6570325 6423150 6832689 7101163 7268450 7324779 7126289 7268625 7790023 7665679
16831 7665679 7675950 8116899 8318055 8362659 8466073 8480048 8854655 9112342 9230171 9037435
16821I037435N16820O7682J63944M84123J09478j07078N72501L1855j37423O62315
16811A1401652k50713L97616L07305L21156J29282K91559M6600L96836N18275
16802A3559568M22468L20606J56957O14199p9764L87847P80659o1586Q81914k50950
16792A6731918J062944k42635O66443O60262O89463L43210P76033K29406R04589
16783B1821633O5166N82198P61176N27120Q87975O68550Q88232L87891J108611
16774B7698552Q04725M88311J173600Q92499R84250R91849Q53818J072990J120235
16765C6080829J222514J278475J009392J363681J700657J140237J749320J355555
16757D6900660J911004J394348J438585K072936J628180J829160K232676K078013
$$ plain form
16821 9037435 9554255 9621937 9785881 10270004 10379482 10272404 10844905 10876760 10739337 11401652
16811 11401652 11150939 11548555 11855860 12177016 12306298 12597857 12644457 13041293 13559568
16802 13559568 13982036 14302642 14459599 15073798 14994034 15381881 16162540 16100954 16982868 16731918
16792 16731918 17794862 17552227 18218670 18878932 19568395 19911605 20687638 20917044 21821633
16783 21821633 21886799 22468997 23230173 23757293 24645268 25313818 26202050 26589941 27698552
16774 27698552 28503277 28991588 30165188 31057687 32041937 33033786 33887604 34960594 36080829
16765 36080829 37303343 38581818 39591210 40954891 42655548 43795785 45545105 46900660
16757 46900660 48811664 50206012 51644597 53717533 55345713 57174873 59407549 61485562
16749F1485562K332009J686998K642033K311779K257133K656351K075846K662278
16741H0109989K634761K100099L114186K414666K508558K805724K246007K465541
16733A00399531K311744K654044J798649K272318J744232J759458J156653J197918
16725A15294547Q12127P23551K07522N44826j93471m50165j113324o47835j397012
16716A13780766j501584j497226k258432j632829k327940k283889k537292k509161
16708I7232413l034425k235167k906129k389678k922036k730434k670597k601460
16700G5742487k568855k510763k511911k440227j958459k741913j675084k337919
16692E6997356j946119j496057k223639j715718j734633j905484j430865j396897
$$ plain form
16749 61485562 63817571 65504569 68146602 70458381 72715514 75371865 77447711 80109989
16741 80109989 82744750 84844849 87959035 90373701 92882259 95687983 97933990 100399531
16733 100399531 102711275 105365319 107163968 109436286 111180518 112939976 114096629 115294547
16725 115294547 116106674 116830225 117037747 117582573 117389102 116938937 115825613 115177778 113780766
16716 113780766 112279182 110781956 108523524 106890695 104562755 102278866 99741574 97232413
16708 97232413 94197988 91962821 89056692 86667014 83744978 81014544 78343947 75742487
16700 75742487 73173632 70662869 68150958 65710731 63752272 61010359 59335275 56997356
16692 56997356 55051237 53555180 51331541 49615823 47881190 45975706 44544841 43147944
16684D3147944j553322r48428j585129j287551j210353j090534j232526j322126
16676C2917975q85764j111858r22371j000266q04159o73053j078531o58077r24307
16667B4859589o21783q26698k67760j009292n05094p10105l25966q38534k12516
16658A9541841p91926n49363k87482l04680m58628o19480k31560o06927l50914
16649A5340881m1656o87008J53924o41857m32081l99944n22979j13428m52500
16640A2203352k07219l05524q0715j56322j33030m82453l79989j85416p9477j87337
16630A0005870k41967l26248j25382k29811j09880j16045l04995J35979k00831
16621H486690j74893j61129N3142j16057n2148l72927k70445N6447o1901J62469
$$ plain form
16684 43147944 41594622 40646194 39061065 37773514 36563161 35472627 34240101 32917975
16676 32917975 32032211 30920353 29997982 28997716 28193557 27520504 26441973 25783896 24859589
16667 24859589 24237806 23411108 23143348 22134056 21628962 20918857 20592891 19754357 19541841
16658 19541841 18749915 18200552 17913070 17608390 17149762 16530282 16298722 15691795 15340881
16649 15340881 15299225 14612217 14766141 14124284 13692203 13292259 12769280 12655852 12203352
16640 12203352 11996133 11690609 11609894 11453572 11320542 10838089 10458100 10272684 10193207 10005870
16630 10005870 9763903 9437655 9312273 9082462 8972582 8856537 8551542 8687521 8486690
16621 8486690 8311797 8150668 8203810 8087753 8035605 7662678 7392233 7448680 7386779 7549248
16611G549248n48724k33278l3010n11794L13261k90929j34686J48666m05518K42324
16601F095560l49924j9809k65386N13207m85751k28070J3337O423O2755n4681
16591E287661l82125L4958J39749l19327k61899o4411K67793n08174L02576K27922
16581D724723l34073k34083L43515m88700N639J68684J81152j99315l90898J94599
16571C971243m12538Q307J79025L8819k69097K30840l50907j73349K06151J8417
16561C446911J88388l78274J7704K58912o51627K59270J9757l91182P6745J79487
16551C026091k44336J0855l8656m9933P7429K90803m13876K36285l30703L99252
16541B963211l25039j18839J79317k11492j15784L1796K31917J07138m85996K63399
$$ plain form
16611 7549248 7000524 6767246 6734236 6222442 6535703 6244774 6110088 6258754 5853236 6095560
16601 6095560 5745636 5725827 5460441 5973648 5487897 5259827 5273164 5279587 5342342 5287661
16591 5287661 4905536 4940494 5080243 4760916 4499017 4434606 4702399 4194225 4496801 4724723
16581 4724723 4390650 4156567 4500082 4011382 4017021 4185705 4366857 4167542 3776644 3971243
16571 3971243 3558705 3567012 3746037 3784856 3515759 3746599 3395692 3222343 3428494 3446911
16561 3446911 3635299 3257025 3274729 3533641 2882014 3141284 3161041 2769859 2846604 3026091
16551 3026091 2781755 2792610 2753954 2704021 2781450 3072253 2658377 2894662 2563959 2963211
16541 2963211 2638172 2519333 2698650 2487158 2371374 2403170 2635087 2742225 2256229 2519628
16531B519628k66920M6209k6834J95634M7918m59966K91112q5183K1861k82670
16521B000789J11539k37546K76116j78157J89693n61350L81152k50094L19026
16512B051168N4825l90317L80654m39838K55251N5539j15452k02129n1567j5867
16502A582267Q6233J86664N9285k69797J65399m40478N31531j71650j66078J44697
16492A708073N3122K6538k44607k57014k0287L83921j98180L28546l00794N1580
16482A530898j36150K30773k79947M13727j20008j89924Q2755k73261K09447k38447
16472A229863K81021N509j7632r4771j26328M250p3358Q9291q6551n1078J77746
16461A337962J33271m83945R9974m5199R9103J11201j60880M72848p43247N44575
$$ plain form
16531 2519628 2252708 2298917 2272083 2467717 2515635 2055669 2346781 2261598 2283459 2000789
16521 2000789 2112328 1874782 2150898 1972741 2162434 1601084 1982236 1732142 2051168
16512 2051168 2105993 1715676 2096330 1656492 1911743 1967282 1851830 1649701 1598134 1582267
16502 1582267 1668500 1855164 1914449 1644652 1810051 1369573 1901104 1729454 1563376 1708073
16492 1708073 1761195 1787733 1543126 1286112 1265825 1649746 1451566 1780112 1479318 1530898
16482 1530898 1394748 1625521 1345574 1759301 1639293 1449369 1532124 1258863 1468310 1229863
16472 1229863 1510884 1516393 1498761 1403990 1277662 1281912 1208554 1297845 1211294 1160216 1337962
16461 1337962 1471233 987288 1087262 1042063 1141166 1252367 1091487 1564335 821088 1365663
16451A365663l38055J2519L8814j98064J75299k46460R6760M66520k72749M2294
16441A142541L98802m33011m04315k3729K34933j5958R3065l03565K56017K21209
16431A165989k85577J05091J48665k05709j09771L5338n7556j32306M19518j89091
16421H94591j09290M422C80239M92481Q9020r6431l57664K53408n0630n5464K82431
16410I37390J02708k11054k8984K88218j10394l57807L25811j76092j03823K57652
16400I23625k45176j34693J97077k44948N6663L6884J32074j43463k25577K37296
16390E89762L37003j37512j52028l9701K76323k04670Q4762r3336M2443r0533
16380F12513J13861P8805k86482J43730j23777k9906K2217p3842J53842B44049
$$ plain form
16451 1365663 1027608 1040127 1078941 880877 1056176 809716 906476 1372996 1100247 1142541
16441 1142541 1541343 1108332 704017 680288 915221 899263 992328 688763 944780 1165989
16431 1165989 880412 985503 1134168 928459 818688 854026 796470 664164 1083682 894591
16421 894591 785301 789723 380239 872720 961740 865309 507645 761053 710423 654959 937390
16410 937390 1040098 829044 800060 1088278 977884 620077 945888 769796 665973 923625
16400 923625 678449 543756 740833 495885 552548 589432 721506 578043 352466 589762
16390 589762 926765 789253 637225 597524 873847 669177 753939 660603 703046 612513
16380 612513 726374 805179 518697 662427 538650 508744 530961 457119 610961 244049
16369G55007j97474j58229J96979J92807A26153R31336E24494l084K53818m4989
16359G30239j2304B31340P2564L41631M4459o2606k18273J30119q693L2151k9836
16348E32856m924q8125J31009j56145J37790j48161J57966j79896K31302B81732
16337G93218Q4487D36902Q0373J33541k26583L2952L19305B35324M95345j60822
16327E69847j76641J26594O2221O875B45360Q6989K13609L1311q153k63230R2632
16316C98518j11948r8696J58001L3163J96617B43977C2148O53250k12633L47119
16306H19884C76680R8001A88136J50017N626A30216M39948n2221j72838m2115
16296C02990k7928J28501J35247A09530N37359k77584j47379N87610A36674M2702
$$ plain form
16369 755007 557533 399304 596283 789090 126153 1057489 524494 521410 775228 730239
16359 730239 717935 231340 303904 645535 689994 627388 409115 539234 530541 562692 532856
16348 532856 527932 439807 570816 414671 552461 404300 562266 382370 613672 281732
16337 793218 877705 436902 517275 650816 424233 457185 776490 235324 730669 569847
16327 569847 393206 519800 582021 588896 245360 332349 545958 577269 569116 305886 398518
16316 398518 286570 187874 345875 379038 575655 243977 32148 685398 472765 819884
16306 819884 376680 474681 188136 338153 343779 130216 570164 517943 345105 302990
16296 302990 275062 403563 538810 109530 646889 369305 221926 809536 136674 179376
16286A79376J13177J35338j99351q4767K82293L6565k06227J51319A88637J83355
16276C71992j41566H5524N6895K78858A91351o8520J98605K22313j46638j93399
16266B03712M04752B52022P3440p1649R5390j39249M2898j04805j123J20948L9739
16255C07611p3237r13L28486O7114F463J71219G2208b6706B19202N230M18489
16244F42921A62039G1606O8659K26042J44974A85131J72261K1830f395B91366
16233D20148E7126L09459b2044G05789r4730A58774O7099P7895l4189J48088e9584
16221C65549j62916n3981J75272I8850K18090j3059D0185M7320J34959M32427
16211F54891l23805J07949l7299K0803a91384E32324G4715K30587m359j21118
$$ plain form
16286 179376 292553 427891 228540 143773 426066 462631 256404 407723 188637 371992
16276 371992 230426 85524 142419 421277 191351 122831 321436 543749 397111 203712
16266 203712 608464 252022 325462 253813 349203 209954 252852 148047 146924 267872 307611
16255 307611 234374 233461 561947 629061 6463 177682 72208 -26706 219202 224432 642921
16244 642921 162039 71606 140265 366307 511281 185131 357392 379222 -6395 291366
16233 420148 57126 366585 -22044 705789 611059 158774 225873 303768 269579 417667 -59584
16221 365549 202633 148652 323924 98850 316940 303881 40185 87505 222464 654891
16211 654891 331086 439035 401736 422539 -191384 532324 74715 305302 300943 179825
16201A79825K4860r7890L17623B9637b4361C27614A555L61334I0430Q6592M99036
16190F76058a324p5360C68658r2911J37380h7069A95901k0816K37450k9564p0837
16179C12134k8196j38136M2986l0664J49597A26923J82156H4705K49894j38112
16169A96487k7641J31790A30167k5970F82J19554n0192L09740j88384m1494E8421
16157A36647o3402M29551j70069D968J07141J68883E5547a14461B10826R6986
16147C07812m6544n3400a3321M688A14279J38488l7922J6534P279b521C21614
16135I6971M1078q723J95505Q0428A03121P8600a72008A37106J05011a6259C11119
16123I6253J557N9677P0868I8941Q0146M5482A8858K28764a53620D87483j08022
$$ plain form
16201 179825 204685 106795 424418 29637 -24361 327614 1555 362889 90430 177022 676058
16190 676058 -1324 -76684 368658 275747 413127 -87069 195901 175085 412535 382971 312134
16179 312134 283938 145802 188788 158124 307721 126923 309079 84705 334599 196487
16169 196487 168846 300636 130167 104197 682 120236 70044 379784 191400 149906 58421
16157 136647 73245 502796 332727 4968 112109 280992 55547 -114461 210826 307812
16147 307812 261268 207868 -13321 -8633 114279 252767 214845 231379 238658 -2521 321614
16135 96971 138049 129326 324831 405259 103121 181721 -172008 137106 242117 -16259 311119
16123 96253 97810 157487 228355 98941 179087 224569 18858 247622 -153620 487483 379461
16112C79461F3538J48835O9659i8578E6594M8244J60500A13496i6636b5903C2177
16100a15931A60045b01345R9406A5679a71320B62997A13996K67705D3230K20409
16090B63639A16219J23295I6028J26708a04217k2348M1686B04595o3419C1397
16079a5469D8625f4281A50952N010a56402N0598B0376K55264b09274A47404A6080
16067I6941N019J1525P4763j7341D8675K7801A0017K7145K4100K9248l9125b3339
16054A16653a35250D2214a31057H2529a77984A37536M9111a13869A31632J07514
16044B39146a5009j01603L7100a8410B58994f4780F6001R5019f4120B24478D9445
16032a57241i64C67835P4894A69065i2003j0242D82028a32812C1914c6558I0616
$$ plain form
16112 379461 63538 212373 282032 -98578 56594 104838 265338 113496 -96636 -25903 32177
16100 -115931 160045 -201345 -101939 15679 -171320 262997 113996 381701 43230 263639
16090 263639 116219 239514 96028 222736 -104217 -126565 -84879 204595 141176 31397
16079 -15469 48625 -64281 150952 155962 -156402 -105804 20376 275640 -209274 147404 16080
16067 96941 101960 113485 188248 170907 48675 76476 10017 37162 61262 90510 51385 -23339
16054 116653 -135250 42214 -131057 82529 -177984 137536 186647 -113869 131632 239146
16044 239146 -15009 -116612 -79512 -18410 258994 -64780 66001 161020 -64120 224478 49445
16032 -157241 -964 367835 442729 169065 -92003 -102245 482028 -132812 31914 -36558 90616
16020H1545J09930g1658k55186g3373E3625a09988k5837A31638n7495K61512c1591
16008b44446L0681j62367a36020k3067e0913A49515a84j90033P5126k1410a1917
15996A01638C5476b2254C54477g0584P938j74684J5573B79831n8892L5724A24676
15984a60423B78276D834b7722o4263I0507Q2805M16506o7879J92423M71890m63472
15973G22780j28298j44130J53587A65219Q7889J79538j91007J4561a52347g5602
15962a03797j82917f3767I1388N0869b23533p1701M4819H2567J3170a51548d0203
15950F7361J09369k549h4813B67629f1378K5370B23202b26483J4720k23020E6006
15938A61976m0781a53864B74623d0970D8468b530B0299a9552k96811B39962c84430
$$ plain form
16020 81545 191475 -71658 -326844 -73373 53625 -109988 -135825 131638 74143 335655 -31591
16008 -244446 -213765 -376132 -136020 -159087 -50913 149515 -184 -190217 -115091 -136501 -11917
15996 101638 35476 -22254 354477 -70584 -62646 -237330 -221757 279831 220939 256663 124676
15984 -160423 278276 4834 -27722 -91985 90507 173312 589818 521939 714362 1186252 722780
15973 722780 594482 450352 603939 165219 253108 432646 241639 256200 -152347 -75602
15962 -103797 -286714 -63767 91388 142257 -223533 -295234 -250415 82567 95737 -151548 -40203
15950 67361 176730 174181 -84813 267629 -61378 -36008 223202 -226483 -211763 -434783 56006
15938 161976 121195 -153864 274623 -40970 48468 -2530 20299 -19552 -316363 239962 -384430
15926C1473i6408B08299a4561l97276d1012B33018r2898b03436A73935J76418
15916C50353a64430L1150B2753a54390o3428A67224b16686J01255B85572a26186
15905A72207l1970C1273b1145B30601m3507e5772p3893H6684a8576C4617L09757
15894C44374d9831C9986g9379D78488A791a43232k9469b8529k3946a5810j69230
15883a85040C9583d2825a4390C4940L38219I6807J27951a63573H4316a11694C07248
15871a40050H1535A0444L7196b52968B85692D2093c721A87408J8489N269e8956
15859B2409J97322a97646H9335C0692J32496a69645O5825C59246A30987g766n0337
15848e8103q3246A41284a8591r6833E0350d44726B2964a40512F9555K5500k7294
$$ plain form
15926 31473 -96408 208299 -14561 -411837 -41012 233018 140120 -203436 173935 350353
15916 350353 -164430 -133280 22753 -154390 -217818 167224 -216686 -115431 285572 -126186
15905 172207 140237 31273 -21145 230601 187094 -55772 -129665 86684 -18576 34617 344374
15894 344374 -49831 39986 -79379 478488 1791 -143232 -172701 -28529 -52475 -15810 -185040
15883 -185040 39583 -42825 -14390 34940 373159 96807 224758 -163573 84316 -111694 307248
15871 -140050 81535 10444 47640 -252968 285692 42093 -3721 187408 205897 211166 -58956
15859 22409 219731 -197646 89335 30692 163188 -169645 -103820 359246 130987 -7766 -58103
15848 -58103 -141349 141284 -18591 -115424 50350 -444726 22964 -140512 69555 95055 67761
15837F7761l2001b70167B22766b67077r9903i1727b6443B16481d1416A18312a28354
15825c83769a08201G7077N8942b47987b6758F0492a78855A6377P2537b07582C48017
15813a23172B12951e7765j11586A14099a7932j94421L5365e4986B6936c7243D8741
15801c07806c2582p8457A27605L8798J26930A46323h7163A52431Q4882f0051j47168
15790b07219j26709A68937E0864P1547n5712c30219J16677A4343J3736b07504
15779a51436C00236c7538j63467A92534j7019J4294n7563a11097p9274M0915I120
15767F7453R9894Q672a07524A7800J71633p6714b14294D4298e358j56812m2798
15756b04968A80688l7537J28253b81668i1429M0584H3478h7202A40443b63914
$$ plain form
15837 67761 35760 -270167 222766 -267077 -366980 -91727 -26443 216481 -41416 118312 -128354
15825 -383769 -108201 77077 136019 -247987 -26758 60492 -178855 16377 88914 -207582 348017
15813 -123172 212951 -57765 -169351 114099 -17932 -212353 -176988 -54986 26936 -37243 48741
15801 -307806 -32582 -111039 127605 166403 293333 146323 -87163 152431 237313 -60051 -207219
15790 -207219 -333928 168937 50864 122411 66699 -330219 -213542 14343 28079 -207504
15779 -151436 300236 -37538 -201005 192534 175515 189809 132246 -111097 -190371 -149456 9120
15767 67453 167347 176019 -107524 17800 189433 112719 -214294 44298 -5358 -162170 -204968
15756 -204968 180688 143151 271404 -281668 -91429 -50845 83478 -87202 140443 -263914
15745B08835a72914I9526J06068b00314M7409B18295f8909a9824j33573A17485
15734C5817b81832A27793E1925a39402E0729i8405B13252G631a99163i1663C07704
15722A05725j0168j4747a10265A1809e5966b3083o390C28756b29491g3911F9657
15710F0096b71122e5844D92215c53224O5565l311K211b0728j86930C3891K35098
15699B68989d4794k38090B58872b8401k17577F9628b88126B26401b14765c5285
15688A67038B0495a26066B2965e7260J0110A37780J0727B173K38949E6061i1268
15676D17351g6213b2032j99033A97972c69132a51114B06431D5773K09703k6904
15666B28572a95725D6267a44236D69b9143l5094d162j9415H7784a76547a9333
$$ plain form
15745 208835 -172914 99526 205594 -200314 -152905 218295 -68909 -19824 -153397 117485
15734 35817 -281832 127793 51925 -139402 50729 -98405 213252 7631 -199163 -91663 307704
15722 105725 95557 80810 -110265 11809 -55966 -23083 -29473 328756 -229491 -73911 69657
15710 60096 -271122 -55844 492215 -353224 -287659 -290970 -288759 -20728 -207658 33891 268989
15699 268989 -44794 -282884 258872 -28401 -245978 69628 -288126 226401 -214765 -35285
15688 167038 20495 -126066 22965 -57260 -47150 137780 148507 2173 241122 56061 -91268
15676 417351 -76213 -22032 -221065 197972 -369132 -151114 206431 45773 255476 228572
15666 228572 -195725 46267 -144236 469 -29143 -64237 -4162 -23577 87784 -176547 -19333
15654h9679d3977A41621A7312K207p586c88625a71825c554l64621A4855b9297
15642c553j40533B1754c0341k26j33747F8619b99011A84464a86149A2687L21542
15631C34229a16870D7579a62482A44746i184j68795h396q70m0580a9685k81349
15620c01034I5058b51612e5791B07791p1994h5779B16125b5925m5805A40713Q4125
15609B24838a05199j88232K4278c2698C58432I8563b96329C46609b1112j04010
15599a25122F5204K07796l4054h8388m0716I815b15530Q1020N3516m6171l8930
15588a66095B15182r3375A8538J91168a89492g1921B13583b1476k13438i2328
15577A16489b47032C86689a17512j35971C8172a87896B71454c19520A05985e63060
$$ plain form
15654 -89679 -43977 141621 17312 19519 11933 -388625 -171825 -3554 -368175 14855 -29297
15642 -3553 -144086 21754 -30341 -30567 -164314 68619 -299011 184464 -186149 12687 334229
15631 334229 -116870 47579 -162482 144746 -9184 -177979 -8396 -9266 -49846 -19685 -301034
15620 -301034 95058 -251612 -55791 207791 135797 -85779 216125 -25925 -71730 140713 224838
15609 224838 -105199 -293431 -269153 -32698 358432 98563 -296329 346609 -21112 -125122
15599 -125122 65204 273000 238946 -88388 -129104 9815 -215530 -134510 -80994 -127165 -166095
15588 -166095 215182 121807 18538 209706 -189492 -71921 213583 -21476 -234914 -92328
15577 116489 -247032 386689 -117512 -253483 38172 -187896 271454 -319520 105985 -563060
15566h2110c0121A95433g5558A06923Q4933q9720J32421a87366G0503d49297A9420
15554d04305F9726j968N9901g1744I5179K70884g6111j51543M8463H9368b545
15542f9763o502c2218m268I862R950M68841A16232L2044e277A10844K95298j55505
15530B50637J72174A89260c5955E4051N1487A1770Q3523N7833a74686D06595R734
15519D16329C3407J14758P2912J62610A23505e6441B49412l0726E5421J60203
15509B15624b70305m5073B51184r6466e3943I1636a3955k1932A04811j3593a05028
15497d6634k05463A15455P7073K5647l932F5191c28783a61221B18489D9544N512
15486E5056K14034c24033A16653b13566B04520J42151C6257K16558J38718K1802
$$ plain form
15566 -82110 -30121 195433 -75558 106923 191856 102136 234557 -187366 70503 -449297 19420
15554 -404305 69726 67758 127659 -71744 95179 366063 -76111 -227654 -179191 89368 -2545
15542 -69763 -76265 -32218 -36486 9862 19812 488653 116232 148276 -5277 110844 406142 250637
15530 250637 422811 189260 -35955 54051 105538 11770 95293 153126 -174686 406595 416329
15519 416329 33407 148165 221077 383687 123505 -56441 249412 218686 55421 215624
15509 215624 -270305 -315378 251184 154718 -53943 91636 -13955 -35887 104811 91218 -105028
15497 -46634 -252097 115455 192528 218175 214243 65191 -328783 -161221 218489 49544 55056
15486 55056 269090 -324033 116653 -213566 204520 346671 36257 252815 391533 413335
15476D13335G1783J80258Q4235J45157j54712j01315H4748J33371C19J71478a37694
15464h9751B04793r8533b84844d8171E0354k1662O2963F770h4594D0595L22433
15453C63028j12725d3962A26744k6160M0923e3530I5936I863K37480a35101B96336
15441B28171K8427K02452j19030A35662J5641a16808J84n8511H0332C4531a57089
15429c0545A01607R1011e5592A72098a54724r1904A40582c63972a49598M5386
15419a04212A23031i3229A43773J83601c3410A09859a58398J9101B0170b4035
15408h7805B0650O2048b34569A12851e8449I590b45313C31118c6072B2286a16998
15396B09219a30384j76794a44982A95445d6811A00663J36674d4213A7692a07622
$$ plain form
15476 413335 71783 252041 336276 481433 326721 225406 84748 218119 319 171797 -137694
15464 -89751 204793 106260 -284844 -48171 50354 28692 91655 6770 -84594 40595 363028
15453 363028 250303 -43962 126744 100584 141507 -53530 95936 9863 247343 -135101 296336
15441 228171 256598 459050 340020 135662 151303 -116808 -116624 -175135 80332 34531 -157089
15429 -30545 101607 192618 -55592 172098 -154724 -246628 140582 -363972 -149598 -104212
15419 -104212 123031 -93229 143773 327374 -33410 109859 -158398 -139297 20170 -24035
15408 -87805 20650 82698 -234569 112851 -58449 9590 -245313 331118 -36072 22286 -116998
15396 209219 -130384 -307178 -144982 195445 -46811 100663 237337 -44213 17692 -107622
15385a37317A79610J19786p3794b82980E7648l238J27674l6934J7569B3067K25587
15374B48654e6652A60144l0359l4893B9975J24473G974K39065P7490j24650b63725
15362A38477R7055c33336A84070l3679k1549a4536j5729A28156D7145a99542A0853
15350C724K59713j4657k200P8470M4462g3679A76335L3099J1935A04796N9345
15339A64141f6897E7388b3815l9387G5173c28159A7176a58563m7521G5460A153
15327b99405J44933C04281E26K6566J070J98386o6627a1894B61a472k13600J6853
15315a98219a1757G9540J21255R7170a0649D2952k151c6550I0300a57975c0422
15303B37921a60420j13138c1513C97575h0712l239l4307M9140A75555i8753A98555
$$ plain form
15385 -137317 179610 299396 225602 -282980 57648 54410 182084 145150 162719 23067 248654
15374 248654 -56652 160144 129785 94892 29975 154448 7974 247039 324529 199879 -263725
15362 138477 235532 -333336 184070 150391 128842 -14536 -30265 128156 47145 -199542 10853
15350 3724 263437 248780 246580 325050 369512 -73679 176335 209434 221369 104796 164141
15339 164141 -66897 57388 -23815 -63202 75173 -328159 17176 -158563 -206084 75460 1153
15327 -299405 -154472 304281 526 27092 28162 226548 159921 -11894 261 -1472 -215072 -198219
15315 -198219 -11757 79540 200795 297965 -10649 42952 40801 -36550 90300 -157975 -30422
15303 237921 -160420 -273558 -31513 397575 -80712 -83951 -118258 -69118 175555 -98753 198555
15291B53952O2572K8008A19470L1628d6636j32455c3637n5602E7387J16176f1373
15279A16096a12305A4986a2381k8431l4691G9829N8401C1172K16738j10982b0868
15267A77862f6006C24549H7364M1735a36411h201E6589h8499A38133a59676a5056
15255d9900D06138A35735L6523p0615d6378F3318b4057F3484i7451B24068j4550
15244B09518c01241e9157k51980G1487a22142B43636P1312A23797J4602L28164
15234D66563A86934N30970C20304O68609R80146K162596j012547M92763n85514
15225C026357j190234F96502k41617C4546f5013A21273J29526i8786L3921B44626
15214A66879H3220c76666A07632A2351a37501A28266L2626p6834R6008l6030r812
$$ plain form
15291 253952 316524 344532 119470 151098 -46636 -179091 -33637 -89239 57387 173563 -61373
15279 116096 -112305 14986 -12381 -40812 -75503 79829 138230 31172 247910 136928 -20868
15267 177862 -66006 324549 87364 129099 -136411 -8201 56589 -88499 138133 -159676 -15056
15255 -49900 406138 135735 172258 101643 -46378 63318 -24057 63484 -97451 224068 209518
15244 209518 -301241 -59157 -311137 71487 -122142 243636 314948 123797 138399 466563
15234 466563 186934 717904 320304 988913 1969059 4131655 3119108 3611871 3026357
15225 3026357 1836123 696502 454885 34546 -65013 121273 250799 -98786 -64865 244626
15214 166879 83220 -376666 107632 12351 -137501 128266 160892 84058 180066 144036 134224
15203A34224h2441j278j7163A51441o9272j9384L417N2130L25375k00938F4081
15191A25020h6460b5334B99489c06967A86824b3557G5005L00854d14A16181P7100
15180A93281J53279A62568C4174b79545H946a24714B98459j44814E3705E18L3710
15169C4228d5324F2237Q0021D546J88152j0475F7618P3034m9597B7739b58510
15157A93316k437a08298M7918F2375L63431j57366r8441i764F7090J52666J98108
15146D17864E8291J42242o2510L2636k3725d6409k00624f4540j50680A51827K6786
15135A78613c5176A548K53491b6736A49283K4137J15851h1970C75835A81203N0424
15124B31627n6939R4625j08547J79014N7478n4077A33647L8503J66170j05218
$$ plain form
15203 134224 -82441 -83719 -100882 151441 82169 62785 66202 118332 443707 242769 64081
15191 125020 -86460 -25334 299489 -306967 186824 -23557 75005 375859 -414 116181 193281
15180 193281 346560 162568 34174 -279545 8946 -124714 298459 153645 53705 518 34228
15169 34228 -45324 62237 142258 4546 192698 182223 67618 140652 91055 27739 -258510
15157 193316 190879 -108298 -60380 62375 425806 268440 169999 -9764 67090 219756 417864
15146 417864 58291 200533 138023 170659 146934 -46409 -247033 -64540 -215220 151827 178613
15135 178613 -35176 1548 255039 -26736 149283 173420 289271 -81970 375835 181203 231627
15124 231627 174688 269313 160766 339780 397258 343181 133647 172150 338320 233102
15114B33102A13456n5440M75936j08154k1605J10736M93958j74771j20244B15223
15103A86725P7358o4797a03001A31169b29003B3348K8850J9792N339h5531l6046
15092a21577B1589P3609Q193J31037r8732b4740G5718M4182J3970Q0191r3636
15081A20425R3341m0302J20131m9897n7844A1055a7877B70808r5164a63405B97773
15069B8624K09873e6408C40610m231j27948h3704A45540J95414q4944H8913J23605
15058B12518l3463n7032n3544Q4495R6495k5281I2015L3285N03734j50353d6506
15046A78211M7538K71133a02477E01354A74657H1182J61317K42047j92757k0151
15036B71638J60936l1788c7351k0379F43811B59412J73414m4816j66887l6082
$$ plain form
15114 233102 113456 58016 533952 425798 404193 514929 1008887 834116 713872 215223
15103 186725 264083 199286 -103001 131169 -229003 23348 52198 71990 77329 -85531 -121577
15092 -121577 21589 95198 103391 234428 135696 -24740 75718 119900 133870 214061 120425
15081 120425 213766 173464 293595 243698 185854 11055 -17877 270808 175644 -163405 297773
15069 28624 238497 -56408 340610 336379 208431 -83704 145540 340954 256010 88913 212518
15058 212518 179055 122023 68479 152974 249469 224188 92015 125300 629034 478681 -46506
15046 178211 225749 496882 -102477 501354 174657 81182 242499 484546 291789 271638
15036 271638 432574 400786 -37351 -57730 643811 259412 432826 388010 221123 185041
15026A85041R9177j35725K17769K02062k72614J22125m7396K42775j40810j51943
15016C20461L16867A84250j8243K16050Q8899l7782Q621o6445D5770J85100J10169
15005C41039K56412j71150k8960N904o97A04367K32063J12148r5251J19324k26260
14994B46391q2892L48783A96519L20543F8072J08631R7609q7797J86508M41492
14984H14515l57786n9439K23200j4462j99716J04203j69370K16602B77075J62940
14974D40015K0395j10118r454r0704K60942J42323k06908A27532K55439j27357
14964B55614b2307B86866a5357A17872K09158l4916e4915C09423P4487b977C45370
14952C74777J25105A58022J73748K31688B76021r4432J02618j9982L21652k33263
$$ plain form
15026 185041 284218 148493 366262 568324 295710 417835 370439 613214 472404 320461
15016 320461 637328 184250 166007 382057 470956 433174 441795 375350 45770 230870 341039
15005 341039 597451 426301 397341 403245 402548 104367 336430 448578 353327 472651 246391
14994 246391 163499 512282 196519 517062 68072 176703 274312 186515 373023 814515
14984 814515 456729 397290 620490 606028 406312 510515 341145 557747 277075 440015
14974 440015 460410 350292 340838 250134 511076 653399 446491 127532 382971 255614
14964 255614 -22307 286866 -15357 117872 327030 292114 -54915 309423 383910 -2977 345370
14952 374777 499882 158022 331770 563458 276021 181589 284207 264225 585877 352614
14942C52614J02220p4025M5287B09061Q6740r2109J50037A09301J7027M96922
14932F23250k75675m2496o2340L09549J6760K05594j69241N20990n5611l17485
14922G53295m0730J85415Q054N2608J02271j17774L18681k34076O9535j61680
14912I35599j22590j88586M939j81267p8656K89641C26472K38812j63562J41111
14902E42833J17394B03334J02938l4693M28298l45507O243A43274L44139J1578
14892D98991k18286J64468K24362l33599m9911N5539L95035j7938B72826K79079
14882E51905J62477n5794K4278j16891j17151n4136o9492J45028n3768L66014
14872G82470k67626j93299L53091j18882R6640B51391G4841M56525j08486j2564
$$ plain form
14942 352614 454834 380809 426096 209061 295801 203692 353729 109301 126328 623250
14932 623250 347575 305079 242739 552288 569048 774642 605401 1126391 1070780 753295
14922 753295 712565 897980 906034 958642 1060913 943139 1261820 1027744 1097279 935599
14912 935599 813009 624423 629362 448095 369439 659080 326472 565284 401722 542833
14902 542833 660227 203334 306272 271579 699877 354370 360613 143274 487413 498991
14892 498991 280705 445173 669535 335936 286025 341564 736599 718661 272826 551905
14882 551905 714382 658588 682866 565975 448824 394688 325196 470224 416456 782470
14872 782470 514844 321545 674636 555754 652394 251391 74841 531366 422880 410316
14862D10316K20312A06094J70087P027J38275J97099A80568J50244q4220L17417
14852E64009l8097j0607o5665J54811J72392C03986K94697J48002k67547M3030
14842E22168K09987n7673M01568j14550j84067N5789J40052j61993k12844L76054
14832I74491k36721p1604k84732K43970K55082k70476k61543M74237l44830M87935
14822I65809l06148l2701k91681M55785k50428A42224N56569B95707K10392m6658
14812D59441K19236B65878L00989K795L17158C54311J01868L09399P8485R1161
14802I35224j49369j76135K53568C31215j6569J05540J29068j1366K63265C32527
14791E76283R7917l31628L42543m7340l3272K6698J06526j66068N47807E00978
$$ plain form
14862 410316 630628 106094 276181 283208 421483 618582 180568 330812 246592 564009
14852 564009 525912 515305 449640 604451 776843 303986 598683 746685 479138 522168
14842 522168 732155 674482 1076050 961500 777433 833222 973274 811281 598437 974491
14832 974491 737770 666166 381434 625404 880486 610010 348467 822704 477874 965809
14822 965809 659661 626960 335279 791064 540636 142224 698793 295707 506099 459441
14812 459441 678677 265878 566867 569662 886820 354311 456179 765578 844063 935224
14802 935224 785855 609720 863288 331215 314646 420186 549254 537888 801153 332527
14791 576283 674200 342572 685115 637775 604503 631201 737727 571659 1119466 500978
14780H13217J43005m18072k298O7470L8395J30274O223k70586L35520k23763M4437
14769F63822j48123L9046K71734l02061N4194R3379j13581J28489q1035k2948
14759E82916m6601J26715j84177M68671k47000j37320K31330k16728K49008k67909
14749E58905K72457J2326j01340K24954j73534k82339M27422l64688J66671j5230
14739G25604L46497l04595j17319K50099k90225k27549L76630K39717j3877K5129
14729A010111N6086j55230L76407J44103j04927J0260k52531n5716k546O5698
14719A091715k32142k2605m3531J94407l27984L28089j38157o8192m8059j29536
14709F04005L28296m06924M74824J6321L0671l70311L85320J60101N6198n2614
$$ plain form
14780 813217 956222 538150 535852 603322 641717 771991 778214 507628 843148 619385 663822
14769 663822 515699 554745 826479 524418 578612 671991 558410 686899 605864 582916
14759 582916 536315 663030 478853 947524 700524 563204 794534 577806 826814 558905
14749 558905 831362 843688 742348 967302 793768 511429 938851 574163 740834 725604
14739 725604 1072101 767506 650187 900286 610061 382512 759142 998859 984982 1010111
14729 1010111 1066197 910967 1287374 1431477 1326550 1336810 1084279 1028563 1026017 1091715
14719 1091715 859573 836968 793437 987844 659860 987949 849792 781600 733541 604005
14709 604005 932301 525377 1000201 1016522 1047193 676882 1062202 1222303 1278501 1225887
14699A225887j1249l184m15578N52429j36962k49850j92440K39109q9654k7601
14689H90907L25125k49156j88409K13497n9590K1125M8253j14663K4848k12480
14679F99457L92064j72867m2317K83872q6517q5572K46492l60626k441L64005
14669A235550l03926L56073n11607J89669L55845l70694j12743K46314k41051
14660H43430M58474l05993K09746k05505J02497l5859Q338k38501j20502L00324
14650A016449K25427J99935l53695J59873L9957j28876J99429m53751M69992l01968
14640A072772P5382J81416K23119l19199N4831j77737K17552k63912K41621j06076
14630A199769J50556j49973L02647j48314K38512J995j04553k20127m7931J89719
$$ plain form
14699 1225887 1214638 1211454 795876 1348305 1211343 961493 769053 1008162 918508 890907
14689 890907 1216032 966876 778467 991964 932374 953499 1001752 887089 911937 699457
14679 699457 1091521 918654 876337 1160209 1073692 988120 1234612 873986 871545 1235550
14669 1235550 931624 1287697 776090 965759 1321604 950910 838167 1084481 843430
14660 843430 1301904 995911 1205657 1000152 1102649 1066790 1075128 836627 716125 1016449
14650 1016449 1241876 1441811 1088116 1247989 1287946 1159070 1358499 904748 1374740 1072772
14640 1072772 1148154 1329570 1552689 1233490 1288321 1110584 1328136 1064224 1305845 1199769
14630 1199769 1350325 1200352 1502999 1354685 1593197 1595192 1490639 1270512 1222581 1412300
14620A412300M1942j41476j20390L22005l1013k43391K50210K93773n17395J11758
14610A378323j73298L76524K1352k33343K07965K87234l77668N7578K89800J50707
14600A985174k23725j50043j0482J03678K83740k74182l0689J81204n7679q511
14590A798485q2547l00764N75401m22266L94355l02231J84930J81459J3963q0809
14580A959976N8319J02106k82495n3321N31468m94547K56504L54090N6351r8699
14570B389752J77480m04419L01402J25259j79433p3539M20117l17795J55376P250
14560B601450R0402j37392K85724j48487N68908J05954L37511J25741J73206Q09076
14550D812093J324273J889540L514192P750645K0266014K946503j8848894G232958
$$ plain form
14620 1412300 1454242 1312766 1192376 1514381 1483368 1239977 1490187 1783960 1266565 1378323
14610 1378323 1205025 1581549 1602901 1369558 1577523 1864757 1487089 1544667 1834467 1985174
14600 1985174 1761449 1611406 1600924 1704602 1988342 1714160 1683471 1864675 1806996 1798485
14590 1798485 1715938 1415174 1990575 1568309 1962664 1660433 1845363 2026822 2040785 1959976
14580 1959976 2018295 2120401 1837906 1784585 2316053 1821506 2078010 2432100 2488451 2389752
14570 2389752 2567232 2162813 2464215 2589474 2410041 2336502 2756619 2438824 2594200 2601450
14560 2601450 2691852 2554460 2840184 2691697 3260605 3366559 3704070 3829811 4003017 4812093
14550 4812093 6136366 8025906 11540098 19290743 39556757 42503260 23654366 7232958
14541C592560r62082o12800q273l21911J77045M44448m35533K87521k9202J08471
14531B240244J46475J64751K08346K38006J05144P62907J466517M091881k165230
14522G259041l521941o76199n31918J24877k67899J48255k1253k6958K72715j64321
14512B594399K87391j29351l7365j10301K75355j50942M22578j86374K51141m03794
14502B812737J51794K06833J41002j26438L5385J64732k35322K1206P2065L69732
14492C613726j75955j76669P4103L61365j9841k50540K97937K7243j63867J55510
14482C743012M8542R4717j37632K96314r4329L4844J41556K20316n5255k00861
14472D091224J07514O0116J85674J55475l34238K90601j71160K59291J62209m61853
$$ plain form
14541 3592560 2630478 2017678 2009405 1687494 1864539 2308987 1873454 2160975 2131773 2240244
14531 2240244 2386719 2551470 2759816 2997822 3102966 3865873 5332390 9424271 7259041
14522 7259041 3737100 3060901 2528983 2653860 2385961 2534216 2512963 2486005 2758720 2594399
14512 2594399 2881790 2752439 2715074 2604773 2880128 2729186 3151764 2965390 3216531 2812737
14502 2812737 2964531 3171364 3312366 3185928 3221313 3386045 3150723 3171929 3243994 3613726
14492 3613726 3437771 3261102 3335205 3696570 3676729 3426189 3724126 3751369 3587502 3743012
14482 3743012 3791554 3886271 3748639 4044953 3950624 3985468 4127024 4347340 4292085 4091224
14472 4091224 4198738 4258854 4444528 4600003 4265765 4556366 4385206 4644497 4806706 4344853
14462D344853L26890Q0949K02830J40169N538k27773L04681J05434j68635R745
14452E124681J93537J77137K67915l42439L29787K1440Q9567J57442L4730O3662
14442F117459M1352k61976J98547j54946K73039J73004L15329j36450K39989L29593
14432G134940m58286M91034l20523J86762K73176K91477o5768m4246K04267L41319
14422H034152K2967J20788K30653j70290j611N48663L4186N018J41295k5020K94948
14411I235749K85906k42082K17066L69036J4120J9299K28704k07546N82227J79500
14401A0681979K38404j10899K50350J37380K15853j02795N05085K51717O0449
14392A2127523M58759q8632K93832M55809l06025M29729L22607L4898L75023M32113
$$ plain form
14462 4344853 4671743 4752692 4955522 5095691 5101229 4873456 5178137 5283571 5114936 5124681
14452 5124681 5318218 5495355 5763270 5420831 5750618 5772058 5861625 6019067 6053797 6117459
14442 6117459 6158811 5896835 6095382 5940436 6213475 6386479 6701808 6565358 6805347 7134940
14432 7134940 6676654 7167688 6847165 7033927 7307103 7598580 7532812 7488566 7692833 8034152
14422 8034152 8057119 8177907 8408560 8238270 8236659 8785322 8819508 8824526 8965821 8940801 9235749
14411 9235749 9521655 9279573 9496639 9865675 9879795 9899094 10127798 9920252 10502479 10681979
14401 10681979 10920383 10809484 11059834 11197214 11413067 11310272 11815357 12067074 12127523
14392 12127523 12586282 12497650 12791482 13247291 12941266 13370995 13693602 13728500 14103523 14535636
14382A4535636K08939K75285K47877L36528L69661J13412O51807J71787K8662
14373A6939594M39473J40217O30199L60104K32746N02527K12371L69998R48568
14364B0775797K94133K13779M98121J75872M32450R16224M90526M95033M51102
14355B4743037Q84906K40227J034008O32554L72337N94080N52794J051505P18170
14346C0823618Q12302Q83449P12120R89959J040874Q46146Q59151J068064J252825
14337C9288508J019665J215769R53788J490274J229426J469284J353413J243281
14329D9263408J916031J578419J867347J445790J822992J884869K222847J878310
14321F3880013K265857K383415K386825K749284K843390K681576L169014K610195
$$ plain form
14382 14535636 14744575 15019860 15267737 15604265 15973926 16087338 16739145 16910932 16939594
14373 16939594 17379067 17519284 18149483 18509587 18742333 19244860 19457231 19827229 20775797
14364 20775797 21069930 21283709 21781830 21957702 22390152 23306376 23796902 24291935 24743037
14355 24743037 25627943 25868170 26902178 27534732 27907069 28501149 29053943 30105448 30823618
14346 30823618 31635920 32519369 33231489 34221448 35262322 36108468 36967619 38035683 39288508
14337 39288508 40308173 41523942 42477730 43968004 45197430 46666714 48020127 49263408
14329 49263408 51179439 52757858 54625205 56070995 57893987 59778856 62001703 63880013
14321 63880013 66145870 68529285 70916110 73665394 76508784 79190360 82359374 84969569
14313H4969569L560821L235556L817127L786663M288362M219170M744839M563461
14305A17185568M914492N577136N607648O067493O024205O410868P197361P856495
14297A66841266P206792Q662004Q615485R029513R617484J0374905J0696371J0833096
14289B41876916J2124265J1911923J2815729J3029325J3657037J3901828J4154260
14282C33471283J4202439J4713627J4410345J3978199J3747914J3079239J2622670
14275D30225716J0857332Q042122M523753L394439K831125J100708l342225l012498
14267D54620472O07283n481205q870092j1017653j2637402j3597031j4756702
14260C88867670j5480149j5588546j5674501j5610921j5240067j4843760j4475848
$$ plain form
14313 84969569 88530390 91765946 95583073 99369736 103658098 107877268 112622107 117185568
14305 117185568 122100060 127677196 133284844 139352337 145376542 151787410 158984771 166841266
14297 166841266 174048058 182710062 191325547 200355060 209972544 220347449 231043820 241876916
14289 241876916 254001181 265913104 278728833 291758158 305415195 319317023 333471283
14282 333471283 347673722 362387349 376797694 390775893 404523807 417603046 430225716
14275 430225716 441083048 449125170 453648923 457043362 459874487 460975195 457632970 454620472
14267 454620472 455227755 449746550 440876458 429858805 417221403 403624372 388867670
14260 388867670 373387521 357798975 342124474 326513553 311273486 296429726 281953878
14253B81953878j4048871j2936244j2612181j2118105j1864880j0096477j0694292
14246A97582828r614205r076790q362295q033485p824828p076765p050306o695380
14238A33848774n866716n277922k524108l361814n428838n620316m492822m193661
14230I7082577m045059l909801l387517l361277l090474k894603l143655k613637
14222G0636554k549143k279229k078187j908003k197273j996088k014826j682088
14214E3931717j316392j371401k209405j078372j281945j987440j107236l97413
14206D3182113j365457j365315j575256j006925j103341o24786o31216j236995
14198C4272822j058626p39468o85801q17822m93087p23120q91400o70191m46942
$$ plain form
14253 281953878 267905007 254968763 242356582 230238477 218373597 208277120 197582828
14246 197582828 187968623 178891833 170529538 162496053 154671225 147594460 140544154 133848774
14238 133848774 127982058 122704136 120180028 116818214 111389376 105769060 101276238 97082577
14230 97082577 93037518 89127717 85740200 82378923 79288449 76393846 73250191 70636554
14222 70636554 68087411 65808182 63729995 61821992 59624719 57628631 55613805 53931717
14214 53931717 52615325 51243924 49034519 47956147 46674202 44686762 43579526 43182113
14206 43182113 41816656 40451341 38876085 37869160 36765819 36141033 35509817 34272822
14198 34272822 33214196 32474728 31788927 30971105 30478018 29754898 28863498 28193307 27746365
14189B7746365j119733r46288L5767j017095p7962n97739r27619m46178l65382
14180B2284136j07500r02944n0034q27397k46885l35687l76835p50205k84803
14171A8401846j84419O716q70095k59358n9594l48430n10639k23897k85322k61793
14161A5405015k07289l40525k23777l77643j65440l23773m3427l39662m80599
14152A2902880l26219q9332J6228K5662m63531J4314m11938k33632p7295N0478
14142A1407615l01823n4581l23322j0965m06074j15887j80875l17813K09822l67484
14132I538613J86209m82604j15980k39802K17583k97311N9267k33318l3365j46830
14122H452462N2367l88881m74238L17587K20044n69829l11358L59086J09958n25975
$$ plain form
14189 27746365 26626632 25680344 25716111 24699016 24621054 24023315 23095696 22649518 22284136
14180 22284136 22176636 21273692 21223658 20396261 20149376 19813689 19436854 18686649 18401846
14171 18401846 18217427 18224143 17354048 17094690 17035096 16686666 16176027 15952130 15666808 15405015
14161 15405015 15197726 14857201 14633424 14255781 14090341 13766568 13723141 13383479 12902880
14152 12902880 12576661 12487329 12503557 12529219 12065688 12080002 11668064 11434432 11357137 11407615
14142 11407615 11105792 11051211 10727889 10716924 10310850 10194963 10014088 9696275 9906097 9538613
14132 9538613 9724822 9242218 9126238 8886436 9104019 8806708 8865975 8632657 8599292 8452462
14122 8452462 8504829 8115948 7641710 7959297 8179341 7609512 7298154 7657240 7767198 7241223
14112G241223J30455K65006p18756K99889m29011R4877k65513J88590k47014J52644
14102F712390k97282P9956j80797l61149j16920K24917l3607J48489m85791K6158
14092E716364L11601m97108K6496k0370j94858O0830M5520j04849K19202j04255
14082E458573l94299J04304k08759o8135L8194J6599l50664J69661p3955M3885
14072D735404j40134j95629k12523p9523M29108k00583K32713m79993M92429k7051
14062D554218j03153M4721n15534m0794P0799j17858R5371J03993j49518j21580
14052C820665R6287J32308o89977L19189j57672J2378j08376K90536j80179l18091
14042C217068K99962m61353K79539K71306j88874j13204j51010m6505K84614j64419
$$ plain form
14112 7241223 7371678 7636684 6917928 7217817 6788806 6883683 6618170 6806760 6559746 6712390
14102 6712390 6415108 6495064 6314267 5953118 5836198 6061115 6027508 6175997 5690206 5716364
14092 5716364 6027965 5530857 5557353 5536983 5342125 5402955 5448475 5343626 5562828 5458573
14082 5458573 5064274 5168578 4959819 4891684 4929878 4946477 4595813 4765474 4691519 4735404
14072 4735404 4595270 4399641 4187118 4107595 4536703 4336120 4568833 4088840 4581269 4554218
14062 4554218 4451065 4495786 3980252 3939458 4010257 3892399 3987770 4091763 3942245 3820665
14052 3820665 3916952 4049260 3359283 3678472 3520800 3533178 3424802 3715338 3535159 3217068
14042 3217068 3517030 3055677 3335216 3606522 3417648 3304444 3153434 3106929 3391543 3227124
14032C227124N3153j77799J9061k63617K40175J29606k8830K95101r26579N07593
14022C074988l2408j78133N4819K86764q53228K32002J35319O2043m7060J0199
14012B745305j36383p4274k4681J94807k41802P1534j46346J57067k24578l09301
14002B011348K65781j62310K80721l16529K86130j76562Q7151l01780O08710l53921
13992B228739J89006J83332J58258J485834K316506N531430J8461198J4658978
13984D5213281j3325358A4276021o333741k168390j169557l65096p37394L9037
13976C540880o04307q176J15147j61011l11936P2279K1007J7839j06412k84771
13966B290539M26134n99678M77332l72626L00107k60830r4316j83740N64715k25290
$$ plain form
14032 3227124 3280277 3102478 3121539 2857922 3098097 3227703 3198873 3493974 2567395 3074988
14022 3074988 3042580 2864447 2919266 3206030 2352802 2584804 2720123 2782166 2735106 2745305
14012 2745305 2608922 2534648 2509967 2704774 2462972 2534506 2388160 2545227 2320649 2011348
14002 2011348 2277129 2114819 2395540 2079011 2365141 2188579 2275730 1973950 2582660 2228739
13992 2228739 2417745 2601077 2759335 4245169 6561675 12093105 30554303 45213281
13984 45213281 31887923 14276021 7942280 5773890 4604333 4239237 3501843 3540880
13976 3540880 2936573 2928397 3043544 2882533 2570597 2642876 2663883 2681722 2575310 2290539
13966 2290539 2716673 2116995 2594327 2221701 2521808 2260978 2166662 1982922 2547637 2322347
13956B322347m50502O87798n97106L51209m05328R5883J3817j31277j353J11304
13946A996792J10818p9361K06497n08204j94472K92131J07911k77130k5968J27176
13936A756190L03737l55314k16782L11825j73707K45510j45376R9820k2765K5029
13926A828167k02089K93396j40378j16932j45339J45891k29825p3968J75058R6834
13916A630815l8355M10407l37570l55506N02050m03493J03100j79286R5144p7621
13906A349685L90806n71705J53745K39476O5082k14463P1438q8641j66659K4227
13896A252991J08491O3668o5035m7518K25986L0067l47008n8472r415o698R0131
13885A237188j49722M35449n55208K55546k0026J62726k90644O9935l6505K46672
$$ plain form
13956 2322347 1871845 2559643 1962537 2313746 1908418 2004301 2018118 1886841 1885488 1996792
13946 1996792 2107610 2028249 2234746 1726542 1532070 1824201 1932112 1654982 1629014 1756190
13936 1756190 2059927 1704613 1487831 1799656 1625949 1871459 1726083 1825903 1803138 1828167
13926 1828167 1626078 1919474 1779096 1662164 1516825 1662716 1432891 1358923 1533981 1630815
13916 1630815 1592460 2002867 1665297 1309791 1811841 1408348 1511448 1332162 1427306 1349685
13906 1349685 1740491 1168786 1322531 1562007 1627089 1412626 1484064 1395423 1228764 1252991
13896 1252991 1361482 1425150 1360115 1312597 1538583 1568650 1221642 1163170 1153755 1147057 1237188
13885 1237188 1087466 1522915 967707 1223253 1203227 1365953 1075309 1145244 1108739 1355411
13875A355411J00843j37863j54138k6455o0708L84386n92357M64780j13223Q034
13865A228710j79785K00447k11823l27414N01604N7870j99756N0199n421r058
13855A105573j40180l2314J46283m9044j9693n0147Q5705N9692j62418L27336
13845A270793m44840k08645L35700k5516J11665J08166j56292L99879o18453K7969
13835H00426K73997j77851K25147K60868m55785j77012J19691J38030N4022m8143
13825A013390L1332J39622m55514o0932M48004k44190J54807k98498L74761j02163
13815A000619K88739K2742l67701J74381n16647K22142j87462L93356m7694K61300
13805A243775k06904k8000m98649M68578k1294l24154J89783K43047E00587M64298
$$ plain form
13875 1355411 1456254 1318391 1164253 1137798 1077090 1461476 869119 1333899 1220676 1228710
13865 1228710 1048925 1249372 1037549 710135 1211739 1269609 1069853 1120052 1114631 1105573
13855 1105573 965393 933079 1079362 1030318 1010625 960478 1046183 1105875 943457 1270793
13845 1270793 825953 617308 953008 927492 1039157 1147323 991031 1390910 772457 800426
13835 800426 1074423 896572 1121719 1382587 926802 749790 869481 1007511 1061533 1013390
13825 1013390 1044722 1184344 728830 667898 1115902 871712 1026519 728021 1102782 1000619
13815 1000619 1289358 1312100 944399 1118780 602133 824275 636813 1030169 982475 1243775
13805 1243775 1036871 1008871 510222 978800 957506 633352 823135 1066182 500587 964885
13795I64885m2957k01789P3436Q7476k0858J3777J0383o8460K6911j84698N0095
13784G08201R968J0508k86196M99105o6682J33796j34904j61796m4415K33135
13774I00720R0672j38709l56242P465L26979j38111j98968K12739j90520K68228
13764G84253j8131K734l00219K41430o2522J68029k17846J3143L2567j01254q9578
13753D52606K14226j8796J51417n8802K06632k64223K20021C58984L74421k3521
13743G09884Q7491l23456L80509C86981K39453l137L01509k62732L39084l51743
13733F49415K89696l04215M5022k70923Q9481J79228P7741l59049q0537L57714
13723F73573J87645m28367L08653j39276k19274j41230N14898J9777k08306j86762
$$ plain form
13795 964885 921928 720139 793575 881051 860193 873970 884353 815893 842804 658106 708201
13784 708201 718169 728677 442481 941586 874904 1008700 873796 712000 667585 900720
13774 900720 991392 852683 496441 503906 830885 692774 493806 706545 516025 784253
13764 784253 766122 768856 468637 710067 647545 815574 597728 610871 643438 542184 452606
13753 452606 666832 648036 799453 740651 947283 683060 903081 358984 733405 709884
13743 709884 797375 473919 854428 386981 626434 623297 924806 662074 1001158 649415
13733 649415 939111 634896 679918 408995 498476 677704 755445 396396 315859 673573
13723 673573 861218 432851 741504 602228 382954 241724 756622 776399 568093 381331
13713C81331L34884M0225l01453j46113L46756k01643N8169M04761l26682B48948
13702E60072q7878m6591J24655m4342j37912L41785k82088k1643K26001J5529
13692F47588k72714K9474L02776l36435K18108m9848K85338B66798N31510k92213
13682E06095k820j62979o3595J83911K38841L09759m11789M0364j95494L68294
13672H10587j53077Q673k02639J11389M196K07727k32344K29283A33799M09301
13662E43100J98018j64155B02967J47578A55232j5495L55112k5408J0307r1236
13652C88512K04944J04283C44256L7620k1179N2326j53237L54331n0222k20533
13642C43362J61355K25569l32373j44921A08204K61257j6375O8777J72496q3760
$$ plain form
13713 381331 716215 756440 454987 308874 655630 453987 512156 916917 590235 248948
13702 560072 472194 425603 550258 505916 368004 709789 427701 406058 632059 647588
13692 647588 374874 404348 707124 370689 588797 538949 824287 266798 798308 506095
13682 506095 503275 340296 276701 460612 699453 1009212 597423 637787 442293 810587
13672 810587 657510 666183 463544 574933 579129 786856 554512 783795 133799 543100
13662 543100 741118 576963 202967 350545 155232 139737 494849 469441 479748 388512
13652 388512 593456 697739 344256 381876 360697 413023 259786 614117 563895 343362
13642 343362 504717 730286 397913 252992 108204 369461 353086 421863 594359 510599
13632E10599j22723f3017B25041O74R7253R2849k07695K58295N0991O988K5952
13621E50348L9756B74971K76445j05214J68709A96012O5611J24559J70415k73137
13611B83460J77333I7636K75937j003j12350M4573L86238j96562k33963L29731
13601E90237k9671k57920J90517J9797n317B36286L19233j69788r8678M28624
13591G15677C40280J38267a28151D69347K36208l09724J93863k70959M6722R292
13581C74749R8213k29594L7612b06604B03070K08785f2162C44756L7998A79486
13570C20609J55254j68536j01747K11700A82224J06085l639k9500L98270k45188
13560D08252N4898K2435o7620A27224O7915k4632J42082J2027j29014J98623J50290
$$ plain form
13632 510599 387876 -63017 225041 225715 322968 415817 208122 466417 517408 524396 550348
13621 550348 590104 274971 551416 446202 614911 196012 261623 386182 556597 283460
13611 283460 460793 97636 373573 372570 260220 304793 691031 494469 260506 590237
13601 590237 560566 302646 493163 512960 507643 236286 555519 385731 287053 715677
13591 715677 340280 478547 -128151 469347 705555 395831 589694 318735 365457 374749
13581 374749 472962 243368 280980 -206604 203070 411855 -62162 344756 382754 179486
13570 320609 475863 307327 205580 417280 182224 288309 284670 255170 653440 408252
13560 408252 463150 485585 417965 127224 195139 170507 312589 324616 195602 394225 544515
13549E44515j02857j55774A09921n1116K57852J01161j81121A05592L4714J76696
13539C17002J57514C5517K11401a8152A61361K24758K96198B14496B5661K71067
13529B96728q2230L17874k04393H4968K47018r397Q7010B5574L05833g32A26055
13517A75094l6005J22484J563R4712J07058j47662j20730O8743j02048L7106K1157
13506B21472O523J28412j54369N6512F6354L46908j02937O2520J33565j04956
13496D01454j42971P0548A16773J45326J07725J91956B37068H3346p134L25801
13486D02013A64453J05060B5331N7247J97662n1180b1110B71951A0924K25119
13476B36043r8923K61484M4968E1811b6483B88927I1061J5758K40246A20824n3820
$$ plain form
13549 544515 441658 285884 109921 58805 316657 417818 236697 105592 140306 317002
13539 317002 474516 35517 246918 -18152 161361 386119 682317 214496 25661 296728
13529 296728 214498 532372 327979 84968 331986 322589 409599 25574 331407 -732 126055
13517 175094 139089 261573 263136 357848 464906 317244 196514 265257 163209 200315 221472
13506 221472 227995 356407 202038 258550 66354 413262 310325 372845 506410 401454
13496 401454 258483 329031 116773 262099 369824 561780 237068 83346 76212 402013
13486 402013 164453 269513 25331 82578 280240 229060 -21110 271951 10924 236043
13476 236043 137120 398604 443572 51811 -26483 288927 91061 106819 347065 120824 67004
13465F7004L03323j44925l7326q5492Q617P5624J38425A41801L7857q7583L02377
13454C94452l7792J3676r5133r6852K93497j69236a376A20752l0952R7414Q5851
13443B73065r6259M8382A7815O08693C8983a7179C10125j49941E9335O7385L32610
13432D59330I5574J30029A00605m4848L32190m3455L7235j65686K42398A8161
13421A31676C1179K51271k6906m1183a00626C39939j12208P55j04798P4363O9140
13410B67191j29391K81756j98800R5869j16036l8815L03824j81062r9972n2273
13400A32291J27163J02524A18887j0154M040K97375o6603A16054O1963L59272
13390E37289C6790a59848A4063K84145J24960G7023A9245K22786p9562K18723
$$ plain form
13465 67004 370327 225402 188076 102584 111201 186825 325250 141801 179658 92075 394452
13454 394452 356660 370336 275203 178351 471848 302612 -1376 120752 89800 187214 273065
13443 273065 176806 225188 17815 626508 38983 -17179 310125 160184 59335 126720 459330
13432 459330 95574 225603 100605 55757 387947 344492 381727 216041 458439 18161
13421 131676 31179 282450 255544 214361 -100626 339939 227731 228486 123688 198051 267191
13410 267191 137800 419556 220756 316625 200589 161774 465598 284536 184564 132291
13400 132291 259454 361978 118887 108733 112773 410148 343545 116054 178017 537289
13390 537289 36790 -159848 14063 298208 423168 77023 19245 242031 162469 381192
13380C81192j26714b02232A90256P1091K75581j74698k8445H3012J58511D1271
13369I0094K38450A28369d6701C90853A06532K2368J29782j18466Q3882A06858
13358C33010A15675K2779J50869O8499E6635N1026J69103F9235L43103C6284c8222
13346E3622L68915j09374a99212A83708K55138j27039J18842A11119J69395o4984
13336B15530R1506K96460A14508K21476j24644j05507m0011K13750Q698m1318
13326B46952K34692k31759K4033o0398k4949M78459A20296J86896A28564o3047
13316F5517K36758A50672J71852J9936A17611M1422J87052n7879k8713F4144L48529
13305D12673P9286r5628h1657H3815K1321D4812J67590J03069A25867m9761Q4754
$$ plain form
13380 381192 254478 -202232 190256 261347 536928 362230 333785 83012 241523 41271
13369 90094 328544 128369 -46701 390853 106532 128900 258682 140216 224098 106858
13358 333010 115675 138454 289323 357822 56635 107661 276764 69235 412338 36284 -38222
13346 53622 422537 313163 -199212 183708 438846 311807 430649 111119 280514 215530
13336 215530 307036 603496 114508 335984 211340 105833 65822 279572 288270 246952
13326 246952 481644 249885 273918 213520 188571 667030 120296 307192 128564 65517
13316 65517 302275 150672 322524 342460 117611 159033 346085 288206 259493 64144 412673
13305 412673 491959 396331 -81657 83815 105136 44812 212402 315471 125867 76106 160860
13294A60860M14875k15594A74063N8439F1688O1868k5786a94002C32311o8933
13284B63378j19777A2061O34411C5939K43580f4900C33425p3018A07735a0071
13273b20067g3645A64532a76175C9052c32443A12117b52291F0884M308N550A4170
13261C52879b50121A88681q971J398l1561j6008k2361E5332O6527R7626J49029
13250C68514a98831A96352l1428a17255B60768C5492M27100b20933A0310K04603
13240B14913r0915K78305f2572A00369a5273G3826B2610J64370K8151K83231A84879
13228B64497L8037G7067Q6853e3557B92013r2725F2177B0362b15214D0841J31240
13217A72081a78335A60110H0049K37013j2803J07046A02013K3069p231A7716K74277
$$ plain form
13294 160860 575735 360141 174063 232502 61688 123556 97770 -194002 332311 263378
13284 263378 143601 12061 646472 35939 279519 -64900 333425 260407 107735 -10071
13273 -220067 -73645 164532 -176175 39052 -332443 112117 -252291 60884 65192 70742 14170
13261 352879 -250121 188681 179710 181108 149547 133539 111178 55332 121859 219485 368514
13250 368514 -198831 196352 164924 -117255 260768 35492 462592 -220933 10310 214913
13240 214913 123998 402303 -62572 100369 -15273 73826 22610 186980 215131 498362 184879
13228 264497 302534 77067 163920 -53557 292013 199288 62177 20362 -215214 40841 172081
13217 172081 -178335 160110 80049 317062 304259 411305 102013 125082 117851 17716 291993
13206B91993A5311K00026J13193A39185a080A84092Q4068j01695n1848J60530
13196B75147B5774a04527H274L33062A49263b64989d7162A50229m3920a45505
13185C44501A51360J21197n7293o2410A4018J71949a81322F7216Q34J55474K0742
13174B44266n5782J64969h7863o7868H9064M6722e13915a13502N6458C85755p1555
13163C14200m8961k317E1072a03197H3298b603E38395A75374O7818I909f9361
13151d04834A22682K471a12655m95265b0434A84025P0329b17712A67203p4100
13141I3103a08113A95445L01310a23601d4255L73H2593c6511B50853a39859H0407
13129D21302A85925l9446b9334J2291n8589b6046I4420B2499p755D477N4351M7437
$$ plain form
13206 291993 15311 215337 328530 139185 -1080 184092 268160 166465 114617 275147
13196 275147 25774 -104527 8274 341336 149263 -264989 -47162 150229 106309 -145505
13185 344501 151360 272557 215264 152854 14018 185967 -181322 67216 68050 223524 244266
13174 244266 188484 353453 -87863 -155731 89064 135786 -513915 -113502 -57044 385755 314200
13163 314200 265239 262922 51072 -103197 83298 -2603 538395 175374 243192 9909 -69361
13151 -404834 122682 125153 -112655 -607920 -20434 184025 254354 -217712 167203 93103
13141 93103 -108113 195445 496755 -123601 -44255 -43882 82593 -36511 250853 -139859 80407
13129 421302 185925 146479 -29334 -17043 -75632 -26046 94420 22499 14744 4477 58828 106265
13117A06265J66627N9948h7155G0438C1129e5564G1470i6346D0164j8793K1046
13106D2417J48188q6622H849J81708D9897c30098a09037K8907H0673P1975h7065
13094A76694L7576d0854a5874A47102d8929G9186j6857r415L12744E162K5765
13083C0927J5505c1767P480A17232L9481J1596E0111M15094F7208L58617e8561
13071B81966I8371J91032j39358J85783J00606c47619B21098j0157E1328j4721
13061C6607J32142h2102j20254h3906R659j574G6391J4529a39251A15193d8432
13049A3063L1261b75459B0852d9938l4513K279L0382D5985a51596D6293b70133
13037c83479A61752o8546e018H1910B6675O9382a67955A1308P1186Q5873l3379
$$ plain form
13117 106265 272892 332840 -87155 70438 31129 -55564 71470 -96346 40164 21371 42417
13106 42417 190605 103983 8849 190557 49897 -330098 -109037 -80130 80673 152648 -87065
13094 176694 214270 -40854 -15874 147102 -48929 79186 62329 52914 365658 5162 30927
13083 30927 46432 -31767 -24287 117232 156713 168309 50111 465205 67208 425825 -58561
13071 281966 98371 289403 150045 335828 436434 -347619 221098 210941 51328 36607
13061 36607 168749 -82102 -202356 -83906 -74247 -75821 76391 90920 -139251 115193 -48432
13049 13063 44324 -275459 20852 -49938 -84451 -82172 -51790 45985 -151596 46293 -270133
13037 -383479 161752 93206 -5018 81910 26675 96057 -167955 11308 82494 168367 134988
13026A34988e7282j99189A37647c66607F5056b4551F3860j144A7082L41251b41140
13014A7177c98689A20077b14498H0614Q6481g6941B5698a12021d0910A44855J37164
13003B82019d4852F8714a73332B36340a27659H4809b71016a34918A35375M0116
12993A75491E1810B768i794q9710A36249a42742A05517g0793K3350l45707a5698
12981c8929C49862a79758A9378A159K97754G9631C9598d5786A26965c1898r8975
12970a30873C3886a3229m445l2218n4307C2984J35748o4862e1303j96522E3270
12958A45613m9246k8398i0353A10070O6772q4747c29663B2088K61826b24824d0262
12946B60990r0827J67277c7810C4104a19722B09184c1259A46806L2797d6962A82678
$$ plain form
13026 134988 -57282 -256471 137647 -366607 65056 -24551 63860 62716 17082 358333 -241140
13014 17177 -398689 120077 -214498 80614 167095 -76941 25698 -112021 -40910 144855 282019
13003 282019 -44852 68714 -173332 236340 -127659 84809 -271016 -134918 135375 175491
12993 175491 51810 2768 -9794 -99504 136249 -142742 105517 -70793 -47443 -393150 -15698
12981 -38929 349862 -179758 19378 1159 298913 79631 39598 -45786 126965 -31898 -130873
12970 -130873 33886 -13229 -17674 -49892 -104199 32984 168732 103870 -51303 -247825 53270
12958 145613 96367 67969 -90353 110070 176842 92095 -329663 22088 283914 -224824 -40262
12946 260990 170163 337440 -37810 34104 -119722 209184 -31259 146806 179603 -46962 182678
12934a7255l1738B11977o3866c1007k47857a09079j01216g0398J9240G7720Q19
12923G8539g3227o6977f8538q8745r1797a06910j83230D13129b62563A28503m5538
12912H2965a62611G8093M428K52013c9696C77843a03055D11592f2733F5741d08417
12900C3985J1717O2713D5155J22792a6295E1575O4217n3999J12298j2195F5828
12888b5992A21208O1407A6985c32868k0518B48010F1774L02295a02918L751H771
12876c5556A17640A4161a80403b2278B72177c4844j75880c887A76250d6831I060
12864D2814a54375F0390a95556R0491E8284J25949b08964B6221b1403A74224E3773
12852a07610j58130I9230b17290I2435H640a25653A15928K54539G5599a95384
$$ plain form
12934 -17255 -48993 211977 148111 -31007 -278864 -109079 -210295 -70398 -51158 77720 78539
12923 78539 -73227 -140204 -68538 -157283 -249080 -106910 -290140 413129 -262563 128503 82965
12912 82965 -162611 78093 82521 334534 -39696 377843 -103055 411592 -62733 65741 -408417
12900 33985 45702 108415 45155 167947 -16295 51575 115792 61793 174091 161896 65828
12888 -25992 121208 182615 16985 -332868 -353386 248010 61774 364069 -102918 -99167 8771
12876 -35556 117640 14161 -180403 -22278 272177 -34844 -210724 -3887 176250 -46831 9060
12864 42814 -154375 60390 -195556 -105065 58284 184233 -208964 26221 -21403 174224 53773
12852 -107610 -265740 99230 -217290 92435 8640 -125653 115928 370467 75599 -195384
12841A02372B936d3628k46076h8703I6238C9911K50673i8208B30401E7043a22617
12829F008a7712j87387Q410P4868B6306J08867c28444A96170d2656E3523a45476
12817f8619I498d5119B51245E7238R1258e0952B59706a66884k8153A52188b59435
12805g7410c5888e275A61437h5832j01353B07652k9905k953D9288a41803c9486
12793C0818R8650N9979G5717R9795a17592d1663j71829c2615B72624F0335K06246
12782B66581H8384m2332b6158A10655a00088j12765E6907i4345p0104F0584a82830
12770D3754a98991P7111A51769a48601j07749A75034c07592A48238o0751g9209
12759C5215b95996J17741H9313L96a72560d1289m7564B7600j3531Q7143C9213
$$ plain form
12841 102372 2936 -43628 -289704 -88703 96238 39911 290584 -98208 230401 57043 -122617
12829 6008 -17712 -205099 -196689 -121821 26306 135173 -328444 196170 -42656 53523 -145476
12817 -68619 9498 -45119 251245 57238 148496 -50952 259706 -166884 -195037 152188 -259435
12805 -77410 -35888 -5275 161437 -85832 -187185 207652 177747 174794 49288 -141803 -39486
12793 30818 129468 189447 75717 175512 -117592 -41663 -213492 -32615 272624 60335 266581
12782 266581 88384 46052 -26158 110655 -100088 -212853 56907 -94345 -164449 60584 -182830
12770 43754 -198991 -121880 151769 -148601 -256350 175034 -307592 148238 87487 -79209
12759 35215 -295996 -178255 89313 89709 -172560 -41289 -88853 27600 14069 101212 39213
12747b57565e5331K3862k40374A58628c257j07846A2857a3801G1057b12279b9037
12735A55308F6287P1055c1521j6501n5313H7228b04915B80515F8906b26720R0413
12724a36307M8373B6312f4933B7186J29234l7457c3442A48234b26209C5517M5094
12713H0611J33344d0890A33521P2737J04861c04339d8034F3783a29581C9224a68411
12701F9053G586K48981d20895E015a14769A02988a18677B44903L369q1103J35140
12690C02309J9316H2840f2098C3236J52864a80167f9298q5708A07899A6286a05302
12678a21104G7157A2326m698c2643l05038A70045J53204A51827p2977a7469A57384
12666b27013d8131C58529c2832A01679a7073B26325L600o0668O2592a43755O3757
$$ plain form
12747 -257565 -55331 -31469 -271843 158628 -3257 -111103 12857 -13801 71057 -212279 -29037
12735 155308 66287 137342 -31521 -48022 -103335 87228 -204915 280515 68906 -226720 -136307
12724 -136307 -87934 26312 -64933 27186 156420 118963 -33442 148234 -226209 35517 80611
12713 80611 213955 -40890 133521 206258 311119 -304339 -48034 63783 -129581 39224 -168411
12701 69053 7586 256567 -420895 5015 -114769 102988 -118677 244903 248272 167169 302309
12690 302309 321625 82840 -62098 33236 186100 -180167 -69298 -155006 107899 16286 -105302
12678 -121104 77157 12326 7628 -32643 -337681 170045 323249 151827 78850 -17469 157384
12666 -227013 -48131 358529 -32832 101679 -17073 226325 229925 169257 231849 -143755 -79998
12655g9998A44604d4231B40719A9831J08847k8155f2924A69656L09934a12702
12644a4737r536m0273B04617h4279j1093A28165J12782E0164Q9084B5493i2777
12632C75143A58717d536B02834g9521H9179Q1883k3730L84K25967j25899a50410
12620a79669A16440J90236j28577J3174A0958b74654A99537g3513f575A16865
12609b19833R3580B75668j03621A2526h1383b1388j94584A87583o0522K19674
12599C46735C1565L6609L70606H9119K18417j19096i4615A42931b1532B32636
12588b09919C6155d4252B56695E5376K57607b84065h8029J6514g203r293I5491
12576g8630D2589a35222c2782j1705f936p474l6501j82061a00329L2484A25944
$$ plain form
12655 -79998 144604 -44231 240719 19831 128678 100523 -62924 169656 479590 -112702
12644 -14737 -24273 -64546 204617 -84279 -95372 128165 240947 50164 139248 25493 -92777
12632 375143 158717 -4536 202834 -79521 89179 171062 147332 147716 373683 247784 -150410
12620 -179669 116440 306676 178099 191273 10958 -274654 199537 -73513 -6575 116865
12609 -219833 -126253 275668 172047 12526 -81383 -21388 -215972 187583 127061 346735
12599 346735 31565 68174 438780 89119 307536 188440 -94615 142931 -21532 232636
12588 -209919 36155 -44252 256695 55376 312983 -284065 -88029 -71515 -7203 -16496 95491
12576 -78630 42589 -135222 -32782 -44487 -6936 -14410 -50911 -232972 -100329 -67845 125944
12564b60192B16427n6048a9737n1703D3386a60168B28389d8736p3626j30574A16035
12552a34418k0335o219A15801E104a55629g4194k39818J4155Q8627G323K5270
12541C2593M5299L0902a17389B09616b12784M2248C7605a42716g0322D6226b03255
12529c40713P9202b111A37715a80375A94256c0477A73780a21859E3253K77224
12519C30477A13192K2680F3282i7369o4945E3493J14497P9239m188a35534q4901
12508b20435G3136J65827o0860K2379o5149J48514A16024B2390Q8436b27809G4823
12496A11683D1534a20703B27227P5907j9510J82542j98099m383j16031C696N20067
12485E23763C1844K06159D5589b54543F6971J81295a20286A2679K43074a14414
$$ plain form
12564 -260192 216427 160379 -19737 -71440 43386 -160168 228389 -48736 -122362 -252936 116035
12552 -134418 -154753 -160972 115801 5104 -155629 -74194 -314012 -299857 -211230 7323 32593
12541 32593 77892 108794 -117389 209616 -212784 -170536 37605 -142716 -70322 46226 -203255
12529 -340713 -261511 -2111 137715 -180375 194256 -30477 173780 -121859 53253 330477
12519 330477 113192 135872 63282 -97369 -162314 53493 167990 247229 243041 -135534 -220435
12508 -220435 73136 238963 178103 200482 135333 283847 116024 22390 110826 -227809 74823
12496 111683 41534 -120703 227227 303134 283624 466166 268067 263684 147653 3696 523763
12485 523763 31844 238003 45589 -254543 66971 248266 -120286 12679 255753 -114414
12474D1185a22498j6801A95316a1574B51477a04209m8076e625A16175b52354G6755
12462B31209H575M91789H8291J03060h6034l22741J72349f234l40407g8957k2999
12451a01956C59025a27643B2903i673D0495J21276a87851A09624m1820a51924
12440b76975B4192e6780b3781A08989b28920d0719a1241j98845H5715a32901A1847
12428h2274A13877a11156H3853i7890K2678a7073p4351b5216A09972b60425A92463
12416i8041d5260G7046J98138b58391J15216k73912G5201c8178B0177i9905A189
12404C73942j39310B6676c9833A92953a54744f8320A03604a88260l2671j30610
12394c51541B05314N0982i6073F575c39830I40K95271E3648J00675K3053m9500
$$ plain form
12474 41185 -122498 -139299 195316 -11574 251477 -104209 -152285 -5625 116175 -252354 76755
12462 231209 8575 500364 88291 191351 -86034 -408775 -236426 -6234 -346641 -78957 -101956
12451 -101956 359025 -127643 22903 -9673 40495 161771 -187851 109624 67804 -151924
12440 -276975 24192 -56780 -23781 108989 -228920 -40719 -11241 -210086 85715 -132901 11847
12428 -82274 113877 -111156 83853 -97890 -75212 -17073 -91424 -25216 109972 -260425 192463
12416 -98041 -45260 77046 275184 -258391 -143175 -417087 75201 -38178 20177 -99905 1189
12404 373942 234632 26676 -39833 192953 -154744 -68320 103604 -188260 -220931 -351541
12394 -351541 205314 256296 -96073 6575 -339830 940 296211 53648 154323 177376 127876
12383A27876c5222D6992J29953L7288G9860R0552j2962l1814J4478L09481A6814
12371A92048J23876A5377a26814B12643a84883G878J61618K24110A46989J84412
12361C31401c2527k43278C73358c32477J58593A85161Q9544r4357a32952B22353
12350C7746J29455a13272M7408A00151c072n6511k01709B56375k1132I3797J90920
12339B84717l9925o05A05279G656L59541a9239A38737N2538H1137K37930A323
12327C27158A33575j3865J43982d6645D45676a07418A62119h1372B19828J04105
12317C23933A47414N0491r8354K70140J60795A44392a21079B85782c0640A85285
12306B37954L88135g3105A09503j7439M28264d0225G7871J9474K19925b9627A81651
$$ plain form
12383 127876 -35222 46992 176945 214233 79860 170412 157450 125636 140114 449595 16814
12371 192048 315924 15377 -126814 212643 -184883 7878 169496 393606 146989 331401
12361 331401 -32527 -275805 373358 -332477 -173884 185161 274705 180348 -132952 222353
12350 37746 167201 -113272 -65864 100151 -3072 -59583 -261292 256375 235243 93797 284717
12339 284717 244792 244187 105279 7656 367197 -19239 138737 191275 81137 319067 1323
12327 327158 133575 119710 263692 -46645 445676 -107418 162119 -81372 219828 323933
12317 323933 147414 197905 99551 369691 530486 144392 -121079 285782 -30640 185285
12306 237954 626089 -73105 109503 92064 520328 -40225 77871 97345 317270 -29627 181651
12294D17370O2938A73675a11170b7762C9854b60378D86406a66920G3396g5245
12283a773D8668e2433H7439K852c88216A71325K9278K6797j05181Q5290l3271
12272A74238b5804o2082m6823f6935A04665Q0138J19356F138K12973J21626C4670
12260A76180b9681B09263g9923k39831i9697B75515H7539j154B3409K5227K22053
12249B70689d1011j35162B44580c4413A54270D7953K88939i0380A33522B9784
12238B04273b73252i149B2013K86842J13943d7167e305A06660K6409l2195J4401
12227A15275J21723R0238J59252k09976o3222m7782K77956a68705D01808e2504
12216A96367J35714K1503J0834j63909a91074A7501K87503j23036j3101K32329
$$ plain form
12294 417370 480308 173675 -111170 -27762 39854 -260378 486406 -166920 73396 -75245
12283 -1773 48668 -52433 87439 90291 -388216 171325 200603 227400 122219 207509 174238
12272 174238 -25804 -87886 -134709 -66935 104665 184803 304159 6138 219111 340737 34670
12260 176180 -29681 209263 -79923 -319754 -99697 275515 87539 86385 23409 48636 270689
12249 270689 -41011 -176173 244580 -34413 154270 47953 336892 -90380 133522 29784
12238 204273 -273252 -9149 22013 308855 422798 -47167 -5305 106660 133069 100874 115275
12227 115275 236998 327236 486488 276512 213290 165508 443464 -168705 401808 -52504
12216 196367 332081 353584 364418 200509 -191074 17501 305004 181968 168867 401196
12206D01196A74163m4451J47761D7355K27584K3772L9426b26123C15118l983J94320
12195E05455A87094K46601N8978A09683J02964A02784L32765k9812J88279A25833
12184D04733A55268L08636j84224j35104J7642L58772I6550l1856K27576C7646
12173B79863L28p1290N1709k8836J28558n581A29291B3992K86024R588j30624
12162A88980K32216j54890D1643J35642p2532E1003J87316r4167b39031B94561
12151F2871L50210A92475e6912D29606c80002G5858h5809A81729H4111b12722
12140B56075A02456L0873J30621R3122A51905R00J04949k8129p5949J81913j50439
12129A85150K90367j33105j0832N3703o1379M7407n1366a883m0775A16150K37404
$$ plain form
12206 401196 174163 129712 277473 47355 274939 298711 338137 -226123 315118 311135 505455
12195 505455 187094 433695 492673 109683 212647 102784 435549 405737 594016 125833
12184 404733 155268 463904 279680 144576 162218 520990 96550 64694 292270 37646
12173 279863 280191 208901 260610 231774 360332 354751 129291 23992 310016 319604 188980
12162 188980 421196 266306 41643 177285 104753 51003 238319 144152 -239031 294561
12151 62871 413081 192475 -56912 429606 -380002 75858 -85809 181729 84111 -212722
12140 256075 102456 133329 263950 357072 151905 152805 257754 229625 153676 335589 185150
12129 185150 475517 342412 331580 385283 323904 371311 319945 -1883 -42658 116150 353554
12118C53554j67097R763C1687h6201j3224E29583n7238B13472q6538n1986J79218
12107B54166a05793a6863A32631f3996j30999d5547A54413C9195b47687Q4497
12097a63190I522a7999G3967a48008C5109R893K65886d0331A78653i0807b3402
12085B1773a17878M0563o8891E1214J25985a0046n0B69516A08351P212J96873
12074C12436p4519E1563j582P4973K21227f0755B3221L95977I610P9616a85493
12062c50731I1299J6317C8499K11525o3457d28476i0970A17301b08323D8184K99641
12051C47825b81916A18980J36040a58297a2511k19371g0721B07126m5848C2704
12040h62n1242l2313F0865a04506A3635Q1660J3544f981C94989j91606E1735d130
$$ plain form
12118 353554 186457 196220 31687 -86201 -99425 529583 472345 213472 126934 74948 254166
12107 254166 -105793 -16863 132631 -63996 -194995 -45547 154413 39195 -247687 -163190
12097 -163190 9522 -17999 73967 -148008 35109 45002 310888 -40331 178653 -90807 -23402
12085 21773 -117878 -77315 -146206 51214 177199 -10046 -10096 269516 108351 115563 312436
12074 312436 237917 51563 49981 124954 346181 -60755 23221 419198 9610 89226 -185493
12062 -350731 91299 107616 38499 250024 186567 -428476 -90970 117301 -208323 48184 347825
12051 347825 -281916 118980 255020 -158297 -12511 -231882 -70721 207126 161278 32704
12040 -862 -52104 -84417 60865 -104506 13635 95295 108839 -6981 394989 203383 51735 -4130
12027i3976B01701F313a34837f2204k2565C9793O4427K35252g7644k02379E6169
12015i3299k1847L8226n6000A18353d82344J04455a0485n8355D8771J18777A0550
12003f0137r5413P5890K4560j02951A6725c03445Q5357A81020i6136B97322i7188
11991B0029L37601c3169j98891B26907E0431b11125D23082B9889J55158E1306
11980I5675f6953I7430K3212l1743b1030F1726b44198E1988b19106p9888G0680
11968D019d35938J19045e338l48680A2402c32820I578c02778B59647a58011a1674
11956b8193k21498d7916l17985B18037a3015n5116K6728B12187F0016g6188j39832
11945b16020E6438O4012J93917f6543E1678J23567n8652a40313f717j51249B8731
$$ plain form
12027 -93976 201701 6313 -134837 -62204 -84769 39793 104220 339472 -77644 -280023 56169
12015 -93299 -115146 -76920 -132920 118353 -482344 -377889 -10485 -68840 48771 167548 10550
12003 -60137 -155550 -79660 -55100 -158051 16725 -303445 -218088 181020 -96136 297322 -97188
11991 20029 357630 -33169 -232060 226907 50431 -211125 423082 29889 185047 51306
11980 95675 -66953 97430 120642 88899 -21030 61726 -244198 51988 -219106 -298994 70680
11968 4019 -435938 -316893 -5338 -354018 12402 -332820 9578 -302778 259647 -158011 -11674
11956 -28193 -249691 -47916 -365901 218037 -13015 -68131 -41403 212187 60016 -76188 -216020
11945 -216020 56438 120450 314367 -66543 51678 175245 116593 -140313 -6717 -157966 28731
11933C4857e8623j64710b8776D1928P5669a29459a2246D05017g6255E8108a35722
11921I2356B4535K68644A6021J20477d2323m756k61336f3521p0944L0397A88900
11909A02518a7780A07131j3001b32208j69550A81453a95125R1178M9050k81935
11899c36832d448A20477J10211i97l3572J5931j65220A20638b53721I4511K4057
11888A18568n1862L15379c32066J24159L0959A15218J38822G0301b40933c2761
11877C3120e1768l00249A57586a73045h302l7240m6986m9924D9874a3561o4749
11866g8310k9509m5603c165l81282e0895J6970j7399k6811j33708j26046K5712
11855c12177D6813c8124j9456K3008n9817L6296B02665F3268b5523j38529B35826
$$ plain form
11933 34857 -58623 -223333 -28776 41928 117597 -129459 -12246 405017 -76255 58108 -135722
11921 92356 24535 293179 16021 136498 -42323 -47079 -308415 -63521 -134465 -104068 188900
11909 102518 -17780 107131 94130 -232208 -401758 181453 -195125 -103947 -54897 -336832
11899 -336832 -4448 120477 230688 -997 -34569 -18638 -183858 120638 -253721 94511 118568
11888 118568 66706 382085 -332066 -207907 -176948 115218 254040 70301 -240933 -32761
11877 33120 -51768 -352017 157586 -173045 -8302 -45542 -92528 -142452 49874 -13561 -78310
11866 -78310 -107819 -153422 -3165 -384447 -50895 -33925 -51324 -78135 -211843 -337889 -312177
11855 -312177 46813 -38124 -57580 -34572 -94389 -58093 202665 63268 -25523 -164052 235826
11843F3377A1500J17038a33075b8448A84564a50012q488l9430g4986c6883f924
11831h9595G1173l1650J95393b30524g4349j1829i442j53275e7j93049g4536j12739
11819a87275C6327b28950M3622m72411b95639B85686M3a2845A4157b2976O370
11808a6606k88949a38043f6688L0933j86246A03008a46096k24913M2720A69038
11797E9269b26421P2927A12735d89766E6422L81822b95583I261d4322l10503a21845
11785b7553l2345r4293j75724K2979B1660K5341b47240A49979E1383c23372d3834
11773A9586e9477q438j96716I0048Q2048q4221d6260G5850J31656b14440e275
11761a8579l20561a03237A78215L6922a28711k22056f7211D5785A6755c0778j06481
$$ plain form
11843 63377 11500 128538 -133075 -28448 184564 -150012 -158500 -197930 -74986 -36883 -6924
11831 -89595 71173 39523 234916 -230524 -74349 -86178 -9442 -162717 -57 -193106 -74536 -187275
11819 -187275 36327 -228950 -185328 -657739 -295639 285686 285729 -12845 14157 -22976 -16606
11808 -16606 -305555 -138043 -66688 -35755 -222001 103008 -146096 -371009 -328289 169038
11797 59269 -226421 -153494 112735 -489766 56422 438244 -295583 9261 -44322 -354825 -121845
11785 -27553 -59898 -154191 -329915 -306936 21660 47001 -247240 149979 51383 -323372 -43834
11773 19586 -59477 -67915 -264631 90048 172096 87875 -46260 75850 207506 -214440 -5275
11761 -18579 -339140 -103237 178215 215137 -128711 -350767 -67211 45785 16755 -30778 -137259
11750a37259a6432j05599A01799A0170a00298n980o4864O663K9552A2942L7082
11739E0024a07439c0474j93536L4638g8229D3475h936k3263j15714h831D1826
11727A97043a45422L6178l49834i676B6696N0780f5984j33009f8303b7103A54000
11715a11632F5731J41220D7602L03874I8962b65407K0164A64197N4338a27754
11704b97726E5592i2880D5358a06466E612a14554j55715K0611B35113B1066b72274
11692a00044k69458A18254b52739q3544h9112A29517b15278c7652A2329J07380
11682A19709b032H4742d03094D2349j8423b55682c5144A04688D3725c63589F5006
11670b63782a15809A8025a15846A15633b3501I3153K1050a61749P8089F1593B4955
$$ plain form
11750 -137259 -16432 -122031 101799 10170 -100298 -106278 -171142 -164479 -134927 12942 50024
11739 50024 -107439 -30474 -224010 -189372 -78229 43475 -8936 -32199 -147913 -8831 41826
11727 197043 -145422 -109244 -459078 -9676 26696 77476 -65984 -198993 -68303 -27103 154000
11715 -111632 65731 206951 47602 351476 98962 -265407 -245243 164197 218535 -127754
11704 -297726 55592 -92880 45358 -106466 5612 -114554 -270269 -249658 235113 21066 -272274
11692 -100044 -369502 118254 -252739 -336283 -89112 129517 -215278 -37652 12329 119709
11682 119709 -2032 84742 -403094 42349 23926 -255682 -35144 104688 43725 -363589 65006
11670 -263782 -115809 18025 -115846 115633 -23501 93153 114203 -161749 -83660 61593 24955
11658c2848C4824b07725e0930B36949c22259f4756o0507b246A02830M182a23711
11646a2045k83999j26294a21409L7947l08104I0845a74697L4771E2005g2967I1217
11634A79016j7937b25359c3607A14092A8652b47606B763c26593g2056l5757A39184
11622I7574b18695M4777f2118B0168J2146b95812J46514B43384C0916H592K7927
11611C6519a76792o5973M9594B95960e3879a2198r5912A39080c46504a02970B03463
11599i4242C72284a0113j83090O3975A19997a20141M7357j11354b0426q7347A5324
11587B99781c19904A76071i4930j61226a23548k02130D4284d985j60097c2817
11576e7491A3064e3503l9316A92778A4497a17310E5332a34734A27232e8603A27919
$$ plain form
11658 -32848 34824 -207725 -50930 236949 -322259 -64756 -125263 -2246 102830 107012 -123711
11646 -12045 -296044 -422338 -121409 -83462 -391566 90845 -174697 -139926 52005 -72967 91217
11634 179016 161079 -225359 -33607 114092 18652 -247606 2763 -326593 -72056 -107813 139184
11622 97574 -218695 -173918 -62118 20168 32314 -295812 -149298 243384 30916 8592 36519
11611 36519 -176792 -242765 -193171 295960 -53879 -12198 -108110 139080 -346504 -102970 203463
11599 -94242 372284 -10113 -193203 -129228 119997 -120141 -72784 -184138 -20426 -107773 15324
11587 299781 -319904 176071 -94930 -256156 -123548 -325678 44284 -4985 -165082 -32817
11576 -57491 13064 -53503 -92819 192778 14497 -117310 55332 -134734 127232 -58603 127919
11564b35969J13960j52309H4221c9352F9306a98561B10626H9044Q6555O2205a09270
11552b54595g3209o5312C58334H597g3464B20391k083A8174j938O6214a71831
11540D6205K24755a48985A20246E7252a54450I9012j4269a99134i5232b1325E407
11528b11488i3354k40974A02816C5803J71949a0636j24516B4176P9156b3910m9797
11517g3707C6272h4288B09954q2634b80739A11008B2348a35863B26897D7634f2052
11505A11766d7310B0595b51036B23016a11452j8234C52639r5276b07139B30236
11494b94491i2194B41225A06166R9290J30875D0015e7762p443b7660A59125E4134
11482a57255B78934G1932K5632K51962d8029A54548g6981C28797d296B87969b06951
$$ plain form
11564 -235969 -122009 -274318 84221 -39352 69306 -198561 210626 89044 175599 237804 -109270
11552 -254595 -73209 -138521 358334 8597 -73464 220391 218308 18174 16236 82450 -171831
11540 46205 270960 -148985 120246 57252 -154450 99012 84743 -199134 -95232 -21325 5407
11528 -211488 -93354 -334328 102816 35803 207752 -10636 -135152 24176 103332 -23910 -73707
11517 -73707 36272 -84288 209954 127320 -280739 111008 22348 -135863 226897 47634 -62052
11505 111766 -47310 20595 -251036 223016 -111452 -129686 352639 257363 -207139 230236
11494 -294491 -92194 241225 106166 205456 336331 40015 -57762 -65205 -27660 159125 54134
11482 -157255 278934 71932 97564 349526 -48029 154548 -76981 328797 -4296 287969 -206951
11470A04607e1983q9462a6986C39895i5646B89710K0766H6539O0512A4460K18396
11459B32856n5122m7208N2959b1421A3359K54973h1962B60213o1021r3382N3729
11448A59539J47219a00996A33093b5619I7950P623a55006A32043J144b76574a08000
11436A94769b5350H5571a19278p9970M2953C19752a2539C41821A50006k7764a39992
11424F9303c863r363j03769B44682n3755L19328k41353A24211H467b04520P2715
11413a31805N206e2986j76276f5921j89031i4659G5958i8083J952o4367d3080
11401A14730a19542o4835A51870c3109r5316k21561A81038c54268A77081G3369
11390c6900B32294a83680B8772n447J48383a11376A1810b79060J35526A10343
$$ plain form
11470 104607 -51983 -141445 -16986 339895 -95646 289710 310476 86539 147051 14460 232856
11459 232856 177734 130526 183485 -21421 13359 268332 -81962 260213 199192 105810 159539
11448 159539 306758 -100996 133093 -25619 97950 105573 -155006 132043 133187 -276574 -108000
11436 194769 -25350 85571 -119278 -199248 -156295 319752 -12539 341821 150006 122242 -139992
11424 69303 -3863 -13226 -116995 244682 190927 510255 268902 124211 8467 -204520 -131805
11413 -131805 -126599 -52986 -229262 -65921 -254952 -94659 75958 -98083 -96131 -160498 -43080
11401 114730 -119542 -184377 151870 -33109 -128425 -349986 181038 -354268 177081 73369
11390 -36900 232294 -183680 28772 23325 171708 -111376 11810 -279060 -143534 110343
11379e8963H6733a62088G1009I31b07523P1808j5275o8063A42337a73989A59509
11367A47262F8968J20699c17191j21275C76671F3227a90234P5932A00420c7293
11356E6428d1856j0667B70333H9990g6092C38884a68802m6120j4654B10842e7282
11344g2702j14986j50825J21668I3695J07825a50233B88030D4338f9301l38138
11334d07439H7572h475A18852h3997c6671m6133M0955j72270A457J47668o8162
11323H0963c27056J55348g0695F081a64108A1131N9315J31815c26391J10086J07724
11312a08581B41043h6646B6535J58185h5343D1982f02404E2952j5610c96388A09767
11300a22164B54944a22150C091Q358M2255P1709a94074r1995A19660J58894E5236
$$ plain form
11379 -58963 86733 -162088 71009 931 -207523 -135715 -150990 -219053 142337 -173989 159509
11367 147262 68968 189667 -317191 -438466 376671 63227 -190234 -114302 100420 -37293
11356 56428 -41856 -52523 270333 89990 -76092 338884 -168802 -214922 -229576 210842 -57282
11344 -72702 -187688 -338513 -216845 93695 201520 -150233 288030 44338 -69301 -407439
11334 -407439 87572 -8475 118852 -83997 -36671 -82804 -41849 -214119 1457 149125 80963
11323 80963 -327056 -171708 -70695 6081 -164108 11131 70446 202261 -326391 -216305 -108581
11312 -108581 241043 -86646 26535 184720 -85343 41982 -602404 52952 37342 -396388 109767
11300 -122164 254944 -122150 3091 11449 53704 125413 -194074 -286069 119660 278554 55236
11288b23970O1263G1481b43122i4556k57170c2258q1443M4447F3580a87006A01930
11276a49299K2626A91054l7461P7027i483n6124C2149a46875e1788D4921Q7435
11265A32356a49718I6744i9877A9032a56344D5433e29815e0718q4247B18116A05239
11253f9491A15640a7908j83206c591A19414f5303K5552J1233j51345q8313G1367
11241i7708B72291b75119h8160p3384A40460o95G137J02169b70327G5248A43J53527
11229A53670c11203B26811c0949F9440j6706P8130j6456A6734a74849j52905B38447
11217a13515b560m37515e5233q4758A32320A0439b7296H1453J35502I4321b20941
11205c20581e8086a7092C02224i7926B67568j24752k172b16152a216k1889E2437
$$ plain form
11288 -223970 -162707 71481 -243122 -94556 -351726 -32258 -113701 -69254 63580 -187006 101930
11276 -149299 -126673 191054 153593 230620 -9483 -65607 32149 -146875 -51788 44921 132356
11265 132356 -149718 96744 -99877 19032 -156344 45433 -529815 -50718 -134965 218116 105239
11253 -69491 115640 -17908 -201114 -3591 119414 -65303 -39751 -28518 -179863 -268176 71367
11241 -97708 272291 -275119 -88160 -161544 140460 139765 7137 109306 -270327 75248 143 153670
11229 153670 -311203 226811 -30949 69440 52734 130864 114408 16734 -174849 -327754 238447
11217 -113515 -2560 -440075 -55233 -139991 132320 10439 -27296 81453 216955 94321 -220941
11205 -320581 -58086 -17092 302224 -97926 267568 142816 140644 -216152 -1216 -23105 52437
11193c1707F7018C0517a22985A19822a83457l3827P3714k5276A74343a30980N3185
11182g7795A70961a19276L0140o0828a4424m6747f623l16636f288F8795K28711
11171B97506j10552e5705j35856H604b1360B14391a84662N4090G0600b68198I8582
11159b59164q9403Q9723r0377Q9678q9213B1059K47500c80948b51k13327A19857
11147d7242n6759C073a39000j27222J11884M933P4283P703C61490j71014B6341
11135C0339K5967N3924a01009B29839f3617j34226L0086D39341A7900a149j17039
11124a18188M1198r683A46724h1955B20035c09247e2672B98932e4741j225K1921
11113c4045C356J29374j6524K57061c91190a40460C7287J60976J00981o7590j8183
$$ plain form
11193 -31707 67018 30517 -122985 119822 -183457 -217284 -143570 -168846 174343 -130980 -77795
11182 -77795 170961 -119276 -89136 -149964 -14424 -61171 -6623 -323259 -6288 68795 297506
11171 297506 186954 -55705 -191561 8604 -21360 214391 -184662 -130572 70600 -268198 98582
11159 -259164 -348567 -258844 -349221 -259543 -348756 21059 268559 -380948 -251 -213578 119857
11147 -47242 -104001 3073 -139000 -266222 -154338 -149405 -75122 -67419 361490 190476 26341
11135 30339 56306 110230 -101009 229839 -63617 -197843 -167757 439341 17900 -1149 -118188
11124 -118188 -76990 -86673 146724 -81955 220035 -309247 -52672 298932 -54741 -55966 -34045
11113 -34045 3356 132730 116206 373267 -391190 -140460 37287 198263 299244 231654 213471
11102B13471r5864a95327C3331K4420J72125G9634L5166J22268a59158C20452
11091A11217l983O8239p4937l452J05341c2274A31495J01922m2194A0659J59543
11080A70202Q182K51889O1390k06692A35068K15072b05872A83661Q6610a37256
11069B64803J23490j24595R2103j15430p0095L6268K6639Q0585M3076J61601J13174
11058F31619K4092B22997R9169L05342K4397k55089L53360j00085j09336r0064
11048D50691N4534J80626J37782m6136j62570L17412k99839L29206j2763o5850
11038H83093J04813j37613R7626L9747m68433L88494n7595k5888K49668l72922
11028G00990K37834j32032m5440J52419j30608j17758J67108j12779L16225k17376
$$ plain form
11102 213471 117607 -195327 33331 57751 229876 79634 114800 237068 -159158 320452
11091 111217 107234 175473 100536 97084 202425 -32274 131495 233417 191223 10659 170202
11080 170202 178384 430273 491663 284971 135068 350140 -205872 183661 270271 -137256
11069 264803 388293 263698 355801 240371 170276 206544 233183 313768 356844 518445 631619
11058 631619 655711 222997 322166 627508 651905 396816 750176 650091 540755 450691
11048 450691 505225 685851 823633 777497 614927 932339 632500 961706 948943 883093
11038 883093 987906 850293 947919 987666 519233 907727 850132 824244 1073912 700990
11028 700990 938824 806792 761352 913771 783163 665405 832513 719734 1035959 818583
11018H18583K0757l72981M22870J0003l05490k20118K71184A74361K88718P3950
11008E37029J21900J33926k14400K47475k32005j9610j7882K06785m9893k04871
10998E08454m8609K37556R8925C40417L8484L86090j49898J5957J28523j7312
10988G42261J97766j03842j75507O5966N537l1607J21961J90000q8417P803K12296
10977A144217J12786Q8072j90967K23113K2178n6650O02785L56484n6265O58179
10967B903932l53484N70136k54328P9464k62579K83293j80989l75574m32885j44936
10957A832050p17008K53309k81852k53659J52084p8051m8936j37904j11254J98172
10947H06951j69894A93776N1995k8659B8808M83417j99862j03836J16989A09589
$$ plain form
11018 818583 839340 466359 889229 899232 593742 373624 644808 174361 463079 537029
11008 537029 658929 792855 578455 825930 593925 574315 556433 763218 713325 508454
10998 508454 459845 697401 796326 340417 378901 764991 615093 631050 759573 742261
10988 742261 940027 836185 660678 726644 732181 700574 822535 1012535 924118 931921 1144217
10977 1144217 1257003 1345075 1154108 1377221 1399399 1342749 1945534 2302018 2245753 2903932
10967 2903932 2550448 3120584 2866256 2945720 2683141 2966434 2785445 2409871 1976986 1832050
10957 1832050 1115042 1368351 1086499 832840 984924 906873 857937 720033 608779 806951
10947 806951 637057 193776 245771 217112 28808 512225 312363 208527 325516 109589
10936C16623H5037i7288D87073A49107e8202B24895A03179B3695L6537j7087f3033
10924G1373b40635i1577k2256q0690F6463b35813I2186J71560a68152F0412b18135
10912c8407A02922a95557j19263I7004P9269E3296k4066J98916o4982e5727C61547
10900B7935b68126J18567m3194A10043a21341A32818D7034a19367L5972A73656
10889a05998k05104A13975J00294n1959i8879A7470b40220a09801F6539J63106
10879B29645H0061h5161E5410b03779e0987l9647E0154a99791k5468b3864l31473
10868c55337Q3130J22253A07214J5188a17590B08618a14188L9111B04720J83685
10858C88405b4780A42334a04710G1433p354a8865p0136m6946K7353L7414B776
$$ plain form
10936 316623 85037 -97288 487073 149107 -58202 224895 103179 23695 60232 43145 -63033
10924 71373 -240635 -91577 -113833 -194523 66463 -235813 92186 263746 -168152 60412 -218135
10912 -38407 102922 -195557 -314820 97004 176273 53296 29230 228146 163164 -55727 361547
10900 27935 -268126 -149559 -192753 110043 -121341 132818 47034 -119367 -83395 173656
10889 -105998 -311102 113975 214269 162310 -98879 17470 -240220 -109801 66539 229645
10879 229645 80061 -85161 55410 -203779 -50987 -90634 50154 -199791 -225259 -23864 -355337
10868 -355337 -272207 -149954 107214 122402 -117590 208618 -114188 -75077 204720 388405
10858 388405 -24780 142334 -104710 71433 64079 -18865 -89001 -135947 -108594 -71180 2776
10846c5072j25315I3770f2152p3503C2759e4236C70646b00768I4940a71681E6346
10834I7502g4972j38317C13436b3801A00289a68584L0029A8972h2361k22851B84391
10822b14802h7100D3319I851a26591j69221d9414A33131l8550g9434L9242j57794
10811a97986R5402J1018d0680q1998K0012A30614c74480J76425j17089g2951j59633
10800b32584P0499A54328b46166G56b35971A17507n8689L76897b25266a03742
10789b41922N5795a5487m70717D1442h9535d921k68312A47487E4322a96116L8892
10778a57224B10925F0271j5c4929j42584C07637a55217j27648A18318I35a42883
10766a51636B68665h2228o7909e3173q3782D04685c9509B29866G0205b82759A59891
$$ plain form
10846 -35072 -160387 93770 -62152 -135655 32759 -54236 370646 -200768 94940 -171681 56346
10834 97502 -74972 -213289 313436 -23801 100289 -168584 -138555 18972 -82361 -305212 284391
10822 -214802 -87100 43319 9851 -126591 -295812 -49414 133131 94581 -79434 -40192 -197986
10811 -197986 -102584 -91566 -40680 -122678 -102666 130614 -374480 -198055 -315144 -72951 -232584
10800 -232584 -162085 154328 -246166 756 -235971 117507 58818 435715 -225266 -103742
10789 -241922 -186127 -15487 -486204 41442 -89535 -4921 -273233 147487 54322 -196116 -157224
10778 -157224 210925 60271 60256 -34929 -177513 307637 -155217 -282865 118318 935 -142883
10766 -151636 268665 -82228 -150137 -53173 -136955 404685 -39509 229866 70205 -282759 159891
10754c33156J56263E6060a46920k46495A528a08975N0821a0191k446k23658g4671
10742A82235a16074N1010l10104a16490J5502c0214J4076j1418A66716a03888
10731a93164k96013F1748J72912c4346A22320m3355b74197H7M8084a762A012b71574
10718b95425G7234A8978O9847R3345c26230e4617j85127j09050J03783E7352K9533
10707H6885a53942A51342i5364A64210m387a4639A72799a68045P5859C4150j034
10696C3116d3426n7513D738O6371I371L70585A2531f6392r2368P7581A85302g3644
10683a23475j13986E1470N2982h9590A78659a24484m9253F3319b05986P9026k26847
10672c53807C1136c047k14569R8466N8999k91480A27590n8259e03782B12165C9199
$$ plain form
10754 -333156 -176893 56060 -146920 -393415 1528 -108975 -58154 -10191 -12637 -236295 -74671
10742 182235 -116074 -65064 -375168 -116490 -100988 -30214 -16138 -27556 166716 -103888
10731 -193164 -489177 61748 234660 -34346 122320 78965 -274197 87 48171 -1762 1012 -271574
10718 -295425 77234 18978 88825 182170 -326230 -54617 -239744 -348794 -245011 57352 86885
10707 86885 -153942 151342 -95364 164210 159823 -14639 172799 -168045 -92186 34150 33116
10696 33116 -43426 -100939 4738 71109 9371 379956 12531 -66392 -158760 -81179 185302 -73644
10683 -123475 -237461 51470 104452 -89590 178659 -124484 -173737 63319 -205986 -126960 -353807
10672 -353807 31136 -3047 -217616 -119150 -60151 -351631 127590 69331 -503782 212165 39199
10660a91357j82108c4375j06963B49502a13791l7614j21143J00526J3501j1564
10650a70085h0928E760J05553n1019A610h1202k52902b6171n7002A45702a03916
10638a26818A94873C7093a70997A64843d0580r8634D3343e9301J6937b856j29125
10627a31981I9474b36227j1542k5372P2346F0727b9908j20014K9362k48873a51921
10615B35275a06414j338L7247A49536a18123A8915b79399O0692g3637A5382O2942
10604G8324H551b1788A36161a75804a5044j66430A06401B0371K2325m513J33661
10593A71844O4956b6302k52655a04194K5749I3839C1185a5997j47484M2970b2712
10581B24088b73399B61851k9744j15805h05m96888b32819L1994q252D6358b17345
$$ plain form
10660 -191357 -373465 -34375 -141338 249502 -113791 -151405 -272548 -172022 -158521 -170085
10650 -170085 -80928 5760 111313 60294 1610 -81202 -334104 -26171 -83173 145702 -103916
10638 -126818 194873 37093 -170997 164843 -40580 -139214 43343 -59301 -42364 -2856 -131981
10627 -131981 99474 -236227 -247769 -273141 -200795 60727 -29908 -149922 -120560 -369433 -151921
10615 235275 -106414 -107752 -70505 149536 -118123 18915 -279399 -218707 -73637 15382 78324
10604 78324 8551 -21788 136161 -175804 -15044 -181474 106401 20371 42696 38183 171844
10593 171844 236800 -26302 -278957 -104194 -78445 93839 31185 -15997 -163481 -120511 -22712
10581 224088 -273399 261851 232107 116302 -805 -497693 -232819 -200825 -209077 46358 -217345
10569B37666H6820f1850J0779h739B09889a13466H9225a2911m11372J69429f4657
10557b35989a05193C17322a24598K5835B11997g6797B11809i9547d4292n3621
10547i7913C76648e44248A39908f3789o4905m0529B07613h5026K9814j81527A84288
10535c17806P9072k15359A19192c8244j91767i7277j09334E2128g0186E314i4855
10523a10623A72207d99117a28150E6310b18424b222j68879h1909r3267d2082k3170
10512f5252F482N1057a54391k83032B15351b29474d4543j2701j31381I1608a28472
10500c10704a46507A03733d1059o6593A36563b43841Q0368D99132j50668b48332
10489C1166J13996A8522a72421b7430k18688a0362l04010a07634n3245b4548J1103
$$ plain form
10569 237666 86820 -61850 -51071 -8739 209889 -113466 89225 -12911 -424283 -254854 -64657
10557 -235989 -105193 317322 -124598 -98763 211997 -76797 211809 -99547 -44292 -97913
10547 -97913 376648 -544248 139908 -63789 -128694 -169223 207613 -85026 -55212 -236739 184288
10535 -317806 -238734 -454093 119192 -38244 -230011 -97277 -206611 52128 -70186 5314 -94855
10523 -110623 172207 -499117 -128150 56310 -218424 -2222 -171101 -81909 -175176 -42082 -65252
10512 -65252 6482 57539 -154391 -437423 215351 -229474 -44543 -57244 -188625 91608 -128472
10500 -310704 -146507 103733 -41059 -107652 136563 -243841 -163473 499132 348464 -248332
10489 31166 145162 18522 -172421 -27430 -246118 -10362 -314372 -107634 -160879 -24548 -13445
10478a3445j69264M2059B37167A3008Q9667e6232i732B9121I041K02266b39160
10466A08699a6953j02148j40655A1383a5147m70474c4296k82903P3712P0256j27804
10455c01035B70514h882J035j85959j70531a28705B38466h1091A895a59806F6068
10443b26D8364P41a56105d1642C0955j0381c38648O6511C8085a18606j0702K7410
10431a01898B28902a2130j47098C49626E3887a23162B2285b39406h6946m38885
10421e25831f6129n0626k71484D7586c1206C1666c51950e8288j25877r4514B25816
10409B78670f4376O402k05638B00549F3947d73511a31024j31849B37274r2955
10399A44319F5828a03976m26864g9620A99718h3080A29308b0116C7349L10853
$$ plain form
10478 -13445 -182709 -140650 237167 13008 102675 -56232 -9732 29121 9041 211307 -239160
10466 108699 -16953 -119101 -259756 11383 -15147 -485621 -34296 -317199 -243487 -173231 -301035
10455 -301035 270514 -8882 -7847 -193806 -364337 -128705 238466 -81091 1895 -159806 66068
10443 -226 48364 49105 -156105 -41642 30955 20574 -338648 -272137 38085 -118606 -129308 -101898
10431 -101898 228902 -12130 -159228 349626 53887 -123162 22285 -239406 -86946 -525831
10421 -525831 -66129 -116755 -388239 47586 -31206 31666 -351950 -58288 -184165 -278679 225816
10409 278670 -64376 -57974 -263612 200549 63947 -473511 -131024 -262873 237274 144319
10399 144319 65828 -103976 -530840 -79620 199718 -83080 129308 -20116 37349 348202
10389C48202J72373n1407A6761J89082a8553B54188H2923K48225A14569h5378
10378C781J1736a1251o8442C4930J49000Q5482A25102a24723b6677A34564J97434
10367C31998j62631M56228d1008C21478j19507J88207j34545l4952J37745e146
10356B55345B9098L43901B4792K35866A04922R7634J02131J0752k2202L01967
10346E95204j91381K23131B51022j17804J00386D2638N1212j5497a50911P4585
10336g6326l4806F26654j59904c4022B7453K03524r385K99635a09223B00173p9214
10325A20959a06002B9323K03990a74084B51636e8562G9030R3492l0927B9834A4483
10313c20698B27028f6150A2218P5327A2640J9500c3124B13685c7276a2832L18
$$ plain form
10389 348202 520575 469168 16761 205843 -18553 254188 82923 331148 114569 -85378
10378 3781 15517 -11251 -79693 34930 183930 269412 125102 -124723 -26677 134564 331998
10367 331998 169367 625595 -41008 321478 201971 390178 255633 220681 358426 -5146
10356 255345 29098 372999 24792 260658 104922 202556 304687 315439 293237 595204
10346 595204 403823 626954 251022 133218 233604 42638 93850 78353 -150911 -76326
10336 -76326 -111132 626654 466750 -34022 27453 230977 221592 521227 -109223 200173 120959
10325 120959 -106002 29323 233313 -174084 251636 -58562 79030 172522 141595 29834 14483
10313 -320698 227028 -66150 12218 87545 12640 32140 -33124 213685 -37276 -12832 -12514
10302a2514l9035A62296J41540A44021o4113J62055E0361b24959o827i0408l04542
10291c94950A14838O6872k4704b61550A75723b05540O5346B12887c6064r7107
10281a33171j61922I4132K4015C605b28486h6942b7340F6635K44524e6942B06169
10269b41889a3521D00513j47178d94103a79397B61254j27611a19602K4401k58464
10259c53665O0862f6370q5164C57637a17047L0436a0178m6773A36942H375O5087
10248G3462P9873L6582E1861a03307F9282A8156J54899b9205n7897p3333j54413
10237c14848d7136A08066b0771B86391K0859a40945l4145j05303L6102e2056j68843
10226b20899n6296A03264d16465B86948f5730k15364B87358a54120A76680a52330
$$ plain form
10302 -12514 -51549 162296 303836 144021 79908 241963 50361 -224959 -231786 -90408 -394950
10291 -394950 114838 181710 157006 -261550 175723 -205540 -140194 212887 -36064 -133171
10281 -133171 -295093 94132 118147 3605 -228486 -86942 -27340 66635 311159 -56942 206169
10269 -241889 -13521 400513 253335 -494103 -179397 261254 133643 -119602 -95201 -353665
10259 -353665 -292803 -66370 -151534 357637 -117047 -86611 -10178 -56951 136942 8375 73462
10248 73462 153335 189917 51861 -103307 69282 18156 173055 -29205 -87102 -160435 -314848
10237 -314848 -47136 108066 -20771 286391 307250 -140945 -175090 -280393 -244291 -52056 -220899
10226 -220899 -277195 103264 -416465 286948 -65730 -281094 287358 -154120 176680 -152330
10215a61415P5557r1560a3798k51499C5735d52443J54912J16603e4842q6045c3358
10203h0194j4596j56424J1007h6149j24555A1322Q0707b48094a21662j29221e3346
10191a65750h0393l59141R5607D4963J28903B7918c57033a72891M5458o9435O9798
10180a27070J8150F1899b79365B24352A6308b56156o3710f5448l1646M2787A96012
10168h0077B41027A6934c41650P3324a11474b0404A50390i7786j61449h8882j04079
10157a92961A25353a10650k83790A18525I396i7078F0885A0421a48702I3990O8916
10146A62906a42031M8930L1374a0378j6277r2129E4641e39800a00014A81932e5639
10134a67295j05042b3945I4119O4721b02749j13993f831l2896j26810B44496H7472
$$ plain form
10215 -161415 -85858 -177418 -13798 -265297 35735 -452443 -297531 -180928 -54842 -140887 -33358
10203 -80194 -94790 -251214 -240207 -86149 -210704 11322 92029 -248094 -121662 -250883 -53346
10191 -165750 -80393 -439534 -343927 44963 173866 27918 -357033 -172891 -127433 -196868 -127070
10180 -127070 -108920 61899 -279365 224352 16308 -256156 -319866 -65448 -97094 -54307 196012
10168 -80077 241027 16934 -341650 -268326 -111474 -20404 150390 -97786 -259235 -88882 -192961
10157 -192961 125353 -110650 -394440 118525 9396 -97078 60885 10421 -148702 93990 162906
10146 162906 -142031 -93101 -61727 -10378 -26655 -118784 54641 -539800 -100014 181932 -55639
10134 -167295 -272337 -23945 94119 158840 -202749 -316742 -6831 -39727 -166537 244496 87472
10122g3445j47148i629H1615J2726k4989b15360A71838a32380F3379i577j57598
10111a67175j1943C55238A6347o153b65118a05822L4154I6361J2409C5975J24045
10100A60020k9077M0998a97650B18127c36833A27357b81562I7206N6820c8248
10089e8183K6591k30515a11352A35651F5399i6268c1232l4776G6345B7562b21080
10077I2021b43713j9434R2426I628b31998A99952b43492g8870I8707a09401C207
10065a35099B45696a81570H3182R069a12597D4765d581q0832r7034Q4796D0483
10053b59482A32055a54867C52498A66397a12258J5597M1895k29160a5251H382
10042i5779q3047p2488P9697C85720A48606D5536c11733a52127j0607L0082j62867
$$ plain form
10122 -73445 -220593 -9629 81615 94341 69352 -215360 171838 -132380 63379 -9577 -167175
10111 -167175 -179118 355238 16347 10194 -265118 -105822 -71668 96361 108770 35975 160020
10100 160020 130943 171941 -197650 218127 -336833 127357 -281562 97206 154026 -38248
10089 -58183 -31592 -262107 -111352 135651 65399 -96268 -31232 -66008 76345 27562 -221080
10077 92021 -243713 -263147 -170721 9628 -231998 199952 -243492 -78870 98707 -109401 3207
10065 -135099 245696 -181570 83182 92251 -112597 44765 -4581 -85413 -182447 -97651 40483
10053 -259482 132055 -154867 352498 166397 -112258 -96661 -54766 -283926 -15251 8382
10042 -95779 -178826 -251314 -171617 385720 148606 45536 -311733 -152127 -162734 -132652 -295519
10031b95519B37770b3818l5376B23607F8557a23744p9159d5303P262r8928D9069
10019I2446f1386l835a2435m4087A88992D70a25022b6651B036i9499A7797l251
10007A4546a18622K8237o2870B66417c6673o0083A15146J25031a34717K4448j6299
9996a26568B26096d53660a97665C6716a16925A10084c58280a09681C17662c35131
9985C47818G2343J18299E7660h3173l64016a66175j78760c4675B7362b78456a2852
9973b46092i2988j10547A03899b71938c9479F9601b56333d50C19329A15917C2676
9961G1474b53993B13702j9874b12518F2921g8898B2920b23271j02839a55095D2400
9949b4864j80137O1991m4913d519D21242b9722k80543A41546B6928a08048a2896
$$ plain form
10031 -295519 237770 -23818 -59194 223607 68557 -123744 -202903 -45303 -38041 -136969 49069
10019 92446 -61386 -65221 -12435 -56522 188992 470 -125022 -26651 2036 -99499 17797 14546
10007 14546 -118622 -90385 -153255 266417 -36673 -96756 115146 240177 -134717 -110269 -126568
9996 -126568 226096 -453660 -197665 36716 -116925 110084 -358280 -109681 317662 -335131
9985 347818 72343 190642 57660 -83173 -447189 -166175 -344935 -34675 27362 -278456 -12852
9973 -246092 -92988 -203535 103899 -271938 -39479 69601 -256333 -450 319329 115917 32676
9961 71474 -253993 213702 193828 -212518 62921 -78898 22920 -223271 -326110 -155095 42400
9949 -24864 -205001 -143010 -187923 -4519 421242 -29722 -310265 141546 26928 -108048 -12896
9937A06037a34869A77831c63034I9024K08300G6831B3575J34613a665l06485L2835
9926b75315i4872K5982m3304A04864f3370A52193a14536o4791B44075M9239b29073
9914A00203B2911b04947j41735A4106b40773J12997N0781F5742C0744e8240j71978
9903b30218f0185q2438j56539h9304k26523E9704g0632B44229b26190K1678H2691
9891b6015k51983a30822l6762M8722o0263d5865k33085R4983E5461G960b265F3079
9878b77592F3614d31894a81546j7881j30465a10740B78926b17925g7346a5175
9867C94555d36329g2846l91278b20620a5978I6883a70436c5439d790j1999j07225
9856a24014D3351i0162B9141c8426j07264B2565a45696H1820C1968K4160b99453
$$ plain form
9937 106037 -134869 177831 -363034 99024 307324 76831 23575 158188 -1665 -308150 -275315
9926 -275315 -94872 -68890 -112194 104864 -63370 152193 -114536 -179327 244075 293314 -229073
9914 100203 22911 -204947 -346682 14106 -240773 -127776 -76995 65742 30744 -58240 -230218
9903 -230218 -60185 -142623 -299162 -89304 -315827 59704 -70632 244229 -226190 -204512 82691
9891 -26015 -277998 -130822 -167584 -118862 -179125 -45865 -278950 -183967 55461 7960 -2265 63079
9878 -277592 63614 -431894 -181546 -199427 -329892 -110740 278926 -217925 -77346 -15175
9867 394555 -436329 -72846 -464124 -220620 -15978 96883 -170436 -35439 -4790 -16789 -124014
9856 -124014 43351 -90162 29141 -38426 -145690 22565 -145696 81820 31968 56128 -299453
9844a64225j035A56990a5804j44114q0695A55869M5696c9874c688j81391O5587
9833a19492M4957G7215L9364B2965a16882J8760k02264l4108J29164K1057P8612
9822a05661f536j2868q7289D3182a40742M864J3068j91461C0266J6541a60568
9810b54979i0563o3468m9782C13947b15290m5963N4748K5094E9338O6756b8146
9798A6405L1121c1131B1157a62788k70920C80870a74376C39221b90744A04486
9787g4747l0726B7881a51524L2098B77625A3690a69985L1786r1487K2262G913
9775B28529a85861j64745a59414b6624A13121B6018a87334j08079B44532a99108
9764a70239c5135F6103c93073a0518A24236j1452a5393A94719e0426C2626I602
$$ plain form
9844 -164225 -165260 156990 -15804 -159918 -240613 155869 201565 -39874 -3688 -185079 -119492
9833 -119492 -74535 77215 116579 22965 -116882 -98122 -300386 -334494 -205330 -184273 -105661
9822 -105661 -6536 -19404 -106693 43182 -140742 -135878 -122810 -314271 30266 46807 -160568
9810 -254979 -90563 -154031 -203813 313947 -215290 -261253 -206505 -181411 59338 126094 -28146
9798 16405 47526 -31131 21157 -162788 -433708 380870 -174376 339221 -290744 104486
9787 -74747 -105473 27881 -151524 -119426 277625 13690 -169985 -138199 -229686 -207424 7913
9775 228529 -185861 -350606 -159414 -26624 113121 26018 -187334 -295413 244532 -199108
9764 -170239 -35135 66103 -393073 -10518 124236 112784 -15393 194719 -50426 32626 9602
9752a66938A22794g5659B6701b60489h8263A00844a62368l5187r4295a40267c150
9740a3228H7136a95378j36399A76783d1844j72351B81989a03203k2123j72685
9730b98011f3618n7891c0640k29235D3503d5796j47271b6173m90179a86899K6168
9719a60731a4173p1343H3861g6756m1461l41817L0268A8944a89203M535k58380
9708d43048a06324L4995j66763k18269L8692a87669A61383i1266d2296E8277c2306
9696a39250A2730J6398K05002h9189G8163j9124K2137B7292e2381q2260d4911
9684a21628A29785e3925j4059l70268b6868j51161H05L1819c11727G0484e2677
9672B1980A308b75047b1467j09774C08763A01514P7164b12418B37468a8013D3028
$$ plain form
9752 -166938 122794 -75659 26701 -260489 -88263 100844 -162368 -197555 -291850 -140267 -3150
9740 -13228 87136 -195378 -331777 176783 -41844 -214195 281989 -103203 -125326 -298011
9730 -298011 -63618 -121509 -30640 -259875 43503 -45796 -193067 -26173 -516352 -186899 -160731
9719 -160731 -14173 -85516 83861 -76756 -118217 -460034 -429766 18944 -189203 -184668 -443048
9708 -443048 -106324 -71329 -238092 -456361 -417669 -187669 161383 -91266 -42296 58277 -32306
9696 -139250 12730 29128 234130 -89189 78163 59039 81176 27292 -52381 -134641 -44911
9684 -121628 129785 -53925 -67984 -438252 -26868 -178029 805 32624 -311727 70484 -52677
9672 21980 1308 -275047 -21467 -131241 308763 101514 178678 -212418 237468 -18013 43028
9660a75265h6127C7498K19687d9763r053r6486A39661b1487j6255l76003a71247
9648A1012K72771b173I6397c11190p951A87014p4793j2791h2314E3168J94231
9637B47399a20046A74016b77963m2728J57005A2820a95003f4928A70047G8708
9626a5920j38716F254K36961b81704K0671i7501A964b18914R5329A7579b22997
9614g2313l62546A00554i7964n3828k32452Q4657J44916l8539c8379j15978B32377
9602h4168q9116k6789G9933B464b85036H8766a25370B44472a82534g9218k84712
9591c63930a2998n7175F7780J7324a34869B27538a33096k15095J72703N2677c4965
9579a76285D6852R1328d18239M583a41403F2888i7187A72508k4508a4214j73930
$$ plain form
9660 -175265 -86127 37498 257185 -49763 -58816 -155302 139661 -21487 -37742 -413745 -171247
9648 11012 283783 -2173 96397 -311190 -319141 187014 112221 99430 -82314 53168 247399
9637 247399 -120046 174016 -277963 -320691 -163686 12820 -195003 -64928 170047 78708
9626 -15920 -154636 6254 243215 -281704 -261033 -97501 1964 -218914 -123585 17579 -222997
9614 -72313 -434859 100554 -97964 -151792 -384244 -299587 -154671 -193210 -38379 -154357 232377
9602 -84168 -173284 -200073 79933 2464 -285036 88766 -125370 244472 -182534 -79218 -363930
9591 -363930 -12998 -70173 67780 85104 -134869 227538 -133096 -348191 -175488 -122811 -34965
9579 -176285 46852 138180 -418239 -413656 -141403 62888 -97187 172508 148000 -14214 -188144
9568a88144a5950A07396a63477j09574O8533Q4814J1630a640j83554A9433a94195
9556B19709C3905d25839A2496h6703D4157o522c5475G6291c82491C062a29864
9544a05090D6452J31846b5538A01946J12044m8034b7891A38157h2550A54265a68061
9532b65925B0254P9370J67055b40882A57160R6076a46092B9665e1778j123G7005
9520B9671J05796C7192J06226a94198p2958b2062F2646a77085G1374b7830k30944
9509b58774h9694D3437b47745A01191c49470a15838A15860b13089F2109N9706
9499A21815a11928B1372a38185C32626b23315B300J0501a37716C6758j8104c16963
9487A23642M1366h5787k39784e0907B08764O110a35948J5598j1165C923h5388
$$ plain form
9568 -188144 -15950 107396 -163477 -273051 -204518 -119704 -108074 -1640 -185194 19433 -194195
9556 219709 33905 -425839 12496 -86703 44157 37635 -35475 76291 -382491 3062 -129864
9544 -105090 46452 178298 -25538 101946 213990 165956 -27891 138157 -82550 154265 -168061
9532 -265925 20254 99624 266679 -240882 157160 253236 -146092 29665 -51778 -52901 77005
9520 29671 135467 37192 143418 -194198 -267156 -22062 62646 -177085 71374 -27830 -258774
9509 -258774 -89694 43437 -247745 101191 -349470 -115838 115860 -213089 62109 121815
9499 121815 -111928 21372 -138185 332626 -223315 2300 12801 -137716 36758 18654 -316963
9487 123642 165008 -85787 -325571 -50907 208764 214874 -135948 -120350 -131515 3923 -85388
9475b92254R6696B32197d785j94519A13753L9187c34598a32208L1160b9557I9859
9463a47749d8914k28121I7795M8987a85728E1115h0848j25426A79840g3549L5934
9452c7615g320k2274m747q0870L4421q9058F1266n8K0419a23965a0523A10187
9439b20177B0836J45444C0908K4886a19134B1871Q0225J9581a4076j51772g1A12589
9426I2823g6150j19443A5583Q5167b90442h2157k23254J21186A06837N3974D4205
9414i8813E1276d4975G2578a17247R37o4651K5453e6935o0978j11149c6102k9961
9402f6063A11098B6796J40222b6975A18835J14284e2525B74178e8300A77456b60265
9390b37140h1498m0336A94034a39531B328K7263d8338m48115K47207a5512D9938
$$ plain form
9475 -292254 -195558 232197 -4785 -199304 113753 152940 -334598 -132208 -101048 -29557 99859
9463 -147749 -48914 -277035 97795 146782 -185728 51115 -80848 -206274 179840 -73549 -37615
9452 -37615 -7320 -29594 -34341 -115211 -80790 -169848 61266 61208 81627 -123965 -10523 110187
9439 -220177 20836 166280 30908 55794 -119134 21871 102096 121677 -14076 -165848 -71 112589
9426 92823 -76150 -195593 15583 100750 -290442 -82157 -305411 -184225 106837 160811 44205
9414 -98813 51276 -44975 72578 -117247 -116310 -180961 -155508 -56935 -117913 -229062 -36102 -66063
9402 -66063 111098 26796 167018 -26975 118835 233119 -52525 274178 -58300 177456 -260265
9390 -237140 -81498 -121834 194034 -139531 2328 29591 -48338 -496453 -249246 -15512 49938
9378c03485a37093j30513a14734C6969b962j63364e2287o9736E9708J18719E8990
9366F7824i4055A60062n999c62863J50879r0110e4915I0909a96861p0721j7967
9355b85549M3456c1013j46290A0675b00691a1994D9474A8645Q2759c9850A78796
9343d17040J79134A33296j7587O5796l2465c50504B44196a06918j39361f5541
9332b5242D7183c59097C68532b87083B30578A07918b05886L19A28419J9961D9482
9320B3311K9526c37096A74778A6776c0080j01526J3223d453B21002b63851k5882
9309b89733b4266O32l73621d2575J710j66690c1706H4636e56614b05148Q8250
9298a16898k19828g3149A01649O9813K64072A39090J04062b89126J40547E5667
$$ plain form
9378 -303485 -137093 -267606 -114734 36969 -2962 -166326 -52287 -122023 59708 178427 58990
9366 67824 -94055 160062 154063 -362863 -211984 -302094 -54915 90909 -196861 -267582 -285549
9355 -285549 -242093 -31013 -177303 10675 -200691 -11994 49474 18645 101404 -39850 178796
9343 -417040 -237906 133296 115709 181505 149040 -350504 244196 -106918 -246279 -65541
9332 -25242 47183 -359097 368532 -287083 230578 107918 -205886 -205567 128419 148380 49482
9320 23311 52837 -337096 174778 16776 -30080 -131606 -118383 -4453 221002 -263851 -289733
9309 -289733 -24266 -23634 -397255 -42575 -40865 -207555 -31706 84636 -556614 -205148 -116898
9298 -116898 -336726 -73149 101649 171462 435534 139090 243152 -289126 -148579 55667
9287B7275b33826n7970j40226a89279B38220f1322D7363a03403j79240m4791C2612
9275h9699F0387J17563b56725i7580k20978c9956n8891m2642A8389J2867a90514
9263e7354J1992A46517o2375A9412J74568a91399B796L50722c53964B67264E2975
9251c64888d5134A25320K7610J0388B8599a50026G8100b08167p496k5483J3324
9240b27822A76586m3994b52509A73152G7982i0723n6877o2909b5802k84151O0374
9229b49579d7530j72266e0665A13490l8768b60514b0975k67136A37532E1768J47235
9218A99003k9438n8572b16787A33657c9770m72868A48371n1732h6328g283A69872
9206b52312l6835B82337c48874B76320j37673h477k052j0999k60514j87034K06368
$$ plain form
9287 27275 -233826 -291796 -432022 -189279 238220 -61322 47363 -103403 -282643 -327434 32612
9275 -89699 60387 177950 -256725 -97580 -318558 -39956 -98847 -141489 18389 31256 -190514
9263 -57354 -45362 146517 84142 19412 193980 -191399 2796 353518 -353964 267264 52975
9251 -364888 -45134 125320 152930 163318 28599 -150026 78100 -208167 -215663 -241146 -227822
9240 -227822 176586 132592 -252509 173152 77982 -90723 -147600 -210509 -25802 -309953 -249579
9229 -249579 -47530 -219796 -50665 113490 74722 -260514 -20975 -288111 137532 51768 199003
9218 199003 169565 110993 -216787 133657 -39770 -512638 148371 96639 -86328 -7283 169872
9206 -252312 -289147 282337 -348874 276320 138647 -8477 -10529 -21528 -282042 -469076 -262708
9195b62708g0337E8368g3515A50246a54403M5453k17201g6787Q31a2843k30478
9184b43321A43890a2245j69813C03868i7003r3871O499C94716F2362c4039B43165
9172A84589m0842a91473A52059a07663A37025h211k86288i4875A3660K05785b15014
9160C014K36415B970a46992j12681I7512N0314a85515k7685f747A93917l1780
9149A62137a21978B1354i0354b9928j4290a7693A56036b34175B7785i702B13352
9137c82674B81793a86797J4050A17536j1529d18638J01777d5939B03154C8109
9126b9559j91759O6421j36268i8603K7155j06107I5844J91839a94590i5277a9113
9114a97874A38345a70219p5222d3184a6323p8010G2584e5978r7349n9638A20008
$$ plain form
9195 -262708 -70337 58368 -73515 150246 -154403 -108950 -326151 -76787 -75956 -12843 -243321
9184 -243321 143890 -12245 -182058 303868 -97003 -190874 -184375 394716 62362 -34039 243165
9172 184589 143747 -191473 152059 -107663 137025 -8211 -294499 -94875 13660 219445 -215014
9160 3014 239429 2970 -146992 -259673 97512 147826 -185515 -213200 -6747 193917 162137
9149 162137 -121978 21354 -90354 -29928 -44218 -17693 156036 -234175 27785 -9702 213352
9137 -382674 281793 -186797 -172747 117536 106007 -418638 -316861 -45939 203154 38109
9126 -29559 -221318 -154897 -291165 -98603 -71448 -177555 95844 287683 -194590 -95277 -19113
9114 -197874 138345 -170219 -245441 -43184 -16323 -94333 72584 -55978 -153327 -212965 120008
9102b31662P5515b5552F0942f6300D84503a57156Q267R941r0436O0655k702q1170
9090b52601f7661B54883a75268P135j70996C24397A38798a97197a2089B77260
9079a7209j20581p5673C94693D403a74175A08865a42996D66494i5919q3090p7262
9068b56271e1522A0745b28439E1966N3970f4102A5419K07030H8394P2089b01373
9056a41848G7197o016c64617B05058h4135E1351Q6690B656i6523L6753a7593B5258
9043e3323j75993e7840o8449D3800b65478b2471C0281b78925d8743B85356i9693
9031a98692G3590a61939F6699O8562k3235b12589h4235j09220d8848j50249J7999
9020a81098L2014k2276D6361N0701b46752Q1878O476J7911A16049N1609m4805
$$ plain form
9102 -231662 -156147 -25552 60942 -66300 484503 -157156 -148889 -138948 -229384 -168729 -171431 -252601
9090 -252601 -67661 254883 -175268 -168133 -339129 324397 138798 -197197 -12089 277260
9079 -17209 -137790 -213463 394693 4403 -174175 108865 -142996 466494 -95919 -179009 -256271
9068 -256271 -51522 10745 -228439 51966 105936 -64102 15419 222449 88394 160483 -201373
9056 -141848 77197 71181 -364617 205058 -84135 51351 138041 2656 -96523 -59770 -17593 25258
9043 -53323 -229316 -57840 -126289 43800 -265478 -22471 30281 -278925 -48743 285356 -99693
9031 -198692 73590 -161939 66699 135261 112026 -212589 -84235 -193455 -48848 -199097 -181098
9020 -181098 -149084 -171360 46361 97062 -246752 -164874 -158398 -140487 116049 167658 122853
9009A22853R6381c31541B15837i7151j95009a39335p4304A02188e5110k59897
8999c15007O1783A0465b22566f8099C6877K59819a03817j10822R0453d0000n7668
8988i7668m34866A53293b00331B35655d67052e016l49957a31219q6202B08130
8977e1521j52817C8998a08754G4827K0676k0684b67836k8814F3602J03043e7540
8965b9104j35299n0955g6173g435A2796b09761E1933a59835j54065q1484a97446
8953b76541L5055I0217a0937l40170A34017k724m384E7506d15351b3954k7821
8942e1775D091a92963h3553k02918a04708j558d8506A54672a58920A29402k8028
8931A01374j2846B3495J11129b11211g8089C8107d29494I7443L3855c4988E52092
$$ plain form
9009 122853 219234 -331541 215837 -97151 -292160 -139335 -213639 102188 -55110 -315007
8999 -315007 -253224 10465 -222566 -68099 36877 296696 -103817 -214639 -124186 -40000 -97668
8988 -97668 -532534 153293 -200331 235655 -467052 -5016 -354973 -131219 -217421 208130
8977 -51521 -204338 38998 -108754 74827 95503 74819 -267836 -296650 63602 166645 -57540
8965 -29104 -164403 -215358 -76173 -7435 12796 -209761 51933 -159835 -313900 -395384 -197446
8953 -276541 -241486 90217 -10937 -351107 134017 131293 126909 57506 -415351 -23954 -51775
8942 -51775 4091 -192963 -83553 -286471 -104708 -106266 -48506 154672 -158920 129402 101374
8931 101374 88528 23495 134624 -211211 -78089 38107 -429494 97443 131298 -34988 552092
8919H63404J944093K461780k144539D86590D9095P852a13380d9775j09650F2733
8908G9330A6263L29631M3317a9487A25872D0344d88729B10097O688a09760C7219
8896b26472A30560d1411q5162K1415l65091B19814f419D6113b65592M0028B50490
8884b56785g7637j79286h2457m4085D1964K27121M1055B7304f122B66728A02702
8872a4093G1786J48179c8145F9728C1189c63868C7746a60260e9089F8851L9885
$$ plain form
8919 863404 2807497 5269277 3124738 486590 49095 56947 -113380 -49775 -159425 62733
8908 79330 16263 345894 389211 -19487 125872 40344 -488729 210097 216785 -109760 37219
8896 -226472 130560 -41411 -126573 -105158 -470249 219814 -6419 46113 -265592 -225564 250490
8884 -256785 -77637 -256923 -82457 -126542 41964 269085 310140 27304 -6122 266728 102702
8872 -14093 71786 219965 -38145 69728 31189 -363868 37746 -160260 -59089 68851 108736
$$ [...]
##END NTUPLES=NMR SPECTRUM
##END=
