
##TITLE=AC1296_UGARS11108_6615178_16VFo8Pvjh
##JCAMPDX= 6.0         $$ Bruker NMR JCAMP-DX V2.0
##DATA TYPE= NMR SPECTRUM
##DATA CLASS= NTUPLES
##ORIGIN= BRUKER
##OWNER= Administrator
$$ 1.72 TOPSPIN		Version 2.1
$$ 2012-08-03 03:54:33.921 -0500  Administrator@TOPSPIN
$$ Compression mode = diff/dup
##.OBSERVE FREQUENCY= 400.02188249412
##.OBSERVE NUCLEUS= ^1H
##.ACQUISITION MODE= SIMULTANEOUS (DQD)
##.ACQUISITION SCHEME= undefined
##.AVERAGES= 64
##.DIGITISER RES= 22
##SPECTROMETER/DATA SYSTEM= spect
##.PULSE SEQUENCE= noesygpps1d.comp
##.SOLVENT NAME= COFFEE_meoh
##.SHIFT REFERENCE= INTERNAL, COFFEE_meoh, 1, 14.963
##AUDIT TRAIL= $$ (NUMBER, WHEN, WHO, WHERE, PROCESS, VERSION, WHAT)
$$ ##TITLE= Audit trail, TOPSPIN		Version 2.1
$$ ##JCAMPDX= 5.01
$$ ##ORIGIN= Bruker BioSpin GmbH
$$ ##OWNER= Administrator
$$ $$ C:\Bruker\TOPSPIN/data/COFFEE/nmr/AC1296_UGARS11108_6615178_16VFo8Pvjh/22/pdata/1/auditp.txt
$$ ##AUDIT TRAIL=  $$ (NUMBER, WHEN, WHO, WHERE, PROCESS, VERSION, WHAT)
(   1,<2012-08-03 03:54:29.312 -0500>,<Administrator>,<TOPSPIN>,<go>,<TOPSPIN 2.1>,
      <created by zg
	started at 2012-08-03 03:42:59.031 -0500,
	POWCHK enabled, PULCHK disabled,
       configuration hash MD5:
       6B 1B 68 BB D9 2E 58 E2 7F 35 AD 54 07 DF 0E 41
       data hash MD5: 64K
       F6 41 BC 4A 09 E4 16 E8 EC BD 10 F2 8F FB 28 DA>)
(   2,<2012-08-03 03:54:32.000 -0500>,<Administrator>,<TOPSPIN>,<proc1d>,<TOPSPIN 2.1>,
      <Start of raw data processing
       efp LB = 0.3 FT_mod = 6 PKNL = 1 PHC0 = 0 PHC1 = 0 SI = 128K 
       data hash MD5: 128K
       7B 56 3C 5E AC 15 14 C9 BA AA 2C FA 58 F3 B8 F6>)
(   3,<2012-08-03 03:54:33.187 -0500>,<Administrator>,<TOPSPIN>,<proc1d>,<TOPSPIN 2.1>,
      <pk PHC0 = 2.790527 PHC1 = 0 
       data hash MD5: 128K
       1D 4D 5A 97 05 29 79 11 57 48 41 97 1A 94 FA 15>)
(   4,<2012-08-03 03:54:33.421 -0500>,<Administrator>,<TOPSPIN>,<proc1d>,<TOPSPIN 2.1>,
      <abs ABSG = 1 
       data hash MD5: 128K
       2A 94 63 7B BF 32 86 8A DD FA 1B 59 C7 2E 29 6A>)
(   5,<2012-08-03 03:54:33.484 -0500>,<Administrator>,<TOPSPIN>,<proc1d>,<TOPSPIN 2.1>,
      <abs ABSG = 2 
       data hash MD5: 128K
       3B 2E A7 3F F8 F1 1E 2F 89 B0 AF 30 F0 42 F2 B6>)
(   6,<2012-08-03 03:54:33.578 -0500>,<Administrator>,<TOPSPIN>,<proc1d>,<TOPSPIN 2.1>,
      <abs ABSG = 3 
       data hash MD5: 128K
       A5 11 C6 E7 F2 8B BE C9 32 07 99 A0 28 7B 0A 0A>)
(   7,<2012-08-03 03:54:33.781 -0500>,<Administrator>,<TOPSPIN>,<proc1d>,<TOPSPIN 2.1>,
      <abs ABSG = 4 
       data hash MD5: 128K
       3C 65 9C 5B 57 45 9E 6C EE 16 26 18 60 1E 53 BA>)
(   8,<2012-08-03 03:54:33.828 -0500>,<Administrator>,<TOPSPIN>,<proc1d>,<TOPSPIN 2.1>,
      <abs ABSG = 5 
       data hash MD5: 128K
       CB 02 C5 AC A4 9A DA 5C E3 36 C7 58 37 4B 26 E6>)
$$ ##END=
$$ 
$$ $$ hash MD5
$$ $$ 4C DC 96 5E 1C C9 9F 4E 14 83 CE 51 A7 5C 39 A0
##$RELAX= 
##$RELAX= 
##$RELAX= 
##$RELAX= 
##$RELAX= 
##$RELAX= 
##$RELAX= 
##$RELAX= 
$$ Bruker specific parameters
$$ [...]
150 150 150 150 150 150 150 150
##$TP07= 0
##$TPNAME0= <>
##$TPNAME1= <>
##$TPNAME2= <>
##$TPNAME3= <>
##$TPNAME4= <>
##$TPNAME5= <>
##$TPNAME6= <>
##$TPNAME7= <>
##$TPOAL= (0..7)
0.5 0.5 0.5 0.5 0.5 0.5 0.5 0.5
##$TPOFFS= (0..7)
0 0 0 0 0 0 0 0
##$TUNHIN= 0
##$TUNHOUT= 0
##$TUNXOUT= 0
##$USERA1= <user>
##$USERA2= <user>
##$USERA3= <user>
##$USERA4= <user>
##$USERA5= <user>
##$V9= 5
##$VALIST= <valist>
##$VCLIST= <CCCCCCCCCCCCCCC>
##$VD= 0
##$VDLIST= <DDDDDDDDDDDDDDD>
##$VPLIST= <PPPPPPPPPPPPPPP>
##$VTLIST= <TTTTTTTTTTTTTTT>
##$WBST= 1024
##$WBSW= 4
##$XGAIN= (0..3)
0 0 0 0
##$XL= 0
##$YL= 0
##$YMAX_a= 15816097
##$YMIN_a= -8243961
##$ZGOPTNS= <>
##$ZL1= 120
##$ZL2= 120
##$ZL3= 120
##$ZL4= 120
##$ABSF1= 14.963
##$ABSF2= -5.595181
##$ABSG= 5
##$ABSL= 3
##$ALPHA= 0
##$AQORDER= 0
##$ASSFAC= 0
##$ASSFACI= 0
##$ASSFACX= 0
##$ASSWID= 0
##$AUNMP= <proc_prof1d_extract.lims>
##$AXLEFT= 0
##$AXNAME= <>
##$AXNUC= <1H>
##$AXRIGHT= 0
##$AXTYPE= 0
##$AXUNIT= <>
##$AZFE= 0.1
##$AZFW= 0.1
##$BCFW= 0
##$BC_mod= 0
##$BYTORDP= 0
##$COROFFS= 0
##$CY= 15
##$DATMOD= 1
##$DC= 0
##$DFILT= <>
##$DTYPP= 0
##$F1P= 0
##$F2P= 0
##$FCOR= 0.5
##$FTSIZE= 131072
##$FT_mod= 6
##$GAMMA= 0
##$GB= 0
##$INTBC= 1
##$INTSCL= 1
##$ISEN= 128
##$LB= 0.3
##$LEV0= 0
##$LPBIN= 0
##$MAXI= 10000
##$MC2= 0
##$MEAN= 0
##$ME_mod= 0
##$MI= 0
##$NCOEF= 0
##$NC_proc= -2
##$NLEV= 6
##$NOISF1= 0
##$NOISF2= 0
##$NSP= 0
##$NTH_PI= 0
##$NZP= 0
##$OFFSET= 14.963
##$PC= 1
##$PHC0= 2.790527
##$PHC1= 0
##$PH_mod= 1
##$PKNL= yes
##$PPARMOD= 0
##$PPDIAG= 0
##$PPIPTYP= 0
##$PPMPNUM= 2147483647
##$PPRESOL= 1
##$PSCAL= 4
##$PSIGN= 0
##$PYNMP= <proc.py>
##$REVERSE= no
##$SF= 400.020008836777
##$SI= 131072
##$SIGF1= 0
##$SIGF2= 0
##$SINO= 400
##$SIOLD= 131072
##$SPECTYP= <>
##$SREGLST= <1H.CDCl3>
##$SSB= 0
##$STSI= 131072
##$STSR= 0
##$SW_p= 8223.68421052631
##$SYMM= 0
##$S_DEV= 0
##$TDeff= 65536
##$TDoff= 0
##$TI= <>
##$TILT= no
##$TM1= 0
##$TM2= 0
##$TOPLEV= 0
##$USERP1= <user>
##$USERP2= <user>
##$USERP3= <user>
##$USERP4= <user>
##$USERP5= <user>
##$WDW= 1
##$XDIM= 131072
##$YMAX_p= 426889208
##$YMIN_p= -13057
##$CURPLOT= <Network HP LaserJet P1505>
##$CURPRIN= <$Network HP LaserJet P1505>
##$DFORMAT= <normdp>
##$LAYOUT= <+/1D_H.xwp>
##$LFORMAT= <normlp>
##$PFORMAT= <normpl>
##$SURQMSG= 1
$$ End of Bruker specific parameters
$$ ---------------------------------
##NTUPLES= NMR SPECTRUM
##VAR_NAME=  FREQUENCY,     SPECTRUM/REAL,   SPECTRUM/IMAG
##SYMBOL=    X,             R,               I
##VAR_TYPE=  INDEPENDENT,   DEPENDENT,       DEPENDENT
##VAR_FORM=  AFFN,          ASDF,            ASDF
##VAR_DIM=   131072,        131072,          131072
##UNITS=     HZ,            ARBITRARY UNITS, ARBITRARY UNITS
##FACTOR=    0.0627417313425164, 1,          1
##FIRST=     8223.62146879497, 4672,         -49597
##LAST=      0,             5279,            -50016
##MIN=       0,             -13057,          0
##MAX=       8223.62146879497, 426889208,    0
$$ Real data points
##PAGE= N=1
##DATA TABLE= (X++(R..R)), XYDATA
$$ [...]
60971A389087J2839J3037J5143J7439J8741K0733K4981K9980L3709L6911M1266
60960A653866M6448N1606N7629O5175P2729P9473Q7661R8968J10910J20232J27454
60949B572151J34571J40925J45540J51086J60974J74674J90333K09718K35381
60940D115353K65217K95244L26012L60933M00831M46420N03520N78246O69276
60931G961052P73128Q94886J044592J226470J444972J719953K080426K544491
60923A9689970L124227L839932M670666N447192N837669N541646M556006L221908
60915E5929216J967066J011951L50143l9147q0498K36185O56234P48216K43626
60906F1022992p45273j868886k858806l667228m340097m850766n098478n023122
$$ plain form
60971 1389087 1401926 1414963 1430106 1447545 1466286 1487019 1512000 1541980 1575689 1612600 1653866
60960 1653866 1700314 1751920 1809549 1874724 1947453 2026926 2114587 2213555 2324465 2444697 2572151
60949 2572151 2706722 2847647 2993187 3144273 3305247 3479921 3670254 3879972 4115353
60940 4115353 4380570 4675814 5001826 5362759 5763590 6210010 6713530 7291776 7961052
60931 7961052 8734180 9629066 10673658 11900128 13345100 15065053 17145479 19689970
60923 19689970 22814197 26654129 31324795 36771987 42609656 48151302 52707308 55929216
60915 55929216 57896282 58908233 59258376 59219229 59138731 59374916 60031150 60779366 61022992
60906 61022992 60277719 58408833 55550027 51882799 47542702 42691936 37593458 32570336
60898C2570336m668632m142560l550603k970221k450217k010300j646264j346405
60890I785134j103270r10908p60069o41310n48346m75549m16468l67265l27605
60881D234344k96008k67965k40441k14540j91629j70322j49549j31489j18820
60872B453581j11118j06069j02347r9513r6640r2848q8136q2652p6302o9669o3829
60861A464458n8672n2976m6729m1578l8288l5565l2243k8914k6425k4387k2212
60850A056469k0269j8981j7940j6768j5760j4964j3807j2291j1350j1340j1375
60839H91624j0844j0426j0845j1684j2240j2519j2735j2758j2704j3005j3323
60828G58541j2491j0311q292p720p962p589o319m870l576k235r39j49mj87k29
$$ plain form
60898 32570336 27901704 23759144 20208541 17238320 14788103 12777803 11131539 9785134
60890 9785134 8681864 7770956 7010887 6369577 5821231 5345682 4929214 4561949 4234344
60881 4234344 3938336 3670371 3429930 3215390 3023761 2853439 2703890 2572401 2453581
60872 2453581 2342463 2236394 2134047 2034534 1937894 1845046 1756910 1674258 1597956 1528287 1464458
60861 1464458 1405786 1352810 1306081 1264503 1226215 1190650 1158407 1129493 1103068 1078681 1056469
60850 1056469 1036200 1017219 999279 982511 966751 951787 937980 925689 914339 902999 891624
60839 891624 880780 870354 859509 847825 835585 823066 810331 797573 784869 771864 758541
60828 758541 746050 735739 727447 719727 711765 704176 697857 692987 689411 687176 686237 686088 686084 685897 685668
60813F85668K51J345K598L422L945M818O106P117P629Q355R675J0799J0834J0033
60799G72595R210Q492P432N935M262K459M45j432k668l322l979m948n930o529
60785G82022o765p038p738q904j0092j0671j0373r512q584p730o778n666m726
60772F77445m406m745n221n327n185n279n553n237l915k331j585j804k108j804
60758F22945j080n07l19k21L08J495K921L875M244M701N713O734O971O549O244
60743F70573O297O210N651M777L589J740p71l300n251o656p850q948r857j0481
60729F45723j0711j0425r758r158r004r221r431r389r189r029q871q471p854p443
60715E17769p474p505p046o431o382o726o513n601n056n486n977n468m352l684
$$ plain form
60813 685668 685919 687264 689862 693284 697229 702047 708153 715270 722899 731254 740929 751728 762562 772595
60799 772595 781805 790297 797729 803664 807926 810385 810830 809398 806730 803408 799429 794481 788551 782022
60785 782022 775257 768219 760481 751577 741485 730814 720441 710929 702345 694615 687837 682171 677445
60772 677445 673039 668294 663073 657746 652561 647282 641729 636492 632577 630246 628661 626857 624749 622945
60758 622945 621865 621358 621039 620818 621126 622621 625542 629417 633661 638362 644075 650809 657780 664329 670573
60743 670573 676870 683080 688731 693508 697097 698837 698066 694766 689515 682859 675009 666061 656204 645723
60729 645723 635012 624587 614829 605671 596667 587446 578015 568626 559437 550408 541537 533066 525212 517769
60715 517769 510295 502790 495744 489313 482931 476205 469692 464091 459035 453549 447572 442104 437752 434068
60701D34068l548l283k862k743k671j909o50L5k02m79q4O47J149J493J981K528
60685D23470K917L179L326L205K921K953L556M343M781M788M688M796N146N481
60671D79550N516N426N821O871P734P503O556O220P027Q159Q710Q779Q926R246
60657E82044R505R692R885R882R454Q823Q531Q843R520J0137J0390J0189R483
60644G06378Q140O100L717J665K47j038k913n402p848r706j0901j1499j1505j1082
60630F54353j0510r812q811p649o802o448o219n790n333n036m561l429j870p99
60616E71284p77j315j409p11K34Q60J356K136K998L359L296L564M392N080N237
60601E99584N756P662J0440J2398J2737J2480J3125J4949J6946J8107J8426J8674
$$ plain form
60701 434068 430520 427237 424375 421632 418961 417052 416402 416437 416235 415756 415672 416319 417468 418961 420942 423470
60685 423470 426387 429566 432892 436097 439018 441971 445527 449870 454651 459439 464127 468923 474069 479550
60671 479550 485066 490492 496313 503184 510918 518421 524977 531197 538224 546383 555093 563872 572798 582044
60657 582044 591549 601241 611126 621008 630462 639285 647816 656659 666179 676316 686706 696895 706378
60644 706378 714518 720618 724335 726000 726247 725209 722296 716894 709046 699340 688439 676940 665435 654353
60630 654353 643843 634031 625220 617571 610769 604321 598102 592312 586979 581943 577382 573953 572083 571284
60616 571284 570507 569192 567783 567072 567306 568166 569522 571658 574656 578015 581311 584875 589267 594347 599584
60601 599584 605340 613002 623442 635840 648577 661057 674182 689131 706077 724184 742610 761284
60589G61284J9441K0536K1370K1708K1664K1064J9476J7058J4648J2551R765N218
60577I65783p00o490j1224j5078j8366k0962k2762k3988k4731k4686k3631k1789
60565G51376j9543j7141j4824j2867j1317r872q282o725n681n460n773n772m775
60552F23344l035j581j012q11r5J288K785L953M733N036M677L771K788K149J977
60537F49967K212K693L175L463L536L464L402L778N068P159R304J0907J2099J3322
60523G33549J4822J6884J9932K3916K8037L1676L5196L9384M4486N0395N7200
60512A095477O4908P3116Q1709R1430J02873J15170J26477J35395J40997J41863
60502B169415J36372J24109J06146Q4098N9823L5913J5080j395j3978k3590l0917
$$ plain form
60589 761284 780725 801261 822631 844339 866003 887067 906543 923601 938249 950800 960565 965783
60577 965783 965083 958593 947369 932291 913925 892963 870201 846213 821482 796796 773165 751376
60565 751376 731833 714692 699868 687001 675684 665812 657530 650805 645124 639664 633891 628119 623344
60552 623344 620309 618728 617716 616905 616810 618098 620883 624836 629569 634605 639282 643053 645841 647990 649967
60537 649967 652179 654872 658047 661510 665046 668510 671912 675690 680758 687917 697221 708128 720227 733549
60523 733549 748371 765255 785187 809103 837140 868816 904012 943396 987882 1038277 1095477
60512 1095477 1160385 1233501 1315210 1406640 1509513 1624683 1751160 1886555 2027552 2169415
60502 2169415 2305787 2429896 2536042 2620140 2679963 2715876 2730956 2729561 2715583 2691993 2661076
60491B661076l6952m3000m9566n6030o1790o6893p1151p3531p3049o9677o3891
60480A995546n5900m5872l4326k1708p958O976K2628L8448N4329P0114Q4763R6486
60468B203526J03627J05109J00394Q9575P3616N4234L3626J4318j072j0495j3195
60457B753263r667q68J2586L0446N2234P6841J03148J31045J61370J94720K30854
60446C735972K69779L12807L61821M17564M79352N46107O16452O87032P50887
60437H177773P97631Q15383P93635P26051O11939M55669K65454N3234j65020l71103
60427A2160646n48685o86956p81534q33247q46362q27046p82389p20212o48844
60418E485371n75696n05503m40203l80678l27991k82793k44416k11343j82435
$$ plain form
60491 2661076 2624124 2581124 2531558 2475528 2413738 2346845 2275694 2202163 2129114 2059437 1995546
60480 1995546 1939646 1893774 1859448 1837740 1829782 1836758 1859386 1897834 1952163 2022277 2107040 2203526
60468 2203526 2307153 2412262 2512656 2602231 2675847 2730081 2763707 2778025 2776953 2766458 2753263
60457 2753263 2743596 2742728 2755314 2785760 2837994 2914835 3017983 3149028 3310398 3505118 3735972
60446 3735972 4005751 4318558 4680379 5097943 5577295 6123402 6739854 7426886 8177773
60437 8177773 8975404 9790787 10584422 11310473 11922412 12378081 12643535 12696769 12531749 12160646
60427 12160646 11611961 10925005 10143471 9310224 8463862 7636816 6854427 6134215 5485371
60418 5485371 4909675 4404172 3963969 3583291 3255300 2972507 2728091 2516748 2334313
60409B334313j57354j36078j18384j03647r0875p9148o8161n8295n0012m3319
60399A429040l7847l3228k9316k6270k4344k3465k3161k3120k3557k4631k5775
60388A134326k6184k5845k5418k5150k4611k3575k2455k1614k0796j9536j7687
60377H81455j5412j3151j1675j1571j2359j2652j1557r571p761o523n505m418
60365G59300l420k726k216j559o08M07J216J911K743L492L482K629J921K325L571
60350G72468M645N233N816O622P392Q284J0028J2840J5847J8002J9099J9605J9840
60337I25721J9620J8482J6180J3138J0286Q187O628N465N408P193J0318J3516
60325A060142J6304J9056K1656K3195K3170K1948J9716J6035J0806M824j134o971
$$ plain form
60409 2334313 2176959 2040881 1922497 1818850 1727975 1648827 1580666 1522371 1472359 1429040
60399 1429040 1391193 1357965 1328649 1302379 1278035 1254570 1231409 1208289 1184732 1160101 1134326
60388 1134326 1108142 1082297 1056879 1031729 1007118 983543 961088 939474 918678 899142 881455
60377 881455 866043 852892 841217 829646 817287 804635 793078 783507 775746 769223 763718 759300
60365 759300 755880 753154 750938 749379 748771 749178 750394 752305 755048 758540 762022 764651 766572 768897 772468
60350 772468 777113 782346 788162 794784 802176 810460 820488 833328 849175 867177 886276 905881 925721
60337 925721 945341 963823 980003 993141 1003427 1011614 1018242 1023707 1029115 1036308 1046626 1060142
60325 1060142 1076446 1095502 1117158 1140353 1163523 1185471 1205187 1221222 1232028 1236852 1235718 1228747
60313A228747j2654j7691k1708k4768k6776k7267k6312k4831k3475k1904j9719
60302I81642j7401j5732j4802j4288j4099j4171j4020j3159j1662r799p531m856
60290H30122k209K8K093M448P118R775J2074J3489J3285J1275Q304N458K892j41
60276I18011m232r025j3254j5563j5613j4553j3880j3685j2663j0043o719m053
60264G84728k305q04R46L075N666Q479J0807J2285J3517J5218J7130J8575J9814
60251I07131K1906K5241K9054L2597L6052L9936M4063M7620N0124N1975N3837
60240A339536N5563N6102N4776N2327N0124M8398M5985M2023L7109L2332K7807
60229A842082K2835J7148J1261N755P09m122q865j3298j6936j9452k1020k1961
$$ plain form
60313 1228747 1216093 1198402 1176694 1151926 1125150 1097883 1071571 1046740 1023265 1001361 981642
60302 981642 964241 948509 933707 919419 905320 891149 877129 863970 852308 842509 834978 830122
60290 830122 827913 827941 830034 834482 841600 851375 863449 876938 890223 901498 909802 915260 918152 918011
60276 918011 913779 904754 891500 875937 860324 845771 831891 818206 805543 795500 788781 784728
60264 784728 782423 781619 782565 785640 791306 799785 810592 822877 836394 851612 868742 887317 907131
60251 907131 929037 954278 983332 1015929 1051981 1091917 1135980 1183600 1233724 1285699 1339536
60240 1339536 1395099 1451201 1505977 1558304 1608428 1656826 1702811 1744834 1781943 1814275 1842082
60229 1842082 1864917 1882065 1893326 1899081 1899790 1895668 1886803 1873505 1856569 1837117 1816097 1794136
60217A794136k2096k0902j8345j5008j1322p145k264L331R793J7312K5432L3210
60205A786132M0340M7276N3843N8729O1090O1757O1915O1297N8690N3657M6730
60194B391456L8358K8814J8863R355J98r158j8332k6198l2486l8007m2984m6266
60182B273613m6823m5085m2153l8457l3935k8916k3810j8234j1342l133N364J3353
60170B000442K1033K8815L6349M2871M8086N2147N4910N5916N5146N3152N0337
60159B499204M6723M2710L9392L7510L6698L6342L6757L8776M2386M6659N0780
60148B953937N4323N6558N6521N3998M9774M4797L9865L6243L5532L8480M4645
60137C464673N3682O6150Q2411J01268J20410J37832J52329J63015J69136J70456
$$ plain form
60217 1794136 1772040 1751138 1732793 1717785 1706463 1699318 1697054 1700385 1710178 1727490 1752922 1786132
60205 1786132 1826472 1873748 1927591 1986320 2047410 2109167 2171082 2232379 2291069 2344726 2391456
60194 2391456 2429814 2458628 2477491 2486846 2487044 2477886 2459554 2433356 2400870 2362863 2319879 2273613
60182 2273613 2226790 2181705 2139552 2101095 2067160 2038244 2014434 1996200 1984858 1981725 1987089 2000442
60170 2000442 2021475 2050290 2086639 2129510 2177596 2229743 2284653 2340569 2395715 2448867 2499204
60159 2499204 2545927 2588637 2628029 2665539 2702237 2738579 2775336 2814112 2856498 2903157 2953937
60148 2953937 3008260 3064818 3121339 3175337 3225111 3269908 3309773 3346016 3381548 3420028 3464673
60137 3464673 3518355 3584505 3666916 3768184 3888594 4026426 4178755 4341770 4510906 4681362
60127D681362J67437J60909J51599J39811J25633J09552R2655P5749N8539M0287
60117E803533K1124J860j7447l7658n8981q0236j00191j18694j35891j50943j62382
60106D964094j69289j71579j69410j62849j51982j37085j19003r9329p9625o0333
60096C643610m1088k2173m806J0304K3651L5654M5587N2537N6740N9197O0379
60085C919592N9939N7181N1392M2275L0632J8081N637o853j9460l1328m1715n1100
60073D034273o0252o8817p5727q0614q3952q6155q7289q7338q6116q3129p8225
60062C156659p1961o4826n6562m6945l6698k6840j7420p636L118J4916K7655M1003
60050B914463N4336O7268Q0010R2688J04566J14425J21220J24030J22058J15354
$$ plain form
60127 4681362 4848799 5009708 5161307 5301118 5426751 5536303 5628958 5704707 5763246 5803533
60117 5803533 5824657 5826517 5809070 5771412 5712431 5632195 5532004 5413310 5277419 5126476 4964094
60106 4964094 4794805 4623226 4453816 4290967 4138985 4001900 3882897 3783568 3703943 3643610
60096 3643610 3602522 3580349 3575543 3585847 3609498 3645152 3690739 3743276 3800016 3859213 3919592
60085 3919592 3979531 4036712 4088104 4130379 4161011 4179092 4184729 4177876 4158416 4127088 4085373 4034273
60073 4034273 3974021 3905204 3829477 3748863 3664911 3578756 3491467 3404129 3318013 3234884 3156659
60062 3156659 3084698 3019872 2963310 2916365 2879667 2852827 2835407 2827771 2830889 2845805 2873460 2914463
60050 2914463 2968799 3036067 3116077 3208765 3313331 3427756 3548976 3673006 3795064 3910418
60040C910418J04940R1576P5099N5633L4654J3809o588k6771m5793o1912p4515
60029D070550q4443r2395r7975j00489r9948r7185r3411q9538q5461q0382p4192
60018C075131o7953o2467n7103n0817m3646l6167k8216j9266r574L01J0717K2293
60006B733233L4327M5202N4305O2227O8976P3375P4493P2555O8057O1047N1627
59995C399424M0383K7868J4354L38j3337k6133l7967m8544n7177o3424o7398o9222
59983C099165o8675o5611o0335n3498m5808l7811k9636k1112j2396m137L298J0388
59971B713832J7749K5256L2390L8955M4814M9468N2658N5004N7185N8850N9151
59960C205312N8086N6453N4821N3296N2114N1538N1445N1698N2589N4201N5780
$$ plain form
60040 3910418 4015358 4106934 4182033 4237666 4272320 4286129 4279541 4252770 4206977 4145065 4070550
60029 4070550 3986107 3893712 3795737 3695248 3595300 3498115 3404704 3315166 3229705 3149323 3075131
60018 3075131 3007178 2944711 2887608 2836791 2793145 2756978 2728762 2709496 2699922 2700223 2710940 2733233
60006 2733233 2767560 2812762 2867067 2929294 2998270 3071645 3146138 3218693 3286750 3347797 3399424
59995 3399424 3439807 3467675 3482029 3482367 3469030 3442897 3404930 3356386 3299209 3235785 3168387 3099165
59983 3099165 3030490 2964879 2904544 2851046 2805238 2767427 2737791 2716679 2704283 2700146 2703444 2713832
59971 2713832 2731581 2756837 2789227 2828182 2872996 2922464 2975122 3030126 3087311 3146161 3205312
59960 3205312 3263398 3319851 3374672 3427968 3480082 3531620 3583065 3634763 3687352 3741553 3797333
59949C797333N6497N6242N4847N1375M5523L9077L4554L2714L2884L5316M1373
59938D277735N1457O4508P9822R7622J17297J36609J53357J66571J75320J77551
59928E497849J71081J55111J30134R7045N7104J2331l4541q0400j22129j57357
59918E726228j85111k05350k17973k22920k20981k13626k01956j86662j68896
59909C902753j50229j31542j12858r4297p6321n8954m1772k4824q633O859K2372
59898C232554L8048N3021O6410P7917Q7211R3612R6618R5954R1003Q1097O6434
59887D079879M7800K5409q12k9502n7743q3102j04949j23365j37907j48004j53670
59876C314034j55199j52877j47481j40345j32341j23414j13493j03189r3180q3502
$$ plain form
59949 3797333 3853830 3910072 3964919 4016294 4061817 4100894 4135448 4168162 4201046 4236362 4277735
59938 4277735 4329192 4393700 4473522 4571144 4688441 4825050 4978407 5144978 5320298 5497849
59928 5497849 5668930 5824041 5954175 6051220 6108324 6120655 6086114 6005714 5883585 5726228
59918 5726228 5541117 5335767 5117794 4894874 4673893 4460267 4258311 4071649 3902753
59909 3902753 3752524 3620982 3508124 3413827 3337506 3278552 3236780 3211956 3203323 3210182 3232554
59898 3232554 3270602 3323623 3390033 3467950 3555161 3648773 3745391 3841345 3932348 4013445 4079879
59887 4079879 4127679 4153088 4152276 4122774 4065031 3981929 3876980 3753615 3615708 3467704 3314034
59876 3314034 3158835 3005958 2858477 2718132 2585791 2462377 2348884 2245695 2152515 2069013
59866B069013p3822o3990n4083m4513l6097k9431k4034j8915j3988j0130p779
59855A692231o425n635n524n890n894n001l466j627N24K768M665O374Q524J0886
59841A686510J2065J0974P771L057k890r669j6447k2634k8154l2675l5440l6248
59829A536220l5832l4785l2922l0146k7115k4459k1995j9150j5664j1583p160
59818A275409k957N42L623P049J1048J5263J9526K3768K7272K9281L0262L1322
59806A471408L2269L1672K9050K5513K1855J7625J2677Q125M860K482N79k46M39
59793A658308J925L566N925R634J4191J8968K4479L1472L9496M7559N5659O4649
59781A975831P5024Q6788J00099J15263J32391J51436J71964J92191K08722K17649
$$ plain form
59866 2069013 1995191 1931201 1877118 1832605 1796508 1767077 1743043 1724128 1710140 1700010 1692231
59855 1692231 1685806 1680171 1674647 1668757 1662863 1657862 1654396 1652769 1653293 1656061 1660726 1667100 1675624 1686510
59841 1686510 1698575 1709549 1717320 1720377 1717487 1707818 1691371 1668737 1640583 1607908 1572468 1536220
59829 1536220 1500388 1465603 1432681 1402535 1375420 1350961 1328966 1309816 1294152 1282569 1275409
59818 1275409 1272452 1272994 1276617 1283666 1294714 1309977 1329503 1353271 1380543 1409824 1440086 1471408
59806 1471408 1503677 1535349 1564399 1589912 1611767 1629392 1642069 1650194 1655054 1657536 1658115 1657869 1658308
59793 1658308 1660233 1663799 1669724 1679358 1693549 1712517 1736996 1768468 1807964 1855523 1911182 1975831
59781 1975831 2050855 2137643 2237742 2353005 2485396 2636832 2808796 3000987 3209709 3427358
59771C427358K15466J99124J66860J20189O4422O354m8203r4853j30417j53621
59761C772679j65277j66973j60378j48246j34490j21760j09687r6726q3007p0144
59751B515991n8895m8397l7585k6275j4963m301N385J4565K4112L4144M3792N2492
59739B500065O0749O9180P7726Q6404R5835J06287J17091J27839J39293J52352
59729C532821J66914J82535J99248K16882K34591K51938K69362K86461L00795
59720E641547L09651L12256L09214L00717K86762K68572K48453K28623K11154
59711H116949J98314J91698J91328J96549K07242K23182K42728K63124K81533
59702A0112647K95036L00539K95975K81029K55955K20604J75779J24532P0658
$$ plain form
59771 3427358 3642824 3841948 4008808 4128997 4193419 4199773 4151570 4056717 3926300 3772679
59761 3772679 3607402 3440429 3280051 3131805 2997315 2875555 2765868 2669142 2586135 2515991
59751 2515991 2457096 2408699 2371114 2344839 2329876 2325575 2330960 2345525 2369637 2403781 2447573 2500065
59739 2500065 2560814 2629994 2707720 2794124 2889959 2996246 3113337 3241176 3380469 3532821
59729 3532821 3699735 3882270 4081518 4298400 4532991 4784929 5054291 5340752 5641547
59720 5641547 5951198 6263454 6572668 6873385 7160147 7428719 7677172 7905795 8116949
59711 8116949 8315263 8506961 8698289 8894838 9102080 9325262 9567990 9831114 10112647
59702 10112647 10407683 10708222 11004197 11285226 11541181 11761785 11937564 12062096 12132754
59693A2132754J6807l4686q0226j16247j41626j57080j62700j57860j43241j20927
59683A1034968r2435n8248j9327K2654O6915J13973J64034K16177K69318L22715
59673A2040744L74967M23552M65591M98118N17173N17570M94381M44728L68545
59664A6145369K68419J49084J6816j20734k54542l75361m75982n52394o02845
59655A4197830o27048o26974o07018n71985n25639m72343m19015l73588l41643
59646I632577l25303l24185l35606l54486l75201l93890m08117m15232m12977
59637F287580m01481l82914l59220l31632l02000k72666k44850k18562j94172
59628C580083j72454j53239j35644j19713j06168r4509q3188p1913o2057n4301
$$ plain form
59693 12132754 12149561 12114875 12034649 11918402 11776776 11619696 11456996 11299136 11155895 11034968
59683 11034968 10942533 10884285 10864958 10887612 10954527 11068500 11232534 11448711 11718029 12040744
59673 12040744 12415711 12839263 13304854 13802972 14320145 14837715 15332096 15776824 16145369
59664 16145369 16413788 16562872 16579688 16458954 16204412 15829051 15353069 14800675 14197830
59655 14197830 13570782 12943808 12336790 11764805 11239166 10766823 10347808 9974220 9632577
59646 9632577 9307274 8983089 8647483 8292997 7917796 7523906 7115789 6700557 6287580
59637 6287580 5886099 5503185 5143965 4812333 4510333 4237667 3992817 3774255 3580083
59628 3580083 3407629 3254390 3118746 2999033 2892865 2798356 2715168 2643255 2581198 2526897
59618B526897m7594m0869l4306k8291k2717j7973j5168j4597j5176j6110j7963
59607B256133k1328k5598k9820l3811l7675m1076m3664m5478m6457m6217m4770
59596A840239m2684m0237l7150l3434k9671k6261k3148k0414j8176j5837j2519
59585A540708q454m796j874J102M356O917Q228R020R969J0713J0901J1026J1406
59572A609222J1413J0659J0006J0409J1529J2452J3183J4564J7161K0903K5441
59561A766942L0204L4583L8532M2679M7453N2687N8344O4845P2238P9802Q7033
59550B375342R4383J02387J10657J18364J25195J31306J36723J41319J44829J46477
59540C626982J45166J40562J33646J25637J16894J07312R7281Q7578P8780P1322
$$ plain form
59618 2526897 2479303 2438434 2404128 2375837 2353120 2335147 2319979 2305382 2290206 2274096 2256133
59607 2256133 2234805 2209207 2179387 2145576 2107901 2066825 2023161 1977683 1931226 1885009 1840239
59596 1840239 1797555 1757318 1720168 1686734 1657063 1630802 1607654 1587240 1569064 1553227 1540708
59585 1540708 1532254 1527458 1525584 1526686 1531042 1537959 1546187 1555207 1565176 1575889 1586790 1597816 1609222
59572 1609222 1620635 1631294 1641300 1651709 1663238 1675690 1688873 1703437 1720598 1741501 1766942
59561 1766942 1797146 1831729 1870261 1912940 1960393 2013080 2071424 2136269 2208507 2288309 2375342
59550 2375342 2469725 2572112 2682769 2801133 2926328 3057634 3194357 3335676 3480505 3626982
59540 3626982 3772148 3912710 4046356 4171993 4288887 4396199 4493480 4581058 4659838 4731160
59530D731160O5729O1974N8684N3798M6459L8144L1706K9235L0677L4474L9337
59519E221377M5017N1202N6210N7492N3221M2957K7026O015j9224m7682p8338
59508E415273j09712j39545j65687j87193k03954k15549k21384k21745k17697
59499C732807k09893j98457j84097j68381j52580j37061j21933j07481r3789q0730
59489B278405o8580n7863m8523l9920l1721k4028j6708r445k450L913J0167J7257
59477B010504K4963L2061L8273M4823N2624O1114O9473P7829Q6592R5527J04215
59466B697998J12585J20288J26276J29622J30056J27179J19939J07602R0619O9935
59456C832099M6084J9618q142l5544o1477q5324j06304j23394j35703j42802j45083
$$ plain form
59530 4731160 4796889 4858863 4917547 4971345 5017804 5055948 5087654 5116889 5147566 5182040 5221377
59519 5221377 5266394 5317596 5373806 5431298 5484519 5527476 5554502 5560517 5541293 5493611 5415273
59508 5415273 5305561 5166016 5000329 4813136 4609182 4393633 4172249 3950504 3732807
59499 3732807 3522914 3324457 3140360 2971979 2819399 2682338 2560405 2452924 2359135 2278405
59489 2278405 2209825 2151962 2103439 2063519 2031798 2007770 1991062 1981617 1979167 1983080 1993247 2010504
59477 2010504 2035467 2067528 2105801 2150624 2203248 2264362 2333835 2411664 2498256 2593783 2697998
59466 2697998 2810583 2930871 3057147 3186769 3316825 3444004 3563943 3671545 3762164 3832099
59456 3832099 3878183 3897801 3889659 3854115 3792638 3707314 3601010 3477616 3341913 3199111 3054028
59445C054028j43791j40272j35041j28095j19977j11696j03537r4913q5687p6712
59435A914307o8748o1600n4795m8305m2293l6771l1873k7768k4028j9848j5130
59424A483148j0613o742l246l1K526M469O503Q871J0942J2404J3823J5586J7285
59411A554925J8729K0579K3221K6118K9083L3168L8968M4760M7661M6558M3022
59400A926792L9474L7317L6788L7715M0105M4414N1424O1612P4241Q7084R7356
59389B534322J03739J07841J13113J21730J32918J44949J57942J73563J92496
59380C782613K13786K36425K59869K82678L02313L16976L26392L30311L27652
59371F379015L17942L02387K82687K59845K34980K10107J86961J65750J46007
$$ plain form
59445 3054028 2910237 2769965 2634924 2506829 2386852 2275156 2171619 2076706 1991019 1914307
59435 1914307 1845559 1783959 1729164 1680859 1638566 1601795 1569922 1542154 1518126 1498278 1483148
59424 1483148 1472535 1465793 1462547 1462516 1465042 1469511 1476014 1484885 1495827 1508231 1522054 1537640 1554925
59411 1554925 1573654 1594233 1617454 1643572 1672655 1705823 1744791 1789551 1837212 1883770 1926792
59400 1926792 1966266 2003583 2040371 2078086 2118191 2162605 2214029 2275641 2349882 2436966 2534322
59389 2534322 2638061 2745902 2859015 2980745 3113663 3258612 3416554 3590117 3782613
59380 3782613 3996399 4232824 4492693 4775371 5077684 5394660 5721052 6051363 6379015
59371 6379015 6696957 6999344 7282031 7541876 7776856 7986963 8173924 8339674 8485681
59362H485681J27985J12265R8492Q5387P1598N6014L7874J7348m457k6522m8428
59351I013237o9449q7978j02674j13597j21593j27266j31368j35642j42150j51771
59341G829749j63823j77014j90305k03030k14651k24455k31500k35171k35622
59332E954178k33241k27834k18984k07132j93517j79072j64203j49575j35988
59323D244632j23413j11081r8831q7292p6756o6917n7849n0006m3008l5787k8234
59312C465458k1398j5582r679k948L913J0077J5764K1302K6228L0112L3199L5518
59300C591964L6408L5536L3374L0113K5332J9229J2885O570o97r198j7536k4573
59288C739407l0901l7332m3282m7733n0523n1530m9969m5718m0106l4097k6951
$$ plain form
59362 8485681 8613666 8725931 8824423 8909810 8981408 9037422 9075296 9092644 9088187 9061665 9013237
59351 9013237 8943788 8855810 8753136 8639539 8517946 8390680 8259312 8123670 7981520 7829749
59341 7829749 7665926 7488912 7298607 7095577 6880926 6656471 6424971 6189800 5954178
59332 5954178 5720937 5493103 5274119 5066987 4873470 4694398 4530195 4380620 4244632
59323 4244632 4121219 4010138 3911307 3824015 3747259 3680342 3622493 3572487 3529479 3493692 3465458
59312 3465458 3444060 3428478 3418799 3415851 3419764 3429841 3445605 3466907 3493135 3523247 3556446 3591964
59300 3591964 3628372 3663908 3697282 3727395 3752727 3771956 3784841 3791411 3790714 3781516 3763980 3739407
59288 3739407 3708506 3671174 3627892 3580159 3529636 3478106 3428137 3382419 3342313 3308216 3281265
59277C281265j7983q366L61Q419J6738K4710L0662L3787L4015L0764K3514J3232
59265C471118J613j0830k4703m0020n5664p0138q1947q9879r3909r5283r4858
59254B815500r2190q7039q0592p4004o6841n8422m9614m1686l4320k6477j8406
59243B185909j1045m121L277J0841J7635K4168L1895M0870M9775N8303O7735P8904
59231B554146R1222J04014J17532J32325J48641J66604J85978K05806K25087K43576
59221D174931K60878K75170K84171K87077K83978K73313K51465K15615J66437
59212F473035J08020M6021j4243o9151j16929j56412j86024k04509k12199k10734
59202E456875k01880j87342j69163j49233j28606j08011q8594p1412n6721m4644
$$ plain form
59277 3281265 3263282 3254916 3255277 3263696 3280434 3305144 3335806 3369593 3403608 3434372 3457886 3471118
59265 3471118 3472731 3461901 3437198 3397178 3341514 3271376 3189429 3099550 3005641 2910358 2815500
59254 2815500 2723310 2636271 2555679 2481675 2414834 2356412 2306798 2265112 2230792 2204315 2185909
59243 2185909 2174864 2170743 2174020 2184861 2202496 2226664 2258559 2299429 2349204 2407507 2475242 2554146
59231 2554146 2645368 2749382 2866914 2999239 3147880 3314484 3500462 3706268 3931355 4174931
59221 4174931 4435809 4710979 4995150 5282227 5566205 5839518 6090983 6306598 6473035
59212 6473035 6581055 6627076 6612833 6543682 6426753 6270341 6084317 5879808 5667609 5456875
59202 5456875 5254995 5067653 4898490 4749257 4620651 4512640 4424046 4352634 4295913 4251269
59192D251269l5917l1045k9222k9185l0636l3941l8917m4880n1311n7592o2838
59181C805785o6921p0836p4944p7760p7787p5614p2786o9534o5212o0189n5409
59170C038793n0640m5006l8835l3362k8789k4425k0307j6954j3848r995n865k909
59158B747858j130J047M444Q369J2320J6673K1363K5530K8880L2131L5686L9122
59146B972293M2099M4636M6247M6038M3828M0160L5217K8815K1292J3179M186
59135C337990o173j7067k6822l4817m1539m6970n0485n2240n3038n2710n0205
59124B905924m5425l9536l3222k6109j8087r789j545O787J4789K1664K7581L3510
59112B836542L9638M5351N0723N6461O2167O6327O8337O9010O8672O6325O1120
$$ plain form
59192 4251269 4215352 4184307 4155085 4125900 4095264 4061323 4022406 3977526 3926215 3868623 3805785
59181 3805785 3738864 3668028 3593084 3515324 3437537 3361923 3289137 3219603 3154391 3094202 3038793
59170 3038793 2988153 2943147 2904312 2870950 2842161 2817736 2797429 2780475 2766627 2756632 2750767 2747858
59158 2747858 2746728 2747775 2752219 2760588 2772908 2789581 2810944 2836474 2865354 2897485 2933171 2972293
59146 2972293 3014392 3059028 3105275 3151313 3195141 3235301 3270518 3299333 3320625 3333804 3337990
59135 3337990 3331817 3314750 3287928 3253111 3211572 3164602 3114117 3061877 3008839 2956129 2905924
59124 2905924 2860499 2820963 2787741 2761632 2743545 2733756 2732211 2738998 2753787 2775451 2803032 2836542
59112 2836542 2876180 2921531 2972254 3028715 3090882 3157209 3225546 3294556 3363228 3429553 3490673
59101C490673N3233M2733K9073J2257o601k6375m6437o5764q2938r7515j10259
59090C192080j21536j30610j36854j40470j41625j40025j35808j29730j22215
59081A993207j13302j03770r4972q7214p9475p1191o3108n6061n0022m4741m0224
59070A189127l6165l2061k8199k5446k3730k1861j9202j6391j4121j2357j1028
59059I48566j0327r896q889p255n999n781o188o621o921o874o094m610k792o75
59045H59644J738L848N326P283J1007J5679J8964J9943J9823J9601J8891J7427
59033A019174J6058J5540J5712J6407J7945K0249K2639K4739K6424K6760K4551
59022A246198K0170J5317J0718N578m56o422j1510j5622j8070j7544j4132r786
$$ plain form
59101 3490673 3543906 3586639 3615712 3627969 3621368 3594993 3548556 3482792 3399854 3302339 3192080
59090 3192080 3070544 2939934 2803080 2662610 2520985 2380960 2245152 2115422 1993207
59081 1993207 1879905 1776135 1681163 1593949 1514474 1443283 1380175 1324114 1274092 1229351 1189127
59070 1189127 1152962 1120901 1092702 1067256 1043526 1021665 1002463 986072 971951 959594 948566
59059 948566 938239 928343 919454 912199 906200 900419 894231 887610 880689 873815 867721 863111 860319 859644
59045 859644 861382 865230 870556 877839 888846 904525 923489 943432 963255 982856 1001747 1019174
59033 1019174 1035232 1050772 1066484 1082891 1100836 1121085 1143724 1168463 1194887 1221647 1246198
59022 1246198 1266368 1281685 1292403 1297981 1297525 1291103 1279593 1263971 1245901 1228357 1214225 1204439
59010A204439n958k209K185O738J0647J3736J5755J5956J4075J0631N804o39q001
58997A283159j4651j9902k4380k8193l0383l0764l0450k9885k8069k4601k0769
58986A001112j7605j4494j0791p322n010l336j324R94L196N462Q017J0510J2705
58973I82114J4881J6948J8306J9085K0284K2035K3111K2868K2279K2163K1823
58962A205897K0320J7959J5551J3340J1469J0427J0174R897R378R492J0693J2132
58950A356729J2970J3525J4436J5763J7465J9782K2636K5631K8904L2876L7134
58939A597851M0934M4809N0068N6553O2637O7658P2437P7258Q1461Q5434R0611
58928B327711R6876J02412J06969J12960J22214J33910J46821J61255J77485J94517
$$ plain form
59010 1204439 1198481 1196272 1198457 1205195 1215842 1229578 1245333 1261289 1275364 1285995 1291799 1291160 1283159
58997 1283159 1268508 1248606 1224226 1196033 1165650 1134886 1104436 1074551 1046482 1021881 1001112
58986 1001112 983507 969013 958222 950900 945890 942554 941230 942224 945420 950882 958899 969409 982114
58973 982114 996995 1013943 1032249 1051334 1071618 1093653 1116764 1139632 1161911 1184074 1205897
58962 1205897 1226217 1244176 1259727 1273067 1284536 1294963 1305137 1315034 1324412 1333904 1344597 1356729
58950 1356729 1369699 1383224 1397660 1413423 1430888 1450670 1473306 1498937 1527841 1560717 1597851
58939 1597851 1638785 1683594 1733662 1790215 1852852 1920510 1992947 2070205 2151666 2237100 2327711
58928 2327711 2424587 2526999 2633968 2746928 2869142 3003052 3149873 3311128 3488613 3683130
58918C683130K11992K31189K52633K74707K96123L17641L39517L59191L73408
58909F339531L80950L81426L72993L53274L21261K76928K20525J53986Q1456O771
58899H889101o8193j41208k07699k63202l06540l38819l60594l71880l73639l67374
58889F089953l54240l35951l15254k94035k72209k49856k28774k10397j93900
58880C635337j78157j63923j52182j41995j31927j22183j13380j04763r5651q7116
58870B344060q0192p3879o7033o0632n5982n2181m7759m3417m0617l8735l6151
58859A747482l3086l0763k8778k5857k2391j9672j7352j4137j0368p450n291k620
58847A529717O43L548O177R395J3034J6362J9740K3830K7829L0584L2820L6176
$$ plain form
58918 3683130 3895122 4126311 4378944 4653651 4949774 5267415 5606932 5966123 6339531
58909 6339531 6720481 7101907 7474900 7828174 8149435 8426363 8646888 8800874 8882330 8889101
58899 8889101 8820908 8679700 8472001 8208799 7902259 7563440 7202846 6830966 6457327 6089953
58889 6089953 5735713 5399762 5084508 4790473 4518264 4268408 4039634 3829237 3635337
58880 3635337 3457180 3293257 3141075 2999080 2867153 2744970 2631590 2526827 2431176 2344060
58870 2344060 2263868 2189989 2122956 2062324 2006342 1954161 1906402 1862985 1822368 1783633 1747482
58859 1747482 1714396 1683633 1654855 1628998 1606607 1586935 1569583 1555446 1545078 1537628 1532337 1529717
58847 1529717 1530360 1533908 1540085 1549480 1562514 1578876 1598616 1622446 1650275 1680859 1713679 1749855
58835A749855M0680M5212M9732N4971O0627O6040P1860P8951Q6408R3053R9982
58824B497371J09087J19759J29782J39129J50067J63571J78264J93141K08961
58815C889132K26512K45478K65290K85464L04979L22767L38501L51436L59127
58806F588686L58927L50005L32036L02952K60510K05577J41680P1751k208p6805
58796H533111j47364k10574k65060l09522l42603l64445l76253l78433l71268
58787E767589l57198l40015l21617l01578k79852k57793k36459k15986j96753
58778C260338j79363j63398j47990j33526j21059j10399j00554r1763q5071q0205
58768B047010p5855p1695o8265o5115o1175n6503n1831m6854m0999l5121l0258
$$ plain form
58835 1749855 1790535 1835747 1885479 1940450 2001077 2067117 2138977 2217928 2304336 2397389 2497371
58824 2497371 2606458 2726217 2855999 2995128 3145195 3308766 3487030 3680171 3889132
58815 3889132 4115644 4361122 4626412 4911876 5216855 5539622 5878123 6229559 6588686
58806 6588686 6947613 7297618 7629654 7932606 8193116 8398693 8540373 8612124 8609916 8533111
58796 8533111 8385747 8175173 7910113 7600591 7257988 6893543 6517290 6138857 5767589
58787 5767589 5410391 5070376 4748759 4447181 4167329 3909536 3673077 3457091 3260338
58778 3260338 3080975 2917577 2769587 2636061 2515002 2404603 2304049 2212286 2127215 2047010
58768 2047010 1971155 1899460 1831195 1766080 1704905 1648402 1596571 1549717 1508718 1473597 1443339
58757A443339k5494j9549j3628r894p684m414J80L801N647P421J0041J2422J4128
58744A416316J6278J9072K0960K1062J9970J7577J2617N207k449q746j4005j8621
58732A505238k2062k4385k6650k9133l0948l1947l3151l4822l6078l6713l7471
58721A161878l8262l8078l6952l6028l5430l4176l2266l0681k9140k6292k2413
58710H02160j9485j8063j6465j3651j0617q331o428m614l348k449j019Q23K026
58697G00539K617L595M657M332K639J234O27l29j775k295j643j504k738m146m789
58682G01021n309o141o551o225n816n289l668r94J482L458N825Q359R446Q624
58668F98222P297O361N278L878K926K524K066J923K800L433J581k460o072q254
$$ plain form
58757 1443339 1417845 1398296 1384668 1374774 1367090 1362676 1362856 1366657 1372304 1379725 1389766 1402188 1416316
58744 1416316 1432594 1451666 1472626 1493688 1513658 1531235 1543852 1549059 1546610 1537864 1523859 1505238
58732 1505238 1483176 1458791 1432141 1403008 1372060 1340113 1306962 1272140 1236062 1199349 1161878
58721 1161878 1123616 1085538 1048586 1012558 977128 942952 910686 880005 850865 824573 802160
58710 802160 782675 764612 748147 734496 723879 715548 709120 704506 701158 698709 697690 698513 700539
58697 700539 703156 706751 711408 715740 718379 719613 720240 719911 718136 715841 714198 712694 709956 705810 701021
58682 701021 695712 689571 683020 676795 670979 665690 662022 661028 662510 665968 671793 680152 689598 698222
58668 698222 705519 711880 717158 721036 723962 726486 728552 730475 733275 736708 738289 735829 729757 721503
58654G21503j0397j2811j3698j2420j0709r656q238n838l452j514Q12L367M768
58641F41717N183O428Q569R507Q827Q837J0684J2751J4137J6313J9767K2358K2877
58628H07955K3227K5094K7392K8986L1148L5147L9896M4164M8818N4933O1804
58617A228564O8637P6089Q4473R2602R9851J07004J13574J16820J14969J09004
58607B211587R9770Q6070O7377M5746K3082p90k5466m8045o6041p9812r0150r6047
58595B127281r7078r5459r3288q9834q3831p6307o8947o1719n4182m7129m0865
58584A318642l4002k5979j8694j3668r789n863l025k337k270j028O78J506K106
58571A206277L559N151N966O937R060J1272J2082J1525R682N300k090j0721j9118
$$ plain form
58654 721503 711106 698295 684597 672177 661468 651812 643574 637736 634284 632770 633582 636949 641717
58641 641717 646900 653328 661897 671404 680231 689068 699752 712503 726640 742953 762720 785078 807955
58628 807955 831182 856276 883668 912654 943802 978949 1018845 1063009 1111827 1166760 1228564
58617 1228564 1297201 1373290 1457763 1550365 1650216 1757220 1870794 1987614 2102583 2211587
58607 2211587 2311357 2397427 2464804 2510550 2533632 2532842 2507376 2459331 2393290 2313478 2223328 2127281
58595 2127281 2030203 1934744 1841456 1751622 1667791 1591484 1522537 1460818 1406636 1359507 1318642
58584 1318642 1284640 1258661 1239967 1226299 1216510 1210647 1207622 1205285 1203015 1201987 1202665 1204171 1206277
58571 1206277 1209836 1214987 1220953 1227890 1236950 1248222 1260304 1271829 1281511 1286811 1284721 1274000 1254882
58558A254882k7931l7348m5116m9371n1161n1963n0944m7101m1836l6938l2079
58547G83094k6707k2253k0000j8695j6734j4695j3499j2151r817p916p706p825
58535F05096o703n266m763m197k552j295j863k808k276j313j756k844k818k078
58521E62564j909j843j006k50l19J47K086L597K887J490J610K337J694M12M19
58506E73916J290J441J231J824K599K729L537O252R207J0412J1099J3508J6855
58493F55900J8864J9632K0627K1292K0093J7640J5598J3638J0483O673L401N2
58481H23893m302q523j1329j3875j7451k0453k0816j9602j8997j8510j6479j3598
58469F39958j1604j0039p630n262m364l945k445p79l84j01J699L791M236L921
$$ plain form
58558 1254882 1226951 1189603 1144487 1095116 1043955 991992 941048 893947 852111 815173 783094
58547 783094 756387 734134 714134 695439 678705 664010 650511 638360 628543 620627 612921 605096
58535 605096 598393 593127 588364 584167 581615 580320 578457 575649 573373 572060 570304 567460 564642 562564
58521 562564 560655 558812 557806 557556 557237 557384 559470 563067 565954 567444 569054 571391 573085 573497 573916
58506 573916 575206 576647 577878 579702 582301 585030 588567 594819 604026 614438 625537 639045 655900
58493 655900 674764 694396 715023 736315 756408 774048 789646 803284 813767 820440 823841 823893
58481 823893 819591 811068 799739 785864 768413 747960 727144 707542 688545 670035 653556 639958
58469 639958 628354 618315 610685 605423 601059 597114 594669 593890 593506 593405 595104 598895 603131 607052
58455F07052M522N055L997K742L278M425M146L462M185M992L922K659L977O803
58441F65217Q244Q728J0673J3691J5524J6199J6858J6155J2265O958L214M03l780
58428G90349q334j0599j1218j2596j3945j2749r762p710o379l797r11m4q1J812
58414F94036M907O415O920R165J2560J4231J4413J5589J7249J6801J4736J3568
58402H40590J2609R081L613o90l692p538j1503j3027j2829j3568j4362j2270q189
58389G68225n605m470k142O80J017l22O4J767J618K74J207L745L915J813J471
58374G73257L540M789M709N922Q054Q055O701P870J1174J2191J0386R773J1338
58361H77759J1863J0973J2112J5634J7837J7964J9331K2455K3768K2294K0974
$$ plain form
58455 607052 611574 616629 620626 623368 626646 631071 635217 638679 642864 647856 651778 654437 658414 665217
58441 665217 673461 682189 692862 706553 722077 738276 755134 771289 783554 790512 793726 794129 790349
58428 790349 782015 771416 760198 747602 733657 720908 711146 703436 697057 693260 692349 692305 692224 694036
58414 694036 698943 705358 712278 721443 734003 748234 762647 778236 795485 812286 827022 840590
58402 840590 853199 862280 865893 865203 861511 853973 842470 829443 816614 803046 788684 776414 768225
58389 768225 762620 758150 756008 756688 757705 757383 757447 759214 760832 761106 762313 766058 769973 771786 773257
58374 773257 776797 781586 786295 792217 800271 808326 815027 822897 834071 846262 856648 866421 877759
58361 877759 889622 900595 912707 928341 946178 964142 983473 1005928 1029696 1051990 1072964
58350A072964K0404J7833J3244R780P371K727l586p090p117p564r183q521n384
58337A095878l761m208k803J088L523L701N317Q913J0625R929J0832J3840J4756
58324A167630J3043J3408J7140J9904J9998K0896K3683K4988K4375K5688K9105
58313A399858K9931K7148K4994K4327K1019J4726J0514R693P883M106K809M833
58301A581841N653M600O346J1155J3517J2641J4150J9038K1567K0619K2183K7549
58289A760859L0402K8973K9709L4923L8350L7185L7163M1256M4638M5361M8599
58278B177418N5660O0303O0546O2512O7865O9588O5022O0707N9326N4704M5021
58267B838672L7817L6184L3361K6805K3890K7540L0318K9233L1920M1313M8966
$$ plain form
58350 1072964 1093368 1111201 1124445 1134225 1141596 1144323 1140737 1133647 1126530 1118966 1109783 1101262 1095878
58337 1095878 1092117 1087909 1085106 1086194 1089717 1093418 1098735 1107648 1118273 1128202 1139034 1152874 1167630
58324 1167630 1180673 1194081 1211221 1231125 1251123 1272019 1295702 1320690 1345065 1370753 1399858
58313 1399858 1429789 1456937 1481931 1506258 1527277 1542003 1552517 1562210 1570093 1574199 1577008 1581841
58301 1581841 1587494 1592094 1598440 1609595 1623112 1635753 1649903 1668941 1690508 1711127 1733310 1760859
58289 1760859 1791261 1820234 1849943 1884866 1923216 1960401 1997564 2038820 2083458 2128819 2177418
58278 2177418 2233078 2293381 2353927 2416439 2484304 2553892 2618914 2679621 2738947 2793651 2838672
58267 2838672 2876489 2912673 2946034 2972839 2996729 3024269 3054587 3083820 3115740 3157053 3206019
58256C206019N0796N4388O3286O9564O9901P3049Q2974R0808R2142R5628J05474
58245D054029J12692J13154J16523J27391J35899J37368J42073J54739J64334
58236E258202J65813J71275J87055K01260K07139K16541K36115K53377K61501
58227G158278K73965K98549L21628L35247L53900L86382M18167M40869M70704
58218A0457689N17381N64572O03005O51038P19306P89102Q51008R28406J035387
58209A7116894J150883J264778J407323J599781J822170K066742K373059K768506
58201C1570136L228152L738388M339306N054658N852528O737348P805226R148055
58193G7473797J0806358J2898082J5668217J9306845K3862789K9386214L5699257
$$ plain form
58256 3206019 3256815 3311203 3374489 3444053 3513954 3587003 3669977 3760785 3852927 3948555 4054029
58245 4054029 4166721 4279875 4396398 4523789 4659688 4797056 4939129 5093868 5258202
58236 5258202 5424015 5595290 5782345 5983605 6190744 6407285 6643400 6896777 7158278
58227 7158278 7432243 7730792 8052420 8387667 8741567 9127949 9546116 9986985 10457689
58218 10457689 10975070 11539642 12142647 12793685 13512991 14302093 15153101 16081507 17116894
58209 17116894 18267777 19532555 20939878 22539659 24361829 26428571 28801630 31570136
58201 31570136 34798288 38536676 42875982 47930640 53783168 60520516 68325742 77473797
58193 77473797 88280155 101178237 116846454 136153299 160016088 189402302 225101559
58186B25101559M1500310M3968182M0241951K9911393J5766517J659204j0256131
58179C87892985k0007954k8106255l4178454l7367312l7419305l4968923l1022031
58172A64822751k6489116k2056258j8136111j4842166j2115646r896606q139604
58165E3147244o749388n616436m693978l968840l390629k897325k477759k144526
58157B1208363j873704j628257j411876j244289j109094r76903q54855p64342
58149A1345043o93326o17115n43592m93075m54751m06281l56087l24360l01767
58140G154689k67634k30158k08647j94079j66516j34113j16224j04716q0249n0415
58130E601938l3628k1294N987M0416O3402Q4144J22834J70061K02067K22325K49060
$$ plain form
58186 225101559 266601869 310570051 350812002 380723395 396489912 398149116 387892985
58179 387892985 367885031 339778776 305600322 268233010 230813705 195844782 164822751
58172 164822751 138333635 116277377 98141266 83299100 71183454 61286848 53147244
58165 53147244 46397856 40781420 36087442 32118602 28727973 25830648 23352889 21208363
58157 21208363 19334659 17706402 16294526 15050237 13941143 12964240 12109385 11345043
58149 11345043 10651717 10034602 9491010 8997935 8543184 8136903 7780816 7456456 7154689
58140 7154689 6887055 6656897 6448250 6254171 6087655 5953542 5837318 5732602 5652353 5601938
58130 5601938 5568310 5547016 5553003 5593419 5656821 5740965 5863799 6033860 6235927 6458252 6707312
58119F707312K76754K91134L07869L53809M23471M96809N84639P10628Q64638
58110A1017063J024153J206224J445801J742844K092987K550089L187704M024028
58102B8290893N066502O364872P821088Q907583Q813635P107656M222898J133176
58094G7728303j450293l460374n128178o490425p340430p522007p109523o322680
58086C2904393n378384m436608l599743k906983k346073j892212j530733j246944
58078I566713j019243q32679o85480n75248m89916m18376l60436l19863k94042
58069D571430k75838k60584k46415k31206k13296j93218j72157j50586j30312
58060B697818j15252j07658j05216j04051j03034j02947j03059j01427r7841r3661
$$ plain form
58119 6707312 6984066 7275200 7583069 7936878 8360349 8857158 9441797 10152425 11017063
58110 11017063 12041216 13247440 14693241 16436085 18529072 21079161 24266865 28290893
58102 28290893 33357395 39722267 47543355 56450938 65264573 72372229 76595127 77728303
58094 77728303 76278010 72817636 67689458 61199033 53858603 46336596 39227073 32904393
58086 32904393 27526009 23089401 19489658 16582675 14236602 12344390 10813657 9566713
58078 9566713 8547470 7714791 7029311 6454063 5964147 5545771 5185335 4865472 4571430
58069 4571430 4295592 4035008 3788593 3557387 3344091 3150873 2978716 2828130 2697818
58060 2697818 2582566 2474908 2369692 2265641 2162607 2059660 1956601 1855174 1757333 1663672
58050A663672q8888q2107p3518o5349n8725n2532m6214m1138l7962l5141l1514
58039A050584k8252k6456k4966k2536k0155j9042j8180j6204j4114j3521j3744
58028H33414j3239j2534j3005j3863j3292j1669j0852j0952j0505r291q302p492
58016F98418n987m075k671j425L44J784J949K110L967O503P435O956P058P898
58002G30264P886O805N725M238R75l343o448q139j0435j4051j7526j9838k1229
57989F54884k1465j9943j7601j6130j5332j3616j0956q791p314n577l983l860
57977E10316m704m640l560l033l194k593j145l89o82q46o34q28r67K33K142K810
57961D88286K316K638M008M514L561K745K737K182L64j704l458n494p652q778
$$ plain form
58050 1663672 1574784 1492677 1419159 1353810 1295085 1242553 1196339 1155201 1117239 1082098 1050584
58039 1050584 1022332 995876 970910 948374 928219 909177 890997 874793 860679 847158 833414
58028 833414 820175 807641 794636 780773 767481 755812 744960 734008 723503 714212 705910 698418
58016 698418 692431 688356 685685 684260 684604 686388 688337 690447 694414 700917 708352 715308 722366 730264
58002 730264 738150 744955 750680 754918 755893 752550 746102 737963 727528 713477 695951 676113 654884
57989 654884 633419 613476 595875 579745 564413 550797 539841 531050 523736 518159 514176 510316
57977 510316 505612 500972 497412 494379 491185 488592 487447 487058 486376 485530 484896 484068 483101 483334 485476 488286
57961 488286 490602 493240 497248 501762 505323 508068 510805 512987 513351 511647 508189 502695 495043 486265
57947D86265q864r044r244q283o357m889l800j781P29J726J067O76J074P44n76
57932D39443j206p66j004k529l735l811l902m386l946k427j605j962j520Q50L643
57917D11137N520P209R314J0788J1063J1233J1730J1242R269P398O564N319K362
57904E20148j314m270o650q955j0684j1564j2402j3482j3850j3139j2297j1624
57892C99917j0136p763o062n644n079l489k042j637j273j03R68J133J198J854
57878C61842K233J601P94O91R40J266K248L717M266L516K992L612M234L871L330
57863D01153L320K906J324m74j511k283l279l749l266k899l432m056m002l811
57849C75941l814l149j432L02J410K659M387N665O315P581R643J0719J0077R619
$$ plain form
57947 486265 477401 468357 459113 450830 444473 439584 435784 434003 434732 436458 437525 438201 439275 440019 439443
57932 439443 438237 437471 436467 433938 430203 426392 422490 418104 414158 411731 410126 408164 406644 407494 411137
57917 411137 416657 423866 433180 443968 455031 466264 477994 489236 498505 505903 512467 517786 520148
57904 520148 518834 514564 507914 498959 488275 476711 464309 450827 436977 423838 411541 399917
57892 399917 389781 382018 375956 370312 365233 361744 359702 358065 356792 356689 357657 358790 359988 361842
57878 361842 364075 365676 366470 367161 368101 369367 371615 375332 379598 383114 386106 389718 393952 397823 401153
57863 401153 404473 407379 408703 408229 406718 404435 401156 397407 394141 391242 387810 383754 379752 375941
57849 375941 372127 368978 367546 367848 369258 371917 376304 381969 388284 395865 405508 416227 426304 435923
57835D35923J0844J2470J2775J2114J1315R728O845L932K026J43k698n492p178
57822E02747q548j0243j0983r973r062j0017j1485j1210r621q571q022o721m972
57809C83319l926l128j294J199L002M114N255N845M918L294K491K182J007q10
57795D07468j948k455l435m804n517n620n915o087n211l765l006k782j940n80
57781C54403J44J22K72O61N16q0k97j31j80j94M73J376J651J792K971M892O170
57764C74561O581P166Q275R275J0090J1404J3262J4893J5891J6258J5603J3593
57752E16852J0862Q176N165J247k813n774p780r785j1637j2485j2520j2660j2791
57739D54057j2050j0503q900p125m591j859j49N49J202J905J981J617J725K245
$$ plain form
57835 435923 446767 459237 472012 484126 495441 505169 512014 515946 517972 518115 515417 509925 502747
57822 502747 494199 483956 472973 463000 453938 443921 432436 421226 411605 403034 395012 388291 383319
57809 383319 379393 376265 374971 376170 379172 383286 388541 394386 399304 402598 405089 407271 408278 407468
57795 407468 405520 403065 399630 394826 389309 383689 377774 371687 366476 362711 359705 356923 354983 354403
57781 354403 354547 354669 354941 355602 356118 356038 355741 355610 355430 355236 355709 357085 358736 360528 363499 368391 374561
57764 374561 381142 388308 396583 405858 415948 427352 440614 455507 471398 487656 503259 516852
57752 516852 527714 535890 541055 542302 539489 533715 525935 516150 504513 492028 479508 466848 454057
57739 454057 442007 431504 422604 415479 410888 409029 408880 409429 410631 412536 414517 416134 417859 420104
57725D20104K283J832J834K632L663M482M889M504L476L078M071N278N283M713
57711D72122M931N441M880L891M436O508Q079Q370Q760J0219J2148J4128J6687
57698E80600J9742K2268K4099K6312K9395L2602L5486L8453M1488M3915M5837
57687I40197M8230N1442N4990N9038O4500P1473P9099Q6992R5247J03065J08950
57676A763223J12206J12525J08463R8456Q3438O6266M8410K9440J0137o312j6967
57665B409285k1002j8187p572J1077L5519O0768P9195Q1735O2688K5077k0591
57654B697992o4182j01523j32349j55760j69569j72437j64887j49238j29469j09799
57644A348779r2225p6297o1633m9105l8985k9964k1186j3683q433m428mN074J0027
$$ plain form
57725 420104 422387 424219 426053 428685 432348 436830 441719 446223 449699 452777 456848 462126 467409 472122
57711 472122 477053 482494 487374 491265 495701 502209 510288 518658 527418 537637 549785 563913 580600
57698 580600 600342 622610 646709 673021 702416 735018 770504 808957 850445 894360 940197
57687 940197 988427 1039869 1094859 1153897 1218397 1289870 1368969 1455961 1551208 1654273 1763223
57676 1763223 1875429 1987954 2096417 2194873 2278311 2344577 2392987 2422427 2432564 2426252 2409285
57665 2409285 2388283 2370096 2362524 2373601 2409120 2469888 2549083 2630818 2693506 2718583 2697992
57654 2697992 2633810 2532287 2399938 2244178 2074609 1902172 1737285 1588047 1458578 1348779
57644 1348779 1256554 1180257 1118624 1069519 1030534 1000570 979384 965701 957268 952840 952836 957910 967937
57631I67937J4537J8742K2739K6974L2193L8293M4260M9830N5872O2508O8511
57620A402396P3422P8653Q5057R0892R3548R2292Q7885Q0420O8961N2835L2366
57609B238727Q864j5362l7770n7024p3056q5512r3361r6586r6776r5203r1714
57598A505227q6266q0125p4328o8366o1629n4989m9619m5284m1093l7020l3468
57587H73040l0218k7018k4423k2774k1190j8719j5815j3559j2066j0797r702q987
57575F57772q253p051n743m941m540m157l951m179m494m452m123l539k230j19
57561E96000J890K921L233L612M336N270O261O920O801O316O544P706Q861R555
57547F76226J0459J1826J2736J2777J3058J4499J6408J7867J9214K1014K2775
$$ plain form
57631 967937 982474 1001216 1023955 1050929 1083122 1121415 1165675 1215505 1271377 1333885 1402396
57620 1402396 1475818 1554471 1639528 1730420 1823968 1916260 2004145 2084565 2153526 2206361 2238727
57609 2238727 2247591 2232229 2194459 2137435 2064379 1978867 1885506 1788920 1692144 1596941 1505227
57598 1505227 1418961 1338836 1264508 1196142 1134513 1079524 1029905 984621 943528 906508 873040
57587 873040 842822 815804 791381 768607 747417 728698 712883 699324 687258 676461 666759 657772
57575 657772 649519 642468 636725 631784 627244 623087 619136 614957 610463 606011 601888 598349 596119 596000
57561 596000 597890 600811 604044 607656 611992 617262 623523 630443 637244 643560 650104 657810 666671 676226
57547 676226 686685 698511 711247 724024 737082 751581 767989 785856 805070 826084 848859
57536H48859K4075K5775K8700L2098L4864L7387M0743M4856M8956N3166N8128
57525A277607O3561O8464P2322P5022P6042P4715P0717O3463N1885L5924J7488
57514A947210j123j8952l5631n0038o1031o8714p3649p5640p4513p1287o7162
57503A349470o2163n6103n0045m5203m1140l6583l1570k7190k3684k0310j6792
57492I38687j3586j0852q403o347m796l270j393L80J623K833M516O209P429Q736
57478I21766J0742J3034J5228J7960K1485K4607K6578K8826L2974L8247M2953
57467A194400M7425N3096N9408O4261O7251O9891P2581P3699P1946O7426O0002
57456A901386M8651L3207J5183l572k1806l8249n1654o1836o9396p4252p5739
$$ plain form
57536 848859 872934 898709 927409 959507 994371 1031758 1072501 1117357 1166313 1219479 1277607
57525 1277607 1341168 1409632 1481954 1556976 1633018 1707733 1778450 1841913 1893798 1929722 1947210
57514 1947210 1946087 1927135 1891504 1841466 1780435 1711721 1638072 1562432 1487919 1416632 1349470
57503 1349470 1287307 1231204 1181159 1135956 1094816 1058233 1026663 999473 975789 955479 938687
57492 938687 925101 914249 905846 899499 894703 891433 890040 890420 892043 894876 899392 905601 913030 921766
57478 921766 932508 945542 960770 978730 1000215 1024822 1051400 1080226 1113200 1151447 1194400
57467 1194400 1241825 1294921 1354329 1418590 1485841 1555732 1628313 1702012 1773958 1841384 1901386
57456 1901386 1950037 1983244 1998427 1994855 1973049 1934800 1883146 1821310 1751914 1677662 1601923
57445A601923p4230p1126o7087o1629n4832m8022m2317l7616l3358k9270k5170
57434A057266k0949j7026j4060j2133j0837r850q808p094m695k652j703j171k88
57421I46000L78K09J72J431L130L573L044L269M542N561N868O324P150P628P793
57406A006072Q396R147R016Q392Q828J0391J1383J1070J0636J1038J1799J2460
57394A128628J3281J4075J4153J3909J4615J6166J6914J6236J5361J5209J5235
57383A293782J5057J5216J5713J5621J4891J4651J5103J5062J4332J4412J5836
57372A459676J6876J6143J4655J3960J3873J3472J2937J2929J3291J3591J3934
57361A615337J4282J4065J3410J3485J4771J6163J6713J7026J7947J9183K0177
$$ plain form
57445 1601923 1527693 1456567 1389480 1327851 1273019 1224997 1182680 1145064 1111706 1082436 1057266
57434 1057266 1036317 1019291 1005231 993098 982261 972411 963603 956509 951814 949162 947459 946288 946000
57421 946000 946378 946587 946759 948190 951320 954893 957937 961206 965748 971309 977177 983501 990651 998279 1006072
57406 1006072 1014468 1023615 1032631 1041023 1049851 1060242 1071625 1082695 1093331 1104369 1116168 1128628
57394 1128628 1141909 1155984 1170137 1184046 1198661 1214827 1231741 1247977 1263338 1278547 1293782
57383 1293782 1308839 1324055 1339768 1355389 1370280 1384931 1400034 1415096 1429428 1443840 1459676
57372 1459676 1476552 1492695 1507350 1521310 1535183 1548655 1561592 1574521 1587812 1601403 1615337
57361 1615337 1629619 1643684 1657094 1670579 1685350 1701513 1718226 1735252 1753199 1772382 1792559
57350A792559K1185K2386K3077K2774K2116K1766K1477K1068K1190K2228K3486
57339B035312K4330K5054K5816K5970K5378K5111K5857K6704K6549K5711K5121
57328B316913K4913K4767K4785K5042K5097K4783K4685K5198K6048K7207K9132
57317B598570L1400L2550L2160L1852L3124L5303L6703L6878L6643L6684L7130
57306B978997L7844L8367L8257L7928L8314L9261L9481L8598L7949L8598L9903
57295C403497M0774M1178M1487M1523M1237M1272M2020M3008M3837M4708M5483
57284C870024M5461M4677M4170M4386M4623M4583M5010M6183M7272M7838M8405
57273D372632M8923M8400M6806M5511M4979M3918M1757L9978L9725L9977L9463
$$ plain form
57350 1792559 1813744 1836130 1859207 1881981 1904097 1925863 1947340 1968408 1989598 2011826 2035312
57339 2035312 2059642 2084696 2110512 2136482 2161860 2186971 2212828 2239532 2266081 2291792 2316913
57328 2316913 2341826 2366593 2391378 2416420 2441517 2466300 2490985 2516183 2542231 2569438 2598570
57317 2598570 2629970 2662520 2694680 2726532 2759656 2794959 2831662 2868540 2905183 2941867 2978997
57306 2978997 3016841 3055208 3093465 3131393 3169707 3208968 3248449 3287047 3324996 3363594 3403497
57295 3403497 3444271 3485449 3526936 3568459 3609696 3650968 3692988 3735996 3779833 3824541 3870024
57284 3870024 3915485 3960162 4004332 4048718 4093341 4137924 4182934 4229117 4276389 4324227 4372632
57273 4372632 4421555 4469955 4516761 4562272 4607251 4651169 4692926 4732904 4772629 4812606 4852069
57262D852069L8705L8738L9447M0527M2445M5102M7199M8319M9958N3029N6167
57251E351705N7980N9166O0761O2158O2706O3455O5239O6651O6047O4196O2916
57240F042980O2432O2008O1899O2614O3470O3825O4493O6244O8272O9943P2403
57229F760583P6327P9817Q0864Q0380Q0291Q0123P8271P5371P3466P2639P1375
57218G609507O9631O8822O9135O9468O9810P1252P3825P6468P8966Q1924Q5091
57207H423899Q7566Q9258R0491R0775Q9687Q8135Q6915Q5020Q1368P7186P4486
57196I364786P3080P1491O9863O9421O9756O9219O7603O6094O4936O3436O1792
57185A0111477O0616N9196N6419N2906N0023M7386M3654L9122L5162L1660K7523
$$ plain form
57262 4852069 4890774 4929512 4968959 5009486 5051931 5097033 5144232 5192551 5242509 5295538 5351705
57251 5351705 5409685 5468851 5529612 5591770 5654476 5717931 5783170 5849821 5915868 5980064 6042980
57240 6042980 6105412 6167420 6229319 6291933 6355403 6419228 6483721 6549965 6618237 6688180 6760583
57229 6760583 6836910 6916727 6997591 7077971 7158262 7238385 7316656 7392027 7465493 7538132 7609507
57218 7609507 7679138 7747960 7817095 7886563 7956373 8027625 8101450 8177918 8256884 8338808 8423899
57207 8423899 8511465 8600723 8691214 8781989 8871676 8959811 9046726 9131746 9213114 9290300 9364786
57196 9364786 9437866 9509357 9579220 9648641 9718397 9787616 9855219 9921313 9986249 10049685 10111477
57185 10111477 10172093 10231289 10287708 10340614 10390637 10438023 10481677 10520799 10555961 10587621 10615144
57174A0615144K3157J9936J7633J4827J1481Q776O757M521K308J111O26k77j570
57161A0724430k655m059o345q316q703q570r603j1194j1988j2995j6173k0988
57149A0602841k5599l0311l6579m3685m9903n5946o3544p1485p6858p9391q0777
57138I988763q0589p6992p0892o4989n9264n1782m3731l9098l9399m2905m8879
57127I370243n7824o7589p3970p5677p4429p0190o1189m8795l7435k9041k2121
57116H751983j6384j3241j1354o886J272J1359K3792M1054O2634Q5954J12324
57105I042507J45907J86975K33164K87557L58313M50059N63291P02268Q74724
57096A2844765J083307J326807J610447J944419K331177K765240L245128L770318
$$ plain form
57174 10615144 10638301 10658237 10675870 10690697 10702178 10710954 10717711 10722232 10724540 10725651 10726277 10726000 10724430
57161 10724430 10721775 10717716 10711371 10703055 10694352 10685782 10676179 10664985 10652997 10640002 10623829 10602841
57149 10602841 10577242 10546931 10510352 10466667 10416764 10360818 10297274 10225789 10148931 10069540 9988763
57138 9988763 9908174 9831182 9760290 9695301 9636037 9584255 9540524 9501426 9462027 9419122 9370243
57127 9370243 9312419 9244830 9170860 9095183 9020754 8950564 8889375 8840580 8803145 8774104 8751983
57116 8751983 8735599 8722358 8711004 8704118 8705390 8716749 8740541 8781595 8844229 8930183 9042507
57105 9042507 9188414 9375389 9608553 9896110 10254423 10704482 11267773 11970041 12844765
57096 12844765 13928072 15254879 16865326 18809745 21140922 23906162 27151290 30921608
57088C0921608M323629M871574N382591N824855O148188O306849O317163O246246
57080G6342703O091474N690916M821435L415867J661864j22409j687788k939889
57072I3274173l896147m617993n172075n602614n912541o077068o079557n928745
57064D9987433n647773n263376m808128m319354l828102l353596k909206k506501
57056A7351397k151248j841756j574256j346173j153512r90077q51312p35359
57048F707704o39300n57960m87577m27334l76343l32171k93383k60588k33816
57039C099232k11211j91210j73814j58857j45120j31976j20137j09998j00851
57030A756058r2270q4729p8326p2384o6749o2002n7961n3443m8084m3087l9457
$$ plain form
57088 30921608 35245237 40116811 45499402 51324257 57472445 63779294 70096457 76342703
57080 76342703 82434177 88125093 92946528 96362395 98024259 97901850 96214062 93274173
57072 93274173 89378026 84760033 79587958 73985344 68072803 61995735 55916178 49987433
57064 49987433 44339660 39076284 34268156 29948802 26120700 22767104 19857898 17351397
57056 17351397 15200149 13358393 11784137 10437964 9284452 8294375 7443063 6707704
57048 6707704 6068404 5510444 5022867 4595533 4219190 3887019 3593636 3333048 3099232
57039 3099232 2888021 2696811 2522997 2364140 2219020 2087044 1966907 1856909 1756058
57030 1756058 1663788 1579059 1500733 1428349 1361600 1299598 1241637 1188194 1140110 1097023 1057566
57019A057566l6714l3997l1420k9516k8059k6299k4048k1871k0391j9659j9141
57008G66451j8179j6584j4901j3859j3593j3445j2622j0964r120p942p673p789
56996F19780p647p015n939m483k973j925j278j12K326N720R400J3324J7636K1727
56982F58541K4522K5187K2980J7407R559K288k321m910o973q026o315j438N606
56969G36107J4076K3312L1754L8489M5079N3566O3576P3835Q5527J01079J20662
56958A387062J43106J69142J99904K33773K69609L12006L68123M41556N36197
56949D060478O60083Q06541R25820R36434P88342N14207K03788p2547l03777n06960
56939H012409o79430p94619q32708p99520p17866o12197n02125m00608l12757
$$ plain form
57019 1057566 1020852 986855 955435 925919 897860 871561 847513 825642 805251 785592 766451
57008 766451 748272 731688 716787 702928 689335 675890 663268 652304 643184 635242 627569 619780
56996 619780 612133 605118 599179 594696 591723 589798 588520 588408 590734 596454 605854 619178 636814 658541
56982 658541 683063 708250 731230 748637 758196 760484 758163 753253 746280 738254 731939 730501 736107
56969 736107 750183 773495 805249 843738 888817 942383 1005959 1079794 1165321 1266400 1387062
56958 1387062 1530168 1699310 1899214 2132987 2402596 2714602 3082725 3524281 4060478
56949 4060478 4720561 5527102 6452922 7389356 8177698 8691905 8895693 8823146 8519369 8012409
56939 8012409 7332979 6538360 5705652 4906132 4188266 3576069 3073944 2673336 2360579
56930B360579k38878j80095j38878j14472j01629r4896r1803r1351r2064r2518
56920A123995r1845q8976q3033p5056o7525o1392n5200m7860m0598l5074l0968
56909D46468k6904k2758j9629j7896j6617j4885j2755j0695q829p028n376m154
56897B78942l396k634j268P94L072N266P734J0843J4220J7364K0773K5435L0741
56884D07886L3874L2133K5539J6583P745j48p349j3892j9129k2176k2556k0525
56872D17985j6869j2376p567k790J787O427J1622J7468K3591K9997L7579M7335
56860E54189N9080P0786P8668P8242O6922M6651K3179J583j7065l3866m8067n6752
56848H23550n8196n3693m5774l6191k6031j6232o924K679J3023K3629L4267M5786
$$ plain form
56930 2360579 2121701 1941606 1802728 1688256 1586627 1491731 1399928 1308577 1216513 1123995
56920 1123995 1032150 943174 860141 785085 717560 656168 600968 553108 512510 477436 446468
56909 446468 419564 396806 377177 359281 342664 327779 315024 304329 295500 288472 283096 278942
56897 278942 275546 272912 271644 272438 275510 280776 288510 299353 313573 330937 351710 377145 407886
56884 407886 441760 473893 499432 516015 523760 523612 516263 502371 483242 461066 438510 417985
56872 417985 401116 388740 381173 378383 380170 386597 398219 415687 439278 469275 506854 554189
56860 554189 613269 684055 762723 840965 907887 954538 977717 979300 962235 928369 880302 823550
56848 823550 765354 711661 665887 629696 603665 587433 580509 583188 596211 619840 654107 699893
56836F99893N9231P5015R3022J11716J26025J28006J12246Q0790M1683K676l2692
56825A497611o3683q9180j06795j14366j11721j01248q6812p1690n7236m3387
56815F51493l0034j7432n658N729J7422K9993M3682N8322P3058Q5553R1303Q5115
56803A088546O5143L5758M747k2832m6791o7802q3582r0817q9327q2215p2494
56792F38334o1396m9671l8542k8915k0701j3253n848K137J0770J9436K7721L5879
56780E15951M3417M7698M5343L5242J9560J978j4362k7721l7910m5697n1377n3942
56768D78180n2378m7316m0639l3794k7450k2303j8888j6596j4123j1049q138o013
56756A79493m469l172k199j629j323j241j499k080k841l671m283m210l507k932
$$ plain form
56836 699893 759124 834139 927161 1038877 1164902 1292908 1405154 1485944 1527627 1530303 1497611
56825 1497611 1433928 1344748 1237953 1123587 1011866 910618 823806 752116 694880 651493
56815 651493 621459 604027 598369 604098 621520 651513 695195 753517 826575 912128 1003431 1088546
56803 1088546 1153689 1189447 1194194 1171362 1124571 1056769 973187 882370 793043 710828 638334
56792 638334 576938 527267 488725 459810 439109 425856 420008 422145 432915 452351 480072 515951
56780 515951 559368 607066 652409 687651 707211 709189 694827 667106 629196 583499 532122 478180
56768 478180 425802 378486 337847 304053 276603 254300 235412 218816 204693 193644 185506 179493
56756 179493 175024 171852 169653 168024 166701 165460 163961 161881 159040 155369 151086 146876 143369 140437
56742A40437k905k868k316j720j604j502q88m07q87j752j788j037n58o12n83m03
56726A18607o09r79o48K88O80Q0o55p99n66l16O0N53P43M78J27RJ43N67J209J589
56706A20561J348R19R51J388J800K184K597K530J690Q34P38Q70L52m14n07k67
56690A37574o69j351j105j35R5o49r32%J192J667J612J390Q83L13L86J050J307
56673A42628P76L00N07R14Q87M90L2l41k71N46J575J816J145M36L09O96J434K239
56655A56118K338J346K87L87J085Q40l43r25m58k10r69k026k802l675m652m910
56639A41431m343m007m262m010k591r94l09k38JL45M19M08O09Q50R77J229J709
56622A27224K122K285K228J790R56M99J113K125K234J445Q54O43m3j245j857j455
$$ plain form
56742 140437 137532 134664 132348 130628 129024 127522 126634 126227 125340 123588 121800 120763 120205 119593 119010 118607
56726 118607 117998 117019 116371 116659 117339 117419 116764 115965 115399 115083 115143 115696 116439 116917 117044 117053 117196 117763 118972 120561
56706 120561 121909 122828 123779 125167 126967 129151 131748 134278 135968 136802 137540 138410 138762 138348 137841 137574
56690 137574 136905 135554 134449 134314 134409 133760 132828 132828 134020 135687 137299 138689 139572 139885 140271 141321 142628
56673 142628 143404 143704 144211 145125 146012 146502 146534 146193 145922 146468 148043 149859 151004 151440 151749 152445 153879 156118
56655 156118 158456 159802 160089 160476 161561 162401 162058 161133 160675 160465 159496 157470 154668 150993 146341 141431
56639 141431 137088 133081 128819 124809 122218 121224 120915 120677 120678 121023 121442 121850 122459 123309 124286 125515 127224
56622 127224 129346 131631 133859 135649 136605 137104 138217 140342 142576 144021 144875 145518 145475 144230 142373 140918
56606A40918q16l33M30J304J275K02p68r48q13n89J72J174J197N0q57m97N22J287
56588A42910J707J845J571J383K126L353L501K206R98J106K029K726K843K310
56574A72614J205M09R31K224K725K297K312L119L423K709K212K672L119K739K214
56559B06924K285K662L103L979N123N715N891O727Q130Q748Q370Q455R589J0623
56545B96324J0999J1675J2917J3506J3063J2884J3439J3360J2000J0662J0081
56534D30910R091P140N653N373M734K541L9j419k526m061n038m770m765o397q539
56519D27966r588j0004j0873j1691j1701j1797j2870j3808j3225j1798j0931j0405
56507B89275r410q493q481q691q163p463p419p341o326n071m548m171l106k146
$$ plain form
56606 140918 140102 139769 140199 141503 142778 142980 142212 141264 140451 139862 140034 141208 142405 142455 141598 141101 141623 142910
56588 142910 144617 146462 148033 149416 151542 154895 158396 160602 161600 162706 164735 167461 170304 172614
56574 172614 173819 174228 175159 177383 180108 182405 184717 187836 191259 193968 196180 198852 201971 204710 206924
56559 206924 209209 211871 214974 218953 224076 229791 235682 242409 250539 259287 267657 276112 285701 296324
56545 296324 307323 318998 331915 345421 358484 371368 384807 398167 410167 420829 430910
56534 430910 440001 447141 452794 458167 462901 465442 465481 464062 461536 457475 452437 447667 442902 436505 427966
56519 427966 418378 408374 397501 385810 374109 362312 349442 335634 322409 310611 299680 289275
56507 289275 279865 271372 262891 254200 246037 238574 231155 223814 217488 212417 207869 203698 200592 198446
56493A98446k317k833k388j334p88o29k19K8m60r74o71p9O9L42J293J948J303
56476A90737J32k74o0R9N21J587K545K822L112L776L674K268J203J932L361L715
56460B21150L261L261L613L563L449L907M520M913N804P436Q429P867O872O614
56446B94659O539O155O516Q101R278Q878Q179Q290P954O222M940N801P166O718
56432C95396N314N146N933N999N534N689N910N092M026L758L108P26j908k621
56418D47102k209k929m713o008o835p955q534p893q002j0643j3578j3305j0432
56405C44066q525q650q928q714r109r776r111p446o525o086m417j959q43r85k29
56390B52763J606K310J163q4m03p22j525j991j833j666j502r93q88j927k974k618
$$ plain form
56493 198446 196129 193296 190908 189574 188786 188157 187938 187966 187506 186532 185861 185782 185851 186193 187486 189434 190737
56476 190737 190869 190595 190535 190634 191155 192742 195287 198109 201221 204997 208671 210939 212142 214074 217435 221150
56460 221150 224411 227672 231285 234848 238297 242204 246724 251637 257441 264877 273306 281173 288045 294659
56446 294659 301198 307353 313869 321970 331248 340126 348305 356595 364549 370771 375711 381512 388678 395396
56432 395396 400710 405856 411789 417788 423322 429011 434921 440013 444039 447797 450905 451631 449723 447102
56418 447102 444893 441964 437251 431243 424408 416453 407919 400026 392024 381381 367803 354498 344066
56405 344066 335541 326891 317963 309249 300140 290364 281253 273807 267282 261196 256779 254820 253977 252992 252763
56390 252763 254369 256679 257842 257758 257355 256633 255108 253117 251284 249618 248116 247123 246235 244308 241334 238716
56374B38716j792k232l260l042k036k082k844k447j004k85l48K74J508J977J801
56359B22904K084K217R03p73o14R68J771J715K439L630L380J883J179J537J521
56344B46744J239J981L067K635J265J185K226K271J322J302K135J966J103J669
56330B72110L385L745K527K119L212M058M217N080O356O060M408L934N263O406
56316C32880O551O879P466P141O562P562R357R288P473O617P127O807N517N617
56302D32844P188P491O019N475O699P023M983K564J366M33q64j447j227j653k683
56287D74211k682j907k404l980m226l039k916m116l967j816l01n93p35K27P18
56272D42474L62R71K626K986J678J230K540L579L582M237N694N957N230O324R544
$$ plain form
56374 238716 236924 234692 231432 228390 226354 224272 221428 218981 217977 217692 217344 217618 219126 221103 222904
56359 222904 224988 227205 228108 227335 226721 227689 229460 231175 233614 237244 240624 242507 243686 245223 246744
56344 246744 247983 249964 253031 255666 256931 258116 260342 262613 263935 265237 267372 269338 270441 272110
56330 272110 275495 279240 281767 283886 287098 291156 295373 300453 306809 312869 317277 321211 326474 332880
56316 332880 339431 346310 353776 360917 367479 375041 384398 393686 401159 407776 414903 421710 427227 432844
56302 432844 440032 447523 453542 459017 465716 472739 477722 480286 481652 482085 481221 479774 478547 476894 474211
56287 474211 471529 469622 467218 463238 459012 455973 453057 448941 444974 443158 442857 442264 441529 441756 442474
56272 442474 442836 443807 446433 449419 451097 452327 454867 458446 462028 466265 471959 477916 483146 489470 499014
56257D99014J1855J2306J3432J5965J7319J6969J8103K1910K5245K6212K7208
56246G05538K9984L2448L2931L3180L4496L5123L4018L3059L3089L1736K7679
56235A063281K3103J9676J5935J0888O278L129m9l687n719n603n735o996p128
56222A107373n316l979m113l386r12O77M5m79L87M13j705l992n477q144j2437
56207A058955j5495j6183j7095j9425k0699j9924j9793k1348k1616j9231j7179
56196H50967j7213j6788j4434j2899j3747j3995j1480q607p618o997n580n211
56184G16398o290n870l179j682k683k604J76J827Q1j294Q26L592L824L407M538
56169G11067N136L529K514M068N135L155P48M43L1k359l850k281q56k475m517
$$ plain form
56257 499014 510869 523175 536607 552572 569891 586860 604963 626873 652118 678330 705538
56246 705538 735522 767970 800901 834081 868577 903700 937718 970777 1003866 1035602 1063281
56235 1063281 1086384 1106060 1121995 1132883 1139161 1142290 1142241 1138554 1132835 1127232 1121497 1114501 1107373
56222 1107373 1102057 1098078 1093965 1090579 1089667 1090344 1090389 1089910 1090297 1090710 1089005 1085013 1079536 1071392 1058955
56207 1058955 1043460 1027277 1010182 990757 970058 950134 930341 908993 887377 868146 850967
56196 850967 833754 816966 802532 789633 775886 761891 750411 741804 734186 727189 721609 716398
56184 716398 710108 704238 701059 699377 696694 694090 694266 696093 696174 694880 695706 699298 703122 706529 711067
56169 711067 716203 719732 722246 726314 731449 734604 735352 735795 735826 733467 729617 727336 726480 724005 719488
56154G19488m048l142m145m784k965j378k403l352j691J19k44k39K219M158L303
56139G00896K928N761Q687Q797Q949J1788J4119J3142J2419J5421J8876J8968
56127H40751J8532K1377K4876K5183K4687K7322L1258L3190L5243M0748M7659
56116A170826N2812N8351O7545P8826R0172J04534J24580J46952J67910J89204
56106B251712K11789K29358K35246K30788K20363K03928J81479J58902J41565
56097D065130J27035J10976R4529P9033O0058L4758R125j0186k5247m0402n3411
56086D451398o1866p1688q9590j12733j34944j57017j81253k01983k11998k13130
56076C015196k10650k02736j85629j63703j43890j25144j03601q2849o8585n8169
$$ plain form
56154 719488 715440 712298 708153 703369 700404 699026 696623 693271 691580 691699 691455 691216 693435 697593 700896
56139 700896 703824 709585 718272 727069 736018 747806 761925 775067 787486 802907 821783 840751
56127 840751 859283 880660 905536 930719 955406 982728 1013986 1047176 1082419 1123167 1170826
56116 1170826 1223638 1281989 1349534 1428360 1518532 1623066 1747646 1894598 2062508 2251712
56106 2251712 2463501 2692859 2928105 3158893 3379256 3583184 3764663 3923565 4065130
56097 4065130 4192165 4303141 4397670 4476703 4536761 4571519 4580644 4570458 4545211 4504809 4451398
56086 4451398 4389532 4317844 4228254 4115521 3980577 3823560 3642307 3440324 3228326 3015196
56076 3015196 2804546 2601810 2416181 2252478 2108588 1983444 1879843 1796994 1728409 1670240
56066A670240m5995l4202k7624k3400j6266q919o345n235L3O267P411O177Q544
56053A530686J2276J2228J1399J4962J9181J8221J6045J9280K4289K3977K1362
56042A723906K3408K7333K6443K3667K5778K9956K9729K8305L2196L7756L8100
56031B046577L6934M1217M6837M6429M4314M8382N4366N4142N2162N6971O3981
56020B592312O4110O1866O6755P4281P4297P0844P4265Q1081Q1578P9945Q6226
56009C407560R5784R7981R7610J05809J17445J20349J19221J26691J38483J42081
55999D569014J42146J51774J66295J72258J74562J87214K05219K14140K19409
55990F202031K36350K59522K72939K82104L03429L30800L46802L58127L83929
$$ plain form
56066 1670240 1624245 1590043 1562419 1539019 1522753 1513834 1507489 1502254 1502287 1508554 1515965 1522142 1530686
56053 1530686 1542962 1555190 1566589 1581551 1600732 1618953 1634998 1654278 1678567 1702544 1723906
56042 1723906 1747314 1774647 1801090 1824757 1850535 1880491 1910220 1938525 1970721 2008477 2046577
56031 2046577 2083511 2124728 2171565 2217994 2262308 2310690 2365056 2419198 2471360 2528331 2592312
56020 2592312 2656422 2718288 2785043 2859324 2933621 3004465 3078730 3159811 3241389 3321334 3407560
56009 3407560 3503344 3601325 3698935 3804744 3922189 4042538 4161759 4288450 4426933 4569014
55999 4569014 4711160 4862934 5029229 5201487 5376049 5563263 5768482 5982622 6202031
55990 6202031 6438381 6697903 6970842 7252946 7556375 7887175 8233977 8592104 8976033
55981H976033M18443M42901M64894N05778N58859O02399O43992P07125P84516
55972A4104940Q52749R22286J021727J144215J264514J396983J577450J801326
55964B4086190K044486K330657K706753L167019L679483M268688M984690N813455
55956E3081421O722062P772684R081631J0703081J2696775J5270187J8677951
55949A34005792K3029993K8386535L4800877M1605165M6478941M6041675L8336609
55942C92685587K4818789R384832m660385j6376478k6190286l4045786l9072242
55935C06544031m0641426l9095506l5441383l0743058k5853419k1355077j7506115
55928I5908047j4302797j1671375r564063p903116o566623n472251m599606l914975
$$ plain form
55981 8976033 9394476 9837377 10302271 10808049 11366908 11969307 12613299 13320424 14104940
55972 14104940 14957689 15879975 16901702 18045917 19310431 20707414 22284864 24086190
55964 24086190 26130676 28461333 31168086 34335105 38014588 42283276 47267966 53081421
55956 53081421 59803483 67576167 76657798 87360879 100057654 115327841 134005792
55949 134005792 157035785 185422320 220223197 261828362 308307303 354348978 392685587
55942 392685587 417504376 426889208 422228823 405852345 379662059 345616273 306544031
55935 306544031 265902605 226807099 191365716 160622658 134769239 113414162 95908047
55928 95908047 81605250 69933875 60369812 52466696 45900073 40427822 35828216 31913241
55920C1913241l349395k864367k468683k155900j886797j643853j444160j287617
55912A4812469j145523j009053q98571q16614p38711o57988n93945n49953n04703
55903G897408m52624m12171l87278l59191l23230k96684k83511k66426k40669
55894D875624k22028k14694k03282j83398j69298j64747j55754j38651j26996
55885C296776j24395j17801j03805r5102r4858r0457p8687p2036p3846p1658o1467
55874B312664n4973n6265n4165m4367l7210l6671l2805k1685j2574q710o17J5026
55862A967648K8749L6723M7271O2787P3065P2775O8471O2609M7831K2969j916
55851B488982k2191m4229o9187q7580r5668j01264j07603j07155r7419q7375q2001
$$ plain form
55920 31913241 28563846 25699479 23230796 21074896 19188099 17544246 16100086 14812469
55912 14812469 13666946 12657893 11759322 10942708 10203997 9546009 8952064 8402111 7897408
55903 7897408 7444784 7032613 6645335 6286144 5962914 5666230 5382719 5116293 4875624
55894 4875624 4653596 4438902 4235620 4052222 3882924 3718177 3562423 3423772 3296776
55885 3296776 3172381 3054580 2950775 2855673 2760815 2670358 2591671 2519635 2445789 2374131 2312664
55874 2312664 2257691 2201426 2147261 2102894 2065684 2029013 1996208 1974523 1961949 1953239 1952622 1967648
55862 1967648 1996397 2033120 2080391 2143178 2216243 2289018 2357489 2420098 2467929 2490898 2488982
55851 2488982 2466791 2422562 2353375 2265795 2170127 2068863 1961260 1854105 1756686 1669311 1587310
55840A587310p5053o3304n3534m9194m4186l5985l1423l3274l4342l0867k8984
55829A107164l1915l3409k9761k6248k5825k3471j7362j3848j5692j6764j3783
55818H59086j1973j3838j3716q837m713m260k431L218P550Q465J1762K0245K8548
55805H79106L3515L8713M3728M0450K6059R126l214j3984k6697l7397m2722m6202
55793I00481n0179n0499m5214l9636l7074l3382k6179k0415j9122j7623j2694
55782E48464q729q955r244o621n256p928r832p210m015l859l213J014M700L753
55768D83069J091K80q70m530p430p067o733q858r924p349m619m276k819J762M372
55753D26099Q41m914p819r484j3116j6595j6864j5744j5670j4680j1040p647o761
$$ plain form
55840 1587310 1512257 1448953 1395419 1346225 1302039 1266054 1234631 1201357 1167015 1136148 1107164
55829 1107164 1075249 1041840 1012079 985831 960006 936535 919173 905325 889633 872869 859086
55818 859086 847113 833275 819559 810722 806009 801749 799318 802536 810086 818551 830313 850558 879106
55805 879106 912621 951334 995062 1035512 1061571 1070697 1067483 1053499 1026802 989405 946683 900481
55793 900481 850302 799803 754589 714953 677879 644497 618318 597903 578781 561158 548464
55782 548464 539735 530780 521536 514915 509659 501731 491899 484689 480674 476815 473602 474616 479316 483069
55768 483069 484160 484440 483570 479040 471610 464543 457810 448952 439028 431679 427060 422784 419965 421727 426099
55753 426099 426940 422026 414207 404723 391607 375012 358148 342404 326734 312054 301014 293367 286606
55740B86606n677k443l61j895l627k339n50j108j802l42Q09m64j513m21k55k916
55724B61702m585k505m77k195m778m536l617n059o450m644j949j729k293q50Q42
55709B16877M12J11K561N448N724N104O140P065N667M174N085O199M893L276M088
55694B82824N501M984M183N063N435L297J250J532J095k866p036p313n786o433
55680B85730p919o829m489m318n522n356m777o110p810p201n690o035p078o424
55666B00172n447o407p472n896l386k931l115r96J940K222M97j24L71R4k09J124
55650A70437K449J268j089j861j756k875m073l212j750k289l747l609k769l409
55636A41715m380l493k118k674l714k480j97J02r32n96O69O12j58L78J277M87
$$ plain form
55740 286606 280929 278486 278125 276230 272603 270264 269714 268606 266804 266462 267271 266807 265294 264873 264618 261702
55724 261702 257117 254612 254135 251940 247162 242626 239009 233950 227500 222856 220907 219178 216885 216035 216877
55709 216877 217289 217400 219961 225409 231133 236237 242377 249442 255109 259283 264368 270567 275460 278736 282824
55694 282824 288325 293309 297492 302555 307990 311287 312537 314069 315164 312298 305262 297949 292163 285730
55680 285730 277811 270982 266493 262175 256653 251297 246520 240410 232600 225399 219709 213674 206596 200172
55666 200172 194725 188318 180846 174950 171564 168633 165518 164522 166462 168684 169181 169057 169428 169522 169313 170437
55650 170437 172886 174154 173065 171204 169448 166573 162500 159288 157538 155249 151502 147893 145124 141715
55636 141715 137335 133842 131724 129050 125336 122856 122659 122761 121829 121233 121902 122514 122356 122734 124011 124498
55620A24498p36LJ495J115j10N30K195K123Q83J041K088J620K46M07J542J091
55604A40031p13j633j790k769l729k798j152j248k313j997j064j887l651l721
55590A09566k530k519l396l064k076k431l157j782P37J296l3n74j4j38n20P15
55574I0080K643K695J502J880L675M272L741M619O948Q191Q043Q761J0688J1805
55560A69543J1809J2413J3567J3303J1357R186O608K328k594n687p188r335j1992
55547B13318j3040j2609j2781j3411j2430j0111q813q614p366n077m010m338l787
55534I6931j898o89q60j010q19j291j854q86Q51R60m11q56q7j55j373j841j154
55517H3558q07q58P7J407R80r81k064j875k283l486l710l000l317m616m725l373
$$ plain form
55620 124498 123762 123765 125260 126375 126265 126795 128990 131113 131996 133037 135125 136745 136991 137398 138940 140031
55604 140031 139318 137685 135895 133126 129397 126599 125447 124199 121886 119889 118825 116938 113287 109566
55590 109566 107036 104517 101121 98057 95981 93550 90393 88611 89348 90644 90611 90037 90023 89885 89365 90080
55574 90080 92723 95418 96920 98800 102475 106747 110488 115107 122055 130246 138289 147050 157738 169543
55560 169543 181352 193765 207332 220635 231992 241178 247786 250114 247520 241833 234645 225310 213318
55547 213318 200278 187669 174888 161477 149047 138936 130123 121509 114143 109066 105056 100718 96931
55534 96931 95033 94344 93484 92474 91655 90364 88510 87624 88475 89435 89024 88168 88081 87926 86553 84712 83558
55517 83558 82751 81893 81970 83377 84357 83376 81312 79437 77154 73668 69958 66958 63641 59025 54300 50927
55501E0927k587k726k105q05q42k045j848J21J276O56L31J269J683O47k39k1N3
55484D3745p36j388j644k620m094m224k730j464j144n56M98N28p31j719j820j879
55468A8022j745m15J274J376M67J014K905L393J795M70M67J78r14j029J93O43
55452B8094l57p45M20J231N18k64q8j03q92j126l18R4l36j15J110J629J025J167
55434C0944K599L195J891N65N59N25n50j231m16N03K20k60K07Q94R87J169J859
55417D3660J991J014J9k62n28j029r08k66m22j249r22Q24J945J623J591K793L657
55400E3531L144K670L432M447M747M983N377M725K881J672J792J426n20k428k864
55385H9015k852l528m013l518l128l693m139l652l326l915m168l134k028j983
$$ plain form
55501 50927 48340 45614 43509 42704 41862 39817 37969 38090 39366 40022 40353 41622 43305 43952 43713 43692 43745
55484 43745 43009 41621 39977 37357 33263 29039 26309 24845 23701 23145 23643 24171 23440 21721 19901 18022
55468 18022 16277 15862 17136 18512 18979 19993 22898 26291 28086 28556 29023 29201 28287 27258 27451 28094
55452 28094 27737 26992 27412 28643 29161 28897 28809 28706 27814 26688 26370 26464 26128 26013 27123 28752 29777 30944
55434 30944 33543 36738 38629 39194 39753 40278 39728 38497 38081 38584 38804 38544 38751 39645 40632 41801 43660
55417 43660 45651 46665 46684 46422 45894 44865 43957 43691 43269 42020 41098 41922 43867 45490 47081 49874 53531
55400 53531 56675 59345 62777 67224 71971 76954 82331 87056 89937 91609 93401 94827 94307 91879 89015
55385 89015 86163 82635 78622 75104 71976 68283 64144 60492 57166 53251 49083 45949 43921 41938
55371D1938k079j382q63j480k238k029j606j948k358j883j043o35l46J24J77k38
55355B2111k8J046J580Q89K07L84M38l21q05j74O04O18N39R69J123M81j06j54
55337B9401m39j082p82P73J858J319K39k09m12o28R5J846K891K218J027L84l67
55320C8132j560j960j013j07q7J56J152J379K9j207r54l71o69q25K17J262J043
55303C4617M98P77R76J06o84r1R13Q84L93N51P55N3q01p89n69r66j152l25M39
55284C5585K7n67p1P50O01j8j01j56q44j148j28R54N20o96j036o43o30p39o5R91
55264C2586J486J640J892J544J59r53n78K62M1p74q97o17q93j214n59M96O95K70
55246C4586K59N64M88L22N62N57m08j555j820j584j674j755j239o23m11J4R44
$$ plain form
55371 41938 39859 38477 37614 36134 33896 31867 30261 28313 25955 24072 23029 22394 22048 22172 22349 22111
55355 22111 22083 23129 24709 25598 25805 26189 26627 26306 25501 25327 25931 26549 27088 28057 29180 29661 29555 29401
55337 29401 28962 27880 27098 27871 29729 31048 31287 31078 30666 30038 30133 31979 34870 37088 38115 38499 38132
55320 38132 36572 34612 33599 33492 33405 33561 34713 36092 36121 34914 33960 33589 32920 32095 32312 33574 34617
55303 34617 35115 35892 36868 36974 36290 36199 37112 37996 38389 38940 39695 39748 38947 38158 37589 36623 35471 35146 35585
55284 35585 35612 35045 34974 35724 36325 36307 36206 36050 35206 34058 33930 34884 35404 34708 33672 33029 32399 31660 31595 32586
55264 32586 34072 35712 37604 39148 39307 38354 37776 38038 38079 37305 36408 35791 34898 33684 33125 33621 34316 34586
55246 34586 34845 35409 35897 36219 36781 37338 36930 35375 33555 31971 30297 28542 27303 26680 26269 26283 27227
55229B7227J223J52r89j020p87j257j456l37R69J041O79J223J881J234M6%P56
55212C0585Q14L33N40J223J187N04Q2k68j138j756j037L65J106J341J871K144
55196C7896J328L01L00N84k02j340j227k72o4m25k8P53L48r87j368l40O77Q75
55178C6809P33L38p34j864j854r16l57l83j06N47P69M91L49K58k52o97l30L43
55160C3144L55JM3qq84j667r82N44J179Q02O07O90K53l16J21J202J517R78O42
55141C8221N27j08p44j64J108J382O11L05O68L20r94j813j389n95l5P05J478J295
55123D0778J21p25m78K41P51J033J032O26L94J001J911K043J538J411J762J832
55107E5271J557J408J062j24j567k122j977k211k780k707j925j155k86J152K320
$$ plain form
55229 27227 28450 28602 27613 26593 25806 24549 23093 22756 23725 24766 25445 26668 28549 29783 29829 29829 30585
55212 30585 31399 31732 32272 33495 34682 35186 35268 35000 33862 32106 31069 31434 32540 33881 35752 37896
55196 37896 39224 39525 39825 40409 40207 38867 37640 37368 37304 36879 36851 37604 37952 36965 35597 35257 35934 36809
55178 36809 37542 37880 37146 35282 33428 32512 32155 31772 31666 32213 32982 33473 33822 34080 33828 33131 32801 33144
55160 33144 33499 33500 33543 33535 32651 30984 30002 30546 31725 32527 33134 33824 34077 33761 33882 35084 36601 37579 38221
55141 38221 38748 38640 37896 37732 38840 40222 40833 41138 41806 42126 41132 39319 37930 37335 37300 38005 39483 40778
55123 40778 40899 40174 39696 39937 40688 41721 42753 43379 43773 44774 46685 48728 50266 51677 53439 55271
55107 55271 56828 58236 59298 59174 57607 55485 53508 51297 48517 45810 43885 42730 42444 43596 45916
55092D5916J871K42p82n95l9N08J245J530N26q69r41J33O31J99J00O30P01J76
55074E1182J91Q08P34j52k74Q66J651R12l10n73LM53L00m70j546j984j022N49
55056E1318J069K69n61o29m22l49j40K01L39N88J537K655K753J803Q69L83jq2
55038F1600N53J122M79p35p66M61J272J000P15J020J245J149J407J985J932J225
55022G5664R38J191R26O3p0R56J917K016J927K075J808R99P05J352J765R15o59
55005I4488j845k244j984j384j173j894k907l101k557k233k251j963j507j567
54991F5878j773j205l40n20j539j817j019l67k49K39J164J365O26L9j42p71j640
54974E7929j401k06N0j053j481pJ821K176J416Q22O88R01J753L002L541L019K497
$$ plain form
55092 45916 47787 48029 47247 46652 46613 47121 48366 49896 50422 49553 48612 48745 49376 49575 49675 50305 51006 51182
55074 51182 51373 52181 52915 52763 52489 53355 55006 55918 55608 55035 55038 55491 55791 55321 53775 51791 50769 51318
55056 51318 52387 52656 52095 51466 51044 50695 50555 50756 51095 51683 53220 55875 58628 60431 61300 61683 61682 61600
55038 61600 62153 63275 63754 63019 62253 62714 63986 64986 65701 66721 67966 69115 70522 72507 74439 75664
55022 75664 76602 77793 78719 78782 78712 79668 81585 83601 85528 87603 89411 90410 91115 92467 94232 95147 94488
55005 94488 92643 90399 88415 87031 85858 83964 81057 77956 75399 73166 70915 68952 67445 65878
54991 65878 64105 62900 62560 62040 60501 58684 57665 57298 57049 57288 58452 59817 60443 60482 60340 59569 57929
54974 57929 56528 56322 56372 55319 53838 53831 55652 57828 59244 60066 60754 61655 63408 66410 69951 72970 75467
54957G5467K771L316L555L709L941M113M746O585Q905J0087J0077J0438J1687
54944A59397J2766J3410J4607J6185J6494J5210J3940J3141J1054O855K228j498
54932B93789n255r707j3298j4634j4695j4870j4767j3745j2730j2530j2027j0020
54920A45511p433n934n571n382n061m572l452j817p95o92k26J250K443K385K205
54905A12859L114M355M861N352O913Q977J0531J1980J3956J5568J5648J4547J2993
54892B41654J0377O073J178k814o152r774j3175j5119j5641j5556j4801j2968
54880A53282j0796r361q429p091n402m011k879j705r02q25q24l03J33j35m76k49
54864A00027j88j106k193k248j626j449j705j755j883k630l375l173k468k359
$$ plain form
54957 75467 78238 81554 85109 88818 92759 96872 101618 108203 117108 127195 137272 147710 159397
54944 159397 172163 185573 200180 216365 232859 248069 262009 275150 286204 293059 295287 293789
54932 293789 288534 278827 265529 250895 236200 221330 206563 192818 180088 167558 155531 145511
54920 145511 138078 132144 126573 121191 116130 111558 108106 106289 105494 104802 104576 105826 108269 110654 112859
54905 112859 115973 120328 125189 130541 137454 146431 156962 168942 182898 198466 214114 228661 241654
54892 241654 252031 258104 259282 256468 250316 240542 227367 212248 196607 181051 166250 153282
54880 153282 142486 133125 124696 117605 112203 108192 105313 103608 102706 101881 101057 100754 100887 100752 100276 100027
54864 100027 99839 98733 96540 94292 92666 91217 89512 87757 85874 83244 79869 76696 74228 71869
54850G1869k765k785k285j746j098j11O25M61o3k7M41O68O73O76K62p34j393j075
54832F1593p63j524k585k553j718j379j508r36M48J433J397J043J193J902K609
54817E8652K480J007r75j648m46J024J230Q06J134K051K459K280K114J763Q45
54802G4776J98R34K542L520L557L612M261N338O799Q494R624R757R933J1342J3458
54787A68145J4977J5978J7464J9116J9292J7208J3640R500N055N32l695p514j0738
54774B78960j2617j2667j1719j1079j1018j0879j0227r023p222n146l596k741
54762A71026j695n2J276J826K898N572Q633J0229J0664J1632J3386J4724J5251
54749B65370J5641J5887J5192J3621J2235J1544J1044J0179Q628O022K551n93
$$ plain form
54850 71869 69104 66319 64034 62288 61190 61079 61704 62165 62102 62075 62516 63184 63857 64533 64795 64061 62668 61593
54832 61593 60830 59306 56721 54168 52450 51071 49563 48627 49075 50508 51905 52948 54141 56043 58652
54817 58652 61132 62139 61164 59516 59070 60094 61324 62130 63264 65315 67774 70054 72168 73931 74776
54802 74776 74974 75908 78450 81970 85527 89139 93400 98738 105537 114031 123655 133412 143345 154687 168145
54787 168145 183122 199100 216564 235680 254972 272180 285820 295320 300375 300907 297212 289698 278960
54774 278960 266343 253676 241957 230878 219860 208981 198754 189731 182509 177363 173767 171026
54762 171026 169331 169279 170555 172381 175279 180851 189484 199713 210377 222009 235395 250119 265370
54749 265370 281011 296898 312090 325711 337946 349490 360534 370713 379341 385363 387914 387321
54737C87321k641m490p345j0835j3804j6110j8024j8797j7641j5503j4002j3130
54725B34999j1859j0340r502q993p706n973n156n217m841l804l215l407l604l650
54711A47732m068m430l781k665k629l496l385j810n98j115k467l218l185k788
54697A08097k144j509j337j385q95O8O80Q30J081J266O88k18j96P23J236J088
54681A08073J413K390K607J474L52L80Q92J004J152J996L100L824M382N080N547
54666A43666N510N362N212M482L121K169K310K817K730K229K094K578L448M508
54652A92236N507O200O841Q054R949J2078J4310J6873J9445K1320K2662K4423
54640C59898K6626K7777K6505K2825J7447J0803L291m337j1330j7155k1344k3816
$$ plain form
54737 387321 384680 380190 372845 362010 348206 332096 314072 295275 277634 262131 248129 234999
54725 234999 223140 212800 203298 194305 186599 180626 175470 170253 165412 161608 158393 154986 151382 147732
54711 147732 143664 139234 135453 132788 130159 126663 123278 121468 120870 119755 117288 114070 110885 108097
54697 108097 105953 104444 103107 101722 100827 100895 101575 102405 103486 104752 105440 105222 105026 105749 106985 108073
54681 108073 109486 111876 114483 115957 116309 116689 117581 118585 119737 121733 124833 128657 133039 138119 143666
54666 143666 149176 154538 159750 164232 167353 169522 171832 174649 177379 179608 181702 184280 187728 192236
54652 192236 197743 203943 210784 218838 228787 240865 255175 272048 291493 312813 335475 359898
54640 359898 386524 414301 440806 463631 481078 491881 495172 490835 479505 462350 441006 417190
54628D17190k5245k6247k6293k4506k1356j8311j5822j3135j0137p901o943o454
54616B14840n625m524l197j341N86J295L89r86j791k248k737k816k196j664k123
54601A85862l378m573n170n117m674m479n050n937o118n387m447l638k618j524
54587A23752j166j763k528k892l005k867k171j301j138j567j488p24m29j050j493
54572I8170j013m48o18r46o59j39P8M20J233J656Q76l62p88m47k95m65k34N87
54554I6606J343J508J215Q56P75J209J983K487K325J812J567J945K959M368N678
54539A28636O495O991P556Q099Q356Q692R694J1018J1678J1524J1269J0973R773
54526B50754P428M828K548J17k732n301p096q597j0129j1065j0891j0114r355
$$ plain form
54628 417190 391945 365698 339405 314899 293543 275232 259410 246275 236138 228237 221294 214840
54616 214840 209215 204691 201494 200153 200739 202034 202423 201437 199646 197398 194661 191845 189649 187985 185862
54601 185862 182484 177911 172741 167624 162950 158471 153421 147484 141366 135979 131532 127894 125276 123752
54587 123752 122586 120823 118295 115403 112398 109531 107360 106059 104921 103354 101866 101142 100713 99663 98170
54572 98170 97157 96709 96091 95145 94486 94347 94425 94845 96078 97734 98610 98248 97460 97013 96718 96253 96019 96606
54554 96606 97949 99457 100672 101528 102303 103512 105495 107982 110307 112119 113686 115631 118590 122958 128636
54539 128636 135131 142122 149678 157777 166133 174825 184519 195537 207215 218739 230008 240981 250754
54526 250754 258182 263010 265558 265675 262943 257642 250546 241949 231820 220755 209864 199750 190395
54513A90395q449p234o216n669m975l746k727k628k845k372j323o12n25n82m64
54498A40028l16l35o74j439k359k732k192j146k57J64N6m57q86p12j57L1l15o01
54480A25701m95l08j48L38J084J436J208J065J373J637J410R15L63m14j234j358
54464A32573n28N85J313J563J219M7j495k371k324k114k086j665o97rm5j51J47
54447A23962K85k59j070j683k267k784k586j604q37r45j368j536j769k239k227
54432A01073j346m05k12m39n11n43o18k32O52J166R60R17J543J918J293M44L51
54415A06011P16R33J315K043K247J547J259K425L818L650K401J982K817L686M052
54400A40902M600N570O278O322N959N283M255L349K996K611J382k87j319j636
$$ plain form
54513 190395 181946 174712 168496 162827 157852 154106 151379 148751 145906 143534 142211 141599 141074 140492 140028
54498 140028 139712 139377 138703 137264 134905 132173 129981 128835 128578 128742 128798 128341 127455 126743 126586 126617 126302 125701
54480 125701 125206 124898 124750 125088 126172 127608 128816 129881 131254 132891 134301 135216 135579 135165 133931 132573
54464 132573 132045 132630 133943 135506 136725 136772 135277 132906 130582 128468 126382 124717 124020 124011 123966 123815 123962
54447 123962 124247 123988 122918 121235 118968 116184 113598 111994 111157 110212 108844 107308 105539 103300 101073
54432 101073 99727 99322 99110 98671 98160 97617 96999 96767 97419 98585 99545 100462 102005 103923 105216 105660 106011
54415 106011 106727 107660 108975 111018 113265 114812 116071 118496 122314 125964 128365 130347 133164 136850 140902
54400 140902 145502 151072 157350 163672 169631 174914 179169 182518 185514 188125 189507 189220 187901 186265
54386A86265k032k608k753k527k676l251l488l152k870l010l275l515l883m127
54372A43098l744k913k406k375k218j726j468j698j798j233m19j66o02j022o91
54357A18619M08J554K081K089K179K481K540K212K051K483L133L399L168K678
54343A51075K204K104K525K896K456J463R38R89N61p50j960k362k592l200l567
54328A52780l261l194m099n034m836m075m002m382m067l157k794l134l138k377
54314A01230j696j832k503l019l015k558k118k261k914l284k957k414k038j430
54300F7191m52J11k44p91p90o86j019j204o59r5k88n47M3P70M25n16o79j56j83
54281F0231q54j044m63l0k49p21j203j661j551n11M47O7j113j451o81jJ39M66
$$ plain form
54386 186265 184233 181625 178872 176345 173669 170418 166930 163778 160908 157898 154623 151108 147225 143098
54372 143098 139354 136441 134035 131660 129442 127716 126248 124550 122752 121519 121100 120934 120332 119310 118619
54357 118619 119027 120581 122662 124751 126930 129411 131951 134163 136214 138697 141830 145229 148397 151075
54343 151075 153279 155383 157908 160804 163260 164723 165661 166650 167211 166461 164501 162139 159547 156347 152780
54328 152780 149519 146325 142226 137192 132356 128281 124279 119897 115830 112673 109879 106745 103607 101230
54314 101230 99534 97702 95199 92180 89165 86607 84489 82228 79314 76030 73073 70659 68621 67191
54300 67191 66739 66850 66606 65815 65025 64339 63320 62116 61457 61362 61074 60527 60570 61340 61765 61249 60570 60414 60231
54281 60231 59377 58333 57870 57840 57591 56870 55667 54006 52455 51944 52391 52458 51345 49894 49213 49212 49351 49817
54263D9817J049R63Q8m63r5N45R08J181J356J046N04N11J005J169R53J087J516
54246F3140J394P57O10J013Q31k24q84l17O95J186J213J053N57m4k1N84P96L75
54228G2714K41O55M62r80k503k808k274k006j991j445k49Q56J163M75q04j673
54212E9833j337m00l44j474k399k071j204r33j020m92O58J429J081k05j583k003
54196D7536r71P66J718J256J46o86j079j099n92J65L43k28n64MP15N83p6k66Q3
54177D7754J85l01r59j461j833j955j461k50J307K580K921J962J90j106r73R0
54161D6690O38j12j461k125j608n49J59L19L10L13J40j48n8N52J071R21L69l5
54143D5386k58m64l95J48N98K95m21o90l88j8L36R39J433J144K85j81L0K71J76
$$ plain form
54263 49817 50866 51829 51917 51454 51359 51904 52812 53993 55349 56395 56899 57410 58415 59584 60537 61624 63140
54246 63140 64534 65291 65901 66914 67745 67521 66637 66320 67015 68201 69414 70467 71024 70980 70959 71543 72339 72714
54228 72714 72955 73610 74072 73092 70589 67781 65507 63501 61510 60065 59816 60672 61835 62310 61506 59833
54212 59833 58496 58096 57752 56278 53879 51808 50604 49671 48651 48159 48817 50246 51327 51122 49539 47536
54196 47536 46565 47331 49049 50305 50451 49765 48686 47587 46995 47160 47503 47275 46711 46715 47430 48013 47937 47671 47754
54177 47754 47939 47638 46679 45218 43385 41430 39969 39719 41026 43606 46527 48489 48679 47573 46600 46690
54161 46690 47328 47216 45755 43630 42022 41473 41632 41951 42261 42574 42714 42566 42508 43060 44131 45052 45421 45386
54143 45386 45128 44664 44269 44417 45015 45310 44889 44199 43811 43793 44129 45068 46501 47645 47930 47749 47779 48050 48226
54124D8226J53M36O80O46N02L03j0q9M59J169J122L04m38p15q33p29N1J142J440
54105E3819P17M2J94P51J095J275J394J158N06p5k83k09K36J168J879J346j81
54088F4832j222j076n25k63K4M83L48p54j909k119j469m64P64J868K015J072J40
54071F1745P6L24M7m43l82R1K47l3k53j08L36Q46J010N12k41m51j26r6n17m75
54051F2109M15J193J055O26P76J224J251R63Q35P05L00L2L32P39O46L84O10J133
54033G5328J331J264J387J522J173N63M23Q67J325J518J736K235K945L736M545
54018A01898N228N652N755N417M589L693L387L692L996M058M289M665M436L380
54004A64135K448K440K822K671K038J481R37nj083j653j667j617j720j883k166
$$ plain form
54124 48226 48379 48815 49495 50141 50643 50946 50936 50847 51306 52475 53597 53901 53463 52748 51915 51186 51237 52379 53819
54105 53819 54536 54578 54772 55523 56618 57893 59287 60445 60951 60876 60593 60384 60620 61788 63667 65013 64832
54088 64832 63610 62534 62009 61746 61770 62253 62601 61847 59938 57819 56350 55886 56650 58518 60533 61605 61745
54071 61745 61821 62145 62192 61749 61367 61458 61705 61672 61419 61311 61647 62493 63503 64015 63774 63323 63197 63101 62584 62109
54051 62109 62524 63717 64772 65398 66174 67398 68649 69612 70447 71152 71452 71484 71816 72555 73201 73585 74195 75328
54033 75328 76659 77923 79310 80832 82005 82568 82991 83858 85183 86701 88437 90672 93617 97353 101898
54018 101898 107126 112778 118533 123950 128539 132232 135619 139311 143307 147365 151654 156319 160755 164135
54004 164135 166583 169023 171845 174516 176554 178035 178972 178967 177884 176231 174564 172947 171227 169344 167178
53989A67178k680l192l370l212k845k318j876j994k678l277l353l237l231l031
53975A26884k387j698j357j151q91r27j410j729j421j023j234j745j712r79p6
53960A07144N37O74K75l37n87m69o29j182j278n19J22k57r58p01M98J590K160
53943A06083K548K714K182J129M09M42Q65J313J860K587L322L841M034L976M059
53928A41364M696N656O235O340O736P714Q367P838O532N317M200K745J176Q5n55
53913B14446j204j908k482l078l738l815k743j063J86Q14J405K158K705K830K679
53898B07192K459K493L250M712O112O846P166P402P162O074M631L495K509J328
53884B72831L70J22P8n50j499j966k066k533l328l711l544l465l793m248m703
$$ plain form
53989 167178 164498 161306 157936 154724 151879 149561 147685 145691 143013 139736 136383 133146 129915 126884
53975 126884 124497 122799 121442 120291 119400 118473 117063 115334 113913 112890 111656 109911 108199 107220 107144
53960 107144 107681 108355 108630 108293 107706 107237 106608 105426 104148 103629 103751 103494 102536 101835 102333 103923 106083
53943 106083 108631 111345 113527 114656 115065 115507 116372 117685 119545 122132 125454 129295 133329 137305 141364
53928 141364 146060 151716 157951 164291 171027 178741 187108 194946 201478 206795 210995 213740 214916 215001 214446
53913 214446 213242 211334 208852 205774 202036 198221 195478 194415 194601 195415 196820 198978 201683 204513 207192
53898 207192 209651 212144 215394 220106 226218 233064 240230 247632 254794 260868 265499 268994 271503 272831
53884 272831 273201 273323 273401 272851 271352 269386 267320 264787 261459 257748 254204 250739 246946 242698 237995
53869B37995n252n624n373m636l970l593l433l624m196m621m498m277m489m651
53855A75758l984k857k375k776l307l507l587l593l252k647k181j962j908k229
53841A35593k986l508l151k332j932k051k262k557k945k651j107O39R81L5o20
53826A09146l56j00m53p49m19J05L03K50N8m02p89m21O45J483J518R84Q9j119
53808A09773j936j379J87J061M18n46l88O81J400J231P26N46Q83J511K034K221
53792A18423K288K541K834K829K696K908L388L636L687M138N020N540N172M341
53778A69441L710L457L446L515L433L010K466K139J879J337P37O46R77R91L50
53763B01534n41j320j996k478k577k550k918l622m082m095l986l818l341k717
$$ plain form
53869 237995 232743 227119 221746 217110 213140 209547 206114 202490 198294 193673 189175 184898 180409 175758
53855 175758 171774 168917 166542 163766 160459 156952 153365 149772 146520 143873 141692 139730 137822 135593
53841 135593 132607 129099 125948 123616 121684 119633 117371 114814 111869 109218 108111 108750 109731 109766 109146
53826 109146 108790 108690 108237 107488 107069 107174 107477 107727 107785 107383 106594 106173 106818 108301 109819 110803 110892 109773
53808 109773 107837 106458 106645 107706 108124 107578 107190 107871 109271 110502 111228 111774 112657 114168 116202 118423
53792 118423 120711 123252 126086 128915 131611 134519 137907 141543 145230 149368 154388 159928 165100 169441
53778 169441 173151 176608 180054 183569 187002 190012 192478 194617 196496 197833 198570 199216 200193 201184 201534
53763 201534 200993 199673 197677 195199 192622 190072 187154 183532 179450 175355 171369 167551 164210 161493
53749A61493k474k592k496k021j627j512j393j193j161j205r47n25m62p23p62
53734A40400o08q85j616k036j776j312j045q87r51j578k410k463j527n35k13k70
53718A20288k81l52n40n26l32m50r09j047o22k44k74k38K36P61R09P70L87m12
53700A17124j223j080J88J513K019J972J833J420P00L99R42J606J570J086P91
53685A30860N93J19l03r8N78J127J439J762J998J842J422J141J095J131J259J521
53669A47486J700J557J188Q64P35Q82J340J835J905J430P13Oo03q19l61L81O46
53652A60885M02L66P29P52j7r69j352j179p51o5O96Q24q1j420k258k298j817j126
53634A51321m56N0M84R32J064N70m1K2N00L49n39j074p68m21m64q6J116J949J292
$$ plain form
53749 161493 159019 156427 153931 151910 150283 148771 147378 146185 145024 143819 142872 142347 141885 141162 140400
53734 140400 139792 138907 137291 135255 133479 132167 131122 130235 129284 127706 125296 122833 121306 120771 120558 120288
53718 120288 120007 119655 119115 118589 118257 117807 116898 115851 115229 114985 114711 114473 114709 115470 116379 117149 117536 117124
53700 117124 115901 114821 115009 116522 118541 120513 122346 123766 124466 124865 125807 127413 128983 130069 130860
53685 130860 131453 131572 131269 131171 131749 132876 134315 136077 138075 139917 141339 142480 143575 144706 145965 147486
53669 147486 149186 150743 151931 152795 153530 154412 155752 157587 159492 160922 161635 161641 161038 160219 159858 160239 160885
53652 160885 161287 161653 162382 163134 163117 162148 160796 159617 158866 158801 159497 160321 160240 158820 156562 154264 152447 151321
53634 151321 150865 150915 151399 152331 153395 153965 153924 153946 154446 154795 154256 153182 152414 151993 151529 151443 152559 154508 155800
53615A55800o7n43O6P79J158J543J943J951J630J501J685J867K013K436L201M007
53599A80970M478M309L483K686K840L803M244L443K413K429L208L537L154K797
53585B27794K820K859K777K864L086L007K536K084J934K040K374K900L252L015
53571B65342K308J676J423J414J410J233P68J15m10o62p62o57j37M80L34p97j925
53554B71153j991j088j3Q41J502J816J584R85K81n56j378j567q74n6N1k62p7P26
53536B71077J430J633J619J627J546J359J344J666K125K364K163J740J796K817
53522B96306M213M728M114L631M423O036P190P463P444P665Q179Q850R459R761
53508C89462R948J0556J1551J2148J2086J2368J3792J5594J6526J6735J7345J8622
$$ plain form
53615 155800 155733 155190 155256 156035 157193 158736 160679 162630 164260 165761 167446 169313 171326 173762 176963 180970
53599 180970 185448 189757 193240 195926 198766 202569 206813 210256 212669 215098 218306 221843 224997 227794
53585 227794 230614 233473 236250 239114 242200 245207 247743 249827 251761 253801 256175 259075 262327 265342
53571 265342 267650 269326 270749 272163 273573 274806 275574 275689 275279 274617 273855 273198 273061 273541 273875 273078 271153
53554 271153 269162 268074 268061 268902 270404 272220 273804 274789 275070 274514 273136 271569 270695 270639 270690 270428 270351 271077
53536 271077 272507 274140 275759 277386 278932 280291 281635 283301 285426 287790 289953 291693 293489 296306
53522 296306 300519 305247 309361 312992 317415 323451 330641 338104 345548 353213 361392 370242 379701 389462
53508 389462 399410 409966 421517 433665 445751 458119 471911 487505 504031 520766 538111 556733
53496E56733J9806K0611K1551K2700K3342K3203K3077K3759K4967K5780K5694
53485H11223K5061K4656K4975K5761K6310K6315K6189K6320K6522K6600K6898
53474A096830K7747K8771K9368K9472K9310K8824K8007K7314K7028K6546K5093
53463A404310K2850K0640J8765J6943J5047J3143J1021Q590O529N733O127O764
53451A556462O983O742O002M514K327j83k755n328p815j0286j3075j6208j9005
53438A508375k0844k1928k2782k3467k3979k4790k6093k7050k6894k6317k6567
53427A237664k7518k7920k7435k6966k6906k6497k5309k4095k3553k3201k2178
53416I56086k0411j8461j6710j5187j3782j2227j0204p663m805j735J463M406
$$ plain form
53496 556733 576539 597150 618701 641401 664743 687946 711023 734782 759749 785529 811223
53485 811223 836284 860940 885915 911676 937986 964301 990490 1016810 1043332 1069932 1096830
53474 1096830 1124577 1153348 1182716 1212188 1241498 1270322 1298329 1325643 1352671 1379217 1404310
53463 1404310 1427160 1447800 1466565 1483508 1498555 1511698 1522719 1531309 1537838 1543571 1549698 1556462
53451 1556462 1563445 1570187 1576189 1580703 1583030 1582847 1580092 1574764 1566949 1556663 1543588 1527380 1508375
53438 1508375 1487531 1465603 1442821 1419354 1395375 1370585 1344492 1317442 1290548 1264231 1237664
53427 1237664 1210146 1182226 1154791 1127825 1100919 1074422 1049113 1025018 1001465 978264 956086
53416 956086 935675 917214 900504 885317 871535 859308 849104 841441 836636 834901 836364 840770
53404H40770O713Q650J0883J3467J5748J7357J8791K0773K3433K6276K8684L0315
53392A061860L1309L2112L3035L4171L5744L8055M0740M2776M3837M5014M7402
53381A486055N0516N3020N4600N6056N7793N9401O0672O1917O3202O4136O4648
53370B132016O5086O5500O5552O5173O4563O3585O1961O0007N8210N6144N2837
53359B810634M8321M3781L9903L6086L1653K6905K2490J8539J4899J1638Q749
53348C113598N824K434j437n586r905j4436j9501k5698l3289m1642m9771n7290
53336B863301o4227p0090p4049p6091p7139p7779p7672p6427p4438p2508p1133
53325B051748p0287o9535o8336o6673o5256o4568o4023o2727o0776n8875n6923
$$ plain form
53404 840770 847483 856133 867016 880483 896231 913588 932379 953152 976585 1002861 1031545 1061860
53392 1061860 1093169 1125281 1158316 1192487 1228231 1266286 1307026 1349802 1393639 1438653 1486055
53381 1486055 1536571 1589591 1644191 1700247 1758040 1817441 1878113 1940030 2003232 2067368 2132016
53370 2132016 2197102 2262602 2328154 2393327 2457890 2521475 2583436 2643443 2701653 2757797 2810634
53359 2810634 2858955 2902736 2942639 2978725 3010378 3037283 3059773 3078312 3093211 3104849 3113598
53348 3113598 3119422 3121856 3120419 3114833 3104928 3090492 3070991 3045293 3012004 2970362 2920591 2863301
53336 2863301 2799074 2728984 2654935 2578844 2501705 2423926 2346254 2269827 2195389 2122881 2051748
53325 2051748 1981461 1911926 1843590 1776917 1711661 1647093 1583070 1520343 1459567 1400692 1343769
53314A343769n4116n0437m6855m3868m0884l7333l3459k9655k6037k2808k0243
53303I38074j7957j5111j1650q401n739l149m18J844L361M743O328P471P806Q233
53289I15435R699J1662J2763J2670J2396J3069J4986J7657K0200K1910K2878K3894
53277A109219K5501K7416K9100L0426L1492L2194L2385L2168L1717L1102L0383
53266A443103K9669K8871K7761K6337K4795K3177K1437J9816J8577J7480J6080
53255A697103J4505J3236J2177J0703Q608O267L884J368j069l170n470q874j3259
53242A736009j7510k1136k4709k8497l1878l4522l7026l9779m2244m3952m5133
53231A369623m5868m5659m4509m3314m2494m1225l8948l6507l4869l3743l2498
$$ plain form
53314 1343769 1289653 1239216 1192361 1148493 1107609 1070276 1036817 1007162 981125 958317 938074
53303 938074 920117 905006 893356 884955 879216 876067 875649 877493 880854 885597 891925 899396 907202 915435
53289 915435 925134 936796 949559 962229 974625 987694 1002680 1020337 1040537 1062447 1085325 1109219
53277 1109219 1134720 1162136 1191236 1221662 1253154 1285348 1317733 1349901 1381618 1412720 1443103
53266 1443103 1472772 1501643 1529404 1555741 1580536 1603713 1625150 1644966 1663543 1681023 1697103
53255 1697103 1711608 1724844 1737021 1747724 1756332 1762599 1766483 1767851 1766782 1763612 1758142 1749268 1736009
53242 1736009 1718499 1697363 1672654 1644157 1612279 1577757 1540731 1500952 1458708 1414756 1369623
53231 1369623 1323755 1278096 1233587 1190273 1147779 1106554 1067606 1031099 996230 962487 929989
53220I29989l1574l1738l2569l2963l2656l2134l1471l0390k9172k8369k7745
53209E89208k6496k4445k2209k0265j8585j7082j5730j4317j2714j1201j0065
53198C96099r099q032p132o773o824p027p581q542r100q426p049o358o741p140
53184B90275o616n550m922n056n479n638n355m823m409m414m817n195n011m103
53170B18887l001k554l034l768l950l619l366l358l292l136l139l115k619j917
53156A75019j833k447k864k588k106j839j505j082j204j985k520k268j858j714
53142A47206j039O64K181K071Q13KO1J87J23L84Q49P02j14o51l91J91O55J157
53124A55051J715J981J976K217K792L117K932K762L064L573L871M065M424M794
$$ plain form
53220 929989 898415 866677 834108 801145 768489 736355 704884 674494 645322 616953 589208
53209 589208 562712 538267 516058 495793 477208 460126 444396 430079 417365 406164 396099
53198 396099 387000 378968 371836 365063 358239 351212 343631 335089 325989 317563 310514 304156 297415 290275
53184 290275 283659 278109 273187 268131 262652 257014 251659 246836 242427 238013 233196 228001 222990 218887
53170 218887 215886 213332 210298 206530 202580 198961 195595 192237 188945 185809 182670 179555 176936 175019
53156 175019 173186 170739 167875 165287 163181 161342 159837 158755 157551 155566 153046 150778 148920 147206
53142 147206 146167 146831 149012 151083 151896 151898 151959 152146 152269 152653 153502 154204 154090 153439 153048 153239 153894 155051
53124 155051 156766 158747 160723 162940 165732 168849 171781 174543 177607 181180 185051 189116 193540 198334
53110A98334M679L747K086K18j162j726j833k098k776l752m821n590n466m358
53096A75482l133k743l004k985k454k221k953m243n099m915l885k789k364k590
53082A30104k715k238j614j541j880j913j418q06l78j48k76q84j466j303n19m8
53066A10957l35q40j021r90r17m84M71J291J174K36o02p77o43p74j129j169p22
53049A03726k75k81m73l46j09m90j495k089j522l76K29j0n83j077j389j344q71
53032I1225m22n73j206j634j497j014m41J24M06Q3o87j333j541j488j340j000
53016G7662m84j44l02q67j451j713j589j183n59L35J368J973J622N18n53j102
53000G3531j220r84l02M94O87J72l22l49k66k17L35J391J820R58r6M7J006J410
$$ plain form
53110 198334 203013 206760 208846 209064 207902 206176 204343 202245 199469 195717 190896 185306 179840 175482
53096 175482 172349 169606 166602 163617 161163 158942 155989 151746 146647 141732 137847 135058 132694 130104
53082 130104 127389 125151 123537 121996 120116 118203 116785 115979 115601 115453 115177 114293 112827 111524 111005 110957
53066 110957 110622 109782 108761 107771 106854 106370 106841 108132 109306 109542 108940 108163 107520 106746 105617 104448 103726
53049 103726 103451 103170 102697 102351 102242 101752 100257 98168 96646 96270 96499 96489 95906 94829 93440 92096 91225
53032 91225 90803 90230 89024 87390 85893 84879 84438 84562 84968 85051 84364 83031 81490 80002 78662 77662
53016 77662 77178 77034 76732 75865 74414 72701 71112 69929 69370 69705 71073 73046 74668 75186 74633 73531
53000 73531 72311 71327 71025 71519 72206 72378 72056 71707 71441 71224 71559 72950 74770 75728 75632 75679 76685 78095
52982G8095J074R99J486J796J551J230J131J029R73J306J867K188K473L298M356
52967A04852M683M210L825L748L159J725K86m44p49r69q76n35o96j599k396k377
52951A15847k027k083k484k899l447m036l863k565j167q56j317j409j051j241
52937H5402k279l200l186k632k307k205j740p51J80M25Lm85n52l09k31n86j136
52920F4411j433j182m37L95Q09O81L75K01l6o60j457j864j713j296p94j50M71
52903E6321P09N50L23J63p8k86j22K87L34j94p74r27q44q90j008r08n26jN30R31
52883E3590J106J106R64M75m11j161j178o60k81q2M30J030P76m25j286q79Q4M34
52865E3632K46L58Q32R81O91O36J139J642J505P92J31R5P84J722K268K307K397
$$ plain form
52982 78095 79169 80168 81654 83450 85001 86231 87362 88391 89364 90670 92537 94725 97198 100496 104852
52967 104852 109535 113745 117570 121318 124477 126202 126488 126044 125295 124326 123450 122915 122219 120620 118224 115847
52951 115847 113820 111737 109253 106354 102907 98871 95008 92443 91276 90420 89103 87694 86643 85402
52937 85402 83123 79923 76737 74105 71798 69593 67853 67102 67282 67707 67710 67225 66673 66364 66133 65547 64411
52920 64411 62978 61796 61359 61754 62563 63244 63619 63820 63784 63124 61667 59803 58090 56794 56000 55850 56321
52903 56321 57030 57580 57903 58066 57988 57702 57580 57867 58201 58007 57233 56306 55462 54572 53564 52656 52130 52129 52659 53590
52883 53590 54696 55802 56766 57241 56830 55669 54491 53831 53550 53468 53898 54928 55704 55279 53993 53114 53198 53632
52865 53632 53878 54236 55068 56049 56740 57376 58515 60157 61662 62454 62585 62680 63464 65186 67454 69761 72158
52848G2158K914L467L509L192L095L282L257K780K106J474Q81M19L22M80M06j62
52832A03580q77j193r62m76j78l38q37j152p99N8O74N04l02j265k156k971l564
52815H7746l699l435l091k772k286j615j144j132j244j016n60l18k44K08J208
52800F6606K164K413J842O64r15k476l314l041k028r58k37j9l27p44n25M87J413
52783F1005J364N09l64q30q09j30R76J410L10j559k537k041q89J24R08J310R91
52766E9748L63M85J530K390K227J516R91N61q7n95n23j54M8K11N07M65l04j115
52748F8264r73m6M99Q7o72j073j127j115r96o39j96M7K5q7o7K36P96J273J203
52729F5439M58n33j067p44J69R01P72k32j392j903j575r11m62k31P7M27L83n8
$$ plain form
52848 72158 75072 78539 82048 85240 88335 91617 94874 97654 99760 101234 102115 102534 102856 103336 103742 103580
52832 103580 102703 101510 100548 100072 99894 99556 98719 97567 96768 96826 97500 98004 97702 96437 94281 91310 87746
52815 87746 84047 80612 77521 74749 72463 70848 69704 68572 67328 66312 65752 65434 65190 65398 66606
52800 66606 68770 71183 73025 73689 72774 70298 66984 63943 61915 60957 60720 60701 60374 59630 59105 59592 61005
52783 61005 62369 62878 62514 61684 60875 60745 61721 63131 63441 61882 59345 57304 56415 56539 57447 58757 59748
52766 59748 60111 60596 62126 64516 66743 68259 69250 69811 69724 69129 68606 68452 68500 68711 69218 69683 69379 68264
52748 68264 67291 67245 67744 67831 67159 66086 64959 63844 62848 62209 62013 62060 62085 61998 61931 62167 62963 64236 65439
52729 65439 65897 65364 64297 63553 63722 64623 65395 65163 63771 61868 60293 59382 58920 58689 58766 59193 59576 59518
52711E9518j33O85J650J548N27J64J360L113M048M229M560N093N151M743M557
52696A00813M659M302L238K101J331O24k67j083j777k723l875m404l760k453j413
52681I5313j009j090j393j575j331q83q68j466k080k217k133k315k753l059k929
52666F8212k207r09N21J319J030j36j589k637k690j727n85j50k82j90K27L34K2
52649E8563o4K48K41m01r08n92R6L31K0m10o91o79k50K91L46m6j03M19P18K77
52629E7406j96Q5O98P68L60J84L95N90P00R71J325J451J355J196Q73K59l66p13
52611F7341r79j406j739j607j188r10p99n97k77kK08L41K61l1k60l19l81m30k50
52592E6976J1o2k68J17R96J227K70r02j207q26m04J06Q52J282J015P24J046J381
$$ plain form
52711 59518 59385 60070 61720 63268 63795 63959 65319 68432 72480 76709 81269 86362 91513 96256 100813
52696 100813 105472 109774 113012 115113 116444 117068 116801 115718 113941 111218 107343 102939 99179 96726 95313
52681 95313 94304 93214 91821 90246 88915 88032 87164 85698 83618 81401 79268 76953 74200 71141 68212
52666 68212 66005 65096 65617 66936 67966 67830 66241 63604 60914 59187 58602 58452 58170 57980 58207 58541 58563
52649 58563 58499 58747 58988 58587 57679 57087 57183 57514 57534 57124 56433 55754 55504 55795 56141 56095 55992 56411 57129 57406
52629 57406 57210 57295 57993 58761 59121 59305 59700 60290 60990 61961 63286 64737 66092 67288 68161 68420 68054 67341
52611 67341 66362 64956 63217 61610 60422 59512 58713 58116 57839 57837 58045 58386 58647 58616 58356 58037 57656 57226 56976
52592 56976 56987 56925 56657 56774 57770 58997 59267 58365 57158 56332 55928 56034 56886 58168 59183 59907 60953 62334
52574F2334R55L65P03J660J906J062l3p08r47p28r1L30L3k80L49J383J348N4j042
52555F8653r11l9P27J238J596J710J680J787J842J410P06M06M37P4o49p75n9M26
52537H0259j13r25q73n3N65N80M86P20J126J319J257J176J158Q76N4q87j100m36
52519H5189K34K57J02M17Q65P53L01K31M36K53j55P8R99J601J256M05l19o51l57
52500I1895O21J463J081l00j194q04J00N13L77k2p14j467j508n15Q05J618J798
52483I3747J432M42p50j125l52M83K58o79j173r02n13n29q70j251j349p70N11
52466H6610J713J836P18p65j580j392o83j85j84k72ON42R11J055J206J278J012
52449I1826O20N31N30n2j066j428n87O44J210R65L37m49j209j515j189o05o3N94
$$ plain form
52574 62334 63289 63654 64357 66017 67923 68985 68952 68244 67297 66569 66478 66808 66841 66561 66910 68293 69641 69695 68653
52555 68653 67742 67703 68430 69668 71264 72974 74654 76441 78283 79693 80399 80805 81242 81316 80667 79892 79833 80259
52537 80259 80146 79221 78348 78295 78860 79440 79926 80646 81772 83091 84348 85524 86682 87558 87612 86725 85625 85189
52519 85189 85423 85680 85782 86199 87064 87817 88118 88349 88785 89038 88883 88961 89960 91561 92817 93222 92903 92252 91895
52500 91895 92516 93979 95060 94760 93566 92762 92862 93375 93752 93730 93016 91549 90041 89526 90331 91949 93747
52483 93747 95179 95621 94871 93746 93394 93877 94135 93456 92283 91381 90868 90339 89469 88218 86869 86099 86610
52466 86610 88323 90159 90877 90112 88532 87140 86457 86272 86088 85816 85822 86364 87275 88330 89536 90814 91826
52449 91826 92446 92977 93507 93455 92389 90961 90374 91018 92228 93193 93530 93081 91872 90357 89168 88563 88500 89094
52431H9094J288J296K16j184j786j462r05n01k2O79J263J270O43j08k31M39J059
52414I1048P35r2q6R38J501N56r08j283n68j8j73m61n46p38j077j088o75l53l20
52395H6392j00N32J002P62Q2m11n12l65MO19J240J531J465J191P13L4n29n63j96
52376I2891k1k46l09K98J161J413R77O92J055J496J281O07K06K46K96K14L41P76
52358A03374J062Q48L89K39O52J404J906J665Q95M95R83J699J699J175J135J758
52342A21378K033J300K03l54m00m54o16o38n14l82k54k46o83j439j707r87K1J98
52324A16459n52j312j414j044n96q8N25R34P20m7p94j056r90j075j353j271m12
52307A06634Q33J635J594R05K3n18k52P02J463J380R80J229K058K588K605K739
$$ plain form
52431 89094 90382 91678 91894 90710 88924 87462 86557 86056 86034 86713 87976 89246 89889 89781 89550 89989 91048
52414 91048 91783 91691 91605 92543 94044 94600 93692 92409 91841 91823 91650 91189 90643 89905 88828 87740 87065 86712 86392
52395 86392 86292 86824 87826 88588 88670 88259 87747 87382 87386 88005 89245 90776 92241 93432 94145 94179 93650 93087 92891
52376 92891 92870 92624 92315 92613 93774 95187 96164 96856 97911 99407 100688 101295 101501 101747 102043 102257 102598 103374
52358 103374 104436 105284 105673 105912 106564 107968 109874 111539 112434 112929 113912 115611 117310 118485 119620 121378
52342 121378 123411 124711 124914 124560 124160 123706 123090 122452 121938 121556 121302 121056 120373 118934 117227 116240 116261 116459
52324 116459 115907 114595 113181 112137 111541 111453 111978 112912 113632 113585 112791 111735 110745 109670 108317 107046 106634
52307 106634 107467 109102 110696 111601 111624 111106 110854 111556 113019 114399 115379 116608 118666 121254 123859 126598
52291A26598L094K878J835R64J177K079K681K577J898R13K85Q98K679M286M659
52276A59501M249L995L915L520K977K726K519J889J212J199J620J623J173J036
52262A93154J392J575J377J446K107K664K408J545P01O8l91m30J91J074J488J232
52246B11601Q83R90J383J460J018M96L39N45J039K008L343M150L684K652K553
52231B38144L581M194L253J560O07P01J176J751K552L284L441L119K733K173J134
52216B73403R5q8N81J265J525J683J945K087K137K401K678K299J294P14J275K381
52200B97675K936K711K352K414K828L234L472L681M044M417M421M007L631L601
52186C45424L537L033K525K805L704M160L715L193L465M221M490M018L448L312
$$ plain form
52291 126598 129692 132570 134405 135369 136546 138625 141306 143883 145781 146694 146979 147877 150556 154842 159501
52276 159501 163750 167745 171660 175180 178157 180883 183402 185291 186503 187702 189322 190945 192118 193154
52262 193154 194546 196121 197498 198944 201051 203715 206123 207668 208369 208437 208046 207616 207807 208881 210369 211601
52246 211601 212484 213474 214857 216317 217335 217831 218170 218715 219754 221762 225105 229255 232939 235591 238144
52231 238144 241725 245919 249172 250732 251339 252040 253216 254967 257519 260803 264244 267363 270096 272269 273403
52216 273403 273498 273410 273991 275256 276781 278464 280409 282496 284633 287034 289712 292011 293305 294019 295294 297675
52200 297675 300611 303322 305674 308088 310916 314150 317622 321303 325347 329764 334185 338192 341823 345424
52186 345424 348961 351994 354519 357324 361028 365188 368903 372096 375561 379782 384272 388290 391738 395050
52172C95050L370L095K489K142K520L270L517K846J771J106J120J532J996K203
52158D28027J828R19J94L26R49R69J6j052j269p29k48l20p57j174j401j463j429
52141D23386j350j306j414j770k243k533k461k173j871j540j131q50r85j493k013
52126C98253k255k170j880j612j613j893k162k261k384k629k636k116j492j407
52112C69743j749j785j285r11j261k077k693k854k762k587k330k006j733j562
52098C42148j418j240j115j219j602k029k156j839j150j90Q32J397J087L06K7
52083C31839N73J173J154R72J383K124K264J637J065J199J884K741L640M436M802
52068C62886M634M102L342K471J937K162K757K736J784P25L77N31N00K22K72R23
$$ plain form
52172 395050 398420 401515 404004 406146 408666 411936 415453 418299 420070 421176 422296 423828 425824 428027
52158 428027 429855 430774 430968 431294 432243 433212 433228 432176 430907 430178 429930 429610 428853 427679 426278 424815 423386
52141 423386 422036 420730 419316 417546 415303 412770 410309 408136 406265 404725 403594 402744 401759 400266 398253
52126 398253 395998 393828 391948 390336 388723 386830 384668 382407 380023 377394 374758 372642 371150 369743
52112 369743 367994 366209 364924 364013 362752 360675 357982 355128 352366 349779 347449 345443 343710 342148
52098 342148 340730 339490 338375 337156 335554 333525 331369 329530 328380 328190 329022 330419 331506 331812 331839
52083 331839 332412 333585 334739 335711 337094 339218 341482 343119 344184 345383 347267 350008 353648 358084 362886
52068 362886 367520 371622 374964 377435 379372 381534 384291 387027 388811 389536 389913 390444 390944 391166 391438 392361
52052C92361J703J885J226K30k71J54J144J980K311K266K018J640J379J556K105
52037D13687K563K676K654K701K632K169J310K40p37j127m91Q40J711J280K1q37
52021D31292q47p86j440k427k746k244j956k695l854m171l421k635k559k720k362
52006C94429j636j215j211j192j042j040j191j131p57l78j62L5K53L42L69N90
51990C85063R45J060Q08L99j63j141k427l393l685l677l837m101m214m329m784
51975C52524n496o021o202o336o696p115p221o978o859p327q193q688q280p276
51961B53836o473o393o999p884q446q185p195o251n952o043n871n333m846m582
51947A63383m361m165m175m212l856l127k545k323k141j876j891k329k669k434
$$ plain form
52052 392361 394064 395949 397175 397405 397134 397288 398432 400412 402723 404989 407007 408647 410026 411582 413687
52037 413687 416250 418926 421580 424281 426913 429082 430392 430632 429895 428768 428277 429117 430828 432108 432129 431292
52021 431292 430445 429659 428219 425792 423046 420802 418846 416151 412297 408126 404705 402070 399511 396791 394429
52006 394429 392793 391578 390367 389175 388133 387093 385902 384771 384014 383636 383474 383509 383762 384104 384473 385063
51990 385063 386008 387068 387876 388275 388112 386971 384544 381151 377466 373789 369952 365851 361637 357308 352524
51975 352524 347028 341007 334805 328469 321773 314658 307437 300459 293600 286273 278080 269392 261112 253836
51961 253836 247363 240970 233971 226087 217641 209456 202261 196010 190058 184015 178144 172811 167965 163383
51947 163383 159022 154857 150682 146470 142614 139487 136942 134619 132478 130602 128711 126382 123713 121279
51933A21279j870j541j545j559j406j218j142j183j291j338j151o75p0M35P11
51918A06436P89P86P85O79K31n33j214j452j295r47m26K01N93N70M92O38N53k77
51900A06609j333j540p80q0j10l85l14j57m08q32p61r3N60N79k6o13n00K37O06
51881A00659k39j822k756k324j093Q1R07J333J151M49j71k97k57n05q62q13k53
51864I3188M78J041J296J254J140J208J292Q86j37j176j537j073j44P09R36L47
51848I9708n00p81m02o2j28j89Q4L85M35N10P93R52Q73J096J794K012R27p35j469
51829A05303r47j91L5O4M68J208J819J856J092k06j134q58M14J608J959J599J053
51812A15142P01P67J226J638J559J243J401K115K590K279J681J537J780J833J694
$$ plain form
51933 121279 119409 117868 116323 114764 113358 112140 110998 109815 108524 107186 106035 105360 105290 105725 106436
51918 106436 107225 108011 108796 109475 109706 109173 107959 106507 105212 104265 103839 104040 104633 105203 105695 106333 106886 106609
51900 106609 105276 103736 102956 102876 102766 102381 102067 101910 101502 100670 99909 99816 100376 100955 100929 100316 99816 100053 100659
51881 100659 100420 98598 95842 93518 92425 92506 93413 94746 95897 96346 96175 95878 95621 95116 94254 93441 93188
51864 93188 93666 94707 96003 97257 98397 99605 100897 101783 101646 100470 98933 97860 97716 98425 99361 99708
51848 99708 99208 98427 98025 97963 97835 97646 97730 98115 98550 99060 99853 100805 101678 102774 104568 106580 107507 106772 105303
51829 105303 104356 104165 104200 104264 104732 105940 107759 109615 110707 110501 109367 108509 108923 110531 112490 114089 115142
51812 115142 115843 116610 117836 119474 121033 122276 123677 125792 128382 130661 132342 133879 135659 137492 139186
51797A39186J948K733L366L314L034L364M302M975M785M117L731L915M517N358
51783A92645O204O606O390O092O331O766O308M495K019j95j917l390m727n864
51769B27763o639o695n743m208l130l052l453l563l266k825k269j649j322j387
51755A78562j231m23L50R9r12j390q04l6k3n97j043j093q87m81l1m3p84j623j642
51736A65968q14k8J19n4r1j97p86j632k126k178k209k249j790p48J12J29l47n47
51718A50532l31j32j67l24n12o04j80R34K106K530K295K122K191K073J728J633
51702A65894J767J470N80j29n0M30O67N56K55k37p59r18p76r87j814k624k851
51685A60474k810l015l349l455l400l273k778j830j095j115j449j298n88L05J279
$$ plain form
51797 139186 141134 143867 147233 150547 153581 156945 161247 166222 171007 175124 178855 182770 187287 192645
51783 192645 198849 205455 211845 217937 224268 231034 237342 241837 243856 243661 241744 238354 233627 227763
51769 227763 221124 214429 208686 204478 201348 198296 194843 191280 188014 185189 182920 181271 179949 178562
51755 178562 177331 176908 177258 177357 176445 175055 174251 174215 174192 173595 172552 171459 170572 170091 170060 170017 169233 167610 165968
51736 165968 165154 165126 165245 165191 165100 164903 164117 162485 160359 158181 155972 153723 151933 151185 151297 151426 151079 150532
51718 150532 150201 150069 149902 149578 149066 148462 148282 149216 151322 153852 156147 158269 160460 162533 164261 165894
51702 165894 167661 169131 169711 169582 169532 169962 170629 171185 171440 171203 170444 169526 168750 167763 165949 163325 160474
51685 160474 157664 154649 151300 147845 144445 141172 138394 136564 135469 134354 132905 131607 131019 131324 132603
51670A32603K171K244J061n06j145q28o45j103j643j792j798j849j666j142o95
51655A23267o14o48n14k80%M67J062J432J584K069L200M405M874M488L715K840
51639A51347J731L67r06j797k450l085l485l219k421j804j751j854j712j638j944
51624A25379k018j101K54O27k91j298j506j352j331j022j02P10Q04P86J374J936
51608A21849J462L47j12L52Q38Q92R66J269J370J062O17J14o12j251j208n87j02
51591A27266M3K36M02l0q94j121k49Q56J267J152J107J111Q92P21J087J874K480
51574A38200K551K183J608J073R00J152J416J139K57o70j059q88o87q38j048p66
51558A44523o0M02L12R4Pl87j314k018j724q85n06n89l80J38J61m65q88o00q1
$$ plain form
51670 132603 134774 137018 138079 137573 136428 135600 134955 133852 132209 130417 128619 126770 125104 123962 123267
51655 123267 122653 122005 121491 121211 121211 121678 122740 124172 125756 127825 131025 135430 140304 144792 148507 151347
51639 151347 153078 153445 152539 150742 148292 145207 141722 138503 136082 134278 132527 130673 128961 127323 125379
51624 125379 123361 122260 122514 123141 122850 121552 120046 118694 117363 116341 116239 116949 117753 118539 119913 121849
51608 121849 123311 123658 123546 123898 124736 125628 126594 127863 129233 130295 130912 131026 130414 129163 127955 127368 127266
51591 127266 127309 127545 127947 127917 127023 125902 125653 126509 127776 128928 130035 131146 132038 132759 133846 135720 138200
51574 138200 140751 142934 144542 145615 146515 147667 149083 150222 150479 149809 148750 147862 147175 146337 145289 144523
51558 144523 144463 144865 145177 145271 145278 144891 143577 141559 139835 138950 138444 137855 137475 137613 137774 137309 136421 135821 135740
51539A35740K01M97R99J266R63N29N17Q24R78P94M34J74L37R99J640J629J123
51522A49644R33J327J744J817J855J989J725Q70J50K73R25J299J148P79M51L15
51506A67244N48J039J258Q77K30j91l49l56j19L09M60J55M3P38J749J985J309
51489A76929Q13J347K405K758J929O56m5P3M34N12L89L73M27L37J18j04m63j088
51471A87800j639j703j529j747k324k556k165j677j494j365j060r35j331j953
51457A64322k308k309k143j901j680j613j535j137o27o57j292j694j265m48R0
51442A43803M56R76J280P01o02j711k041j839j675j901k430k764k388j441p08
51427A27716o59q11m83K18O27M59nm07n54l74r8k55r63j524j232l56K60L29K22
$$ plain form
51539 135740 135941 136438 137437 138703 139666 140195 140712 141536 142514 143308 143742 143916 144253 145252 146892 148521 149644
51522 149644 150577 151904 153648 155465 157320 159309 161034 161904 162054 162327 163252 164551 165699 166478 166929 167244
51506 167244 167792 168831 170089 170966 171196 171005 170656 170300 170181 170490 170950 171105 171148 171886 173635 175620 176929
51489 176929 177742 179089 181494 184252 186181 186837 186792 186865 187299 187811 188200 188573 189000 189337 189455 189351 188888 187800
51471 187800 186161 184458 182929 181182 178858 176302 174137 172460 170966 169601 168541 167606 166275 164322
51457 164322 162014 159705 157562 155661 153981 152368 150833 149696 149069 148412 147120 145426 144161 143713 143803
51442 143803 144259 145235 146515 147216 146614 144903 142862 141023 139348 137447 135017 132253 129865 128424 127716
51427 127716 127057 126246 125763 125981 126608 127067 127062 126655 126101 125727 125629 125374 124411 122887 121655 121299 121559 121888 122110
51408A22110Q2l77j072j321p46J08M34J41k13l02l97q30j429j724j605j404j297
51391A10158r48j16O53N01o40j877k406k221j698r91j92M36P32R07J213J532J591
51374A06634J287O97k9o12p79o45o02p07o00j46K79M43O20J033J396J454J470
51357A11193J725J917J574P58j24r05j578j957j958j919k173k495k458k131j885
51342I7584j698j255n96j78k42o11j043j437j662j576j171m99L93J212J346N40
51326H9107n35r24n05j3K7j34l4L56P60J004J011O50r8q84j248j136r49r46p73
51307H4736J7J116J610J159M40M2m35j446k253j675N8J349J271M65j91o23q84
51290H4756n65L71J071R31M58K78J11m60r78q59m64l62k09N53J347J172K28m06
$$ plain form
51408 122110 122192 121815 120743 119422 118676 118784 119218 119359 119146 118844 118447 117617 116188 114464 112859 111455 110158
51391 110158 109210 109094 109747 110248 109608 107731 105325 103104 101406 100415 100223 100659 101391 102298 103511 105043 106634
51374 106634 107921 108618 108589 107977 107198 106553 105951 105244 104644 104498 104777 105220 105840 106873 108269 109723 111193
51357 111193 112918 114835 116409 117167 117043 116138 114560 112603 110645 108726 106553 104058 101600 99469 97584
51342 97584 95886 94631 94035 93857 93615 93004 91961 90524 88862 87286 86115 85616 86009 87221 88567 89107
51326 89107 88572 87648 87143 87130 87157 87023 86989 87345 88105 89109 90120 90770 90672 89788 88540 87404 86455 85509 84736
51307 84736 84753 85869 87479 88638 89078 89120 88685 87239 84986 83311 83369 84718 85989 86454 86263 85640 84756
51290 84756 84191 84562 85633 86564 87022 87300 87411 86951 85973 85114 84650 84288 84079 84632 85979 87151 87379 86973
51272H6973n62j037j859j968r40K19N47L11J45n6o22j155r83k02L79K37l84q11
51254G8232n38M46J567K061J648P46j9l96n75p79r65q72l58L04O36M74Q0l22p38
51235H0632j046q37j6R03J361J351J077N29j60m23M5O61O62J77q5Q7K92K59M2
51216H5511l59q60j007m90K28M94M21N26O86M06n1J02P92J008L41m47o29m63m42
51197H5767m82l06L9M30R31J411J441R57M98N09Q61J219J328Q01o03k198k675
51180H9928j572J41J332J878K139K036J393O18L35N54P69O13Pr99k006k298j580
51163I3288n36j18m90r90j016n47j7L3n91j352j388n56L13N00L05L56N08J15q56
51144H6961j693j829j349n77K58R44J265J220J010P95O74P58R55Q34J27p34r76
$$ plain form
51272 86973 86411 85374 83515 81547 80607 80826 81373 81684 81829 81773 81151 79996 79013 78811 79190 79427 79043 78232
51254 78232 77694 78140 79707 81768 83416 84162 84143 83747 83172 82393 81428 80556 80198 80502 81138 81612 81692 81370 80632
51235 80632 79586 78749 78733 79636 80997 82348 83425 83954 83794 83371 83416 84077 84739 84916 84831 84918 85210 85469 85511
51216 85511 85152 84292 83285 82795 83023 83517 83938 84464 85150 85556 85505 85607 86399 87407 87748 87301 86672 86209 85767
51197 85767 85285 84979 85018 85448 86379 87790 89231 90188 90686 91195 92056 93275 94603 95404 94801 92603 89928
51180 89928 88356 88497 89829 91707 93846 95882 97275 97893 98228 98782 99551 100164 100171 99172 97166 94868 93288
51163 93288 92752 92634 92144 91154 90138 89591 89574 89607 89016 87664 86276 85720 86033 86533 86838 87194 87702 87817 86961
51144 86961 85268 83439 82090 81513 81771 82715 83980 85200 86210 87005 87679 88437 89392 90226 90353 89619 88643
51127H8643m58J32J49k54m40j41K69K78j98p64j010q76n32q5L54M93Q6n31o01
51108H4514J51J056J277P75K21J25L81O18O37N25N82J048J779K258K133J579J017
51091A00676O70O36J030J597J544M10r14r12O13K054J911N59m74m82m7J94K60
51074A09325J65m39j537k358k280j646j094n88J81Q10O08j86n05M0P21R68J141
51057A03326J600J875J392M37l25p43r43p57j83J08m31j181j133m08L0L8M92J617
51039A04811K315J728N50N9M34P82M93n9p8P91K129L021K786J639M93L8K27N83
51021A22742O84L29l26p14l81K99M97O5k21J36O48O69L06n6n88j563k477k493
51003A17556j679r40p24n17J05P10P33M02L51N96N41j2m22k6R58J714J832J658
$$ plain form
51127 88643 88185 88317 88466 88212 87772 87631 87900 88178 87980 87216 86206 85330 84798 84713 85067 85560 85646 85115 84514
51108 84514 84665 85721 86998 87773 87994 88119 88500 89118 89755 90280 90862 91910 93689 95947 98080 99659 100676
51091 100676 101346 101982 103012 104609 106153 106563 105649 104737 105350 107404 109315 109874 109400 108918 108871 109065 109325
51074 109325 109490 109051 107514 105156 102876 101230 100136 99548 99729 100539 101147 100961 100456 100496 101217 102185 103326
51057 103326 104926 106801 108193 108630 108305 107562 106619 105862 105679 105787 105356 104175 103042 102634 102664 102702 103194 104811
51039 104811 107126 108854 109404 109463 109897 110679 111172 111113 111035 111826 113955 116976 119762 121401 121894 121932 122159 122742
51021 122742 123426 123755 123429 122715 122334 122633 123130 123195 122974 123110 123758 124427 124733 124677 124089 122526 120049 117556
51003 117556 115877 114937 114213 113696 113801 114511 115244 115646 115997 116593 117134 117122 116700 116674 117632 119346 121178 122836
50985A22836J687J953K217K474K921L497L751L309K381J616J467J746J976K085
50971A55916K546L597M641M743L763K461J533R75N78M54P72J312J771K144K520
50956A89726K766K799K856L072L151K920K901L734N257O693P615Q228Q901R939
50942B60558J1563J3504J4915J5307J5387J6172J7479J8206J7999J7710J8059
50931D36859J8713J8928J8274J6528J3666J0359P681N859L943J094k407n838r063
50918E34596j2261j5173j7258j8373j8804j8798j8483j8070j7740j7432j6898
50907C45306j5917j4361j2337j0292q667p418o142m734l534k781k385k229k193
50894B52316j951j251m45q2J5N53J589K339K408K322K474K446J846J075O24K51
$$ plain form
50985 122836 124523 126476 128693 131167 134088 137585 141336 144645 147026 148642 150109 151855 153831 155916
50971 155916 158462 162059 166700 171443 175206 177667 179200 180175 180753 181207 181979 183291 185062 187206 189726
50956 189726 192492 195291 198147 201219 204370 207290 210191 213925 219182 225875 233490 241718 250619 260558
50942 260558 272121 285625 300540 315847 331234 347406 364885 383091 401090 418800 436859
50931 436859 455572 474500 492774 509302 522968 533327 541008 546867 550810 551904 549497 543659 534596
50918 534596 522335 507162 489904 471531 452727 433929 415446 397376 379636 362204 345306
50907 345306 329389 315028 302691 292399 283732 276314 270172 265438 261904 259123 256738 254509 252316
50894 252316 250365 249114 248669 248587 248602 249155 250744 253083 255491 257813 260287 262733 264579 265654 266278 266529
50878B66529m95j419j978k009j635r29j52J14k95p18m96P2K03l14r56j159p20
50861B53643J41Q02P40L28N43J541K214J775J015J157K130K919L150L259L387
50846B78744L288L248L975N360O331O303N948O160O857P351P462P723Q665J0285
50832C67700J2198J4037J5680J7204J8768K0579K2876K5713K8760L1530L3884
50821F08929L6184L8843M1946M5185M7937M9514M9763M9341M8861M7849M5185
50810A109537M0627L5053K9071K2317J4596O697n46p231j3601j8952k2330k3913
50798A171325k4741k5268k4984k3377k0606j7320j4364j2500j1827j1487j0477
50787I74374q628o420m111j548J401M736Q424J2311J6204K0267K4856K9524L2813
$$ plain form
50878 266529 266034 264615 262637 260628 258993 258064 257912 258026 257731 257013 256517 256589 256792 256478 255522 254363 253643
50861 253643 253784 254586 255326 255654 256197 257738 259952 261727 262742 263899 266029 268948 272098 275357 278744
50846 278744 282032 285280 289255 294615 300946 307249 313197 319357 326214 333565 341027 348750 357415 367700
50832 367700 379898 393935 409615 426819 445587 466166 489042 514755 543515 575045 608929
50821 608929 645113 683956 725902 771087 819024 868538 918301 967642 1016503 1064352 1109537
50810 1109537 1150164 1185217 1214288 1236605 1251201 1257898 1257352 1250121 1236520 1217568 1195238 1171325
50798 1171325 1146584 1121316 1096332 1072955 1052349 1035029 1020665 1008165 996338 984851 974374
50787 974374 965746 959326 955215 953667 955068 959804 968228 980539 996743 1017010 1041866 1071390 1104203
50774A104203L3739L2906L1447K9380K5917K1019J5672J0727O259K024k146o414
50762A304733j0791j5045j9131k3428k8044l2352l5796l8668m1343m3323m3927
50751I72885m3450m2579m1076l8269l4538l1041k8057k4857k1240j7872j4935
50740F34971j1740q039m583j862O56L504O303Q503J0263J2073J4100J6360J9075
50727F99584K2241K5214K7133K7602K6867K5595K4351K2938K0354J5921J0341
50716I48141N075R36k058l903m717n296o328p044n934k972K33K781N532R220J2990
50701I46656J5796J8108K1061K4641K7857L0213L1985L3387L4280L4522L3832
50690A252338L1669K7784K2765J7478J2286P323L089J61j503k340k421j474M54
$$ plain form
50774 1104203 1137942 1170848 1202295 1231675 1257592 1278611 1294283 1305010 1311269 1313293 1311147 1304733
50762 1304733 1293942 1278897 1259766 1236338 1208294 1175942 1140146 1101478 1060135 1016812 972885
50751 972885 929435 886856 845780 807511 772973 741932 713875 689018 667778 649906 634971
50740 634971 623231 615192 610609 608747 609403 612907 619210 627713 637976 650049 664149 680509 699584
50727 699584 721825 747039 774172 801774 828641 854236 878587 901525 921879 937800 948141
50716 948141 953216 954152 952094 948191 943474 938178 931850 924806 918872 915900 916133 918914 924446 933666 946656
50701 946656 962452 980560 1001621 1026262 1054119 1084332 1116317 1149704 1183984 1218506 1252338
50690 1252338 1284007 1311791 1334556 1352034 1364320 1371643 1374732 1374893 1373390 1371050 1368629 1367155 1367609
50677A367609K714M441M977M193K686J392Q10Q54J578L541P193J2379J8804K6495
50663A459666L5391M4926N4459O3672P2116P8762Q2574Q3317Q1426P7444P1947
50652B205700O5665N9105N2272M5130L8021L1295K4712J7709J0074K062n918j3458
50640B532369k0232k6129l1086l4660l6199l5601l3398k9996k5412j9990j4538
50629B225128r402m216Q76M696O554P399Q372Q884P397L819j59l101n062o736
50615B244449q363r763j0558j0095p815m000M92N248J0378J5452J9253K0945K0796
50602B286419J9374J6618J2154N934j859j1111k1363l1551m0712m8767n6078o2458
50590B066600o7195o9955p1157p1265p0179o7517o3341n8332n3337m8800m4578
$$ plain form
50677 1367609 1370323 1374764 1379741 1383934 1386620 1388012 1388822 1389676 1391254 1394795 1401988 1414367 1433171 1459666
50663 1459666 1495057 1539983 1594442 1658114 1730230 1808992 1891566 1974883 2056309 2133753 2205700
50652 2205700 2271365 2330470 2382742 2427872 2465893 2497188 2521900 2539609 2549683 2551745 2545827 2532369
50640 2532369 2512137 2486008 2454922 2420262 2384063 2348462 2315064 2285068 2259656 2239666 2225128
50629 2225128 2215726 2211510 2212386 2217082 2223636 2231035 2239407 2248291 2255688 2259507 2259348 2256247 2251185 2244449
50615 2244449 2236086 2226323 2215765 2205670 2197855 2193855 2194347 2199595 2209973 2225425 2244678 2265623 2286419
50602 2286419 2305793 2322411 2334565 2340499 2338640 2327529 2306166 2274615 2233903 2185136 2129058 2066600
50590 2066600 1999405 1929450 1858293 1787028 1716849 1649332 1585991 1527659 1474322 1425522 1380944
50579A380944m0241l5620l1137k7508k5044k3327k1717k0096j8873j8183j7394
50568A101804j5758j3333j0902q962p215n233l145j347J91J887L838N557O538
50555A053920O879P141P792Q961J0744J3440J7280K1993K7058L2422L8614M5797
50543A292041N3127N9470O4621O9188P3392P6616P8283P8516P7634P5606P2510
50532B071004O9128O6490O4987O4335O4225O4615O5372O6032O6070O5299O3997
50521B791554O2737O2006O1918O2360O3331O4977O7261O9845P2270P3994P4269
50510C526522P2453O8504O2706N4776M3909K9979J4194k019j8316l5130n2292
50499C765286o8549q2349r2765r9807j03998j05506j03553r7058q6134p2410n7513
$$ plain form
50579 1380944 1340703 1305083 1273946 1246438 1221394 1198067 1176350 1156254 1137381 1119198 1101804
50568 1101804 1086046 1072713 1061811 1052849 1045634 1040401 1037256 1035909 1036100 1037987 1041825 1047382 1053920
50555 1053920 1060799 1067940 1075732 1084693 1095437 1108877 1126157 1148150 1175208 1207630 1246244 1292041
50543 1292041 1345168 1404638 1469259 1538447 1611839 1688455 1766738 1845254 1922888 1998494 2071004
50532 2071004 2140132 2206622 2271609 2335944 2400169 2464784 2530156 2596188 2662258 2727557 2791554
50521 2791554 2854291 2916297 2978215 3040575 3103906 3168883 3236144 3305989 3378259 3452253 3526522
50510 3526522 3598975 3667479 3730185 3784961 3828870 3858849 3873043 3871024 3852708 3817578 3765286
50499 3765286 3696737 3614388 3521623 3421816 3317818 3212312 3108759 3011701 2925567 2853157 2795644
50488B795644m1899k5812j0658J647J0442J6249J9011J7607J1422J314j1515k6676
50476B756776m3788o1225p6766q9242r8833j05896j10280j11861j10999j08187
50466A839699j03767r8242r2367q6554q0561p4123o7622o1608n5971n0163m4226
50455A024495l8894l4480l0358k5957k1723j8500j6313j4355j2117r907q243p168
50443G86480o273n013l092q72P20J200J349K293L925N029N189N549P196R681J1885
50428H25246J3712J5907J8632K1251K3512K6035K9341L3118L6766M0232M3929
50417A127681M8072N2390N6355N9550O1904O3644O5027O6124O6984O7875O9157
50406A804763P0867P2549P3548P3419P2147P0020O7271O3827N9513N4466M9119
$$ plain form
50488 2795644 2753745 2727933 2717275 2718922 2729364 2745613 2764624 2782231 2793653 2794967 2783452 2756776
50476 2756776 2712988 2651763 2574997 2485755 2386922 2281026 2170746 2058885 1947886 1839699
50466 1839699 1735932 1637690 1545323 1458769 1378208 1304085 1236463 1174855 1118884 1068721 1024495
50455 1024495 985601 951121 920763 894806 873083 854583 838270 823915 811798 801891 793648 786480
50443 786480 780207 775194 772102 771230 771950 773150 774499 776792 780717 785746 790935 796484 803680 813361 825246
50428 825246 838958 854865 873497 894748 918260 944295 973636 1006754 1043520 1083752 1127681
50417 1127681 1175753 1228143 1284498 1344048 1405952 1469596 1534623 1600747 1667731 1735606 1804763
50406 1804763 1875630 1948179 2021727 2095146 2167293 2237313 2304584 2368411 2427924 2482390 2531509
50395B531509M3704L8046L1958K5552J8937J1826L763n410j5545k6551l8352n0513
50383B568924o2117p2223q0366q6549r0744r2511r1267q7034q0728p3419o5420
50372A686546n6406m6392l6203k6828j8654j1558n527j039J166O03k427o980j2262
50359A464039j8119k4526l0900l6444m0911m4328m6165m5730m3590m1529m0602
50348A051195l9985l8331l5495l2331k9364k6520k3758k1215j8856j6591j4517
50337G54232j2688j0852q883p115n801m650l384k355j912j604p61L59Q54M61k42
50322F95659q34j434j983j999j395q73j045j497j203K64K229L653M178M362M842
50307G02924N527N984O413P616R783J2032J3604J4945J6952J9596K2004K3668
$$ plain form
50395 2531509 2575213 2613259 2645217 2670769 2689706 2701532 2705295 2699885 2684340 2657789 2619437 2568924
50383 2568924 2506807 2434584 2354218 2267669 2176925 2084414 1993147 1906113 1825385 1751966 1686546
50372 1686546 1630140 1583748 1547545 1520717 1502063 1490505 1484978 1483939 1485105 1485708 1483281 1476301 1464039
50359 1464039 1445920 1421394 1390494 1354050 1313139 1268811 1222646 1176916 1133326 1091797 1051195
50348 1051195 1011210 972879 937384 905053 875689 849169 825411 804196 785340 768749 754232
50337 754232 741544 730692 721809 714694 708893 704243 700859 698504 696592 694988 694227 694586 695440 695901 695659
50322 695659 694825 693391 691408 689409 688014 687141 686096 684599 683396 683660 685889 689542 693720 698082 702924
50307 702924 708451 714435 720848 728464 738247 750279 763883 778828 795780 815376 837380 861048
50295H61048K4757K5373K5241K4230K2645K0872J9134J7515J5867J3746J0827
50284A081255P306L546m64m878r478j3838j7861k1626k4920k7386k8944k9584
50272I13128k9032k7298k5235k3720k2457k0399j7387j4539j2891j2399j2411
50261F95360j2418j2092j1333j0531j0245j0321r944q786p531o887o680o318n708
50248E76566n158m677l972l077k502k609l077l201k698k012j674j564j181n53
50234E38611l07o51r24n30K23P09Q71Q83N19l42r65n41N21J080Q22M85N26O27
50216E41617N67N99P22N08l6k57J35O16O94O60J032J847K705L122K798K075K013
50199E61417L195M535M300K434P07L53P99J170J699K665L207K483J282J190K449
$$ plain form
50295 861048 885805 911178 936419 960649 983294 1004166 1023300 1040815 1056682 1070428 1081255
50284 1081255 1088561 1092107 1091643 1086765 1077287 1063449 1045588 1023962 999042 971656 942712 913128
50272 913128 884096 856798 831563 807843 785386 764987 747600 733061 720170 707771 695360
50261 695360 682942 670850 659517 648986 638741 628420 618476 609690 602159 595272 588592 582274 576566
50248 576566 571408 566731 562759 559682 557180 554571 551494 548293 545595 543583 541909 540345 539164 538611
50234 538611 538304 537653 536729 536199 536422 537131 538002 538885 539404 539062 538097 537556 538077 539157 539979 540464 540990 541617
50216 541617 542184 542783 543505 544013 543977 543720 543855 544471 545165 545825 546857 548704 551409 554531 557329 559404 561417
50199 561417 564612 569147 573447 575881 576588 576941 577740 578910 580609 583274 586481 588964 590246 591436 593885
50184E93885L864M516M596M576M579M652M882N050M765M071L514L475L788M025
50170F54238L887L387K928L054L788M424M311L653L187L354M140N430O925P956
50156G14662Q011P448P123P307P525P429P242P111O648N574M417M068M638N246
50142H04449M995L888K650J897J774K224L123M023M234L584K862K996L859M383
50128H50941L908L019K771L430M245M336L742L506M658P002R208J0363J1072J2597
50114I34798J5149J7805J9956K2034K4657K7832L1336L5324M0092M5704N2112
50103A266799N9331O7219P5455Q3839R2084R9159J03411J03838J00739R4965Q7102
50092B233941P7790O8179N9414N1896M5505M0156L5642L1301K6269J9877J1455
$$ plain form
50184 593885 597749 602265 606861 611437 616016 620668 625550 630600 635365 639436 642950 646425 650213 654238
50170 654238 658125 661512 664440 667494 671282 675706 680017 683670 686857 690211 694351 699781 706706 714662
50156 714662 722673 730121 737244 744551 752076 759505 766747 773858 780506 786080 790497 794565 799203 804449
50142 804449 809444 813332 815982 817879 819653 821877 825000 829023 833257 836841 839703 842699 846558 850941
50128 850941 854849 857868 860639 864069 868314 872650 876392 879898 884556 891558 900766 911129 922201 934798
50114 934798 949947 967752 987708 1009742 1034399 1062231 1093567 1128891 1168983 1214687 1266799
50103 1266799 1326130 1393349 1468804 1552643 1644727 1743886 1847297 1951135 2051874 2146839 2233941
50092 2233941 2311731 2379910 2439324 2491220 2536725 2576881 2612523 2643824 2670093 2689970 2701425
50081B701425J04j4651l2140n0772o8857q4989r8084j07511j13078j14719j12498
50070A904230j07109r9837r1612q2636p3228o4369n6726m9789m2835l6347l1454
50059A168288k8183k5289k1912j8540j6031j4426j3114j1690j0235r019q154p507
50047I84188o884o393o427o958p101n953l799k008j554k096k575k370j595o50
50033I27825K10R57J606K065K202K105K158K686L684M988O449P823Q708Q969Q999
50018I91434R260R804J0503J1491J2895J4340J5296J5836J6433J7079J7267J6952
50006A158590J6813J7255J7776J7821J7819J8675K0502K2503K4089K5548K7425
49995A384816K9853L2796L6539M1343M6931N2856N9476O7868P8543R0711J03193
$$ plain form
50081 2701425 2701529 2686878 2654738 2603966 2535109 2450120 2352036 2244525 2131447 2016728 1904230
50070 1904230 1797121 1697284 1605672 1523036 1449808 1385439 1328713 1278924 1236089 1199742 1168288
50059 1168288 1140105 1114816 1092904 1074364 1058333 1043907 1030793 1019103 1008868 999849 991695 984188
50047 984188 977304 970911 964484 957526 950425 944472 940673 938665 937111 935015 932440 930070 928475 927825
50033 927825 928035 928992 930598 932663 934865 936970 939128 941814 945498 950486 956935 964758 973466 982435 991434
50018 991434 1000694 1010498 1021001 1032492 1045387 1059727 1075023 1090859 1107292 1124371 1141638 1158590
50006 1158590 1175403 1192658 1210434 1228255 1246074 1264749 1285251 1307754 1331843 1357391 1384816
49995 1384816 1414669 1447465 1484004 1525347 1572278 1625134 1684610 1752478 1831021 1921732 2024925
49984B024925J15582J27972J39822J49769J56490J59267J57802J52279J43792
49975C327700J34128J24762J16261J08755J02379R6956R1565Q4797P5235O1654
49965D324192M3252K0135o556l5178o4125r1871j16973j38314j55167j67066j74008
49954C438321j76908j77178j75595j71977j66096j58343j49197j38770j27416
49945A996841j16163j05800r5982q6019p6230o7684o0667n4259m7659m1237l5981
49934A209160l2295k9693k7469k5342k3492k2072k0857j9475j7856j6337j5228
49923I59044j4597j4426j4700j5186j5394j4984j4001j2677j1161r555p941o319
49911H08103m769l593k999k700k292j826j486q99L88J805K140J283N40Q43J640
$$ plain form
49984 2024925 2140507 2268479 2408301 2558070 2714560 2873827 3031629 3183908 3327700
49975 3327700 3461828 3586590 3702851 3811606 3913985 4010941 4102506 4187303 4262538 4324192
49965 4324192 4367444 4387579 4381023 4345845 4281720 4189849 4072876 3934562 3779395 3612329 3438321
49954 3438321 3261413 3084235 2908640 2736663 2570567 2412224 2263027 2124257 1996841
49945 1996841 1880678 1774878 1678896 1592877 1516647 1448963 1388296 1334037 1286378 1245141 1209160
49934 1209160 1176865 1147172 1119703 1094361 1070869 1048797 1027940 1008465 990609 974272 959044
49923 959044 944447 930021 915321 900135 884741 869757 855756 843079 831918 822363 814422 808103
49911 808103 803334 799741 796742 794042 791750 789924 788438 787539 787927 789732 791872 793155 793695 794538 796178
49896G96178K097K383K952L407L048K098J440J521K200L248M335N013N337O037
49882H41294P400Q653R177R660J1116J3403J5695J7844K0186K2479K4417K6749
49870A028073L0575L5721M1143M6806N3743O2188P1101P9840Q8880R8257J06601
49859A742928J12393J15214J15081J11491J04169R4198Q3500P3406O4284N6312
49849B672976M9910M5252M1718L7838L1879K2561R423p432k7556m9914p2728r3985
49837B659942j12036j25576j33644j36270j34633j29958j22535j12518j01135
49828A551637r0084p9970p0399o1453n3905m7863m2469l7177l2389k8481k5162
49817I82285k2155j9670j7765j5965j3940j1889j0044q383p073o373n987n275
$$ plain form
49896 796178 798275 800658 803610 807017 810065 812163 813603 815124 817324 820572 824907 829920 835257 841294
49882 841294 848694 857347 866524 876184 887300 900703 916398 934242 954428 976907 1001324 1028073
49870 1028073 1058648 1094369 1135512 1182318 1236061 1298249 1369350 1449190 1538070 1636327 1742928
49859 1742928 1855321 1970535 2085616 2197107 2301276 2395474 2478974 2552380 2616664 2672976
49849 2672976 2722886 2768138 2809856 2847694 2879573 2902134 2911557 2904125 2876569 2826655 2753927 2659942
49837 2659942 2547906 2422330 2288686 2152416 2017783 1887825 1765290 1652772 1551637
49828 1551637 1461553 1381583 1311184 1249731 1195826 1147963 1105494 1068317 1035928 1007447 982285
49817 982285 960130 940460 922695 906730 892790 880901 870857 862474 855401 849028 843041 837766
49805H37766m340l928l997l509k112r99j283k410l002k600j767j065p05p70j052
49790H04227r67k92M06O08O06Q08P76k32j978l321l540k966k306j909j736j626
49774G86558j456j196q93o41o27j091j926k456k092j209p46r64j276j380j674
49759G66931k284k601k260j741j466j068k89J17o87k300l519l770l358k614j653
49744G37438q05n45r97j984l317m591n027m284l207l084m126n250n358m358k998
49729F87507k174k296k946l190k624j882j721j954j851j399j343k058k998l469
49715F55602l365l011k769k963l687m472m514l584k514k358l128l657k899j200
49701F11481J9n8o49m71N17J176R44O35J157K152K616K316J877J726J666J452
$$ plain form
49805 837766 833426 829498 825501 821992 819880 818881 817598 815188 812186 809586 807819 806754 806049 805279 804227
49790 804227 803260 802968 803374 803982 804588 805396 806172 805940 803962 800641 797101 794135 791829 789920 788184 786558
49774 786558 785102 783906 783013 782372 781745 780654 778728 776272 774180 772971 772225 771261 769985 768605 766931
49759 766931 764647 762046 759786 758045 756579 755511 755222 755339 754652 752352 748833 745063 741705 739091 737438
49744 737438 736633 736088 735091 733107 729790 725199 720172 715888 712681 709597 705471 700221 694863 690505 687507
49729 687507 685333 683037 680091 676901 674277 672395 670674 668720 666869 665470 664127 662069 659071 655602
49715 655602 652237 649226 646457 643494 639807 635335 630821 627237 624723 622365 619237 615580 612681 611481
49701 611481 611500 611442 610793 610322 610839 612015 612959 613594 614751 616903 619519 621835 623712 625438 627104 628556
49685F28556J165J003J083J458K020K451K508K258J846J348J061J548K846M030
49671F55181M125L332K671K625K765K776L069M036N228N760N375M726M636N244
49657G11549O057O665P216P948Q574Q532P830P085O668O308N815N521N675N869
49643H07312N662N375N709O790Q081R039R464R480R524J0083J0995J1402J0830
49630I19746R941R656R915J0065R994J0007R815Q798P305O613P198P968P719O679
49616A041419N996O188O764P144P337P663Q214Q773R108R195R091Q736Q063P371
49602A151062P194P601P934P672P239P535Q756J0262J1521J2619J3750J4795J5616
49589A283556J6346J7157J8036J8975K0075K1254K2158K2638K3107K4177K5995
$$ plain form
49685 628556 629721 630724 631807 633265 635285 637736 640244 642502 644348 645696 646757 648305 651151 655181
49671 655181 659306 662638 665309 667934 670699 673475 676544 680580 685808 691568 696943 701669 706305 711549
49657 711549 717606 724271 731487 739435 748009 756541 764371 771456 778124 784432 790247 795768 801443 807312
49643 807312 812974 818349 824058 830848 838929 847968 857432 866912 876436 886519 897514 908916 919746
49630 919746 929687 939343 949258 959323 969317 979324 989139 997937 1005242 1011855 1019053 1027021 1034740 1041419
49616 1041419 1047415 1053603 1060367 1067511 1074848 1082511 1090725 1099498 1108606 1117801 1126892 1135628 1143691 1151062
49602 1151062 1158256 1165857 1173791 1181463 1188702 1196237 1204993 1215255 1226776 1239395 1253145 1267940 1283556
49589 1283556 1299902 1317059 1335095 1354070 1374145 1395399 1417557 1440195 1463302 1487479 1513474
49578A513474K8110K9848L0795L0985L0783L0652L0918L1713L2914L4145L5022
49567A859359L5558L6138L6966L7722L8026L7996L8026L8206L8316L8267L8200
49556B272780L8149L7962L7516L6786L5711L4317L2843L1459K9945K8024K5908
$$ plain form
49578 1513474 1541584 1571432 1602227 1633212 1663995 1694647 1725565 1757278 1790192 1824337 1859359
49567 1859359 1894917 1931055 1968021 2005743 2043769 2081765 2119791 2157997 2196313 2234580 2272780
49556 2272780 2310929 2348891 2386407 2423193 2458904 2493221 2526064 2557523 2587468 2615492 2641400
$$ [...]
##END NTUPLES=NMR SPECTRUM
##END=
