
##TITLE=AC1296_UGARS11108_6534421_xA5jigeR2I
##JCAMPDX= 6.0         $$ Bruker NMR JCAMP-DX V2.0
##DATA TYPE= NMR SPECTRUM
##DATA CLASS= NTUPLES
##ORIGIN= BRUKER
##OWNER= Administrator
$$ 1.72 TOPSPIN		Version 2.1
$$ 2012-07-17 15:22:30.156 -0500  Administrator@TOPSPIN
$$ Compression mode = diff/dup
##.OBSERVE FREQUENCY= 400.02188249412
##.OBSERVE NUCLEUS= ^1H
##.ACQUISITION MODE= SIMULTANEOUS (DQD)
##.ACQUISITION SCHEME= undefined
##.AVERAGES= 8
##.DIGITISER RES= 22
##SPECTROMETER/DATA SYSTEM= spect
##.PULSE SEQUENCE= zg30
##.SOLVENT NAME= COFFEE_meoh
##.SHIFT REFERENCE= INTERNAL, COFFEE_meoh, 1, 14.98509
##AUDIT TRAIL= $$ (NUMBER, WHEN, WHO, WHERE, PROCESS, VERSION, WHAT)
$$ ##TITLE= Audit trail, TOPSPIN		Version 2.1
$$ ##JCAMPDX= 5.01
$$ ##ORIGIN= Bruker BioSpin GmbH
$$ ##OWNER= Administrator
$$ $$ C:\Bruker\TOPSPIN/data/COFFEE/nmr/AC1296_UGARS11108_6534421_xA5jigeR2I/20/pdata/1/auditp.txt
$$ ##AUDIT TRAIL=  $$ (NUMBER, WHEN, WHO, WHERE, PROCESS, VERSION, WHAT)
(   1,<2012-07-17 15:22:23.406 -0500>,<Administrator>,<TOPSPIN>,<go>,<TOPSPIN 2.1>,
      <created by zg
	started at 2012-07-17 15:21:16.906 -0500,
	POWCHK enabled, PULCHK disabled,
       configuration hash MD5:
       6B 1B 68 BB D9 2E 58 E2 7F 35 AD 54 07 DF 0E 41
       data hash MD5: 64K
       F7 75 D9 E3 09 58 EE 0E EB 6E C0 86 87 EF AE F8>)
(   2,<2012-07-17 15:22:26.093 -0500>,<Administrator>,<TOPSPIN>,<proc1d>,<TOPSPIN 2.1>,
      <Start of raw data processing
       efp LB = 0 FT_mod = 6 PKNL = 1 PHC0 = 0 PHC1 = 0 SI = 32K 
       data hash MD5: 32K
       65 AE DF 0C BE 76 69 7B 0D DC CC 08 06 C3 3C F5>)
(   3,<2012-07-17 15:22:26.453 -0500>,<Administrator>,<TOPSPIN>,<proc1d>,<TOPSPIN 2.1>,
      <pk PHC0 = 177.6434 PHC1 = 0 
       data hash MD5: 32K
       30 6F E6 44 69 BE 8E D1 C9 2C F4 B2 A7 C5 46 22>)
(   4,<2012-07-17 15:22:26.515 -0500>,<Administrator>,<TOPSPIN>,<proc1d>,<TOPSPIN 2.1>,
      <abs ABSG = 1 
       data hash MD5: 32K
       50 E0 BE C7 B4 33 12 78 2A 26 91 C3 4B 19 02 67>)
(   5,<2012-07-17 15:22:26.562 -0500>,<Administrator>,<TOPSPIN>,<proc1d>,<TOPSPIN 2.1>,
      <abs ABSG = 2 
       data hash MD5: 32K
       D8 54 17 B8 3D 2D 65 88 46 19 4D 47 99 A2 FD 98>)
(   6,<2012-07-17 15:22:26.593 -0500>,<Administrator>,<TOPSPIN>,<proc1d>,<TOPSPIN 2.1>,
      <abs ABSG = 3 
       data hash MD5: 32K
       1A 70 C0 68 55 8B A3 62 FF 16 32 A6 44 48 76 36>)
(   7,<2012-07-17 15:22:26.625 -0500>,<Administrator>,<TOPSPIN>,<proc1d>,<TOPSPIN 2.1>,
      <abs ABSG = 4 
       data hash MD5: 32K
       BA 3C 83 4D FD 9F AD FF 34 02 AB FB AE 53 95 B1>)
(   8,<2012-07-17 15:22:26.656 -0500>,<Administrator>,<TOPSPIN>,<proc1d>,<TOPSPIN 2.1>,
      <abs ABSG = 5 
       data hash MD5: 32K
       4A DC 3A F5 62 62 78 E4 57 F1 F9 EF B7 7C A7 95>)
$$ ##END=
$$ 
$$ $$ hash MD5
$$ $$ D3 52 5F 4C E9 80 A9 2D D2 32 6B 9B 47 85 1F AC
##$RELAX= 
##$RELAX= 
##$RELAX= 
##$RELAX= 
##$RELAX= 
##$RELAX= 
##$RELAX= 
$$ Bruker specific parameters
$$ --------------------------
$$ [...]
150 150 150 150 150 150 150 150
##$TP07= 0
##$TPNAME0= <>
##$TPNAME1= <>
##$TPNAME2= <>
##$TPNAME3= <>
##$TPNAME4= <>
##$TPNAME5= <>
##$TPNAME6= <>
##$TPNAME7= <>
##$TPOAL= (0..7)
0.5 0.5 0.5 0.5 0.5 0.5 0.5 0.5
##$TPOFFS= (0..7)
0 0 0 0 0 0 0 0
##$TUNHIN= 0
##$TUNHOUT= 0
##$TUNXOUT= 0
##$USERA1= <user>
##$USERA2= <user>
##$USERA3= <user>
##$USERA4= <user>
##$USERA5= <user>
##$V9= 5
##$VALIST= <valist>
##$VCLIST= <CCCCCCCCCCCCCCC>
##$VD= 0
##$VDLIST= <DDDDDDDDDDDDDDD>
##$VPLIST= <PPPPPPPPPPPPPPP>
##$VTLIST= <TTTTTTTTTTTTTTT>
##$WBST= 2048
##$WBSW= 25
##$XGAIN= (0..3)
0 0 0 0
##$XL= 0
##$YL= 0
##$YMAX_a= 499009
##$YMIN_a= -638388
##$ZGOPTNS= <>
##$ZL1= 120
##$ZL2= 120
##$ZL3= 120
##$ZL4= 120
##$ABSF1= 14.98509
##$ABSF2= -5.573092
##$ABSG= 5
##$ABSL= 3
##$ALPHA= 0
##$AQORDER= 0
##$ASSFAC= 0
##$ASSFACI= 0
##$ASSFACX= 0
##$ASSWID= 0
##$AUNMP= <proc_prof1d_extract_pilot.lims>
##$AXLEFT= 0
##$AXNAME= <>
##$AXNUC= <1H>
##$AXRIGHT= 0
##$AXTYPE= 0
##$AXUNIT= <>
##$AZFE= 0.1
##$AZFW= 0.1
##$BCFW= 0
##$BC_mod= 0
##$BYTORDP= 0
##$COROFFS= 0
##$CY= 15
##$DATMOD= 1
##$DC= 0
##$DFILT= <>
##$DTYPP= 0
##$F1P= 0
##$F2P= 0
##$FCOR= 0.5
##$FTSIZE= 32768
##$FT_mod= 6
##$GAMMA= 0
##$GB= 0
##$INTBC= 1
##$INTSCL= 1
##$ISEN= 128
##$LB= 0
##$LEV0= 0
##$LPBIN= 0
##$MAXI= 10000
##$MC2= 0
##$MEAN= 0
##$ME_mod= 0
##$MI= 0
##$NCOEF= 0
##$NC_proc= -8
##$NLEV= 6
##$NOISF1= 0
##$NOISF2= 0
##$NSP= 0
##$NTH_PI= 0
##$NZP= 0
##$OFFSET= 14.98509
##$PC= 1
##$PHC0= 177.6434
##$PHC1= 0
##$PH_mod= 1
##$PKNL= yes
##$PPARMOD= 0
##$PPDIAG= 0
##$PPIPTYP= 0
##$PPMPNUM= 2147483647
##$PPRESOL= 1
##$PSCAL= 4
##$PSIGN= 0
##$PYNMP= <proc.py>
##$REVERSE= no
##$SF= 400.02
##$SI= 32768
##$SIGF1= 0
##$SIGF2= 0
##$SINO= 400
##$SIOLD= 32768
##$SPECTYP= <>
##$SREGLST= <1H.CDCl3>
##$SSB= 0
##$STSI= 32768
##$STSR= 0
##$SW_p= 8223.68421052631
##$SYMM= 0
##$S_DEV= 0
##$TDeff= 65536
##$TDoff= 0
##$TI= <>
##$TILT= no
##$TM1= 0
##$TM2= 0
##$TOPLEV= 0
##$USERP1= <user>
##$USERP2= <user>
##$USERP3= <user>
##$USERP4= <user>
##$USERP5= <user>
##$WDW= 1
##$XDIM= 32768
##$YMAX_p= 465726586
##$YMIN_p= -712722
##$CURPLOT= <Network HP LaserJet P1505>
##$CURPRIN= <$Network HP LaserJet P1505>
##$DFORMAT= <normdp>
##$LAYOUT= <+/1D_H.xwp>
##$LFORMAT= <normlp>
##$PFORMAT= <normpl>
##$SURQMSG= 1
$$ End of Bruker specific parameters
$$ ---------------------------------
##NTUPLES= NMR SPECTRUM
##VAR_NAME=  FREQUENCY,     SPECTRUM/REAL,   SPECTRUM/IMAG
##SYMBOL=    X,             R,               I
##VAR_TYPE=  INDEPENDENT,   DEPENDENT,       DEPENDENT
##VAR_FORM=  AFFN,          ASDF,            ASDF
##VAR_DIM=   32768,         32768,           32768
##UNITS=     HZ,            ARBITRARY UNITS, ARBITRARY UNITS
##FACTOR=    0.250966925370066, 1,           1
##FIRST=     8223.43324360094, 137731,       -216308
##LAST=      0,             -32958,          80572
##MIN=       0,             -712722,         0
##MAX=       8223.43324360094, 465726586,    0
$$ Real data points
##PAGE= N=1
##DATA TABLE= (X++(R..R)), XYDATA
$$ [...]
19560C9643Q9535J11256j18992C2641d3176p4728A1305N1355b57839N5189B1361
19548b92382H7160D3001b52155d7945l53377a68006j24855A59293g1277E1242
19537c7719B23962b81663g7369A82606b3624j98584k09013a0221j1219A84985
19526a80025f9089E4225a5448k67803E0114a61755d4140m7141d1369j39399f0605
19514A71253b87459A74149a71123p3481B71907d8096G2206a753D8255J5418J22652
19503A86325m4117E2395A6699a13716J5269J8109C1076c01690a2129A86689F2071
19491F8559J6373b06255D58394H2005c02761A05202N0922a03970A6200K14377
19481B30577A3583a26346A37907e2582l12319A34162i4260H3880J15004i2418
$$ y = [39643, 129178, 240434, 121442, 32641, -43176, -117904, 11305, 62660, -257839, -202650, 21361, -292382, 87160, 43001, -252155, -47945, -401322, -168006, -292861, 159293, -71277, 51242, -37719, 223962, -281663, -77369, 182606, -23624, -222208, -431221, -10221, -21440, 184985, -180025, -69089, 54225, -15448, -283251, 50114, -161755, -44140, -91281, -41369, -180768, -60605, 171253, -287459, 174149, -171123, -244604, 271907, -48096, 72206, -1753, 48255, 63673, 186325, 142208, 52395, 16699, -113716, -98447, -80338, 31076, -301690, -12129, 186689, 62071, 68559, 84932, -206255, 458394, 82005, -302761, 105202, 156124, -103970, 16200, 230577, 13583, -126346, 137907, -52582, -364901, 134162, -94260, 83880, 198884, -92418]
19470g9294A51331J37454b90956B62115b9938a3397A39962c34169G4390h1322
19459b35803A2992a56684j48361A978g0124A97444o9736b16714a7600A17836b10498
19447b17953A66386d23008a0429E5091c34092D1449f3482k22184J25188l5969
19437a96447j87187j54702a25441r4657g1395j19290D8263O6993a99225d1383
19426h6942A29889L36552i2868B2118R259b2753I7194C3326c81719B86775b491
19414E1828a8683j28000C3693K63437f1495j89304B81011b11674A32878a4349
19403e4402A26930e44077a06814D46018a24954e7066n6729I6995B8881c04162
19392b42847G6858a06435j77693a05542e2103b3807a1324B5337J28436b83314
$$ y = [-79294, 151331, 288785, -290956, 262115, -29938, -13397, 139962, -334169, 74390, -81322, -235803, 12992, -156684, -305045, 1978, -70124, 197444, 127708, -216714, -17600, 117836, -210498, -217953, 166386, -423008, -10429, 55091, -334092, 41449, -63482, -285666, -160478, -196447, -383634, -538336, -125441, -220098, -71395, -190685, 48263, 115256, -199225, -41383, -86942, 129889, 466441, -92868, 22118, 31377, -22753, 97194, 33326, -381719, 286775, -2491, 51828, -18683, -146683, 33693, 297130, -61495, -250799, 281011, -211674, 132878, -14349, -54402, 126930, -544077, -106814, 446018, -124954, -57066, -113795, 96995, 28881, -304162, -242847, 76858, -106435, -284128, -105542, -52103, -23807, -11324, 25337, 153773, -283314]
19381e9104C3024d11932O7563B08386D7584a15904B97077g3536j64736J06402
19371a31870L1455I4142B856J07404a30923B19376h4178A64547E7874P6210k3835
19360A10249a9872k63807B25285a99171P5066j85418C1705f2458A46296P901b94879
19348c08601B22228h0757A49394n7370a34517o3531p989M2935O0044F2244e5008
19336a53257I2613k4371b71225A77630B0168a31486a9241C72690a80770k4087
19326b04857d3301B7534a44732B83880A19597K4589h2496o0923B51461a75319
19315a87220P1949j75546B8562b03971g8714n66386B29911A13972n462q450d84691
19303a2521j58041A27806f0407G0708K15365A8206b19866i55m0707k27550R754
$$ y = [-59104, 33024, -411932, -344369, 208386, 47584, -115904, 297077, -73536, -238272, -131870, -100415, 94142, 2856, 110260, -130923, 219376, -84178, 164547, 57874, 134084, 110249, -19872, -283679, 225285, -199171, -124105, -309523, 31705, -62458, 146296, 154197, -294879, -308601, 222228, -80757, 149394, 92024, -134517, -198048, -206037, -163102, -103058, 62244, -55008, -153257, 92613, 68242, -271225, 177630, 20168, -131486, -19241, 372690, -180770, -204857, -43301, 27534, -144732, 283880, 119597, 144186, -82496, -143419, 251461, -175319, -187220, -115271, -290817, 28562, -203971, -78714, -645100, 229911, 113972, 108510, 100060, -484691, -12521, -170562, 127806, -60407, 70708, 286073, 18206, -219866, -955, -41662, -269212, -259458]
19292b59458f183j06585k2723P780B97767e03439h2975k54870a68090l7271a624
19280a01081m8614q88G4156b84925A07478a88041Q5250D12205A57774B7408h4631
19268B1153B8f7792E1894J21949n3771A4760g2267p2566B76285A4319b7039j78319
19256b05358f4929q4163D3170d9521G8729J29384M20q663A920c64182H668a88108
19243a22371K092A32244O2697e00107a02514C90041b38027B47200e891A44895
19232a21620o5589f6794o2422G0154a70363j56824d849k45235I8226a99373j23426
19221c22799a28806A22747e0516A70260a25536n5407f830A18439d4341A37990
19210C57627r3811G8306c5416A42662m2364a58788A90166m9752g9915p0401j44969
$$ y = [-259458, -6183, -112768, -135491, -127711, 297767, -503439, -82975, -337845, -168090, -205361, -1624, -101081, -149695, -150583, 74156, -284925, 107478, -188041, -102791, 412205, 157774, 27408, -84631, 21153, 28, -67792, 51894, 173843, 120072, 14760, -72267, -144833, 276285, 14319, -27039, -205358, -64929, -149092, 43170, -49521, 78729, 208113, 208533, 199870, 1920, -364182, 8668, -188108, -122371, -120279, 132244, 194941, -500107, -102514, 390041, -238027, 247200, -5891, 144895, -121620, -187209, -66794, -129216, 70154, -170363, -327187, -4849, -250084, 98226, -199373, -322799, -128806, 122747, -50516, 170260, -125536, -180943, -6830, 118439, -44341, 137990, 357627, 263816, 78306, -35416, 142662, 100298, -158788, 190166, 140414, -79915, -150316, -295285]
19199b95285F2835R8459K8369b04891O3336a5596j62116a3618A51362J44093a25825
19187f6419L839l08318A02681a96466b0411p3147k3584D1424j2259b11651A03141
19175e6071B93905a37717k13012J67801k30217m6835b05096B7670b25438o5425
19165b90863b4422A58808m7799e413I2921a96230K549A59637g3297c1057A61621
19153e393k00240F0698B91K63231b23944C4574e7959A0943K32590b34853A19940
19141A6289c8948p1116l67853e8443A16903b499r9977k67247D355a31675A64590
19129I451a47979N7815j41479B15819J22326c85043A93497a13631d7396k32743
19119b80139L1225P4683a7058I9750c0182B00491b34455e9624B75594g9083b0870
$$ y = [-295285, 62835, 161294, 189663, -204891, -141555, -15596, -177712, -13618, 151362, 295455, -125825, -66419, -62580, -370898, 102681, -196466, -20411, -93558, -117142, 41424, 29165, -211651, 103141, -56071, 293905, -137717, -350729, -182928, -413145, -459980, -205096, 27670, -225438, -290863, -24422, 158808, 111009, -5413, 92921, -196230, -193681, 159637, -73297, -31057, 161621, -5393, -205633, 60698, 291, 263522, -223944, 34574, -57959, 10943, 243533, -234853, 119940, 16289, -38948, -110064, -477917, -58443, 116903, -2499, -102476, -369723, 4355, -131675, 164590, 9451, -147979, -90164, -231643, 215819, 338145, -385043, 193497, -113631, -47396, -280139, -248914, -174231, -17058, 99750, -30182, 200491, -234455, -59624, 275594, -79083, -20870]
19107a64220M0127m4035I0738a56168j46221A3801a70484H5866a7020m792r899
19096c1711j12768A21503d9525D9991A4210J974a94784L5926n04k0269M3058G6216
19083D8907Q8764a97244O1820B3833N6917e2509A28737C4800a37258a5708k2078
19072c7786a0138p0355A8891a79061l0528O781D49142c60951b6084B13600C3676
19060a20010H6605a91906A12881c06150f1604C2195M4357a76581A83844G7590
19049e6550k3750j02101F7539b72043c6270A39172j1215e1865j97517c4623l4556
19038f9179A24214J62015b02737a6956r8407E1570a10842B56898A9548R9327b10483
19026a69664M8968A4209a29179k62488A40364b27623L5316j5871A28891D1773
$$ y = [-164220, -124093, -168128, 90738, -156168, -302389, 13801, -170484, 85866, -17020, -21812, -31711, -144479, 121503, -49525, 49991, 14210, 16184, -194784, -158858, -159362, -179631, -136573, 76216, 48907, 137671, -197244, -135424, 23833, 80750, -52509, 128737, 34800, -137258, -15708, -37786, -10138, -80493, 18891, -179061, -209589, -202808, 449142, -360951, -26084, 213600, 33676, -120010, 86605, -191906, 112881, -306150, -61604, 32195, 76552, -176581, 183844, 77590, -56550, -80300, -182401, 67539, -272043, -36270, 139172, 127957, -51865, -249382, -34623, -69179, 124214, 286229, -202737, -16956, -115363, 51570, -110842, 256898, 19548, 118875, -210483, -169664, -120696, 14209, -129179, -391667, 140364, -227623, -192307, -208178, 128891, 41773]
19015c1555j78755N0709b1695j47030H9590Q9856f7171C5777a0419k47161A01831
19003a93448B82227a00222j12421A83010C2338J82471b67405c5198A6012b4522
18992g3254B33438b78498O7754c8573j81727H0953b48413k79306B86105a30217
18981c1519k34685A13790b04529B58640a44440B0358b69019g7497l31086C9643
18970e0619b3227m2431k03023A05076L2148g5415H2321e9332E12008h5030j9570
18959a04600n4478j22024h2470j20758e8885j16262A30812g3252A36414c44923
18948d7139A7757O3915a44906E9865b6561A99574K6580j8920l0195e3854B42118
18936A1394d2788B4895g8668a4693j56131K3745R368j37820A0449J44749B3309
$$ y = [-31555, -210310, -159601, -21695, -168725, 89590, 179446, -67171, 35777, -10419, -257580, 101831, -193448, 282227, -100222, -212643, 183010, 32338, 214809, -267405, -35198, 16012, -24522, -73254, 233438, -278498, -210744, -38573, -220300, 80953, -248413, -527719, 286105, -130217, -31519, -266204, 113790, -204529, 258640, -144440, 20358, -269019, -77497, -408583, 39643, -50619, -23227, -65658, -268681, 105076, 137224, -75415, 82321, -59332, 512008, -85030, -104600, -159078, -281102, -82470, -203228, -58885, -175147, 130812, -73252, 136414, -344923, -47139, 17757, 81672, -144906, 59865, -26561, 199574, 226154, 207234, 177039, -53854, 242118, 11394, -42788, 24895, -78668, -14693, -170824, -147079, -137711, -275531, 10449, 155198, 23309]
18924b0196k47811A08392a10760L5869k59942J61450A01847B9460b2254q9446
18914a11700N2442K6326j44775b0177k01769g6577k28468D8928m800Q4181a7785
18902a43478A60938a81504a1337k60747A64390B3103a99707P7640A22544a56709
18891B8899J3407O5280J2717a96823E2259a36161c5634a6965l10853H818i8982
18879g4352K46k55650J33830k5895g0994j90782h7810m82584a90486F6825B1273
18867B04862e7543D7652i0799C3529R4138J35657A13909b9091n9098j9706K6584
18856h1311A70472b011A36429g6997E8900h6460A03775L64448A88073k442d03373
18844a2322D8034g63C3239a52779A40534a04636q6281O2549C5639b60689B7524
$$ y = [-20196, -268007, 108392, -110760, -74891, -334833, -173383, 101847, 29460, -22254, -111700, -59258, -32932, -177707, -20177, -221946, -76577, -305045, 48928, 44128, 128309, -17785, -143478, 160938, -181504, -11337, -272084, 164390, 23103, -199707, -122067, 122544, -156709, 28899, 42306, 107586, 120303, -196823, 52259, -136161, -35634, -16965, -327818, 8818, -98982, -74352, -74106, -329756, -195926, -221821, -70994, -261776, -87810, -570394, -190486, 66825, 21273, 204862, -57543, 47652, -90799, 33529, 127667, 263324, 113909, -29091, -88189, -107895, -81311, 170472, -2011, 136429, -76997, 58900, -86460, 103775, 468223, 188073, 185631, -403373, -12322, 48034, -763, 33239, -152779, 140534, -104636, -190917, -128368, 35639, -260689, 27524]
18832B37424G0980e1968A89157h8119k7019D040e1801a4155B26091a57325n0587
18821b07912f1463j09054A20861A9823K1029J13950p3869b80864l7260D3697d2236
18809a07780A59062F6438a20106C01068a35840H2639c652j31605h523n1466j61097
18798b21086E157J56359A2516a28092A66692J02051g7044m7109j4915E919J18378
18787A24297b32376c1395A44167a79530c278F1557e6010j63722J00850j56886
18777b75768C6608b47318f0611I6081c97469J24807h5890B37347a41341N1666
18767h9675k65363c8440n4557r2256A34992i5764r4407B486K18581D5386K18727
18756B64113b6980A2425f701j96556g4585n9400p5666k44375G4825c79576A18436
$$ y = [237424, 70980, -51968, 189157, -88119, -115138, 4040, -51801, -14155, 226091, -157325, -207912, -61463, -170517, 120861, 19823, 40852, 154802, 80933, -280864, -318124, 43697, -42236, -107780, 159062, 66438, -120106, 301068, -135840, 82639, -3652, -135257, -8523, -59989, -221086, 5157, 161516, 12516, -128092, 166692, 268743, -77044, -124153, -139068, 5919, 124297, -232376, -31395, 144167, -179530, -3278, 61557, -56010, -219732, -118882, -275768, 36608, -247318, -60611, 96081, -397469, -272662, -85890, 237347, -141341, -89675, -355038, -38440, -92997, -185253, 134992, -95764, -190171, 2486, 221067, 45386, 264113, -26980, 12425, -6701, -203257, -74585, -133985, -209651, -454026, 74825, -379576, 118436]
18744b96146E0483O5970L48856b31360j80376i350A65095g7496c1198j23011A33162
18732a907j22096j6046B8846J85426a91647M6671j2059N3586D565J38307G52b88483
18719A71850b71350a20439C6773a80697O0504j33534P2311K3404A9562a32501
18708a5394l8219r556C2105b50811g2815q1563A66290c4872j94250A57487G8388
18696I3160m449a45164j17467B24751j06184e6992j98725a07423F4301M0801B9144
18684a55777A07734G95J44206E9709B5991a79797J7127O3982i552l1729k38733
18673b80014a25023F8321P9038a83691F6656O9055E5225J78412O5718a50241d0165
18661i1189D1597A1012b47260r6377a6911K805A29838b64010f7262H3679f8703
$$ y = [-296146, 50483, 116453, 465309, -231360, -411736, -9350, 165095, -77496, -31198, -154209, 133162, -1907, -124003, -140049, 28846, 214272, -191647, -144976, -157035, -103449, 4565, 142872, 752, -288483, 171850, -271350, -120439, 36773, -180697, -120193, -253727, -181416, -158012, 19562, -132501, -15394, -53613, -63169, 32105, -250811, -72815, -154378, 166290, -34872, -229122, 157487, 78388, 93160, 88711, -145164, -262631, 224751, 118567, -56992, -255717, -107423, 64301, 105102, 29144, -155777, 107734, 795, 145001, 59709, 25991, -179797, -162670, -98688, -9552, -41281, -280014, -125023, 68321, 147359, -183691, 66656, 135711, 55225, 233637, 299355, -150241, -40165, -91189, 41597, 11012, -247260, -343637, -16911, -14106, 129838, -264010, -67262, 83679, -68703]
18649h271k41672j76414a83189A05512a81250M9118a9609G8376d5577k80540A20621
18637c15919j30576a61657n9475k1155m46329h9755J3830j70070A17992a63034
18626a45548j33610J6443b5690A55324i010k29768B9931c7578B00662K4660a29591
18614B73874b61894G7912b98155B26493O9340F4435N3204L4267a43723K1654M8051
18603g4018o7205d2762o0655J8113B6696a05131B19922G8110e1092k07999k2475
18592b81566Q5150N782A11605K0898a02129G0517J05891F9502a47650p6924H0639
18580a132A1774J59315m3836q861b34455D0259J0137g7007n1990l7739f6911A01891
18567A14891d59918a43359e6612A75824a56046p8126A80435G1116J42985E0662
$$ y = [-8271, -249943, -426357, -183189, 105512, -181250, -132132, -19609, 78376, -45577, -326117, 120621, -315919, -446495, -161657, -221132, -242287, -688616, -89755, -75925, -245995, 117992, -163034, -145548, -279158, -262715, -25690, 155324, -9010, -238778, 29931, -37578, 200662, 225322, -129591, 273874, -261894, 77912, -298155, 226493, 295833, 64435, 117639, 151906, -143723, -122069, -74018, -141223, -42762, -103417, -85304, 26696, -105131, 219922, 78110, -51092, -259091, -281566, -196416, -190634, 111605, 132503, -102129, 70517, 176408, 69502, -147650, -224574, 80639, -1132, 11774, 171089, 127253, 118392, -234455, 40259, 50396, -77007, -128997, -166736, -66911, 101891, 114891, -459918, -143359, -56612, 175824, -156046, -234172, 180435, 71116, 214101, 50662]
18556b36485e0490k27417c5502B48041a09117q8371Q2804I1541k3726K3360a15688
18544g7765H9417h5925j0686l17963A34542B938e8874a8526A7441L7398P2921
18533A27760a29381A2821h7068I6399a48583f191k06723L3034J7357A31248A8630
18521H3338c06432g4350K7669p5609e7083E196Q5942a16117G4478c8269k4699
18510f2968k14846D9582a33494B9091b91827g0849k42790J9314e6607A87692c5970
18498a15871A2748h8911j68580c5506A93462B6767a85057G032a48065E7014a18597
18486B06910K00805a01936n6171j09811F8723J31221a78018j1181A27826j0824
18476A17002n7856k3812j2061a55702A82J45969b8015r0557I5405K2663b45587
$$ y = [-236485, -50490, -277907, -35502, 248041, -109117, -197488, -114684, 91541, 67815, 91175, -115688, -77765, 89417, -85925, -96611, -414574, 134542, 2938, -58874, -18526, 17441, 54839, 127760, -129381, 12821, -87068, 96399, -148583, -6191, -212914, -179880, -162523, 131248, 18630, 83338, -306432, -74350, -46681, -122290, -57083, 5196, 91138, -116117, 74478, -38269, -62968, -277814, 49582, -133494, 29091, -291827, -70849, -313639, -294325, -56607, 187692, -35970, -115871, 12748, -88911, -257491, -35506, 193462, 26767, -185057, 7032, -148065, 57014, -118597, 206910, 407715, -101936, -158107, -267918, 68723, 199944, -178018, -189199, 127826, 117002, 59146, 35334, 23273, -155702, 182, 146151, -28015, -118572, 95405, 118068, -245587]
18464E1837a9633D4123c25738j2990O5170H3972h0414B77626F4098J53095c8123
18452c38703F4573b38542c2916p8926c2593A66658b3301A82532b9013B273e5176
18440A56511b0020l77231d8390D6376K31756E9865d8814l12149d3514j08107M0415
18429a11206b784A7653b15750F4973b07385A33039b93068R7659A66676h0748G8220
18417a50161A34177b06086E4741b53943h7044e452j94688I3680a9585j16711k12814
18406c49110A11930b15441H03i8852k87707c7118J2286A87067b11778j4119l3355
18395b59252G8226e5303p5463j33864A86943B7941O9966a32696A08685J39381
18385B48066b04613O4852a1958m7283k09602A40854J67099a88961F8371b22448
$$ y = [51837, -19633, 44123, -325738, -338728, -273558, 83972, -80414, 277626, 64098, 217193, -38123, -338703, 64573, -238542, -32916, -111842, -32593, 166658, -23301, 182532, -29013, 2273, -55176, 156511, -20020, -397251, -48390, 46376, 278132, 59865, -48814, -360963, -43514, -151621, -111206, -2784, 17653, -215750, 64973, -207385, 133039, -293068, -195409, 166676, -80748, 78220, -150161, 134177, -206086, 54741, -253943, -87044, -5452, -200140, 93680, -19585, -136296, -349110, 111930, -215441, 803, -98852, -386559, -37118, -24832, 187067, -211778, -225897, -259252, 78226, -55303, -130766, -264630, 186943, 27941, 97907, -132696, 108685, 248066, -204613, -139761, -11958, -59241, -268843, 140854, 307953, -188961, 68371, -222448]
18374a53757l31806a23644a579j19150a5276J397k38855b7737B9229j552A2429
18362A1576a49855c7442Q335A94340c51316b6574j51578p0789g7855A33009F0595
18350a67363P5839j73017i3230K4144A62723c53414E5592a28294L2229b5498C7437
18338A29490c6530A32547A3391e7451I7992d0010q9433F343J20905a9655B02318
18326E6748b78613C5911J0626P257J66354C9747a29893K8193c5871j07399B41475
18314b9254C5087d30142C7550b3343F0174B9623J59749a42718j3607q2672A10054
18302a11498L9059G9442a36899C28877b2861k2692n0169o318k03381F7726a19974
18290C99796a43143I6571A6452K69347d24350a87063j16356A80706C3397a96503
$$ y = [-153757, -485563, -123644, -1579, -120729, -15276, -13879, -252734, -27737, 29229, 27677, 12429, 11576, -149855, -37442, -29107, 194340, -351316, -26574, -178152, -248941, -77855, 133009, 60595, -167363, -91524, -264541, -93230, -69086, 162723, -353414, 55592, -128294, -96065, -25498, 37437, 129490, -36530, 132547, 13391, -57451, 97992, -40010, -129443, 6343, 127248, -19655, 202318, 56748, -278613, 35911, 46537, 53794, 220148, 39747, -129893, -101700, -35871, -143270, 241475, -29254, 35087, -430142, 37550, -23343, 60174, 29623, 189372, -142718, -156325, -238997, 110054, -111498, -72439, 79442, -136899, 328877, -22861, -45553, -95722, -102040, -305421, 67726, -119974, 399796, -143143, 96571, 16452, 285799, -424350, -187063, -303419, 180706, 33397, -196503]
18279C9804d4135A29040a32482a2089j14720J2195P173m1962j08332A72092b90012
18267i912m4626C9752K19522B32a22063A51982b80185E8201i9293M9638E5759
18255E2935K64198F9335a03882a3523q1482k15467A26693f0291K2287k47398Q9102
18244a96300c3907h283l05054B18955a78514g7615j02371J7947B17562I6630b249
18232h9624C05179a29754l02711J12276A3062h8129a3123B58549B1176L7836M7369
18221A06381P4823m6109l4854a21097N2354k37879B81216A08533a2005l71096
18211c83101C97852a45986M4080G1718i5129c1206k1717I460L955L97351A1051
18199A31175e2558o1504N5438A12422m1269Q5914J77683a87450O8119J5377j9863
$$ y = [39804, -44135, 129040, -132482, -12089, -126809, -114614, -107441, -149403, -257735, 172092, -290012, -9912, -54538, 39752, 259274, 232, -122063, 151982, -280185, 58201, -99293, -49655, 55759, 52935, 317133, 69335, -103882, -13523, -95005, -310472, 126693, -60291, -38004, -285402, -196300, -33907, -8283, -313337, 218955, -178514, -77615, -179986, -162039, 217562, 96630, -2249, -89624, 305179, -129754, -432465, -320189, 13062, -88129, -13123, 258549, 21176, 59012, 106381, 181204, 135095, 100241, -121097, -68743, -306622, 281216, 108533, -12005, -383101, 397852, -145986, -101906, 71718, -95129, -31206, -52923, 9460, 13415, 410766, 11051, 131175, -52558, -114062, -58624, 112422, 71153, 157067, 334750, -187450, -119331, -103954, -123817]
18188a23817A09333O0197b21579j75827F5937b4006q7265b9418n3350L5673j69757
18177b16852Q5446A54682o4459a1345F5084j7965J8456E881c23860a08370l1273
18166a39643A1107b2186j016p7405k13548i6364b9252j48924O449H6690b75442
18154a90051A83349b36109B39170b41764P6953q1238K7497B21651b72836G4781
18143E1385j3025a97663A88986a19450A09101c7419A92339o6819D407a6507D9921
18131c9560A3656A012P7917f0200B59860A22409l1486P1793a537E6608d4772n8509
18119a03281A01691J0745b04385h2593k68900B23410a76783O4153m5300A72415
18108a32284A27253M1314c37806B4574d6298E07002a82751n6261D6694a06324
$$ y = [-123817, 109333, 169530, -221579, -397406, 65937, -24006, -111271, -29418, -82768, -47095, -216852, -131406, 154682, 90223, -11345, 65084, 47119, 65575, 5881, -323860, -108370, -139643, 11107, -22186, -23202, -100607, -314155, -96364, -29252, -178176, -171727, 86690, -275442, -190051, 183349, -236109, 239170, -241764, -164811, -246049, -218552, 221651, -272836, 74781, 51385, 38360, -197663, 188986, -119450, 109101, -37419, 192339, 125520, 4407, -16507, 49921, -39560, 13656, 1012, 78929, -60200, 259860, 122409, 90923, 162716, -1537, 56608, -44772, -103281, 101691, 112436, -204385, -82593, -351493, 223410, -176783, -112630, -157930, 172415, -132284, 127253, 168567, -337806, 24574, -46298, 507002, -182751, -239012, 46694, -106324]
18097A9476c7824l77526B58511b9244C35024e206k22205j3272l65544i2594H9662
18085A72068d5394j87301A2330O5145a11679e0337j81148J13281l5800J6974A18304
18073B06299m0485c4295j26625D13241f6635K2260E4962J03305d91527B03466
18062C13906b22183A55909N1986a29913A98327d7848j34038E8506a18612b6498
18051a98162A78821a38521A60462E0232f4764N532B72982G7379b75738E8657b72135
18039b86174Q4022i0760A89360f161C01499b86486Q7471A35735j1877d8861m9209
18028i8070l6700D60927j83856b70879F3623i9630K6482j88972J30873j34405
18018b65652B51883f9887D344e6698k1341C6855J38961E4126b4490A40330J31758
$$ y = [19476, -37824, -415350, 258511, -29244, 335024, -5206, -227411, -240683, -606227, -92594, 89662, 172068, -45394, -232695, 12330, 77475, -111679, -50337, -231485, -118204, -154004, -137030, 118304, 206299, 165814, -34295, -160920, 413241, -66635, -44375, 54962, 158267, -491527, 203466, 313906, -222183, 155909, 207895, -129913, 198327, -47848, -181886, 58506, -118612, -26498, -198162, 178821, -138521, 160462, 50232, -64764, -59232, 272982, 77379, -275738, 58657, -272135, -286174, -202152, -90760, 189360, -6161, 301499, -286486, -199015, 135735, 123858, -48861, -98070, -134770, 460927, 277071, -270879, 63623, -99630, -73148, -262120, -131247, -265652, 251883, -69887, 4344, -56698, -78039, 36855, 175816, 54126, -24490, 140330, 272088]
18007B72088R6730j76117a45007O555k44823a39921m6974E5691b09966b0548j95919
17996b16467B0062J80285a18345b0899A05133E327a02080j16196c7315M118C96897
17984C6785b10646R8242E2264R1848a564G2975a68013O0068M0479j22463j07842
17973b97771B75876a87299d3826A49806c5110B02837F3241b55074B95226b04165
17962c5697m954k25309I2535e5695o9261b9115m3807a3890n0743A49442a40296
17950A29402b20160G5610f1115k38672G6996b21728C0969i8880A14238b03668
17939f5410j48440M8707d0697C83041i3933B35137d08653H3048B2038J75941a11317
17927F9700j1912a19318M8219H005K22956p8662c2887k07785K4619l1528A67079
$$ y = [272088, 368818, 192701, -145007, -138452, -383275, -139921, -186895, 55691, -209966, -20548, -216467, 20062, 200347, -118345, -20899, 105133, 5327, -102080, -218276, -37315, -33197, 396897, 36785, -210646, -112404, 52264, 144112, -1564, 72975, -168013, -107945, -67466, -189929, -297771, 275876, -187299, -43826, 149806, -35110, 202837, 63241, -255074, 295226, -204165, -35697, -40651, -265960, 92535, -55695, -124956, -29115, -72922, -13890, -64633, 149442, -140296, 129402, -220160, 75610, -61115, -299787, 76996, -221728, 30969, -98880, 114238, -203668, -65410, -213850, -165143, -40697, 383041, -93933, 235137, -408653, 83048, 22038, 197979, -111317, 69700, 57788, -119318, -71099, 8005, 230961, 152299, -32887, -240672, -216053, -247581, 167079]
17915B43518c40275h6015C28955a34095B91846B4693P8169a8046A25168h4168
17904d23617h0758B19580a23789E9280J2465K9534a43964o8624n2888G5110f387
17892C10985a19097c1126j1069l93752F5138i9940l4865B6905J6672g3345o5396
17881a38741j0408E5271b37837G733b78117i0764o3609q7794A0664L7146b31691
17869A81342H0607d3827k21595J19614C94428a63327P8530B32256e5847C88154
17858d4503m117O526a2787j14460d1288B80957a48328j44645a15213A16286J53375
17847B69661a48207E0674a01418k22180C1210d0839A42910a17368e6939C46314
17836a18397c1414E633d2762a1856l4670h142A47323b91065K8649B87473D5526
$$ y = [243518, -340275, -86015, 328955, -134095, 291846, 24693, 102862, -18046, 125168, -84168, -423617, -80758, 219580, -123789, 59280, 71745, 101279, -143964, -212588, -265476, 75110, -6387, 310985, -119097, -31126, -42195, -435947, 65138, -99940, -134805, 26905, 43577, -73345, -138741, -149149, 55271, -237837, 7733, -278117, -90764, -154373, -242167, 10664, 47810, -231691, 181342, 80607, -43827, -265422, -145808, 394428, -163327, -84797, 232256, -55847, 388154, -44503, -48620, -42094, -12787, -127247, -41288, 280957, -148328, -292973, -115213, 116286, 269661, -148207, 50674, -101418, -323598, 31210, -40839, 142910, -117368, -56939, 346314, -118397, -31414, 5633, -42762, -11856, -46526, -8142, 147323, -291065, -262416, 287473, 45526]
17824B5076g1126p2871a8738m3766o9958B59964a0260B70838C9363b5177E4376
17812A75341k8802P4113o3597c01704R9194B90486d2175A24907d1653k74490C7172
17800A65423J22234b9462o0309o7087a0763j31058D17542A46617a91420j7548
17790b08968j75644J02834J19231C9196M9519a17061A64145J80021c5144m8852
17780h3996r3384j51726E344a72351k33165A30196a04908J3715F3276P4901a30313
17768I8358K0206J34281a48650m037A87745b98314R2424H9854P298R2371b5138
17756b47969J18943j94549A17720d1304A39680L04031A94942A7752b14498l1771
17746b46269L4885E616i7782q2876N4240M1169A3160N1430J3692f9902c0982B79369
$$ y = [25076, -71126, -143997, -18738, -62504, -132462, 259964, -10260, 270838, 39363, -25177, 54376, 175341, 146539, 220652, 157055, -301704, -202510, 290486, -42175, 124907, -41653, -316143, 37172, 165423, 287657, -29462, -89771, -156858, -10763, -141821, 417542, 146617, -191420, -208968, -384612, -281778, -162547, 39196, 88715, -117061, 164145, 344166, -35144, -83996, -177380, -329106, 5344, -172351, -405516, 130196, -104908, -91193, 63276, 138177, -130313, 98358, 118564, 252845, -148650, -152687, 187745, -298314, -205890, 89854, 97152, 189523, -25138, -247969, -129026, -323575, 117720, -41304, 139680, 443711, 194942, 17752, -214498, -246269, -211384, 5616, -97782, -180658, -126418, -85249, 13160, 64590, 78282, -69902, -30982, 279369]
17733b6970A54685l7089b3398A52240a0068j3521A19924a47447q7798k6602B5821
17721a33264d8211a7761E4366b96156f3240p3194H3247e3865C06367A45552E2599
17709D9985K86808g4057J016A93675a03777G63N8660b99191C12264a60881c2406
17697b358E1054i0412A77265H3771j410K81345A52882a82678a2288j45134c2223
17685A24391l4486J7422b80728J36375C7190J90258b2708F6776g6908e56H9077
17673a25625e5146K3263q1979F0055e2178E0376k2415a47083a7280j26150L4180
17662a09250M2594A24666K21632f7436B06536H5533b28780M3537B86578d8992
17651b03016C5069d5715G0016M3156B3643c05806J01464A42265k641h7691B68154
$$ y = [-26970, 154685, 117596, -23398, 152240, -10068, -23589, 119924, -147447, -235245, -261847, 25821, -133264, -48211, -17761, 54366, -296156, -63240, -136434, 83247, -53865, 306367, 145552, 52599, 49985, 336793, -74057, -73041, 193675, -103777, 763, 59423, -299191, 312264, -160881, -32406, -2358, 51054, -90412, 177265, 83771, 82361, 363706, 152882, -182678, -12288, -157422, -32223, 124391, 89905, 107327, -280728, -144353, 37190, 227448, -22708, 66776, -76908, -556, 89077, -125625, -55146, -31883, -113862, 60055, -52178, 50376, 27961, -147083, -17280, -143430, -109250, -66656, 124666, 346298, -67436, 206536, 85533, -228780, -185243, 286578, -48992, -203016, 35069, -45715, 70016, 113172, 23643, -305806, -204342, 142265, 139624, -87691, 268154]
17639a29520N2105k7276a9119l5941A9274L3193A8525o140O1085B9457a01087
17627c134r6269G9411g682G7632R3672h2654E8226O8939C8481K50193j00650g8488
17614A03087B6974b1379A76333h0653j46317K4618A05756C6658K58819b5708M025
17603b1683I2773C6563J55543c50677A62611c34023B15265J48338j21874a657
17592A98313D7726N4095K9280C9713o133a56857e5744F1603a69394d7083A23780
17580g2480A4588N1077R6130F8671L29999a52465A34441a6041k69602c0153j67223
17569a97376f9101j47654A10556e8840B2768K17998A05219L1556R3597b12665
17558B0077f7546A85179a52111j7850B20181a04287G8631d6929r0260A41330E3419
$$ y = [-129520, -77415, -104691, -19119, -55060, 19274, 52467, 18525, 12385, 73470, 29457, -101087, -3134, -99403, 79411, -7682, 77632, 171304, -82654, 58226, 127165, 38481, 288674, 188024, -78488, 103087, 26974, -21379, 176333, -80653, -226970, -202352, 105756, 36658, 295477, -25708, -21683, 92773, 36563, 192106, -350677, 162611, -334023, 215265, 363603, 241729, -1657, 198313, 47726, 101821, 131101, 39713, 33580, -156857, -55744, 61603, -169394, -47083, 123780, -72480, 14588, 65665, 161795, 68671, 398670, -152465, 134441, -16041, -285643, -30153, -197376, -69101, -216755, 110556, -58840, 22768, 240766, 105219, 136775, 230372, -212665, 20077, -67546, 185179, -152111, -169961, 220181, -104287, 78631, -46929, -137189, 141330, 53419]
17546b7517C05100j29286j3588G8816P609J74k7436B3604J90407q6385E2041b6605
17533A09450a9653D24355i2272E6296M997a95883A66176o7285J03613H1233g2421
17521I492J28619b05073B3909g8692A25195Q8899D6250a47590J0817A35992a72341
17509a66364A92471K08650c6211m6768p6955I5076N4529a2737G8175J11022m4992
17498A44205f603B87694E763J45271K038P0045a40231B43530J13750i2550A03354
17486C93676b10886A58532J58425a87211K9958I9546k9963j9237Q5259l9071J87571
17475B84105j15168n8778N5225J02392A0940P7474A8194K59847m0466D2161a55776
17463C85852n6647l8376b5257o4028a6588c110G5544k5106O2872J8839L66573
$$ y = [-27517, 305100, 175814, 162226, 78816, 86425, 86599, 59163, 23604, 214011, 127626, 52041, -26605, 109450, -19653, 424355, -92272, 56296, 61293, -195883, 166176, 98891, 202504, 81233, -72421, 9492, 138111, -205073, 23909, -78692, 125195, 214094, 46250, -147590, -136773, 135992, -172341, -166364, 192471, 401121, -36211, -82979, -159934, 95076, 149605, -12737, 78175, 189197, 144205, -6603, 287694, 5763, 151034, 153072, 223117, -140231, 243530, 357280, -92550, 103354, 393676, -210886, 158532, 316957, -187211, -157253, 99546, 69583, 50346, 135605, 96534, 284105, 168937, 110159, 165384, 267776, 10940, 88414, 18194, 278041, 237575, 42161, -155776, 385852, 329205, 290829, -25257, -89285, -16588, -3110, 75544, 50438, 113310, 132149, 498722]
17452D98722k09612K50009A80732K03031A6429k521c50C79044E9154J92204l3796
17441B17562o5597K30671H8939c11662B14274p0085K64213A10873O6585J26752
17431C04210j46516J16659I6686K87648a3857A80586L96090B06409M8325n6720
17421A98014k7773L6009C4214R2661L21760A11533n3740L36744C8032N26893I8582
17409B28600f1888o349B17094L0018c50832B6003a0219I5081k4030h6417B97885
17397E58621C5559N4198j9553J85549m1439m7732E4037J03885K37902a30618B52937
17385H5645J20642Q6842b2982B16146h3506B88321r3295g8761A21896L1926E0195
17373B57776p4799a36703C46107L4232j75963J62567A8768K17510H6081c1052
$$ y = [498722, 289110, 539119, 180732, 383763, 16429, 13908, -350, 379044, 59154, 251358, 217562, 151965, 382636, 88939, -311662, 214274, 144189, 408402, 110873, 177458, 304210, 157694, 274353, 96686, 384334, -13857, 180586, 576676, 206409, 254734, 198014, 170241, 206250, 34214, 126875, 448635, 111533, 57793, 394537, 38032, 564925, 98582, 228600, -61888, -68237, 217094, 247112, -350832, 26003, -10219, 95081, 71051, -86417, 297885, 558621, 35559, 89757, 70204, 255753, 214314, 166582, 54037, 157922, 395824, -130618, 252937, 85645, 206287, 293129, -22982, 216146, -83506, 288321, 195026, -78761, 121896, 153822, 50195, 257776, 182977, -136703, 346107, 380339, 204376, 366943, 18768, 236278, 86081, -31052]
17362B67314e4815A84890l0357E9259a12219D9569N13105A3258N5644L64425A98305
17350F0835h019A81787l6696J75113C815M7626g5858C8705Q7885q850m8527K50034
17338C19247b57405d4837B10004b1371o865D6046J14578J1454l6507Q1049o0345
17327A56275K50495E4681a30751B13194c7347l6202B83428J40584A73727R3858
17317B67585K92484A81947b43542I615h1498D1746J67402a79639A765b91547f9229
17305a82954C20109B7666J07326d3535A25458K66809J99331a02264E1289a63457
17294a20378B5725P1171K70419a00304A73537a58325D1297J03081L35978k12753
17284B67603J5639J5099A47265J96089q8647p8767J87479A15804J36439j13214
$$ y = [267314, -54815, 184890, 154533, 59259, -112219, 49569, 562674, 13258, 68902, 433327, 198305, 60835, -8019, 181787, 145091, 320204, 3815, 51441, -75858, 38705, 126590, 117740, 69213, 319247, -257405, -44837, 210004, -21371, -28236, 46046, 160624, 172078, 135571, 216620, 156275, 406770, 54681, -130751, 213194, -37347, -73549, 283428, 424012, 173727, 267585, 560069, 181947, -243542, 9615, -81498, 41746, 209148, -179639, 1765, -291547, -69229, -182954, 320109, 27666, 134992, -43535, 125458, 392267, 591598, -102264, 51289, -163457, -120378, 25725, 96896, 367315, -100304, 173537, -158325, 41297, 144378, 480356, 267603, 283242, 298341, 147265, 343354, 254707, 175940, 363419, 115804, 252243, 139029]
17274A39029L895g9804A65389j2868B0685K16575a12349p232C79622j68625L7613
17263B48610M297J73704a1564A55621a62656E9566d5929k2940j1375A53859J14873
17252B68732A28408l4015N1911a09455d5382H2821A467M67392k32837D1926L9892
17241H1818L05835A34405L19910A30619K47173E1187O4181O9876M2417A9949J04424
17230A24373J37702b3526R69B59683A00215L30095j13447c6765B62556a72180
17219A97549K43890f213B94515F2771d5369B06164d519A05856M15209q0332j40794
17208B99939K83234A39980K21923j58204K75189A73974L73828B12356I8611J50894
17198B49505E7421R3436E1862O5529J81512p7575O8265F598J53517R2003J43177
$$ y = [139029, 142924, -79804, 165389, 152521, 20685, 237260, -112349, -119581, 379622, 210997, 248610, 252907, 426611, -11564, 155621, -162656, 59566, -45929, -68869, -80244, 153859, 268732, 128408, 94393, 146304, -109455, -45382, 82821, 1467, 468859, 236022, 41926, 81818, 387653, 134405, 454315, 130619, 377792, 51187, 115368, 185244, 227661, 19949, 124373, 262075, -23526, -22557, 259683, 100215, 430310, 316863, -36765, 262556, -172180, 197549, 441439, -6213, 294515, 62771, -45369, 206164, -4519, 105856, 521065, 440733, 299939, 583173, 139980, 361903, 203699, 478888, 173974, 547802, 212356, 98611, 249505, 57421, 150857, 51862, 117391, 298903, 221328, 289593, 6598, 160115, 252118, 395295]
17187C95295B8234a03322C49272A45507o4677K40335G5173J53784D2178a91786
17176A28589Q2225r2643L55288a1772C72278A74028J51443C8459J02112J9272
17166A59843m219J93550j68657h247D49784B6594M02260K13021B95372O9827j19865
17155B45334L48298j19964Q3999B70116c6436C52376J25212j33854j06214k5232
17145B12288J64569A48772Q6592M3558N5593P6533A89467K04106q9164m2612K12949
17134D74746q9604A31511K83815A44705M21501B62776j3323r5769P3716N8661
17124B86061G1960K86585N6346Q4085K8396A82272J0383M18566B59682J01896
17114C61578N1041A63071M37488k00525m9266E5803J87672J87713f7383C22001
$$ y = [395295, 28234, -103322, 349272, 145507, 80830, 321165, 75173, 228957, 42178, -191786, 128589, 210814, 118171, 473459, -11772, 372278, 174028, 325471, 38459, 140571, 159843, 155624, 349174, 180517, -8247, 449784, 26594, 428854, 641875, 295372, 365199, 245334, 593632, 473668, 557667, 270116, -36436, 352376, 477588, 343734, 237520, 212288, 376857, 148772, 235364, 278922, 334515, 411048, 189467, 393573, 304409, 261797, 474746, 385142, 131511, 415326, 144705, 566206, 262776, 249453, 153684, 227400, 286061, 71960, 358545, 414891, 498976, 527372, 182272, 192655, 611221, 259682, 361578, 412619, 163071, 600559, 400034, 350768, 55803, 243475, 431188, -67383, 322001]
17103A10965M91100B91165k8704n3072O358k5727B7228N05199k23769G1635L01304
17092C72939J25R6999j59164J90024r7430N1733j35995A40287J35645R6657N9593
17081D32182B04030J67628L99177l50621M45703C92891j11957Q6028J03311A31938
17070B81799K31509l2468K24922B65137K32263Q0008k59795L25798j73525B34238
17059E12849k41843Q0296K9657K36002J93137B88797K22658J9319N7492o8349
17049E19917K40022k43256A03215P54994j55081B36433N84246l83158j62925R7264
17039C71860J11170N03057D01253K16654j46444P8380j16389K07987B75139l3493
17029B41646N0744L04474j81551L79695J46908j97595o3641j81823M6162q2846
$$ y = [110965, 602065, 291165, 262461, 209389, 215747, 190020, 27228, 532427, 308658, 71635, 372939, 373064, 470063, 310899, 500923, 403493, 455226, 319231, 140287, 275932, 372589, 432182, 204030, 371658, 770835, 420214, 865917, 392891, 280934, 366962, 470273, 131938, 281799, 513308, 480840, 705762, 265137, 497400, 577408, 317613, 643411, 469886, 234238, 512849, 271006, 351302, 380959, 616961, 810098, 288797, 511455, 530774, 588266, 519917, 759939, 516683, 103215, 858209, 703128, 236433, 820679, 437521, 274596, 371860, 483030, 986087, 401253, 617907, 471463, 549843, 433454, 641441, 275139, 241646, 292390, 596864, 415313, 795008, 941916, 744321, 680680, 498857, 545019, 462173]
17019D62173M86579l27030K28222o9504J3598j58346M4219J49387k03366K45687
17009H71619l87155J59975k44290L33204l0528j21766L47253q8501k27519j485
16999F10807R3449k9208C08688M48641K86630k83853J88143k53986n7146Q8864
16989G25981O8607Q644k06489K08006j02555o0034K6247Q4892M2437j79121M16586
16978A033201l31665j0547L13269j00067q0162K24450o857l01992K75987m33125
16968E82492J12666Q7188L3594j6562L50139j77573l07614J81863j04551L74877
16958A116519k22011O4148L4499Q8177R1646j59074Q2899J1902m01831J96537
16948I03411J4209O4822J9138j26561j69143K47213o5561R9548K96503R0402q9920
$$ y = [462173, 948752, 621722, 849944, 780440, 794038, 635692, 679911, 829298, 625932, 871619, 484464, 644439, 400149, 733353, 702825, 581059, 928312, 839811, 612292, 610807, 704256, 675048, 308688, 757329, 1043959, 760106, 948249, 694263, 637117, 725981, 794588, 803232, 596743, 804749, 702194, 642160, 668407, 753299, 795736, 616615, 1033201, 701536, 690989, 1004258, 904191, 824029, 1048479, 1041622, 739630, 1015617, 582492, 695158, 782346, 815940, 799378, 1149517, 971944, 664330, 846193, 741642, 1116519, 894508, 958656, 993155, 1081332, 1172978, 1013904, 1096803, 1108705, 706874, 903411, 917620, 982442, 1001580, 875019, 705876, 953089, 887528, 987076, 1283579, 1373981, 1284061]
16937A284061J73701m19527J57839K07139j51532k10428J0991K78865J02313j80213
16927A253209O4904J73432l57550k20893J90782J67987l03872L89643J06294k18593
16917A245343j01294K14744L80338k86187j74212K50683J80570m69841M56895
16908A697039k34932P0109l41410L09804l31965L10584J08652j2904L5402J74282
16898A784661k11510K07176n3008r9708P0321L17763q1563k52307J00175j2251
16888A769749K63564l46526K73894n3911N355k1557K91622j10949l3251P8606
16878B116596j68891L23276o22189N07027j26810M34492k72717Q2836J88679K68856
16868B731155k75778j87866L66189K84966m12499L17006j68919J46718k44128
$$ y = [1284061, 1457762, 1038235, 1196074, 1403213, 1251681, 1041253, 1052244, 1331109, 1433422, 1253209, 1318113, 1491545, 1133995, 913102, 1103884, 1271871, 967999, 1357642, 1463936, 1245343, 1144049, 1358793, 1739131, 1452944, 1278732, 1529415, 1709985, 1240144, 1697039, 1462107, 1532216, 1190806, 1500610, 1168645, 1479229, 1587881, 1574977, 1610379, 1784661, 1573151, 1780327, 1727319, 1627611, 1697932, 2015695, 1934132, 1681825, 1782000, 1769749, 2033313, 1686787, 1960681, 1906770, 1912125, 1890568, 2182190, 2071241, 2037990, 2116596, 1947705, 2270981, 1648792, 2155819, 2029009, 2463501, 2190784, 2273620, 2462299, 2731155, 2455377, 2267511, 2633700, 2918666, 2506167, 2823173, 2654254, 2800972, 2556844]
16859B556844L63905l60355J38922L39568n65169L59968Q0119J60045K3822k24047
16849B873622M30506N0534k50800P7594J93340j68169M14196J62663k14154l37167
16839C232165N34222l3301R7986l8279J23591k9858K20118K91825l67244Q1688
16829D112913J75290j26540M40685j75158L24927l5917J61665l5511N2992K77631
16819E172977J28501m50776N40996P5540J27887O7783J10128N20732J14965j1524
16809F397209K61999k19658J37983J42602L7670L09108J27954j3372M40814l9769
16799G582540J86506L85136N955M47079o9122K39482O06927j63975L66771r6786
16789I490513O05980L29815L05183J07782K23350M92973M89628r291N33622L41614
$$ y = [2556844, 2920749, 2560394, 2699316, 3038884, 2473715, 2833683, 2913802, 3073847, 3097669, 2873622, 3304128, 3354662, 3103862, 3181456, 3374796, 3206627, 3620823, 3783486, 3569332, 3232165, 3766387, 3733086, 3831072, 3792793, 3916384, 3886526, 4106644, 4398469, 4031225, 4112913, 4288203, 4161663, 4602348, 4427190, 4752117, 4716200, 4877865, 4842354, 4895346, 5172977, 5301478, 4850702, 5391698, 5467238, 5595125, 5662908, 5773036, 6293768, 6408733, 6397209, 6659208, 6439550, 6577533, 6720135, 6757805, 7066913, 7194867, 7181495, 7622309, 7582540, 7769046, 8154182, 8160137, 8607216, 8538094, 8777576, 9384503, 9220528, 9587299, 9490513, 10096493, 10426308, 10731491, 10839273, 11062623, 11555596, 12045224, 12035933, 12569555, 12911169]
16779A2911169K74499N21543L62789M30099L45719O81901O5006O99496O09503
16770A6901724N16914O32019O06629R20495J15400O20222J089319O79508Q66724
16761B2948954Q83951J195640R08989J088596R31464Q46903J785979P25701J754539
16752C3070716J519009J226997J741553J915013K111673J886864K333341K069353
16744D7874519K343016K879595K838961L519340K814990L451586M206874M201498
16736G4130379M381344N019999M825279N549144N848424O363429O620513P226199
16728A19964710P567582P611081Q378337Q315238Q249218Q359479Q573465P722665
16720A84741775P424869N946787N373112L691640K253234O85771q20845k559868
$$ y = [12911169, 13185668, 13707211, 14070000, 14500099, 14845818, 15527719, 15592725, 16292221, 16901724, 17418638, 18050657, 18657286, 19577781, 19693181, 20313403, 21402722, 22082230, 22948954, 23832905, 25028545, 25937534, 27026130, 27957594, 28804497, 30590476, 31316177, 33070716, 34589725, 35816722, 37558275, 39473288, 41584961, 43471825, 45805166, 47874519, 50217535, 53097130, 55936091, 59455431, 62270421, 65722007, 69928881, 74130379, 78511723, 83531722, 88357001, 93906145, 99754569, 106117998, 112738511, 119964710, 127532292, 135143373, 143521710, 151836948, 160086166, 168445645, 177019110, 184741775, 192166644, 198113431, 203486543, 207178183, 209431417, 210117188, 209296343, 206736475]
16712B06736475m331294n548972o487840p522173q112072q577984q995941q620907
16704A48539292q417195q829406q225950p644173p269366o799619o672619n654344
16696H9026620n606053n479925m604764m248236m182622l983464l114232l597890
16688E4209434k890394k363916l208331k228623k183386k241578j977031j901393
16680C5214782j606252j494608j647787r43139j530452j372551j201948q12916
16672B4605129j198826q61991r28807o70587j178696n83741n89486p75302q09507
16663A7008186m79985q98513j63420r87114l00961k96717l38690q16872k90453
16654A2435461m39118k24157j63484o49937m26366n4373l03923n19296k6409l13476
$$ y = [206736475, 202405181, 196856209, 190368369, 182846196, 174734124, 166156140, 157160199, 148539292, 140122097, 131292691, 123066741, 115422568, 108153202, 101353583, 94680964, 89026620, 83420567, 77940642, 73335878, 69087642, 64905020, 60921556, 57807324, 54209434, 51319040, 48955124, 45746793, 43518170, 41334784, 39093206, 37116175, 35214782, 33608530, 32113922, 30466135, 29522996, 27992544, 26619993, 25418045, 24605129, 23406303, 22544312, 21615505, 20944918, 19766222, 19182481, 18592995, 17817693, 17008186, 16528201, 15629688, 15466268, 14479154, 14178193, 13881476, 13542786, 12725914, 12435461, 11996343, 11772186, 11608702, 10958765, 10532399, 10478026, 10174103, 9654807, 9628398, 9314922]
16644I314922j49657j44494k06957k17349l07718m97984J9509l36435r4174n20146
16634F859517N2698j1188l96945p2846k72143j67664q5828l05425J5365l76137
16624E239404M89689m32223M649j96925m1443l1634n300p33971J52904K1196L732
16613D470078o8348k72416l5232R3983k55103j25610K64766k86625p8232R5032
16603C802293k56828r5270J35004k2574j48384m46664M50338n46417K45427p7332
16593C039593k23943l3491J95832L28063m77902o785j56608n0848k03579N8055
16583B468387r7687J24964k2758r4727J07784q8731j40681j6978L0020l80843
16573A888750J77030K00224o2761j92290M8506P6034r0916l63661J61165o0953
$$ y = [9314922, 9165265, 9020771, 8813814, 8596465, 8288747, 7790763, 7810272, 7473837, 7379663, 6859517, 6912215, 6901027, 6504082, 6431236, 6159093, 5991429, 5905601, 5600176, 5615541, 5239404, 5729093, 5296870, 5301519, 5104594, 5063151, 5031517, 5026217, 4292246, 4445150, 4466346, 4470078, 4401730, 4129314, 4094082, 4188065, 3932962, 3807352, 4072118, 3785493, 3707261, 3802293, 3545465, 3450195, 3585199, 3562625, 3414241, 2967577, 3417915, 2871498, 3116925, 3039593, 2815650, 2782159, 2977991, 3306054, 2828152, 2821367, 2664759, 2613911, 2410332, 2468387, 2370700, 2495664, 2472906, 2378179, 2485963, 2397232, 2256551, 2239573, 2269593, 1888750, 2065780, 2266004, 2203243, 2010953, 2059459, 2135493, 2044577, 1680916, 1842081, 1781128]
16563A781128K0800p5444k8510l73722Q62780o77083K00600N4852J0725J31186
16553A907312j69406l48058L96763K15676m81480j84121Q0136K80987l7781o7032
16543A592996m11139K16945j275J05340j76086L959j98375L01393l7099j14834
16533A281825l0979K567P4791Q2238k19472l92332Q91134n06988q9488o2195L62516
16522A393617k51387k41474J17885p1921M57074m13466K54696m698m61043O55795
16512A435078n74395p358L92808k79648J42931j37852j99921P7003K8728J56982
16502A034356l17267k9686L7771O7476K55270m5595N5477j71360Q806j50370K6645
16491G71523L3121J36707L0308m85498L72509J23854p660m54471K81993j73714
$$ y = [1781128, 1801928, 1726484, 1697974, 1324252, 2187032, 1509949, 1710549, 1765401, 1776126, 1907312, 1737906, 1389848, 1786611, 2002287, 1520807, 1336686, 1416822, 1697809, 1660028, 1592996, 1181857, 1398802, 1397527, 1502867, 1326781, 1330740, 1132365, 1433758, 1396659, 1281825, 1250846, 1253413, 1328204, 1410442, 1190970, 798638, 1689772, 1182784, 1093296, 1031101, 1393617, 1142230, 900756, 1018641, 946720, 1403794, 990328, 1245024, 1240326, 779283, 1435078, 860683, 853325, 1246133, 966485, 1109416, 971564, 771643, 848646, 877374, 1034356, 717089, 687403, 725174, 792650, 1047920, 1002325, 1057802, 886442, 895248, 744878, 771523, 804644, 941351, 971659, 486161, 858670, 982524, 974864, 520393, 802386, 628672]
16481F28672J0341L73043k87327L55427q4362l84347q6915L42077k21238Q4615
16471G29986J07413k54708P2434k4403J03769l63831N57016k53557B75614K45915
16461E21529N4467K35655l77170L78215j20947l252K9999B94885Q20864m70636
16451F45113j25979J99172l25140K71974k84771K72819I9844K24836K23779n0001
16441D98458M8347K75345j93567B28367J88705P9725r2023j4247p551L8050L03764
16430G24790k42227O8109q3473Q0164k1515k13088K26448M4384j84519J49617
16420E48690L3615j0400J71851k27291r7134P5163k38329N9612J00658J48942
16410E65377k06381L61250l04479L37361k38837p9718J205B12700K14729p0716
$$ y = [628672, 639013, 1012056, 724729, 1080156, 995794, 611447, 524532, 866609, 645371, 729986, 837399, 582691, 655125, 630722, 734491, 370660, 927676, 674119, 275614, 521529, 575996, 811651, 434481, 812696, 691749, 688497, 718496, 294885, 1115749, 645113, 519134, 718306, 393166, 665140, 380369, 653188, 99844, 324680, 548459, 498458, 546805, 822150, 628583, 228367, 417072, 496797, 404774, 390527, 382976, 421026, 724790, 482563, 550672, 467199, 547363, 525848, 312760, 539208, 583592, 399073, 548690, 582305, 571905, 743756, 516465, 419331, 494494, 256165, 315777, 416435, 565377, 358996, 720246, 415767, 753128, 514291, 434573, 435778, 212700, 427429, 356713]
16400C56713J45500B22148J31018J03825m5676j67731P9760J18611J37555B63552
16389A20147L92576B52779K66745R5848J0932j55123k16040j24885J25575K26283
16379D82114A48877M02003A59413J7849j053M60998B13828k6984L9192J04454
16369C30490l6532L82682l11236A27356J82771A20085K90071A27126L93312q6344
16359D34094j93508J28917H1144N7553M9841K97754j85955A22827c6508E0238
16348C24723J34627l8754F0569L06590j03724K31299p8902o8089K94649A75099
16337C41921rm7478M7981j66816J62462H2031K1735M2730P0930L0959l5070Q1226
16325B94541j4818j5634F7624J57480K93188r3958A17691j7124K49913A44869
$$ y = [356713, 502213, 222148, 353166, 456991, 411315, 243584, 323344, 441955, 579510, 263552, 120147, 512723, 252779, 519524, 615372, 626304, 471181, 255141, 130256, 255831, 482114, 148877, 550880, 159413, 177262, 176209, 637207, 213828, 186844, 226036, 330490, 293958, 676640, 365404, 127356, 310127, 120085, 410156, 127126, 520438, 434094, 240586, 369503, 81144, 138697, 188538, 486292, 300337, 122827, -36508, 50238, 324723, 459350, 420596, 60569, 367159, 263435, 494734, 415832, 347743, 642392, 175099, 341921, 341912, 294434, 342415, 175599, 338061, 82031, 103766, 146496, 217426, 248385, 213315, 294541, 279723, 264089, 67624, 225104, 518292, 424334, 117691, 100567, 350480, 144869]
16314A03418L02985j64822J1324g2208D16126r3193o9415E267K63768M3759A2716
16302G1538J0795f3095C59797j27078a19236M5449C41158e8204B14161j6841K39080
16291D36400k03891I1327M3204B3538M1578Q9678J31827a54478A15672P5015Q6977
16280B77664o1569c3595C92508A59004Q6410I6679M21365B31061J35169A74005
16269A06741L2656C5152L83118j58287p9290m8094J63343p4962J93062e9842F6155
16257B25982A6398b7333C4586d3164k66996A83627B9759J9167a11895G9346B0220
16245A14095M01842j81842e8616j04911d2451E18775a5736A12805d7466D00718
16234A17598J15520J99671A08107n2591i1626A29848J56625j26820C0389a62573
$$ y = [103418, 406403, 241581, 252905, -72208, 416126, 322933, 253518, 5267, 269035, 312794, 12716, 71538, 82333, -63095, 359797, 232719, -119236, -73787, 341158, -58204, 214161, 197320, 436400, 232509, 91327, 134531, 23538, 65116, 154794, 286621, -154478, 115672, 190687, 277664, 216095, -33595, 392508, 159004, 245414, 96679, 518044, 231061, 366230, 174005, 106741, 139397, 35152, 418270, 259983, 180693, 132599, 295942, 220980, 414042, -59842, 66155, 225982, 16398, -27333, 34586, -43164, -310160, 183627, 29759, 48926, -111895, 79346, 20220, 114095, 515937, 334095, -58616, -163527, -42451, 518775, -15736, 112805, -47466, 400718, 117598, 233118, 432789, 108107, 55516, -91626, 129848, 286473, 159653, 30389, -162573]
16223g2076B19069h2910r8161C22331A10997J2756E4757a35835B89535A33371
16212C52223I546K38284o1483N3275q8990l0358L05590j85757m3031J257a27966
16200g0385C42592q2218k1700a3176A6931b2930B44015L0788J21257j62610J20973
16189C54423e9177K0725j45862B11124O7508j06948c32291Q8552B79750f2010
16178A29384J45830C2618J54050e5184r6775A54012F4119k2983L5529e3713C76000
16166a18647k56711a21898G4347a59308r8194B6308b06989A86007A724h9378C81774
16154A97852O6329a91851R1830C47632b35194a16349G8334K02739h8679a7213
16143B11364K8811A2760b92221A00463a19538C5893b99056B69102j26832a44708
$$ y = [-72076, 219069, -82910, -181071, 322331, 110997, 123753, 54757, -135835, 289535, 133371, 352223, 9546, 247830, 186347, 239622, 150632, 120274, 425864, 240107, 197076, 198333, -127966, -70385, 342592, 260374, 238674, -13176, 16931, -22930, 244015, 274803, 396060, 233450, 354423, -59177, -38452, -184314, 211124, 278632, 171684, -332291, -243739, 279750, -62010, 129384, 275214, 32618, 186668, -55184, -151959, 154012, 64119, 41136, 76665, -53713, 376000, -118647, -375358, -121898, 74347, -159308, -257502, 26308, -206989, 186007, 1724, -89378, 381774, 197852, 264181, -191851, -100021, 347632, -235194, -116349, 78334, 281073, -88679, -17213, 211364, 240175, 12760, -292221, 100463, -119538, 35893, -299056, 269102, 142270, -144708]
16132B54863c9360H7708L6111i1578k0240k68840a59018E6823a90694A6747a18075
16120A72924J32818b3456A8952K8869J44711a40399m815E49723f5926B20884L52935
16109E73819B8149P9168a33438G4989a6472D16411a49470D54708C1100J78167
16099B09267H7780O5800a28351H8853i3842M953A10581B1296b4802C31344I0059
16087h4664m44779B5026M4594b74938A49624c90910c3607A44701c38881J29267
16077b09614a0915o7453J9317m3650q052c2793A28221n5241e058A83869P0146
16066B54015i91A38165c66516C05421j40460i1409A62284b5493A75603b96430
16055h8350m9155A10374a18341A46765B3294a62679P8739A03062D1963c58284
$$ y = [254863, -39360, 87708, 123819, -91578, -111818, -380658, -159018, 56823, -190694, 16747, -118075, 172924, 305742, -23456, 18952, 47821, 192532, -140399, -145214, 549723, -65926, 220884, 573819, 28149, 107317, -133438, 74989, -16472, 416411, -149470, 454708, 31100, 209267, 87780, 153580, -128351, 88853, -93842, -88889, 110581, 21296, -24802, 331344, 90059, -84664, -529443, 25026, 69620, -274938, 149624, -390910, -33607, 144701, -338881, -209614, -10915, -78368, -59051, -102701, -110753, -32793, 128221, 72980, -5058, 183869, 254015, -991, 138165, -366516, 305421, 164961, -91409, 162284, -25493, 175603, -296430, -88350, -137505, 110374, -118341, 146765, 23294, -162679, -83940, 103062, 41963, -358284]
16044b91522b6869f599j09606B52000G3743a18909A46170o4947A4818J60546c4241
16032b51114R7505N9677n999A72835a64003A4927a36477J2921a8768m9047p9747
16021a47562B70787D5445b16467e58k2127j74383L9108A48347a94623j6959A94404
16009A73021G7890b41586k03464K20006b8390n4310a4856F4499J59022J130q7640
15998A37011C8416b03499c2827e217j13044a9687H0999J95729b47294P7600A50769
15986a71346I2201B3114J72409h3232K4706A1411J30017j1645L2466n1254b7151
15974E9037K37573b16681B31276e9522K9349k10269j69978A33806K29056A3754
15963B34675I6110B1245J07464a22642C47135a06973j97778A29250m7451g2284
$$ y = [-291522, -26869, -6599, -116205, 252000, 73743, -118909, 146170, 81223, 14818, 175364, -34241, -251114, -153609, -93932, -99931, 172835, -164003, 14927, -136477, -123556, -18768, -67815, -147562, 270787, 45445, -216467, -558, -22685, -197068, -157960, 148347, -194623, -211582, 194404, 173021, 77890, -241586, -445050, -225044, -28390, -82700, -14856, 64499, 223521, 224651, 137011, 38416, -203499, -32827, -5217, -118261, -19687, 80999, 276728, -247294, -169694, 150769, -171346, 92201, 23114, 195523, -83232, -58526, 11411, 141428, 129783, 162249, 110995, -27151, 59037, 296610, -216681, 231276, -59522, -30173, -240442, -410420, 133806, 362862, 13754, 234675, 96110, 21245, 128709, -122642, 347135, -106973, -304751, 129250, 81799, -72284]
15952H7467A9795a67167A60507a87154B43897k9529Q3574H9378b16084f6269l6685
15941a02954K3267k31167A04838a39989C26268b33640a4827B30905c6429D94L31076
15930C31570b54762B2992c59548d710o3287O840A43598n055d5250A48225e317
15918I2267l0659J39088l2029c3117D5854L4205c35847a63387q6760j0847I3352
15906b62404A91314C0515b35557f1765J167j19229B07713k8342g6917A80679b4577
15894B7556b55710J2059i2008B48979r5553p1181a70759A8855i6199A9035i3676
15882A5748M2348c40708J37776J2665f9157B00869p4489m1147N8821B1307B580
15870D3129j5838f2026m5717C270b03614C3208J67183a47188L667j64269E585
$$ y = [87467, 19795, -167167, 160507, -187154, 243897, 214368, 297942, 89378, -216084, -66269, -102954, -79687, -310854, 104838, -139989, 326268, -233640, -14827, 230905, -36429, 494, 331570, -254762, 22992, -359548, -4710, -67997, -61157, 143598, 138543, -45250, 148225, -5317, 92267, 61608, 200696, 168667, -33117, 45854, 80059, -335847, -163387, -250147, -260994, 93352, -262404, 191314, 30515, -235557, -61765, -60598, -179827, 207713, 179371, -76917, 180679, -24577, 27556, -255710, -243651, -92008, 248979, 153426, 82245, -170759, 18855, -96199, 19035, -93676, 15748, 58096, -340708, -202932, -190267, -69157, 200869, 126380, 85233, 144054, 21307, 2580, 43129, 27291, -62026, -107743, 3270, -203614, 33208, 200391, -147188, -143521, -307790, 5585]
15858b07286f086l61375A24279P8490E1217i9707H6197P130a31019j23727A82237
15846c9938j16630n5086b1100C056L75230f2735B03172G4261a60126b6781E9844
15834A23848a27225b1057n4311b6732l67848A18961a82666C42423b88203c143
15823c21098C54731a5976A59071b6814B08976a24016L2246E2771a99114Q2107
15813a17007j63943J22569G0749f7603k95136a2951F6836e3806B1040a41834A58694
15801A1585N5689d3158j15810A60069p8257c2410A94377F0816e9230p4685b4555
15789d49246a7990A1238b23571e090I0666G954J4327R3543b65090b5816j42172
15778a67988n8206P5708j72199E6689a4678J15j43911A3169a17271I8265J0697
$$ y = [-207286, -6086, -367461, 124279, 202769, 51217, -99707, 86197, 93327, -131019, -254746, 182237, -39938, -156568, -211654, -21100, 3056, 378286, -62735, 203172, 74261, -160126, -26781, 59844, 123848, -127225, -21057, -75368, -26732, -394580, 118961, -182666, 342423, -288203, -3143, -321098, 354731, -15976, 159071, -26814, 208976, -124016, -91770, 52771, -199114, -117007, -280950, -158381, 70749, -67603, -362739, -12951, 66836, -53806, 21040, -141834, 158694, 11585, 67274, -43158, -158968, 160069, 81812, -32410, 194377, 60816, -59230, -133915, -24555, -449246, -17990, 11238, -223571, -5090, 90666, 7954, 22281, 115824, -265090, -25816, -167988, -226194, -150486, -322685, 56689, -14678, -14563, -158474, 13169, -117271, 98265, 108962]
15767A08962K61389A13558a1627B6652d6730H9541a39134j49738J19545r1734
15757b61061O1384C71227A37210f2463B25717c19984A09196a78216r2381O0487
15747b10110Q2573A52130A5892L76046c59409E1975j7166f7538j58456N5214J9880
15736a50900O4406G1784Q4794a42519A79842E7696A4758b23089d63j19658b7699
15724F3213A9083a37668K1320F3041O1526P03A3668J14821b0961j49824P0219
15713a00566j02501D1341b79757A20706A4436e2173j81332k91467i2737J0376
15703h2361B44168A11942K1752E0554b11360j2424A98034a55081d4933D3766c2317
15691c16548a57964B3157Q0117h2696j66580K9685B6070N8526a06517A00377b15061
$$ y = [108962, 370351, 113558, -11627, 26652, -46730, 89541, -139134, -288872, -169327, -261061, -199677, 371227, 137210, -62463, 225717, -319984, 109196, -178216, -270597, -210110, -127537, 152130, 15892, 391938, -359409, 51975, 34809, -67538, -225994, -170780, -150900, -86494, 71784, 156578, -142519, 179842, 57696, 14758, -223089, -463, -120121, -27699, 63213, 19083, -137668, -116348, 63041, 124567, 125270, 13668, 128489, -20961, -170785, -100566, -203067, 41341, -279757, 120706, 14436, -52173, -233505, -524972, -92737, -82361, 244168, 111942, 133694, 50554, -211360, -223784, 198034, -155081, -44933, 43766, -32317, -316548, -157964, 23157, 103274, -82696, -249276, -219591, 26070, 84596, -106517, 100377, -215061]
15679d0387B17552D641a04656j61655A89393a11187F6558a01905A34699a22787
15668A64497b19564L4518H8541k0230a46414A44249a32187A08245K82888j26177
15658B64956a41198j69581g4765A06727a10147c3194f834q6062c4843C1047L25238
15647C56285H0192i2673M2855q3737A56559a37452p1159A28070n8905J43557H2866
15635h0317n2071j0946A51958G630M9791J02312a03920K1586A9141c28361D1558
15623d5494G8810f1869A16910a05345A73587a39319A2589K56704A28919M5993
15613A74912P8359k4395a0446k16726B46822a00482A27336a17348b7780B04334
15602a07644A1264h2833F9056c91880A86259a35416I1539b46007N7656A71804
$$ y = [-40387, 217552, 4641, -104656, -266311, 189393, -111187, 66558, -101905, 134699, -122787, 164497, -219564, -185046, 88541, 68311, -146414, 144249, -132187, 108245, 391133, 264956, -141198, -310779, -74765, 106727, -110147, -33194, -6834, -92896, -34843, 31047, 356285, 80192, -92673, -49818, -133555, 156559, -137452, -208611, 128070, 69165, 212722, 82866, -80317, -132388, -143334, 151958, 7630, 57421, 159733, -103920, -82334, 19141, -328361, 41558, -45494, 78810, -61869, 116910, -105345, 173587, -139319, 12589, 269293, 128919, 174912, 253271, 228876, -10446, -227172, 246822, -100482, 127336, -117348, -27780, 204334, -107644, 11264, -82833, 69056, -391880, 186259, -135416, 91539, -246007, -188351, 171804]
15591a38443M2507M1360B39569a58921m4404h8374M94j22139c2731j78182K1345
15580a89568n5467a614j77774j78662B3842J94577a83900Q2981d0989J3989A6734
15568a6140A15461O4516a55550d7866A78418D7039a45574M2218o4893B49201B0076
15556A60725c18291a39114K1357k222k41504A06266b8328A20679a76074H588a76780
15544h0648b6431H9240k5352d64953E221O5425c11903b128A12947c3199B1937
15532A64451e64510B97888f3277K0889A04301J51103i5860B12815G0042P852J81829
15521B59723c58304a36259A05726j1944M0467a05574j8070p817g306A12681g8566
15509C91405I5442M923J07325b75852a01037m2051l8500A58081m50b78402B6524
$$ y = [-138443, -95936, -54576, 239569, -158921, -203325, -88374, -87880, -210019, -32731, -210913, -189568, -245035, -1614, -179388, -358050, 23842, 218419, -183900, -100919, -40989, -27000, 16734, -16140, 115461, 179977, -155550, -47866, 178418, 47039, -145574, -103356, -168249, 249201, 20076, 160725, -318291, -139114, -117757, -119979, -361483, 106266, -28328, 120679, -176074, 8588, -176780, -80648, -26431, 89240, 63888, -464953, 5221, 70646, -311903, -2128, 112947, -33199, 21937, 164451, -564510, 297888, -63277, -42388, 104301, 255404, -95860, 212815, 70042, 77894, 259723, -358304, -136259, 105726, 93782, 134249, -105574, -123644, -131461, -7306, 112681, -78566, 391405, 95442, 100365, 207690, -275852, -101037, -143088, -181588, 158081, 157631, -278402, 26524]
15497E0185a5900o1744k7275A36546Q632m8955P2532i2800j1014p9386l0690B19641
15484c20689a481A7418J30348a8644o7374A05835b75525G0660j6090J01110b57503
15472C3049b29606A71510A80J92075D2599a37147r507D5687b73413a04696j6495
15461a21191A27147H439a62828C21241j59355a57737N9868A44152c6361B4286
15450A67792g468C09692b6205A87986a52762B60240H4360Q9521n3958a67284B06665
15438G7680J7673m2150J02476g0716j45748c2292B05736H5383A7617b62847C360
15426a12891B09006a53845d9827C84007H8830j4491P8965J72446b61318C514h2426
15414B80213h3005B315P149J72714l524e8127I6232b45475Q4685A91674a33075
$$ y = [50185, -15900, -77644, -104919, 136546, 145178, 96223, 168755, -92800, -103814, -183200, -213890, 219641, -320689, -1481, 17418, 147766, -18644, -86018, 105835, -275525, 70660, 54570, 155680, -257503, 33049, -229606, 171510, 180, 192255, 42599, -137147, -146654, 45687, -273413, -104696, -121191, 127147, 8439, -162828, 321241, 161886, -157737, -97869, 144152, -36361, 24286, 167792, -7468, 309692, -26205, 187986, -152762, 260240, 84360, 173881, 119923, -167284, 206665, 77680, 95353, 53203, 155679, -70716, -216464, -32292, 205736, 85383, 17617, -262847, 3360, -112891, 209006, -153845, -49827, 384007, 88830, 74339, 153304, 325750, -261318, 3514, -82426, 280213, -83005, 2315, 9464, 182178, 178654, -58127, 96232, -245475, -160790, 191674, -133075]
15402g2848A96167a12775G3408K3905c04391a0161A55L7224b3033B22388K4175
15391B46563c11480a52325I6377a37089f7027b8001k9504A91648n8675L3892d1905
15379a58475j65232g0185F3581Q649a1562D2716q803J69231n949K3387p4432m1338
15367A04812c8156k91198B2616c9478a3091j70546k25533C0355J46794o7921j7141
15356I2087b21109C479K1657a19230j21566B15357H7573b41867D8035A3520b6248
15344c9341E0755b02855K781B61293E8136e4763A42825c9995A19094a53658b7496
15332A69161L82009a73272h5577A30502c49024I917K86568d070C00727m3831a34164
15320g2587k7243l12596K05464n1963J07000C17046C370K90599I7069a13208I5162
$$ y = [-72848, 196167, -112775, 73408, 97313, -304391, -10161, 155, 37379, -23033, 222388, 246563, -311480, -152325, 96377, -137089, -67027, -28001, -57505, 191648, 132973, 166865, -41905, -158475, -323707, -70185, 63581, 72230, -11562, 42716, 33913, 203144, 197195, 220582, 146150, 104812, -38156, -329354, 22616, -39478, -13091, -183637, -409170, 30355, 177149, 109228, 92087, -221109, 3479, 25136, -119230, -240796, 215357, 87573, -241867, 48035, 13520, -26248, -39341, 50755, -202855, -200074, 261293, 58136, -54763, 142825, -39995, 119094, -153658, -27496, 169161, 551170, -173272, -85577, 130502, -349024, 9917, 296485, -4070, 300727, 256896, -134164, -72587, -99830, -412426, -206962, -258925, -151925, 317046, 3370, 293969, 97069, -113208, 95162]
15308G8697N4677p205e2147m9699c0584a172B102Q5189J91150a1653k24174B43033
15295B21303n3250l5919G368P4206K48484b2102o8380a6332C37088C0869e2784
15283i2188B19738p7223c33098a10294J9168j20218A71469E8762B5318K45534
15273B70852g3685C5306J85302G883K21322I8693K01885E6051J62208F87M2381
15262D3068b19059G4693N5698F4913C0116L47655k1439p7642i68B57554L5692
15251B93246j19585c0432C25362l197L92726M67326J556808q60950q026Q52943
15241B722992A225121E31654A92141B7377K2093K9441l6183M9776J43948L6955
15231B73407j07716E3309b52454e4376r1739L2748F6818K05842a82446A36771
$$ y = [78697, 133374, 126169, -52147, -101846, -30584, -1172, 2102, 87291, 278441, -11653, -235827, 243033, 221303, 168053, 132134, 7368, 81574, 330058, -22102, -90482, -16332, 337088, 30869, -52784, -92188, 219738, 142515, -333098, -110294, -91126, -211344, 171469, 58762, 25318, 270852, -73685, 35306, 220608, 7883, 229205, 98693, 300578, 56051, 218259, 687, 43068, -219059, 74693, 130391, 64913, 30116, 377771, 356332, 278690, -968, 257554, 293246, 173661, -30432, 325362, 322165, 714891, 1182217, 2739025, 1878075, 1870049, 2722992, 1225121, 531654, 192141, 27377, 49470, 78911, 42728, 92504, 236452, 273407, 165691, 53309, -252454, -54376, -146115, -113367, 66818, 272660, -182446, 136771]
15220B86870A12361f6315E4734a63492D09882A69115K63391A23076a25130i807
15209B72877E8154i2782p0371E5484J74078n4827f5177f669C88757H5956K12650
15198B98606r5842o2538J11659B4307J20054M61J31729j3996b0034A2990J62411
15187A75401G9859O4709e1188A32955M4862d4397j01688F54K3481L88295D7919
15175a60408d3322k3449j462A11909l4160K47349d9286B67363c35102c7780j22079
15164a59859B3087J66761K30738a49007B11943J48848m6771d9150j42333B83004
15153B04238f6191j1258j78879A10124N5625E4082d6087A31452k0208K99127E8438
15141h3102D65477C5376J45630k7123R2018p8292b7428e584n1749A59063J5668
$$ y = [286870, 112361, -66315, 54734, -163492, 409882, 169115, 432506, 123076, -125130, -9807, 272877, 58154, -92782, -163153, 55484, 229562, 174735, -65177, -6669, 388757, 85956, 298606, 202764, 140226, 251885, 24307, 144361, 144822, 276551, 262555, -20034, 12990, 175401, 79859, 144568, -51188, 132955, 177817, -44397, -146085, 654, 24135, 412430, 47919, -160408, -43322, -66771, -68233, 111909, 77749, 325098, -49286, 267363, -335102, -37780, -159859, 23087, 189848, 420586, -149007, 211943, 360791, 314020, -49150, -191483, 283004, 204238, -66191, -77449, -256328, 110124, 165749, 54082, -46087, 131452, 111244, 410371, 58438, -83102, 465477, 35376, 181006, 153883, 245901, 167609, -27428, -5584, -57333, 159063, 174731]
15130A74731L8170K08462j81843j4034H3130c3273D47057B02386q6816N45094
15120F60664B02539G2696L40469J3733j17214J54479k28561Q4875j07637K67649
15110D80489m5943d7517C8949J87082P0245F0950Q0784P5919K71655a03437f3
15098A49636a00414A44394f8763A09770k3314m538h3606A36854f4848B7971M73357
15087E01328A05561K07899h0849K9604C5222J42139a99162A72811K50899E3650
15076C06471o5028C0365M0477M9434J05611g0338b8525C45893a61429D04948C7806
15064A23640Q8523C6108a17449A79187K92173B09892R7279B307M0246K61325m6080
15053B57798l1602J46664o2004J30006p6083q3872J64432d363D22275a63189A01206
$$ y = [174731, 212901, 421363, 239520, 225486, 83130, -33273, 447057, 202386, 115570, 660664, 202539, 72696, 413165, 426898, 309684, 464163, 235602, 320477, 212840, 480489, 434546, -47517, 38949, 226031, 296276, 60950, 141734, 217653, 489308, -103437, -63, 149636, -100414, 144394, -68763, 109770, 86456, 81918, -83606, 136854, -64848, 27971, 501328, 105561, 313460, -80849, -51245, 35222, 177361, -199162, 172811, 423710, 53650, 306471, 241443, 30365, 70842, 120276, 225887, -70338, -28525, 345893, -161429, 404948, 37806, 123640, 212163, 36108, -117449, 179187, 471360, 209892, 307171, 2307, 42553, 303878, 257798, 226196, 372860, 310856, 440862, 364779, 280907, 445339, -4363, 422275, -163189, 101206]
15041D78410B01720D6093d6232B84105j22617M26651A75669D9626J26489K55824
15031D31939j86272E3910e746j65280C69613d7591D93448B39188m4916m1470D1136
15019A33408k1239K25988M1597j7584a26789M3427C23312A38390K45504j9750
15009C64144j73227G1006J11520K10910j53497K24819C5070O2501K81641j35848
14999B43364j18505L56821A22661K4158G0353L30824F9177J03253j7211o0761
14989I4458L07742b8525o6858D11259n718c4821B35677n8347E8963K60743D0200
14977B59594A23042Q177E0801M56841j85679A00795M34228L584o3284A81277J46001
14966C27278A09862J34767J89021A85728j2147J74822a45321B29666o4938k8393
$$ y = [478410, 201720, 46093, -46232, 284105, 161488, 588139, 175669, 49626, 176115, 431939, 245667, 53910, -5746, -171026, 369613, -47591, 493448, 239188, 194272, 152802, 41136, 133408, 112169, 338157, 379754, 362170, -126789, -83362, 323312, 138390, 383894, 364144, 190917, 71006, 182526, 393436, 239939, 464758, 35070, 97571, 379212, 243364, 124859, 481680, 122661, 146819, 70353, 401177, 69177, 172430, 155219, 94458, 402200, -28525, -95383, 411259, 405541, -34821, 235677, 177330, 58963, 319706, 40200, 259594, 123042, 131219, 50801, 507642, 321963, 100795, 535023, 538607, 475323, 181277, 327278, 109862, 244629, 433650, 185728, 173581, 348403, -145321, 229666, 164728, 136335]
14956A36335L65189j63420K68313p6577k13897K61572k87513R0831k3945M394
14946C61282A27787J11971A18991J43237K52275c9747C32833A05919l335P6104
14936A78688L6044r5774K68245A57786K06063n3100M01L42136o5705j89788j94696
14925B03097L7828N5316m7960j9170J05439r5737p2838G6755R7936J05250o1650
14914B18291O2968C5656K10761K50340B25837L06892r2754a3467B80153K0516
14904C00669L29163C09733J7541J26342j43971b24827B06059K23716J72910p6301
14894E26384B60853M05333A28151J46805J05986j1040r9850J94879j40293K4013
14884C48651A30135L46463K2120j77851O6895j00758p834K88096F0186K79661
$$ y = [136335, 501524, 338104, 606417, 529840, 315943, 577515, 290002, 380833, 356888, 361282, 127787, 239758, 118991, 262228, 514503, -39747, 332833, 105919, 102584, 178688, 214732, 118958, 387203, 157786, 363849, 310749, 311150, 653286, 587581, 397793, 203097, 240925, 296241, 248281, 229111, 334550, 238813, 165975, 76755, 174691, 279941, 218291, 281259, 35656, 246417, 496757, 225837, 532729, 439975, -13467, 280153, 300669, 629832, 309733, 327274, 453616, 309645, -224827, 206059, 429775, 602685, 526384, 260853, 666186, 128151, 274956, 380942, 369902, 270052, 464931, 324638, 348651, 130135, 476598, 498718, 320867, 387762, 287004, 279170, 567266, 60186, 339847]
14874C39847R2481n7062P6504j59582M26947A65562L03872o9158K25336n5235
14864E70377N9914C05055J38724n1686R6488O8304j57538K06733k61073Q1980
14854D26987l1769K84720k9076k25206J37451B11027K70459L1446q1341J56668
14844E88259n2650J02687j90417j72511M75820B84439N06791A09617L62734M02460
14834H74811l15657A62663M17960n7703M28p1900J34099B27364o3256J95999M57893
14823H18000j87671J0135A71028K09055l5770K70278j80575M6467k8190n6119
14813C96174M1574R6219K04604B31566N86677j40313B55926L66266o2103p9439
14803D80650R4180K9016k72032M74787k90997K39344l33252H6900N31136k94466
$$ y = [339847, 432328, 375266, 451770, 292188, 719135, 165562, 469434, 400276, 625612, 570377, 630291, 305055, 443779, 392093, 488581, 556885, 399347, 606080, 345007, 426987, 395218, 679938, 650862, 425656, 563107, 211027, 481486, 512932, 431591, 588259, 535609, 638296, 447879, 275368, 751188, 284439, 791230, 109617, 472351, 874811, 559154, 162663, 580623, 522920, 523348, 451448, 585547, 227364, 164108, 360107, 818000, 630329, 640464, 171028, 380083, 344313, 614591, 434016, 480483, 452293, 396174, 437748, 533967, 738571, 231566, 818243, 677930, 255926, 622192, 560089, 480650, 574830, 603846, 331814, 806601, 515604, 754948, 421696, 86900, 618036, 323570]
14793C23570M7217k619K57481j14065j95832L54152j84146l5865L24608r6914
14783F77587k20764K67087l31573l864K74967J93425o1774k64946J0160j01477
14773D38828K60028J27576l07986L40432m06302j61897N71975L6921j92893k3003
14763F83679m970L8610j79766j15879K54693p1082J42364J57229k24175j81203
14753D99500Q8695r8476K47797M08550m73725J17915k39070K67184l86983J19744
14743E51131P637L08625J28412J86026m21118r2482J0228J82412D27662L22091
14733G49753j73188L97159l01958K00757q3681P8168J23583m49553K39738P5529
14723H56307J2678j48076L39664l92662L44866l68592j4476M88706k53414R1845
$$ y = [323570, 370787, 368168, 625649, 511584, 315752, 669904, 485758, 449893, 774501, 677587, 456823, 723910, 392337, 388473, 663440, 856865, 795091, 530145, 540305, 438828, 698856, 826432, 518446, 858878, 452576, 290679, 862654, 899575, 706682, 683679, 678709, 717319, 537553, 421674, 676367, 605285, 747649, 904878, 680703, 499500, 588195, 489719, 737516, 1146066, 672341, 790256, 551186, 818370, 431387, 551131, 558768, 867393, 995805, 1181831, 760713, 668231, 678459, 860871, 427662, 749753, 576565, 973724, 671766, 872523, 788842, 867010, 990593, 541040, 780778, 856307, 868985, 720909, 1060573, 667911, 1012777, 644185, 629709, 1118415, 865001, 956846]
14713I56846r6826j74884K6856K5275O1551k23812J49751J18106m3896R7618r434
14702H87151n3439J3845J81335l71987K68641R0385l23471M27917j92690K11728
14692A139415r1208j85834l666K11617j78657O9709p8847J11036J20264l46722
14682G67107J40909J98185k22614L14040m48652O27072l59432J19659J60606j87683
14672A109197J74963j02505j59828m9810m05069N72597j56125N6274L54450k54190
14662A139954k33998J64301n8922L45055L7656k42030P9842K66851k56276k04890
14652A037543M54924m10756j04297N56577j99601l2307j90769K55743J25636R1483
14642A584176k20890j73712K99664j37112q2346J54680L75190k0588o39889M67933
$$ y = [956846, 860020, 685136, 711992, 737267, 798818, 575006, 724757, 842863, 798967, 896585, 887151, 833712, 847557, 1028892, 656905, 925546, 1015931, 692460, 1120377, 927687, 1139415, 1048207, 862373, 858707, 1070324, 891667, 961376, 882529, 993565, 1113829, 767107, 908016, 1106201, 883587, 1197627, 748975, 1376047, 1016615, 1136274, 1296880, 1109197, 1284160, 1181655, 1021827, 972017, 566948, 1139545, 983420, 1039694, 1394144, 1139954, 905956, 1070257, 1011335, 1356390, 1394046, 1152016, 1231858, 1498709, 1242433, 1037543, 1492467, 1081711, 977414, 1533991, 1334390, 1302083, 1111314, 1367057, 1492693, 1584176, 1363286, 1189574, 1489238, 1352126, 1269780, 1424460, 1799650, 1779062, 1139173, 1607106]
14632A607106m32386M96484l38065O4488P5596k10857J76114K16765k40337K7462
14622A442370r5253L78573l40830L5127J8054M0552P6045K16952j13921J11988
14612A769657m2565j2745R8912k78146J58967r4216n1587N1656N2352J45978o0003
14601A738260j89030J11618j7975L15143j91791j16830M44647l45013j6925J5075
14591A747179O5205k68820O72350j64317N0329p0343J01767J10644J91167l99839
14581B035322j23797J17172L42451r5189n1774p6724J86906p846K55284j55775
14571B426030k74604M10515k6925j81479K16094L7403L42527k22654K0506J85152
14561B932565K23404j23161K24387L59359k92097L24253k91092N72643K41244
$$ y = [1607106, 1174720, 1671204, 1333139, 1397627, 1473223, 1262366, 1438480, 1655245, 1414908, 1442370, 1347117, 1725690, 1384860, 1419987, 1438041, 1478593, 1554638, 1771590, 1657669, 1769657, 1727092, 1714347, 1813259, 1535113, 1694080, 1599864, 1548277, 1599933, 1652285, 1798263, 1738260, 1549230, 1660848, 1642873, 1958016, 1766225, 1649395, 2094042, 1749029, 1732104, 1747179, 1812384, 1543564, 2215914, 2051597, 2101926, 2031583, 2133350, 2243994, 2435161, 2035322, 1911525, 2028697, 2371148, 2275959, 2224185, 2147461, 2334367, 2326521, 2581805, 2426030, 2151426, 2561941, 2535016, 2353537, 2569631, 2607034, 2949561, 2726907, 2747413, 2932565, 3155969, 3032808, 3257195, 3616554, 3324457, 3648710, 3357618, 3930261, 4171505]
14552D171505M68052M16024J210217J564242L060806P967747J6622321P611620
14544D3092534k0742795A0656797m074421k6044K209430D092768j072575o49323
14536B370870k93472M80462k43839j75702N195N52973l06327J28056k52217q260
14526B257739N61788J5297k26229K81018l66300K88379N338J15488P6988p5830
14516B933676J58777j78731O3873o188J81801r0729J02049l70790K75481j79398
14506B889821L49446P2850k09768J99673j32960Q5150r9737L11230O6306j41709
14496C390302Q7011K19722R9986k44667L7867L55634j65211J0935j3931K31385
14486D009033J84639j77330J29608J9897n6137R1220o9046Q3308j6544j58671
$$ y = [4171505, 4639557, 5055581, 6265798, 7830040, 10890846, 18858593, 35480914, 43092534, 22349739, 10656797, 6582376, 6556332, 8765762, 4092768, 3020193, 2370870, 2077398, 2557860, 2314021, 2138319, 2143514, 2696487, 2390160, 2518216, 2265999, 2257739, 2819527, 2834824, 2608595, 2889613, 2523313, 2811692, 2817030, 2932518, 3009506, 2933676, 3092453, 2913722, 2977595, 2971407, 3153208, 3062479, 3164528, 2793738, 3069219, 2889821, 3239267, 3312117, 3102349, 3302022, 3169062, 3254212, 3154475, 3465705, 3532011, 3390302, 3477313, 3697035, 3797021, 3552354, 3590221, 3945855, 3780644, 3791579, 3777648, 4009033, 4193672, 4016342, 4145950, 4165847, 4109710, 4200930, 4131884, 4215192, 4198648, 4039977]
14476D039977M62557J33065k92680L90940L3775k15348K03296M3443m3973J89479
14466D944531J43052j16681L9278J54468K3297O881K45529k68044L03399n4006
14456E421704j13451m4774O29627l48507L37989l66149K08821M40044k59391L69773
14446F275686j90832M28411m70586L67673J92189K2737J6420M08114j6475q5125
14436F948212J82000P9710o4940L55068J05567k61758K16097J47543J30876j23167
14426G715208M04964K80300m54345N16794J21253J9601R4338J85662L85731j6110
14416I253396K01394J98677l47572M85345L8704J75237J66859j30521K34608L80368
14406A0656495M76385K02732l55896L58741J95362L47024k61459O70579j78023
$$ y = [4039977, 4502534, 4635599, 4342919, 4733859, 4767634, 4552286, 4755582, 4799025, 4755052, 4944531, 5087583, 4970902, 5010180, 5164648, 5187945, 5194826, 5440355, 5172311, 5475710, 5421704, 5308253, 5263479, 5893106, 5544599, 5882588, 5516439, 5725260, 6165304, 5905913, 6275686, 6084854, 6513265, 6042679, 6410352, 6602541, 6625278, 6641698, 7049812, 7033337, 6948212, 7130212, 7209922, 7144982, 7500050, 7605617, 7343859, 7559956, 7707499, 7838375, 7715208, 8120172, 8400472, 7946127, 8462921, 8584174, 8603775, 8698113, 8883775, 9269506, 9253396, 9454790, 9653467, 9305895, 9791240, 9829944, 10005181, 10172040, 10041519, 10276127, 10656495, 11132880, 11335612, 10979716, 11338457, 11533819, 11880843, 11619384, 12289963, 12111940]
14397A2111940K03214L10175K52501K2196O02843j48505n2757N39551M51221R4875
14387A4387254j3066L84068M92543k0718J015832j25171Q8690M62267M28250J89929
14377A7289878J44791N03191J96225O31266J74239N81445j17293P75754M63797
14368B0643293L75443M98690J18711O71171N9963R24611J27853R26118O37012
14359B4982865P1143P34801O54156J05232O90302Q55688Q13219Q24121K02781
14350B9934308R58918J219681N47966Q29085N54417J191587P39160J167185Q50771
14341C7993078J096304O61385J376874J165098R07019J552020J059591J127680
14333D6939049J568597J223955J713399J557122J207350J955257J631978J813455
$$ y = [12111940, 12315154, 12625329, 12877830, 12900026, 13502869, 13354364, 13301607, 13841158, 14292379, 14387254, 14374188, 14758256, 15250799, 15230081, 16245913, 16120742, 16209432, 16671699, 17099949, 17289878, 17434669, 17937860, 18134085, 18765351, 18939590, 19521035, 19403742, 20179496, 20643293, 21018736, 21517426, 21636137, 22307308, 22367271, 23291882, 23419735, 24345853, 24982865, 25054008, 25788809, 26442965, 26548197, 27238499, 28094187, 28907406, 29731527, 29934308, 30893226, 32112907, 32660873, 33489958, 34044375, 35235962, 35975122, 37142307, 37993078, 39089382, 39750767, 41127641, 42292739, 43199758, 44751778, 45811369, 46939049, 48507646, 49731601, 51445000, 53002122, 54209472, 56164729, 57796707, 59610162]
14325E9610162J897904K043155K129589K263607K082226K502560K632201K355881
14317G7517285K977633L015072K720521L647489K967812L874236L688498L731734
14309A04140280M092809M483177M611670M805486N138108N240506O167814N983083
14301A44662933O642737O389222P287584P605145Q016999Q245441R083926R302558
14293B07236545J0137271J0347250J1079728J1172385J1863659J2757015J2543549
14286B87137402J3625184J3831278J3733893J4332779J4150313J4610301J4357410
14279C85778560J3681459J3166995J2280538J1385414R888747Q478750O474283
14272D61134746M050359N41481j991539l107023m749136m241762p250895r449702
$$ y = [59610162, 61508066, 63551221, 65680810, 67944417, 70026643, 72529203, 75161404, 77517285, 80494918, 83509990, 86230511, 89878000, 92845812, 96720048, 100408546, 104140280, 108233089, 112716266, 117327936, 122133422, 127271530, 132512036, 138679850, 144662933, 151305670, 157694892, 164982476, 172587621, 180604620, 188850061, 197933987, 207236545, 217373816, 227721066, 238800794, 249973179, 261836838, 274593853, 287137402, 300762586, 314593864, 328327757, 342660536, 356810849, 371421150, 385778560, 399460019, 412627014, 424907552, 436292966, 446181713, 454660463, 461134746, 465185105, 465726586, 463735047, 460628024, 455878888, 451637126, 444386231, 434936529]
14264D34936529j1347369j2690309j3833471j4698592j5294577j5294378j5577959
14257C36199874j5313865j4969499j4126783j4553583j3386584j3301113j0304207
14250B40244240j1309116j1149758j0845779j0217833r305753r156420q158690
14243A70100891p603672p791836o959242o635263o367069n518682n255203n344201
14235A18625723n251216m449465m753579l951761l867520l272840l898256l423302
14227H5757784l179701l256053k714323k992640k432454k602395k602420j751461
14219F4226337k040881j978054k199328j923899j567696j671099j281979j512686
14211E0050715j370550j883783j414927j029905o58110j203835j687783j430262
$$ y = [434936529, 423589160, 410898851, 397065380, 382366788, 367072211, 351777833, 336199874, 320886009, 305916510, 291789727, 277236144, 263849560, 250548447, 240244240, 228935124, 217785366, 206939587, 196721754, 187416001, 178259581, 170100891, 162497219, 154705383, 147746141, 141110878, 134743809, 129225127, 123969924, 118625723, 113374507, 108925042, 104171463, 100219702, 96352182, 93079342, 89181086, 85757784, 82578083, 79322030, 76607707, 73615067, 71182613, 68580218, 65977798, 64226337, 62185456, 60207402, 58008074, 56084175, 54516479, 52845380, 51563401, 50050715, 48680165, 46796382, 45381455, 44351550, 43693440, 42489605, 40801822, 39371560]
14203C9371560r02331q55666q56445p60948j529896l76547r90738q13485m74454
14194C1811050r12830r26834p31960p58592p48676p34564m94703n93844r16137
14185B4992910l20673k43105q56552n20445j78770m93683k77299r13867k69089
14176B0919427m06114n53225j19921n31458k17943m14933k59002n84148j73389
14167A7659294o33061m45425J40256j76329l58571n38819j83461k49519k66203
14158A4948162l92957r0370n29793q831n68904J78497m16230j21619k35810m87594
14148A2274551L34683j35944o97772L0957k07714J60124m68870m00364p1262j16698
14138A0701691k31472k00414R2071l12602l82622J25038m0640L6105N948o18295
$$ y = [39371560, 38469229, 37613563, 36757118, 35996170, 34466274, 34089727, 33098989, 32285504, 31811050, 30898220, 29971386, 29239426, 28480834, 27732158, 26997594, 26502891, 25909047, 24992910, 24672237, 24429132, 23572580, 23052135, 22873365, 22379682, 22102383, 21188516, 20919427, 20513313, 19960088, 19840167, 19308709, 19090766, 18675833, 18416831, 17832683, 17659294, 17026233, 16580808, 16721064, 16544735, 16186164, 15647345, 15463884, 15214365, 14948162, 14555205, 14464835, 13935042, 13926211, 13357307, 13535804, 13119574, 12997955, 12762145, 12274551, 12609234, 12473290, 11775518, 11806475, 11598761, 11758885, 11290015, 10889651, 10818389, 10701691, 10470219, 10269805, 10361876, 10049274, 9666652, 9791690, 9751050, 9787155, 9793103, 9174808]
14128I174808J41245j89102k15010o4394K14532j33687o07167K63691k55895k67053
14118H061968Q4746j66210k16775K12779k9783m36242K20120m59779P1513l59432
14108F982905J82722Q270Q0653o80773Q5530J00650O739L5102j50195j35132k97757
14097F218714J91251o6500l4478k85302M4122k09358k5993k15350o0447L4899
14087E591558O8500m9849j2960l73406O2604K81154l34271q5059J47699j96744
14077E099226K56610p2894k85869k3711p6222J22700n39786J07660j40215m15
14067D447084K88908m27351j18770J10550O2653o631j78406o7462J63857Q099
14057D282531j8606p6470j77909q8142M51728l85118l22511N71192q444l73307
$$ y = [9174808, 9316053, 9126951, 8911941, 8847547, 9062079, 8928392, 8321225, 8584916, 8329021, 8061968, 8146714, 7980504, 7763729, 7976508, 7946725, 7510483, 7730603, 7270824, 7342337, 6982905, 7165627, 7173897, 7254550, 6573777, 6659307, 6759957, 6766696, 6801798, 6651603, 6516471, 6218714, 6409965, 6343465, 6308987, 6023685, 6067807, 5858449, 5832456, 5617106, 5556659, 5591558, 5660058, 5610209, 5597249, 5223843, 5286447, 5567601, 5233330, 5148271, 5295970, 5099226, 5355836, 5282942, 4997073, 4973362, 4897140, 5019840, 4480054, 4587714, 4447499, 4447084, 4735992, 4308641, 4189871, 4300421, 4363074, 4356443, 4178037, 4110575, 4274432, 4282531, 4263925, 4187455, 4009546, 3921404, 4373132, 3988014, 3665503, 4236695, 4228251, 3854944]
14047C854944l54043K47557P969J54546k41483J30535n47976J32161K36557J54479
14037C775246m05301J93898O8110k12169J20196m09755K59214j0977p3477q2899
14027C222086j75335P76458n91208J83476k24284j26900L87667o07219J13388
14018B958129j39480k8528l1212J85876k44030q9380K0391K15845j53649k76312
14008B417650K64882k4591o3755L6517k74012J27746J3137j64500K78212k70310
13998B340976J65346j50625j43489L87041j64121K9617N12869O1158M43712Q90299
13988D372783K118259O123072J6385013J4719221j6672459j1787076o120454k868664
13980F269695r34657r04061o28235k9411j11078n65656K6410m43831P4956L09150
$$ y = [3854944, 3500901, 3748458, 3756427, 3910973, 3669490, 3800025, 3252049, 3384210, 3620767, 3775246, 3369945, 3563843, 3631953, 3419784, 3539980, 3130225, 3389439, 3378462, 3304985, 3222086, 3046751, 3823209, 3232001, 3415477, 3191193, 3064293, 3451960, 2844741, 2958129, 2818649, 2790121, 2758909, 2944785, 2700755, 2611375, 2631766, 2847611, 2693962, 2417650, 2682532, 2657941, 2594186, 2630703, 2356691, 2484437, 2497574, 2333074, 2611286, 2340976, 2506322, 2355697, 2212208, 2599249, 2435128, 2464745, 2977614, 3038772, 3482484, 4372783, 6491042, 12614114, 28999127, 43718348, 27045889, 15258813, 9138359, 6269695, 5335038, 4430977, 3802742, 3773331, 3662253, 3096597, 3123007, 2679176, 2754132, 3063282]
13970C063282l82013K2513L1174M5430l30383n5504M86784n08094R5682k10807
13960B258064J23628j06709J90034n21982K61679M2511p1543r7474j13022K90941
13950B256127n5729l40376L83839k7557k44261K2027J10190O9602n37438M70392
13940B106816k18395J47197J43732O3085k91622k07472k5028m4891K59354J99734
13930B132510o19304M85507k34467J9461l17781O39213j04213j02156j9089j57626
13920A722055j0321k98981M5819J01665J08123J42593n1411l60116J11788L853
13910A515067L1114k90351K22654L42243l77439J10334R0345n05078M39134l63173
13900A214850J22058K21753m3966L00731m01311r9483J13377r7240J69195j29158
$$ y = [3063282, 2681269, 2703782, 2734956, 2780386, 2450003, 2394499, 2881283, 2373189, 2468871, 2258064, 2381692, 2274983, 2465017, 1943035, 2204714, 2247225, 2175682, 2078208, 1965186, 2256127, 2200398, 1860022, 2243861, 2216304, 1972043, 1994070, 2104260, 2173862, 1636424, 2106816, 1888421, 2035618, 2179350, 2242435, 1950813, 1743341, 1718313, 1673422, 1932776, 2132510, 1513206, 1998713, 1764246, 1783707, 1465926, 2105139, 2000926, 1898770, 1879681, 1722055, 1711734, 1412753, 1458572, 1560237, 1668360, 1810953, 1759542, 1399426, 1511214, 1515067, 1546181, 1255830, 1478484, 1820727, 1443288, 1553622, 1643967, 1138889, 1578023, 1214850, 1336908, 1558661, 1514695, 1815426, 1414115, 1314632, 1428009, 1330769, 1499964, 1370806]
13890A370806o2453k16067L82294l41647J13532J03391J88281k34811N1816j67613
13880A187529O6109L83362l62277k0575J22901j45115K17666j90308n6530K75472
13870A478234k31782M1060k56261p7709J14122J68015l04499J31319K98681l84270
13860I76910L30504J79530m28036J30436k55563M81800l03184K60834k03439l11707
13850H58085M91933o1199K5998m06181L07167m13112O9412L2279J47385k52228
13840G99539P0268L36722l47532L85996m28195L1552J40179K90658k71618j26409
13830H81160L67726E31214K59460P1194Q8143L07143l05930j36478K81178k28053
13820H67871J75754j58378k30792J137J50970K60947k33322J10317l0767P6897
$$ y = [1370806, 1308353, 1092286, 1474580, 1132933, 1246465, 1349856, 1538137, 1303326, 1355142, 1187529, 1253638, 1637000, 1274723, 1254148, 1377049, 1231934, 1449600, 1259292, 1202762, 1478234, 1246452, 1287512, 1031251, 953542, 1067664, 1235679, 931180, 1062499, 1361180, 976910, 1307414, 1486944, 1058908, 1189344, 933781, 1415581, 1112397, 1373231, 1169792, 858085, 1350018, 1288819, 1314817, 908636, 1215803, 802691, 872103, 904382, 1051767, 799539, 869807, 1206529, 858997, 1244993, 816798, 848350, 988529, 1279187, 1007569, 881160, 1248886, 531214, 790674, 861868, 950011, 1257154, 951224, 814746, 1095924, 867871, 1043625, 885247, 654455, 655592, 806562, 1067509, 834187, 944504, 913737, 990634]
13810I90634J42561k75825K50829k14432J89108j58715J55832n3944l11747O8750
13800G83051Q9356J77998J57542m26977J92776k1162k66129M28397k4928k21094
13790H68830J02123k66851q3036M31293k18699j46782M7913l4903J01090J16839
13780I17817k737l65091J62173j23764L58106j59741N5868j8864M4248k07793
13770F60222J25384L728r2191P0550M7275J25260j58152j00273K79749k35688
13760G25864M1195R0685j95315J00665j45172J29921Q4249k52586J61016P8986
13750H19508O645k0410j0484j16716M9769L61924D65970p7034K88894j67794L3018
13739E43054J73053J26184J03475n7191j88110j17161q5864L58472k74954L78103
$$ y = [990634, 1133195, 857370, 1108199, 893767, 1082875, 924160, 1079992, 1026048, 714301, 783051, 872407, 1050405, 1207947, 780970, 973746, 952584, 686455, 1114852, 1089924, 868830, 970953, 704102, 621066, 1052359, 833660, 686878, 734791, 699888, 800978, 917817, 915080, 549989, 712162, 588398, 946504, 786763, 842631, 823767, 868015, 660222, 785606, 789334, 697143, 767693, 814968, 940228, 782076, 681803, 961552, 725864, 767059, 857744, 662429, 763094, 617922, 747843, 832092, 579506, 740522, 819508, 826153, 805743, 795259, 678543, 728312, 1090236, 465970, 388936, 677830, 510036, 543054, 716107, 842291, 945766, 888575, 700465, 583304, 497440, 855912, 580958, 959061]
13729I59061l74523O3918j94521R6322K88240l87808J12409K81388l93065L21457
13719G72878J27816k73245K06018j28131k69681P721K35927j93673M10275A97323
13708D97963L3306J83594q1255J99653j46353J17301q5093J48800J38493k91693
13698G14716j01245k54875M29482k97666L51143l12789P5062L406A42509L38689
13688D81198k01413J67944J39247L30191C25763K2882J46652n274J80447k47196
13678D23274m4294J71064O3969j62085J62286B82403K65096K72104C03848A28152
13667F14107k31501L51765l49966K96396k75815J62700B46579K25729M1651P878
13657E21837q7239p8727N00459m02415J91011B92485L04099A71500M19637k28747
$$ y = [959061, 584538, 648456, 453935, 550257, 838497, 450689, 563098, 844486, 451421, 772878, 900694, 627449, 833467, 705336, 435655, 443376, 679303, 485630, 895905, 197323, 497963, 531269, 714863, 633608, 833261, 686908, 804209, 719116, 867916, 1006409, 714716, 613471, 358596, 788078, 490412, 841555, 528766, 603828, 607234, 142509, 481198, 279785, 447729, 586976, 917167, 325763, 348645, 495297, 490023, 670470, 423274, 378980, 550044, 614013, 451928, 614214, 282403, 547499, 819603, 303848, 128152, 614107, 382606, 734371, 384405, 680801, 404986, 567686, 246579, 472308, 513959, 521837, 434598, 355871, 856330, 453915, 644926, 292485, 596584, 171500, 591137, 362390]
13647C62390j62811L17086P9602k48490K12435o1254j1462j02951p5337N0016
13637C59224L33451C38214L09980j3923A87113Q39522D40876m3135R2271P313
13627D97325H5888N5178K72383J76207j80586J50285k62059M08640A32988M16769
13617E49757n5738K96968l64018K78273j6966j30174k34098L78354j03681k35504
13607C63173J50617k43757K63475J51601D1459M17773j61017J95131l0639A80409
13596E1416L17116J7760M9566r4695p5580O0749J24411j5813j37534j02447K26671
13585D21620k01322J16246J9133P1727K1264r9516j57991J25314m3392M7435J37471
13574D57989B12917O8754J39981L48924l61051r3479l1511o2243n1968J5024F221
$$ y = [362390, 199579, 516665, 596267, 347777, 560212, 498958, 487496, 384545, 309208, 359224, 692675, 338214, 648194, 634271, 187113, 1026635, 440876, 397741, 490012, 497325, 85888, 141066, 413449, 589656, 409070, 559355, 297296, 705936, 132988, 549757, 494019, 790987, 426969, 705242, 688276, 558102, 324004, 702358, 598677, 363173, 513790, 270033, 533508, 685109, 41459, 459232, 298215, 493346, 462707, 180409, 51416, 368532, 386292, 435858, 341163, 265583, 326332, 450743, 434930, 297396, 194949, 421620, 220298, 336544, 355677, 427404, 448668, 349152, 191161, 316475, 273083, 320518, 457989, 212917, 281671, 421652, 770576, 409525, 316046, 284535, 222292, 170324, 185348, 6221]
13562D20982L16177A96058J48704A51605K8241D1944L44700j63731O2086K3896
13552C08895L39902k96527j27352K69286A87790L14413O2002r1738q3176j47827
13542B41464K95272H4887K09100P3785j36148K77655B00390K82973j71477o6869
13532B45017Q6726P0666m0803A64517K99925B22436L18224k35681n829J54485
13522D53635j8866j70076d0428E74517k76803m2748J6283P4014N02828k65573
13512E82518E0025K76814j33158M7481B9183K42078O8649P0567j0375n5556K75017
13501F19563B35210k0174K91088j09703a43608D78359k29284L42568m2238k72515
13491B76890q6123N3739o8206j1564N4630a6388B67379D5541J82228J98286O1258
$$ y = [420982, 737159, 196058, 344762, 151605, 179846, 41944, 386644, 222913, 284999, 308895, 648797, 352270, 224918, 494204, 187790, 502203, 564205, 472467, 389291, 241464, 536736, 84887, 293987, 367772, 231624, 509279, 200390, 483363, 311886, 245017, 331743, 402409, 361606, 164517, 464442, 222436, 540660, 304979, 299150, 453635, 434769, 264693, -40428, 574517, 297714, 254966, 271249, 345263, 848091, 582518, 50025, 326839, 193681, 241162, 29183, 271261, 339910, 410477, 400102, 344546, 619563, 235210, 215036, 506124, 396421, -143608, 478359, 249075, 591643, 549405, 276890, 190767, 244506, 176300, 164736, 219366, -16388, 267379, 45541, 227769, 426055, 487313]
13480D87313q253k33415J54245j06964M7692J8645k5643l1747K11045j60970J8423
13469C70371j59996L69625r4355g6328A41255n3533J59681k6426M61154k14368
13459D67763l3422j18657j15398d5989B41461F3411K4967L13867A97174Q6452
13449B83626L1310J03259Q4634j60320n9339N7316J83865k59080o3466o8108A2221
13437G2409M05275j27539A73837K23743j24964A05782L18555A05091K21992D1236
13426B72261r5273D655J70611K4491b3759E62083B63120k5394p1951D8165a2977
13414D12743G4721Q1320g7943C58803J50706A99674o0826L83914B59293K08247
13404D67540A82789J41114L2370j21131K30172L6161G5147M01859p1321j91769
$$ y = [487313, 479060, 245645, 399890, 292926, 340618, 359263, 333620, 301873, 512918, 351948, 370371, 210375, 580000, 485645, -76328, 141255, 87722, 247403, 220977, 682131, 467763, 434341, 315684, 200286, -45989, 241461, 63411, 88378, 402245, 197174, 283626, 314936, 418195, 502829, 342509, 283170, 340486, 524351, 265271, 201805, 133697, 12221, 72409, 477684, 350145, 173837, 397580, 272616, 105782, 424337, 105091, 327083, 41236, 272261, 176988, 4655, 175266, 199757, -23759, 562083, 263120, 237726, 165775, 48165, -12977, 412743, 74721, 156041, -77943, 358803, 509509, 199674, 138848, 522762, 259293, 467540, 182789, 323903, 356273, 235142, 465314, 501475, 75147, 477006, 405685, 213916]
13394B13916D4325L92192j28116k7494J88858h4974B23345B462Q3944B8814Q4012
13383A12826L59731F5829K96549m8724A07495J46455N1217N4120k7581j36222
13373A95484J22530K86535B91182J67286J0590l6941F9403L27573g9719B53170
13362D25971l7631a08056B33973n6694B803J06721l9361O5297J81210G1324K39817
13351C11141Q5554A31716J49909K16622B33454M9726M4115A46071L27899k02958
13341B71012J81115o9584I6247i8260C59554C5111K48075j23610e7649A49041
13330A26605C426J10025K13474p6542A13941Q7938L02199A19403L08301j15033
13320C12671p012P022F5280M05679j67402G3869K25553A07298J98540J1363j10357
$$ y = [213916, 44325, 436517, 308401, 280907, 469765, -84974, 223345, 2462, 86406, 28814, 112826, 472557, 65829, 362378, 313654, 107495, 253950, 305167, 359287, 331706, 195484, 318014, 604549, 291182, 458468, 469058, 432117, 69403, 396976, -79719, 253170, 425971, 388340, -108056, 233973, 177279, 2803, 109524, 70163, 135460, 316670, 71324, 311141, 396695, 131716, 281625, 498247, 233454, 283180, 327295, 146071, 473970, 271012, 452127, 382543, 96247, -98260, 359554, 35111, 283186, 159576, -57649, 149041, 126605, 3426, 113451, 326925, 250383, 113941, 201879, 504078, 119403, 427704, 312671, 305659, 312681, 65280, 470959, 303557, 73869, 299422, 107298, 305838, 317201, 206844]
13309B06844K94395k14864A36129J97750p5029k5385j03511c2391A49585J51172
13299C00757A07579J11420L8092J1159N2259p0047a57857g8379B58136A09728
13288a96343d6833q6563A52803A1396N6294K42109A00381J11594G9381P9455K09311
13277C68147a33007B7307N6790a39844D74716A20901E3269K05577K09818j54494
13267C14170A8760J73007J2435l0493J45130b55746F2739B0795M1373O2075b44207
13255g6917A89400m1100J89115K7995o5260n605f6131B40540J90556b6907B22918
13243i3689A99987p6237N4297l9302J98768h7707C39428b42587B60101m6818o0955
13232A52328J14758j28015n7529a57144P6840B99329A31652J0491C4203J86433
$$ y = [206844, 501239, 286375, 136129, 333879, 258850, 233465, 129954, -32391, 149585, 300757, 107579, 218999, 257091, 268250, 320509, 250462, -157857, -78379, 258136, 109728, -196343, -46833, -133396, 152803, 11396, 67690, 309799, 100381, 211975, 79381, 158836, 368147, -133007, 27307, 84097, -139844, 474716, 120901, 53269, 258846, 468664, 314170, 18760, 191767, 204202, 173709, 318839, -255746, 62739, 20795, 62168, 124243, -244207, -76917, 189400, 148300, 337415, 365410, 300150, 294545, -66131, 240540, 431096, -26907, 222918, -93689, 199987, 123750, 178047, 138745, 337513, -87707, 339428, -242587, 260101, 213283, 152328, 267086, 139071, 81542, -157144, -80304, 299329, 131652, 142143, 34203, 220636]
13222B20636P5269D3547a27014I5836a02220C06229G9066J26328a10586A71370
13211C79437A78957K51460j74257M1881D3453N9033O1323P3315Q8418q8192J02578
13200C39928a7971C2397J88847L7915I0259i0632A37776J52626h0057a0303F7096
13188a95375B53097A01688M0342J87567C8538e3870B13786g8922A50750R9193
13178B49943M6377b76205C29122H309a75398B21048l7377F933K0881K26391P2700
13167C26905d0827l7396k8895B31965D4305A7986K37211b83183A3229a022j30248
13156a31270B16633D0466M06450k22524q9367P906F7802b23467E4701B5467N2199
13145G7666J51103K62672A1785J13620J50581A22661A5999b053C32413A55248
$$ y = [220636, 295905, 43547, -127014, 95836, -102220, 306229, 79066, 205394, -110586, 171370, 379437, 178957, 430417, 256160, 298041, 43453, 102486, 163809, 237124, 325542, 237350, 339928, -17971, 32397, 221244, 259159, 90259, -90632, 137776, 290402, -80057, -10303, 67096, -195375, 253097, 101688, 142030, 329597, 38538, -53870, 213786, -78922, 150750, 249943, 296320, -276205, 329122, 8309, -175398, 221048, 183671, 6933, 27814, 254205, 326905, -40827, -78223, -107118, 231965, 44305, 17986, 255197, -283183, 13229, -1022, -131270, 216633, 40466, 446916, 224392, 135025, 142931, 67802, -223467, 54701, 25467, 77666, 228769, 491441, 11785, 125405, 275986, 122661, 15999, -2053, 332413, 155248]
13134h803A31446c66192h1223B22420J08464A29937K33604E6187a75217B48527
13123A91670D4832J84861c4312B09045l1170b31436C36173J65505A92404J83677
13113C76081q6379b52112A77488i4176C36894a31402A70473l2025J12778n8224
13103A93002p4565J50058m3730m1554D2486K05616c4423D33061j65308E7574J32684
13092A90258J61471j66942C5797c0115H8472B6027Q5371K69702j17027d7408B5077
13080A79896d01059C40294F5213Q8618C9031J59026P0187j20498a95596H9516
13069d2515A38670c9834A26939a54355A71252L013K71996b64163O4995E9058K48725
13058C07783l2799l3436J1K23157a11474A48257B70K4713J52819F0756a44581
$$ y = [-8803, 131446, -366192, -81223, 222420, 330884, 129937, 363541, 56187, -175217, 248527, 191670, 44832, 229693, -34312, 209045, 177875, -231436, 336173, 501678, 192404, 376081, 289702, -252112, 177488, -94176, 336894, -131402, 170473, 138448, 251226, 193002, 118437, 268495, 224765, 183211, 42486, 248102, -34423, 433061, 267753, 57574, 190258, 351729, 184787, 35797, -30115, 88472, 26027, 111398, 381100, 264073, -47408, 25077, 179896, -401059, 340294, 65213, 153831, 39031, 198057, 268244, 147746, -195596, 89516, -42515, 138670, -39834, 126939, -154355, 171252, 174265, 446261, -264163, -199168, 59058, 307783, 274984, 241548, 241559, 464716, -111474, 148257, 270, 24983, 177802, 60756, -144581]
13046A47208G812J38149J39085b2399C93342a20664b6671D26446j99246j09098
13036A18102c5290F4738j4014e106A79945a10666K8631A61263J23902E3578Q002
13025F1580q826L05208D2816J42022J61760j21303a39626A14827f1227A26279
13014C7572K89940H0354K88246c0822A90332e4465A94136J48404j12996a84001
13003a8475A80158c4655A48876L6282E0530K6685i3384m6474A8818f959A93072
12991a94488A32390J25672O9841m2105f5460A37461a97478A37507m3106a00752
12980a5308B51199f3718k3844A74065A0238K57374j20786a34478A41899b10492
12969C89878A75621L2250J5911J28517D3634J6514J53479A5378K33849p5062d0686
$$ y = [147208, 7812, 145961, 285046, -22399, 393342, -120664, -26671, 426446, 227200, 118102, -35290, 64738, 50724, -5106, 179945, -110666, -82035, 161263, 285165, 53578, 61580, 52754, 357962, 42816, 184838, 346598, 225295, -139626, 114827, -61227, 126279, 37572, 327512, 80354, 368600, -30822, 190332, -54465, 194136, 342540, 229544, -184001, -18475, 180158, -34655, 148876, 185158, 50530, 77215, -93384, -139858, 18818, -6959, 193072, -194488, 132390, 258062, 327903, 285798, -65460, 137461, -197478, 137507, 94401, -100752, -15308, 251199, -63718, -87562, 174065, 10238, 267612, 146826, -134478, 141899, -210492, 389878, 175621, 207871, 223782, 352299, 43634, 60148, 213627, 15378, 249227, 174165, -40686]
12957a67384k67001E3268Q7665e3223D12466b2164D1399J42597d8448A24012a40623
12945g5085m9077m710B05836E4010J40637e1296I9322J20793E7935M4256D3272
12933B2584a87925B28452b51973c7513A55498o5596e4602B74739A12334d84j79653
12922a80137B27406F4849K25780j19276c13446E8579i5162B08476G7262e2184
12911b49536A01623f6479B37851A09008a08153B9191J10579K56946A59874a11554
12900B2385D705K23330n2190a30913D3749h6528M0844a2477E1863K3375K39588
12889C14826g3185A81327d137k35865d4051C0190Q0980J3068B0622c2110Q604
12878b3506j65485B93058C8608O1532a40710C30294q9950a17179k17473a9299
$$ y = [-167384, -434385, 53268, 140933, -53223, 412466, -22164, 41399, 183996, -48448, 124012, -140623, -75085, -124162, -128872, 205836, 54010, 194647, -51296, 99322, 220115, 57935, 102191, 43272, 22584, -187925, 228452, -251973, -37513, 155498, 89902, -54602, 274739, 112334, -484, -180137, 227406, 64849, 290629, 171353, -313446, 58579, -95162, 208476, 77262, -52184, -249536, 101623, -66479, 237851, 109008, -108153, 29191, 139770, 396716, 159874, -111554, 22385, 4705, 228035, 175845, -130913, 43749, -86528, -45684, -12477, 51863, 75238, 314826, -73185, 181327, -4137, -240002, -44051, 30190, 111170, 124238, 20622, -32110, -23506, -188991, 293058, 38608, 100140, -140710, 330294, 240344, -117179, -334652, -19299]
12867b27048C0428O6657D1929M44732d71080A00993i0741M3388B70217A735L25974
12856C27709b22812d5946a9570B21466c1994B06241a3631L987A08548D0891R7520
12845A38411n713c0500D4216e0616j06205B10617B1961K32959m4116c45063c1100
12833g6666D7387e616j35348D24145H8694L5580m9459K2798B5915d0705B10108
12821A19918P2619I0925K08862b8430j55597A35038K4407J02765a20219j2037
12811a32256D5878J62783a5973q0774j36761A46454a97227Q1198A26166b51667
12800A62101p5484B6973L58821c7942l2896b3799F9960J59350J73694h2214A6664
12788D21589A60939g8049H0852B4523e3144A52459A9288b53410g0812k19265A03587
$$ y = [-227048, 30428, 97085, 41929, 486661, -471080, 100993, -90741, -47353, 270217, 1735, 327709, -222812, -45946, -19570, 221466, -31994, 206241, -13631, -9644, 108548, 40891, 138411, 132698, -30500, 44216, -50616, -156821, 210617, 21961, 254920, 210804, -345063, -31100, -76666, 47387, -5616, -140964, 424145, 88694, 124274, 74815, 97613, 25915, -40705, 210108, 119918, 192537, 90925, 299787, -28430, -184027, 135038, 159445, 262210, -120219, -132256, 45878, 208661, -15973, -96747, -233508, 146454, -197227, -116029, 126166, -251667, 162101, 86617, 26973, 385794, -37942, -70838, -23799, 69960, 229310, 403004, -82214, 16664, 421589, 160939, -78049, 80852, 24523, -53144, 152459, 19288, -253410, -70812, -290077, 103587]
12776h7576C22727j25937C95L377g1994M745L1095B31468a9595B0356K73207a67384
12763H4156d9399k21227d0337B2917K32421b26846B39399K2389c3145A39186N4499
12752A93685M2939M2159a02073j41664c0927H269Q1733K59752b02776P5644A1597
12740G7837b1021A68948b1130A68520H3150C9788M9854C0824J93257c5666j60815
12729a96481P9620C7927F066M46183a35943O0675R500A36322a53929D8703K14798
12718B63501r0551i8863B21612L2023a18511C78295j69204c11786A03490M1037
12708A44527K5709m3284f4101C70397d4931B16315a1999B78155A01858J34424
12698B36282A13384i6347J499n6480j0074q536k3612c7481A8090J21883j9233
$$ y = [-87576, 322727, 196790, 395, 3772, -71994, -67249, -36154, 231468, -19595, 20356, 293563, -167384, 84156, -49399, -270626, -40337, 22917, 255338, -226846, 239399, 261788, -33145, 139186, 193685, 236624, 278783, -102073, -243737, -30927, 8269, 90002, 349754, -202776, -127132, 11597, 77837, -21021, 168948, -21130, 168520, 83150, 39788, 89642, 30824, 224081, -35666, -196481, -116861, 37927, 6066, 452249, -135943, -75268, -65768, 136322, -153929, 48703, 263501, 172950, -98863, 221612, 253635, -118511, 378295, 209091, -311786, 103490, 144527, 170236, 126952, -64101, 370397, -44931, 216315, -11999, 278155, 101858, 236282, 113384, -96347, -94848, -151328, -161402, -169938, -193550, -37481, 18090, 139973, 120740]
12687A20740a41157C587Q939K40965h3040I0285J2437L8391b22145j1404A69332
12675B16551a04109A36324C3894K00077G1511j462h1306A89681a98634A21652
12664B7374a28062E8958i0282I7441a15595C02596D3028K40083c7849i965A10271
12652A71929J12216q6908H0098J28904C0704J16545E0556a16962J2974H2845a70534
12640A14910A2257J08953c4826n83A19589b42452i5966C49775d300k11418F5131
12628A55916O00278d503I483K47509p0342f1033B02062o5421o2089k2646b17034
12616D6512M3422e600D21404f5056r160j31511i7513d6742j03992A15115i6193
12604a72310F3838b4880I8088C3448P9913R5775b4040j70203A69016e8998A14468
$$ y = [120740, -141157, 3587, 12526, 253491, -83040, 90285, 102722, 141113, -222145, -233549, 169332, 216551, -104109, 136324, 33894, 233971, 71511, 70049, -81306, 189681, -198634, 121652, 27374, -128062, 58958, -90282, 97441, -115595, 302596, 43028, 283111, -37849, -9965, 110271, 171929, 284145, 197237, 80098, 209002, 30704, 147249, 50556, -116962, -103988, 82845, -170534, 114910, 12257, 121210, -34826, -35409, 119589, -242452, -95966, 349775, -4300, -215718, 65131, 155916, 756194, -4503, 9483, 256992, 186650, -61033, 202062, 136641, 74552, 51906, -217034, 46512, 89934, -5600, 421404, -65056, -74216, -205727, -97513, -46742, -150734, 115115, -96193, -172310, 63838, -24880, 98088, 33448, 113361, 209136, -24040, -194243, 169016, -58998, 114468]
12592E6884K97817M8684a37932E7921a08131N945j6866A68719a3040k97978h7581
12580E54562N6845b13062A12778O424b11350B39886J46980a35108B56749b25412
12569A14173P5700Q4885I3264l2035a43932B21579b85938B02518I3547b36286
12558A22447a83330B08944E3083a48796B27272a29997e5303A21072B7434g0665
12547A36378o898E3153h8923I9917J0471P6937J37471j60286F6782N4305g584
12535a10230A68318A0612J02727d8599E9404O6818a24295C18238a86689G4913
12524H5439a84088d4495A18850e7839q986A71634N1028P472A00905H014e8423
12512A71292k523J33863K01983B31459D2942M1888B0823K39011j00510B3517O9251
$$ y = [56884, 354701, 403385, -137932, 57921, -108131, -102186, -119052, 168719, -13040, -311018, -87581, 554562, 611407, -213062, 112778, 119202, -211350, 239886, 386866, -135108, 256749, -225412, 114173, 189873, 274758, 93264, 61229, -143932, 221579, -285938, 202518, 93547, -236286, 122447, -183330, 208944, 53083, -148796, 227272, -129997, -55303, 121072, 27434, -70665, 136378, 129480, 53153, -88923, 99917, 110388, 187325, 324796, 164510, 66782, 121087, -7584, -110230, 168318, 10612, 113339, -48599, 59404, 126222, -124295, 318238, -186689, 74913, 85439, -184088, -44495, 118850, -57839, -66825, 171634, 222662, 230134, 100905, 8014, -58423, 171292, 168769, 302632, 504615, 231459, 42942, 84830, 20823, 259834, 159324, 23517, 92768]
12501I2768J03315H7526a97111A32582E7783b64253F6346a59892B92965A11906
12490d8523k13647A57182i3017A17956J34199e9239A28630i0056d4426B19930
12479a62664E4808K89717a98563a8844o4407n6517F0894F503a80818C40990b2950
12467h3720C26462a54883B14460b25282a06421j9519A07203c14620A22712e1489
12456g9627E7950B6424J28236a06815C8969O8928J17162B1473K09765b4671A34353
12444a67749h597A38502b7162A30063E7819b47845a4552A88515D6264i6439N713
12433i0726B55146H3113O9683K16627g2102k57107H9042c05456J42642M3185E0937
12421B0314e2255D06691n3507C878c1076j9591n808D7487a58206A52673b50580
$$ y = [92768, 196083, 87526, -197111, 132582, 57783, -264253, 66346, -159892, 292965, 111906, -48523, -262170, 157182, -93017, 117956, 252155, -59239, 128630, -90056, -44426, 219930, -162664, 54808, 344525, -198563, -18844, -83251, -139768, 60894, 6503, -180818, 340990, -22950, -83720, 326462, -154883, 214460, -225282, -106421, -125940, 107203, -314620, 122712, -51489, -79627, 57950, 26424, 154660, -106815, 38969, 107897, 225059, 21473, 231238, -24671, 134353, -167749, -8597, 138502, -27162, 130063, 57819, -247845, -14552, 188515, 46264, -96439, -90726, 255146, 83113, 152796, 369423, -72102, -329209, 89042, -305456, -162814, -119629, 50937, 20314, -52255, 406691, 353184, 3878, -31076, -50667, -56475, 47487, -158206, 152673, -250580]
12409c29732G1487o692g8841r9970F4667a76766J4527m50646b21652I0353b48853
12397b3136B14713D2248K96180d3830j16011N7287j06340D4135a38334G2906c14148
12385A24962B5932N2665i7976E5589P5345J88532C9595K6509f6437A36745c57323
12373c0405C0261J15527b90247B50173b52232D9433M7448E486K02545K38655i1218
12361d25753B59678a01338A11351i6317B56139b8648A43052D1063r781a06422
12350a40280L7781j25861J10140r7840E8093P7571d2003j18282P2268B45842g6080
12338B8909c51755C86101e8817l8823K5148A41078J9274b610B07491b0316B05650
12326c2073B4371L048J20461A7512d4960k44202F9717h1216L4067A79198l5360
$$ y = [-329732, 71487, 64795, -78841, -178811, 64667, -176766, -162239, -612885, -221652, 90353, -248853, -23136, 214713, 42248, 338428, -43830, -159841, -102554, -208894, 44135, -138334, 72906, -314148, 124962, 25932, 78597, -97976, 55589, 130934, 319466, 39595, 66104, -66437, 136745, -357323, -30405, 30261, 145788, -290247, 250173, -252232, 49433, 96881, 5486, 208031, 446686, -91218, -425753, 259678, -101338, 111351, -96317, 256139, -28648, 143052, 41063, 31282, -106422, -140280, -102499, -228360, -118220, -216060, 58093, 135664, -42003, -160285, -88017, 245842, -76080, 28909, -351755, 386101, -58817, -97640, -72492, 141078, 160352, -2610, 207491, -20316, 205650, -32073, 24371, 27419, 147880, 17512, -44960, -289162, 69717, -81216, -47149, 179198, 143838]
12315A43838d8806j65709j265h9394B79712A14118d5B06191d0365I5678b3513
12303C04052j32311G9981K56784j14701C2118Q2538b8080F5781A662i7988C88444
12291h8934p7098A20362e0978k57169a23152C2618N7669j7417b57368D0876a62282
12279C77414b7191j92551M7828g6805a5569o642A27695Q704a66540B60200A14476
12267b1146I3957l2883M5467J76400j39076k8623J7039c4534A87289B3315e7218
12255e4154E11181A33629J05403C4929K23112p3367J34580h8829H5941J06097
12245A92038F1593a42067A61786b24887D24378a20006a5963j52196b9428H3084
12234H3994J15748p7913h7738d0836B16262j6802Q013G2927a32196C68102j72433
$$ y = [143838, -48806, -214515, -215780, -89394, 279712, 114118, -45, 206191, -40365, 95678, -23513, 304052, 171741, 79981, 336765, 222064, 32118, 114656, -28080, 65781, 1662, -97988, 388444, -88934, -166032, 120362, -50978, -308147, -123152, 32618, 90287, 72870, -257368, 40876, -162282, 377414, -27191, -219742, -171914, -76805, -15569, -22211, 127695, 136399, -166540, 260200, 114476, -21146, 93957, 61074, 106541, 282941, 143865, 115242, 132281, -34534, 187289, 23315, -57218, -54154, 511181, 133629, 239032, 34929, 258041, 184674, 319254, -88829, 85941, 192038, 61593, -142067, 161786, -224887, 424378, -120006, -15963, -168159, -29428, 83084, 83994, 199742, 121829, -87738, -40836, 216262, 199460, 207473, 72927, -132196, 368102, 195669]
12223A95669F0671k005L13186d8642A08106a55935A97215E5645a03502B85677
12212d0519A93677I685M40812A82901a12290B55288e5103m8807B0756e0775A39197
12200D44098l9200E166K32443n2746b0742D41879j24226A02961C8955b1823B8759
12188E5695A9632J72763a2614C49979I279O5381B4668h4577A12209J0747J16028
12177B38984m7693a43598G5812K63066a58980A50200c0280A11080N7312J00352
12167B68744Q2695b4338C45281F4001C550K73934a14097G8552i8672C33883A6001
12155F0415c3185m2045B14955A6197K08137E3933J13783M7584M0113a10063C15088
12143A79481o0217A7189J09339K45940P010d4071C44174a42785p7792c9704A20719
$$ y = [195669, 60671, 58666, 371852, -48642, 108106, -155935, 197215, 55645, -103502, 285677, -40519, 193677, 9685, 450497, 182901, -112290, 255288, -55103, -103910, 20756, -50775, 139197, 444098, 404898, 5166, 237609, 184863, -20742, 441879, 317653, 102961, 38955, -21823, 28759, 55695, 19632, 192395, -12614, 349979, 9279, 74660, 24668, -84577, 112209, 122956, 238984, 191291, -143598, 75812, 338878, -158980, 150200, -30280, 111080, 168392, 268744, 351439, -24338, 345281, 64001, 3550, 277484, -114097, 78552, -98672, 333883, 16001, 60415, -33185, -75230, 214955, 16197, 224334, 53933, 167716, 215300, 255413, -110063, 315088, 179481, 119264, 17189, 126528, 372468, 379478, -44071, 344174, -142785, -220577, -39704, 120719]
12131a36713l5263I810J86728J41252p7508a52591j11351H9176a56180A49917
12120h0503j13655C7038b92862F6631J3914J74592j02336F0863m882a80916B77453
12108c06352B1573Q3250f8468k618A56646K1362a78492H0174a64504f5097j67225
12097b32322E2705h4757b2015j8314j9487k01127a9020l85025J28341c9119A41885
12085h5287B67914d63615r4910d940A7064f524k63980r3916g6709j56236f1019
12073A92552b12509a7548l0182F911M21119a0423B1550L8067i3938A83678a47345
12061E07849a9479l8922j37350M9395A88997A2783J19447d3979C49706H4873M05763
12050D90636J011412n25497A27277K04809C1227N6467D1991A1593c89882a3116
$$ y = [-136713, -171976, 9810, 196538, 337790, 260282, -152591, -263942, 89176, -156180, 149917, -80503, -194158, 37038, -292862, 66631, 80545, 255137, 152801, 60863, 55981, -180916, 277453, -306352, 21573, 104823, -68468, -71086, 156646, 178008, -178492, 80174, -164504, -65097, -232322, 52705, -84757, -22015, -40329, -59816, -260943, -19020, -404045, -275704, -39119, 141885, -85287, 267914, -463615, -558525, -4940, 17064, -6524, -270504, -364420, -76709, -232945, -61019, 192552, -212509, -17548, -47730, 6911, 428030, -10423, 21550, 59617, -93938, 183678, -147345, 507849, -19479, -58401, -195751, -146356, 188997, 12783, 132230, -43979, 349706, 84873, 490636, 1502048, 976551, 127277, 332086, 31227, 87694, 41991, 11593, -389882, -13116]
12039c4687F8119f21121A18791J05429b29106k51011e913k47019F2761J3440L29597
12028D05798h5122H7766P3506c1036p8902b7191o9023p4778f7167b7672C8022
12016A01084R4583E8094j4831L210N7137A0349c07591C7838J48975q9758I319
12004h7913a6529m6138b2115j23073F3413L5977F335a92250a4320B36430b04154
11992g8405B57501g3125B29036o4407a81803A01485m427i4417a960m8402q151
11981e8513H677d3928E9318i5793Q071A05133P7542b42406G4143a55910A79727
11969h4362A6611e2226B2499b7545l3596D7700c95016B69747a29071m5024A38482
11957d81232B01596E2368J79803C032b28750A00936l8349g7125p0057f1086D38075
$$ y = [-34687, 68119, -621121, 118791, 224220, -229106, -480117, -5913, -252932, 62761, 76201, 405798, -85122, 87766, 161272, -31036, -109938, -27191, -96214, -170992, -67167, -27672, 38022, 101084, 195667, 58094, 43263, 46473, 103610, 10349, -307591, 37838, 186813, 97055, 9319, -87913, -16529, -62667, -22115, -145188, 63413, 99390, 6335, -192250, -14320, 236430, -204154, -78405, 257501, -73125, 229036, 164629, -181803, 101485, 97058, -94417, -1960, -50362, -58513, 8677, -43928, 59318, -95793, -87722, 105133, 182675, -242406, 74143, -155910, 179727, -84362, 16611, -52226, 22499, -27545, -61141, 47700, -395016, 269747, -129071, -174095, 138482, -481232, 201596, 52368, 232171, 3032, -228750, 100936, 62587, -77125, -147182, -61086, 438075]
11945a07988c7892D4662b13461P4603q3317A97977C7321K2648d32283a66260g5018
11933A74440a21640k8123j21302E71953d3320A88787E1654c32920J12269A07873
11922c20428f8898A00627b72210c0524j09324A04166d40154e8121k4006D986K89350
11911B94336b4406F9126M5470n5228J07270c23109B13330a1278l85800a07198
11900A92305e2901m6714j2034D3255L6816J8395g2788m1081e0879l06897A12872
11888a39717a7489A2773b91544a41995K6584A94618J31668e8977E4421f7789j12156
11877a79945l4935f7755K7309A45808N0353d109j08351F4438k0892a42580n7972
11866b00552h1513A11631A3244J81261A2190a20676A12219a25855F33728e1228
$$ y = [-107988, -37892, 44662, -213461, -138858, -222175, 197977, 37321, 59969, -432283, -166260, -75018, 174440, -121640, -149763, -271065, 571953, -43320, 188787, 51654, -332920, -220651, 107873, -320428, -68898, 100627, -272210, -30524, -139848, 104166, -440154, -58121, -82127, 4986, 294336, -24406, 69126, 114596, 59368, 166638, -323109, 213330, -11278, -397078, -107198, 192305, -52901, -99615, -111649, 43255, 80071, 98466, -72788, -113869, -50879, -357776, 112872, -139717, -17489, 12773, -291544, -141995, -115411, 194618, 326286, -58977, 54421, -67789, -179945, -214880, -67755, -40446, 145808, 196161, -4109, -112460, 64438, 43546, -142580, -200552, -81513, 111631, 13244, 194505, 12190, -120676, 112219, -125855, 633728, -51228]
11855e70897d4634j37380j351c5739A1936a32772A81539a49735A22386b5517m467
11844b9984B54603C9891j070a87537I8208B3668J4827h9843p7039A02038a97964
11832i4359A4486Q5603K37269a59218G111e68170c5821B0343H264O5584b92614
11820a04498A29050J19886D904g0420k31777J7589c7620j31342e3330B59445H4257
11808A37350C9780N7654C7328L77033b81317B34264j00622B513h3847c095j44367
11797a47462j47715b7656B02703H1459L6334h2960A35623c4620j10513G885J59149
11786A67034p2261f5013k3224j29491A05952b19787C13428a95491i3993A16639
11775F324J63915c61391A26617C0359a77774d2767D5008O0279a77274A27547h4546
$$ y = [-570897, -44634, -182014, -183365, -35739, 11936, -132772, 181539, -149735, 122386, -25517, -29984, 254603, 39891, 38821, -187537, 98208, 23668, 38495, -89843, -166882, 102038, -197964, -94359, 14486, 100089, 337358, -159218, 7111, -568170, -35821, 20343, 8264, 73848, -292614, -104498, 129050, 248936, 4904, -70420, -302197, -284608, -37620, -168962, -53330, 259445, 84257, 137350, 39780, 97434, 37328, 414361, -281317, 234264, 133642, 2513, -83847, -3095, -147462, -295177, -27656, 202703, 81459, 117793, -82960, 135623, -34620, -145133, 7885, 167034, 94773, -65013, -88237, -217728, 105952, -219787, 313428, -195491, -93993, 116639, 6324, 170239, -361391, 126617, 30359, -177774, -42767, 45008, 105287, -177274, 127547, -84546]
11763H9138J78492B1331e0985E6623J5441a40457E1809c52946C9156J25831b15192
11751B7622a34280k13005K6394G7939J45826r8421E708L21773b51348j41560C3146
11739b07115m05006g539B91973h193m3347a2663p6876B61138e0166A36951e1256
11727a34077a8963O352n2086K1114I2128h3906A52844a8004j17041o709P093K1227
11715a13434k15219J54267p4115B36310E5737b17230A84771l7924C5041L9278
11705G4319d83131a54161A65823a26323c8775B50965j18911k7a97085m2388e79
11693b7302l0755o6944M9714p1053O0864A43949M3090b27599f4281G2037h5535
11681c98264a0345E5944b2441I9930b46837a21812j9174a8566j78967c5682j03670
$$ y = [89138, 267630, 21331, -50985, 56623, 72064, -140457, 51809, -352946, 39156, 164987, -215192, 27622, -134280, -347285, -320891, 77939, 223765, 125344, 5708, 327481, -251348, -392908, 33146, -207115, -612121, -7539, 291973, -8193, -51540, -12663, -89539, 261138, -50166, 136951, -51256, -134077, -18963, -12611, -64697, -43583, 92128, -83906, 152844, -18004, -135045, -141754, -134661, -113434, -328653, -174386, -248501, 236310, 55737, -217230, 184771, 146847, 35041, 74319, -483131, -154161, 165823, -126323, -38775, 250965, 132054, 132027, -197085, -239473, -579, -27302, -58057, -125001, -75287, -146340, -85476, 143949, 187039, -227599, -64281, 72037, -85535, -398264, -10345, 55944, -22441, 99930, -246837, -121812, -140986, -18566, -197533, -35682, -139352]
11670a39352C9278a2804C6123g8348j95251J02501j22106f4088D7737h5746A99086
11658G9252J61636b26768o6889a24491j8172A48618N0651b13527j4627A76506
11647A3477J68687p9844j2495k7093n381c02057c9706A82697J1729a08669f591
11635c256B26208g6412b3466j04217j3422H368Q4770M410b9284l5102I7646C1575
11622H5161A5188L21701A53006a6072j70802E0308d3575A12331a60513k70419
11612d30932B04873n3481a78269A71153j9103J60383r5130e41239d487B7457a37586
11600a05150k12893a10532I2437b19484M9621Q2396a4680B31334A10000f250A4508
11588i1087L9947j90954D8766P0625d9637k17931c988A08157a84399M3637A10067
$$ y = [-139352, 39278, -12804, 36123, -78348, -273599, -171098, -293204, -64088, 47737, -85746, 199086, 79252, 240888, -226768, -293657, -124491, -142663, 148618, 199269, -213527, -228154, 176506, 13477, 182164, 102320, 89825, 62732, 57351, -302057, -39706, 182697, 194426, -108669, -6591, -3256, 226208, -76412, -23466, -127683, -141105, 8368, 93138, 97548, -29284, -64386, 97646, 31575, 85161, 15188, 336889, 153006, -16072, -186874, 50308, -43575, 112331, -160513, -430932, 204873, 151392, -178269, 171153, 152050, 312433, 217303, -541239, -4487, 27457, -137586, -105150, -318043, -110532, 92437, -219484, -169863, -87467, -14680, 231334, 110000, -6250, 14508, -91087, -51140, -242094, 48766, 119391, -49637, -267568, -3988, 108157, -184399, -140762, 110067]
11576c8193p6742K1838O427d0692B63765a91162f0232A02535C689E78d4797q771
11564e3568j40564E1881Q3491o0172e7281n646H0314c6902k23110A92129b40507
11552G2204a15074D1623P6301a39175A0429L9013a67754r9550A33543O7081A9680
11540A6468L10744b00010I60i9117B0543N6315J51586g9990r0760B4893K58221
11529B83114i7328A9214A318J97124J37136A7640K10077D7175J20134b78810a23534
11517b96408A90731G8604h5744A4696J33813h9063F6113M2166i8850B19752c22829
11505a5646A57822D5104g4988G5005J96173r1238a30304N5195k29540B51124G2904
11493G5243K38771q3695a4481B65663j04935O2801F3874J19390M4470H1695A3983
$$ y = [-38193, -114935, -93097, -86670, -40692, 263765, -191162, -60232, 102535, 3689, 578, -44797, -53568, -194132, 51881, 135372, 75200, -57281, -62927, 80314, -36902, -260012, 192129, -240507, 72204, -115074, 41623, 117924, -139175, 10429, 49442, -167754, -267304, 133543, 200624, 19680, 16468, 327212, -200010, 960, -99117, 20543, 76858, 228444, -79990, -170750, 24893, 283114, -97328, 19214, 1318, 198442, 335578, 17640, 227717, 47175, 167309, -278810, -123534, -296408, 190731, 78604, -85744, 14696, 148509, -89063, 66113, 108279, -98850, 219752, -322829, -15646, 157822, 45104, -74988, 75005, 271178, 179940, -130304, -75109, -304649, 251124, 72904, 75243, 314014, 230319, -14481, 265663, 160728, 223529, 63874, 183264, 227734, 81695, 13983]
11481F215b6241G8856K20681f0956G3160b528B3814J60507a413k63495a7284B90292
11468B6593K81316j07030r1757b83737A23724J03051c79163F6800b2520C14643
11457A81579d375E88521b9441A70506b3379A38723F6791R2150D4269J25143n4418
11446A14994J30858c84221B38890e7552m9039A57718F1431J58187a09067P611
11436a01456M4887j09762C6251c0781A93996D2061i6119B61939l6275a14018l8353
11425a52371G4242J8590J00661i3985B63120b01553i6058A8615K32510A19156
11414F7631R8158K97757q3972i2321D931a61155c3839A02477c35464A13549e9377
11402a5731F4885j0418b18590g8368b2357k90425d3792G0075b96832D00743H9092
$$ y = [6215, -26241, 78856, 299537, -60956, 73160, -2528, 23814, 184321, -1413, -264908, -17284, 290292, 26593, 307909, 200879, 109122, -283737, 123724, 226775, -379163, 66800, -22520, 314643, 181579, -4375, 588521, -29441, 170506, -23379, 138723, 66791, 158941, 44269, 169412, 114994, 245852, -384221, 238890, -57552, -106591, 157718, 61431, 219618, -109067, -101456, -56569, -166331, 36251, -30781, 193996, 42061, -96119, 261939, 225664, -114018, -152371, 74242, 92832, 193493, -93985, 263120, -201553, -96058, 18615, 251125, 119156, 67631, 165789, 463546, 379574, -92321, 4931, -161155, -33839, 102477, -335464, 113549, -59377, -15731, 64885, 54467, -218590, -78368, -22357, -312782, -43792, 70075, -296832, 400743, 89092]
11390A32015a0851j16239a7402j24325k0126A33933K9979a02350M6008r6769C84265
11378a76779B09458L8570j20949e02l9506r078G564i2343c1162A9801K44958a33927
11365A49683b52345k1940M0955D8828a9908I6016f1202j85200Q922J14884c3970
11353F8422b01361B58319j03922b83698J08226L2614n4659C5877K2771G038a75847
11341b05228L805d3546A48122p0072c29566J64255k5409e0158l37632C0801R7111
11330A27912d9353r294h109j122A04722Q0332g5896i9D2532i9547I9724f3k74155
11317b74218a03270G0890a46765I6684A546K06415q5202J8534E9902i5920M7161
11306d8759j56807A54201b47420d0657K0202G8456a44190C22812D7235J26434
$$ y = [132015, -10851, -127090, -17402, -141727, -161853, 133933, 163912, -102350, -56342, -153111, 384265, -176779, 209458, 248028, 127079, -502, -40008, -49086, 7564, -92343, -31162, 19801, 264759, -133927, 149683, -252345, -274285, -233330, 48828, -19908, 96016, -61202, -246402, -237480, -122596, -33970, 68422, -201361, 258319, 154397, -283698, -175472, -142858, -197517, 35877, 58648, 7038, -175847, -205228, -201423, -43546, 148122, 78050, -329566, -165311, -190720, -50158, -387790, 30801, 127912, -49353, -58647, -8109, -9231, 104722, 185054, -75896, -99, 42532, -99547, 99724, -63, -274218, -103270, 70890, -146765, 96684, 1546, 207961, 122759, 141293, 59902, -95920, -48759, -205566, 154201, -247420, -40657, -20455, 78456, -144190, 322812, 47235, 173669]
11296A73669a20001A00028b30004I1063d05588i9578B24005d02649C2434b1224
11285C0244i6179A26767b21136i6876b8034C34284b14564a02284R540j20842B5367
11273a81577D7045d42390A28652b64342A55730a05434j19928B6228J05456a30117
11262A26927a19593m0564k56696A54091C0801J6083a64239A25551c8164d062F6085
11250D4283e6964E4607b29967A09619Q303J12300b90432H9261J28805A07975a36068
11238b34153f2047J1945A44037b51857D3154L289d3712D8835Q5870a44764P371
11227a37393k43382i7600c5714j60219A2939a11473L9607c1122E3399a53636j88301
11216c41937H7909b56708a04752A15945d4009j35044G1054b20280B9215a85380
$$ y = [173669, -120001, 100028, -230004, 91063, -405588, -99578, 224005, -402649, 32434, -21224, 30244, -96179, 126767, -221136, -96876, -28034, 334284, -214564, -102284, -92744, -213586, 25367, -181577, 47045, -442390, 128652, -264342, 155730, -105434, -225362, 26228, 131684, -130117, 126927, -119593, -160157, -416853, 154091, 30801, 46884, -164239, 125551, -38164, -4062, 66085, 44283, -56964, 54607, -229967, 109619, 117922, 230222, -290432, 89261, 218066, 107975, -136068, -234153, -62047, -50102, 144037, -251857, 43154, 46443, -43712, 48835, 134705, -144764, -137393, -380775, -97600, -35714, -195933, 12939, -111473, -71866, -31122, 53399, -153636, -341937, 87909, -256708, -104752, 115945, -44009, -179053, 71054, -220280, 29215, -185380]
11205d55044B25257c6111k28977B12649h8664j5231k9206M2968H7573f7598A8187
11193c3582j80064a2884k8795k29103e4923C0606K6911K426d40300H7152a76875
11181B21133a13414R202C3039a97431I1750j9765J16922a81006B24655c8070l13273
11170c51343A51024a14635A34622c40990H8780O2794b53330J23974A9737e1502
11159A52500a08236I8496L1831a56704a9598E2004a96800C4876O6610O671a99258
11147B43839a33650D08505d1759j9504A89582f6895A23701l225a9569j06569A1304
11135D9983a80648a1225o3536A83437c71205B54980e4398m5788j56330B98155
11124a37795A65758a56802D0944N2360J61835b1551j83534B78009A7788b81016
$$ y = [-455044, 225257, -36111, -265088, 212649, -88664, -103895, -133101, -90133, 87573, -67598, 18187, -33582, -213646, -12884, -41679, -270782, -54923, 30606, 57517, 59943, -440300, 87152, -176875, 221133, -113414, -104212, 33039, -197431, 91750, 71985, 188907, -181006, 224655, -38070, -351343, 151024, -114635, 134622, -340990, 88780, 151574, -253330, -129356, 19737, -51502, 152500, -108236, 98496, 130327, -156704, -19598, 52004, -196800, 34876, 101486, 108157, -199258, 243839, -133650, 408505, -41759, -61263, 189582, -66895, 123701, 120476, -19569, -126138, 11304, 49983, -180648, -11225, -74761, 183437, -371205, 254980, -54398, -100186, -256516, 298155, -137795, 165758, -156802, 40944, 93304, 255139, -21551, -205085, 278009, 17788, -281016]
11113A00107J22181b06838g983m62879c295B62037h877B65958o6437a15523A78868
11101B12848D0290i155D4963N74269A65396K80093A65662D6019L31410A46309
11090a12128G4306b02316M3390D12987A34889a4771B47992F8729J3908L06230
11080C88867J1210e0582C05432K06897r1308j29091Q8654j32789B0708L28927
11070C49635J7803j77501o2123d4406D10491A18063J82485J76735B30362J25030
11060C55392M82741C56044N2951j9220n0613L0878L54528j1853j61858a25135
11049E97009n7727p4461A89688L95286K00282k15695R8877C32797J65696L22894
11039H21387j99774B89006K31798n9859L95217C07890K02538J89147o0198p7852
$$ y = [100107, 222288, -206838, -7983, -470862, -3295, 262037, -8877, 265958, 199521, -115523, 178868, 212848, 40290, -9155, 44963, 619232, 165396, 445489, 165662, 46019, 377429, 146309, -112128, 74306, -202316, -158926, 412987, 134889, -14771, 247992, 68729, 82637, 388867, 400077, -50582, 305432, 512329, 421021, 291930, 380584, 247795, 20708, 349635, 367438, 189937, 127814, -44406, 410491, 118063, 300548, 477283, 230362, 355392, 838133, 356044, 408995, 389775, 339162, 370040, 724568, 712715, 550857, -125135, 597009, 539282, 464821, 189688, 584974, 785256, 569561, 668438, 332797, 498493, 821387, 621613, 289006, 520804, 460945, 856162, 307890, 510428, 699575, 639377, 561525]
11029E61525N1526q9864L8569P5750k02953K44280j8486B24334J8015L79168j54353
11018D67164J34012j30356K48541k08533j76795M7812K43719j14656G0271L68672
11008D38943K7208n3831l282R5277P2987B81716P2476J64917j12878J56099j49054
10997D13276J88350j05708J17084L1806k47653N2141R8129m6301L29662r6686
10987G34100K6087j67301N81763n00092P9438q435J38823J2916O5098K31435L89614
10976A583446N4568K52079q5483L34105L96513l39208J63313k25828p0459l02322
10966A760724j35038k09660k07453k46205J5033k35977j10380J90638J01432l01606
10956F21508L68726L3816l79332j20948n4736r6015F2002N29755b7205o1118A47919
$$ y = [561525, 613051, 523187, 561756, 637506, 434553, 678833, 660347, 224334, 242349, 621517, 467164, 601176, 470820, 719361, 510828, 334033, 381845, 625564, 510908, 70271, 438943, 466151, 412320, 409038, 504315, 577302, 281716, 354192, 519109, 406231, 562330, 413276, 601626, 495918, 613002, 644808, 397155, 449296, 547425, 501124, 830786, 734100, 760187, 592886, 1174649, 674557, 753995, 745560, 884383, 897299, 962397, 1193832, 1583446, 1638014, 1890093, 1804610, 2138715, 2535228, 2196020, 2359333, 2133505, 2063046, 1760724, 1625686, 1416026, 1208573, 962368, 977401, 741424, 631044, 821682, 923114, 621508, 990234, 1024050, 644718, 523770, 469034, 373019, 62002, 591757, -27205, -88323, 147919]
10944A93616I782M71766G464c6192C03386F5377K31165q0939q2980J87273F8814
10932E543K57891b15167B49614b53509c7553B7170e6105B46241A15795a5433l80464
10921c95897B90011a2957l6807J5751B50393i9906j02195A1997R3940e8442H6043
10909a14009k9716E671J5451a315j01302l2562D6304a106q5076L8361k81388A2743
10896E7566e5543A36973a00373n0524B5261b51052c1106j33124j01093J0970E6164
10884H8306J7015k0630J37113j00901a74702e7033l84402a42074O6218K527n1615
10873a24944G3252a07769m7980D1901R6577b6267j30891O6875I2299a39040N7193
10862h1847L5518l1514q2562C28653a48104J4747c0070A21184j3973J4569b23828
$$ y = [193616, 9782, 481548, 7464, -36192, 303386, 65377, 296542, 215603, 132623, 319896, 68814, 5543, 263434, -215167, 249614, -253509, -37553, 27170, -56105, 246241, 115795, -15433, -395897, 290011, -12957, -49764, -34013, 250393, -99906, -202101, 11997, 105937, -58442, 86043, -114009, -143725, 5671, 21122, -1315, -102617, -135179, 46304, -1106, -86182, -47821, -329209, 12743, 57566, -55543, 136973, -100373, -150897, 25261, -251052, -31106, -164230, -265323, -254353, 56164, 88306, 105321, 84691, 221804, 120903, -174702, -57033, -441435, -142074, -75856, -73329, -124944, 73252, -107769, -155749, 41901, 138478, -26267, -157158, -90283, 92299, -139040, -81847, -46329, -77843, -160405, 328653, -148104, -133357, -30070, 121184, 107211, 121780, -223828]
10850f7703A26656a21581C0012I257a81231I2104d84719a10076j73884g6521J9906
10839e6615r9665H7076a75643Q2569C58307A23938a2357j92107A66397F7632R404
10828G7036j1958a44823j46679A25516b68987f1295D55608A46686c617k75811
10818b79428B92685a14875A57040G4431M5422f4664B34074q2580c57219B08844
10807G9018B6106f5427j04626o3445D2572a98054O6821d2626j3020E0713b6756
10795A4970K22079B3799a81927j05096A1261a694A97541b30138B9186K08115E8354
10783a9630k23992N4023A42869D7527n536K6792a32276A4582a62391A01337c6136
10771H6679J01382J67415a04133b6991A4079b51526m5738k29596b6084A59438
$$ y = [-67703, 126656, -121581, 30012, 9257, -181231, 92104, -484719, -110076, -283960, -76521, -56615, -156280, 87076, -175643, -93074, 358307, 123938, -12357, -204464, 166397, 67632, 77036, 65078, -144823, -291502, 125516, -268987, -61295, 455608, 146686, -3617, -279428, 292685, -114875, 157040, 74431, 119853, -64664, 234074, 151494, -357219, 208844, 79018, 26106, -65427, -170053, -233498, 42572, -198054, -131233, -42626, -55646, 50713, -26756, 14970, 237049, 23799, -181927, -287023, 11261, -1694, 197541, -230138, 29186, 237301, 58354, -19630, -243622, -189599, 142869, 47527, 41991, 68783, -132276, 14582, -162391, 101337, -36136, 86679, 188061, 355476, -104133, -26991, 14079, -251526, -297264, -526860, -26084, 159438]
10760d4469E8758Q4040h7085C843b68794j32055H8388N2505e5065b4493j03189
10749a27682k6401i650B00492J4636b06103N271H5788a86275f6442j30058N6741
10738a39759n488L1201E0922L7933c89794E3273Q1809b92758h908p7838B12977
10726h8766n7953B12783Q1647K4559K28492a37394J5294B27501F6591d9511B9577
10714c8399k89493a20823a1682j22726I1678c1812k31390a12229J8599J9827j1652
10703h5455c941l02264A85670C0395K5251a42477j57072O1565O0568A74782g4663
10691b46175B11854a2946j05980A19711C4313b3464j48142E8482b32817J08066
10681a24751A03066l8552c8680j54383j85523H4246b74404B00359G3487b1993
$$ y = [-44469, 58758, 142798, -87085, 3843, -268794, -400849, 88388, 140893, -55065, -24493, -127682, -154083, -9650, 200492, 215128, -206103, -200832, 85788, -186275, -66442, -196500, -139759, -145247, -114046, 50922, 88855, -389794, 53273, 135082, -292758, -8908, -86746, 212977, -88766, -146719, 212783, 294430, 318989, 547481, -137394, -122100, 227501, 66591, -49511, 29577, -38399, -327892, -120823, -11682, -134408, 91678, -31812, -263202, -112229, -93630, -73803, -85455, -3941, -306205, 185670, 30395, 55646, -142477, -299549, -237984, -177416, 174782, -74663, -246175, 211854, -12946, -118926, 119711, 34313, -23464, -171606, 58482, -232817, -124751, 103066, 64514, -38680, -193063, -378586, 84246, -274404, 200359, 73487, -21993]
10670a4235C41697a94080P4380E6226K09290a66305P2558k24507J19631a7415
10659h2154A2975J53336n4698k2585a62893j67541a3827B68436b06285B54755
10648A11166d8211n5384B24371c5968j94162c1281J587A17319c72907B7010b49081
10636a80717a2171B8741L6930J08549P3308C9525N5302d716H3143b34640B77839
10624b35022A29075b8013a2772C04572h0225n5761p4352P6263H8863N7481b5079
10612b74553A4217J68749o7618a6381r4900A93399a36979j56075m7466l8030A24130
10600G9080K72050a00091A04907B5579R9694J61431c38123f5997D9845e5189A46338
10588A2471a4210p6283B25174b00306A3239a57676a8185j50499c9538B6432c95388
$$ y = [-14235, 341697, -194080, -119700, 56226, 265516, -166305, -93747, -318254, -198623, -17415, -82154, 12975, 166311, 111613, 89028, -162893, -330434, -13827, 268436, -206285, 254755, 111166, -48211, -103595, 224371, -35968, -230130, -31281, -29694, 117319, -372907, 27010, -249081, -180717, -12171, 28741, 65671, 174220, 247528, 39525, 94827, -4716, 83143, -234640, 277839, -235022, 129075, -28013, -12772, 304572, -80225, -135986, -210338, -134075, 88863, 146344, -25079, -274553, 14217, 182966, 115348, -16381, -111281, 193399, -136979, -293054, -340520, -378550, 124130, 79080, 351130, -100091, 104907, 25579, 125273, 286704, -338123, -65997, 49845, -55189, 146338, 12471, -14210, -90493, 225174, -200306, 13239, -157676, -18185, -168684, -39538, 26432, -395388]
10576B26885h7998c7354A46398f5206j03449B4144c8787A56120b86172A43213
10565A79648e3447a1894j55867N6066o5663L4471J3981B47554c04593B0533N0713
10554G1246a83881G1943c61617a71879J1757c0186C3668g1627K9834n9275D3599
10542B58602p3387a00814A58494b71807A23189b64501d6919B013a60957A90239
10531a22802I3312b1640m7280A12654a98153k02911a17065b8834E9372i4170C2705
10519b85620G6368K23573a7329m1680D3439a24452E7436a38138A17760b77472
10508a01650l150F4224b42573h6384k72955B26843b33120K7467Q4824G8421J24206
10497B02627i818B19451c763A03249k2723G609F90g5893k0142M6568C5249f3254
$$ y = [226885, -87998, -37354, 146398, -65206, -168655, 24144, -38787, 156120, -286172, 143213, 179648, -53447, -11894, -167761, -111695, -177358, -142887, -128906, 247554, -304593, 20533, 71246, -183881, 71943, -361617, -171879, -160122, -30186, 33668, -71627, -41793, -101068, 43599, 258602, 185215, -100814, 158494, -271807, 123189, -264501, -46919, 2013, -160957, 190239, -122802, 93312, -21640, -68920, 112654, -198153, -401064, -117065, -28834, 59372, -94170, 32705, -285620, 76368, 299941, -17329, -59009, 43439, -124452, 57436, -138138, 117760, -277472, -101650, -104800, 64224, -242573, -86384, -359339, 226843, -233120, -205653, -120829, 78421, 202627, -9818, 219451, -3763, 103249, 80526, 7609, 690, -75893, -96035, -49467, 35249, -63254]
10484a43567q1376B79416f3795K5194B53718p1944H1221C4793i5162j29406A56100
10472G5179h4026j68122b2463n5034J0330E3551J72575a46240I7409A0516e4121
10460A62075a73062a9180j88727M8520A29283a01740A98599b5543A69075a00125
10449b33784j7545B49791Q4174A65066b70928a7118k5375A39691J71985a58347
10438b00553B08598b53663A23407a23624j85757g5661B17576b14800C17609c96985
10427A81207o2772h7387I2686b71141g3282A60788K7946a75352F980i0854P931
10416h2923r980l59968b0733E75637b46021f0089j5607j41140N3694j53845C21131
10404a08125j58375f6779D4810J10106F1747e36060A04274b87294a4811m5275
$$ y = [-143567, -224943, 279416, -63795, -38601, 253718, 181774, 81221, 34793, -95162, -224568, 156100, 75179, -84026, -252148, -22463, -77497, -67167, 53551, 226126, -146240, 97409, 10516, -54121, 162075, -173062, -19180, -207907, -159387, 129283, -101740, 198599, -25543, 169075, -100125, -233784, -251329, 249791, 333965, 165066, -270928, -17118, -42493, 139691, 311676, -158347, -200553, 208598, -253663, 123407, -123624, -309381, -75661, 217576, -214800, 317609, -396985, 181207, 118435, -87387, 92686, -271141, -73282, 160788, 188734, -175352, 6980, -90854, -82923, -92903, -452871, -20733, 575637, -246021, -60089, -75696, -216836, -163142, -316987, 321131, -108125, -266500, -66779, 44810, 154916, 61747, -536060, 104274, -287294, -14811, -60086]
10394f0086A02072l5578K85212A31680m8961M1896a21795d6721F8244N2022g1451
10382H2370j4376b0817j46676I7143J08971E4418K7726K84690j1473J01761j81849
10371B75273q8135L42934k29578A19581E2229K65979L7254I3270K19315G3326
10360E9672Q2209E5909A7761M0483M83006K36898C51351d9861B62151L88257j57084
10349D93324r4588A24926j3627J04738G6745J27677a58258E2216K22908r4000
10339A81124R8h2511B90712a11876j1637g672k5161D6784J78228a17317A82693
10327D4884i0303B25686p6686D15M31534j82312j21627a56996D77747a90460C6018
10315G2824J77725b28023d9884k67578a21915k44819J71474m4916p5208D08242
$$ y = [-60086, 102072, 66494, 351706, 131680, 82719, 124615, -121795, -46721, 68244, 120266, -71451, 82370, 67994, -20817, -167493, 97143, 206114, 54418, 82144, 366834, 355361, 457122, 275273, 187138, 530072, 300494, 119581, 52229, 318208, 355462, 93270, 312585, 73326, 59672, 141881, 55909, 17761, 58244, 541250, 778148, 351351, -49861, 262151, 650408, 493324, 398736, 124926, 111299, 216037, 76745, 204422, -158258, 52216, 275124, 181124, 181222, -82511, 290712, -111876, -123513, -7672, -32833, 46784, 225012, -117317, 182693, 44884, -90303, 225686, 149000, 415, 431949, 249637, 128010, -156996, 477747, -190460, 36018, 72824, 250549, -228023, -49884, -317462, -121915, -366734, -195260, -240176, -315384, 408242]
10304b10569A69668a13959G9924i9373H3507l0170c34185a26085k92181G1682
10293d68551A92261P1318a00536C5338J50231c70575f4528k50623a02330j78062
10283b80392B37090C5588g963j23625L4392k8869B54001g0896C7101b00488H4658
10271B86124B9301R1735K37800P684a0786j58048r0019F349a63409B3411a93447
10259A02517K18037j37982o5885a86751A8586b16038g5715A96925g382A09197
10248B50026k1158P1646e0788A98157b87856A20916a0497j11110E1189c56866
10237b32405L7703M2776A9703O9531R5861a18588G7178M70766i2151F5983b14625
10225b64610h0114A7601b20064l035D6581L2548O172K1843a9176A25672e8762
$$ y = [-210569, 169668, -113959, 79924, -99373, 83507, 53337, -334185, -126085, -418266, 71682, -468551, 192261, 263579, -100536, 35338, 185569, -370575, -64528, -315151, -102330, -280392, 237090, 35588, -7963, -131588, -97196, -126065, 254001, -70896, 37101, -200488, 84658, 286124, 29301, 121036, 358836, 366520, -10786, -168834, -258853, 6349, -163409, 23411, -193447, 102517, 320554, 182572, 116687, -186751, 18586, -216038, -75715, 196925, -7382, 109197, 250026, 228868, 300514, -50788, 198157, -287856, 120916, -10497, -121607, 51189, -356866, -232405, -194702, -151926, 19703, 89234, 185095, -118588, 77178, 547944, -92151, 65983, -214625, -264610, -80114, 17601, -220064, -223099, 46581, 79129, 85301, 107144, -19176, 125672, -58762]
10213c33934G3324k7673M43729b11706d0950H106J78221J4588a01344m7461A32125
10201a4552A0315K24413C3574q392a89611A1528a22910B01217c33424E0625K4191
10190G4816J03682A5608d53283b23963h3779a6057r0612I5649d09508b6141m1683
10179f7824C5168M46211k39878c27870b1017j22552M9870c0814A35146b14573
10168d10623J87703H7823K0501D3954h9573d262l409j68028j3430m5006a5553
10156B773J22694m530c4415A34912A0619c98927h654j38759n1952B01621h6580
10144I3034N7021a00062C8003f4401H8045b66650k1832b886l07227m1475C625
10132a63941l8461e4516n8808D909a25005c93l9138k321I8088B0125e498A49999
$$ y = [-333934, 73324, 45651, 489380, -211706, -40950, 8106, 186327, 200915, -101344, -148805, 132125, -14552, 10315, 234728, 33574, 25182, -189611, 11528, -122910, 201217, -333424, 50625, 74816, 178498, 15608, -453283, -223963, -83779, -16057, -106669, 95649, -409508, -26141, -67824, 35168, 481379, 241501, -327870, -21017, -143569, -93699, -30814, 135146, -214573, -410623, -222920, 87823, 108324, 43954, -89573, -4262, -7671, -175699, -189129, -234135, -15553, 2773, 125467, 120937, -34415, 134912, 10619, -398927, -8654, -147413, -199365, 201621, -86580, 93034, 150055, -100062, 38003, -64401, 88045, -266650, -288482, -2886, -310113, -351588, 3625, -163941, -202402, -54516, -113324, 4909, -125005, -393, -39531, -41852, 98088, 20125, -5498, 149999]
10119A347h8288p9582g1419E8496a51157f0034q9407F4615a97259a4121k16609
10108b30730j27813B99683b20106I3922h3323B07569a0651j25149o5832l2270
10098b33902a11965m7406j56882a25989B42664a54328d0003g164j39056B33022
10087B13963b16322h2967L348m514j43505e2704m6215a1424p0304b1562l3769
10076e5331j9714A02677B7468a06672j05701f1578o2556j46275A68265l1316a47560
10064A15820b05186f2468M911C21963b943B7410J42785g1845A70175a88567I8162
10052B6491a19440j57262h9380j4975A59278j8542g747G9403F720K34108D5237
10040A22441J53872b9424A23733k1034K35438d07042A51382m4488e1974G4517
$$ y = [1347, -88288, -167870, -71419, 58496, -151157, -60034, -149441, 64615, -197259, -14121, -230730, -358543, 299683, -220106, 93922, -83323, 207569, -10651, -135800, -201632, -233902, -111965, -159371, -316253, -125989, 242664, -154328, -40003, -7164, -146220, 233022, 213963, -216322, -82967, -79619, -84133, -227638, -52704, -98919, -11424, -81728, -21562, -55331, -75045, 102677, 27468, -106672, -212373, -61578, -124134, -270409, 168265, 136949, -147560, 115820, -205186, -62468, -57557, 321963, -2943, 27410, 170195, -71845, 170175, -188567, 98162, 26491, -119440, -276702, -89380, -104355, 159278, 140736, -7747, 79403, 6720, 240828, 45237, 122441, 276313, -29424, 123733, 102699, 338137, -407042, 151382, 106894, -51974, 74517]
10029e4249H6029c1841k21970Q0203j09314L7804E5015h1225c9445B08463a14898
10017b42318D1039b02706d5909n5182c8045E3201D489b1872l8837B70865c953
10005B41149l7472a09866A17897j7439g106A42056b66735A8235c9149j52323A61310
9993A43822g7232A8782a59153B4078K0359a07916d5547C9468i2180B9729a17732
9981b59520d0602k32386J16372k56147J05681a24227a6442A1836g6537H1126A4118
9969b41907A44039a21849k14457p6538f072n1053l01779b2256k71735C7922L4327
9958G2249d34889A4601M5065i3028B23256a80157B9915b32734A13979n1573a40439
9946b38819j52495h9351p7076j5513A26419b94561a22562j44681D0556P0678a28420
$$ y = [-54249, 86029, -31841, -253811, -173608, -282922, -245118, 55015, -81225, -39445, 208463, -114898, -242318, 41039, -202706, -45909, -101091, -38045, 53201, 4489, -21872, -60709, 270865, -3953, 241149, 203677, -109866, 117897, 100458, -7106, 142056, -266735, 18235, -39149, -191472, 161310, 143822, -77232, 18782, -159153, 24078, 44437, -107916, -45547, 39468, -92180, 29729, -117732, -259520, -40602, -272988, -156616, -412763, -307082, -124227, -16442, 11836, -76537, 81126, 14118, -241907, 144039, -121849, -336306, -412844, -6072, -57125, -358904, -22256, -293991, 37922, 72249, -434889, 14601, 59666, -93028, 223256, -180157, 29915, -232734, 113979, 62406, -140439, -238819, -391314, -89351, -166427, -181940, 126419, -294561, -122562, -267243, 40556, 111234, -128420]
9934a63962K0796e5937A25561a36309j32472J07422k301K5934f1339A8828c38729
9922a67419E0632a86300A39168m9368a61904N9883k34875B82724h3748I3451a67118
9910B40206a52713A2069b9504k2158r0447f4748D53448B5825K45138k2396a57117
9898C18960c5325k65489A5340i9726A5912i1208B20448f2222G6378C4619a90948
9886a31543m2119k23568a5138G7408a70042E3173c12902g0512L484j6892j2080
9875i6000K7716n6118j52961J4954E7628a32092a4373L077k49819A79135g9073
9863A23761e9206I5254C0678a89320A58822J88816a5404r2542D3165J05294d7851
9851I028b94233C4838b27721o2387d1670g408e65m16544A3419a59387P4572A49898
$$ y = [-163962, -143166, -55937, 125561, -136309, -268781, -161359, -163660, -137726, -61339, 18828, -338729, -167419, 50632, -186300, 139168, 89800, -161904, -102021, -336896, 282724, -83748, 93451, -167118, 240206, -152713, 12069, -29504, -51662, -142109, -64748, 453448, 25825, 270963, 248567, -157117, 318960, -35325, -300814, 15340, -99726, 15912, -91208, 220448, -62222, 76378, 34619, -190948, -131543, -173662, -397230, -15138, 77408, -170042, 53173, -312902, -70512, -67028, -83920, -96000, -68284, -124402, -277363, -262409, 57628, -132092, -14373, -11296, -261115, 179135, -79073, 123761, -59206, 95254, 30678, -189320, 158822, 347638, -15404, -107946, 43165, 148459, -47851, 9028, -294233, 34838, -227721, -290108, -41670, -7408, -565, -417109, 13419, -159387, -84815, 149898]
9838f9105A7865b44317d2779G2647K48248a66607B14349g455A25177g1629a865
9826f8725A25498c22223F9634F700J58646j21b6537q2477i563j80119m6805f452
9813E3940N0480J08d6224C176e3710r0517j43031l0044p6961a43452e1264I4033
9800c01903B04559q6061j5753R448J27108A01918f7087o9023d1376A71958a32250
9788D14091k01880a507D1356I637C041a81190k8477B62065c44756d1480A1622
9776A64268a39296c0033l8937l9798R749j44357N3936G4480K78237a65513d1611
9764c82373E2358a7423G8456Q4800A5620M8778J12833A2595K05500j01484a4968
9752h2592H3858h9814D6689d992o2704j3958B07320a08312j53014L5638b2450
$$ y = [-69105, 17865, -244317, -42779, 72647, 320895, -166607, 214349, -7455, 125177, -71629, -1865, -68725, 125498, -322223, 69634, 6700, 165346, 165225, -26537, -109014, -9563, -189682, -236487, -6452, 53940, 104420, 104528, -46224, 3176, -53710, -144227, -287258, -317302, -394263, -143452, -51264, 94033, -301903, 204559, 118498, 102745, 112193, 239301, 101918, -67087, -136110, -41376, 171958, -132250, 414091, 212211, -1507, 41356, 9637, 3041, -181190, -209667, 262065, -344756, -41480, 11622, 164268, -139296, -30033, -68970, -108768, -99019, -243376, -189440, 74480, 352717, -165513, -41611, -382373, 52358, -17423, 78456, 163256, 15620, 64398, 177231, 12595, 218095, 116611, -14968, -82592, 83858, -89814, 46689, -4992, -67696, -81654, 207320, -108312, -261326, -225688, -22450]
9740b36803A05661m3036d1280I3584K5141J0051J40400a95207A2706K3175a91027
9728e2480B78362f1483k46316J42037P9391j46311B78739g2033D61b69180B73230
9716a68034l1459h7783I839N5792a66144E1455J71804a01373j8165A17513a5279
9704d2714E1516c2978l12351A11100k3577c32201D93g6060B8188E592a83636M4853
9692a38783k59054g5491K0383B1654g927l32820R7153B60134b7079k07263j5482
9681b49824D1228J70805b73097J19408C532a90876F0812N9177c31103e04B61238
9669i2085B2402J09050e8997C7092b83067J39889j11250H502a0413C4188L8488
9658G2676a11076F7260a85875E04510B00519c7142K129m07005I070h0602n1944
$$ y = [-236803, 105661, 62625, -41280, 93584, 118725, 128776, 269176, -195207, 12706, 35881, -191027, -52480, 278362, -61483, -307799, -165762, -86371, -232682, 278739, -72033, 461, -269180, 273230, -168034, -199493, -87783, 9839, 65631, -166144, 51455, 223259, -101373, -119538, 117513, -15279, -42714, 51516, -32978, -345329, 111100, 87523, -332201, 493, -76060, 28188, 5592, -183636, -138783, -397837, -75491, -55108, 21654, -7927, -340747, -243594, 260134, -27079, -234342, -249824, 41228, 212033, -273097, -153689, 3532, -190876, 60812, 119989, -331103, -504, 261238, -92085, 22402, 131452, -58997, 37092, -283067, -143178, -254428, 8502, -10413, 34188, 72676, -111076, 67260, -185875, 504510, 200519, -37142, -35013, -442018, 9070, -80602, -132546]
9647a32546j18629A40967c3228j27177C49558b28754j7289A19058P793a22918
9636h9927d3141j77770f1997b7736n45435B20215a41208A13585P165c86004C2208
9624A75183D3663a75456B20093O0682i167j09567H571L83761c77758A13333h3396
9612B42059g6548k93139a24601A3262M491b94056i3029r1395H0090f63301i3131
9600g6504G944N1417b52519j51235A27607b94773J47183A51803a45951j13960
9590b59911B47779d82642b08146r1034H9208h1886j20759i1271j8397k67465J53187
9579b23946M4563B14707a79652e9154I9370b08235C8879d58027N1686f4194l52754
9568d16948d9589B04749a13810d9063J1364j8515k0648B3239b46493A1276b07666
$$ y = [-132546, -251175, 140967, -33228, -160405, 349558, -228754, -246043, 119058, 126851, -122918, -89927, -43141, -220911, -61997, -27736, -573171, 220215, -141208, 113585, 120750, -386004, 32208, 175183, 43663, -175456, 220093, 280775, -9167, -118734, 8571, 392332, -377758, 113333, -83396, 242059, -76548, -369687, -124601, 13262, 17753, -294056, -93029, -184424, 80090, -663301, -93131, -76504, 7944, 59361, -252519, -403754, 127607, -294773, -147590, 151803, -145951, -259911, 247779, -482642, -208146, -299180, 89208, -81886, -202645, -91271, -109668, -377133, -223946, -179383, 214707, -179652, -59154, 99370, -208235, 38879, -458027, -406341, -64194, -416948, -49589, 204749, -113810, -49063, -37699, -56214, -76862, 23239, -246493, 11276, -207666]
9556c21856a416j42016B79063j39252a48410F6870c6654G3060J58045o0487F792
9544g0528k01383E7553a39729D4068a16483D45268A66920a94276g6120l4349D1311
9532A05050k6907c01031A01007j5129a67162P5370j61624M7525B29092a82276
9521F7710A0277M6178j9202J26236f8935k01390B76999a1962E1000a1151A03130
9509A11962a78336F7837e4815j97550j49895a14029L7116k17825A49311a32846
9498F3498c7772C0639L433b7287A58204H354a90346B73136C4972a52523c4321
9486A21868n064J8990b86580N6561b6480I4301c46990A24829a71432e2231B69644
9474B689b82361B32523a81464f1383k2563j97739a4765j02193m2249k86394A47337
$$ y = [-321856, -1416, -143432, 279063, 139811, -148410, 66870, -36654, 73060, 231105, 170618, 6792, -70528, -271911, 57553, -139729, 44068, -116483, 445268, 166920, -194276, -76120, -110469, 41311, 105050, 78143, -301031, 101007, 85878, -167162, -91792, -253416, -205891, 229092, -182276, 67710, 10277, 56455, 37253, 163489, -68935, -270325, 276999, -11962, 51000, -11151, 103130, 111962, -178336, 67837, -54815, -252365, -402260, -114029, -76913, -294738, 149311, -132846, 63498, -37772, 30639, 34072, -27287, 158204, 8354, -190346, 273136, 34972, -152523, -34321, 121868, 116804, 135794, -286580, -230019, -26480, 94301, -346990, 124829, -171432, -52231, 269644, 2689, -282361, 232523, -181464, -61383, -83946, -281685, -14765, -116958, -159207, -445601, 147337]
9462D70129A11081b16772N7405M1198j14539d0620I3356b77277R4096K2269a7409
9450b97842J542J44794c068j62556k239I6520b84294A11790d463E3986K733J25565
9438A82284b42576A8523b33568A80700c61085B36848G4274c11798j14802e4100
9427h2184k94306B3664a4290j46592k12847E9131b46657A48196a57359A50126
9416B52978a17241j89665R6121E7054N1072D5J79306E8812a74084h4593H7416
9404a17884m9014K3177k61607i8048b2269k68804d0426A84641P8084b49913L7391
9393b12522e0518m0713l23629a74356O7500A11868b13576j81432A41318B899a3868
9381a75371J9790j35259J01171I7626a00001c3198j08329C5766K8700g3283q5544
$$ y = [470129, 111081, -216772, -159367, -118169, -232708, -40620, 93356, -277277, -183181, -160912, -17409, -297842, -296300, -151506, -3068, -165624, -167863, 96520, -284294, 111790, -4463, 53986, 56719, 182284, -242576, 18523, -233568, 180700, -361085, 236848, 74274, -311798, -426600, -54100, -82184, -376490, 23664, -14290, -160882, -373729, 59131, -246657, 148196, -157359, 150126, 252978, -117241, -306906, -210785, 57054, 108126, 45, 179351, 58812, -174084, -84593, 87416, -117884, -166898, -143721, -405328, -98048, -22269, -291073, -40426, 184641, 262725, -249913, -212522, -50518, -91231, -414860, -174356, -106856, 111868, -213576, -395008, 141318, 2899, -13868, -175371, -155581, -290840, -189669, 97626, -100001, -33198, -141527, 35766, 64466, -73283, -158827]
9370a58827L7927b999m56455e0337A81025a88991D6464O6987a12391c8203B69828
9358a70203A49519a2385G2078J9860e4603B34893g971G2297a85197b7036j7091
9347d4127A29771b26489O8922b1611d795j96758G2367l1351d24452A595a4112
9335A97448A4793g9572E2882N3813b29518b6686R032B42546B1829a43237A70144
9323c40171a57514A40567n3119b81411J30379f51H5138J29286c18674i4024k1567
9312a15591L3401A85204f4172o9451e8432b3864l09301A8447O0436a81499D0143
9300A0809f5985G3696h4859A55573C9321N0669A2463P8661a33992M6971l22220
9289d09241E185d04386a82940H2782P973a27056A70064o5313a23612c4795C1124
$$ y = [-158827, -120900, -2999, -459454, -50337, 181025, -188991, 46464, 113451, -112391, -38203, 269828, -170203, 149519, -12385, 72078, 91938, -54603, 234893, -7971, 72297, -185197, -27036, -44127, 129771, -226489, -157567, -21611, -4795, -201553, 72367, 41016, -424452, 1595, -14112, 197448, 14793, -79572, 52882, 106695, -229518, -26686, -17654, 242546, 21829, -143237, 170144, -340171, -157514, 140567, 87448, -281411, -151032, -651, 85138, 214424, -318674, -94024, -115591, -82190, 185204, -64172, -133623, -58432, -23864, -333165, 18447, 78883, -181499, 40143, 10809, -65985, 73696, -84859, 155573, 39321, 89990, 12463, 91124, -133992, -87021, -409241, 5185, -404386, -182940, 82782, 90755, -127056, 170064, 104751, -123612, -34795, 31124]
9277A40046N4912b8431G7975K4559d70613D2602M3939a15258E985b21825e819
9265c49750B33224b09672e2441A17624D6104a00102H9497a31280h639k09335b6458
9253c55506q1168K16863l52669d9358k87883H6530a36358C6432M1999Q665M13419
9242E00515h0121k62254H1719b36000O3822j72956C9581b33297h4598l1176j73427
9231b89201C1892d43815b11742A51591a20610C2370b14934m6710a29420B51024
9220b63185O4080b6415C3167c6914F6399c39878B4603b75795H3860d61110E7529
9208A86769b14635A78246a22094N6374A01424l8119P3458C2365e7106E4859k1573
9197C3286b79633B32089n93G24b14472f2789A00424b03801B025Q719e7496B19852
$$ y = [140046, 194958, -28431, 77975, 102534, -470613, 42602, 86541, -115258, 5985, -221825, -5819, -349750, 233224, -209672, -52441, 117624, 46104, -100102, 89497, -131280, -8639, -217974, -26458, -355506, -436674, -219811, -572480, -49358, -337241, 86530, -136358, 36432, 78431, 87096, 500515, -80121, -342375, 81719, -236000, -172178, -345134, 39581, -233297, -84598, -115774, -289201, 31892, -443815, -211742, 151591, -120610, 32370, -214934, -261644, -129420, 251024, -263185, -199105, -26415, 33167, -36914, 66399, -339878, 24603, -275795, 83860, -461110, 57529, 186769, -214635, 178246, -122094, -65720, 101424, 63305, 136763, 32365, -57106, 54859, 33286, -279633, 232089, 231496, 724, -214472, -62789, 100424, -203801, 2025, 10744, -57496, 219852]
9184a01172j46486A1158O3729a79378M6426E0638C868J37484J20251a29208E02784
9172B56348a32189A6174a0845I5028K13033a88706k36472i412n4155k4904L5184
9161e3287j89109q843h9116A87078b0291o0861K9035j62357B17371F8232N1240
9150A19472K97623a63945K4157M7576m035D56322G4780h1756L2385j34431M2373
9139a41429N1308l5388A9093b0080j10973F8052A6630e8375A45719b84224C09583
9127B21173e1561j71655C0093J70648i2755J4524K0510N542k5735k39742J29851
9116a87805k26360a13936q8178A4695a26362A17014B0069b04926j51033a2154
9105h8876b6967D8155e6630C21638a95497o0472f8166r6919A66656b20754f5996
$$ y = [-101172, -247658, 11158, 74887, -179378, -132952, 50638, 3868, 141352, 261603, -129208, 502784, 256348, -132189, 16174, -10845, 95028, 308061, -188706, -425178, -9412, -63567, -88471, -53287, -242396, -251239, -89116, 187078, -20291, -81152, -52117, -214474, 217371, 68232, 119472, 417095, -163945, -139788, -92212, -96247, 456322, 74780, -81756, -49371, -183802, -141429, -90121, -125509, 19093, -20080, -131053, 68052, 16630, -58375, 145719, -284224, 309583, 221173, -51561, -223216, 30093, 200741, -92755, -78231, -57721, -52179, -77914, -317656, -187805, -414165, -113936, -202114, 14695, -126362, 117014, 20069, -204926, -355959, -12154, -88876, -26967, 48155, -56630, 321638, -195497, -255969, -68166, -165085, 166656, -220754, -65996]
9093G3934b14702A02992f9462H0985b88967I9287N9655a76248j52782Q0125A10393
9081C2061K58623b7634j24442b2623k8996j443B43357b34868j4803E4959d3421
9069b7167k51740a37957J6881A4211d51029h2578j66102D57808a12259c7719F8352
9057a68977h0605p0466k70103A28521b92009L3516b2177A05428l4906a22764K026
9046a20738A28859a72032j19807A3602J50197B5019C01K2498o612J53571b92087
9034B32798h5741j062f779A37671a13701a0065B9963c26854c7657k46276a20692
9022a64723A20134a58908J9296A09262J2008R387d0681n9615l28179A76511J74333
9011C50844B0984c60228i3124C84060a60346j08210A55636P487c24642b7993j14994
$$ y = [73934, -214702, 102992, -69462, 80985, -288967, 99287, 158942, -176248, -329030, -248905, 110393, 32061, 290684, -27634, -152076, -22623, -51619, -53062, 243357, -234868, -249671, 54959, -43421, -27167, -278907, -137957, -121076, 14211, -451029, -82578, -248680, 457808, -112259, -37719, 68352, -168977, -80605, -151071, -421174, 128521, -292009, -258493, -22177, 105428, 70522, -122764, -120738, 128859, -172032, -291839, 13602, 163799, 25019, 301, 22799, 16187, 169758, -292087, 232798, -85741, -86803, -6779, 137671, -113701, -10065, 29963, -326854, -37657, -283933, -120692, -164723, 120134, -158908, -139612, 109262, 121270, 130657, -40681, -100296, -428475, 176511, 350844, 20984, -360228, -93124, 384060, -160346, -268556, 155636, 163123, -324642, -27993, -142987]
9000a42987j45793E1850a04638l6785B19647d24084a55289C3432a05183m923j06756
8989b16862q2120c6916B16575q4358C7803b54252P4140d8409A24276K02584E6974
8977B56150g1310l14770a00368b376j85072I3470L2950L912i3078A92619a81263
8965A43226J27954d3443r4777k53060a2571j157A72273a4499B36691h9592l7373
8954a26965B94574A41210a5759l39975b2546F3940P4720a38289B80431b65501
8943H7440e4682q8289A60836d6274n4627c6961j26773e9856B57705J28225r2884
8932B93046b8633A22038h0939A60277a64713D10895o4589J21388F1856J065732
8922A127588M614565J850140B175371F81050m1113A93100F6196a00922m41635
$$ y = [-142987, -288780, 51850, -104638, -141423, 219647, -424084, -155289, 33432, -105183, -110106, -216862, -298982, -36916, 216575, 132217, 37803, -254252, -180112, -48409, 124276, 326860, 56974, 256150, -71310, -386080, -100368, -2376, -187448, 93470, 126420, 130332, -93078, 192619, -181263, 143226, 271180, -43443, -138220, -391280, -12571, -13728, 172273, -14499, 236691, -89592, -126965, 294574, 141210, -15759, -355734, -22546, 63940, 138660, -138289, 280431, -265501, 87440, -54682, -142971, 160836, -46274, -100901, -36961, -163734, -59856, 257705, 385930, 293046, -28633, 122038, -80939, 160277, -164713, 410895, 346306, 467694, 61856, 1127588, 5742153, 7592293, 2175371, 681050, 639937, 193100, 66196, -100922, -542557]
8913e42557a56912C5300b8786A13463K97047B04591M1652g6024m26095a22660
8902B68301a3939A1503C972c15244g6516k1776A34863C336J65832b94909J38488
8891a56421F6880d06287l8169H029K34746c4834E9853d22844a32625a9678F9674
8879b89682A15692a32081q2080R0175A81751h794q046k5827D6272a7912k63798
8868b81710d7251k8857A39138b03982i5166k42817C63785I7398a72740r9290a23784
8856A86737b13646k0516B5759J63906a69113A3406K46815E1438b13992A10180
8845a67414G0785c3227j06379B59184A04070b76652M7819K4194Q9907D9687c23548
$$ y = [-542557, -156912, 35300, -28786, 113463, 410510, 204591, 246243, -76024, -502119, -122660, 268301, -13939, 11503, 3972, -315244, -76516, -98292, 134863, 3336, 169168, -294909, -156421, 66880, -406287, -444456, 8029, 242775, -34834, 59853, -422844, -132625, -19678, 69674, -289682, 115692, -132081, -214161, -123986, 181751, -8794, -16840, -42667, 46272, -17912, -281710, -47251, -76108, 139138, -203982, -95166, -337983, 363785, 97398, -172740, -272030, -123784, 186737, -213646, -234162, 25759, 189665, -169113, 13406, 260221, 51438, -213992, 110180, -167414, 70785, -33227, -139606, 259184, 104070, -276652, -228833, -204639, -114732, 49687, -323548]
$$ [...]
##END NTUPLES=NMR SPECTRUM
##END=
