
##TITLE=AC1297_GUAAH11109_6613995_9oJLyBijUr
##JCAMPDX= 6.0         $$ Bruker NMR JCAMP-DX V2.0
##DATA TYPE= NMR SPECTRUM
##DATA CLASS= NTUPLES
##ORIGIN= BRUKER
##OWNER= Administrator
$$ 1.72 TOPSPIN		Version 2.1
$$ 2012-08-02 15:36:16.828 -0500  Administrator@TOPSPIN
$$ Compression mode = diff/dup
##.OBSERVE FREQUENCY= 400.02188249412
##.OBSERVE NUCLEUS= ^1H
##.ACQUISITION MODE= SIMULTANEOUS (DQD)
##.ACQUISITION SCHEME= undefined
##.AVERAGES= 64
##.DIGITISER RES= 22
##SPECTROMETER/DATA SYSTEM= spect
##.PULSE SEQUENCE= noesygpps1d.comp
##.SOLVENT NAME= COFFEE_meoh
##.SHIFT REFERENCE= INTERNAL, COFFEE_meoh, 1, 14.9624
##AUDIT TRAIL= $$ (NUMBER, WHEN, WHO, WHERE, PROCESS, VERSION, WHAT)
$$ ##TITLE= Audit trail, TOPSPIN		Version 2.1
$$ ##JCAMPDX= 5.01
$$ ##ORIGIN= Bruker BioSpin GmbH
$$ ##OWNER= Administrator
$$ $$ C:\Bruker\TOPSPIN/data/COFFEE/nmr/AC1297_GUAAH11109_6613995_9oJLyBijUr/12/pdata/1/auditp.txt
$$ ##AUDIT TRAIL=  $$ (NUMBER, WHEN, WHO, WHERE, PROCESS, VERSION, WHAT)
(   1,<2012-08-02 15:36:11.234 -0500>,<Administrator>,<TOPSPIN>,<go>,<TOPSPIN 2.1>,
      <created by zg
	started at 2012-08-02 15:24:41.078 -0500,
	POWCHK enabled, PULCHK disabled,
       configuration hash MD5:
       6B 1B 68 BB D9 2E 58 E2 7F 35 AD 54 07 DF 0E 41
       data hash MD5: 64K
       BE 83 91 5C B3 C1 F7 AE 5A 39 A3 51 6B C3 1E 49>)
(   2,<2012-08-02 15:36:14.718 -0500>,<Administrator>,<TOPSPIN>,<proc1d>,<TOPSPIN 2.1>,
      <Start of raw data processing
       efp LB = 0.3 FT_mod = 6 PKNL = 1 PHC0 = 0 PHC1 = 0 SI = 128K 
       data hash MD5: 128K
       17 CC 19 10 7F CE 05 97 88 EE 3A 3E 83 B8 C1 5B>)
(   3,<2012-08-02 15:36:15.812 -0500>,<Administrator>,<TOPSPIN>,<proc1d>,<TOPSPIN 2.1>,
      <pk PHC0 = 3.120117 PHC1 = 0 
       data hash MD5: 128K
       18 93 1F 7D 81 08 4B 5B 3F 23 BC BB BC 97 21 6E>)
(   4,<2012-08-02 15:36:16.500 -0500>,<Administrator>,<TOPSPIN>,<proc1d>,<TOPSPIN 2.1>,
      <abs ABSG = 1 
       data hash MD5: 128K
       86 3E 82 91 8D 47 55 A7 38 48 D2 A9 1E 1D E4 0E>)
(   5,<2012-08-02 15:36:16.578 -0500>,<Administrator>,<TOPSPIN>,<proc1d>,<TOPSPIN 2.1>,
      <abs ABSG = 2 
       data hash MD5: 128K
       AF 6E ED D8 4F 49 50 85 E1 B2 E4 FB 00 B0 C3 83>)
(   6,<2012-08-02 15:36:16.625 -0500>,<Administrator>,<TOPSPIN>,<proc1d>,<TOPSPIN 2.1>,
      <abs ABSG = 3 
       data hash MD5: 128K
       B1 C5 26 A2 6D 49 55 7F 2C AD 96 4B 50 5A F0 DA>)
(   7,<2012-08-02 15:36:16.671 -0500>,<Administrator>,<TOPSPIN>,<proc1d>,<TOPSPIN 2.1>,
      <abs ABSG = 4 
       data hash MD5: 128K
       18 A5 B1 A8 6D 60 68 F2 A5 40 13 4D 6B 9D 25 DE>)
(   8,<2012-08-02 15:36:16.734 -0500>,<Administrator>,<TOPSPIN>,<proc1d>,<TOPSPIN 2.1>,
      <abs ABSG = 5 
       data hash MD5: 128K
       79 2F FC 79 55 FF E1 52 C6 08 9F F7 06 78 E6 00>)
$$ ##END=
$$ 
$$ $$ hash MD5
$$ $$ E9 9A 27 D3 7D E3 0E 9E 3F C9 6B 8C EE 27 F4 21
##$RELAX= 
##$RELAX= 
##$RELAX= 
##$RELAX= 
##$RELAX= 
##$RELAX= 
##$RELAX= 
##$RELAX= 
$$ Bruker specific parameters
$$ [...]
150 150 150 150 150 150 150 150
##$TP07= 0
##$TPNAME0= <>
##$TPNAME1= <>
##$TPNAME2= <>
##$TPNAME3= <>
##$TPNAME4= <>
##$TPNAME5= <>
##$TPNAME6= <>
##$TPNAME7= <>
##$TPOAL= (0..7)
0.5 0.5 0.5 0.5 0.5 0.5 0.5 0.5
##$TPOFFS= (0..7)
0 0 0 0 0 0 0 0
##$TUNHIN= 0
##$TUNHOUT= 0
##$TUNXOUT= 0
##$USERA1= <user>
##$USERA2= <user>
##$USERA3= <user>
##$USERA4= <user>
##$USERA5= <user>
##$V9= 5
##$VALIST= <valist>
##$VCLIST= <CCCCCCCCCCCCCCC>
##$VD= 0
##$VDLIST= <DDDDDDDDDDDDDDD>
##$VPLIST= <PPPPPPPPPPPPPPP>
##$VTLIST= <TTTTTTTTTTTTTTT>
##$WBST= 1024
##$WBSW= 4
##$XGAIN= (0..3)
0 0 0 0
##$XL= 0
##$YL= 0
##$YMAX_a= 16954763
##$YMIN_a= -9449120
##$ZGOPTNS= <>
##$ZL1= 120
##$ZL2= 120
##$ZL3= 120
##$ZL4= 120
##$ABSF1= 14.9624
##$ABSF2= -5.595781
##$ABSG= 5
##$ABSL= 3
##$ALPHA= 0
##$AQORDER= 0
##$ASSFAC= 0
##$ASSFACI= 0
##$ASSFACX= 0
##$ASSWID= 0
##$AUNMP= <proc_prof1d_extract.lims>
##$AXLEFT= 0
##$AXNAME= <>
##$AXNUC= <1H>
##$AXRIGHT= 0
##$AXTYPE= 0
##$AXUNIT= <>
##$AZFE= 0.1
##$AZFW= 0.1
##$BCFW= 0
##$BC_mod= 0
##$BYTORDP= 0
##$COROFFS= 0
##$CY= 15
##$DATMOD= 1
##$DC= 0
##$DFILT= <>
##$DTYPP= 0
##$F1P= 0
##$F2P= 0
##$FCOR= 0.5
##$FTSIZE= 131072
##$FT_mod= 6
##$GAMMA= 0
##$GB= 0
##$INTBC= 1
##$INTSCL= 1
##$ISEN= 128
##$LB= 0.3
##$LEV0= 0
##$LPBIN= 0
##$MAXI= 10000
##$MC2= 0
##$MEAN= 0
##$ME_mod= 0
##$MI= 0
##$NCOEF= 0
##$NC_proc= -2
##$NLEV= 6
##$NOISF1= 0
##$NOISF2= 0
##$NSP= 0
##$NTH_PI= 0
##$NZP= 0
##$OFFSET= 14.9624
##$PC= 1
##$PHC0= 3.120117
##$PHC1= 0
##$PH_mod= 1
##$PKNL= yes
##$PPARMOD= 0
##$PPDIAG= 0
##$PPIPTYP= 0
##$PPMPNUM= 2147483647
##$PPRESOL= 1
##$PSCAL= 4
##$PSIGN= 0
##$PYNMP= <proc.py>
##$REVERSE= no
##$SF= 400.020009074999
##$SI= 131072
##$SIGF1= 0
##$SIGF2= 0
##$SINO= 400
##$SIOLD= 131072
##$SPECTYP= <>
##$SREGLST= <1H.CDCl3>
##$SSB= 0
##$STSI= 131072
##$STSR= 0
##$SW_p= 8223.68421052631
##$SYMM= 0
##$S_DEV= 0
##$TDeff= 65536
##$TDoff= 0
##$TI= <>
##$TILT= no
##$TM1= 0
##$TM2= 0
##$TOPLEV= 0
##$USERP1= <user>
##$USERP2= <user>
##$USERP3= <user>
##$USERP4= <user>
##$USERP5= <user>
##$WDW= 1
##$XDIM= 131072
##$YMAX_p= 413927110
##$YMIN_p= -11652
##$CURPLOT= <Network HP LaserJet P1505>
##$CURPRIN= <$Network HP LaserJet P1505>
##$DFORMAT= <normdp>
##$LAYOUT= <+/1D_H.xwp>
##$LFORMAT= <normlp>
##$PFORMAT= <normpl>
##$SURQMSG= 1
$$ End of Bruker specific parameters
$$ ---------------------------------
##NTUPLES= NMR SPECTRUM
##VAR_NAME=  FREQUENCY,     SPECTRUM/REAL,   SPECTRUM/IMAG
##SYMBOL=    X,             R,               I
##VAR_TYPE=  INDEPENDENT,   DEPENDENT,       DEPENDENT
##VAR_FORM=  AFFN,          ASDF,            ASDF
##VAR_DIM=   131072,        131072,          131072
##UNITS=     HZ,            ARBITRARY UNITS, ARBITRARY UNITS
##FACTOR=    0.0627417313425164, 1,          1
##FIRST=     8223.62146879497, 2084,         -62734
##LAST=      0,             4730,            -63676
##MIN=       0,             -11652,          0
##MAX=       8223.62146879497, 413927110,    0
$$ Real data points
##PAGE= N=1
##DATA TABLE= (X++(R..R)), XYDATA
$$ [...]
60944A4928798j908277j666624j429883j210148j016225q51134p13449o00608
$$ 14928798 13020521 11353897 9924014 8713866 7697641 6846507 6133058 5532450
60936E532450n10164m38869l82519l37301l00538k70132k44159k21261k00757
$$ 5532450 5022286 4583417 4200898 3863597 3563059 3292927 3048768 2827507 2626750
60927B626750j82124j64752j48268j32616j17749j03925r2245q4084p9431p6398
$$ 2626750 2444626 2279874 2131606 1998990 1881241 1777316 1685071 1600987 1521556 1445158
60917A445158p2945o8700o4533o0800n6833n2096m7013m2256l7863l3540k9497
$$ 1445158 1372213 1303513 1238980 1178180 1121347 1069251 1022238 979982 942119 908579 879082
60906H79082k6336k4127k2189j9915j7430j5188j3360j1925j1008j0588j0087
$$ 879082 852746 828619 806430 786515 769085 753897 740537 728612 717604 707016 696929
60895F96929q844o968n111l398j331J108L017L752L931M636O004P217P611P214
$$ 696929 688085 681117 676006 672608 671277 672385 675402 679154 683085 687721 693725 700942 708553 715767
60881G15767O374N429M666M078L299K122R09M6o97j749k940l858m699n937p282
$$ 715767 722141 727570 732236 736314 739613 741735 742644 742690 741993 740244 737304 733446 728747 722810 715528
60866G15528p842p478p093p387q089q679r027q934p904n977m119l086k384j075
$$ 715528 707686 700208 693115 685728 677639 668960 659933 650999 643095 637118 632999 629913 627529 626454
60852F26454P80K229K825L131L836N000O391Q020R991J2073J3751J4754J5340
$$ 626454 627234 629463 632288 635419 639255 644255 650646 658666 668657 680730 694481 709235 724575
60839G24575J6009J6890J7584J7590J6820J5564J4125J2646J1203R866Q742Q035
$$ 724575 740584 757474 775058 792648 809468 825032 839157 851803 863006 872872 881614 889649
60827H89649P852P836P357O313N336M740L934K490J278J429K462K648J363k75
$$ 889649 897501 905337 912694 919007 924343 929083 933017 935507 936785 938214 940676 943324 944687 944412
60813I44412j378k537m455o506p671q184r097j0768j2674j4339j5575j6023j5525
$$ 944412 943034 940497 936042 929536 921865 913681 904584 893816 881142 866803 851228 835205 819680
60800H19680j4791j4789j5348j5190j3556j1203r386q387p438n847l839k192j208
$$ 819680 804889 790100 774752 759562 746006 734803 725417 717030 709592 703745 699906 697714 696506
60787F96506k96J297L484N450O730P694Q834J0092J1165J2055J2830J3252J3062
$$ 696506 696210 697507 700991 706441 713171 720865 729699 739791 750956 763011 775841 789093 802155
60774H02155J2442J1831J1478J1457J1721J1890J1359J0093Q940Q639Q785Q345
$$ 802155 814597 826428 837906 849363 861084 872974 884333 894426 903366 912005 920790 929135
60762I29135P002N505M714M785N223N392N033M474M243M347M265L823L599M044
$$ 929135 936137 941642 946356 951141 956364 961756 966789 971263 975506 979853 984118 987941 991540 995584
60748I95584M621M437L443K472K184K418K518J883M36j219k269k689l380m989
$$ 995584 1000205 1004642 1008085 1010557 1012741 1015159 1017677 1019560 1019996 1018777 1016508 1013819 1010439 1005450
60734A005450o929q123q373q422q897r707j0371j0465r860q903q116p540o710
$$ 1005450 998521 990398 982025 973603 964706 954999 944628 934163 924303 915400 907284 899744 893034
60721H93034n528m530l868k827j070L58K87q72j743j926k188l010m125n406o915
$$ 893034 887506 882976 879108 876281 875211 875569 875856 874984 873241 871315 869127 866117 861992 856586 849671
60706H49671q033p793o383n179m928m868m040k501p62J053K831L982M066L505
$$ 849671 841638 833845 827462 822283 817355 812487 808447 805946 805184 806237 809068 813050 817116 820621
60692H20621L102L194L528L563K654M60k450m941o606q219j0515j3072j4846j5408
$$ 820621 823723 826917 830445 834008 836662 837122 834672 829731 823125 814906 804391 791319 776473 761065
60678G61065j5157j4677j4338j4227j4049j3267j1656r594p548n551l429j275
$$ 761065 745908 731231 716893 702666 688617 675350 663694 654100 646552 641001 637572 636297
60666F36297N66J809K330K156J577J046P88O37L61n2n04r01j103r34l45N54J583
$$ 636297 636863 638672 641002 643158 644735 645781 646569 647206 647567 647515 647011 646110 645007 644073 643728 644282 645865
60649F45865K449K798K643K523K828L193L047K567K375K439K052J046K52N37J925
$$ 645865 648314 651112 653755 656278 659106 662299 665346 667913 670288 672727 674779 675825 676077 676614 678539
60634F78539L831N586O668P024P371Q536J0430J2224J3563J4802J6012J6713J6935
$$ 678539 682370 687956 694624 701648 709019 717555 727985 740209 753772 768574 784586 801299 818234
60621H18234J7469J8617J9562J9579J8941J8031J6456J3921J1058Q468N654K094
$$ 818234 835703 854320 873882 893461 912402 930433 946889 960810 971868 980336 985990 988084
60609I88084j273k994l319m023n911p758q167p415o821p014p565p956q268q936
$$ 988084 986811 983817 980498 976475 970564 962806 954639 947224 940403 933389 925824 917868 909600 900664
60595I00664j0148j1524j2325j2063j0975r711q573p285n608l846k498j551n49
$$ 900664 890516 878992 866667 854604 843629 833918 825345 818060 812452 808606 806108 804557 804008
60582H04008O29J432J293M25m74j125j789k466k680k351k160k480k495j259P55
$$ 804008 804637 806069 807362 807787 807313 806188 804399 801933 799253 796902 794742 792262 789767 788508 789263
60567G89263K146K484K626L195L847M250M664N023M482K656N02q13j375k052l062
$$ 789263 791409 793893 796519 799714 803561 807811 812475 817498 821980 824636 825138 824325 822950 820898 817836
60552H17836l843l987l531k558j186J50J016J505K105L215N150Q183J2076J5890
$$ 817836 813993 810006 806475 803917 802731 802881 803897 805402 807507 810722 815872 824055 836131 852021
60538H52021J8924K1658K5150K9726L4775L9527M3244M4785M2837L6937K7885
$$ 852021 870945 892603 917753 947479 982254 1021781 1065025 1109810 1152647 1189584 1217469
60527A217469J7037N575n565j5529k3619k9370l2550l3249l1855k8739k4071j8229
$$ 1217469 1234506 1240081 1234516 1218987 1195368 1165998 1133448 1100199 1068344 1039605 1015534 997305
60515I97305j2141o798k467J232M527P172Q896R824J0316J0604J0738J0786J1106
$$ 997305 985164 978366 975899 977131 981658 988830 997726 1007550 1017866 1028470 1039208 1049994 1061100
60502A061100J2288J4660J7853K1252K4981L0062L7284M6283N6143O6581P8047
$$ 1061100 1073388 1088048 1105901 1127153 1152134 1182196 1219480 1265763 1321906 1388487 1466534
60491A466534R0811J04439J18178J31616J45081J59728J77108J98361K23692K52597
$$ 1466534 1557345 1661784 1779962 1911578 2056659 2216387 2393495 2591856 2815548 3068145
60481C068145K83937L14994L40388L52471L43624L08970K48029J64807O6717l6916
$$ 3068145 3352082 3667076 4007464 4359935 4703559 5012529 5260558 5425365 5492082 5455166
60471E455166j36174k21867k87189l29245l49252l51154l39759l19477k93754
$$ 5455166 5318992 5097125 4809936 4480691 4131439 3780285 3440526 3121049 2827295
60462B827295k65128k35792k07873j82737j60234j39432j20226j03542q9916p8791
$$ 2827295 2562167 2326375 2118502 1935765 1775531 1636099 1515873 1412331 1322415 1243624
60452A243624o9478o1880n5696m9931m3935l8260l3720l0178k6988k3978k1249
$$ 1243624 1174146 1112266 1056570 1006639 962704 924444 890724 860546 833558 809580 788331
60441G88331j8645j6260j4916j5065j5763j5667j4736j3867j3233j2213j0713
$$ 788331 769686 753426 738510 723445 707682 692015 677279 663412 650179 637966 627253
60430F27253r358q332p160n771m702m078l336k258j339q46l26N27J289J527J433
$$ 627253 617895 609563 602403 596632 591930 587852 584516 582258 580919 580073 579747 580274 581563 583090 584523
60415E84523J377J345J244J257J511J778J907K165K819L575L850L491K994L054
$$ 584523 585900 587245 588489 589746 591257 593035 594942 597107 599926 603501 607351 610842 613836 616890
60401F16890L861M888N450N559N934O999Q230Q795Q488P631O531N513N091N353
$$ 616890 620751 625639 631089 636648 642582 649581 657811 666606 675094 682725 689256 694769 699860 705213
60387G05213N481M609K974J527O27j60j095j965k651l214l480l272l006l243l705
$$ 705213 710694 715303 718277 719804 720431 720271 719176 717211 714560 711346 707866 704594 701588 698345 694640
60372F94640l543k582j497p73l78l56p97j107m44R09J633J198N72P04J356J922
$$ 694640 691097 688515 687018 686245 685867 685511 684714 683607 683163 684072 685705 686903 687475 688179 689535 691457
60356F91457K421L032L503L760M277N150N572N041M484N161P003Q824R910J0427
$$ 691457 693878 696910 700413 704173 708450 713600 719172 724213 728697 733858 740861 749685 759595 770022
60342G70022J0527J0059R217Q673Q712Q764Q122O821N585M995M960N044N152N659
$$ 770022 780549 790608 799825 808498 817210 825974 834096 840917 846502 851497 856457 861501 866653 872312
60328H72312O829Q462J0393J2896J5987J8660J9563J8466J6249J3425R569M473
$$ 872312 879141 887603 897996 910892 926879 945539 965102 983568 999817 1013242 1022811 1027284
60316A027284j077o184j0730j4737j7514j8292j7384j5963j4796j3718j2291j0505
$$ 1027284 1026207 1020023 1009293 994556 977042 958750 941366 925403 910607 896889 884598 874093
60304H74093q740p383o524n905n217m457l812l193k213p31Q81K105K707K801K787
$$ 874093 865353 857970 851446 845541 840324 835867 832055 828862 826649 825918 826799 828904 831611 834412 837199
60289H37199L194M151N045N064M173L060K217J579J063P77O19L55K28P73J929
$$ 837199 840393 844544 849589 854653 858826 861886 864103 865682 866745 867522 868141 868496 868724 869497 871426
60274H71426K991L644M270N109N925O746P988R450J0231J0214J0636J2447J5012
$$ 871426 874417 878061 882331 887440 893365 900111 908099 917549 927780 937994 948630 961077 976089
60261I76089J7322J9620K2717K6344K9395L1588L3766L6664M0350M4833N0262
$$ 976089 993411 1013031 1035748 1062092 1091487 1123075 1156841 1193505 1233855 1278688 1328950
60250A328950N6352O2444O8359P4659Q1798Q9497R7189J04667J12070J19346J25970
$$ 1328950 1385302 1447746 1516105 1590764 1672562 1762059 1859248 1963915 2075985 2195331 2321301
60239B321301J31127J34204J35023J33551J29507J22589J13062J01643Q8782P4473
$$ 2321301 2452428 2586632 2721655 2855206 2984713 3107302 3220364 3322007 3410789 3485262
60229C485262N8850M2448K5723Q982p044k1220l2970m2641n0514n6114n8814n8514
$$ 3485262 3544112 3586560 3612283 3621265 3614221 3593001 3560031 3517390 3466876 3410762 3351948 3293434
60217C293434n5290m9170m0822l1621k2282j1988K67J4096K8299M2434N6851P1537
$$ 3293434 3238144 3188974 3148152 3116531 3094249 3082261 3082528 3096624 3124923 3167357 3224208 3295745
60205C295745Q5963R9906J13338J25548J35125J40988J42805J40525J34180J24162
$$ 3295745 3381708 3481614 3594952 3720500 3855625 3996613 4139418 4279943 4414123 4538285
60195D538285J11132R5563P7712N7920L6572J4041q985l1396n2235p1036q7266
$$ 4538285 4649417 4744980 4822692 4880612 4917184 4931225 4922240 4890844 4838609 4767573 4680307
60184D680307j00027j08847j14119j16043j13887j07161r6908q4806p1414n6425
$$ 4680307 4580280 4471433 4357314 4241271 4127384 4020223 3923315 3838509 3767095 3710670
60174C710670m0181k3583o757J0871K9096M6673O2592P6458Q7453R4253R6362
$$ 3710670 3670489 3646906 3640149 3651020 3680116 3726789 3789381 3865839 3953292 4047545 4143907
60163D143907R4541Q9572Q1524P0560N7509M3132K7688J1653l921j8204l1016
$$ 4143907 4238448 4328020 4409544 4480104 4537613 4580745 4608433 4620086 4616165 4597961 4566945
60152D566945m1974m9884n3627n3124m9018m1838l1861j9336m415J2702L1368
$$ 4566945 4524971 4475087 4421460 4368336 4319318 4277480 4245619 4226283 4221868 4234570 4265938
60141D265938N0693P0427R1125J13219J36479J60667J86087K12978K40895K69074
$$ 4265938 4316631 4387058 4478183 4591402 4727881 4888548 5074635 5287613 5528508 5797582
60131E797582K97050L24456L50591L74534L95303M11604M21912M25155M21128
$$ 5797582 6094632 6419088 6769679 7144213 7539516 7951120 8373032 8798187 9219315
60122I219315M09836L90865L63720L28624K86632K39227J87945J33999P7947J9922
$$ 9219315 9629151 10020016 10383736 10712360 10998992 11238219 11426164 11560163 11638110 11658032
60112A1658032l9524r9010j56833k11526k61564l04870l39040l62254l74106l75666
$$ 11658032 11618508 11519498 11362665 11151139 10889575 10584705 10245665 9883411 9509305 9133639
60102I133639l68599l54022l32312l04230k71627k36369j98937j59081j17720
$$ 9133639 8765040 8411018 8078706 7774476 7502849 7266480 7067543 6908462 6790742
60093F790742p6996l8265j117L5044O9444J00378J26309J45811J57334J60021
$$ 6790742 6713746 6675481 6674364 6709408 6778852 6879230 7005539 7151350 7308684 7468705
60083G468705J54442J41781J22771R8083O9156L7813N349k7187n8203q6138j10728
$$ 7468705 7623147 7764928 7887699 7985782 8054938 8092751 8098100 8070913 8012710 7926572 7815844
60072G815844j32907j53279j71401j86501j98167k06153k10237k10537k07560
$$ 7815844 7682937 7529658 7358257 7171756 6973589 6767436 6557199 6346662 6139102
60063F139102k01626j92662j80798j66731j51161j34135j15308r4731p3148n1428
$$ 6139102 5937476 5744814 5564016 5397285 5246124 5111989 4996681 4901950 4828802 4777374
60053D777374k9919q400J3366L5204N6667P7443R7252J15386J30639J41876J48424
$$ 4777374 4747455 4739055 4752421 4787625 4844292 4921735 5018987 5134373 5265012 5406888 5555312
60042E555312J49811J45578J35679J20854J02168Q0247N5271K7693j362l0535
$$ 5555312 5705123 5850701 5986380 6107234 6209402 6289649 6344920 6372613 6371251 6340716
60032F340716n8804q5554j10123j31534j48685j60866j68021j70421j68311j62015
$$ 6340716 6281912 6196358 6086235 5954701 5806016 5645150 5477129 5306708 5138397 4976382
60022D976382j52247j39954j25895j10574r4452p7812o0510m2347k3703n209J3250
$$ 4976382 4824135 4684181 4558286 4447712 4353260 4275448 4214938 4172591 4148888 4143679 4156929
60011D156929L2596N3369P5135R7353J20070J43208J65565J85243K00710K11021
$$ 4156929 4189525 4242894 4318029 4415382 4535452 4678660 4844225 5029468 5230178 5441199
60001E441199K15387K13309K04920J90683J70882J45949J17033Q5603N2584J8415
$$ 5441199 5656586 5869895 6074815 6265498 6436380 6582329 6699362 6784965 6837549 6855964
59991F855964j6168n0114q2523j12483j38411j58494j71994j79417j81266j77469
$$ 6855964 6839796 6789682 6707159 6594676 6456265 6297771 6125777 5946360 5765094 5587625
59981E587625j68317j55156j39460j21767j02091q0991n9465l8098j6925M007
$$ 5587625 5419308 5264152 5124692 5002925 4900834 4819843 4760378 4722280 4705355 4709362
59971D709362K4505M4520O3856Q1579R6398J07863J16603J23107J26751J26456
$$ 4709362 4733867 4778387 4842243 4923822 5020220 5128083 5244686 5367793 5494544 5621000
59961E621000J21959J13977J03358R0635P6328O1174M5814L0588J5867K375q926
$$ 5621000 5742959 5856936 5960294 6050929 6127257 6188431 6234245 6264833 6280700 6283075 6274149
59950F274149j7110k1343k0985j5923o666O210K2710M3304O8196R6930J28807
$$ 6274149 6257039 6235696 6214711 6198788 6192122 6198332 6221042 6264346 6332542 6429472 6558279
59939F558279J63491K01037K41391K83897L27377L70565M12365M51417M85313
$$ 6558279 6721770 6922807 7164198 7448095 7775472 8146037 8558402 9009819 9495132
59930I495132N10452N22812N19021M96733M54474L91740L09644K11468J02612
$$ 9495132 10005584 10528396 11047417 11544150 11998624 12390364 12700008 12911476 13014088
59921A3014088j0157j19759k19960l06188l75657m27010m60099m76027m77051
$$ 13014088 13003931 12884172 12664212 12358024 11982367 11555357 11095258 10619231 10142180
59912A0142180m65932m45184m16856l82878l45361l06297k66856k27161j86908
$$ 10142180 9676248 9231064 8814208 8431330 8085969 7779672 7512816 7285655 7098747
59903G098747j46231j05809o6184k7286J1180M9042Q5596J20077J51923J80496
$$ 7098747 6952516 6846707 6780523 6753237 6764417 6813459 6899055 7019132 7171055 7351551
59893G351551K04694K22879K33185K33824K23265K00403J65007J18281O2873K030
$$ 7351551 7556245 7779124 8012309 8246133 8469398 8669801 8834808 8953089 9015962 9017992
59883I017992o1216j23924j82806k34669k77460l10381l33026l45125l47386l41811
$$ 9017992 8956776 8832852 8650046 8415377 8137917 7827536 7494510 7149385 6801999 6460188
59873F460188l30521l14711k95124k72916k49347k25065k00448j76378j53888
$$ 6460188 6129667 5814956 5519832 5246916 4997569 4772504 4572056 4395678 4241790
59864D241790j33218j13953r6085q0327o7455n7927n1954m9244m8732m9214n0209
$$ 4241790 4108572 3994619 3898534 3818207 3750752 3692825 3640871 3591627 3542895 3493681 3443472
59853C443472n1636n2765n2361m9871m5648l9986l2724k4121j5320p631j921J164
$$ 3443472 3391836 3339071 3286710 3236839 3191191 3151205 3118481 3094360 3079040 3071409 3069488 3070652
59841C070652J112j984p433j4763k3830l3884m3198n0155n4274n5838n5106n2352
$$ 3070652 3071764 3069780 3062347 3047584 3023754 2989870 2946672 2896517 2842243 2786405 2731299 2678947
59829B678947m8151m3035l7084l0243k2774j5100p445J36P733J5767K4749L4476
$$ 2678947 2630796 2587761 2550677 2520434 2497660 2482560 2475115 2475251 2482984 2498751 2523500 2557976
59817B557976M3767N1271N6443N9773O2435O5599O9517P3215P5539P6334P5843
$$ 2557976 2601743 2653014 2709457 2769230 2831665 2897264 2966781 3039996 3115535 3191869 3267712
59806C267712P3075O6136N4564M0272K5673J1883n65j0484j6725j9471j9750j8064
$$ 3267712 3340787 3406923 3461487 3501759 3527432 3539315 3538750 3528266 3511541 3492070 3472320 3454256
59794C454256j4309q520p60R298K1681L5434M9614O4719Q2131J02384J24958J49649
$$ 3454256 3439947 3431427 3430667 3439965 3461646 3497080 3546694 3611413 3693544 3795928 3920886 4070535
59782D070535J77051K07807K42357K81396L25275L72517M19309M60119M87528
$$ 4070535 4247586 4455393 4697750 4979146 5304421 5676938 6096247 6556366 7043894
59773G043894M91736M62621L94843K91924J65687L2079r3342j98630k77355l28656
$$ 7043894 7535630 7998251 8393094 8685018 8850705 8882784 8789442 8590812 8313457 7984801
59763G984801l55396l61839l52494l31791l03661k71114k36564k02299j70160
$$ 7984801 7629405 7267566 6915072 6583281 6279620 6008506 5771942 5569643 5399483
59754E399483j40759j13607q8250o4935m3921k4622n982J2411L0154M7151O4215
$$ 5399483 5258724 5145117 5056867 4991932 4948011 4923389 4917407 4929818 4959972 5007123 5071338
59743E071338Q2105J00448J18361J35961J54469J74780J96711K19905K44640K71394
$$ 5071338 5153443 5253891 5372252 5508213 5662682 5837462 6034173 6254078 6498718 6770112
59733F770112L00285L31451L65451M02671M42833M85455N30137N75790O20156
$$ 6770112 7070397 7401848 7767299 8169970 8612803 9098258 9628395 10204185 10824341
59724A0824341O60731O95560P22257P37107P36627P20092O89674O48519O00066
$$ 10824341 11485072 12180632 12902889 13639996 14376623 15096715 15786389 16434908 17034974
59715A7034974N49247N02600M66216M43926M37557M47662M73190N11177N57623
$$ 17034974 17584221 18086821 18553037 18996963 19434520 19882182 20355372 20866549 21424172
59706B1424172O08319O58397P01736P31707P42534P29777O90397O23489N31201
$$ 21424172 22032491 22690888 23392624 24124331 24866865 25596642 26287039 26910528 27441729
59697B7441729M18490K92012J59423K9238r0074j91761k71786l28213l60050l67065
$$ 27441729 27860219 28152231 28311654 28340892 28250818 28059057 27787271 27459058 27099008 26731943
59687B6731943l50495l13255k58925j90530j10285k0134P8094J83221K94915M13041
$$ 26731943 26381448 26068193 25809268 25618738 25508453 25488319 25566413 25749634 26044549 26457590
59677B6457590N36906O65070P95139R23063J042657J146024J224068J266169J260248
$$ 26457590 26994496 27659566 28454705 29377768 30420425 31566449 32790517 34056686 35316934
59668C5316934J194836J062596Q62984O03101K97452l3208l64681o73452r40288
$$ 35316934 36511770 37574366 38437350 39040451 39337903 39304695 38940014 38266562 37326274
59659C7326274j152008j301982j389842j420208j400691j340398j249631j140117
$$ 37326274 36174266 34872284 33482442 32062234 30661543 29321145 28071514 26931397
59651B6931397j025042r18680q35275p86469p77733q05899q59663r22908r79521
$$ 26931397 25906355 24987675 24152400 23365931 22588198 21782299 20922636 19999728 19020207
59642A9020207j017773j032529j024381r96873r54147r00217q39083p74537p09690
$$ 19020207 18002434 16969905 15945524 14948651 13994504 13094287 12255204 11480667 10770977
59633A0770977o46650n86549n29921m77298m29399l86474l47760l12116k79178
$$ 10770977 10124327 9537778 9007857 8530559 8101160 7714686 7366926 7054810 6775632
59624F775632k49309k22380j97426j73785j51858j32192j14389r7709q2438o9818
$$ 6775632 6526323 6303943 6106517 5932732 5780874 5648682 5534293 5436584 5354146 5284328
59614E284328o0629n4501n0808m9611n1326n5829o2423p0478p9585q8938r7116
$$ 5284328 5223699 5169198 5118390 5068779 5017453 4961624 4899201 4828723 4749138 4660200 4563084
59603D563084j02965j06534j08618j09484j08553j05471j00880r5654q9786q2660
$$ 4563084 4460119 4353585 4244967 4135483 4026930 3921459 3820579 3724925 3635139 3552479
59593C552479p4230o5318n6696m8403m0078l1584k3139j5120p882j538M163R522
$$ 3552479 3478249 3412931 3356235 3307832 3267754 3236170 3213031 3197911 3190029 3188491 3192654 3202176
59581C202176J4447J8484K1272K2756K3047K2418K1399K0557K0175K0347K1360
$$ 3202176 3216623 3235107 3256379 3279135 3302182 3324600 3345999 3366556 3386731 3407078 3428438
59570C428438K3616K7164L1663L6939M3222N0758N9403O8717P8284Q7967R8075
$$ 3428438 3452054 3479218 3510881 3547820 3591042 3641800 3701203 3769920 3848204 3936171 4034246
59559D034246J09256J22022J36334J51864J68565J86645K06039K26191K46441
$$ 4034246 4143502 4265524 4401858 4553722 4722287 4908932 5114971 5341162 5587603
59550E587603K66420K86006L05005L22758L37932L48948L54880L55787L52024
$$ 5587603 5854023 6140029 6445034 6767792 7105724 7454672 7809552 8165339 8517363
59541H517363L43664L31018L15286K98121K80668K63304K45824K27215K05919
$$ 8517363 8861027 9192045 9507331 9805452 10086120 10349424 10595248 10822463 11028382
59532A1028382J81560J56574J35137J20269J12471J10940J14856J23144J33922
$$ 11028382 11209942 11366516 11501653 11621922 11734393 11845333 11960189 12083333 12217255
59523A2217255J44725J52712J54417J46236J25813R2774M7946p349p0989j39814
$$ 12217255 12361980 12514692 12669109 12815345 12941158 13033932 13081878 13074529 13003540 12863726
59513A2863726k10328k79227l43086l98425m42859m75801m97549n08237n08191
$$ 12863726 12653398 12374171 12031085 11632660 11189801 10714000 10216451 9708214 9200023
59504I200023m98732m81875m59471m33001m03827l73063l41485l09950k79453
$$ 9200023 8701291 8219416 7759945 7326944 6923117 6550054 6208569 5898619 5619166
59495E619166k50444k22648j96055j71492j49544j29494j10148r1265p3357n6451
$$ 5619166 5368722 5146074 4950019 4778527 4628983 4499489 4389341 4298076 4224719 4168268
59485D168268m0124k4409r558N112K0962L8283N5829P2623Q9414J07665J27685
$$ 4168268 4128144 4103735 4094177 4099289 4120251 4158534 4214363 4286986 4376400 4484065 4611750
59474D611750J48581J69723J91367K13740K36150K57402K76649K93299L06158
$$ 4611750 4760331 4930054 5121421 5335161 5571311 5828713 6105362 6398661 6704819
59465F704819L13166L12244L02171K82354K52100K10768J58830R8469L3029l3844
$$ 6704819 7017985 7330229 7632400 7914754 8166854 8377622 8536452 8634921 8667950 8634106
59455H634106r8622j58171k10202k53396k86997l10702l25043l31413l31244l25370
$$ 8634106 8535484 8377313 8167111 7913715 7626718 7316016 6990973 6659560 6328316 6002946
59445F002946l14467k99756k82700k64282k44954k25278k06081j87958j70982
$$ 6002946 5688479 5388723 5106023 4841741 4596787 4371509 4165428 3977470 3806488
59436C806488j54958j39789j25558j12472j00658q9859p9449o8920n8371m8363
$$ 3806488 3651530 3511741 3386183 3273711 3173053 3083194 3003745 2934825 2876454 2828091
59426B828091l9453l1869k5388j9356j3055o400p2N166R198J2359J4914J7045
$$ 2828091 2788638 2756769 2731381 2712025 2698970 2692570 2692498 2697664 2706862 2719221 2734135 2751180
59414B751180J9292K2602K7691L4323M0976M5255M5200M0850L4701L0271K9925
$$ 2751180 2770472 2793074 2820765 2855088 2896064 2941319 2986519 3027369 3062070 3092341 3122266
59403C122266L3822M0710M9543O0451P4230R0813J08400J24348J37054J46973
$$ 3122266 3156088 3196798 3246341 3306792 3381022 3471835 3580235 3704583 3841637 3988610
59393C988610J56116J67166J82803K04840K33217K66246L02384L41594L84685
$$ 3988610 4144726 4311892 4494695 4699535 4932752 5198998 5501382 5842976 6227661
59384F227661M31605M80799N29886N76369O17665O50848O72673O80057O71221
$$ 6227661 6659266 7140065 7669951 8246320 8863985 9514833 10187506 10867563 11538784
59375A1538784O46725O09276N62333N09004M52204L95028L40273K89663K43719
$$ 11538784 12185509 12794785 13357118 13866122 14318326 14713354 15053627 15343290 15587009
59366A5587009K01956J62861J24194Q3888M0650o510n8674j16246j77814k40125
$$ 15587009 15788965 15951826 16076020 16159908 16200558 16194048 16135374 16019128 15841314 15601189
59356A5601189k98843l49264l87096m09888m17868m13169l98473l76847l52319
$$ 15601189 15302346 14953082 14565986 14156098 13738230 13325061 12926588 12549741 12197422
59347A2197422l29412l11735l01272k98747l03855l15125l30308l47219l63937
$$ 12197422 11868010 11556275 11255003 10956256 10652401 10337276 10006968 9659749 9295812
59338I295812l78303l88030l91582l88710l80080l66704l49639l29710l07410
$$ 9295812 8917509 8529479 8137897 7749187 7369107 7002403 6652764 6323054 6015644
59329F015644k83390k58895k35216k12733j91049j69969j49873j31051j13469
$$ 6015644 5732254 5473359 5238143 5025410 4834361 4664392 4514519 4383468 4269999
59320D269999r7229q2628o9422n6707m3877l1255j9356q040L198J4391K5161L5384
$$ 4269999 4172770 4090142 4020720 3964013 3920136 3888881 3869525 3861485 3864683 3879074 3904235 3939619
59308C939619M5315N5040O4268P2699Q0320Q7229R3310R8147J01161J01790R9682
$$ 3939619 3984934 4039974 4104242 4176941 4257261 4344490 4437800 4535947 4637108 4738898 4838580
59297D838580R4909Q7884P9049O8632N6918M4668L2922K2296J2842M958l7r73
$$ 4838580 4933489 5021373 5100422 5169054 5225972 5270640 5303562 5325858 5338700 5343658 5343621 5342648
59285E342648J757O690J3295K2544L5165N0265O6267Q2448R8723J14488J28575
$$ 5342648 5344405 5351095 5364390 5386934 5422099 5472364 5538631 5621079 5719802 5834290 5962865
59274E962865J40061J48280J52273J51023J44049J31247J12618Q9012O2695L5896
$$ 5962865 6102926 6251206 6403479 6554502 6698551 6829798 6942416 7031428 7094123 7130019
59264G130019Q722k0289n1270q1428j06610j23741j31813j31565j24815j13496
$$ 7130019 7138741 7118452 7067182 6985754 6879144 6755403 6623590 6492025 6367210 6253714
59254F253714r8946q2278o5098m8866l3611j8476l904P940J5500J9590K2086K3789
$$ 6253714 6154768 6072490 6007392 5958526 5924915 5906439 5902535 5910475 5925975 5945565 5967651 5991440
59242E991440K4526K4567K4911K6561L0409L7471M8351O2811Q0609J02526J29654
$$ 5991440 6015966 6040533 6065444 6092005 6122414 6159885 6208236 6271047 6351656 6454182 6583836
59231F583836J61943J98177K37159K77963L19133L58419L93311M20908M37277
$$ 6583836 6745779 6943956 7181115 7459078 7778211 8136630 8529941 8950849 9388126
59222I388126M38062M20336L83529L28584K57078J71400P5019k7959j32997k34716
$$ 9388126 9826188 10246524 10630053 10958637 11215715 11387115 11462134 11434175 11301178 11066462
59212A1066462l27137m05264m66325n09400n34534n42891n37133n20667m96328
$$ 11066462 10739325 10334061 9867736 9358336 8823802 8280911 7743778 7223111 6726783
59203F726783m66204m32340l96847l61293l26603k93602k63117k35471k10463
$$ 6726783 6260579 5828239 5431392 5070099 4743496 4449894 4186777 3951306 3740843
59194C740843j88017j68326j51171j35721j21431j08697r8129q9459q1666p4112
$$ 3740843 3552826 3384500 3233329 3097608 2976177 2867480 2769351 2679892 2598226 2524114
59184B524114o7053o0974n5808n0993m6168m1553l7550l3976k9999k5069j9677
$$ 2524114 2457061 2396087 2340279 2289286 2243118 2201565 2164015 2130039 2100040 2074971 2055294
59173B055294j4779j0553o342j884K217N597Q953J3091J7737K2079K6072L0340
$$ 2055294 2040515 2029962 2023620 2021736 2023953 2029550 2038503 2051594 2069331 2091410 2117482 2147822
59161B147822L4929L9142M2692M6159N0169N4728N9663O5007P0739P6587Q2338
$$ 2147822 2182751 2221893 2264585 2310744 2360913 2415641 2475304 2540311 2611050 2687637 2769975
59150B769975Q8011R3584R8919J03941J08361J11429J12514J11829J09838J06093
$$ 2769975 2857986 2951570 3050489 3154430 3262791 3374220 3486734 3598563 3708401 3814494
59140C814494R9620R0512P9963O8518N5546M0963K6231J2869J018r531j7877k2807
$$ 3814494 3914114 4004626 4084589 4153107 4208653 4249616 4275847 4288716 4289734 4280203 4262326 4239519
59128D239519k4426k3713k0909j5483p375K866J5071K9515M6018O3870Q2643J02304
$$ 4239519 4215093 4191380 4170471 4154988 4147613 4150479 4165550 4195065 4241083 4304953 4387596 4489900
59116D489900J22577J43042J63837J85362K07313K28676K48708K66913K81926
$$ 4489900 4612477 4755519 4919356 5104718 5312031 5540707 5789415 6056328 6338254
59107F338254K91124K91673K81451K59219K24901J80121J27820P1204J3545m1236
$$ 6338254 6629378 6921051 7202502 7461721 7686622 7866743 7994563 8065767 8079312 8038076
59097H038076q8952j26934j54908j73949j85162j89742j89537j86750j83225j80210
$$ 8038076 7949124 7822190 7667282 7493333 7308171 7118429 6928892 6742142 6558917 6378707
59087F378707j78484j78276j79297j81150j83626j86468j89149j91086j91951
$$ 6378707 6200223 6021947 5842650 5661500 5477874 5291406 5102257 4911171 4719220
59078D719220j91646j90143j87417j83450j78232j71887j64727j57033j48915
$$ 4719220 4527574 4337431 4150014 3966564 3788332 3616445 3451718 3294685 3145770
59069C145770j40574j32428j24678j16939j08696j00027r1564q3888p7181p1241
$$ 3145770 3005196 2872768 2748090 2631151 2522455 2422428 2330864 2246976 2169795 2098554
59059B098554o5486n9331n2983m7469m3393m0185l7110l4500l3079l2573l2052
$$ 2098554 2033068 1973737 1920754 1873285 1829892 1789707 1752597 1718097 1685018 1652445 1620393
59048A620393l1417l1385l2045l2497l2072l0885k9074k6502k3477k0723j8341
$$ 1620393 1588976 1557591 1525546 1493049 1460977 1430092 1401018 1374516 1351039 1330316 1311975
59037A311975j5677j2536r641p472n494l056k31K642N559Q504J1190J3479J5467
$$ 1311975 1296298 1283762 1274121 1266649 1261155 1258099 1257868 1260510 1266069 1274573 1285763 1299242 1314709
59024A314709J6739J6429J4413J1702R119O447L444Q18o40j186j489j436n04J133
$$ 1314709 1331448 1347877 1362290 1373992 1383111 1389558 1393002 1393820 1393180 1391994 1390505 1389069 1388565 1389698
59010A389698K816M430O360Q529J0390J1810J3148J4355J4712J3665J1512R011
$$ 1389698 1392514 1396944 1403304 1411833 1422223 1434033 1447181 1461536 1476248 1489913 1501425 1510436
58998A510436O667M526K456L92j498k867l358k872j722o04j08l9N83K430M929
$$ 1510436 1517103 1521629 1524085 1524477 1522979 1520112 1516754 1513882 1512160 1511556 1511448 1511409 1511992 1514422 1519351
58983A519351O942Q171R283J0671J1999J3052J4116J5167J5600J5366J5555J7130
$$ 1519351 1526293 1534464 1543747 1554418 1566417 1579469 1593585 1608752 1624352 1639718 1655273 1672403
58971A672403J9640K1970K3857K5874K8272L0729L3094L5516L7776L9216L9585
$$ 1672403 1692043 1714013 1737870 1763744 1792016 1822745 1855839 1891355 1929131 1968347 2007932
58960B007932L9465L9648M0343M1139M1508M1245M0623M0220M0646M2320M5398
$$ 2007932 2047397 2087045 2127388 2168527 2210035 2251280 2291903 2332123 2372769 2415089 2460487
58949B460487M9736N4986O0877O7324P4155Q0946Q7528R4456J02437J11423J20831
$$ 2460487 2510223 2565209 2626086 2693410 2767565 2848511 2936039 3030495 3132932 3244355 3365186
58938C365186J30591J41336J53449J66671J80758J95961K12642K31022K51480
$$ 3365186 3495777 3637113 3790562 3957233 4137991 4333952 4546594 4777616 5029096
58929E029096K74495L00082L27929L58245L91771M28758M68719N11401N57125
$$ 5029096 5303591 5603673 5931602 6289847 6681618 7110376 7579095 8090496 8647621
58920H647621O05772O56374P08086P60460Q11943Q58918Q97023R22568R31759
$$ 8647621 9253393 9909767 10617853 11378313 12190256 13049174 13946197 14868765 15800524
58911A5800524R19498Q80445Q11384P11920N83642M30130K57916P6225j05008
$$ 15800524 16720022 17600467 18411851 19123771 19707413 20137543 20395459 20471684 20366676
58902B0366676k76953m32404n65855o73803p54984q10237q42072q53806q48491
$$ 20366676 20089723 19657319 19091464 18417661 17662677 16852440 16010368 15156562 14308071
58893A4308071q28726p97564p58939p16398o71661o25065n77262n29851m84553
$$ 14308071 13479345 12681781 11922842 11206444 10534783 9909718 9332456 8802605 8318052
58884H318052m42426m03939l69238l38154l10342k85542k63593k44314k27486
$$ 8318052 7875626 7471687 7102449 6764295 6453953 6168411 5904818 5660504 5433018
58875E433018k12785j99471j86536j73478j60613j48375j36679j25321j14583
$$ 5433018 5220233 5020762 4834226 4660748 4500135 4351760 4215081 4089760 3975177
58866C975177j04892r6121q7785p9709p2111o5127n8673n2648m6957m1509l6328
$$ 3975177 3870285 3774164 3686379 3606670 3534559 3469432 3410759 3358111 3311154 3269645 3233317
58855C233317l1448k6557k1120j5087q967l034L029R375J5597K1572K7994L5423
$$ 3233317 3201869 3175312 3154192 3139105 3130138 3127104 3130133 3139508 3155105 3176677 3204671 3240094
58843C240094M3330N0832N7893O5091P2566Q0062Q7769R6294J05803J15877J26315
$$ 3240094 3283424 3334256 3392149 3457240 3529806 3609868 3697637 3793931 3899734 4015611 4141926
58832D141926J37555J50151J64188J79244J94957K11683K30523K52317K76715
$$ 4141926 4279481 4429632 4593820 4773064 4968021 5179704 5410227 5662544 5939259
58823E939259L02894L31131L62739L98287M36955M78186N22708N71078O22143
$$ 5939259 6242153 6573284 6936023 7334310 7771265 8249451 8772159 9343237 9965380
58814I965380O74000P25586P75883Q22084Q59666Q84090Q91275Q76821Q36219
$$ 9965380 10639380 11364966 12140849 12962933 13822599 14706689 15597964 16474785 17311004
58805A7311004P66251O65917N36632L82696K11522L2265j46089l15245m67354
$$ 17311004 18077255 18743172 19279804 19662500 19874022 19906287 19760198 19444953 18977599
58796A8977599n96030o98014p73197q23066q49834q56620q47112q24628p92119
$$ 18977599 18381569 17683555 16910358 16087292 15237458 14380838 13533726 12709098 11916979
58787A1916979p52853p10077o65860o21133n76884n34399m94229m55947m19296
$$ 11916979 11164126 10454049 9788189 9167056 8590172 8055773 7561544 7105597 6686301
58778F686301l84860l53327l24689k98525k74538k52679k33121k16314k02477
$$ 6686301 6301441 5948114 5623425 5324900 5050362 4797683 4564562 4348248 4145771
58769D145771j90943j80346j69602j58482j47330j36680j26934j18012j09265
$$ 4145771 3954828 3774482 3604880 3446398 3299068 3162388 3035454 2917442 2808177
58760B808177j00185r1086q2667p5100o7960o0963n4326m8481m3755m0146l7144
$$ 2808177 2707992 2616906 2534239 2459139 2391179 2330216 2275890 2227409 2183654 2143508 2106364
58749B106364l4097l0987k8414k6639k5206k3824k2810k2206k1343j9993j9018
$$ 2106364 2072267 2041280 2012866 1986227 1961021 1937197 1914387 1892181 1870838 1850845 1831827
58738A831827j9047j9402j9291j9202j9834k0559k0270j9216j8534j8500j8602
$$ 1831827 1812780 1793378 1774087 1754885 1735051 1714492 1694222 1675006 1656472 1637972 1619370
58727A619370j8965k0104k1680k2968k4277k6344k8544k9445k9053k8750k8939
$$ 1619370 1600405 1580301 1558621 1535653 1511376 1485032 1456488 1427043 1397990 1369240 1340301
58716A340301k8474k6796k4908k3661k2568k0934j8944j7044j5317j3903j3039
$$ 1340301 1311827 1285031 1260123 1236462 1213894 1192960 1174016 1156972 1141655 1127752 1114713
58705A114713j2340j1161r819r263r343q843p510o614o949p764q254q740r483
$$ 1114713 1102373 1091212 1081393 1072130 1062787 1053944 1046434 1039820 1032871 1025107 1016853 1008113 998630
58692I98630r677q603o856n490m855m977o134q197j0194j1335j1850j2205j2308
$$ 998630 988953 980350 973494 968004 963149 958172 952038 943841 933647 922312 910462 898257 885949
58679H85949j2007j1557j0962r687p670n786m618l618k227j004q03j430k009k114
$$ 885949 873942 862385 851423 841736 834066 828280 823662 820044 817817 816813 816010 814580 812571 810457
58665H10457j839j171n1J245K281K695K087K93j988l504l840l780m033m386m392
$$ 810457 808618 807447 807396 808641 810922 813617 815704 815997 814009 810505 806665 802885 798852 794466 790074
58650G90074l856k113J948Q216J4598J9038K1712K4237K7233K9684L0582L0249
$$ 790074 786218 784105 786053 794269 808867 827905 849617 873854 901087 930771 961353 991602
58638I91602K9972L0820L2842L5244L7407L9804M3443M8385N3590N8436O3616
$$ 991602 1021574 1052394 1085236 1120480 1157887 1197691 1241134 1289519 1343109 1401545 1465161
58627A465161P0060P7765Q6303R5852J06988J19798J33913J49228J66095J84805
$$ 1465161 1535221 1612986 1699289 1795141 1902129 2021927 2155840 2305068 2471163 2655968
58617B655968K05135K26208K46646K64996K79953K89761K91648K82436K59870
$$ 2655968 2861103 3087311 3333957 3598953 3878906 4168667 4460315 4742751 5002621
58608E002621K23263J73500J13440M8000j7365p8566j32838j77494k10256k30905
$$ 5002621 5225884 5399384 5512824 5560824 5543459 5464893 5332055 5154561 4944305 4713400
58598D713400k41286k43405k38671k28917k16489k02766j87917j72559j58202
$$ 4713400 4472114 4228709 3990038 3761121 3544632 3341866 3153949 2981390 2823188
58589B823188j45489j33462j21468j10394j01107r2887q4506p5825o7320n8997
$$ 2823188 2677699 2544237 2422769 2312375 2211268 2118381 2033875 1958050 1890730 1831733
58579A831733n0817m3410l7394l2640k8937k6537k5410k4880k4793k5936k8393
$$ 1831733 1780916 1737506 1700112 1667472 1638535 1611998 1586588 1561708 1536915 1510979 1482586
58568A482586l0546l0878k9850k8839k8033k6625k4493k2407k0922k0111k0059
$$ 1482586 1452040 1421162 1391312 1362473 1334440 1307815 1283322 1260915 1239993 1219882 1199823
58557A199823k0641k1146k0940k0219j9404j8256j6297j3723j1240r273p865o883
$$ 1199823 1179182 1158036 1137096 1116877 1097473 1079217 1062920 1049197 1037957 1028684 1020819 1013936
58545A013936n924m525k922j917j633j233k97M80M94J45k71j470m004o923q762
$$ 1013936 1008012 1003487 1000565 998648 997015 995782 995485 995965 996459 996604 996333 994863 990859 983936 975174
58530I75174r293r416r858j0772j2209j4059j5857j7146j7754j7496j6255j4635
$$ 975174 965881 956465 946607 935835 923626 909567 893710 876564 858810 841314 825059 810424
58518H10424j3669j3517j3287j2467j1466j0470q931o808m996m005l267k447k012
$$ 810424 796755 783238 769951 757484 746018 735548 726617 719809 714813 710808 707541 705094 703082
58505G03082j951j337k8P12K77q3P22J824J905J170O25N58R58K128L643M029K837
$$ 703082 701131 699794 699766 700478 700755 700672 701394 703218 705123 706293 706918 707476 708434 710562 714205 718234 721071
58488G21071J691J946K722K784K814L956N502O066N957O314O884O801O678P715
$$ 721071 722762 724708 727430 730214 733028 736984 742486 748552 754509 760823 767707 774508 781186 788901
58474G88901R342R910R312Q778Q462P176M466J139k145n265p807r359j0381j1471
$$ 788901 798243 808153 817465 826243 834705 841881 846347 847486 845341 840076 832269 822910 812529 801058
58460H01058j2168j1853j1135j0902j0680r622q362q016p978o789m834l997m738
$$ 801058 788890 777037 765902 755000 744320 734698 726336 718320 710342 703553 698719 694722 689984
58447F89984n539n338m657m092l371k230q82N42J988K974L191L286L952M648M481
$$ 689984 684445 679107 674450 670358 666987 664757 663875 664417 666405 669379 672570 675856 679808 684456 688937
58432F88937L764L352L058K195J164R16J300J551J881L029M727O123P196Q217
$$ 688937 692701 696053 699111 701306 702470 703386 704686 706237 708118 711147 715874 721997 729193 737410
58418G37410Q585P920P458Q443R834R792Q689Q328Q749Q311O725N442M959M109
$$ 737410 745995 753915 761373 769816 779650 789442 798131 806459 815208 823519 830244 835686 840645 844754
58404H44754K369P10k08q38j482j943k489l508m230l553k058j359j596j432l33
$$ 844754 847123 847833 847625 846787 845305 843362 840873 837365 833135 829582 827524 826165 824569 823137 822804
58389H22804J002K292L726M600M073L134L623N368O479O434O462O801O029L609
$$ 822804 823806 826098 829824 834424 838497 841631 845254 850622 857101 863535 869997 876798 882827 886436
58375H86436Q45j132k391k875k101n64M65Q75J707L149M374N246O217O627N434
$$ 886436 887281 886149 883758 880883 878782 878218 878683 879558 881265 884414 888788 894034 900251 906878 912312
58360I12312L520K994M010M673M231L905M351M730M734N154N978O197N850O038
$$ 912312 915832 918826 922836 927509 931740 935645 939996 944726 949460 954614 960592 966789 972639 978677
58346I78677O631O337N299N133O032O388N716N342N688N512M552M308N397O610
$$ 978677 985308 991645 996944 1002077 1008109 1014497 1020213 1025555 1031243 1036755 1041307 1045615 1051012 1057622
58332A057622P321Q423J0052J0945J0822J1068J2079J2385J1290J0143J0076J0578
$$ 1057622 1064943 1073366 1083418 1094363 1105185 1116253 1128332 1140717 1152007 1162150 1172226 1182804
58320A182804J1085J1822J2418J1866J0562J0257J1384J2559J3134J3955J5156
$$ 1182804 1193889 1205711 1218129 1229995 1240557 1250814 1262198 1274757 1287891 1301846 1317002
58309A317002J5618J5089J4515J4003J2896J1946J2668J4467J5187J4732J5003
$$ 1317002 1332620 1347709 1362224 1376227 1389123 1401069 1413737 1428204 1443391 1458123 1473126
58298A473126J6158J6383J5698J6334J8676K0397K0525K0774K1867K2199K1278
$$ 1473126 1489284 1505667 1521365 1537699 1556375 1576772 1597297 1618071 1639938 1662137 1683415
58287A683415K0962K1994K2714K2499K3059K5094K7029K8296L0403L3578L5776
$$ 1683415 1704377 1726371 1749085 1771584 1794643 1819737 1846766 1875062 1905465 1939043 1974819
58276A974819L6264L6703L7624L7489L6391L6701L8801M0086L9549L9361M0517
$$ 1974819 2011083 2047786 2085410 2122899 2159290 2195991 2234792 2274878 2314427 2353788 2394305
58265B394305M1149M0749M1776M5247M8794N0941N3205N6258N8194N8389N8940
$$ 2394305 2435454 2476203 2517979 2563226 2612020 2662961 2716166 2772424 2830618 2889007 2947947
58254B947947O0578O1432O1407O3310O7917P2524P5996Q0474Q6586R1970R6236
$$ 2947947 3008525 3069957 3131364 3194674 3262591 3335115 3411111 3491585 3578171 3670141 3766377
58243C766377J02030J09551J15493J19168J23952J30982J37439J42775J50079
$$ 3766377 3868407 3977958 4093451 4212619 4336571 4467553 4604992 4747767 4897846
58234D897846J59477J67099J72722J81110J93536K05620K16045K29323K47111
$$ 4897846 5057323 5224422 5397144 5578254 5771790 5977410 6193455 6422778 6669889
58225F669889K65186K82016L01638L25066L48047L70525L98451M32910M68052
$$ 6669889 6935075 7217091 7518729 7843795 8191842 8562367 8960818 9393728 9861780
58216I861780N03277N46073N99065O56687P18926P94832Q87640R91025J105499
$$ 9861780 10365057 10911130 11510195 12166882 12885808 13680640 14568280 15559305 16664804
58207A6664804J243092J410734J606982J841356K136724K504725K939782L444500
$$ 16664804 17907896 19318630 20925612 22766968 24903692 27408417 30348199 33792699
58199C3792699M036626M725648N516762O450845P605975R050375J0843529J3101966
$$ 33792699 37829325 42554973 48071735 54522580 62128555 71178930 82022459 95124425
58191I5124425J6007884J9740113K4473879L0393111L7328901M3972199M7519100
$$ 95124425 111132309 130872422 155346301 185739412 223068313 267040512 314559612
58184C14559612M4752907L4219252J7678629o27642j6356884k7122379l2869113
$$ 314559612 359312519 393531771 411210400 410582758 394225874 367103495 334234382
58177C34234382l4875279l4562467l2895585l0378420k7295717k3911776k0513537
$$ 334234382 299359103 264796636 231901051 201522631 174226914 150315138 129801601
58170A29801601j7344347j4545580j2164176j0188084q567614p234350o127678
$$ 129801601 112457254 97911674 85747498 75559414 66991800 59757450 53629772
58163E3629772n204653m427159l757106l167763k643225k163000j701761j243645
$$ 53629772 48425119 43997960 40240854 37073091 34429866 32266866 30565105 29321460
58155B9321460p78675k85817K64009Q98010J655741K575763L580118M346212M389400
$$ 29321460 28542785 28256968 28520977 29418987 31074728 33650491 37230609 41576821 45966221
58146D5966221L399208J539085o10320k425060l579842m101489m194794m056558
$$ 45966221 49365429 50904514 50294194 47869134 44289292 40187803 35993009 31936451
58138C1936451l799926l470295l089182k683678k288115j929590j619729j359395
$$ 31936451 28136525 24666230 21577048 18893370 16605255 14675665 13055936 11696541
58130A1696541j144844r68868q22816p01051o01294n20886m56030m04053l63049
$$ 11696541 10551697 9582829 8760013 8058962 7457668 6936782 6480752 6076699 5713650
58121E713650l30182l03520k83729k70438k58910k44290k27092k10372j93659
$$ 5713650 5383468 5079948 4796219 4525781 4266871 4022581 3795489 3585117 3391458
58112C391458j74431j53757j35294j19709j04975r1578q2853q0112q1189q3602
$$ 3391458 3217027 3063270 2927976 2808267 2703292 2611714 2528861 2448749 2367560 2283958
58102B283958q5918q6480q4170q0205p6507p2868o8153o3107n9149n5579n0894
$$ 2283958 2198040 2111560 2027390 1947185 1870678 1797810 1729657 1666550 1607401 1551822 1500928
58091A500928m5824m2121l9283l5507l1011k7588k5622k4253k3684k4623k6112
$$ 1500928 1455104 1412983 1373700 1338193 1307182 1279594 1253972 1229719 1206035 1181412 1155300
58080A155300k6491k5931k5636k5349k4032k2266k1445k1255k0192j8141j6264
$$ 1155300 1128809 1102878 1077242 1051893 1027861 1005595 984150 962895 942703 924562 908298
58069I08298j4948j3755j2813j2414j1891j0531q866p603o368m917m313n190o323
$$ 908298 893350 879595 866782 854368 842477 831946 823080 815477 809109 804192 799879 794689 788366
58056G88366o573o785p928r039r012q829r718j0674j0151q819q160p691o091l902
$$ 788366 781793 775008 767080 758041 749029 740200 730482 719808 709657 700838 692678 684987 678896 674994
58042F74994k556j777m65Q61J033O96J313K476K746K378K667L360L181K285J728
$$ 674994 672438 670661 670196 671057 672090 672786 674099 676575 679321 681699 684366 687726 690907 693192 694920
58027F94920J128n21k308k318q02J30k46o98o11p06j225j576j875k768l780l842
$$ 694920 696048 695527 693219 690901 690099 690229 689983 689285 688674 687968 686743 685167 683292 680524 676744 672902
58011F72902l357l739n009n822n796n816o100o008n709o049o714o521n561n145
$$ 672902 669545 665806 660797 654975 649179 643363 637263 631255 625546 619497 612783 606262 600701 595556
57997E95556n555n917o373q122j0831j2209j0913q125n510l197p04J649L286M372
$$ 595556 590001 584084 577711 569589 558758 546549 535636 527511 522001 518804 518100 519749 523035 527407
57983E27407N414O428P086P173O714O074N892O340O702O329N548M854L830K003
$$ 527407 532821 539249 546335 553508 560222 566296 572188 578528 585230 591559 597107 601961 605791 607794
57969F07794J91l61M6j45j621l526m801n107m574l679l237l552l871l527l070
$$ 607794 607985 607624 607670 607525 605904 602378 597577 592470 587896 584217 580980 577428 573557 570030 566960
57954E66960l235l504l017k239k208k642k361j225q9Q80K187L552M159M247M831
$$ 566960 563725 560221 557204 554965 552757 550115 547754 546529 546440 547320 549507 553059 557218 561465 566296
57939E66296N782N774M275K178L27j215k414l131l853n259p035q321r194j0316
$$ 566296 572078 577852 582127 584305 584632 583417 581003 577872 574019 568760 561725 553404 544210 533894
57925E33894j1308j1144r984r002q314o880m665l047k545j870k8K186L608M387
$$ 533894 522586 511442 501458 492456 484142 477262 472597 469550 467005 465135 465107 467293 470901 475288
57911D75288N309O494P570Q450R220R825J0233J0418J0045Q799P093N692M728
$$ 475288 480597 487091 494661 503111 512331 522156 532389 542807 552852 561651 568744 574436 579164
57898E79164L860L232L180L178K322Q44j07l85j093k750m482n428n756n866n691
$$ 579164 583024 586256 589436 592614 594936 595780 595673 595288 594195 591445 586963 581535 575779 569913 564222
57883E64222n293n114n169m908m240l760l679l506l073k788k582j665K35K303
$$ 564222 558929 553815 548646 543738 539498 535738 532059 528553 525480 522692 520110 518445 518680 520983
57869E20983L756M636N180N380N567O396P754Q587Q284P420O755O247N548M639
$$ 520983 524739 529375 534555 539935 545502 551898 559652 568239 576523 583943 590698 596945 602493 607132
57855F07132L541K130N76o32j417k150k863l227l428m079n078n566n329n149n399
$$ 607132 610673 612803 613379 612747 611330 609180 606317 603090 599662 595583 590505 584939 579610 574461 569062
57840E69062n341m405l174k486k335k339k506k920l251l161k781k387k094k148
$$ 569062 563721 559316 556142 553656 551321 548982 546476 543556 540305 537144 534363 531976 529882 527734
57826E27734k928m384n984p367q521r276r391r192r223r236q426o869n623n179
$$ 527734 524806 520422 514438 507071 498550 489274 479883 470691 461468 452232 443806 436937 431314 426135
57812D26135m866m176l592l531l504k955k122j448q79k96P7K07N36J282K101K856
$$ 426135 421269 417093 413501 409970 406466 403511 401389 399941 399062 398766 398843 399050 399586 400868 402969 405825
57796D05825L987N677P473R078J0779J2608J3843J3837J2687J0759Q357O189N138
$$ 405825 409812 415489 422962 432040 442819 455427 469270 483107 495794 506553 514910 521099 526237
57783E26237N068M736L422J786N46o30k212l717m502m830n258n583n257m408l654
$$ 526237 531305 536041 539463 541249 541795 541165 538953 535236 530734 525904 520646 515063 509806 505398 501744
57768E01744l325l513m275n200n272l962j929j05J357K630L437L578L658M306
$$ 501744 498419 494906 490631 485431 480159 476197 474268 474163 475520 478150 481587 485165 488823 493129
57754D93129N096N148M474L879L707L510K932K179J659J607K021K588K849K709
$$ 493129 498225 503373 507847 511726 515433 518943 521875 524054 525713 527320 529341 531929 534778 537487
57740E37487K634L014L601L902L869L859M232N175O546P763Q284Q326Q669R647
$$ 537487 540121 543135 546736 550638 554507 558366 562598 567773 574319 582082 590366 598692 607361 617008
57726F17008J0973J2581J4743J7128J8750J9356J9830K0663K1056K0250J8810
$$ 617008 627981 640562 655305 672433 691183 710539 730369 751032 772088 792338 811148
57715H11148J7720J7057J6564J6647J7689J9006J9730K0306K1876K4512K7264
$$ 811148 828868 845925 862489 879136 896825 915831 935561 955867 977743 1002255 1029519
57704A029519K9776L2740L6673M1281M6217N1648N7860O4884P2639Q1075R0173
$$ 1029519 1059295 1092035 1128708 1169989 1216206 1267854 1325714 1390598 1463237 1544312 1634485
57693A634485J00274J12183J26447J42745J60415J79290J99455K20574K41944
$$ 1634485 1734759 1846942 1973389 2116134 2276549 2455839 2655294 2875868 3117812
57684C117812K62711K81161K94113K97997K90474K70547K37685J92207J36767
$$ 3117812 3380523 3661684 3955797 4253794 4544268 4814815 5052500 5244707 5381474
57675E381474P6670J8358l2298p0879r4941j04065r9331q3544o3156m9142n3184
$$ 5381474 5458144 5476502 5444204 5373325 5278384 5174319 5074988 4991444 4928288 4879146 4825962
57664D825962q0447j25481j75292k16662k41934k50363k45930k33710k17061j97283
$$ 4825962 4745515 4620034 4444742 4228080 3986146 3735783 3489853 3256143 3039082 2841799
57654B841799j75236j52592j31188j11789r4105p7896o3548n1464m1333l2315
$$ 2841799 2666563 2513971 2382783 2270994 2176889 2098993 2035445 1983981 1942648 1910333
57644A910333k3775j5621p876l35P097J4176K0955K8435L7808M8911O0279P1046
$$ 1910333 1886558 1870937 1863061 1862726 1869823 1883999 1904954 1933389 1971197 2020108 2080387 2151433
57632B151433Q2119R4905J09605J25474J42152J59728J77800J95460K12167K27560
$$ 2151433 2233552 2328457 2438062 2563536 2705688 2865416 3043216 3238676 3450843 3678403
57622C678403K40125K46801K44363K30837K05511J68341J20095O3232K299n6957
$$ 3678403 3918528 4165329 4409692 4640529 4846040 5014381 5134476 5197708 5200007 5143050
57612E143050j09472j52503j85588k09108k23304k28858k27617k21860k12924
$$ 5143050 5033578 4881075 4695487 4486379 4263075 4034217 3806600 3584740 3371816
57603C371816k01220j87440j72927j58729j45027j31811j19534j08694r9098r0089
$$ 3371816 3170596 2983156 2810229 2651500 2506473 2374662 2255128 2146434 2047336 1957247
57593A957247q1356p3191o5994n9769n4236m9228m4805m0905l7129l3131k9113
$$ 1957247 1875891 1802700 1736706 1676937 1622701 1573473 1528668 1487763 1450634 1417503 1388390
57582A388390k5609k2772k0252j7844j5798j4292j2999j1478r720q030o649n653
$$ 1388390 1362781 1340009 1319757 1301913 1286115 1271823 1258824 1247346 1237626 1229596 1222947 1217294
57570A217294m933m073k629p25J035K406L744N194O298O857P521Q873J0504J1699
$$ 1217294 1212361 1208288 1205659 1204934 1205969 1208375 1212119 1217313 1223611 1230468 1237989 1246862 1257366 1269065
57556A269065J2540J3607J4906J5916J6465J6830J7188J7665J8707K0672K3225
$$ 1269065 1281605 1295212 1310118 1326034 1342499 1359329 1376517 1394182 1412889 1433561 1456786
57545A456786K5897K9067L3537L9283M5453N1736N8802O7279P7023Q7659R9159
$$ 1456786 1482683 1511750 1545287 1584570 1630023 1681759 1740561 1807840 1884863 1972522 2071681
57534B071681J11540J24554J38054J52213J66987J81427J93740K01869K04132
$$ 2071681 2183221 2307775 2445829 2598042 2765029 2946456 3140196 3342065 3546197
57525C546197J99438J86799J64767J32114Q9848M2108n765n0021q8954j21369
$$ 3546197 3745635 3932434 4097201 4229315 4319163 4361271 4355506 4305485 4216531 4095162
57515D095162j45946j62208j70872j72899j69128j61102j51108j40706j29912
$$ 4095162 3949216 3787008 3616136 3443237 3274109 3113007 2961899 2821193 2691281
57506B691281j18404j06853r6253q6607p7168o7733n8918n1157m4198l7641l1481
$$ 2691281 2572877 2466024 2369771 2283164 2205996 2138263 2079345 2028188 1983990 1946349 1914868
57495A914868k5883k0788j5995j1443p183l089J127N507R634J3159J6524K0783
$$ 1914868 1888985 1868197 1852202 1840759 1833576 1830487 1831614 1837121 1846755 1859914 1876438 1897221
57483A897221K6523L3229L9919M6095N1920N7978O5101P4023Q4597R5822J07143
$$ 1897221 1923744 1956973 1996892 2042987 2094907 2152885 2217986 2292009 2376606 2472428 2579571
57472B579571J19294J33151J48227J63047J76543J87965J95612J96937J90061
$$ 2579571 2698865 2832016 2980243 3143290 3319833 3507798 3703410 3900347 4090408
57463D090408J74237J48860J13513O9673K1381k6658p1101j09869j41096j63388
$$ 4090408 4264645 4413505 4527018 4596691 4618072 4591414 4520313 4410444 4269348 4105960
57453D105960j76761j82569j82509j78026j70300j60237j48564j36152j23953
$$ 4105960 3929199 3746630 3564121 3386095 3215795 3055558 2906994 2770842 2646889
57444B646889j12368j01187r0451q0837p2718o5373n7834n0228m3639l8707l4961
$$ 2646889 2534521 2433334 2342883 2262046 2189328 2123955 2066121 2015893 1972254 1933547 1898586
57433A898586l1504k7909k4458k1676j9694j7981j5855j3359j1228r876q820p367
$$ 1898586 1867082 1839173 1814715 1793039 1773345 1755364 1739509 1726150 1714922 1705046 1696226 1688859
57421A688859n460l508j844p23m35q36j139o25N74J825K819L549L881L800L901
$$ 1688859 1683399 1679891 1678047 1677324 1676889 1676053 1674914 1674289 1674863 1676688 1679507 1683056 1686937 1690737 1694638
57406A694638M871O465P725Q212Q459Q961R433R332Q755Q390Q775R837J1036J1804
$$ 1694638 1699509 1705974 1713699 1721911 1730370 1739331 1748764 1758096 1766851 1775241 1784016 1793853 1804889 1816693
57392A816693J1969J1898J2138J2827J3553J3779J3323J2454J1654J1312J1447
$$ 1816693 1828662 1840560 1852698 1865525 1879078 1892857 1906180 1918634 1930288 1941600 1953047
57381A953047J1720J1844J1888J2085J2433J2782J3200J3885J4641J4819J4067
$$ 1953047 1964767 1976611 1988499 2000584 2013017 2025799 2038999 2052884 2067525 2082344 2096411
57370B096411J2916J2275J2457J2942J3163J3184J3433J3948J4241J3969J3403
$$ 2096411 2109327 2121602 2134059 2147001 2160164 2173348 2186781 2200729 2214970 2228939 2242342
57359B242342J3071J3141J3459J3963J4694J5386J5529J5068J4691J5144J6394
$$ 2242342 2255413 2268554 2282013 2295976 2310670 2326056 2341585 2356653 2371344 2386488 2402882
57348B402882J7691J8372J8383J8129J8035J8186J8349J8320J8269J8570J9214
$$ 2402882 2420573 2438945 2457328 2475457 2493492 2511678 2530027 2548347 2566616 2585186 2604400
57337B604400J9745J9930K0078K0412K0493J9848J8961J8874J9672K0143J9313
$$ 2604400 2624145 2644075 2664153 2684565 2705058 2724906 2743867 2762741 2782413 2802556 2821869
57326B821869J7821J7151J7875J9280K0545K1469K1930K1551K0490J9927K0885
$$ 2821869 2839690 2856841 2874716 2893996 2914541 2936010 2957940 2979491 2999981 3019908 3040793
57315C040793K2741K3775K3298K2472K2637K3633K4340K4343K4199K4327K4570
$$ 3040793 3063534 3087309 3110607 3133079 3155716 3179349 3203689 3228032 3252231 3276558 3301128
57304C301128K4915K5738K6977K7796K7664K7285K7869K9651L1798L3562L4998
$$ 3301128 3326043 3351781 3378758 3406554 3434218 3461503 3489372 3519023 3550821 3584383 3619381
57293C619381L6425L7817L9013M0200M1796M3936M6221M8051M9214N0166N1586
$$ 3619381 3655806 3693623 3732636 3772836 3814632 3858568 3904789 3952840 4002054 4052220 4103806
57282D103806N3502N4969N5010N3799N2471N1531M9984M6408M0559L3388K5744
$$ 4103806 4157308 4212277 4267287 4321086 4373557 4425088 4475072 4521480 4562039 4595427 4621171
57271D621171J7776R660K222l666p930j1155j3770j5707j6728j6783j6033j4773
$$ 4621171 4638947 4648607 4650829 4647163 4639233 4628078 4614308 4598601 4581873 4565090 4549057 4534284
57259D534284j3233j1349q825n597k112J015L494N391O870Q175R620J1269J2764
$$ 4534284 4521051 4509702 4500877 4495280 4493168 4494183 4497677 4503068 4509938 4518113 4527733 4539002 4551766
57246D551766J3747J4333J4910J5674J6584J7541J8179J7905J6604J5103J4299
$$ 4551766 4565513 4579846 4594756 4610430 4627014 4644555 4662734 4680639 4697243 4712346 4726645
57235D726645J4046J3540J2613J1823J1383J0868J0166R773R867R897R400Q619
$$ 4726645 4740691 4754231 4766844 4778667 4790050 4800918 4811084 4820857 4830724 4840621 4850021 4858640
57223D858640Q039P906Q361R393J0368J0485R902R639J0085J0588J0808J1344
$$ 4858640 4866679 4874585 4882946 4892339 4902707 4913192 4923094 4932733 4942818 4953406 4964214 4975558
57211D975558J2402J3089J2838J2486J2871J3335J2835J1647J0704R980Q892P724
$$ 4975558 4987960 5001049 5013887 5026373 5039244 5052579 5065414 5077061 5087765 5097745 5106637 5114361
57199E114361P130O662N361L513K217J408Oj938l022k831k709l506m134l364j867
$$ 5114361 5121491 5128153 5133514 5137027 5139244 5140652 5140658 5138720 5135698 5132867 5130158 5126652 5122518 5119154 5117287
57184E117287j283k024l112l671l666l466l506m196n520o842p473p314o712o049
$$ 5117287 5116004 5113980 5110868 5107197 5103531 5100065 5096559 5092363 5086843 5080001 5072528 5065214 5058502 5052453
57170E052453n662n772o101n913m810l236j944j254r75p84m64n0rq87k686m829
$$ 5052453 5046791 5041019 5034918 5029005 5024195 5020959 5019015 5017761 5016786 5016002 5015538 5015488 5015479 5014592 5011906 5007077
57154E007077o839q719j0575j2327j3963j5636j7334j8824k0168k1936k4562k7770
$$ 5007077 5000238 4991519 4980944 4968617 4954654 4939018 4921684 4902860 4882692 4860756 4836194 4808424
57142D808424l0794l3006l4183l4406l3935l3122l2279l1564l0870k9736k7680
$$ 4808424 4777630 4744624 4710441 4676035 4642100 4608978 4576699 4545135 4514265 4484529 4456849
57131D456849k4748k1572j8664j5953j3175j0359p605m826k167k59M15J87k22
$$ 4456849 4432101 4410529 4391865 4375912 4362737 4352378 4344773 4339947 4337780 4337521 4337936 4338123 4337901
57118D337901l76QJ312L638O599J0163J5169K2346L1282M1065N1631O3878P8924
$$ 4337901 4337525 4337533 4338845 4342483 4349082 4359245 4374414 4396760 4428042 4469107 4520738 4584616 4663540
57105D663540R7774J21229J49700J83822K25772K79121L46825M30087N29249O44370
$$ 4663540 4761314 4882543 5032243 5216065 5441837 5720958 6067783 6497870 7027119 7671489
57095G671489P74700R19836J082121J265256J468784J685844J907129K123716
$$ 7671489 8446189 9366025 10448146 11713402 13182186 14868030 16775159 18898875
57087A8898875K324277K493451K615319K673559K646139K510979K269893J962831
$$ 18898875 21223152 23716603 26331922 29005481 31651620 34162599 36432492 38395323
57079C8395323J642038J326587R92140O09752J84651k49343o62642j045807j399678
$$ 38395323 40037361 41363948 42356088 42965840 43150491 42901148 42238506 41192699 39793021
57070C9793021j723628k013374k259320k444045k548671k565748k503261k376835
$$ 39793021 38069393 36056019 33796699 31352654 28803983 26238235 23734974 21358139
57062B1358139k203260k001202j790352j585491j393845j219466j066343r35805
$$ 21358139 19154879 17153677 15363325 13777834 12383989 11164523 10098180 9162375
57054I162375q24942p30070o49287n80419n19824m65236m17251l76317l40727
$$ 9162375 8337433 7607363 6958076 6377657 5857833 5392597 4975346 4599029 4258302
57045D258302l09119k82245k60453k41746k24187k08119j94191j81234j67982
$$ 4258302 3949183 3666938 3406485 3164739 2940552 2732433 2538242 2357008 2189026
57036B189026j55107j43635j32879j21832j11200j02339r5246q9149q3946p9645
$$ 2189026 2033919 1890284 1757405 1635573 1524373 1422034 1326788 1237639 1153693 1074048
57026A074048p5401p0483o5277o0251n4964m9135m3525l8680l3927k8672k3618
$$ 1074048 998647 928164 862887 802636 747672 698537 655012 616332 582405 553733 530115
57015E30115j9635j6496j3580j0771p800m021L16L932O523R460J3606J8151K2620
$$ 530115 510480 493984 480404 469633 461833 457812 458128 462060 468583 478043 491649 509800 532420
57002E32420K8271L6167M5739N6634P0324Q8561J12402J43855J84094K25223K46272
$$ 532420 560691 596858 642597 699231 769555 858116 970518 1114373 1298467 1523690 1769962
56991A769962K24644J55279N7236l9448j12430j54942j71638j71122j61142j46957
$$ 1769962 1994606 2149885 2207121 2167673 2055243 1900301 1728663 1557541 1396399 1249442
56981A249442j31848j18319j08073j00899r4764q7780p9670p1165o2656n4055
$$ 1249442 1117594 999275 891202 790303 695539 607759 528089 456924 394268 340213
56971C40213m5402l7128k9705k3268j7583j2394p840m223j214K183O485J1120
$$ 340213 294811 257683 227978 204710 187127 174733 166893 162670 161456 163639 170124 181244
56959A81244J5467J9967K5248L0289L2441K9444K1237R948j422j0554j6713k0401
$$ 181244 196711 216678 241926 272215 304656 334100 355337 365285 363863 353309 336596 316195
56947C16195k2178k2120k0376j7633j4599j1500q478n861l687j496J024L786P043
$$ 316195 294017 271897 251521 233888 219289 207789 199311 193450 189763 188267 189291 193077 200120
56934B00120J1577J7712K4797L1999L8454M2060L9597K9585J4482j125j3997k3160
$$ 200120 211697 229409 254206 286205 324659 366719 406316 435901 450383 449258 435261 412101
56922D12101k8542l0418k9910k8478k6685k4398k1887j9624j7315j4341j1148
$$ 412101 383559 353141 323231 294753 268068 243670 221783 202159 184844 170503 159355
56911A59355q991q244q010p407o304m778k868j080k02m02j067j533j441n26J142
$$ 159355 150364 142120 134110 126703 120399 115621 112753 111673 111471 111069 110002 108469 107028 106502 107644
56896A07644K844L921M670N800P311Q800J0562J3353J7169K1360K5775L0412L3866
$$ 107644 110488 114409 119079 124879 132190 140990 151552 164905 182074 203434 229209 259621 293487
56883B93487L3492K7851J8214P288k668j0337j5087j7099j7242j6253j4333j1657
$$ 293487 326979 354830 373044 380332 377664 367327 352240 335141 317899 301646 287313 275656
56871B75656q699n712k428J445N834J0679J6197K2562K9695L7727M7224N8479
$$ 275656 266957 261245 258817 260262 266096 276775 292972 315534 345229 382956 430180 488659
56859D88659P0260P9116Q0162O9566M7538J9131q403k9546m2412m8053m8850m7093
$$ 488659 558919 638035 718197 787763 835301 854432 846029 816483 774071 726018 677168 630075
56847F30075m3867l8931l2024k3913j5651p267J794J1385K0960L1044M3214N8447
$$ 630075 586208 547277 515253 491340 475689 468422 470216 481601 502561 533605 576819 635266
56835F35266P6460R6434J16554J31988J34886J18603Q2927L5371j2621n1406p6912
$$ 635266 711726 808160 924714 1056702 1191588 1310191 1393118 1428489 1415868 1364462 1287550
56824A287550r0487r5747r5420r0651q2279p1692o0406m9440l9129k9107j8568
$$ 1287550 1197063 1101316 1005896 915245 832966 761274 700868 651428 612299 583192 564624
56813E64624p127M620J5977K7495M0810N6909P4608R0019R7033Q9558O5617L0076
$$ 564624 557497 562117 578094 605589 646399 703308 777916 867935 964968 1054526 1120143 1150219
56801A150219p571l8939o0530p2960p8297p8539p5208o9189o1121n2104m3473
$$ 1150219 1142648 1103709 1043179 970219 891922 813383 738175 668986 607865 555761 512288
56790E12288l5680k8148k0408j2738n394J940R704J8103K7346L7262M6131N0639
$$ 512288 476608 448460 428052 415314 409920 411860 421564 439667 467013 504275 550406 601045
56778F01045M7740L6550J8713k168k1482l5358m2712m5351m5729m4926m2871l9547
$$ 601045 648785 685335 704048 701880 680398 645040 602328 556977 511248 466322 423451 383904
56766C83904l5350l0737k6193k2292j9316j7017j4939j2768j0370p947o146n458
$$ 383904 348554 317817 291624 269332 250016 232999 218060 205292 194922 186975 180829 175371
56754A75371n466n264m652m168l917l323k297j775k519l996m967m740l531k107
$$ 175371 169905 164641 159989 155821 151904 148581 146284 144509 141990 137994 133027 128287 124756 122649
56740A22649j287j320j607j435r87j004j525j897k022k453l054k808j442j90k03
$$ 122649 121362 120042 118435 117000 116013 115009 113484 111587 109565 107112 104058 101250 99808 99618 99415
56725I9415j079j675j591j170p67o80j191k000k201j422m68k35n78p69m98Q9P69
$$ 99415 98336 96661 95070 93900 93133 92453 91262 89262 87061 85639 85171 84936 84358 83589 83091 83180 83949
56708H3949J191J049O78Q08J311J212L40n9Q16J946J929R51K31K58P05J414K285
$$ 83949 85140 86189 86867 87675 88986 90198 90538 90479 91295 93241 95170 96121 96352 96610 97315 98729 101014
56691A01014K625J829M76l23l74k82k88k19l10r04j545j395n40J26K37K67N69
$$ 101014 103639 105468 105944 105621 105247 104965 104677 104458 104148 103244 101699 100304 99764 99890 100127 100394 100963
56674A00963J005J527K163K364J380n17k034k370k002j736j700j595j325j006
$$ 100963 101968 103495 105658 108022 109402 108885 106851 104481 102479 100743 99043 97448 96123 95117
56660I5117p14m96l91k90l4L49P17J072J393J353O60m07j189j430j429j474j502
$$ 95117 94403 93907 93516 93226 93192 93541 94258 95330 96723 98076 98736 98329 97140 95710 94281 92807 91305
56643I1305j348r42l68J05Q5m96j169j522j802k503l537m320m593m685m923n241
$$ 91305 89957 89015 88647 88752 88837 88341 87172 85650 83848 81345 77808 73488 68895 64210 59287 54046
56627E4046n422n388n179m846m443l986l482l097l017l026k579j531m78M5L71
$$ 54046 48624 43236 38057 33211 28768 24782 21300 18203 15186 12160 9581 8050 7572 7617 7988
56612G988J278K897M523N464N682N638N753O046O200O000N640N398N032M041K524
$$ 7988 9266 12163 16686 22150 27832 33470 39223 45269 51469 57469 63109 68507 73539 77580 80104
56597H0104J303R67J219J413J274Q81M29K68O65J262J268M48n94j291j591j393
$$ 80104 81407 82374 83593 85006 86280 87161 87590 87858 88523 89785 91053 91501 90907 89616 88025 86632
56581H6632l77J151K094J847J099Q01J027J387J790K199K348K319K670L357L480
$$ 86632 86255 87406 89500 91347 92446 93247 94274 95661 97451 99650 101998 104317 106987 110344 113824
56566A13824K739K247K893L968M461M784N789O889O789N591M644M564M786M901
$$ 113824 116563 118810 121703 125671 130132 134916 140705 147594 154383 159974 164618 169182 173968 178869
56552A78869M952M581L309J721J022J270J310N13n69j420k253l150l689l737l708
$$ 178869 183821 188402 191711 193432 194454 195724 197034 197547 196978 195558 193305 190155 186466 182729 179021
56537A79021l754l591l262l225l485l558l351l227l111k509j531r14r08j073j252
$$ 179021 175267 171676 168414 165189 161704 158146 154795 151568 148457 145948 144417 143503 142595 141522 140270
56522A40270j716k272k344k059k156k603k527j862j659k272k525j484M7P63O92
$$ 140270 138554 136282 133938 131879 129723 127120 124593 122731 121072 118800 116275 114791 114838 115601 116293
56507A16293Q34J567K337K605K383K021J923K235K546K356J859J725J945J665
$$ 116293 117127 118694 121031 123636 126019 128040 129963 132198 134744 137100 138959 140684 142629 144294
56493A44294N35o70j158j095r76o84P6J021J541J403P88K6l72K6R36J480J360
$$ 144294 144829 144159 143001 141906 140930 140246 140322 141343 142884 144287 145075 145101 144729 144755 145691 147171 148531
56476A48531J236J566J728J018k9j81Q80K230K886K723K263J968J912J869J641
$$ 148531 149767 151333 153061 154079 154050 153869 154749 156979 159865 162588 164851 166819 168731 170600 172241
56461A72241J374J363J619J774J608J351J346J565J584R96j33j149j275m21O75
$$ 172241 173615 174978 176597 178371 179979 181330 182676 184241 185825 186821 186688 185539 184264 183843 184518
56446A84518J293J415J239O11n07j424j406p32k59j39J63O69O67k61j787l460
$$ 184518 185811 187226 188465 189076 188569 187145 185739 185007 184748 184609 184772 185441 186108 185847 184060 180600
56430A80600m981n915n989n698n774o060n878n417n540o154o105n059m159m257
$$ 180600 175619 169704 163715 158017 152243 146183 140305 134888 129348 123194 117089 112030 107871 103614
56416A03614m757m922n151n992o824o525m795j946J982O830J1514J4564J5384
$$ 103614 98857 93935 88784 82792 75968 69443 64648 62702 64684 71514 83028 97592 112976
56403A12976J4493J2735J0804R227Q141P185N948M472L114K150J625J295P21k14
$$ 112976 127469 140204 151008 160235 168376 175561 181509 185981 189095 191245 192870 194165 194886 194672
56389A94672q42l96Q79J888K058J801J555J194O38J97J9j08j02M29J286J697J535
$$ 194672 193830 193434 194313 196201 198259 200060 201615 202809 203447 203644 203663 203555 203453 203882 205168 206865 208400
56372B08400J634K440L297L572L529L464K969J779N83Q5m1m55r89j007m65J28
$$ 208400 210034 212474 215771 219343 222872 226336 229305 231084 231667 231752 231711 231256 230267 229260 228795 228923
56356B28923M73N28K45j94k06N99J933L246M132M204L260J964J561K382L379L624
$$ 228923 229396 229924 230169 229975 229769 230368 232301 235547 239679 243883 247143 249107 250668 253050 256429 260053
56340B60053L496L708M056L960L588L547L868M115M208M404M786N259N778O147
$$ 260053 263549 267257 271313 275273 278861 282408 286276 290391 294599 299003 303789 309048 314826 320973
56326C20973O014N496N354O120P437Q593R179R015Q074O871O135N758M847L206
$$ 320973 326987 332483 337837 343957 351394 359987 369166 378181 386255 393126 399261 405019 409866 413072
56312D13072J841J504J582J112N3j123k223l059l187k612k031j758j256l67N6
$$ 413072 414913 416417 417999 419111 419164 418041 415818 412759 409572 406960 404929 403171 401915 401548 401604
56297D01604m27q20j55R96J612J996L143M918O224O636O714O948P389Q162R408
$$ 401604 401177 400357 400202 401198 402810 404806 407949 412867 419091 425727 432441 439389 446778 454940 464348
56282D64348J0851J2178J3552J5206J6846J8159J9407K0920K2442K3748K5400
$$ 464348 475199 487377 500929 516135 532981 551140 570547 591467 613909 637657 663057
56271F63057K8121L1819L5825L9725M3443M7158N1569N7564O5077P3055Q1019
$$ 663057 691178 722997 758822 798547 841990 889148 940717 998281 1063358 1136413 1217432
56260A217432Q9688R9469J09582J19565J30265J42094J53446J62361J68885J74121
$$ 1217432 1307120 1406589 1516171 1635736 1766001 1908095 2061541 2223902 2392787 2566908
56250B566908J77684J77795J73539J65386J53645J37944J18339R5824P1661M7107
$$ 2566908 2744592 2922387 3095926 3261312 3414957 3552901 3671240 3767064 3838725 3885832
56240C885832K3693K832j4951k9788m1770n1082n8328o3939o7660o9312o9633
$$ 3885832 3909525 3912357 3897406 3867618 3825848 3774766 3716438 3652499 3584839 3515527 3445894
56229C445894o9756p0441p2311p5941q0989q6113r0632r5309j00642j05541j08844
$$ 3445894 3376138 3305697 3233386 3157445 3076456 2990343 2899711 2804402 2703760 2598219 2489375
56218B489375j11041j13134j14655j14360j12134j08816j04784j00023r4996r0044
$$ 2489375 2378334 2265200 2150545 2036185 1924051 1815235 1710451 1610428 1515432 1425388
56208A425388q4597p8156p1364o4981n8698n2312m6897m3233m0037l5641l0548
$$ 1425388 1340791 1262635 1191271 1126290 1067592 1015280 968383 925150 885113 849472 818924
56197H18924k6507k3784k1345j9109j7857j7231j5947j3842j1932j0454q667o490
$$ 818924 792417 768633 747288 728179 710322 693091 677144 663302 651370 640916 632249 625759
56185F25759m694l462k228q72L21J583L231M683N311N773O963Q317Q753Q713R380
$$ 625759 621065 617603 615375 614503 614824 616407 619638 624321 629632 635405 642368 650685 659438 668151 677531
56170F77531J0436J0524R520Q449P498O008M145K769J924J218J116K055K910K416
$$ 677531 687967 698491 708011 716460 723958 729966 734111 736880 738804 740022 741138 743193 746103 748519
56156G48519J538K184M107N423N771O473P885R209J0731J3634J7547K0841K3528
$$ 748519 750057 752241 756348 761771 767542 774015 781900 791109 801840 815474 833021 853862 877390
56143H77390K7341L2844L8952M5499N3662O3479P3584Q3921R6236J11224J27307
$$ 877390 904731 937575 976527 1022026 1075688 1139167 1212751 1296672 1392908 1504132 1631439
56132A631439J42504J55132J62418J61272J51581J36757J20562J05345R3292Q6268
$$ 1631439 1773943 1929075 2091493 2252765 2404346 2541103 2661665 2767010 2860302 2946570
56122B946570Q3180P9785P2213N9292M1564K0683L36j5076k4126k9236l3658l9725
$$ 2946570 3029750 3109535 3181748 3241040 3282604 3303287 3303623 3288547 3264421 3235185 3201527 3161802
56110C161802m9915o6320q7695j09296j26798j38731j44915j45142j40271j32200
$$ 3161802 3111887 3045567 2957872 2848576 2721778 2583047 2438132 2292990 2152719 2020519
56100B020519j21876j09296r5822q4047p4784o6679n9217n3457m9208m4461l8523
$$ 2020519 1898643 1789347 1693525 1609478 1534694 1468015 1408798 1355341 1306133 1261672 1223149
56089A223149l3018k8932k5314k1735j9211j7714j5536j2139r016o848m589k133
$$ 1223149 1190131 1161199 1135885 1114150 1094939 1077225 1061689 1049550 1040534 1033686 1029097 1026964
56077A026964r36j085p05P82J859K158L269N420O796P183Q673J1564J3249J2746
$$ 1026964 1026028 1024943 1024238 1025020 1026879 1029037 1032306 1037726 1044522 1051705 1060378 1071942 1085191 1097937
56063A097937J2446J3700J4479J3444J2516J3190J3882J3345J3259J4937J6625
$$ 1097937 1110383 1124083 1138562 1152006 1164522 1177712 1191594 1204939 1218198 1233135 1249760
56052A249760J6655J6192J6565J6941J6843J7815K0230K1664K0815J9884K0842
$$ 1249760 1266415 1282607 1299172 1316113 1332956 1350771 1371001 1392665 1413480 1433364 1454206
56041A454206K2573K3917K6057K9445L1889L2222L2449L3836L4452L3188L2423
$$ 1454206 1476779 1500696 1526753 1556198 1588087 1620309 1652758 1686594 1721046 1754234 1786657
56030A786657L3943L5933L6820L8230M1244M3618M3855M4159M6296M8405M9040
$$ 1786657 1820600 1856533 1893353 1931583 1972827 2016445 2060300 2104459 2150755 2199160 2248200
56019B248200N0181N2991N4881N4291N4076N6435N8872N9004N9091O1847O5986
$$ 2248200 2298381 2351372 2406253 2460544 2514620 2571055 2629927 2688931 2748022 2809869 2875855
56008B875855O9745P4406Q0522Q5400Q8194R2542J00107J06960J10601J14822
$$ 2875855 2945600 3020006 3100528 3185928 3274122 3366664 3466771 3573731 3684332 3799154
55998C799154J22730J30980J36247J41430J49676J58325J64755J72195J83411
$$ 3799154 3921884 4052864 4189111 4330541 4480217 4638542 4803297 4975492 5158903
55989E158903J94832K03428K13058K27296K42610K55739K70832K91834L15011
$$ 5158903 5353735 5557163 5770221 5997517 6240127 6495866 6766698 7058532 7373543
55980G373543L36856L61724L93415M27461M60589M98968N47655O01549O57188
$$ 7373543 7710399 8072123 8465538 8892999 9353588 9852556 10400211 11001760 11658948
55971A1658948P23159Q07272R04476J010213J134222J287771J470453J685018
$$ 11658948 12382107 13189379 14093855 15104068 16238290 17526061 18996514 20681532
55963B0681532J950924K285727K688009L156710L709152M360387N110234N980186
$$ 20681532 22632456 24918183 27606192 30762902 34472054 38832441 43942675 49922861
55955D9922861P039038Q361944R999226J2029928J4609853J7922028K2144915
$$ 49922861 56961899 65323843 75323069 87352997 101962850 119884878 142029793
55948A42029793K7511760L4145292M1354954M6909635M7453421M0426653K6124794
$$ 142029793 169541553 203686845 245041799 291951434 339404855 379831508 405956302
55941D05956302P970808r384977k2536021l0484712l4094540l4825784l3841168
$$ 405956302 413927110 404542133 382006112 351521400 317426860 282601076 248759908
55934B48759908l1796059k9030594k5807019k2412783j9125955j6141971j3552099
$$ 248759908 216963849 187933255 162126236 139713453 120587498 104445527 90893428
55927I0893428j1373902r581649q120940o927673n948927n144915m478774l917557
$$ 90893428 79519526 69937877 61816937 54889264 48940337 43795422 39316648 35399091
55919C5399091l440342l034229k684330k376368k104965j869517j664597j482706
$$ 35399091 31958749 28924520 26240190 23863822 21758857 19889340 18224743 16742037
55911A6742037j322548j185658j067856r62266q67701p86116p14764o48707n88336
$$ 16742037 15419489 14233831 13165975 12203709 11336008 10549892 9835128 9186421 8598085
55902H598085n36784m92306m50447m11420l78329l50102l22985k97138k75301
$$ 8598085 8061301 7568995 7118548 6707128 6328799 5978697 5655712 5358574 5083273
55893E083273k56565k37614k18659k02323j88152j73705j59557j47932j37829
$$ 5083273 4826708 4589094 4370435 4168112 3979960 3806255 3646698 3498766 3360937
55884C360937j26741j15781j08012j03020r7942r2526q8500q5327q1314p7562
$$ 3360937 3234196 3118415 3010403 2907383 2809441 2716915 2628415 2543088 2461774 2384212
55874B384212p6156p5671p2978o8352o4332o0762n5592m9609m5720m4143m2611
$$ 2384212 2308056 2232385 2159407 2091055 2026723 1965961 1910369 1860760 1815040 1770897 1728286
55863A728286m0795m0228m0310l8613l5084l2080l0229k7805k4135k0234j5979
$$ 1728286 1687491 1647263 1606953 1568340 1533256 1501176 1470947 1443142 1419007 1398773 1382794
55852A382794j0016k692L546O871O864L129m262j3149k0464k4974k7201k7587
$$ 1382794 1372778 1370086 1373632 1380503 1387367 1390496 1386234 1373085 1352621 1327647 1300446 1272859
55840A272859k6701k6033k6354k6367k5098k4162k5214k6832k6761k5713k5806
$$ 1272859 1246158 1220125 1193771 1167404 1142306 1118144 1092930 1066098 1039337 1013624 987818
55829I87818k6529k5641k3111k0793j8929j6383j3781j3057j4001j4401j3620
$$ 987818 961289 935648 912537 891744 872815 856432 842651 829594 815593 801192 787572
55818G87572j3096j3307j3077j1986j0901r918q233o206n197n199m661k816l71
$$ 787572 774476 761169 748092 736106 725205 715287 707054 700848 695651 690452 685791 682975 682604
55805F82604K008L968M644L486J643O43J39j223l294m877o087p998j0355j1921
$$ 682604 684612 688580 693224 696710 698353 698996 699135 697912 694618 689741 683654 675656 665301 653380
55791F53380j2659j3468j4085j3569j2503j2434j3220j3130j1522r428p633o087
$$ 653380 640721 627253 613168 599599 587096 574662 561442 548312 536790 527362 519729 513642
55779E13642m952m305l141p58J241M46l124p253j0571j3154j4596j4127j2621
$$ 513642 508690 504385 501244 500486 501727 502173 499049 491796 481225 468071 453475 439348 426727
55766D26727j1986j2250j1474q840n806l938l487m315o288q484r808j0632j2154
$$ 426727 414741 402491 391017 382177 376371 372433 368946 364631 358343 349859 340051 329419 317265
55753C17265j4148j5091j4474j3164j1422q648n160k345p67J98P25L54n09p55
$$ 317265 303117 288026 273552 260388 248966 240318 235158 232813 232046 232244 232969 233323 232814 232059
55739B32059l99m90j080j098l49J76K45P59J960K959L362L604L450J965o96l082
$$ 232059 231660 231170 230090 228992 228643 228819 229064 229823 231783 234742 238104 241708 245158 247123 246427 243345
55723B43345m370m976n106m396l219k630k688k392j541j015r95p07j18j15n84
$$ 243345 238975 233999 228893 224497 221278 218648 215960 213568 212027 211012 210017 209310 209192 209077 208493
55708B08493j33J703L675M811N583O524P174P100O566N702M233K537J638J749
$$ 208493 208360 210063 213738 218549 224132 230656 237830 244930 251496 257198 261431 263968 265606 267355
55694B67355J939J589J013N03L3m9N62J017J37j619k620k523k454k634j834L13
$$ 267355 269294 270883 271896 272399 272432 272383 272945 273962 274099 272480 269860 267337 264883 262249 260415 260728
55678B60728K427L447L854M136L821K782J904J660J386P15K71L04R9o21j123j129
$$ 260728 263155 266602 270456 274592 278413 281195 283099 284759 286145 286860 287131 287435 287534 286913 285790 284661
55662B84661j364j944j820o28M27M29J24L96Q04O29K52L74P69P88K00j079l238
$$ 284661 283297 281353 279533 278905 279332 279761 279885 280281 281085 281714 281966 282340 283109 283897 284097 283018 279780
55645B79780n785p562q128q264q593q742q359p898p777p794p823q069q148p157
$$ 279780 273995 266433 258305 250041 241448 232706 224347 216449 208672 200878 193055 184986 176838 169681
55631A69681n157l437k802k789k972l623m535m615l453k122j638j828k249k899
$$ 169681 164524 161087 158285 155496 152524 148901 144366 139751 136298 134176 132538 130710 128461 125562
55617A25562l385k786j221k19o33j484j705j670k049k463k361k128k169k001j217
$$ 125562 122177 119391 118170 117951 117318 115834 114129 112459 110410 107947 105586 103458 101289 99288 98071
55602I8071m47l23m88m77o09j117j402j076o95o13j98Q53J533R54k21q62r35r37
$$ 98071 97624 97301 96813 96336 95727 94610 93208 92132 91437 90824 90626 91479 93012 93966 93745 92883 91948 91011
55584I1011p41j09M40L80O7K7J00Q3L36R11J008K04o71p11r7O89J667K596K605
$$ 91011 90270 90161 90601 90981 91048 91075 91175 91258 91594 92505 93513 93717 93046 92335 92238 92927 94594 97190 99795
55565I9795J652J120J873K876K866K197J748J278K77o36p11n25r37j506j433j230
$$ 99795 101447 102567 104440 107316 110182 112379 114127 115405 115682 115046 114335 113810 112873 111367 109934 108704
55549A08704j813k756l013k708k555k298j340k89j14l28K02J128J225P97J429
$$ 108704 106891 104135 101122 98414 95859 93561 92221 91932 91818 91490 91692 92820 94045 94842 96271
55534I6271L340M891M972M234L617L161K683K377K200J724R08K10k64q21j409
$$ 96271 99611 104502 109474 113708 117325 120486 123169 125546 127746 129470 130378 130588 130324 129503 128094
55519A28094j700j924k630l600l972l533k967k791k886l142l667m261m497m368
$$ 128094 126394 124470 121840 118240 114268 110735 107768 104977 102091 98949 95282 91021 86524 82156
55505H2156m213l996l356k262j061m4M42m6j256j898j068M71J403J672K074K492
$$ 82156 77943 73947 70591 68329 67268 67224 67666 67620 66364 64466 63398 63869 65272 66944 69018 71510
55489G1510K156J432J765L594N703O939P508Q073Q498P950N741J953k198m889
$$ 71510 73666 75098 76863 80457 86160 93099 100607 108680 117178 125128 130869 132822 130624 125735
55475A25735n397n069n727p327q238p652o407n439m715m005l512l269k884k264
$$ 125735 120338 115269 109542 102215 93977 86325 79918 74479 69764 65759 62247 58978 56094 53830
55461E3830j834j710j420p53r5K31K84M0n98j223j161m50J19J45j0p5k45n11m64
$$ 53830 51996 50286 48866 48113 48018 48249 48533 48573 47975 46752 45591 45141 45260 45405 45395 45320 45075 44564 44100
55442D4100l9K57J08k16m30n40m99k79k68q29j464j293m32P6j27k27L78J197J579
$$ 44100 44061 44318 44426 44210 43780 43240 42741 42462 42194 41365 39901 38608 38176 38252 38125 37898 38276 39473 41052
55423D1052J641J735J772J586J315J038N51j08n71q29j305j953j990r94M44J541
$$ 41052 42693 44428 46200 47786 49101 50139 50690 50582 50011 49182 47877 45924 43934 42940 43384 44925
55407D4925K125K240J720P37N2J68O49Q28O74M84K35j59l55p2K41j84j380k481
$$ 44925 47050 49290 51010 51747 51799 51967 52616 53444 54118 54602 54837 54678 54323 54251 54492 54308 52928 50447
55389E0447k576j502P7J108R24j36j005r57l24j4m23r58o72N64J610J106q12k356
$$ 50447 47871 46369 46446 47554 48478 48342 47337 46380 46056 46042 45619 44661 43989 44553 46163 47269 46457 44101
55371D4101k075n25O67Q79P33N67mr03j239o53pj41p14r80j008j328j816j779
$$ 44101 42026 41501 42168 43047 43780 44347 44343 43440 42201 41548 41541 41400 40686 39706 38698 37370 35554 33775
55353C3775r87l2M36M12L88P28J188J153M38l07m04j18k61q54r88k41N27L33n27
$$ 33775 32788 32756 33192 33604 33992 34720 35908 37061 37499 37192 36788 36670 36409 35555 34567 34326 34853 35186 34659
55334C4659q85k17P88J173P23Kl93l72k31j18N1J98J7m37n74j20L28K31J36Q92
$$ 34659 33774 33557 34345 35518 36241 36243 35850 35478 35247 35129 35180 35378 35395 34958 34384 34264 34592 34823 34959 35851
55314C5851K059K196Q13r53j831j753j355j001p82p65p93m65K13O55M62j7j82
$$ 35851 37910 40106 40919 39966 38135 36382 35027 34026 33244 32479 31686 31221 31434 32089 32551 32534 32352
55297C2352J28P02J285J586J410R44N43K30k08o97j030j409k042k332j530k54
$$ 32352 32480 33182 34467 36053 37463 38407 38950 39180 38972 38275 37245 35836 33794 31462 29932 29678
55281B9678k9r66j333j38J224J043j23m52L77J021Q05M83N64M24l66j097j021
$$ 29678 29649 28683 27350 27212 28436 29479 29356 28904 29281 30302 31107 31590 32154 32578 32212 31115 30094
55264C0094n95o84j109r12R3R84J049P76J024J695J872J163K67KL23O43P27P51
$$ 30094 29499 28815 27706 26794 26887 27871 28920 29696 30720 32415 34287 35450 35717 35719 36042 36685 37412 38163
55246C8163P78O96N26K98j43p10p51J66J267J275R7r50q58k2N31L79k35r12j274
$$ 38163 38941 39637 40163 40461 40318 39608 38857 39023 40290 41565 41662 40712 39854 39832 40363 40742 40507 39595 38321
55227C8321j142q44q84j135r22j34M89M76L15O04J127J316J067N97Kn08n00N6
$$ 38321 37179 36335 35451 34316 33394 33260 33749 34225 34540 35144 36271 37587 38654 39251 39253 38745 38245 38301
55209C8301N06L79O5J32M57O19O62P96P91L85p7p0K40L10J07L0J36J12l6L7L48
$$ 38301 38807 39186 39251 39383 39840 40459 41121 41917 42708 43093 43016 42946 43186 43496 43603 43633 43769 43881 43845 43882 44230
55188D4230N06L71K49K80J82k77q21r62n74k8J79q3m62n59l57p3K69P35J029P15
$$ 44230 44736 45107 45356 45636 45818 45541 44720 43758 43184 43156 43335 43252 42790 42231 41874 41801 42070 42805 43834 44549
55168D4549p5p13r71j174j354r68O0Q52O73p4n54o68q11r46p07j32M30Q98J316
$$ 44549 44474 43761 42790 41616 40262 39294 39354 40206 40879 40805 40251 39583 38772 37826 37119 36987 37417 38315 39631
55149C9631J418R95M62M14P48R14P73N76K95k65p36m91L52Q98O56J13K4O49J874
$$ 39631 41049 42044 42506 42920 43668 44582 45355 45931 46226 45961 45225 44734 45086 45984 46640 46753 46777 47426 49300
55130D9300L478M985N740N546M999M890N345N782N618M892M077L387K459R07j013
$$ 49300 52778 57763 63503 69049 74048 78938 84283 90065 95683 100575 104652 108039 110498 111405 110392
55115A10392k688l910m845n320m915l897l269l464l691l088j859p46m4K21j26
$$ 110392 107704 103794 98949 93629 88714 84817 81548 78084 74393 71305 69446 68700 68656 68877 68751
55100F8751q84j167n67pn12j610k038j561q70j30J012K089K005Q00j20Q9P06Q11
$$ 68751 67867 66700 66133 66126 65614 64004 61966 60405 59535 59405 60417 62506 64511 65311 65191 65280 65986 66797
55082F6797N33M44O01Q51J283J820K011J761J581J670J474O77o7m4N64J167J646
$$ 66797 67330 67774 68375 69226 70509 72329 74340 76101 77682 79352 80826 81503 81436 81392 81956 83123 84769
55065H4769K023J906J097L48N62J489K021J732J315J471K025K316J992J204L94
$$ 84769 86792 88698 89795 90143 90705 92194 94215 95947 97262 98733 100758 103074 105066 106270 106664
55050A06664j4M5J87K1l55m79j04N95J337J967K427K687K772K743K686K700K719
$$ 106664 106650 106695 106882 106903 106548 106069 105965 106560 107897 109864 112291 114978 117750 120493 123179 125879 128598
55033A28598K306R37j204l048l607k976k082j542j246r63q21r86j240j260j074
$$ 128598 130904 131841 130637 127589 123982 121006 118924 117382 116136 115173 114352 113366 112126 110866 109792
55018A09792r60r51q19n52n07q52j140q14o3K52l04j148j441j119q29j009j525
$$ 109792 108832 107881 107062 106510 106003 105151 104011 103197 103134 103386 103082 101934 100493 99374 98545 97536 96011
55001I6011k087k539k717k431j773j092n73j62M8j90p62j116r21n21m06o03q31
$$ 96011 93924 91385 88668 86237 84464 83372 82799 82637 82685 82495 81733 80617 79696 79175 78769 78166 77335
54984G7335r46q78m18M43J081P66l78j309j159j12R28J307J149J035J330J854
$$ 77335 76389 75511 75093 75536 76617 77383 77005 75696 74537 74425 75353 76660 77809 78844 80174 82028
54968H2028K165K207K498L517M996O063O169N620N179N385O356P910R587J0801
$$ 82028 84193 86400 88898 92415 97411 103474 109643 115263 120442 125827 132183 140093 149680 160481
54954A60481J1346J1685J2363J3160J3307J2590J1752J1392J1003R523O627K907
$$ 160481 171827 183512 195875 209035 222342 234932 246684 258076 269079 278602 285229 288136
54942B88136j060n100q885j1742j3389j4305j5008j5314j4791j3565j2248j1209
$$ 288136 287076 281976 273091 261349 247960 233655 218647 203333 188542 174977 162729 151520
54930A51520j0347r522q693p767o625n338m084k902j779r02m33j47L63J095J660
$$ 151520 141173 131651 122958 115191 108566 103228 99144 96242 94463 93561 93128 92981 93344 94439 96099
54915I6099J938K321L207M464N633O477P212Q300R975J1917J3469J4263J4440
$$ 96099 98037 100358 103565 108029 113662 120139 127351 135651 145626 157543 171012 185275 199715
54902A99715J4032J2462R178M609m7m013p381j0313j2494j3627j3948j3737j2821
$$ 199715 213747 226209 235387 239996 239949 235936 228555 218242 205748 192121 178173 164436 151615
54889A51615j1082r172q048p817p613o791n724n115m909m309k868j169j82j88
$$ 151615 140533 131361 123313 115496 107883 101092 95368 90253 85344 81035 78167 76998 76816 76628
54875G6628n38m72P4N54M91r8q54j448j743j759j568j249r12p24p90r67r39n86
$$ 76628 76090 75618 75692 76246 76737 76639 75785 74337 72594 70835 69267 68018 67106 66382 65592 64625 63686 63100
54857F3100j02K92N38O15L65k09p48q83o86n08m89n58p62j174j523j423j003q02
$$ 63100 62998 63290 63828 64443 64808 64599 63851 62968 62282 61774 61285 60727 59965 58791 57268 55845 54842 54040
54839E4040q83o04L34J147Q55l18j120q38p0K91K03K56O60J078J279J384J457
$$ 54040 53157 52553 52887 54034 54889 54571 53451 52613 52543 52834 53037 53293 53953 55031 56310 57694 59151
54822E9151J353J121J029J048P83K36R8P64J578J657J169R94J398J924K489L517
$$ 59151 60504 61625 62654 63702 64485 64721 64819 65583 67161 68818 69987 70981 72379 74303 76792 80309
54806H0309M797N267M500L527L527M368N221O010P365R481J1794J3664J4755J4923
$$ 80309 85106 90373 94873 98400 101927 106295 111516 117526 124891 134372 146166 159830 174585 189508
54792A89508J4309J3413J2512J1092Q459M725P20k912n968q308r835j0677j0899
$$ 189508 203817 217230 229742 240834 249293 254018 254738 251826 245858 237550 227715 217038 206139
54779B06139j0280q973p978q106q662q185o375m376l129k525k246k332k500j987
$$ 206139 195859 186886 178908 170802 162140 153955 147580 143204 140075 137550 135304 132972 130472 128485
54765A28485o41O39J165J437K250L483M504N229O061P145Q366R827J1708J3849
$$ 128485 127844 128483 129648 131085 133335 136818 141322 146551 152612 159757 168123 177950 189658 203507
54751B03507J5995J8151K0203K1404K0864J8429J4636R961M616j034o361j0863
$$ 203507 219502 237653 257856 279260 300124 318553 333189 343150 347766 346732 340371 329508
54739C29508j4275j6355j6995j6629j6118j6051j6214j5868j4515j2391j0212
$$ 329508 315233 298878 281883 265254 249136 233085 216871 201003 186488 174097 163885
54728A63885q412o809n231m198m435n654o515o057m724l567k954k615k439k453
$$ 163885 155473 148664 143433 139235 134800 129146 122631 116574 111850 108283 105329 102714 100275 97822
54714I7822k250j256L17J372J182L03p9M64J138R29j86j220j338p88l34j28K86
$$ 97822 95572 94316 94633 96005 97187 97490 97411 97875 99013 99942 99756 98536 97198 96410 96076 95948 96234
54697I6234R35J240J014R27J399J793J375N69L24N86L85o07j504j382l60P36J186
$$ 96234 97169 98409 99423 100350 101749 103542 104917 105486 105810 106396 106781 106174 104670 103288 102928 103664 104850
54680A04850P30k65q21k01J031J452O46j70J35R72J051M24M66J875L748M907N241
$$ 104850 105580 105315 104494 104293 105324 106776 107422 107252 107387 108359 109410 109834 110300 112175 115923 120830 126071
54663A26071N289N180M711M032L582L459L434L498L849M268M096L099J927J419
$$ 126071 131360 136540 141251 145283 148865 152324 155758 159256 163105 167373 171469 174568 176495 177914
54649A77914J645K032K245K571L461M985O817Q578J0081J1305J2226J2772J2985
$$ 177914 179559 181591 183836 186407 189868 194853 201670 210248 220329 231634 243860 256632 269617
54636B69617J3097J3178J2704J0795P159K515k093o227r974j3245j5631j6879
$$ 269617 282714 295892 308596 319391 326550 329065 326972 320745 310771 297526 281895 265016
54624B65016j7093j6420j4966j3113j1461j0210q957p331n606m330l560k848j988
$$ 265016 247923 231503 216537 203424 191963 181753 172796 165465 159859 155529 151969 149121 147133
54611A47133j361j374j745j647o33Q01J787K014J882J746J430O52l93j247j798
$$ 147133 145772 144398 142653 141006 140373 141174 142961 144975 146857 148603 150033 150685 150292 149045 147247
54596A47247k276k729k885k647k412k677l470m328m724m487l806k955k122j468
$$ 147247 144971 142242 139357 136710 134298 131621 128151 123823 119099 114612 110806 107851 105729 104261
54582A04261j236j489j863j921j766j946k618l226l238k711j924r06J66O77K25
$$ 104261 103025 101536 99673 97752 95986 94040 91422 88196 84958 82247 80323 79417 79583 80260 80485
54567H0485o78j214j224j054p12QQ09J087Q60O77O67M20j06l83k15q1l17o18o93
$$ 80485 79807 78593 77369 76315 75603 75611 76420 77507 78367 79044 79711 80131 80025 79642 79427 79346 79029 78411 77718
54548G7718p70j091j354j069j31J191K516L420L686L567L499L454L103K629K724
$$ 77718 76948 75857 74503 73434 73303 74494 77010 80430 84116 87683 91182 94636 97739 100368 103092
54533A03092L573M474M872N172O131P742R095R171P693N411L484K284R79j217
$$ 103092 106665 111139 116011 121183 127314 135056 144151 153322 161015 166426 169910 172194 173173 171956
54519A71956l795n676o824p987r006q781p189n618n012m714l896k980k686k798
$$ 171956 168161 162485 155661 147674 138668 129887 122698 117080 112068 107354 103458 100478 97792 94994
54505I4994k867l155l784l813k523q83m14j042j414r94n18n31p10p53q05q61o47
$$ 94994 92127 88972 85188 81375 78852 77969 77555 76513 75099 74105 73587 73056 72346 71593 70788 69927 69280
54488F9280j80K90Q15J478J761J174L79O00J837K735K463J702J357J290R21L78
$$ 69280 69100 69390 70205 71683 73444 74618 74997 75597 77434 80169 82632 84334 85691 86981 87902 88280
54472H8280L35J033J978K454K117J209L21j69l64m30k93m4k86j293k202j960q89
$$ 88280 88615 89648 91626 94080 96197 97406 97727 97558 97194 96764 96471 96427 96141 94848 92646 90686 89797
54455H9797m24j181k280k721k510k028j256k25M18R2q46j454j232m78K08L85k3
$$ 89797 89373 88192 85912 83191 80681 78653 77397 77172 77590 77682 76836 75382 74150 73672 73880 74265 74242
54438G4242p09j207j345j274j124q63n58l47j56K59Q10J062Q35M78L29K93J75
$$ 74242 73533 72326 70981 69707 68583 67720 67162 66815 66659 66918 67728 68790 69625 70103 70432 70725 70900
54421G0900P3J59L17K90O2q1J73Q37J469J443O19l11m92R6O74P09N09P12J495
$$ 70900 70973 71132 71449 71739 71801 71720 71893 72730 74199 75642 76261 75950 75458 75554 76228 76937 77446 78158 79653
54402G9653K508L296L642L694L800M106M358M278M072M267N032N939O286N565
$$ 79653 82161 85457 89099 92793 96593 100699 105057 109335 113407 117674 122706 128645 134931 140496
54388A40496L775J682M24L93P01K57q38j595j651j600j866k151k235k479l078
$$ 140496 144271 145953 146377 146770 147471 147728 146890 145295 143644 142044 140178 138027 135792 133313 130235
54373A30235l499l274k800k784l248l637l650l399k961k287j521j022q92q18m39
$$ 130235 126736 123462 120662 117878 114630 110993 107343 103944 100983 98696 97175 96153 95261 94443 94004
54358I4004K17P34O82K6p86j177r13k12N38J091J400J531J530J353J071J023J553
$$ 94004 94221 94955 95637 95663 94877 93700 92787 92575 93113 94204 95604 97135 98665 100018 101089 102112 103665
54341A03665K469L137L313L467L990M490M319L490K555J891J490J227Q48%j205
$$ 103665 106134 109271 112584 116051 120041 124531 128850 132340 134895 136786 138276 139503 140351 140351 139146
54326A39146j991j967j900k710l994m554m178l837m109m447m287l837l470l135
$$ 139146 137155 135188 133288 130578 126584 122030 117852 114015 109906 105459 101172 97335 93865 90730
54312I0730k801k687k707k377j632j044r36j025j136j518k045k064j503j251j809
$$ 90730 87929 85242 82535 80158 78526 77482 76546 75521 74385 72867 70822 68758 67255 66004 64195
54297F4195k331j864q15k55l42l55k0K21J23n4j34k56m08k83K34Q59J219J110
$$ 64195 61864 60000 59185 58930 58588 58233 58213 58434 58557 58503 58369 58113 57705 57422 57656 58515 59734 60844
54279F0844M58n17j195r63R3J200J674J482R94M53q5m10j08Q61J785J807R49N2
$$ 60844 61302 60785 59590 58627 58720 59920 61594 63076 64070 64523 64438 64028 63920 64781 66566 68373 69322 69374
54261F9374l83p14j131j020m7Q12M46n97q23r2K40m13r26l27P56J282J208R46
$$ 69374 68991 68277 67146 66126 66079 66891 67337 66740 65917 65825 66065 65652 64726 64399 65155 66437 67645 68591
54243F8591L77n16r89n52k2m13j290j387n02L71O12N93P01P52N92M45M35K81k50
$$ 68591 68968 68452 67463 66911 66889 66476 65186 63799 63297 63668 64280 64873 65574 66326 66918 67363 67798 68079 67829
54224F7829r71j507j588j160l92L55P89Q50N76O7l08j11N26Q67N53R1L6J46j26
$$ 67829 66858 65351 63763 62603 62211 62566 63355 64205 64781 64848 64540 64429 64955 65822 66375 66466 66502 66648 66522
54205F6522p06j073j092j087j222j316j192q63m60j93j74j53K19P24P48L20K86
$$ 66522 65816 64743 63651 62564 61342 60026 58834 57971 57511 57318 57144 56991 57210 57934 58682 59002 59288
54188E9288J031J738J520P03K36L89P47J048J283J299J020O76L22m02j433j807
$$ 59288 60319 62057 63577 64280 64516 64905 65652 66700 67983 69282 70302 70978 71300 70898 69465 67658
54172F7658r49J55J31q79j543j273o70j99L18Q38Q36K05m18n41l39q6K53P03J084
$$ 67658 66709 66864 66995 66116 64573 63300 62630 62431 62749 63587 64423 64628 64210 63669 63330 63244 63497 64200 65284
54153F5284J280J219O87l15j165j187n51L1L39O96J152J373J293J087O09l67j366
$$ 65284 66564 67783 68470 68155 66990 65803 65252 65283 65622 66318 67470 68843 70136 71223 71832 71465 70099
54136G0099j515p16K29P11Q21P40M49N1k30m60p82r35o69m00o64j142j159r07
$$ 70099 68584 67868 68097 68808 69629 70369 70818 70869 70639 70179 69397 68462 67793 67393 66729 65587 64428 63521
54118F3521j018j231p40J80M12oJ80J210J646O78m89m94J99L33k25p59j042j241
$$ 63521 62503 61272 60532 60712 61124 61118 61298 62508 64154 64832 64343 63849 64048 64381 64156 63397 62355 61114
54100F1114j150o07j59k81m81q5N66P38N65P03J033Q94K69k07l63n88r11r50p56
$$ 61114 59964 59357 59198 58917 58436 58351 58917 59655 60220 60923 61956 62850 63119 62912 62549 61961 61050 60100 59344
54081E9344q63j258j219l51P29J091M35p44j614j539n25P81J717K123K059J437
$$ 59344 58481 57223 56004 55653 56382 57473 57908 57164 55550 54011 53486 54267 55984 58107 60166 61603
54065F1603L66n09n72n6K91K20J37L36O66R37J146J285J342J463J655J490O71
$$ 61603 61969 61460 60888 60832 61123 61343 61480 61816 62482 63419 64565 65850 67192 68655 70310 71800 72471
54048G2471j93p3J105K225K344J706J110Q40P23P97J270J900K063J645J437K277
$$ 72471 72278 72205 73310 75535 77879 79585 80695 81535 82258 83055 84325 86225 88288 89933 91370 93647
54032I3647L920N162N202M534M254M760N535O053O323O427O179N560N041M961
$$ 93647 97567 102729 107931 112465 116719 121479 127014 133067 139390 145817 151996 157556 162597 167558
54018A67558M901M197K904J767J329J469J793K024K019J754J467J458J633J483
$$ 167558 172459 176656 179560 181327 182656 184125 185918 187942 189961 191715 193182 194640 196273 197756
54004A97756O48o09j625k012k009k175k732l259l251k800k535k754l033k871k397
$$ 197756 198404 197795 196170 194158 192149 189974 187242 183983 180732 177932 175397 172643 169610 166739 164342
53989A64342k156k386k840l173l204k964k666k555k547k281j707j354j636k155
$$ 164342 162186 159800 156960 153787 150583 147619 144953 142398 139851 137570 135863 134509 132873 130718
53975A30718k173j619j088r44r29p37m59k77j39j7j42o38j141j057k91O02J003
$$ 130718 128545 126926 125838 124894 123965 123228 122769 122492 122353 122336 122194 121556 120415 119358 119067 119669 120672
53958A20672Q53O25O54P11M36M4K55J377K803L748M125M365M543M312L640L118
$$ 120672 121525 122150 122804 123515 123951 123995 124250 125627 128430 132178 136303 140668 145211 149523 153163 156281
53942A56281L259L892M533N004N457O006O646P337P781P294N432K732M10r10j688
$$ 156281 159540 163432 167965 172969 178426 184432 191078 198415 206196 213490 218922 221654 222064 221154 219466
53927B19466k492l028k788k283k687m128n192m591k694p50P80K251L586M113L739
$$ 219466 216974 213946 211158 208875 206188 202060 196868 192277 189583 188833 189613 191864 195450 199563 203302
53912B03302L336L606M321N078O030P238P963P445O115N206N222N443N084M245
$$ 203302 206638 210244 214565 219643 225673 232911 240874 248319 254434 259640 264862 270305 275389 279634
53898B79634L463K816J911O03o84j393j420j137r85j167j763k821m138n158n503
$$ 279634 283097 285913 287824 288427 287743 286350 284930 283793 282808 281641 279878 277057 272919 267761 262258
53883B62258n437n526n841n977n854n927o403o814o736o418o302o230n710m732
$$ 262258 256821 251295 245454 239477 233623 227696 221293 214479 207743 201325 195023 188793 183083 178351
53869A78351l824l362l271l333l474l619l616l404l129l060l449m239m910m778
$$ 178351 174527 171165 167894 164561 161087 157468 153852 150448 147319 144259 140810 136571 131661 126883
53855A26883l678k189j050n94p74j339j793j628r95p45j353k185k316j680q45
$$ 126883 123205 121016 119966 119372 118598 117259 115466 113838 112843 112098 110745 108560 106244 104564 103719
53840A03719n6O83Q66j19j761k558j726j64P07M95j99p50r00n50K04R14J132Q94
$$ 103719 103663 104346 105212 105093 103332 100774 99048 98884 99591 100086 99887 99137 98237 97687 97891 98805 99937 100831
53822A00831N66L03J5k39k22Q8L32J83k80o66o21m2Q52J616J822J387O10p4k97
$$ 100831 101397 101700 101715 101476 101254 101342 101674 101857 101577 100911 100290 100248 101100 102716 104538 105925 106535 106461 106164
53803A06164K59J713L574M746M459L238K472K870L761M167M101M233M703M973
$$ 106164 106423 108136 111710 116456 120915 124153 126625 129495 133256 137423 141524 145757 150460 155433
53789A55433M791M540M484M329L795L087K459J834J210R14J055J104O17k7j61
$$ 155433 160224 164764 169248 173577 177372 180459 182918 184752 185962 186876 187931 189035 189652 189625 189464
53774A89464J37J83l04r51j437j886k435k947l269l416l379l078k718k738l244
$$ 189464 189601 189784 189480 188529 187092 185206 182771 179824 176555 173139 169760 166682 163964 161226 157982
53759A57982l650l247j961m88L71L77n6l88m91o14r20j270j484j577j563j315
$$ 157982 154332 151085 149124 148636 149007 149384 149328 148940 148449 147835 146915 145645 144161 142584 141021 139706
53743A39706q20l68l12p01j300j794j822j188k51J93j59o34l79N53J362J565J390
$$ 139706 138886 138518 138206 137505 136205 134411 132589 131401 131150 131343 131184 130550 130171 130724 132086 133651 135041
53726A35041J269J355J580J742J628J338J372J961K475K050P00o69j421j756k050
$$ 135041 136310 137665 139245 140987 142615 143953 145325 147286 149761 151811 152511 151842 150421 148665 146615
53711A46615k179j847j136m57j34j87l67l03J93Q52J219J125P08J56k44K7J259
$$ 146615 144436 142589 141453 140996 140862 140675 140308 140005 140198 141050 142269 143394 144102 144258 144014 144041 145300
53694A45300K906L963M023L475K718J754P55L27Q05J757K518K862K911K751K510
$$ 145300 148206 152169 156192 159667 162385 164139 164894 165221 166026 167783 170301 173163 176074 178825 181335
53679A81335K382K346K167J953K245L148L881L668K699J707R75L75J13N70J467
$$ 181335 183717 186063 188230 190183 192428 195576 199457 203125 205824 207531 208506 208881 208994 209564 211031
53664B11031J928J531P24L1n99j344j968k059j634j051o08m65p81j524k210k221
$$ 211031 212959 214490 215214 215245 214646 213302 211334 209275 207641 206590 205982 205517 204736 203212 201002 198781
53648A98781j557r17r40j450j747j512j139j102j261j129o74m43o85p98j07J032
$$ 198781 197224 196307 195367 193917 192170 190658 189519 188417 187156 186027 185353 184910 184225 183427 183320 184352
53632A84352J474P76j59k61L18O57N60P87J617K107J405J92o7Q91J876K029J966
$$ 184352 185826 186602 186443 186182 186500 187157 187717 188504 190121 192228 193633 193825 193758 194649 196525 198554 200520
53615B00520K609L642L939L213K402K364K843L005K549J919J657J889K450L187
$$ 200520 203129 206771 210710 213923 216325 218689 221532 224537 227086 229005 230662 232551 235001 238188
53601B38188L993M683M999M836M337L731L237L140L695M683N318M999M075L462
$$ 238188 242181 246864 251863 256699 261036 264767 268004 271144 274839 279522 284840 289839 293914 297376
53587B97376L534L886M145M326M282L629K550J948K218K518K001J176J122J714
$$ 297376 300910 304796 308941 313267 317549 321178 323728 325676 327894 330412 332413 333589 334711 336425
53573C36425J773R28K52P03J795K304J791R22N39Q73J503J856J791J664J787J956
$$ 336425 338198 339126 339378 340081 341876 344180 345971 346893 347432 348305 349808 351664 353455 355119 356906 358862
53557C58862J809J455J345J586J889K099K343K594K644K537K511K463K069J544
$$ 358862 360671 362126 363471 365057 366946 369045 371388 373982 376626 379163 381674 384137 386206 387750
53543C87750J646K585L517L536K763K094K158K911L927M712M921M605M166L913
$$ 387750 389396 391981 395498 399034 401797 403891 406049 408960 412887 417599 422520 427125 431291 435204
53529D35204L769L543L227K942K838L186M223N667O744O993O857P196Q369R989
$$ 435204 438973 442516 445743 448685 451523 454709 458932 464599 471343 478336 485193 492389 500758 510747
53515E10747J1386J2132J2232J2044J1930J1943J1997J2249J2993J4172J5428
$$ 510747 522133 534265 546497 558541 570471 582414 594411 606660 619653 633825 649253
53504F49253J6588J7760J8847J9579K0156K1233K2972K4575K5249K5149K4926
$$ 649253 665841 683601 702448 722027 742183 763416 786388 810963 836212 861361 886287
53493H86287K4806K4687K4795K5515K6625K7307K7022K5994K4804K3857K3206
$$ 886287 911093 935780 960575 986090 1012715 1040022 1067044 1093038 1117842 1141699 1164905
53482A164905K2629K1862K0950K0343K0403K0924K1408K1634K1671K1492K0917
$$ 1164905 1187534 1209396 1230346 1250689 1271092 1292016 1313424 1335058 1356729 1378221 1399138
53471A399138J9941J8844J7945J7422J7291J7310J7014J6072J4587J2871J1026
$$ 1399138 1419079 1437923 1455868 1473290 1490581 1507891 1524905 1540977 1555564 1568435 1579461
53460A579461R011O994N304M027K856J381o11l045n598p879r790j1626j3603j5438
$$ 1579461 1588472 1595466 1600770 1604797 1607653 1609034 1608423 1605378 1599780 1591901 1582111 1570485 1556882 1541444
53446A541444j6640j7170j7481j7984j8685j9408k0095k0772k1420k1997k2484
$$ 1541444 1524804 1507634 1490153 1472169 1453484 1434076 1413981 1393209 1371789 1349792 1327308
53435A327308k2864k3125k3342k3582k3734k3546k2838k1697k0342j8903j7360
$$ 1327308 1304444 1281319 1257977 1234395 1210661 1187115 1164277 1142580 1122238 1103335 1085975
53424A085975j5737j4248j3095j2116j0861r222p777p133p000o354m633k419o78
$$ 1085975 1070238 1055990 1042895 1030779 1019918 1010696 1002919 995786 988786 982432 977799 975380 974702
53411I74702L30J184K545M525O640Q261R201J0027J1564J3955J6423J8130J9086
$$ 974702 975032 976216 978761 983286 989926 998187 1007388 1017415 1028979 1042934 1059357 1077487 1096573
53398A096573J9961K1266K2929K4551K5817K6775K7910K9781L2379L4968L6827
$$ 1096573 1116534 1137800 1160729 1185280 1211097 1237872 1265782 1295563 1327942 1362910 1399737
53387A399737L8052L9358M1196M3365M5459M7338M8976N0134N0561N0554N1000
$$ 1399737 1437789 1477147 1518343 1561708 1607167 1654505 1703481 1753615 1804176 1854730 1905730
53376A905730N2437N4196N4898N4013N2492N1537N1126N0260M8426M6048M3606
$$ 1905730 1958167 2012363 2067261 2121274 2173766 2225303 2276429 2326689 2375115 2421163 2464769
53365B464769M1066L8246L5082L1340K6801K1950J7700J4079R990M808n44m821
$$ 2464769 2505835 2544081 2579163 2610503 2637304 2659254 2676954 2691033 2701023 2705831 2705287 2700466
53353B700466q131j1589j5668j9849k3634k6976k9776l1929l3979l6910m0877
$$ 2700466 2692335 2680746 2665078 2645229 2621595 2594619 2564843 2532914 2498935 2462025 2421148
53342B421148m4739m7236m8218m8381m8167m7417m5978m4222m2749m1809m1243
$$ 2421148 2376409 2329173 2280955 2232574 2184407 2136990 2091012 2046790 2004041 1962232 1920989
53331A920989m0970m1206m1909m2336m1626l9865l8009l6611l5226l3282l0957
$$ 1920989 1880019 1838813 1796904 1754568 1712942 1673077 1635068 1598457 1563231 1529949 1498992
53320A498992k8806k6962k5187k3305k1190j8700j6166j4444j3992j4234j4438
$$ 1498992 1470186 1443224 1418037 1394732 1373542 1354842 1338676 1324232 1310240 1296006 1281568
53309A281568j4717j5442j6089j5617j3904j1895j0250q733o964n082l337j737
$$ 1281568 1266851 1251409 1235320 1219703 1205799 1193904 1183654 1174921 1167957 1162875 1159538 1157801
53297A157801k97Q38J782K884M159N169N713O233P253Q797J0560J2362J4266J6390
$$ 1157801 1157504 1158342 1160124 1163008 1167167 1172336 1178049 1184282 1191535 1200332 1210892 1223254 1237520 1253910
53283A253910J8632K0490K1379K1476K1903K3519K5783K7398K7888K7729K7138
$$ 1253910 1272542 1293032 1314411 1335887 1357790 1381309 1407092 1434490 1462378 1490107 1517245
53272A517245K5801K3883K2252K1222K0018J8021J5748J3934J2360J0374Q040
$$ 1517245 1543046 1566929 1589181 1610403 1630421 1648442 1664190 1678124 1690484 1700858 1708898
53261A708898N924M114K278N14p43j681l170n598q198r956j0879j1987j4072j6683
$$ 1708898 1714822 1718936 1721214 1721728 1720985 1719304 1716134 1710536 1702338 1692382 1681503 1669516 1655444 1638761
53247A638761j8567j9070j8899j9255k0445k1733k2510k2945k3305k3301k2589
$$ 1638761 1620194 1601124 1582225 1562970 1542525 1520792 1498282 1475337 1452032 1428731 1406142
53236A406142k1565k0983k0974k1040k0906k0846k1012k1021k0415j9239j7926
$$ 1406142 1384577 1363594 1342620 1321580 1300674 1279828 1258816 1237795 1217380 1198141 1180215
53225A180215j6817j5994j5472j5253j5247j5264j5105j4647j3859j2806j1630
$$ 1180215 1163398 1147404 1131932 1116679 1101432 1086168 1071063 1056416 1042557 1029751 1018121
53214A018121j0481r464q742q561r106j0217j1419j2270j2649j2725j2759j3080
$$ 1018121 1007640 998176 989434 980873 971767 961550 950131 937861 925212 912487 899728 886648
53202H86648j3974j5313j6407j6610j6096j5569j5267j4713j3662j2725j2638
$$ 886648 872674 857361 840954 824344 808248 792679 777412 762699 749037 736312 723674
53191G23674j3302j4001j4290j4246j4061j3893j3957j4325j4816j5329j6015
$$ 723674 710372 696371 682081 667835 653774 639881 625924 611599 596783 581454 565439
53180E65439j6728j6728j5578j4048j3296j3312j3078j2198j1445j1400j1458
$$ 565439 548711 531983 516405 502357 489061 475749 462671 450473 439028 427628 416170
53169D16170j0795r631q878q837q851q204o987o019o002o751p354p196o633o346
$$ 416170 405375 395744 386866 378029 369178 360974 353987 347968 341966 335215 327861 320665 314032 307686
53155C07686o344o116n589n274n414n633n588n319m874m172l416l003k837k383
$$ 307686 301342 295226 289637 284363 278949 273316 267728 262409 257535 253363 249947 246944 244107 241724
53141B41724j591j074j079j105r02r91j633k023j358j9J032J570J960K137J764
$$ 241724 240133 239059 237980 236875 235973 234982 233349 231326 229968 229949 230981 232551 234511 236648 238412
53126B38412J174J226K122L127L551L416L052K650K315K021J425J59j542k918
$$ 238412 239586 240812 242934 246061 249612 253028 256080 258730 261045 263066 264491 264650 263108 260190
53112B60190l525l662l887m356m781m808m363l815l693m074m389m118l504l250
$$ 260190 256665 253003 249116 244760 239979 235171 230808 226993 223300 219226 214837 210719 207215 203965
53098B03965l543l852l715l295l059l186l435l415k944k233j747j738k009k219
$$ 203965 200422 196570 192855 189560 186501 183315 179880 176465 173521 171288 169541 167803 165794 163575
53084A63575k276k189j817j130n62o21j209j695j748j641j701j785j541r37l35
$$ 163575 161299 159110 157293 156163 155601 154980 153771 152076 150328 148687 146986 145201 143660 142723 142388
53069A42388j13l32o84p95n97l73l59m52m69m78o25p81p09n00m91p54r66q44m08
$$ 142388 142275 141943 141259 140464 139867 139494 139135 138683 138214 137736 137111 136330 135621 135121 134630 133876 132910 132066 131658
53050A31658J76P45J023P62J02l84k64L02Q02R44Q18O19L68j0m27n98l59O5K22
$$ 131658 131834 132579 133602 134364 134466 134082 133818 134120 134922 135866 136684 137303 137671 137661 137234 136636 136277 136342 136564
53031A36564l3l70m52l70m56p49r15o80j91J10m7m33n09o2M10K61m32q79n73L2
$$ 136564 136531 136161 135709 135339 134883 134134 133219 132539 132348 132458 132411 131978 131469 131407 131817 132078 131646 130767 130194 130226
53011A30226J71k62p42q03m27J40N68N96L53L13O95J002O52j37n11k7R15J656
$$ 130226 130397 130135 129393 128590 128163 128303 128871 129467 129820 130133 130828 131830 132482 132345 131834 131807 132722 134378
52993A34378J870J554Q97L06J59L66M76L41L87J024K061K916L265L298L427L809
$$ 134378 136248 137802 138699 139005 139164 139530 140006 140347 140734 141758 143819 146735 150000 153298 156725 160534
52977A60534M180M168L848L831M524N465N708M828L209J441j47j324j869j877
$$ 160534 164714 168882 172730 176561 181085 186550 192258 197086 200295 201736 201589 200265 198396 196519
52963A96519j788j895k073k176k363k701k779k165j085k55n8k50m96q28j401j985
$$ 196519 194731 192836 190763 188587 186224 183523 180744 178579 177494 177239 177181 176931 176435 175607 174206 172221
52947A72221k107j659j194j299j821j959j277l04R3j91m43j07N64R80R28O45L79
$$ 172221 170114 168455 167261 165962 164141 162182 160905 160601 160694 160503 160060 159953 160517 161497 162425 163070 163449
52930A63449K50L16N07N24J06n38q16l35P14J749K247J989J170L40K5K27L59m3
$$ 163449 163699 164015 164522 165046 165152 164614 163798 163463 164177 165926 168173 170162 171332 171672 171697 171924 172283 172240
52912A72240p10r35m99Q4K87J90K04M41P15R29J129J223J005N27J05p0j00r7J9
$$ 172240 171530 170595 170096 170180 170467 170657 170861 171302 172017 172946 174075 175298 176303 176830 176935 176865 176765 176668 176687
52893A76687L23P24J043J140R30M93J08k3%K5K22Q47J660K113K091J951J801J315
$$ 176687 177010 177734 178777 179917 180847 181340 181448 181425 181425 181450 181672 182519 184179 186292 188383 190334 192135 193450
52875A93450M64j74j90J32L57M93O56O80N22N85J091J606J716J763K252K942L180
$$ 193450 193914 193740 193550 193682 194039 194532 195188 195868 196390 196975 198066 199672 201388 203151 205403 208345 211525
52858B11525K887K480K149J936K234L309M516M903M477M020L636K680J163J01
$$ 211525 214412 216892 219041 220977 223211 226520 231036 235939 240416 244436 248072 250752 251915 252016
52844B52016pL1n20j139j042n87o88j327j734j743j954k567l057l205l538m342
$$ 252016 252009 252040 251520 250381 249339 248752 248064 246737 245003 243260 241306 238739 235682 232477 228939 224597
52828B24597m914m465l291k405k167k002j464r31r04j183j243j179j535k277k610
$$ 224597 219683 215218 211927 209522 207355 205353 203889 202958 202054 200871 199628 198449 196914 194637 192027
52813A92027k111j457j566k385l062l064k629k159j765j431j195r60n40%K90J00
$$ 192027 189916 188459 186893 184508 181446 178382 175753 173594 171829 170398 169203 168243 167703 167703 167993 168093
52797A68093l33o41p92j105j764k445k527j767o35K07O32Q98Q99K16r65j781j884
$$ 168093 167760 167119 166327 165222 163458 161013 158486 156719 156084 156291 156923 157821 158720 158936 157971 156190 154306
52780A54306j933k372k452j398J18P24J92n81j119j668k057j641n53J90J77Rn2
$$ 154306 152373 150001 147549 146151 146269 146993 147185 146604 145485 143817 141760 140119 139566 139756 139933 139942 139890
52763A39890o01j686k202j615j102j883l283l710k899k011j824k074k344k505
$$ 139890 139289 137603 135401 133786 132684 130801 127518 123808 120909 118898 117074 115000 112656 110151
52749A10151k305j540o87n35j063j449j241q03n61m79m58n44o57n86m28m68n86
$$ 110151 107846 106306 105619 105084 104021 102572 101331 100528 99967 99488 99030 98486 97829 97243 96815 96347 95761
52732I5761l83oq0o75j048p42k90l59p27o48J03J073J770J968J576P05j16k71
$$ 95761 95378 95372 95292 94617 93569 92827 92537 92178 91451 90803 90906 91979 93749 95717 97293 97998 97882 97611
52714I7611K94J006J329J276J198J310J577J967K458K840K719J972J060O06O54
$$ 97611 97905 98911 100240 101516 102714 104024 105601 107568 110026 112866 115585 117557 118617 119223 119877
52699A19877O42K25k75m12k94l55o78j009j321j822k407k600k183j553j178j088
$$ 119877 120519 120744 120469 120057 119763 119408 118730 117721 116400 114578 112171 109571 107388 105835 104657 103569
52683A03569j060j022j017r73q46p99r95j330j606j889k344k750k572j684p67
$$ 103569 102509 101487 100470 99497 98651 97852 96857 95527 93921 92032 89688 86938 84366 82682 81915
52668H1915o68j464k347k474j764q14k09PJ97O55J236J467J030K06l29j60M65
$$ 81915 81247 79783 77436 74962 73198 72384 72175 72182 72379 73034 74270 75737 76767 76973 76644 76484 76949
52651G6949R53Q72K16o64j136o77M65J228Q42j84p09m34j33l22n50k89J70L23
$$ 76949 77902 78774 78990 78326 77190 76513 76978 78206 79048 78864 78155 77721 77588 77266 76716 76427 76597 76920
52633G6920L91R32J816K285J959J199N21R3j75m74j040j792k137j600o27k46p72
$$ 76920 77311 78243 80059 82344 84303 85502 86023 86116 85941 85467 84427 82635 80498 78898 78271 78025 77253
52616G7253j443j429p49M4O16R73J144J115R50O55J84l17m70r9N07R66J203J312
$$ 77253 75810 74381 73632 73676 74292 75265 76409 77524 78474 79129 79313 78996 78526 78427 78934 79900 81103 82415
52598H2415J177O87J05j18Q3L44L96L26K71J87P3J70O13J124J300J164J083J106
$$ 82415 83592 84279 84384 84266 84349 84693 85089 85415 85686 85873 85946 86116 86729 87853 89153 90317 91400 92506
52580I2506P92m3p34m29P41J680J666J155R37R79O98J41P4Q13J656J884J710J759
$$ 92506 93298 93255 92521 92092 92833 94513 96179 97334 98271 99250 99948 100089 100163 100976 102632 104516 106226 107985
52562A07985J981J796J149P26R30J293J216Q80Q93J288J480J200R01J008J183
$$ 107985 109966 111762 112911 113637 114567 115860 117076 117956 118849 120137 121617 122817 123718 124726 125909
52547A25909P83j14o11k1J305K337K379J615P79M44N87P66O39L70L88Q15J293
$$ 125909 126692 126578 125967 125946 127251 129588 131967 133582 134361 134805 135392 136158 136797 137167 137555 138370 139663
52530A39663J415J168P79L42k03p71j140j227j123q69l70L16Q76J077J024R15
$$ 139663 141078 142246 143025 143367 143164 142393 141253 140026 138903 138034 137664 137980 138856 139933 140957 141872
52514A41872P14L69J41L65Q39Q98K75m68o57l17L8K30M48O04K89m84j060j085
$$ 141872 142586 142955 143096 143461 144300 145198 145473 145005 144348 144031 144069 144299 144747 145351 145640 145156 144096 143011
52496A43011j049j495k035j847r09o5J51J24M14R94J445J532J257O98Q7j57J52
$$ 143011 141962 140467 138432 136585 135676 135611 135762 135886 136300 137294 138739 140271 141528 142226 142313 142156 142308
52479A42308O78R39Q72P94R15J108J132R21O68O40Q77J085R34M55J2j28M8M67
$$ 142308 142986 143925 144797 145591 146506 147614 148746 149667 150335 150975 151852 152937 153871 154326 154338 154210 154258 154725
52461A54725J026J438J427J135J027J238J357J061N39J51QJ39O34J238J293N53
$$ 154725 155751 157189 158616 159751 160778 162016 163373 164434 164973 165124 165132 165271 165905 167143 168436 168989
52445A68989k23j04P91J515J570J349J298J277R84N27K67L63O65Q86P63K52k84
$$ 168989 168766 168662 169453 170968 172538 173887 175185 176462 177446 177973 178240 178603 179268 180154 180917 181169 180885
52428A80885l17K77J057J433J154L96m79j200j781k445l235l775l690l079k361
$$ 180885 180568 180845 181902 183335 184489 184885 184406 183206 181425 178980 175745 171970 168280 165201 162840
52413A62840j756j313j269j819k507k463j459k65L46M37M84N60M50K36J64J05
$$ 162840 161084 159771 158502 156683 154176 151713 150254 149989 150335 150772 151256 151816 152266 152502 152666 152771
52397A52771k93r07j146o90J66R44J376J313P57J28R6P99J609J885J659J302Q83
$$ 152771 152478 151571 150425 149735 149901 150845 152221 153534 154291 154419 154515 155314 156923 158808 160467 161769 162652
52380A62652L49J0K33P43Q32L77Q5N14J303J695J486J090R84J353K149L072L626
$$ 162652 163001 163011 163244 163987 164819 165196 165281 165795 167098 168793 170279 171369 172353 173706 175855 178927 182553
52363A82553L498K844K040J327R04J115K062L202L778L701L555L724L936L775
$$ 182553 186051 188895 190935 192262 193166 194281 196343 199545 203323 207024 210579 214303 218239 222014
52349B22014L276K731K295J985J881K081K478K789K780K469K145K105K307K361
$$ 222014 225290 228021 230316 232301 234182 236263 238741 241530 244310 246779 248924 251029 253336 255697
52335B55697K028J604J515J692J660J201N99K37L23R97K225L524M215M105L663
$$ 255697 257725 259329 260844 262536 264196 265397 265996 266233 266556 267553 269778 273302 277517 281622 285285
52320B85285L372L287L298L446L778M124M244M018L510L115L498M906O507P020
$$ 285285 288657 291944 295242 298688 302466 306590 310834 314852 318362 321477 324975 329881 336388 343408
52306C43408O177N095M968N873P104Q148Q953R644J0362J1145J1775J1951J1829
$$ 343408 349585 354680 359648 365521 372625 380773 389726 399370 409732 420877 432652 444603 456432
52293D56432J1963J2594J3393J4076J4807J5776J6805J7624J8099J8058J7466
$$ 456432 468395 480989 494382 508458 523265 539041 555846 573470 591569 609627 627093
52282F27093J6935J7335J8592J9558J9468J8786J8217J7722J7034J6416J6101
$$ 627093 644028 661363 679955 699513 718981 737767 755984 773706 790740 807156 823257
52271H23257J5689J4833J3915J3221J2155J0172P923O419N566M559L367K642K464
$$ 823257 838946 853779 867694 880915 893070 903242 911165 917584 923150 927709 931076 933718 936182
52258I36182K239J712J080K90p47j509j516j401k145l370l663k699j642j299j203
$$ 936182 938421 940133 941213 941503 940756 939247 937731 936330 934185 930815 927152 924453 922811 921512 920309
52243I20309q57n43l17N22K227L893M783N493O967Q995J0549J1150J1157J1007
$$ 920309 919452 918909 918592 919114 921341 925234 930017 935510 942477 951472 962021 973171 984328 995335
52229I95335J0889J0914J1145J1534J2033J2515J2573J1864J0725R865R287Q292
$$ 995335 1006224 1017138 1028283 1039817 1051850 1064365 1076938 1088802 1099527 1109392 1118679 1126971
52217A126971O711N316M587L891K524Q51l13r38j692k944m477n909o947p458p744
$$ 1126971 1133682 1138998 1143585 1147476 1150000 1150851 1150538 1149600 1147908 1144964 1140487 1134578 1127631 1120173 1112429
52202A112429q490r999j1692j2694j2679j1945j1036j0498j0601j0943j0709r655
$$ 1112429 1103939 1093940 1082248 1069554 1056875 1044930 1033894 1023396 1012795 1001852 991143 981488
52190I81488q414p603p149o747o399o073n405m223k979k171j813j810k372l447
$$ 981488 973074 965471 958322 951575 945176 939103 933698 929475 926496 924325 922512 920702 918330 914883
52176I14883m288m130l073j839j082j209k286l571l824k720j514j539k561l290
$$ 914883 910595 906465 903392 901553 900471 899262 896976 893405 889581 886861 885347 883808 881247 877957
52162H77957l110k443j786j344j370j958k571k567k196k268k883l375l444l512
$$ 877957 874847 872404 870618 869274 867904 865946 863375 860808 858612 856344 853461 850086 846642 843130
52148H43130l702l415k413j565j941l398m710m966m465m144m447m916m920m497
$$ 843130 839428 836013 833600 832035 830094 826696 821986 817020 812555 808411 803964 799048 794128 789631
52134G89631m197m259m316m055l649l366l177l083l339m010m609m693m431m143
$$ 789631 785434 781175 776859 772804 769155 765789 762612 759529 756190 752180 747571 742878 738447 734304
52120G34304l685k849k034j846k272k799l178l421l280k427j123p9M20P31J161
$$ 734304 730619 727770 725736 723890 721618 718819 715641 712220 708940 706513 705390 705311 705731 706462 707623
52105G07623J692K370L400M707N938O989Q074R153R903J0345J1039J2343J3916
$$ 707623 709315 711685 715085 719792 725730 732719 740793 749946 759849 770194 781233 793576 807492
52092H07492J5294J6547J8058J9863K1558K2757K3368K3470K3172K2646K2186
$$ 807492 822786 839333 857391 877254 898812 921569 944937 968407 991579 1014225 1036411
52081A036411K2014K2029K1866K1294K0448J9478J8207J6445J4529J3002J1806
$$ 1036411 1058425 1080454 1102320 1123614 1144062 1163540 1181747 1198192 1212721 1225723 1237529
52070A237529J0279Q148N902M028K432Q94m81j672l021m623n969o700p215p989
$$ 1237529 1247808 1255956 1261858 1265886 1268318 1269212 1268731 1267059 1264038 1259415 1253446 1246746 1239531 1231542
52056A231542q784r164r298r542r698r398q854q457p979p029n925n217m699l777
$$ 1231542 1222758 1213594 1204296 1194754 1185056 1175658 1166804 1158347 1150368 1143339 1137414 1132197 1127498 1123721
52042A123721k668k100j970j395j71Q80J209J265J680K563L932N830P709Q527
$$ 1123721 1121053 1118953 1116983 1115588 1115417 1116297 1117506 1118771 1120451 1123014 1126946 1132776 1140485 1149012
52028A149012P954O900O318O169N943N631N492N333M652L386K059J266J183J485
$$ 1149012 1156966 1163866 1170184 1176353 1182296 1187927 1193419 1198752 1203404 1206790 1208849 1210115 1211298 1212783
52014A212783J560R93p4j184k116l012m102n574p512r586j1092j1783j2415j3789
$$ 1212783 1214343 1215336 1215262 1214078 1211962 1208950 1204848 1199274 1191762 1182176 1171084 1159301 1146886 1133097
52000A133097j5648j7206j8499k0131k1888k2829k2927k3316k4503k5528k5567
$$ 1133097 1117449 1100243 1081744 1061613 1039725 1016896 993969 970653 946150 920622 895055
51989H95055k5280k5668k6481k6744k6328k5960k6008k6114k5843k5070k3841
$$ 895055 869775 844107 817626 790882 764554 738594 712586 686472 660629 635559 611718
51978F11718k2394k1158k0303j9489j8490j7634j7225j6880j6002j4571j2930
$$ 611718 589324 568166 547863 528374 509884 492250 475025 458145 442143 427572 414642
51967D14642j1223r623q723q871r310q888p562o440o218o396o228n703n189m726
$$ 414642 403419 393796 385073 376202 366892 358004 350442 344002 337784 331388 325160 319457 314268 309542
51953C09542m211l899m125m690m962m615l941l343k860k291j630j162j147j585
$$ 309542 305331 301432 297307 292617 287655 283040 279099 275756 272896 270605 268975 267813 266666 265081
51939B65081k249k787k861k382j733j465j689j923j745j350j187j326j467j408
$$ 265081 262832 260045 257184 254802 253069 251604 249915 247992 246247 244897 243710 242384 240917 239509
51925B39509j164o87K1O10O16O0n09o66n39n39r18j592k196k415k426k838l847
$$ 239509 238345 237658 237679 238289 238905 238965 238456 237790 237251 236712 235794 234202 232006 229591 227165 224327 220480
51908B20480m756m733l800k548j251L9P81L04j007j829j468n73p9j98p73j778
$$ 220480 215724 210991 207191 204643 203392 203431 204212 204516 203509 201680 200212 199639 199560 199362 198589 196811
51892A96811k941l513l070k091j289p79l60j10k00m29m34j56K61P49J148J136
$$ 196811 193870 190357 187287 185196 183907 183128 182768 182658 182458 182029 181595 181439 181700 182449 183597 184733
51876A84733O31P6m4K85P24R29O81M2m52l16J33L1p47j320j040l28J31L03M17
$$ 184733 185364 185440 185396 185681 186405 187334 188015 188057 187605 187289 187422 187453 186706 185386 184346 184018 184149 184452 184869
51857A84869L87K35M15J059J473J190Q34J142J656J455P38O08J365K175K419K381
$$ 184869 185256 185491 185906 186965 188438 189628 190462 191604 193260 194715 195453 196061 197426 199601 202020 204401
51841B04401K393K247J767J244R07N32j7l61k20l1m51j355j811j215r3M94K44
$$ 204401 206794 209041 210808 212052 212959 213491 213474 213113 212893 212862 212411 211056 209245 208030 207937 208431 208675
51824B08675r1J80O68N26k34p59o35l90m66n00mQ26J486J767J614R34R1q5O67
$$ 208675 208584 208764 209432 209958 209724 208965 208330 207940 207474 206974 206970 207796 209282 211049 212663 213597 213688 213603 214270
51805B14270J498J597J293J292J406R75J46k17J91P96J021P57J28o07j012r79
$$ 214270 215768 217365 218658 219950 221356 222331 222477 222260 222451 223247 224268 225025 225153 224546 223534 222555
51789B22555r66j219j168l78L87J15p48p79L26J389J563J273J094Q37L59K34R41
$$ 222555 221589 220370 219202 218824 219211 219326 218578 217799 218125 219514 221077 222350 223444 224281 224640 224874 225815
51772B25815K031K672K565J910J029L79M17J041J620J841J976K106J823J048M93
$$ 225815 227846 230518 233083 234993 236022 236401 236818 237859 239479 241320 243296 245402 247225 248273 248766
51757B48766P18J353J776K087K673L275L284K718K255K313K699L189L828M504
$$ 248766 249484 250837 252613 254700 257373 260648 263932 266650 268905 271218 273917 277106 280934 285438
51743B85438M721M201L432L243L839M590M916N037N487O138O327N996N928O440
$$ 285438 290159 294360 297792 301035 304874 309464 314380 319417 324904 331042 337369 343365 349293 355733
51729C55733O582N383L365J886J294P73j5l63J63R10J178J169J232R95P6q00n11
$$ 355733 362315 367698 371063 372949 374243 375016 375001 374638 374801 375711 376889 378058 379290 380285 380361 379561 379050
51712C79050P25J259n4k439m151m463m224m441m852m388k892j661j976l574n139
$$ 379050 379775 381034 380980 378541 374390 369927 365703 361262 356410 352022 349130 347469 345493 341919 336780
51697C36780n904o073n896n206m023k858k132j771j589j573j594j362q79m67j56
$$ 336780 330876 324803 318907 313701 309678 306820 304688 302917 301328 299755 298161 296799 295920 295453 295297
51682B95297M89J595K644L036K651J547k52k289l558l416k280j037o2P39J329
$$ 295297 295786 297381 300025 303061 305712 307259 307007 304718 301160 297744 295464 294427 294365 295104 296433
51667B96433J476J242J025J217K013L360M896O125O830P214P469P519P249O582
$$ 296433 297909 299151 300176 301393 303406 306766 311662 317787 324617 331831 339300 346819 354068 360650
51653C60650N188K682n88l465n125n950o842q072r256j0067j0384j0042r091q121
$$ 360650 365838 368520 367932 364467 359342 353392 346550 338478 329222 319155 308771 298729 289638 281517
51639B81517p723p593o848n299l859l490m047m546m355l760l384l295k988k258
$$ 281517 273794 266201 259353 254054 250195 246705 242658 238112 233757 229997 226613 223318 220330 218072
51625B18072j648j740k216k213j503p70n70o61o46o49r37j298j332j085r13r20
$$ 218072 216424 214684 212468 210255 208752 207982 207412 206751 206105 205456 204519 203221 201889 200804 199891 198971
51609A98971r24q42p05n25l65l99n76n49j93J44J92J64K71K91P0M5N84J224J260
$$ 198971 198047 197205 196500 195975 195610 195211 194635 194086 193893 194037 194229 194393 194664 194955 195025 195070 195654 196878 198138
51590A98138Q81R21J593K250K456K547K933L498L951M296M735N406O365P438Q085
$$ 198138 199019 199940 201533 203783 206239 208786 211719 215217 219168 223464 228199 233605 239970 247408 255493
51575B55493P915P342P191P544P527O485M775L115J671K81r47j824k567l521m506
$$ 255493 263408 270750 277941 285485 293012 299497 304272 307387 309058 309339 308392 306568 304001 300480 295974
51560B95974m995m843m427m033l610l161k838k518j722k85J209K019K132K207
$$ 295974 290979 286136 281709 277676 274066 270905 268067 265549 263827 263542 264751 266770 268902 271109
51546B71109K726L568M437N302O210O954P213O862O034M954L949L438L568L879
$$ 271109 273835 277403 281840 287142 293352 300306 307519 314381 320415 325369 329318 332756 336324 340203
51532C40203L606K422P50o57j307j197p29m70p14j190j298p32K28J074J560J819
$$ 340203 343809 346231 346981 346324 345017 343820 343091 342621 341907 340717 339419 338687 338915 339989 341549 343368
51516C43368K092K377K348J684O01k10l44j22j09l83p36j252k129l059l526l703
$$ 343368 345460 347837 350185 351869 352470 352260 351916 351794 351685 351302 350566 349314 347185 344126 340600 336897
51500C36897m262n233n796n516m970m751m590m058l444l199l022k393j619j474
$$ 336897 332635 327402 321606 316090 311120 306369 301779 297721 294277 291078 288056 285663 284044 282570
51486B82570j865j790p25O62J406J298Q12M57N08J072K065L149L892M008L495
$$ 282570 280705 278915 278190 278852 280258 281556 282368 282825 283333 284405 286470 289619 293511 297519 301014
51471C01014K646J865J408J397K019L378N035O105O159N727N578N804O025O148
$$ 301014 303660 305525 306933 308330 310349 313727 318762 324867 331026 336753 342331 348135 354160 360308
51457C60308O355O545O443O167O140O344O272N706N000M419L700K542J198K00
$$ 360308 366663 373208 379651 385818 391958 398302 404574 410280 415280 419699 423399 425941 427139 427339
51443D27339k38l69n51r53j505j987k226k234k120j874j356n01N33J419J818J584
$$ 427339 427101 426732 426181 425228 423723 421736 419510 417276 415156 413282 411926 411425 411958 413377 415195 416779
51427D16779R37K33n28j745l586n547o912p451p395o942o228n616n584o234p189
$$ 416779 417716 417949 417421 415676 412090 406543 399631 392180 384785 377843 371615 365999 360415 354181 346992
51412C46992p969q226p770o701n429m349l493k769k260j989j624q56M9N92P49
$$ 346992 339023 330797 323027 316326 310897 306548 303055 300286 298026 296037 294413 293557 293606 294198 294947
51397B94947Q71R28N67n5j29Q54K434L696M141L852L184K443J700Q15k66j327
$$ 294947 295818 296746 297313 297258 297129 297983 300417 304113 308254 312106 315290 317733 319433 320248 319982 318655
51381C18655k294l524n222o772p318o976o699o886o927o431n934o034o432o613
$$ 318655 316361 312837 307615 300843 293525 286549 279850 272964 266037 259606 253672 247638 241206 234593
51367B34593o735p141p399o754n395m408m387m798m859m474m018l651l234k700
$$ 234593 227858 220717 213318 206564 201169 196761 192374 187576 182717 178243 174225 170574 167340 164640
51353A64640k152j680j277r21o31m67n37q85j328j475j100m75j59l80p63q35o09
$$ 164640 162488 160808 159531 158610 157979 157512 156975 156090 154762 153287 152187 151712 151553 151173 150410 149575 148966
51336A48966m34l69p0N78J171J296J006N74P1m43o33l03J76L06K26M85J139J722
$$ 148966 148532 148163 148093 148671 149842 151138 152144 152718 152789 152346 151713 151410 151586 151892 152118 152603 153742 155464
51318A55464K038K409K967L342L278L117L390M232N391O429O853O512O003O122
$$ 155464 157502 159911 162878 166220 169498 172615 176005 180237 185628 192057 198910 205422 211425 217547
51304B17547O727O729N524L855K718J955O46j465l609n012n699o132o535o725
$$ 217547 224274 231003 236527 240382 243100 245055 245701 244236 240627 235615 229916 223784 217249 210524
51290B10524o413n579m619m036l936m008m032m132m306m125l316k335j914k171
$$ 210524 204111 198532 193913 189877 185941 181933 177901 173769 169463 165338 162022 159687 157773 155602
51276A55602k614k865k970l016k907k622k317k104j929j742j549j302r66o55n01
$$ 155602 152988 150123 147153 144137 141230 138608 136291 134187 132258 130516 128967 127665 126699 126044 125543
51261A25543m52l84l22k90r3L95Q84J008R63J301J987K233J487K20o19o58k28
$$ 125543 125091 124707 124385 124095 124002 124397 125281 126289 127252 128553 130540 132773 134260 134480 133861 133203 132975
51244A32975K71P80J346J826J903J339K57q15j333j348j426j807j930j216p6M68
$$ 132975 133246 134026 135372 137198 139101 140440 140697 139882 138549 137201 135775 133968 132038 130822 130746 131214
51228A31214J11l99m56l92o75r28n20L01O98N22L79L95q4j198j920j350K5J096
$$ 131214 131325 130926 130470 130078 129403 128475 127955 128256 128954 129476 129855 130250 130166 128968 127048 125698 125723 126819
51210A26819J603J947K041J411L42j64K51Q96J171J297J499J359N26m99r43o90
$$ 126819 128422 130369 132410 133821 134163 133999 134250 135146 136317 137614 139113 140472 140998 140499 139556 138866
51194A38866k02J81L32J25l47o34m64j57l2K12R15J538J184j1q40n88J03K49k14
$$ 138866 138664 138845 139177 139302 138955 138321 137857 137700 137668 137880 138795 140333 141517 141506 140666 140078 140181 140430 140216
51175A40216o30p27q42j177j407j189p16m43m19j52O69J575J728R07j36n12j49
$$ 140216 139586 138859 138017 136840 135433 134244 133528 133085 132666 132514 133183 134758 136486 137393 137257 136745 136596
51158A36596L25M22K20n0m20j036j755k195k162j866j664j655j612j322q26l22
$$ 136596 136921 137343 137563 137513 137093 136057 134302 132107 129945 128079 126415 124760 123148 121826 121000 120678
51142A20678O9L41M43L17J2l51o93r50r82p17l52j18Q3N64J369K174K743L121
$$ 120678 120747 121088 121531 121848 121860 121509 120816 119866 118884 118167 117815 117697 117780 118344 119713 121887 124630 127751
51124A27751L301L104K540J968J658J513J368J300J334J206P43J86k09n89j190
$$ 127751 131052 134156 136696 138664 140322 141835 143203 144503 145837 147043 147786 147972 147763 147174 145984
51109A45984j721j657j021m51l96o53q25q89j127j618k034j967j354n56K4L51
$$ 145984 144263 142606 141585 141134 140738 140085 139260 138371 137244 135626 133592 131625 130271 129715 129739 130090
51093A30090O19Q65R45Q87R21J022Q93N20L60O53R75Q71N47M77N72L48k69q68
$$ 130090 130709 131574 132519 133406 134327 135349 136242 136762 137122 137775 138750 139621 140168 140645 141217 141565 141296 140428
51075A40428j134j055n80L14J226J585J351J039R60R43Q28P81R70J308J659J873
$$ 140428 139294 138239 137659 137973 139199 140784 142135 143174 144134 145077 145905 146686 147656 148964 150623 152496
51059A52496J617O38o82j551j697j530j257n47N66J242R07K63M26J368K082K120
$$ 152496 154113 154751 154069 152518 150821 149291 148034 147487 148053 149295 150202 150465 150891 152259 154341 156461
51043A56461K173K865L807M182L837L342L166L204L069K601K044J743J719J565
$$ 156461 158634 161499 165306 169488 173325 176667 179833 183037 186106 188707 190751 192494 194213 195778
51029A95778R14r7r92j512j769j836j565r48l34p9j74m25p84j223j430j095l82
$$ 195778 196692 196595 195603 194091 192322 190486 188921 187973 187639 187560 187386 186961 186177 184954 183524 182429 182047
51012A82047J87L75M20N53O92P98J087J682K333K791L192L700M067L960L562L358
$$ 182047 182234 182609 183029 183582 184274 185072 186159 187841 190174 192965 196157 199857 203924 207884 211446 214804
50996B14804L417L405L327L599M279M837N037N416O423P568Q026P899Q135R212
$$ 214804 218221 221626 224953 228552 232831 237668 242705 248121 254544 262112 270138 278037 286172 295384
50982B95384J0511J1228J1444J1987J3381J5303J7024J8227J9335K1090K3890
$$ 295384 305895 317123 328567 340554 353935 369238 386262 404489 423824 444914 468804
50971D68804K7513L1429L5177L8531M1561M4649M8208N2218N6164N9628O2696
$$ 468804 496317 527746 562923 601454 643015 687664 735872 788090 844254 903882 966578
50960I66578O5564O7956O9240O9057O7573O5079O1642N7156N1580M5043L7769
$$ 966578 1032142 1100098 1169338 1238395 1305968 1371047 1432689 1489845 1541425 1586468 1624237
50949A624237K9974K1902J4034P201K008j875n492r252j2282j3462j2794j1218
$$ 1624237 1654211 1676113 1690147 1697348 1699356 1697481 1691989 1682737 1670455 1656993 1644199 1632981
50937A632981r367p289n359m605n745q430j1827j5535j9545k3714k7807l1908
$$ 1632981 1623614 1616325 1610966 1606361 1600616 1592186 1580359 1564824 1545279 1521565 1493758 1461850
50925A461850l6338m1097m5674m9459n2148n3809n4805n5587n6186n5890n3781
$$ 1461850 1425512 1384415 1338741 1289282 1237134 1183325 1128520 1072933 1016747 960857 907076
50914I07076m9904m5615m2286l9768l6725l2582k8463k5733k4165k2380j9786
$$ 907076 857172 811557 769271 729503 692778 660196 631733 606000 581835 559455 539669
50903E39669j7027j4583j2071r387p388o564n967m516k745j969k067j599j60R31
$$ 539669 522642 508059 495988 486601 479213 472649 466682 462166 459421 457452 455385 453786 453626 454557
50889D54557P20O1J67Q44J191J235J663K393K660K459K767M085N688O653O950
$$ 454557 455277 455338 455505 456349 457540 458775 460438 462831 465491 467950 470717 474802 480490 487143 494093
50874D94093P116P507Q280R606J1316J2688J3214J3427J4386J6345J8491K0132
$$ 494093 501209 508716 516996 526602 537918 550606 563820 577247 591633 607978 626469 646601
50862F46601K1541K3377K5806K8734L2516L7695M4010N0400N6202O1879O8306
$$ 646601 668142 691519 717325 746059 778575 816270 860280 910680 966882 1028761 1097067
50851A097067P5783Q4147R3300J03075J12849J21914J30136J37738J44600J50257
$$ 1097067 1172850 1256997 1350297 1453372 1566221 1688135 1818271 1956009 2100609 2250866
50841B250866J54433J56872J56579J52078J42759J29471J13477R5449P5814N5501
$$ 2250866 2405299 2562171 2718750 2870828 3013587 3143058 3256535 3351984 3427798 3483299
50831C483299L5651J6899m45j5683k7789l6186m0985m2431m0592l5715k8549k0192
$$ 3483299 3518950 3535849 3535404 3519721 3491932 3455746 3414761 3372330 3331738 3296023 3267474 3247282
50819C247282j1874m911n68K88k683r436j9554l2040m5524n9026p2402q5876r9168
$$ 3247282 3235408 3230497 3229929 3230217 3227534 3218098 3198544 3166504 3120980 3061954 2989552 2903676 2804508
50806B804508j11329j21358j28688j33139j34745j33791j30713j25675j18470
$$ 2804508 2693179 2571821 2443133 2309994 2175249 2041458 1910745 1785070 1666600
50797A666600j09285r9304r0021q1819p3751o5047n6313m8822m2934l7810l2543
$$ 1666600 1557315 1458011 1367990 1286171 1212420 1147373 1091060 1042238 999304 961494 928951
50786I28951k7037k1740j7031j3128j0151q039o537n422m648m226m086m133m227
$$ 928951 901914 880174 863143 850015 839864 831825 825288 819866 815218 810992 806906 802773 798546
50773G98546m215m140m339n069o008o541o534o520p005p885q662q965q698p964
$$ 798546 794331 790191 785852 780783 774775 768234 761700 755180 748175 740290 731628 722663 713965 706001
50759G06001p025o128n191l846j938J81K019L492M966O831R117J1489J3637J5706
$$ 706001 698976 692848 687657 683811 681873 682054 684073 687565 692531 699362 708479 719968 733605 749311
50745G49311J8144K1076K4070K6833K9789L3551L7937M2182M6005M9877N4190
$$ 749311 767455 788531 812601 839434 869223 902774 940711 982893 1028898 1078775 1132965
50734A132965N8797O3471O8232P2995P7537Q1927Q6358R0338R2768R3229R2426
$$ 1132965 1191762 1255233 1323465 1396460 1473997 1555924 1642282 1732620 1825388 1918617 2011043
50723B011043R0813Q7590Q1722P3275O2891N0550L5911J9607L172j2254k6178
$$ 2011043 2101856 2189446 2271168 2344443 2407334 2457884 2493795 2513402 2516574 2504320 2478142
50712B478142l7810m6006n0419n1875n1212m8459m3592l7320l0532k3463j6072
$$ 2478142 2440332 2394326 2343907 2292032 2240820 2192361 2148769 2111449 2080917 2057454 2041382
50701B041382r052l792j397k118n672j1759k0078l0100m0984n1733o1502o9762
$$ 2041382 2032330 2028538 2027141 2025023 2019351 2007592 1987514 1957414 1916430 1864697 1803195 1733433
50689A733433p6170q0310q1763q0570p7411p3168o8331o2960n7170n1359m5900
$$ 1733433 1657263 1576953 1495190 1414620 1337209 1264041 1195710 1132750 1075580 1024221 978321
50678I78321m0707l5409l0008k5031k0872j7092j2807p818k956Q22L501N919Q818
$$ 978321 937614 902205 872197 847166 826294 809202 796395 788577 785621 786443 789944 795863 804681
50665H04681J2112J4968J6458J6344J5411J4821J5011J5401J5327J4861J4415
$$ 804681 816793 831761 848219 864563 879974 894795 909806 925207 940534 955395 969810
50654I69810J3932J3155J2496J2883J4534J6486J7764J8615K0069K2469K5018
$$ 969810 983742 996897 1009393 1022276 1036810 1053296 1071060 1089675 1109744 1132213 1157231
50643A157231K6962K8784L1736L6290M1479M5927M9146N1591N3738N5529N6628
$$ 1157231 1184193 1212977 1244713 1281003 1322482 1368409 1417555 1469146 1522884 1578413 1635041
50632A635041N6639N5132N1886M7272M1955L6137K9556K2344J5338R284M297K86
$$ 1635041 1691680 1746812 1798698 1845970 1887925 1924062 1953618 1975962 1991300 2000584 2004881 2005167
50620B005167k596m393n587o381o180m418j468J856N331R097J2687J5165J6165
$$ 2005167 2002571 1998178 1992591 1986210 1980030 1975612 1974144 1976000 1981331 1990428 2003115 2018280 2034445
50607B034445J6033J4948J2658R183N095Q41l720r007j5316k2801l1345m0282
$$ 2034445 2050478 2065426 2078084 2087267 2092362 2093203 2089483 2080476 2065160 2042359 2011014 1970732
50595A970732m8681n5952o1897o6272o8806o9720o9664o9075o7926o6081o3475
$$ 1970732 1922051 1866099 1804202 1737930 1669124 1599404 1529740 1460665 1392739 1326658 1263183
50584A263183n9983n5695n1250m7312m3719l9774l5389l1235k7724k4646k1886
$$ 1263183 1203200 1147505 1096255 1048943 1005224 965450 930061 898826 871102 846456 824570
50573H24570j9644j7646j5105j1878q819o446m075r91K235M467N626O669Q250
$$ 824570 804926 787280 772175 760297 751478 745032 740957 739966 742201 746668 752294 758963 767213
50560G67213J0156J1958J3551J5071J6738J8741K0955K2975K4747K6718K8962
$$ 767213 777369 789327 802878 817949 834687 853428 874383 897358 922105 948823 977785
50549I77785L0698L1354L1691L2901L4839L6107L5917L4927L4066L3483L3053
$$ 977785 1008483 1039837 1071528 1104429 1139268 1175375 1211292 1246219 1280285 1313768 1346821
50538A346821L3066L3777L4800L5704L6858L9105M2644M6813N0990N5275O0117
$$ 1346821 1379887 1413664 1448464 1484168 1521026 1560131 1602775 1649588 1700578 1755853 1815970
50527A815970O5572P1200P6565Q1622Q6543R1231R5108R7449R7971R7013R5057
$$ 1815970 1881542 1952742 2029307 2110929 2197472 2288703 2383811 2481260 2579231 2676244 2771301
50516B771301R2060Q7373Q0415P1262O0480M8437L5149K0757N789r309k4442l9325
$$ 2771301 2863361 2950734 3031149 3102411 3162891 3211328 3246477 3267234 3273023 3263714 3239272 3199947
50504C199947n3035o4702p4309q2153q7668q9635q7655q2593p5289o5691n3702
$$ 3199947 3146912 3082210 3007901 2925748 2838080 2748445 2660790 2578197 2502908 2437217 2383515
50493B383515m0131k6141j2368P78J2447K1762K8559L3054L5030L3920K9302K0732
$$ 2383515 2343384 2317243 2304875 2305653 2318100 2339862 2368421 2401475 2436505 2470425 2499727 2520459
50481B520459P610r766k9221m7839o4066p7912q9233r7046j00885j01734j01021
$$ 2520459 2528069 2518303 2489082 2441243 2377177 2299265 2210032 2112986 2012101 1910367 1809346
50470A809346r9226r6005r1195q5168p8609p2318o6851o1952n6701n0517m3795
$$ 1809346 1710120 1614115 1522920 1437752 1359143 1286825 1219974 1158022 1101321 1050804 1007009
50459A007009l7419l1967k7521k3731j9906j5589j1330q287o692n285k790N32
$$ 1007009 969590 937623 910102 886371 866465 850876 839546 831259 824567 819282 816492 817024
50447H17024L400N185O435Q022J0381J3377J6366J8486J9434J9910K0844K2335
$$ 817024 820424 825609 832044 840066 850447 863824 880190 898676 918110 938020 958864 981199
50435I81199K3787K4916K6049K7456K8961L0244L1112L1416L1145L0591L0080
$$ 981199 1004986 1029902 1055951 1083407 1112368 1142612 1173724 1205140 1236285 1266876 1296956
50424A296956K9528K8656K7546K6563K5752K4856K3870K3103K2604K2186K2127
$$ 1296956 1326484 1355140 1382686 1409249 1435001 1459857 1483727 1506830 1529434 1551620 1573747
50413A573747K3196K5665K8786L1570L3706L5417L6809L7785L8304L8403L8056
$$ 1573747 1596943 1622608 1651394 1682964 1716670 1752087 1788896 1826681 1864985 1903388 1941444
50402A941444L7187L5654L3137K9457K5035K0543J5875J0082K633n863j4651k3886
$$ 1941444 1978631 2014285 2047422 2076879 2101914 2122457 2138332 2148414 2151047 2145184 2130533 2106647
50390B106647l4017m4520n4166o2282o8935p3916p6499p6354p3978p0016o4736
$$ 2106647 2072630 2028110 1973944 1911662 1842727 1768811 1692312 1615958 1541980 1471964 1407228
50379A407228n8354n1263m3698l5603k7109j8645j0413k272N591J2355J7319K0398
$$ 1407228 1348874 1297611 1253913 1218310 1191201 1172556 1162143 1159871 1165462 1177817 1195136 1215534
50367A215534K1567K0320J6277R961K440n560j3640k1102k7093l1360l4359l6496
$$ 1215534 1237101 1257421 1273698 1283659 1286099 1280539 1266899 1245797 1218704 1187344 1152985 1116489
50355A116489l7727l7962l7367l6179l4518l2583l0650k8737k6582k4174k2037
$$ 1116489 1078762 1040800 1003433 967254 932736 900153 869503 840766 814184 790010 767973
50344G67973k0632j9660j8297j6157j3753j1836j0478r075p221n270l897l277
$$ 767973 747341 727681 709384 693227 679474 667638 657160 648085 640864 635594 631697 628420
50332F28420k974k422j274N93K999N330O963P977R044J0499J1922J2831J3347
$$ 628420 625446 623024 621750 622343 625342 630672 637635 645612 654656 665155 677077 689908 703255
50319G03255J3863J4458J5058J5785J6693J7491J8063J8904K0436K2128K2967
$$ 703255 717118 731576 746634 762419 779112 796603 814666 833570 854006 876134 899101
50308H99101K2714K2005K1256K0236J8765J7212J5941J4868J3746J2505J1045
$$ 899101 921815 943820 965076 985312 1004077 1021289 1037230 1052098 1065844 1078349 1089394
50297A089394R118O676M034J559n26k001k772l306m347o083p981r672j1452j3631
$$ 1089394 1098512 1105188 1109222 1110781 1110255 1108254 1105482 1102176 1097829 1091746 1083765 1074093 1062641 1049010
50283A049010j5939j7894j9335k0203k0302j9781j9380j9651k0186k0220j9668
$$ 1049010 1033071 1015177 995842 975639 955337 935556 916176 896525 876339 856119 836451
50272H36451j9092j8761j8375j7666j6735j5763j4772j3759j2729j1672j0649
$$ 836451 817359 798598 780223 762557 745822 730059 715287 701528 688799 677127 666478
50261F66478r793q951p590n509l419k305k194k111j266J42J457K431L269M070
$$ 666478 656685 647734 640144 634635 631216 628911 626717 624606 623340 623482 624939 627370 630639 634709
50247F34709M609M612M143L588L290L255L362L672M235M557L782J753n43k015
$$ 634709 639318 643930 648073 651661 654951 658206 661568 665240 669475 674032 677814 679567 679024 677009
50233F77009k579k847l090l167l244l753m596n152n231n401o068o782o866o292
$$ 677009 674430 671583 668493 665326 662082 658329 653733 648581 643350 637949 631881 625099 618233 611941
50219F11941n493m670l690k536j429m77N05J734L123M230M593M206L628L488L892
$$ 611941 606448 601778 598088 595552 594123 593646 594151 595885 599008 603238 607831 612037 615665 619153 623045
50204F23045M434M653M344L477K198R31J40q9j14l06p62j426k202k924l439l730
$$ 623045 627479 632132 636476 639953 642151 643082 643222 643133 643019 642713 641951 640525 638323 635399 631960 628230
50188F28230l821l699l560l935n121o617p569p780p766p849p851p744p886q308
$$ 628230 624409 620710 617150 613215 608094 601477 593908 586128 578362 570513 562662 554918 547032 538724
50174E38724q425p865o976o157n204l884k563j673j012k37M15N90O68J175J650
$$ 538724 530299 522434 515458 509301 504097 500213 497650 495977 494965 494728 495143 495733 496401 497576 499226
50159D99226J072o06k333l467m403n384n805n348m878n373o456o937o435n564
$$ 499226 500298 499692 497359 493892 489489 484105 478300 472952 468074 462701 456245 449308 442873 437309
50145D37309m723l690k490j733j743k019j961j621j390j339j365j557j946k112
$$ 437309 432586 428896 426406 424673 422930 420911 418950 417329 415939 414600 413235 411678 409732 407620
50131D07620j614o33L18J194K320L519M065L698L190L404M256N072N639O329P221
$$ 407620 406006 405373 405691 406885 409205 412724 416789 420487 423677 427081 431337 436409 442048 448377 455598
50116D55598P710P249O164N409N581O273O471N583M010K658J995J834J940K322
$$ 455598 463308 470557 476721 482130 487711 493984 500455 506038 510048 512706 514701 516535 518475 520797
50102E20797K729K426J061n56j227q86o07j040j538j207j83O71J028J406K280
$$ 520797 523526 525952 527013 526457 525230 524344 523737 522697 521159 519952 519769 520440 521468 522874 525154
50087E25154L429M319M779N103N627O439P447Q554R644J0441J0594J0102R530
$$ 525154 528583 532902 537681 542784 548411 554850 562297 570851 580495 590936 601530 611632 621162
50074F21162R604J0534J1858J2896J3202J2763J2004J1623J1936J2387J2101J1002
$$ 621162 630766 641300 653158 666054 679256 692019 704023 715646 727582 739969 752070 763072
50062G63072R974R704R820R591R002Q608Q600Q623Q463Q308Q202P817O956N958
$$ 763072 773046 782750 792570 802161 811163 819771 828371 836994 845457 853765 861967 869784 876740 882698
50048H82698N265M860M417L827L310L066K990K748J976N37j294k942l956m372
$$ 882698 887963 892823 897240 901067 904377 907443 910433 913181 915157 915694 914400 911458 907502 903130
50034I03130m600n033n843o993q201q955q941q520q490r067r418q573o712n032
$$ 903130 898530 893497 887654 880661 872460 863505 854564 846044 837554 828487 819069 810496 803784 798752
50020G98752m265l910l167k107j363r70j79J529L847O180Q381J0687J3216J5792
$$ 798752 794487 790577 787410 785303 783940 782970 782791 784320 788167 794347 802728 813415 826631 842423
50006H42423J8176K0359K2728K5793K9440L2529L3658L2481K9929K6978K3643
$$ 842423 860599 880958 903686 929479 958919 991448 1025106 1057587 1087516 1114494 1138137
49995A138137J9380J4090Q420L338k70j935j916j113l47R4J23n79k375n369r585
$$ 1138137 1157517 1171607 1180027 1183365 1183095 1181160 1179244 1178131 1177784 1177878 1178001 1177422 1175047 1169678 1160093
49980A160093j5085k1549k8018l3580l7996m1267m2990m2796m1202l9172l6939
$$ 1160093 1145008 1123459 1095441 1061861 1023865 982598 939608 896812 855610 816438 779499
49969G79499l3974l0163k6227k2761j9684j6891j4783j3612j2914j2020j0840
$$ 779499 745525 715362 689135 666374 646690 629799 615016 601404 588490 576470 565630
49958E65630r674q701q026p863q120q191p650o917o672o829o687o051n525n650
$$ 565630 555956 547255 539229 531366 523246 515055 507405 500488 493816 486987 480300 474249 468724 463074
49944D63074o253o820p042o829o152n187m386m115m285m430m096l168k013j215
$$ 463074 456821 450001 442959 436130 429978 424791 420405 416290 412005 407575 403479 400311 398298 397083
49930C97083r85q74l71K68L14k73n66N1R08J007N46O51J671K676K922K976L752
$$ 397083 396098 395224 394853 395121 395435 395162 394596 394647 395555 396562 397108 397759 399430 402106 405028 408004 411756
49913D11756M998N628N294M809M907N337N439N078M606M338M434N023O027P016
$$ 411756 416754 422382 427676 432485 437392 442729 448168 453246 457852 462190 466624 471647 477674 484690
49899D84690P629Q037Q684R720J1040J2711J4954J7717K0668K3700K7023L0768
$$ 484690 492319 500356 509040 518760 529800 542511 557465 575182 595850 619550 646573 677341
49887F77341L4749L8663M2204M4881M6116M5654M3697M0577L6648L2490K8838
$$ 677341 712090 750753 792957 837838 883954 929608 973305 1013882 1050530 1083020 1111858
49876A111858K6045K3999K2692K2472K3382K4720K5605K5705K4924K2662J8066
$$ 1111858 1137903 1161902 1184594 1207066 1230448 1255168 1280773 1306478 1331402 1354064 1372130
49865A372130J1027K464o466j5010k2730k9235l4315l8093m0800m2527m3242m3036
$$ 1372130 1383157 1385621 1379155 1364145 1341415 1312180 1277865 1239772 1198972 1156445 1113203 1070167
49853A070167m2240m1353m0660l9913l8630l6847l5211l3935l2205k9271k5905
$$ 1070167 1027927 986574 945914 906001 867371 830524 795313 761378 729173 699902 673997
49842F73997k3722k3050k2406k0541j7970j5899j4455j2978j1495j0671j0426
$$ 673997 650275 627225 604819 584278 566308 550409 535954 522976 511481 500810 490384
49831D90384r751q225o786o500p214p933q040p629o969o209n452m753m116l681
$$ 490384 480633 472408 465622 459122 451908 443975 435935 428306 421337 415128 409676 404923 400807 397126
49817C97126l668l900l702k730j603j166j263r34J83J277J442Q19K88L70Q77J400
$$ 397126 393458 389558 385856 383126 381523 380357 379094 378160 378343 379620 381062 381881 382169 382539 383416 384816
49801C84816J682J631J304R62Q73J033J236J374J455J393J044N68L87O59R11M71
$$ 384816 386498 388129 389433 390395 391268 392301 393537 394911 396366 397759 398803 399371 399758 400417 401328 401799
49785D01799p57k050k428j456M41K329L437L670L589L908M912O207P158P656Q436
$$ 401799 401042 398992 396564 395108 395549 397878 401315 404985 408574 412482 417394 423601 430759 438415 446851
49770D46851J0311J3109J5703J7387J8942K1762K6018L0284L3104L4362L4793
$$ 446851 457162 470271 485974 503361 522303 544065 570083 600367 633471 667833 702626
49759G02626L4665L3533L1004K7142K2271J7002J2500R946R484J0159J1131J2416
$$ 702626 737291 770824 801828 828970 851241 868243 880743 890689 900173 910332 921463 933879
49747I33879J4149J5684J6023J4705J1695O691n59r273j7727k4634k9929l4030
$$ 933879 948028 963712 979735 994440 1006135 1012826 1012267 1002994 985267 960633 930704 896674
49735H96674l6859l8013l7457l5620l3019l0055k7003k3875k0508j7132j4527
$$ 896674 859815 821802 784345 748725 715706 685651 658648 634773 614265 597133 582606
49724E82606j3249j2759j1872j0096q175p145p124p193o386m733l324l291m602
$$ 582606 569357 556598 544726 534630 526455 519310 512186 504993 498607 493874 490550 487259 482657
49711D82657n954n989m511k453q58j25l5q0J95P92J168Q73J94n7M83J397K053
$$ 482657 476703 470714 466203 463750 462892 462767 462732 462652 462847 463639 464807 465680 465874 465817 466300 467697 469750
49694D69750K186J849J223O73O06J011J432J552J581J784J966J750J199P92Q21
$$ 469750 471936 473785 475008 475681 476287 477298 478730 480282 481863 483647 485613 487363 488562 489354 490175
49679D90175J078J135Q00K38k05l41k60q3K59P99J195R97L37q7J01M87N64M49
$$ 490175 491253 492388 493188 493426 493221 492880 492620 492537 492796 493595 494790 495787 496124 496037 496138 496625 497189 497638
49661D97638N57Q69J023R06P37O51O63Q77J334J658J358N28j66k70q8k47r61j880
$$ 497638 498195 499064 500087 500993 501730 502381 503044 503921 505255 506913 508271 508799 508633 508363 508275 508028 507067 505187
49643E05187k464k445j993j429p91J26J214J876J725J193R78J070Q82K55k43k00
$$ 505187 502723 500278 498285 496856 496065 496191 497405 499281 501006 502199 503177 504247 505129 505384 505141 504941
$$ [...]
##END NTUPLES=NMR SPECTRUM
##END=
