
##TITLE=AC1298_ECUAH12110_6615958_p2pXCobptA
##JCAMPDX= 6.0         $$ Bruker NMR JCAMP-DX V2.0
##DATA TYPE= NMR SPECTRUM
##DATA CLASS= NTUPLES
##ORIGIN= BRUKER
##OWNER= Administrator
$$ 1.72 TOPSPIN		Version 2.1
$$ 2012-08-03 00:38:58.093 -0500  Administrator@TOPSPIN
$$ Compression mode = diff/dup
##.OBSERVE FREQUENCY= 400.02188249412
##.OBSERVE NUCLEUS= ^1H
##.ACQUISITION MODE= SIMULTANEOUS (DQD)
##.ACQUISITION SCHEME= undefined
##.AVERAGES= 8
##.DIGITISER RES= 22
##SPECTROMETER/DATA SYSTEM= spect
##.PULSE SEQUENCE= zg30
##.SOLVENT NAME= COFFEE_meoh
##.SHIFT REFERENCE= INTERNAL, COFFEE_meoh, 1, 14.98509
##AUDIT TRAIL= $$ (NUMBER, WHEN, WHO, WHERE, PROCESS, VERSION, WHAT)
$$ ##TITLE= Audit trail, TOPSPIN		Version 2.1
$$ ##JCAMPDX= 5.01
$$ ##ORIGIN= Bruker BioSpin GmbH
$$ ##OWNER= Administrator
$$ $$ C:\Bruker\TOPSPIN/data/COFFEE/nmr/AC1298_ECUAH12110_6615958_p2pXCobptA/10/pdata/1/auditp.txt
$$ ##AUDIT TRAIL=  $$ (NUMBER, WHEN, WHO, WHERE, PROCESS, VERSION, WHAT)
(   1,<2012-08-03 00:38:51.437 -0500>,<Administrator>,<TOPSPIN>,<go>,<TOPSPIN 2.1>,
      <created by zg
	started at 2012-08-03 00:37:44.796 -0500,
	POWCHK enabled, PULCHK disabled,
       configuration hash MD5:
       6B 1B 68 BB D9 2E 58 E2 7F 35 AD 54 07 DF 0E 41
       data hash MD5: 64K
       D5 D7 03 65 61 D7 62 69 51 A7 BA 6C 24 3D 40 C2>)
(   2,<2012-08-03 00:38:54.031 -0500>,<Administrator>,<TOPSPIN>,<proc1d>,<TOPSPIN 2.1>,
      <Start of raw data processing
       efp LB = 0 FT_mod = 6 PKNL = 1 PHC0 = 0 PHC1 = 0 SI = 32K 
       data hash MD5: 32K
       36 62 5B 91 45 66 BD 58 CD 2D B3 C7 5E 4E 30 A1>)
(   3,<2012-08-03 00:38:54.421 -0500>,<Administrator>,<TOPSPIN>,<proc1d>,<TOPSPIN 2.1>,
      <pk PHC0 = 176.7316 PHC1 = 0 
       data hash MD5: 32K
       E8 F2 AE 0D 12 88 57 FF FB 52 30 AC D9 9A 66 7B>)
(   4,<2012-08-03 00:38:54.531 -0500>,<Administrator>,<TOPSPIN>,<proc1d>,<TOPSPIN 2.1>,
      <abs ABSG = 1 
       data hash MD5: 32K
       63 A3 33 8E AC 7F D6 BD E4 45 4C C5 59 D7 11 20>)
(   5,<2012-08-03 00:38:54.562 -0500>,<Administrator>,<TOPSPIN>,<proc1d>,<TOPSPIN 2.1>,
      <abs ABSG = 2 
       data hash MD5: 32K
       50 65 C3 CD 2F DE D5 4E B2 CD DB 5B B7 2F 0B 78>)
(   6,<2012-08-03 00:38:54.593 -0500>,<Administrator>,<TOPSPIN>,<proc1d>,<TOPSPIN 2.1>,
      <abs ABSG = 3 
       data hash MD5: 32K
       76 35 FF FF BD 5B 36 92 41 62 0B 78 EE 79 6A E2>)
(   7,<2012-08-03 00:38:54.609 -0500>,<Administrator>,<TOPSPIN>,<proc1d>,<TOPSPIN 2.1>,
      <abs ABSG = 4 
       data hash MD5: 32K
       C9 CC BF 94 1A F9 D8 CF CF E4 20 98 33 53 EC 9C>)
(   8,<2012-08-03 00:38:54.640 -0500>,<Administrator>,<TOPSPIN>,<proc1d>,<TOPSPIN 2.1>,
      <abs ABSG = 5 
       data hash MD5: 32K
       31 F5 20 A1 7F 31 0F 32 05 9F 57 6D 97 A2 61 0B>)
$$ ##END=
$$ 
$$ $$ hash MD5
$$ $$ B8 1D 2D 80 01 1C 2E EC C7 06 90 0C BE B5 90 27
##$RELAX= 
##$RELAX= 
##$RELAX= 
##$RELAX= 
##$RELAX= 
##$RELAX= 
##$RELAX= 
$$ Bruker specific parameters
$$ --------------------------
$$ [...]
150 150 150 150 150 150 150 150
##$TP07= 0
##$TPNAME0= <>
##$TPNAME1= <>
##$TPNAME2= <>
##$TPNAME3= <>
##$TPNAME4= <>
##$TPNAME5= <>
##$TPNAME6= <>
##$TPNAME7= <>
##$TPOAL= (0..7)
0.5 0.5 0.5 0.5 0.5 0.5 0.5 0.5
##$TPOFFS= (0..7)
0 0 0 0 0 0 0 0
##$TUNHIN= 0
##$TUNHOUT= 0
##$TUNXOUT= 0
##$USERA1= <user>
##$USERA2= <user>
##$USERA3= <user>
##$USERA4= <user>
##$USERA5= <user>
##$V9= 5
##$VALIST= <valist>
##$VCLIST= <CCCCCCCCCCCCCCC>
##$VD= 0
##$VDLIST= <DDDDDDDDDDDDDDD>
##$VPLIST= <PPPPPPPPPPPPPPP>
##$VTLIST= <TTTTTTTTTTTTTTT>
##$WBST= 1024
##$WBSW= 4
##$XGAIN= (0..3)
0 0 0 0
##$XL= 0
##$YL= 0
##$YMAX_a= 481603
##$YMIN_a= -629704
##$ZGOPTNS= <>
##$ZL1= 120
##$ZL2= 120
##$ZL3= 120
##$ZL4= 120
##$ABSF1= 14.98509
##$ABSF2= -5.573092
##$ABSG= 5
##$ABSL= 3
##$ALPHA= 0
##$AQORDER= 0
##$ASSFAC= 0
##$ASSFACI= 0
##$ASSFACX= 0
##$ASSWID= 0
##$AUNMP= <proc_prof1d_extract_pilot.lims>
##$AXLEFT= 0
##$AXNAME= <>
##$AXNUC= <1H>
##$AXRIGHT= 0
##$AXTYPE= 0
##$AXUNIT= <>
##$AZFE= 0.1
##$AZFW= 0.1
##$BCFW= 0
##$BC_mod= 0
##$BYTORDP= 0
##$COROFFS= 0
##$CY= 15
##$DATMOD= 1
##$DC= 0
##$DFILT= <>
##$DTYPP= 0
##$F1P= 0
##$F2P= 0
##$FCOR= 0.5
##$FTSIZE= 32768
##$FT_mod= 6
##$GAMMA= 0
##$GB= 0
##$INTBC= 1
##$INTSCL= 1
##$ISEN= 128
##$LB= 0
##$LEV0= 0
##$LPBIN= 0
##$MAXI= 10000
##$MC2= 0
##$MEAN= 0
##$ME_mod= 0
##$MI= 0
##$NCOEF= 0
##$NC_proc= -8
##$NLEV= 6
##$NOISF1= 0
##$NOISF2= 0
##$NSP= 0
##$NTH_PI= 0
##$NZP= 0
##$OFFSET= 14.98509
##$PC= 1
##$PHC0= 176.7316
##$PHC1= 0
##$PH_mod= 1
##$PKNL= yes
##$PPARMOD= 0
##$PPDIAG= 0
##$PPIPTYP= 0
##$PPMPNUM= 2147483647
##$PPRESOL= 1
##$PSCAL= 4
##$PSIGN= 0
##$PYNMP= <proc.py>
##$REVERSE= no
##$SF= 400.02
##$SI= 32768
##$SIGF1= 0
##$SIGF2= 0
##$SINO= 400
##$SIOLD= 32768
##$SPECTYP= <>
##$SREGLST= <1H.CDCl3>
##$SSB= 0
##$STSI= 32768
##$STSR= 0
##$SW_p= 8223.68421052631
##$SYMM= 0
##$S_DEV= 0
##$TDeff= 65536
##$TDoff= 0
##$TI= <>
##$TILT= no
##$TM1= 0
##$TM2= 0
##$TOPLEV= 0
##$USERP1= <user>
##$USERP2= <user>
##$USERP3= <user>
##$USERP4= <user>
##$USERP5= <user>
##$WDW= 1
##$XDIM= 32768
##$YMAX_p= 463937488
##$YMIN_p= -658432
##$CURPLOT= <Network HP LaserJet P1505>
##$CURPRIN= <$Network HP LaserJet P1505>
##$DFORMAT= <normdp>
##$LAYOUT= <+/1D_H.xwp>
##$LFORMAT= <normlp>
##$PFORMAT= <normpl>
##$SURQMSG= 1
$$ End of Bruker specific parameters
$$ ---------------------------------
##NTUPLES= NMR SPECTRUM
##VAR_NAME=  FREQUENCY,     SPECTRUM/REAL,   SPECTRUM/IMAG
##SYMBOL=    X,             R,               I
##VAR_TYPE=  INDEPENDENT,   DEPENDENT,       DEPENDENT
##VAR_FORM=  AFFN,          ASDF,            ASDF
##VAR_DIM=   32768,         32768,           32768
##UNITS=     HZ,            ARBITRARY UNITS, ARBITRARY UNITS
##FACTOR=    0.250966925370066, 1,           1
##FIRST=     8223.43324360094, 59312,        -55006
##LAST=      0,             -16194,          -226637
##MIN=       0,             -658432,         0
##MAX=       8223.43324360094, 463937488,    0
$$ Real data points
##PAGE= N=1
##DATA TABLE= (X++(R..R)), XYDATA
$$ [...]
19480a38874j47770g6096b5628j93726a08326B14478b62519g3776k4423l06528
$$ -138874 -286644 -76096 -25628 -219354 -108326 214478 -262519 -73776 -98199 -404727
19470d04727f1973B1836c6416G8312a55709e6695k08284C5656c7951j8998E3596
$$ -404727 -61973 21836 -36416 78312 -155709 -56695 -264979 35656 -37951 -56949 53596
19458E1577A9798b05718A09640R967B3433a75023l7310o2096A48056d1740m341
$$ 51577 19798 -205718 109640 119607 23433 -175023 -212333 -274429 148056 -41740 -46081
19447d6081n5782j8140C307K53570b47409a9485C5228b86724P2286B9727M2127
$$ -46081 -101863 -120003 3307 256877 -247409 -19485 35228 -286724 -214438 29727 71854
19436G1854L7663J12595a3187j00171r5334l1020a13462J3916A34113j6676E739
$$ 71854 109517 222112 -13187 -113358 -208692 -239712 -113462 -99546 134113 117437 5739
19424b65080g3783N621i731j24780a864o958A88068c6357j3314j50140k22274
$$ -265080 -73783 -68162 -9731 -134511 -1864 -8822 188068 -36357 -49671 -199811 -422085
19413d22085A9902J48842b00076N2777H5114I506b11743f3943j04613e1086K5437
$$ -422085 19902 168744 -200076 -147299 85114 9506 -211743 -63943 -168556 -51086 -25649
19402b5649N491j67117l4757g472B07499b84228P6671N9366r2864E8740b35385
$$ -25649 -20158 -187275 -222032 -7472 207499 -284228 -207557 -148191 -241055 58740 -235385
19390A4531f9553b8472k48516a1235A11890L0869D2286a7033l6946j25382G1260
$$ 14531 -69553 -28472 -276988 -11235 111890 142759 42286 -17033 -53979 -179361 71260
19378D2796a13874k79549A53971d3107q9253B1289K06158b20648e6004l20233
$$ 42796 -113874 -393423 153971 -43107 -132360 21289 227447 -220648 -56004 -376237
19368c76237D4308b82403H7237N1785J23238f825j38757d7638p06F466A45c8899
$$ -376237 44308 -282403 87237 139022 262260 -6825 -145582 -47638 -48344 6466 145 -38899
19355e7140A25911e4375i100k68890A66491O35h1586A06338O9834j8797a33364
$$ -57140 125911 -54375 -9100 -277990 166491 167126 -81586 106338 176172 157375 -133364
19343a28717k31467a5765j62098g6300I1061e6753q4325I286a69479A26319c7899
$$ -128717 -360184 -15765 -177863 -76300 91061 -56753 -141078 9286 -169479 126319 -37899
19331G3212O8021a55684B5721R5548c1892m1709j31519d9136m5365c0906A16440
$$ 73212 141233 -155684 25721 121269 -31892 -73601 -205120 -49136 -94501 -30906 116440
19319a72330r0882a11666j81767A52820B2906M4071a37139d8617A86732B7501
$$ -172330 -263212 -111666 -293433 152820 22906 66977 -137139 -48617 186732 27501
19308A37100a04170j70353c122j7285A57844c73507a35187a9746m4633k46582
$$ 137100 -104170 -274523 -3122 -20407 157844 -373507 -135187 -19746 -64379 -310961
19298c10961g9571n9902c3848j87417F1506e7515p5174A32649b45489J03790E2953
$$ -310961 -79571 -139473 -33848 -221265 61506 -57515 -132689 132649 -245489 -141699 52953
19286a67469D4076a80689j401B49757d2529o2690k82241A31569b78274R4596A03029
$$ -167469 44076 -180689 -182090 249757 -42529 -105219 -387460 131569 -278274 -183678 103029
19274a489I0438Q4815m8622K7208a89875r1151A65602b48418R4266j35288K232
$$ -1489 90438 175253 126631 153839 -189875 -281026 165602 -248418 -154152 -289440 -287208
19263b87208C5107e338k5823j20862c5069j62031m972A43883c85685C8225J52364
$$ -287208 35107 -5338 -31161 -152023 -35069 -197100 -202072 143883 -385685 38225 190589
19252A90589a20085A6443R8055J67912b10385J02868C9384R9515b0895j68640
$$ 190589 -120085 16443 114498 282410 -210385 -107517 39384 138899 -20895 -189535
19242a89535l9661g7168j60152A4623g5657j8708k64282E0907a18346C6659b22537
$$ -189535 -229196 -77168 -237320 14623 -75657 -94365 -358647 50907 -118346 36659 -222537
19230A1398e156j21426I0080a70465B11976a38302G2272b70255E101P636K6506
$$ 11398 -5156 -126582 90080 -170465 211976 -138302 72272 -270255 5101 12737 39243
19219C9243J73025E1742k4724b89525a9579j88273j40578J57502o034n3233L3475
$$ 39243 212268 51742 27018 -289525 -19579 -207852 -348430 -190928 -196962 -250195 -216720
19208b16720a1034j55903j18974O3594K4840B44126i4039j54651a8017B50961
$$ -216720 -11034 -166937 -285911 -222317 -197477 244126 -94039 -248690 -18017 250961
19197b68635a8452l18090f3457A24077m8602q985C105a30421H8615b33793R756
$$ -268635 -18452 -336542 -63457 124077 75475 66490 3105 -130421 88615 -233793 -224037
19186b24037B4340l72o435K18126h1939a7796k56616g8143k49839e3469n0139
$$ -224037 24340 23968 17533 235659 -81939 -17796 -274412 -78143 -327982 -53469 -103608
19175a03608M7742J1828a2617j80109N7709e4601C9333d55456b02917A50134E6614
$$ -103608 -55866 -44038 -12617 -192726 -135017 -54601 39333 -455456 -202917 150134 56614
19163A53873Q7607e7835B19209c25268J14152m9614A18244J8445b58528A76437
$$ 153873 241480 -57835 219209 -325268 -211116 -260730 118244 136689 -258528 176437
19152B2769e9001A11217P5214c9785k348q7791I2385L18663C1603c93116d5540
$$ 22769 -59001 111217 186431 -39785 -42133 -129924 92385 411048 31603 -393116 -45540
19140e7202F3169J1651P2340b1609k71854B16512B5151P2220b199H972R4159M5696
$$ -57202 63169 74820 147160 -21609 -293463 216512 25151 97371 -2199 8972 103131 148827
19128A48827b23187i9152H2999f2503j04486p8045c0958j09328M6519A21791d14420
$$ 148827 -223187 -99152 82999 -62503 -166989 -245034 -30958 -140286 -93767 121791 -414420
19116A62127a74659j89466B4937a43897N732k15818d9005k17836A04602A6171
$$ 162127 -174659 -364125 24937 -143897 -138165 -353983 -49005 -266841 104602 16171
19105b5090n3484r3028m3206D24395a3549D8863a65882j6777A34763c25820A25968
$$ -25090 -78574 -171602 -214808 424395 -13549 48863 -165882 -182659 134763 -325820 125968
19093c81241a12679q1346q5664a04959C4803J87402e1780l04461a45217j08280
$$ -381241 -112679 -194025 -279689 -104959 34803 222205 -51780 -356241 -145217 -253497
19083b53497M8802E7892a26437N1707b5160B02019a99071N8534a9249o3887A41811
$$ -253497 -204695 57892 -126437 -74730 -25160 202019 -199071 -140537 -19249 -83136 141811
19071b10566A54456a33133D14153a86721K6188A09222g8616q0467C9373d9119
$$ -210566 154456 -133133 414153 -186721 -160533 109222 -78616 -159083 39373 -49119
19060b19788C22991b21899a9175l4355A11825i9538A9264J57118c58132Q9880
$$ -219788 322991 -221899 -19175 -53530 111825 -99538 19264 176382 -358132 -268252
19050b68252f7020n8928I0552h8272r9922K0837P2240M0055b6921n9058o792j22021
$$ -268252 -67020 -125948 90552 -88272 -188194 -167357 -95117 -55062 -26921 -85979 -92771 -214792
19038b14792A09718b80180J16558j4673q9681a8102j90068R5958m832A4421J98407
$$ -214792 109718 -280180 -163622 -178295 -267976 -18102 -208170 -112212 -117044 14421 212828
19027B12828f8894m9624A78262D7416b39370B30837F4864d6761F886Q2734c12491
$$ 212828 -68894 -118518 178262 47416 -239370 230837 64864 -46761 6886 89620 -312491
19015H2807b6922B91335n9167i0663M0997m1495j01878C13811a87254E1516a08166
$$ 82807 -26922 291335 232168 -90663 -49666 -91161 -193039 313811 -187254 51516 -108166
19003c13391F4784J23571o4025k6117a23154C30287J3831D881i664j46903j26812
$$ -313391 64784 188355 124330 98213 -123154 330287 344118 4881 -9664 -156567 -283379
18992b83379B04421a48221G8410e48C3487i2270a3342k43774N0912e6022j25762
$$ -283379 204421 -148221 78410 -548 33487 -92270 -13342 -257116 -206204 -56022 -181784
18981a81784q8359J13061e3313E9641g4783l40540C04017e339B45107L9818J15572
$$ -181784 -270143 -157082 -53313 59641 -74783 -415323 304017 -5339 245107 284925 400497
18970D00497M90709k33357j22406G3839a54015F9136L99418g4471m9647j10146
$$ 400497 891206 657849 535443 73839 -154015 69136 468554 -74471 -124118 -234264
18960b34264j08302F937a5218A34056A2242f599n2798B45475a62373p3713O2493
$$ -234264 -342566 6937 -15218 134056 12242 -6599 -59397 245475 -162373 -236086 -173593
18949a73593J4726B4679J10574a14422A61941h3819k624k92079a07594j09641
$$ -173593 -158867 24679 135253 -114422 161941 -83819 -86443 -378522 -107594 -217235
18939b17235R9079A31712K59148h6116L1539A49285a14096j04877g3426j15977
$$ -217235 -118156 131712 390860 -86116 -54577 149285 -114096 -218973 -73426 -189403
18929a89403h0142C8528K65050p8885a92748C45819b05576I6104k7539f3961B57659
$$ -189403 -80142 38528 303578 224693 -192748 345819 -205576 96104 68565 -63961 257659
18917h3329n9519c1541o0315l24017A42031J3392M0145a44292A71482c6927G04054
$$ -83329 -142848 -31541 -91856 -415873 142031 155423 195568 -144292 171482 -36927 704054
18905G30588B90030A37286C8792a98750I0882O5890o3963a39674D7793i2722p6303
$$ 730588 290030 137286 38792 -198750 90882 156772 92809 -139674 47793 -92722 -169025
18894a69025B2024a06242C5766a8239j40164q3665R9618j16587B18383a39965
$$ -169025 22024 -106242 35766 -18239 -158403 -242068 -142450 -259037 218383 -139965
18883g3927k38271a07501j6501F5692e3045j59902L4016d6212A63362J08146A3978
$$ -73927 -312198 -107501 -124002 65692 -53045 -212947 -178931 -46212 163362 271508 13978
18871C04632C4566d5623j6317i300A66730a63774D0140b4345j442C7575a23634
$$ 304632 34566 -45623 -61940 -9300 166730 -163774 40140 -24345 -25787 37575 -123634
18859c31520E0709b55291b9988k9321H8661a28611n7652l6689A30561o0627B0628
$$ -331520 50709 -255291 -29988 -59309 88661 -128611 -186263 -222952 130561 69934 20628
18847C69661b38626A3685a22284A99481a6057k29349B4969e3388A12633b10613
$$ 369661 -238626 13685 -122284 199481 -16057 -245406 24969 -53388 112633 -210613
18836A42497m3697c8975o7227I4468b36604A55102a44472n9649k82433B6241b68142
$$ 142497 98800 -38975 -106202 94468 -236604 155102 -144472 -204121 -486554 26241 -268142
18824B73869b17180J7621E5585k2c50122A85177a02167H698J87982H801b59452
$$ 273869 -217180 -199559 55585 55563 -350122 185177 -102167 8698 196680 8801 -259452
18812a6310B09272a08889o4782B04219a07391B45521c6078J64C54440A69266h1788
$$ -16310 209272 -108889 -173671 204219 -107391 245521 -36078 -35914 354440 169266 -81788
18800B7285a08852k0014l00795D0674L17443I5823a84031A10260d6729A12375
$$ 27285 -108852 -128866 -429661 40674 358117 95823 -184031 110260 -46729 112375
18789a74149A92289m373J1731b25137Q7631D7730A7407d56773a71302l6108P1327
$$ -174149 192289 187916 199647 -225137 -137506 47730 17407 -456773 -171302 -207410 -136083
18778a36083J6448A58062B9971a4125l5145A50319a54542O3061l3608M8833A22648
$$ -136083 -119635 158062 29971 -14125 -49270 150319 -154542 -91481 -125089 -76256 122648
18766I9909e9932A03467j5149L8744C5461g3248n1860j09903g3860j20897O8031
$$ 99909 -59932 103467 88318 127062 35461 -73248 -125108 -235011 -73860 -194757 -126726
18755a26726l46046P0240a5670k5097C05415j47996p0349J94a55817f4043A7405
$$ -126726 -472772 -402532 -15670 -40767 305415 157419 87070 87264 -155817 -64043 17405
18743A34919a19314m7233B02437K1043b7748l6333j82553J13276B8677K75520
$$ 134919 -119314 -166547 202437 223480 -27748 -64081 -246634 -133358 28677 304197
18733C04197a12949Q898J6883j2252B5959G191a05738F2707Q765b00590j70890
$$ 304197 -112949 -104051 -87168 -99420 25959 7191 -105738 62707 71472 -200590 -371480
18722c71480D27347a8207j38436j1284K3298k273c6408p1135q6799g6551l004
$$ -371480 427347 -18207 -156643 -167927 -144629 -146902 -36408 -107543 -194342 -76551 -79555
18711g9555E9568a34651j7367O6554A08157f2226P883k0796j20231i5056B20375
$$ -79555 59568 -134651 -152018 -85464 108157 -62226 -54343 -75139 -195370 -95056 220375
18699a64872D4407b39859B2907A0762c56296a39058c4233C29502e1055p6631D6114
$$ -164872 44407 -239859 22907 10762 -356296 -139058 -34233 329502 -51055 -127686 46114
18687b84474B67318h7785a7704q2620r9781K5913P9002q7805h6624j89019O6631
$$ -284474 267318 -87785 -17704 -100324 -200105 -174192 -95190 -182995 -86624 -275643 -209012
18676b09012b5060k17822C05063j31968a03281r3381B47490e3665B34815b74259
$$ -209012 -25060 -242882 305063 173095 -103281 -196662 247490 -53665 234815 -274259
18665f7660n6113E5248b38540E5989M2462O4595c72094J00845C233D49d6138m6086
$$ -67660 -123773 55248 -238540 55989 98451 163046 -372094 -271249 3233 449 -46138 -92224
18653i2224n5132p7744N0485A15945f9285D1141a36699k41497k2915e8134C7825
$$ -92224 -147356 -225100 -174615 115945 -69285 41141 -136699 -378196 -401111 -58134 37825
18641e1290l4722B84066p4332a15831B15902a17862a7352j06803c0363A39479
$$ -51290 -86012 284066 209734 -115831 215902 -117862 -17352 -124155 -30363 139479
18630a21990q2022A02234m0236g9439D8074k1635a39940C5656e575o9012b1240
$$ -121990 -204012 102234 61998 -79439 48074 26439 -139940 35656 -5575 -74587 -21240
18618h5468M0144k39959J23482p8916g4466l2291e785C1347J34186k9925B2272
$$ -85468 -45324 -285283 -161801 -240717 -74466 -106757 -5785 31347 165533 135608 22272
18606b38358J4011C14207a47536J2765g179p268A398R1364b51621G8865J13440
$$ -238358 -224347 314207 -147536 -134771 -7179 -14447 1398 92762 -251621 78865 192305
18595A92305d65856D752M7659c35848b2053k6482E9952c2887j79767A23273b94340
$$ 192305 -465856 4752 52411 -335848 -22053 -48535 59952 -32887 -212654 123273 -294340
18583b3553j05002j53260j8878B6414a71867O6921k2905K6746k4296o7020I5986
$$ -23553 -128555 -281815 -300693 26414 -171867 -104946 -127851 -101105 -125401 -192421 95986
18571b02357i559j41859e7111l01645b6306C0603D535J29122F1328B5231L1811
$$ -202357 -9559 -151418 -57111 -358756 -26306 30603 4535 133657 61328 25231 57042
18560E7042b72841c8570A3833a02305M9782B08328N1298h7455d1341Q885B07470
$$ 57042 -272841 -38570 13833 -102305 -52523 208328 259626 -87455 -41341 -32456 207470
18548b51244H9494j8943b6251n9966k3882A0278R191a8473C5307R556b02189A96433
$$ -251244 89494 70551 -26251 -86217 -110099 10278 19469 -18473 35307 44863 -202189 196433
18535D6274c64164a24699j69500a01669b5315o4534j6075H8658h2674g066G1935
$$ 46274 -364164 -124699 -294199 -101669 -25315 -89849 -105924 88658 -82674 -7066 71935
18523A12099E818K1125G922b7262l09869L0445a29156N2847B06900a3235j97199
$$ 112099 5818 26943 7922 -27262 -337131 -306686 -129156 -76309 206900 -13235 -210434
18512b10434A49438j686l9220j0395b4573k7938A9717a83468B98610h0307m251
$$ -210434 149438 147752 108532 98137 -24573 -52511 19717 -183468 298610 -80307 -84558
18501h4558C9366c010j84824A67934q2838a4268j13347A83043L6159d25067a3810
$$ -84558 39366 -3010 -187834 167934 85096 -14268 -127615 183043 219202 -425067 -13810
18489h8170H9248C0648b04667P4998q6403A94874a17300B92157I4663J2272f8027
$$ -88170 89248 30648 -204667 -129669 -216072 194874 -117300 292157 94663 106935 -68027
18477A78319b47653F2264J81447c40680A38807a74835D1088a89551N8983e0586
$$ 178319 -247653 62264 243711 -340680 138807 -174835 41088 -189551 -130568 -50586
18466c5667B03735b66099A81020a27651k04922Q2616N1577B09276h3417j4094
$$ -35667 203735 -266099 181020 -127651 -332573 -249957 -198380 209276 -83417 -97511
18456i7511k92020A3137a46786b1694B93311A19997M8760c15804J16995g3191
$$ -97511 -389531 13137 -146786 -21694 293311 119997 168757 -315804 -198809 -73191
18445i0081n3810K901d743j92418P3528l70942E7480K74589a48250N1871j13618
$$ -90081 -143891 -140990 -4743 -197161 -123633 -494575 57480 332069 -148250 -96379 -209997
18434b09997A08718n1266g9125G0883e4180A57680L0806o313a21850B3080b09382
$$ -209997 108718 57452 -79125 70883 -54180 157680 188486 182173 -121850 23080 -209382
18422A81033b56219H4832a3539A61360b639F8571a41310j10923c6317A73561a3976
$$ 181033 -256219 84832 -13539 161360 -2639 68571 -141310 -252233 -36317 173561 -13976
18410A064Q4669b17891a06571D6824M907O4088B5867N3557f8559A7302R6678a81899
$$ 1064 85733 -217891 -106571 46824 51731 115819 25867 79424 -68559 17302 113980 -181899
18397b20613f2695G8389g7190D9450J31680L5865p9983b0746k88763G3770b2452
$$ -220613 -62695 78389 -77190 49450 181130 216995 137012 -20746 -309509 73770 -22452
18385c25672b1244r4714A44539D8762A1140b62584j34226B94225a10100c9384
$$ -325672 -21244 -115958 144539 48762 11140 -262584 -396810 294225 -110100 -39384
18374d4876B16726B2978N9057c72741a01264b0706E9839c8835k1315A76345b19994
$$ -44876 216726 22978 82035 -372741 -101264 -20706 59839 -38835 -60150 176345 -219994
18362c3946D1812a79550C10J59409b68941b2224o7924B20531m6706A7099J44521
$$ -33946 41812 -179550 310 159719 -268941 -22224 -90148 220531 173825 17099 161620
18351A61620a28989J806m9691a8078m4371D6720a51906K6917k01708a43397B39684
$$ 161620 -128989 -127183 -176874 -18078 -62449 46720 -151906 -124989 -326697 -143397 239684
18339B6155a97040E4587a1448l96291L2381c7279A40530b10589j18938J20012
$$ 26155 -197040 54587 -11448 -407739 -375358 -37279 140530 -210589 -329527 -209515
18329b09515k9827h5065B29211m0847B9810L13062j61216g6207A32231a67624
$$ -209515 -239342 -85065 229211 188364 29810 342872 181656 -76207 132231 -167624
18318d6142l02257L6537B69535a81449K2835A83921M7104C2054g2264I6521h5265
$$ -46142 -348399 -311862 269535 -181449 -158614 183921 231025 32054 -72264 96521 -85265
18306A35419c2936p9323A3005b81896a3757j43439k053M0023l35460C95325h3353
$$ 135419 -32936 -112259 13005 -281896 -13757 -157196 -159249 -119226 -454686 395325 -83353
18294f8314A50938k2642c15314a04928b2692j89991P7206J4269j35758F5233a6969
$$ -68314 150938 128296 -315314 -104928 -22692 -212683 -135477 -121208 -256966 65233 -16969
18282b16839A09955B2032a780B10658b3l52750E7517K24753A02069a25609n0786
$$ -216839 109955 22032 -1780 210658 -23 -352773 57517 282270 102069 -125609 -176395
18271a76395B84865a58395o2462i517C05598I8040C6400J27691m0331f8865A43820
$$ -176395 284865 -158395 -220857 -9517 305598 98040 36400 164091 123760 -68865 143820
18259a36729q0995D6717a42201G5691b13637L2407G5377a86505D1529d92794b19983
$$ -136729 -217724 46717 -142201 75691 -213637 -181230 75377 -186505 41529 -492794 -219983
18247a56440j05170H1635a46890k48731j02551B15063g0885A71386a59444p3289
$$ -156440 -261610 81635 -146890 -395621 -498172 215063 -70885 171386 -159444 -232733
18237b32733j90316a64D9377O4848m9895h5777L2447k8043A20876g3082E8084
$$ -232733 -423049 -164 49377 114225 64330 -85777 -53330 -81373 120876 -73082 58084
18225b07632A73803P0514a455D5820N3436M3798a88147j28286a02322b1670A05261
$$ -207632 173803 244317 -1455 45820 99256 143054 -188147 -316433 -102322 -21670 105261
18213B2420J26711l8032e0455H5862M9428J34348J65053A11471b266A56022c15435
$$ 22420 149131 111099 -50455 85862 135290 269638 434691 111471 -2266 156022 -315435
18201b4237j86479A9358L36760D6381J64708m3153c2504B21443a63142J1153K297
$$ -24237 -210716 19358 356118 46381 211089 167936 -32504 221443 -163142 -151989 -149692
18190a49692j52769B17297B329L66709A44411c59024b7019j662b20A07382a31617
$$ -149692 -302461 217297 2329 369038 144411 -359024 -27019 -28681 -220 107382 -131617
18178c7409k19960a18860o3250h7793F0808h685r9986M9476p8461G8193J3053
$$ -37409 -257369 -118860 -182110 -87793 60808 -8685 -108671 -59195 -137656 78193 91246
18167I1246a13202A43417M1090b14601g230n2369q8659G1556L3537b07721k13183
$$ 91246 -113202 143417 184507 -214601 -7230 -59599 -148258 71556 105093 -207721 -420904
18156d20904c7231n6787A69358e6765B09780j03210J48704M2001j16986f8536
$$ -420904 -37231 -94018 169358 -56765 209780 106570 255274 297275 180289 -68536
18145b66282E5097b5836G8764j9692b90867C53148A36101o728f9708p4565G3475
$$ -266282 55097 -25836 78764 59072 -290867 353148 136101 129373 -69708 -144273 73475
18133A24350b06570j15142A7683P7766j1072O7246D3610i9011K143F3175b60653
$$ 124350 -206570 -321712 17683 95449 84377 151623 43610 -99011 -96868 63175 -260653
18121a69380A01300a86169m1700c7723D42682e1699a0478G7010h6283A13014n3216
$$ -169380 101300 -186169 -227869 -37723 442682 -51699 -10478 77010 -86283 113014 59798
18110E9798a7541k32803C0489c26782J47883B66809q0784I0408c39151b4842k75241
$$ 59798 -17541 -250344 30489 -326782 -178899 266809 186025 90408 -339151 -24842 -300083
18099c00083E8150O2899i5594c3320q5585G7745b21636P7978C84374e338B7582
$$ -300083 58150 121049 -95594 -33320 -118905 77745 -221636 -143658 384374 -5338 27582
18087a4244G2185c242D5104a8291A37961a82580l8134A9158K1669a0663p0146
$$ -14244 72185 -3242 45104 -18291 137961 -182580 -220714 19158 40827 -10663 -80809
18076h0809C976J56447K2749k3611l7241a38129B87878A22228J11194G7032d28944
$$ -80809 3976 160423 183172 159561 122320 -138129 287878 122228 233422 77032 -428944
18064B95271c5035A14596J31990b15621j03199A17664n8538G208J87736a50464
$$ 295271 -35035 114596 246586 -215621 -318820 117664 59126 7208 194944 -150464
18053b78629c1664k76379J33261I4158D96Q4054a80991Q192D6991a74500B58211
$$ -278629 -31664 -308043 -174782 94158 496 84550 -180991 -172799 46991 -174500 258211
18041C13483c1120D74550E599d1753o2928A70588B6803e937k86967E24302q6485
$$ 313483 -31120 474550 5599 -41753 -104681 170588 26803 -5937 -292904 524302 437817
18030D37817C6143K38802g7745c2415E6802b12743A52983M5080f3427B9695e6442
$$ 437817 36143 274945 -77745 -32415 56802 -212743 152983 198063 -63427 29695 -56442
18018b21454F2330C0192a21583r08L4068A97100b87367a04715B49889N9439E8410
$$ -221454 62330 30192 -121583 -122491 -88423 197100 -287367 -104715 249889 309328 58410
18006a56466d101j36423j67058a27962P66m0048G7360O0703j4758h8128H0488
$$ -156466 -4101 -140524 -307582 -127962 -127196 -167244 77360 138063 123305 -88128 80488
17994b03617n9804A8197K1786b11530A25436d2842k0388j52582f2561m32069A06632
$$ -203617 -263421 18197 39983 -211530 125436 -42842 -63230 -215812 -62561 -494630 106632
17982D8456b63428o2426A52393E047P484J54089E5899K0984a42156b2546F7388
$$ 48456 -263428 -325854 152393 5047 12531 166620 55899 76883 -142156 -22546 67388
17970a15636m8853e1138j41668c3759k1919G4621c38536g1147m7559F5570a7649
$$ -115636 -164489 -51138 -192806 -33759 -55678 74621 -338536 -71147 -118706 65570 -17649
17958c1349r3940A13994C447R2147h3937a0908B3712a5797o106p7710i612j71050
$$ -31349 -125289 113994 3447 95594 -83937 -10908 23712 -15797 -21903 -99613 -9612 -180662
17946a80662e2465D3425J69875M4048C8560c2628B20006d813C97655a14496K9556
$$ -180662 -52465 43425 213300 257348 38560 -32628 220006 -4813 397655 -114496 -84940
17935h4940I5918J4584d5095A80378a42687o0315h002k32976c3941j98629C28258
$$ -84940 95918 110502 -45095 180378 -142687 -203002 -8002 -240978 -33941 -232570 328258
17923b2262A07134D2537f6421j45112i7544B39389i1917j43218a0650L306E9796
$$ -22262 107134 42537 -66421 -211533 -97544 239389 -91917 -235135 -10650 -7344 59796
17911a1067A49291h8480G6346b47081A14889d885C02254E8127J1576R7a12039
$$ -11067 149291 -88480 76346 -247081 114889 -4885 302254 58127 69703 69800 -112039
17899A67927F948K7312J23188K00490A8360J26337h0529j76871O9542c0474G2009
$$ 167927 6948 34260 157448 357938 18360 144697 -80529 -257400 -187858 -30474 72009
17887F7914R5742O6779f605j29615k30212B71419B8762J38740b9523D1116j7829
$$ 67914 163656 230435 -6605 -136220 -366432 271419 28762 167502 -29523 41116 23287
17876B3287M4940a84388E9951J75709a14422A44501e4236C87254a61785C55799
$$ 23287 68227 -184388 59951 235660 -114422 144501 -54236 387254 -161785 355799
17865g767E60408B29024j09792a47842K724A68156i1675m121A7302K37838n9411
$$ -7767 560408 229024 119232 -147842 -145118 168156 -91675 -95796 17302 255140 195729
17854A95729c1939E00235j85151E6162J67013A03854M8927c8373j0274q2256j56024
$$ 195729 -31939 500235 315084 56162 223175 103854 152781 -38373 -48647 -130903 -286927
17843b86927f3833J9970A38851F8561M4223n6197a54123O7719K0011G6007L9451
$$ -286927 -63833 -43863 138851 68561 112784 56587 -154123 -86404 -66393 76007 115458
17832A15458d8407c894G7295b6104I0642D3475o754E906b49997d5417E9696c8610
$$ 115458 -48407 -3894 77295 -26104 90642 43475 36721 5906 -249997 -45417 59696 -38610
17819a25803A85636p2434P1386D9889K37757E0992h972j03934A97502a25663A98270
$$ -125803 185636 113202 184588 49889 287646 50992 -8972 -112906 197502 -125663 198270
17807a35932A06549M789R4309a83975B7841K92045A23696b11992A78019h7572
$$ -135932 106549 111338 205647 -183975 27841 319886 123696 -211992 178019 -87572
17796b00966A23b3927j43949B226K63085A22150C7374K07561h5832j97522D7687
$$ -200966 123 -23927 -167876 2226 265311 122150 37374 244935 -85832 -283354 47687
17784A07230J80222A13409J00504I828b4490A94136h8400o433J2408B64536o6477
$$ 107230 287452 113409 213913 9828 -24490 194136 -88400 -94833 -82425 264536 198059
17773A98059c3003B99490J49646j91974f4674D19097E9183h6019r2479m6681A01647
$$ 198059 -33003 299490 449136 257162 -64674 419097 59183 -86019 -178498 -225179 101647
17761C72975j12929g9972m3699K499B40696a01255F8222J79993d4410k31357A36239
$$ 372975 260046 -79972 -123671 -121172 240696 -101255 68222 248215 -44410 -275767 136239
17749A37602e6251A69163b27204f8328C0326K51356B0341a70576O864B48514a4068
$$ 137602 -56251 169163 -227204 -68328 30326 281682 20341 -170576 -163712 248514 -14068
17737B20581q559n3778c2615A62645J5594b33510J11960C70134a3896q1009B00961
$$ 220581 212022 158244 -32615 162645 178239 -233510 -121550 370134 -13896 -94905 200961
17725C5821J70584J01084b74098A68129c1324Q544B51969o0465P4956i8006J3544
$$ 35821 206405 307489 -274098 168129 -31324 -22780 251969 191504 266460 -98006 -84462
17714h4462B8960a12849N5256A43969D6269J0571J38J71777A08150k9622J37011
$$ -84462 28960 -112849 -57593 143969 46269 56840 56978 228755 108150 78528 215539
17703B15539L8672E2469O8996A0959a16429A03152O3699b8017G0178a2091q5610
$$ 215539 254211 52469 121465 10959 -116429 103152 166851 -28017 70178 -12091 -97701
17692i7701G8415A6035M0003c56833A17429n1294h5415g07j72705l5362l1397
$$ -97701 78415 16035 56038 -356833 117429 66135 -85415 -707 -173412 -208774 -240171
17681b40171C08988b16902A08913C90a2713C17043D0923J04698d4304B31601a02582
$$ -240171 308988 -216902 108913 390 -12713 317043 40923 145621 -44304 231601 -102582
17669G4703i9835B53696h3253C75980j49910b47645J07087k08630D61757I484
$$ 74703 -99835 253696 -83253 375980 226070 -247645 -140558 -349188 461757 9484
17658b89625I6609a2748B98545E4335o302c09260A17449m7139b2154A45730a69637
$$ -289625 96609 -12748 298545 54335 48033 -309260 117449 70310 -22154 145730 -169637
17646E3372g2067B24460D6552J61686c0235n2589k76101e0799B12952a1602C79565
$$ 53372 -72067 224460 46552 208238 -30235 -82824 -358925 -50799 212952 -11602 379565
17634H173L78449F6226J26505J47449M7802M3935H7645i989A9270J88537r4550
$$ 8173 386622 66226 192731 340180 387982 431917 87645 -9989 19270 207807 113257
17623A13257D7470P1091b78181A02523L93240g4456A18927Q0050K2037H5363A8976
$$ 113257 47470 118561 -278181 102523 495763 -74456 118927 198977 221014 85363 18976
17611b71181E7627a97015I2512J06190e0847E7228k2718L78239b5228A00862D1688
$$ -271181 57627 -197015 92512 198702 -50847 57228 34510 412749 -25228 100862 41688
17599E55304E8253L4615a6511A40557J56202E1787L02119b3342A13975a11971
$$ 555304 58253 92868 -16511 140557 296759 51787 353906 -23342 113975 -111971
17588i3734A26107b353A42402N883J53831C4167N22411I5634L2220O9923n7662
$$ -93734 126107 -2353 142402 148285 302116 34167 556578 95634 127854 197777 140115
17577A40115a97548C94566b6930A62105K64650B05237Q4431o5131P6269A3577
$$ 140115 -197548 394566 -26930 162105 426755 205237 289668 224537 300806 13577
17566B46025a13503A1821J20540O8623J7767h7077c3337C41209F3199P1349A3093
$$ 246025 -113503 11821 132361 200984 218751 -87077 -33337 341209 63199 134548 13093
17554A4528L42236q2704H5587K34736N8524A79531J01174h379j40831B90148K3106
$$ 14528 356764 274060 85587 320323 378847 179531 280705 -8379 -149210 290148 313254
17543C13254N2326Q5677A05078K05500E8422J90631J7967O9103A61944J45576
$$ 313254 365580 451257 105078 310578 58422 249053 267020 336123 161944 307520
17533C07520L94473l41532j56258N2696j08437L24860J36788L39234J07524L83091
$$ 307520 701993 360461 204203 256899 148462 473322 610110 949344 1056868 1439959
17523A439959k58452m37670n1720K92862j99983j37983l06907M0114K76663A88429
$$ 1439959 1181507 743837 692117 984979 784996 647013 340106 380220 656883 188429
17512C68328J02557J70494J07153N80639K90953p55419K10925D99411J1031p0588
$$ 368328 470885 641379 748532 1329171 1620124 864705 1075630 499411 510442 439854
17502D39854n3771j43693E5219M70885n8890j23206j04176K56349g9357I1190
$$ 439854 386083 242390 55219 526104 467214 344008 239832 496181 -79357 91190
17491B75104A00122R4125Q473L36458B35172H1865N2011N7136L46426i734D96158
$$ 275104 100122 194247 202720 539178 235172 81865 133876 191012 537438 -9734 496158
17479E67145B05359J32651o3957J04323J57539A31645K47350j00194I3107D6454
$$ 567145 205359 338010 274053 378376 535915 131645 378995 278801 93107 46454
17468A32937K85676b8772I7178K67181j16137B7807J97416n7578l1054J38335
$$ 132937 418613 -28772 97178 364359 248222 27807 225223 167645 136591 274926
17458B74926M1086j4528E1364L82717A85067K99362B39038O8919a1205n28E12665
$$ 274926 316012 301484 51364 434081 185067 484429 239038 307957 -11205 -11733 512665
17446E28160p9127L37001B46441f4167C14812K21663A03945L63660K3742k36003
$$ 528160 449033 786034 246441 -64167 314812 536475 103945 467605 491347 255344
17436B55344J32437R5270n2665q5490O2404j03233j8416H4816a49651E05319A14609
$$ 255344 387781 483051 430386 344896 407300 304067 285651 84816 -149651 505319 114609
17424B32001m8451J44095j48007m2522N76557B46951k6767g3979A66959L51535
$$ 232001 183550 327645 179638 137116 713673 246951 220184 -73979 166959 518494
17414E18494j51842M6383k04851L64794B66005Q7795L6534o7201j59256K03608
$$ 518494 366652 413035 208184 572978 266005 353800 390334 323133 163877 367485
17404C67485Q981A17402D9093L57801j97903J19820A12790K46870K5124A17400
$$ 367485 376466 117402 49093 406894 208991 328811 112790 359660 384784 117400
17393A77828J88752j5273d8803C17278J36327A57760K11808G31K29041F6792J40564
$$ 177828 366580 351307 -48803 317278 453605 157760 369568 731 229772 66792 207356
17382B07356K67420A84458J8187E5181J56758Q6588j07955N6473j15288B1520
$$ 207356 474776 184458 202645 55181 211939 298527 190572 247045 131757 21520
17371A04716J41341R8027q3863J1755j12943J80813J19267F7845K92603R8600
$$ 104716 246057 344084 260221 271976 159033 339846 459113 67845 360448 459048
17361D59048j26564E5232J40097O2288j25667K18440M588p8256l858A8186K45987
$$ 459048 332484 55232 195329 257617 131950 350390 354978 276722 272864 18186 264173
17350B64173J36585r5392E0574L35360j84652H7206J87585d1148C81500j72248
$$ 264173 400758 305366 50574 385934 201282 87206 274791 -41148 381500 209252
17340B09252J18971p769j14608K25244J4807j75269K18844j59192I3249J76709
$$ 209252 328223 320454 205846 431090 445897 270628 489472 330280 93249 269958
17330B69958R1085K00520j28975C4621P4624q61J39780N95780C30028c824A99557
$$ 269958 361043 561563 432588 34621 109245 108384 248164 843944 330028 -3824 199557
17318D57264A04559K90979e8754D33080o8598R1280B02625J0580I4071M55527
$$ 457264 104559 395538 -58754 433080 364482 455762 202625 213205 94071 549598
17308E49598B5261K96661a42497A81871J58845L7201b0709F89780k84041j58148
$$ 549598 25261 321922 -142497 181871 340716 377917 -20709 689780 405739 247591
17298B47591M1843o2398J02281J8273p7325L5238J67405N2383B34655L20594m0662
$$ 247591 289434 227036 329317 347590 270265 305503 472908 525291 234655 555249 514587
17287E14587A71630J69725j51177i5258C02112I1570J54496L28748J91868k28206
$$ 514587 171630 341355 190178 -95258 302112 91570 246066 574814 766682 538476
17277E38476q6359j32279j01371k2302K51103J98021B96123m6641J61315E4198
$$ 538476 452117 319838 218467 196165 447268 645289 296123 249482 410797 54198
17266D71584j33037K47834j19905o6402J79422B31011d6842D43610j6530j11814
$$ 471584 338547 586381 466476 400074 579496 231011 -46842 443610 427080 315266
17256C15266p9974H3354K59320j3839r9192M4668L4046J66069J57090j23416d2506
$$ 315266 235292 83354 342674 328835 229643 274311 308357 474426 631516 508100 -42506
17244B72055M0186J11160m889J81406k07301j95152K20706k4342L4784m9872L647
$$ 272055 312241 423401 418512 599918 392617 197465 418171 393829 428613 378741 382388
17233C82388H8879L25420B00656K34762A28521J52677K15081j30514P6896j49749
$$ 382388 88879 414299 200656 435418 128521 281198 496279 365765 442661 292912
17223B92912L7153I8641L29510J00104j52433A43675J24083Q4457N26630k11027
$$ 292912 330065 98641 428151 528255 375822 143675 267758 352215 878845 667818
17213F67818A97567M56749j46662j08220K97979j15448B55407J61088j25024J74085
$$ 667818 197567 654316 507654 399434 697413 581965 255407 416495 291471 465556
17203D65556P7934J0383B28560N08446j81246j22726k0056A63918K37276N2466
$$ 465556 543490 553873 228560 737006 555760 433034 412978 163918 401194 453660
17193D53660J38269M88o0647J15011l101N8216C21032j32956K92767J7009K48023
$$ 453660 591929 592417 531770 646781 643680 701896 321032 188076 480843 497852 745875
17182G45875k39884p3623j0021j6281K4773R6044j43073J74590q5143J4548j1969
$$ 745875 505991 432368 422347 406066 430839 526883 383810 558400 473257 487805 475836
17171D75836o5129K07308j90039m4403J46185J62266j86402L2626j68913N7778
$$ 475836 410707 618015 427976 383573 529758 692024 505622 538248 369335 427113
17161D27113J68874M47027D88392j88101K7835L37750l07705J58734K43768k18484
$$ 427113 595987 1043014 488392 300291 328126 665876 358171 516905 760673 542189
17151E42189A39282J62549L0688K74585C02395L84249k15391L47413k66431J61631
$$ 542189 139282 301831 332519 607104 302395 686644 471253 818666 552235 713866
17141G13866k74192J5712L0757L269j91522R2945J59060J25782j81605J43527
$$ 713866 439674 455386 486143 489412 297890 390835 549895 675677 494072 637599
17131F37599j23510r576K3662J05179M2520J04095A02635M74025k51529N31151
$$ 637599 514089 504513 528175 633354 675874 779969 102635 576660 325131 856282
17121H56282l2064k51305j11568j06869L39034m7748m4076k57748K17466J11680
$$ 856282 824218 572913 461345 354476 693510 645762 601686 343938 561404 673084
17111F73084j2427p4133q6501o4452K34029p0295P4029J84807k98848R4363j88651
$$ 673084 660657 586524 500023 435571 669600 599305 673334 858141 559293 653656 465005
17100D65005M69537l94293j02502L18384J43462k47304j31538M84713L845l06998
$$ 465005 934542 540249 437747 756131 899593 652289 520751 1005464 1009309 702311
17090G02311N8384o5417J72595N2365k2857k49689K65235l8654J19854L4415J0848
$$ 702311 760695 695278 867873 920238 897381 647692 912927 874273 994127 1028542 1039390
17079A039390l57158j19126M61132l07689J30206K61652n09715J05431N7389O4574
$$ 1039390 682232 563106 1024238 716549 846755 1108407 598692 704123 761512 826086
17069H26086J02844J43142k77643N6907r5016l2646L17859m261j07590l455j52427
$$ 826086 928930 1072072 794429 851336 756320 723674 1041533 1037272 929682 926227 773800
17058G73800L62034k86881K15875k29273J02298k26482K60512j83048P9177L9648
$$ 773800 1135834 848953 1064828 835555 937853 711371 971883 788835 868012 907660
17048I07660o0333l9460J70941M39158n79535p82J76685k16283L934J06506m7903
$$ 907660 847327 807867 978808 1417966 838431 837649 1014334 798051 801985 908491 860588
17037H60588J0383L20645m81459K95265j44865j59293M04513j92803J09873l4363
$$ 860588 870971 1191616 710157 1005422 860557 701264 1105777 912974 1022847 988484
17027I88484M8119j00112L93393k87257k19460L49950j12372j19148M30303k59672
$$ 988484 1036603 936491 1329884 1042627 823167 1173117 1060745 941597 1371900 1112228
17017A112228j65886K64852Q2479j68068O6803k1275l68414K89128L11994j91169
$$ 1112228 946342 1211194 1293673 1125605 1192408 1171133 802719 1091847 1403841 1212672
17007A212672m02884N69343J70131o40489M76627j24535J62178o0686J96970k59322
$$ 1212672 809788 1379131 1549262 908773 1385400 1260865 1423043 1362357 1559327 1300005
16997A300005O0440l85701K63769N3841J74940K33245J45489l78303m8495J90247
$$ 1300005 1360445 974744 1238513 1292354 1467294 1700539 1846028 1467725 1419230 1609477
16987A609477k29042o5040o4436k3287K69454O0200M0258K86529j98704r0047
$$ 1609477 1380435 1315395 1250959 1227672 1497126 1557326 1597584 1884113 1685409 1595362
16977A595362K14930j36339m2559Q2853j52426Q651K05752p984l3208j42153K18262
$$ 1595362 1810292 1673953 1631394 1714247 1561821 1570472 1776224 1768240 1735032 1592879 1811141
16966A811141k84010J13388K45207k03178K96365k38721J20753o0233K9434j75761
$$ 1811141 1527131 1640519 1885726 1682548 1978913 1740192 1860945 1800712 1830146 1654385
16956A654385J28051l19703O22773k57641K3266J31875j09409j78659M21797k60419
$$ 1654385 1782436 1462733 2085506 1827865 1851131 1983006 1873597 1694938 2116735 1856316
16946A856316m0433L17549J15436k64032K8655K27652J087K37221k90281J78392
$$ 1856316 1815883 2133432 2248868 1984836 2013491 2241143 2242230 2479451 2189170 2367562
16936B367562m9691K8059K7366k77993K76514r2233j15961K70976k37501j4132
$$ 2367562 2317871 2345930 2373296 2095303 2371817 2279584 2163623 2434599 2197098 2182966
16926B182966K94087k13655L4900L20205o10953P28075j62369k57168J50624J15528
$$ 2182966 2477053 2263398 2298298 2618503 2007550 2735625 2573256 2316088 2466712 2582240
16916B582240J38242j24168l07218K98861M08893n36195Q7768K41322q7221K87380
$$ 2582240 2720482 2596314 2289096 2587957 2996850 2460655 2548423 2789745 2702524 2989904
16906B989904l26065L13198j96582K69145k37771N77360l80781L25077J10121
$$ 2989904 2663839 2977037 2780455 3049600 2811829 3389189 3008408 3333485 3443606
16897C443606j01469q9567P7470j36489K08066J61619j50629L68467p972o9698
$$ 3443606 3342137 3252570 3330040 3193551 3401617 3563236 3412607 3781074 3773102 3703404
16887C703404j55669K71474j63007O7097L67300l10713L65667M24706o72696j29830
$$ 3703404 3547735 3819209 3656202 3723299 4090599 3779886 4145553 4570259 3897563 3767733
16877C767733O19463p5352j45136P6430L4321J07834k54772K41601l463L02285
$$ 3767733 4387196 4311844 4166708 4243138 4277459 4385293 4130521 4372122 4368659 4670944
16867D670944M9800j97132K83819N6100j62531j4193N53501k63170L18460M6468
$$ 4670944 4720744 4523612 4807431 4863531 4701000 4686807 5240308 4977138 5295598 5342066
16857E342066k47556K26601m96200N10254N86904m52309N13199m2851K27758k74381
$$ 5342066 5094510 5321111 4824911 5335165 5922069 5469760 5982959 5940108 6167866 5893485
16847E893485Q0363J4136o694L95019K29318j35411K36387K07060k67559O22031
$$ 5893485 5973848 5987984 5981290 6376309 6605627 6470216 6706603 6913663 6646104 7268135
16837G268135l87169K1701K82109M67522J62825m24818N15473j21957K91643j00900
$$ 7268135 6880966 6902667 7184776 7652298 7815123 7390305 7905778 7783821 8075464 7974564
16827G974564O19031J61292k7991O6678J72138M54995o00954P39768L43597K053
$$ 7974564 8593595 8754887 8726896 8793574 8965712 9420707 8819753 9559521 9903118 9905171
16817I905171J09214Q8378M23387K14526L56683j36847J02664O10486J65970M8433
$$ 9905171 10014385 10102763 10526150 10740676 11097359 10960512 11063176 11673662 11839632 11888065
16807A1888065J09420P99345m4107K86386J57604M63567L14718J12186O24032
$$ 11888065 11997485 12796830 12752723 13039109 13196713 13660280 13974998 14087184 14711216
16798A4711216N4616P40811P0659K48101M89384N58589K77456R30608j3075J98543
$$ 14711216 14765832 15506643 15577302 15825403 16314787 16873376 17150832 18081440 18068365 18266908
16788A8266908O86688P63484M14239N26715R8809R27819N35218N43153Q17720
$$ 18266908 18953596 19717080 20131319 20658034 20756843 21684662 22219880 22763033 23580753
16779B3580753Q91533K93413N78452N66399J054853R79258M60074J288647P80543
$$ 23580753 24472286 24765699 25344151 25910550 26965403 27944661 28404735 29693382 30473925
16770C0473925P52169J135527J084110Q66386Q51053J250078J370677J191959
$$ 30473925 31226094 32361621 33445731 34312117 35163170 36413248 37783925 38975884
16762C8975884J136399J337486J390231J164127J535085J652710J682500J308765
$$ 38975884 40112283 41449769 42840000 44004127 45539212 47191922 48874422 50183187
16754E0183187J903051J869590J630285K066931K165703J916250J896414K397505
$$ 50183187 52086238 53955828 55586113 57653044 59818747 61734997 63631411 66028916
16746F6028916J929465K123217K750235K351463K232921K423775K591744K764776
$$ 66028916 67958381 70081598 72831833 75183296 77416217 79839992 82431736 85196512
16738H5196512K391965K428329K668530K048216K852145K004691K280856K114639
$$ 85196512 87588477 90016806 92685336 94733552 97585697 99590388 101871244 103985883
16730A03985883K096973J540601J791418J271656J167820J244622Q11028M46181
$$ 103985883 106082856 107623457 109414875 110686531 111854351 113098973 113910001 114356182
16722A14356182L69133j35546j56156q14270l42644j277399j292399j465725j592658
$$ 114356182 114725315 114589769 114433613 113619343 113276699 111999300 110706901 109241176 107648518
16713A07648518j472409k333521j748956k396464k418585k571756k440802k494678
$$ 107648518 106176109 103842588 102093632 99697168 97278583 94706827 92266025 89771347
16705H9771347k501526k707980k313096k839583k423067k557614k202208k451358
$$ 89771347 87269821 84561841 82248745 79409162 76986095 74428481 72226273 69774915
16697F9774915k112257k678454k104431k029370j967652k138945j627338k161400
$$ 69774915 67662658 64984204 62879773 60850403 58882751 56743806 55116468 52955068
16689E2955068j654268j758362j765804j528502j659681j474805j200518j599961
$$ 52955068 51300800 49542438 47776634 46248132 44588451 43113646 41913128 40313167
16681D0313167p43149j705498j193084j102919j333997j051498j047444j024811
$$ 40313167 39570018 37864520 36671436 35568517 34234520 33183022 32135578 31110767
16673C1110767p37384q82554q21082j018314o13005o93843j236603j34658j010876
$$ 31110767 30373383 29490829 28669747 27651433 27038428 26344585 25107982 24973324 23962448
16664B3962448l73674o06745j241112n56378l76341l58155m11521o43129m26741
$$ 23962448 23588774 22982029 21740917 21184539 20808198 20450043 20038522 19395393 18968652
16655A8968652p62440l10858o25676Q737o67250n82517m01023j05675n79338j95910
$$ 18968652 18206212 17895354 17269678 17278415 16611165 16028648 15627625 15521950 14942612 14746702
16645A4746702j69767l31867n14808j55709k68196l36607l45715l59552n07901
$$ 14746702 14576935 14245068 13730260 13574551 13306355 12969748 12624033 12264481 11756580
16636A1756580L8441P7570n42455r4062k81461l35710q5757k22254j94878m01482
$$ 11756580 11795021 11872591 11330136 11236074 10954613 10618903 10533146 10310892 10116014 9714532
16626I714532j72502l73201J02128j83024j76616O0192n35550Q8169o13657M15809
$$ 9714532 9542030 9168829 9270957 9087933 8911317 8971509 8435959 8524128 7910471 8326280
16616H326280k64368m48307L36493m65113l76190J5748O4941k496n9731m51683
$$ 8326280 8061912 7613605 7950098 7484985 7108795 7124543 7189484 7186988 7127257 6675574
16606F675574J4538j01835L4254l40182m6666K57055j46915m55074n7685L78130
$$ 6675574 6690112 6588277 6622531 6282349 6235683 6492738 6345823 5890749 5833064 6211194
16596F211194n76490j05053J37598j68319l9877k81776J88251j97282l35602L8286
$$ 6211194 5634704 5529651 5667249 5498930 5459053 5177277 5365528 5168246 4832644 4870930
16586D870930J12450j42299L0069l85472L37792l74642q2492j2869l3334l19352
$$ 4870930 4983380 4841081 4871150 4485678 4823470 4448828 4366336 4353467 4320133 4000781
16576D000781N33225k1500k21212m05545L80784m04434M48896m64008J8590j81518
$$ 4000781 4534006 4512506 4291294 3885749 4266533 3862099 4310995 3846987 3865577 3684059
16566C684059K0247J51494k26637J40917j67174q3561J62269k66413J74888l45798
$$ 3684059 3704306 3855800 3629163 3770080 3602906 3519345 3681614 3415201 3590089 3244291
16556C244291j45692K70345j15362N6464j85877L52j77459J73949r0355J06272
$$ 3244291 3098599 3368944 3253582 3310046 3124169 3124521 2947062 3121011 3030656 3136928
16546C136928j85547k4237K46818n00241j2748M24892k21667r7539K72811q14924
$$ 3136928 2951381 2927144 3173962 2673721 2660973 3085865 2864198 2766659 3039470 2224546
16536B224546M96338j28535k18628R6936P8913M7039k20145J90227j38824K22366
$$ 2224546 2720884 2592349 2373721 2470657 2549570 2596609 2376464 2566691 2427867 2650233
16526B650233k91659q8913j30043K3163L55199m88818J41801L10472j33830J72596
$$ 2650233 2358574 2269661 2139618 2162781 2517980 2029162 2170963 2481435 2347605 2520201
16516B520201j90098j96835k64049L69074K31048r6184k72052j1941p7230r7412
$$ 2520201 2330103 2133268 1869219 2238293 2469341 2373157 2101105 2089164 2011934 1914522
16506A914522k41979L07239L3895j04152l08035M85243j3625l19954K95353p1172
$$ 1914522 1672543 1979782 2013677 1909525 1601490 2086733 2073108 1753154 2048507 1977335
16496A977335k84597k44787P40134l71243L9257k22309j33069K88958J49679j88499
$$ 1977335 1692738 1447951 2188085 1816842 1856099 1633790 1500721 1789679 1939358 1750859
16486A750859r8045k49260L323q6772n9038K73027M7053K48555k65462L3309J64025
$$ 1750859 1652814 1403554 1406877 1320105 1261067 1534094 1581147 1829702 1564240 1597549 1761574
16475A761574l04330J62058Q813k22111m3104J92720J19544l25774J95108j58382
$$ 1761574 1457244 1619302 1628115 1406004 1362900 1555620 1675164 1349390 1544498 1386116
16465A386116J35995l2157L8996n0077l89922K71611J95282l3956m0497l06589
$$ 1386116 1522111 1489954 1528950 1478873 1088951 1360562 1555844 1521888 1481391 1174802
16455A174802r498Q9838K85360k69836q2593N34330l02321j88331J12826k26761
$$ 1174802 1165304 1255142 1540502 1270666 1188073 1722403 1420082 1231751 1344577 1117816
16445A117816m8995j06406K06615L00792m54544K66531K63227l70155k39577K07524
$$ 1117816 1068821 962415 1169030 1469822 1015278 1281809 1545036 1174881 935304 1142828
16435A142828j27549J76986k73140J70379l38722J99517K23424j44674Q063M8080
$$ 1142828 1015279 1192265 919125 1089504 750782 950299 1173723 1029049 1037112 1085192
16425A085192l18428l309K20881l50816M28343J68950l37184K8760J96784k52566
$$ 1085192 766764 763455 984336 633520 1061863 1230813 893629 922389 1119173 866607
16415H66607K62639J7545n3690j23483r8332K9120J7356L22911j42009j60074
$$ 866607 1129246 1146791 1093101 969618 871286 900406 917762 1240673 1098664 938590
16405I38590j12182K74077j08254q2038k2972P9708p9779k40995K34407J25394
$$ 938590 826408 1100485 992231 910193 887221 966929 887150 646155 880562 1005956
16395A005956k85119J67663j26153K7560o18K14252J003D11725M69310J48749
$$ 1005956 720837 888500 762347 789907 789289 1003541 1004544 411725 881035 1029784
16385A029784k04598K0697K67178D97930J77451l4484K39799j68581k46545L77629
$$ 1029784 825186 845883 1113061 497930 675381 640897 880696 712115 465570 843199
16375H43199Q4443k29459l07007L61985k25838K93228j05448K46160l13553Q3678
$$ 843199 927642 698183 391176 753161 527323 820551 715103 961263 647710 731388
16365G31388l13381K82456N7177J0370k29161O8162j97822J26813K78007j45923
$$ 731388 418007 700463 757640 768010 538849 607011 409189 536002 814009 668086
16355F68086K5691J52111k47590n4466K9511J30718k88678M57151j24022m6215
$$ 668086 693777 845888 598298 543832 573343 704061 415383 872534 748512 702297
16345G02297j28396J46861k64379M9495k5988J83533K88937C92078n5619L68128
$$ 702297 573901 720762 456383 505878 479890 663423 952360 392078 336459 704587
16335G04587K510J4013B68670M08958j56779j19651K21629L4243m5938O3210j31886
$$ 704587 707097 721110 268670 677628 520849 401198 622827 657070 611132 674342 542456
16324E42456K60073K22704l65675q8765j00722L00097r270j32330m3032J7631
$$ 542456 802529 1025233 659558 570793 470071 770168 760898 628568 585536 603167
16314F03167j30985k7243N0518m4947J74767O8992l7510k42145J28028l7676A53001
$$ 603167 472182 444939 495457 450510 625277 694269 656759 414614 542642 504966 153001
16302F41812j94541n3795j80180G1480K26232K66011k12779K28302q9005F4950
$$ 641812 447271 393476 213296 71480 297712 563723 350944 579246 490241 64950
16291A20135L17045L52810l81346j87477L14850A87948M91723j49201j14773M5568
$$ 120135 437180 789990 408644 221167 536017 187948 679671 530470 415697 461265
16281D61265J57398k31431L457M8172r216K88305j65961j08445m7532r1249K75034
$$ 461265 618663 387232 390689 438861 429645 717950 551989 443544 396012 304763 579797
16270E79797j76658L1046j3068o2583K88692m8384j26051B31051N2221j04628
$$ 579797 403139 434185 421117 358534 647226 598842 472791 231051 283272 178644
16260A78644o7060K88610j07578J65501l3015j54692K00974m8395J71228B72464
$$ 178644 111584 400194 292616 458117 425102 270410 471384 422989 594217 272464
16249E12716j40908J95677m4651j26722A01318P5561J91334M6017n7148J85043
$$ 512716 371808 567485 522834 396112 101318 176879 368213 414230 357082 542125
16239E42125B60437K400r7727P9446L01404a06212E4427M44109K9809j44893n9965
$$ 542125 260437 262837 165110 244556 545960 -106212 54427 498536 528345 383452 323487
16228C23487j2406N9955l6035e6809B36202J38344J22586A18947k7301M38979
$$ 323487 311081 371036 335001 -56809 236202 374546 497132 118947 91646 530625
16218E30625j60486j65662K86611A30765J10535e7672A76013K47729G4339O7145
$$ 530625 370139 204477 491088 130765 241300 -57672 176013 423742 74339 141484
16208A41484L63050B8967K40926I0515L32740j1980A14888m5552c0989C92951
$$ 141484 504534 28967 269893 90515 423255 411275 114888 69336 -30989 392951
16197B66922N6009K90221A70070L09354k3666K2123D6211h1520A06623q703J07434
$$ 266922 322931 613152 170070 479424 455758 477881 46211 -81520 106623 97920 205354
16186B05354K65534B11531G1125O0149K08105D9874K365J89683L9137A22131Q7880
$$ 205354 470888 211531 71125 131274 339379 49874 52239 241922 281059 122131 210011
16175B10011J66558J86150A94349p0895P8016m3435K8734m3470k0084i9025E9732
$$ 210011 376569 562719 194349 123454 201470 158035 186769 143299 123215 -99025 59732
16163C4305J27469M20500k05745I0352o233M04605A686M0181C790a72237B10369
$$ 34305 161774 582274 376529 90352 84119 488724 1686 41867 3790 -172237 210369
16151A64673J20227A02257O5500P8261o0567m2303j6847K96188C7060J44259a41535
$$ 164673 284900 102257 167757 246018 185451 143148 126301 422489 37060 181319 -141535
16139e0635A28432p532R561K27912j54615a5429j64393A46387a41607D40383I7460
$$ -50635 128432 120900 130461 358373 203758 -15429 -179822 146387 -141607 440383 97460
16127H0145P3177Q335M5197J21054j43376f6209j08326I8860J12355H4213K12822
$$ 80145 153322 161657 206854 327908 184532 -66209 -174535 98860 211215 84213 297035
16116B97035J23371j80883R1800j09339I1092b2930j60981A1540L46363A68389
$$ 297035 420406 239523 331323 221984 91092 -22930 -183911 11540 357903 168389
16105a26704p4078P5434B20785J68337b8727E25994r4708a14250M431j3478C32997
$$ -126704 -200782 -125348 220785 389122 -28727 525994 431286 -114250 -109819 -123297 332997
16093A22853C6398K32208j30351F5480O3771F2736k586P7055K02k7258J88334
$$ 122853 36398 268606 138255 65480 129251 62736 60150 137205 137407 110149 298483
16082B98483r707l1011P3071A20935J18933O5000a29848B1918i1924l3219D41583
$$ 298483 288776 257765 330836 120935 239868 304868 -129848 21918 -91924 -125143 441583
16070G0649C4168j3204a967B29012h9869A09675K79197c20171D85144G8055R428
$$ 70649 34168 20964 -1967 229012 -89869 109675 388872 -320171 485144 78055 87483
16059H7483J9950L228Q678j9456c6348C2574Q2966c02628B64741q839B8373K6771
$$ 87483 107433 110661 119339 99883 -36348 32574 115540 -302628 264741 255902 28373 55144
16047E5144a19117m6342B30450F7753K7706a9292B16023n9327C0315L11553n708
$$ 55144 -119117 -165459 230450 67753 95459 -19292 216023 156696 30315 341868 336160
16036C36160o9461l2182G4890J04433n5733D5829c59180a50264A52451j3159J32581
$$ 336160 266699 234517 74890 179323 123590 45829 -359180 -150264 152451 139292 271873
16025B71873m0554C5490K65574P1500m2925E4547o083K19481E0482J01557j2303
$$ 271873 231319 35490 301064 372564 329639 54547 48464 267945 50482 152039 139736
16014A39736J01852b62242a9182A65539D3438h0082Q423A2036P6507a15331k2203
$$ 139736 241588 -262242 -19182 165539 43438 -80082 -71659 12036 88543 -115331 -137534
16003a37534A0726b39360B04679r7235M9672a24882C15045N2207I3768A8442K24572
$$ -137534 10726 -239360 204679 107444 157116 -124882 315045 367252 93768 18442 243014
15992B43014o7631K45366A28640N3333J31393L91512N19677n0796j5196L03880
$$ 243014 175383 420749 128640 181973 313366 704878 1224555 1173759 1158563 1462443
15982A462443n27021k09254j58849j08018p6468j31159D0867J01625N4623I1528
$$ 1462443 935422 726168 567319 459301 382833 251674 40867 142492 197115 91528
15971d3331D1894J18391a1068q3845m4022f5635G9072C7648a49218E891a01859
$$ -43331 41894 160285 -11068 -94913 -138935 -65635 79072 37648 -149218 5891 -101859
15959a66302n3196h5550G763k418g8020j41100C14762g8319k76487A27530d65542
$$ -166302 -219498 -85550 7763 5345 -78020 -219120 314762 -78319 -354806 127530 -465542
15947B83394b7973B4137O4680f759j51338N3724l9440e0206B16851o3640P9825
$$ 283394 -27973 24137 88817 -6759 -158097 -104373 -143813 -50206 216851 153211 233036
15936B33036b17703K6462A87653b08684J6619h5462G0415J50799E2320Q7692j7822
$$ 233036 -217703 -191241 187653 -208684 -192065 -85462 70415 221214 52320 140012 122190
15925A22190L37278b50406f1990A64288q191J65050b44170N5628i1048A8704a2900
$$ 122190 459468 -250406 -61990 164288 156097 321147 -244170 -188542 -91048 18704 -12900
15913A83291a65413H0134f595j68518A54921k658f0294r5373b8636j8140j78046
$$ 183291 -165413 80134 -6595 -175113 154921 152263 -60294 -155667 -28636 -46776 -224822
15902b24822A42424j4656a48316l5257h7669a2915A55702a66722j86442B23996
$$ -224822 142424 127768 -148316 -183573 -87669 -12915 155702 -166722 -353164 223996
15891a38245a7305n4123r3095N9669A65523b11660C3878j964a0532k78589I707
$$ -138245 -17305 -71428 -164523 -104854 165523 -211660 33878 31914 -10532 -289121 9707
15879H8271b48557a02163D05319B435h7137j81568I2075h3057A2158d07493a18621
$$ 88271 -248557 -102163 405319 2435 -87137 -268705 92075 -83057 12158 -407493 -118621
15867f0711n9892C653d57101a32587L3190k21353n2372a20196A0673g4444B1127
$$ -60711 -120603 3653 -457101 -132587 -99397 -320750 -373122 -120196 10673 -74444 21127
15855H7363h1186C1915J00392K98130a93536A53188g7388k10940M6019Q2804L5434
$$ 87363 -81186 31915 132307 430437 -193536 153188 -77388 -288328 -242309 -159505 -124071
15844a24071o0831A20468b23143C51499J0007a75340N9344d4837K0398l9304o5662
$$ -124071 -184902 120468 -223143 351499 361506 -175340 -115996 -44837 -24439 -63743 -129405
15833a29405B50822F6521g9238d678G9921a06210D4961L2557e5078E85693C1161
$$ -129405 250822 66521 -79238 -4678 79921 -106210 44961 77518 -55078 585693 31161
15821a50838p8019L493R4814a4499A25687E1661h6767o5680C34299a31152C5698
$$ -150838 -228857 -225364 -130550 -14499 125687 51661 -86767 -152447 334299 -131152 35698
15809A22391P5340o3650o3734K36380a63122A59189D4443b7836k74552B31195
$$ 122391 197731 134081 70347 306727 -163122 159189 44443 -27836 -302388 231195
15798d537j91549A70927A1568J03693i5782D5606K05964e3018o5191B5867d3655
$$ -4537 -196086 170927 11568 115261 -95782 45606 251570 -53018 -118209 25867 -43655
15786B60699b26504g7419I0180D569a45052r0231H9436O40228b06004l49022A07530
$$ 260699 -226504 -77419 90180 4569 -145052 -235283 89436 729664 -206004 -555026 107530
15774B73781b6076G1813K6843d399A85240a6428F1690b8437j22979f661l41369
$$ 273781 -26076 71813 98656 -4399 185240 -16428 61690 -28437 -151416 -6661 -348030
15763c48030a38734H4247K01610b90554B66718h1951B85312A17802m2854k1544
$$ -348030 -138734 84247 285857 -290554 266718 -81951 285312 117802 74948 53404
15753E3404J11457C6053a96400K1547A74694c16631I6114m0712K44056G06b87527
$$ 53404 164861 36053 -196400 -174853 174694 -316631 96114 55402 299458 706 -287527
15741g7114D8793N2052L9436i9584o5468j74983c8114j817n7440j39333A17831
$$ -77114 48793 100845 140281 -99584 -165052 -340035 -38114 -39931 -97371 -236704 117831
15729I0106Q682J1803J23263D6722J30201b9202A00120m8741K86011a49361n3091
$$ 90106 98788 110591 233854 46722 176923 -29202 100120 51379 337390 -149361 -202452
15718b02452f5686j5835A58299a06747k44519A28850n519f585B80106I7073L51030
$$ -202452 -65686 -81521 158299 -106747 -351266 128850 123331 -6585 280106 97073 448103
15707D48103j98861a76549d5117p1131F2860B2321b49312G6132C3912Q8145m2577
$$ 448103 249242 -176549 -45117 -116248 62860 22321 -249312 76132 33912 122057 79480
15696G9480c7196j00802A77376H3722J34163k7152c01972a43652G8997L03098
$$ 79480 -37196 -137998 177376 83722 217885 190733 -301972 -143652 78997 382095
15686C82095b58417E0949b7655p6502n2785B6907b31426a15268A51280a95500
$$ 382095 -258417 50949 -27655 -104157 -156942 26907 -231426 -115268 151280 -195500
15675i5552A6396b67160G0894A87b29982C0373a5563G1875N2293e9625H8341c47000
$$ -95552 16396 -267160 70894 187 -229982 30373 -15563 71875 124168 -59625 88341 -347000
15662a9635B12445b60679B75993a49914A6785c42828B56297r8625B9592R5842
$$ -19635 212445 -260679 275993 -149914 16785 -342828 256297 157672 29592 125434
15652A25434g0458n5653b5571o0367k1638d5282j25197B77907A29539i7406o5374
$$ 125434 -70458 -126111 -25571 -85938 -107576 -45282 -170479 277907 129539 -97406 -162780
15641a62780a1178j9280J1986A45146a75546C114N3784J7492P4218M5273G6051
$$ -162780 -11178 -30458 -18472 145146 -175546 3114 56898 74390 148608 193881 76051
15629C52940b23366D667b97244G1771h4210I6290c05302J43361j7212A05198A6526
$$ 352940 -223366 4667 -297244 71771 -84210 96290 -305302 -161941 -179153 105198 16526
15617c4362A24179J52019b81750P9644B32071b17047e98j76589C03063A9159L23853
$$ -34362 124179 276198 -281750 -202106 232071 -217047 -598 -177187 303063 19159 343012
15606C43012c9842j52317A69402a65170O1351A32115B6397K85895c42323f6184
$$ 343012 -39842 -192159 169402 -165170 -103819 132115 26397 312292 -342323 -66184
15595d94l6321l14102J13153a10762A80836b44574E0652f5821D18240c61290A9642
$$ -494 -36815 -350917 -237764 -110762 180836 -244574 50652 -65821 418240 -361290 19642
15583A11093d1787A62666g05A4933J12928a10854j4673A19564i8A72408E3685
$$ 111093 -41787 162666 -705 14933 127861 -110854 -125527 119564 -98 172408 53685
15571a78633D1613a85172c3023F0739i6009K3296j11610o677K2897a3322j34396
$$ -178633 41613 -185172 -33023 60739 -96009 -72713 -184323 -191000 -168103 -13322 -147718
15560a47718F549J24869a58412c3398j03432J9124k1853B28333c82081a56427
$$ -147718 6549 131418 -158412 -33398 -136830 -117706 -139559 228333 -382081 -156427
15549a71189A0662K86238f5199K7518B93475d1204j76840D02283A8603g6249C82700
$$ -171189 10662 296900 -65199 -37681 293475 -41204 -218044 402283 18603 -76249 382700
15537i1973r0436A18198E8895a8894A11237a3600k09576h1869C741K59563b1831
$$ -91973 -182409 118198 58895 -18894 111237 -13600 -223176 -81869 3741 263304 -21831
15525B44364E2825a27832I4146K21763f8953A96799B5914R6899P4735A8174J4125
$$ 244364 52825 -127832 94146 315909 -68953 196799 25914 122813 197548 18174 32299
15514C2299P4708a61866C65045J8231n7056J24192A3494J04262b35751C0522J79584
$$ 32299 107007 -161866 365045 383276 326220 450412 13494 117756 -235751 30522 210106
15503B10106e6517k29656F8935a25161c2105C15206m8667J16130A18378J16063
$$ 210106 -56517 -286173 68935 -125161 -32105 315206 266539 382669 118378 234441
15493B34441P5094k2840e2273D6384h0114A36497R9979B791a48529G6716J79808
$$ 234441 309535 286695 -52273 46384 -80114 136497 236476 2791 -148529 76716 256524
15482B56524b8422A01593J81J80548F2243P9957J69761o6800J78094K69850K14058
$$ 256524 -28422 101593 101774 282322 62243 142200 311961 245161 423255 693105 907163
15471I07163D32875j85482p4203h5423a7241A25964b67073b4695j10320C19301
$$ 907163 432875 247393 173190 -85423 -17241 125964 -267073 -24695 -135015 319301
15460B99455j6028F0035K3137d591F2139a57755B0782g5389B68487G2040J1713
$$ 299455 283427 60035 83172 -4591 62139 -157755 20782 -75389 268487 72040 83753
15449H3753a27902C04194a19409N7957B14461K89254P9787J04572K62990M07600
$$ 83753 -127902 304194 -119409 -61452 214461 503715 583502 688074 951064 1358664
15439A358664F27125J56341A24005J58528B0756b38344d2403k85531F18M5361
$$ 1358664 627125 783466 124005 282533 20756 -238344 -42403 -327934 618 45979
15429D5979J14322E0169a37967B73214p2533n5927b12717b5004j4745j72964E7285
$$ 45979 160301 50169 -137967 273214 200681 144754 -212717 -25004 -39749 -212713 57285
15417f942B054P5197O1099M5322a0141j0200D7763J80764c54945e8332m0216E7580
$$ -6942 2054 77251 138350 183672 -10141 -20341 47763 228527 -354945 -58332 -98548 57580
15404C2351a79477A20143b18513J03068A68919a78962A79554F7115g4599I4630
$$ 32351 -179477 120143 -218513 -115445 168919 -178962 179554 67115 -74599 94630
15393A82545h5847K5137A79488a67337a0266q514A872J17884o073c7979D27218
$$ 182545 -85847 -60710 179488 -167337 -10266 -18780 1872 119756 113683 -37979 427218
15381a56405B10545L5225F8289a58357E6916b77724B97141a67868E6504J52725
$$ -156405 210545 245770 68289 -158357 56916 -277724 297141 -167868 56504 209229
15371B09229K75502B13941G1606b2457B56110p3972a87248C66367A31844l4542
$$ 209229 484731 213941 71606 -22457 256110 182138 -187248 366367 131844 97302
15361I7302K8766B2474L40230A52205F9729g9996E9676d7136A98589b5121m5368
$$ 97302 126068 22474 362704 152205 69729 -79996 59676 -47136 198589 -25121 -70489
15350g0489A36470J87427B8217c2192A52685L3207o99O00191C14181R6378o9498
$$ -70489 136470 323897 28217 -32192 152685 185892 185193 785384 314181 410559 341061
15339C41061Q7444j53776J5226j24908D0296J30693J11091o6936L17838d8452
$$ 341061 428505 274729 289955 165047 40296 170989 282080 215144 532982 -48452
15328E98692a35677A23302M6454K2190i1161C90465e0524F6865J1288a2788A09015
$$ 598692 -135677 123302 169756 191946 -91161 390465 -50524 66865 78153 -12788 109015
15316A73161K07776F9277d4474B7754c5708B25880D8013K24560K24635A88881
$$ 173161 380937 69277 -44474 27754 -35708 225880 48013 272573 497208 188881
15305I0054a26403j70761C21764b4661A52626p3465f2069F0303c17421a00033
$$ 90054 -126403 -297164 321764 -24661 152626 79161 -62069 60303 -317421 -100033
15294G659c16844B31813b9426A90504B415J37437M029b79330A18423N0840M14503
$$ 7659 -316844 231813 -29426 190504 2415 139852 143881 -279330 118423 169263 583766
15283E83766C7879J21163J9346a8465D7402N1259g3431A35982K96751j2538b0498
$$ 583766 37879 159042 178388 -18465 47402 98661 -73431 135982 432733 420195 -20498
15271h8298n497d3325F19721c6132D8880f0965p6495j22769b0643k72414C12554
$$ -88298 -93795 -43325 619721 -36132 48880 -60965 -137460 -260229 -20643 -293057 312554
15259c73965a21229A174J77172b33257e1563D90122i0535d2993B85196A7969a64224
$$ -373965 -121229 1174 178346 -233257 -51563 490122 -90535 -42993 285196 17969 -164224
15247B10148E1877g2634B27045l4083K49567k8746J329378K26593o21147Q08838
$$ 210148 51877 -72634 227045 192962 442529 413783 1743161 1969754 1348607 2157445
15237B157445j064539C80268A22842r133L99688k20912P4881k7485f8193A81021
$$ 2157445 1092906 380268 122842 113709 513397 292485 367366 339881 -68193 181021
15226a884j72768c1943l254B54618j24267n2133A6437a19929c616A12049a23335
$$ -1884 -174652 -31943 -35197 254618 130351 78218 16437 -119929 -3616 112049 -123335
15214A72458J19461a6529l98826C1837a20883A17447n8140K98373d8735B01678
$$ 172458 291919 -16529 -415355 31837 -120883 117447 59307 357680 -48735 201678
15203A94755p8984n4445j0113b21549A17307J32166G5219J48892I3938n39J45152
$$ 194755 115771 61326 51213 -221549 117307 249473 75219 224111 93938 93399 238551
15192B38551b06420A80746a8993A23969P8138C1972b61419O3108A80572a77851
$$ 238551 -206420 180746 -18993 123969 202107 31972 -261419 -198311 180572 -177851
15181a13543H6048J64614i0905A40083C3302P0633J94770k8207B0346K2649J23280
$$ -113543 86048 250662 -90905 140083 33302 103935 298705 270498 20346 42995 166275
15170A66275F1322L18552A69486R9541g3743k9242o8264j43380Q6561j72586C37097
$$ 166275 61322 379874 169486 269027 -73743 -102985 -171249 -314629 -228068 -400654 337097
15158I1916P5559a92699A39866b9256j14041b6470A25727l1001J84948A18952
$$ 91916 167475 -192699 139866 -29256 -143297 -26470 125727 94726 279674 118952
15147C43437g3171A77952J78541j76109L0345Q4872r6699r8669a10891F6804L18956
$$ 343437 -73171 177952 356493 180384 210729 295601 198902 100233 -110891 66804 385760
15136C85760A28286N5124e4113b0758B08232J2499J11677j39824J32735a50614
$$ 385760 128286 183410 -54113 -20758 208232 220731 332408 192584 325319 -150614
15125B0120a8468C34718b201C42578B1648L31141N623L77379B72432D6725J0928
$$ 20120 -18468 334718 -2201 342578 21648 352789 358412 735791 272432 46725 57653
15114E7653L04677A55889L8958b06141C14711g9872M809D655Q1153k4072l0283
$$ 57653 362330 155889 194847 -206141 314711 -79872 -75063 4655 85808 61736 31453
15103C1453h9624A13589i1082B36515E9126K4253c6573A01042N6958D0994Q4487
$$ 31453 -89624 113589 -91082 236515 59126 83379 -36573 101042 158000 40994 125481
15092A25481h4600f104j01607A97157J10409F0287a69910B37642a34201D22525
$$ 125481 -84600 -6104 -107711 197157 307566 60287 -169910 237642 -134201 422525
15081d14047A56182K69700A30676J70273a76913A26834O4811D5828O2523A3204
$$ -414047 156182 425882 130676 300949 -176913 126834 191645 45828 108351 13204
15070c6705B88406A6298J29213E4289i646B18124J47206e1967C08856p3555A01200
$$ -36705 288406 16298 145511 54289 -9646 218124 365330 -51967 308856 235301 101200
15058A80653O9287J33848K30955C04760l1238j3019K30186j74126j37393N3232
$$ 180653 249940 383788 614743 304760 273522 260503 490689 316563 179170 232402
15048B32402L23995j96550A09193L09982I8012K45043r2910J62028o9023M6030
$$ 232402 556397 359847 109193 419175 98012 343055 250145 412173 343150 389180
15038C89180J43790k55976l2818J10157J23885A82075L62709P232K99997j80185
$$ 389180 532970 276994 244176 354333 478218 182075 544784 552016 852013 671828
15028F71828O4332L40706j87318B85046K8026k4409J29701L12994l02323j4429
$$ 671828 736160 1076866 889548 285046 313072 288663 418364 731358 429035 414606
15018D14606L52792C41385j69156L71616k01681J29620B5459R9838K15639j32316
$$ 414606 767398 341385 172229 543845 342164 471784 25459 125297 340936 208620
15008B08620O54594D14293L31163B01085B0082L37744K83434B97259N03444j13496
$$ 208620 863214 414293 745456 201085 20082 357826 641260 297259 800703 687207
14998F87207r0167k40352L51482j41206k09213K29785j06694j41797J228J03158
$$ 687207 597040 356688 708170 566964 357751 587536 480842 339045 340273 443431
14988D43431K31855j61390O6254B71852K45755L73618m01486J41618n1471N14459
$$ 443431 675286 513896 580150 271852 517607 891225 489739 631357 579886 1094345
14978A094345r9944C16569B6515M78566L17956k58048J26311m2658r9577m8229
$$ 1094345 994401 316569 26515 505081 823037 564989 691300 648642 549065 500836
14968E00836j38656k6694J05942p6548P8139K4776p4544q4425K08843B56936K34623
$$ 500836 362180 335486 441428 364880 443019 467795 393251 308826 517669 256936 491559
14957D91559A42387O44633k72035k52045Q838A2671M40753K19682a8374A81988
$$ 491559 142387 787020 514985 262940 271778 12671 453424 673106 -18374 181988
14946A93992G8352N02128K98569n753k37869j83472q9209K5009j69446M6235K66756
$$ 193992 78352 580480 879049 873296 635427 451955 362746 387755 218309 264544 531300
14935E31300n8044J3900P9014M2027M80591q5061L60285O8771J25991q7009J06903
$$ 531300 473256 487156 566170 608197 1088788 1003727 1364012 1432783 1558774 1471765 1578668
14924A578668o0556L51508p8930k56351k78827L03026N18781R1438M0715K0979
$$ 1578668 1518112 1869620 1790690 1534339 1255512 1558538 2077319 2168757 2209472 2230451
14914B230451n54392j85455l10338J16714l86505l93845K33361B36249K26311
$$ 2230451 1676059 1490604 1180266 1296980 910475 516630 749991 236249 462560
14905D62560J93663l14870p957K39376k0842m4592B31013m9454L16885m6543K4067
$$ 462560 656223 341353 333396 572772 551930 507338 231013 181559 498444 451901 475968
14894D75968A28827L75195j22709O9692A23712L88410j92020L18883M5039K17130
$$ 475968 128827 504022 381313 451005 123712 512122 320102 638985 684024 901154
14884I01154M0000L3137n7927L15891l92366o6260J99948k72033l46367j00826
$$ 901154 941154 974291 916364 1232255 839889 773629 973577 701544 355177 254351
14874B54351M67856j48601k72265j699L76386j85320r8619M08234l74979M92126
$$ 254351 722207 573606 301341 299642 676028 490708 392089 800323 425344 917470
14864I17470r9591l73563Q6989J27204k28937B06265K43583J13361l2129j87365
$$ 917470 817879 444316 531305 658509 429572 206265 449848 563209 531080 343715
14854C43715N5812K24471j25046J06360A44630K05967A47523L68898j30488K19023
$$ 343715 399527 623998 498952 605312 144630 350597 147523 516421 385933 604956
14844F04956M59367j29940K50586k46639M73172l56439j36914j44330r1020j44832
$$ 604956 1064323 934383 1184969 938330 1411502 1055063 918149 773819 682799 537967
14834E37967L51249k86835l6072K0412J33611q0317L140j42160k41652M85702
$$ 537967 889216 602381 566309 586721 720332 640015 643155 500995 259343 745045
14824G45045C67503K62572j11702B55474N50684M4966j62463J72836j22998J13028
$$ 745045 367503 630075 518373 255474 806158 851124 688661 861497 738499 851527
14814H51527j08696J0670j50962J43386P7806J18571C02340N58004J6849N7890
$$ 851527 742831 753501 602539 745925 823731 942302 302340 860344 877193 935083
14804I35083L54404l60889j03548j56582j20178K53500k2470l11316J89362m054
$$ 935083 1289487 928598 825050 668468 548290 801790 779320 468004 657366 653312
14794F53312A72984L52717L39787j97675J30692C28918J77958m6921K02141J22229
$$ 653312 172984 525701 865488 667813 798505 328918 506876 459955 662096 784325
14784G84325K8290o0999j58457O7548j16995j68588J97360N8539N31739K3513
$$ 784325 812615 751616 593159 660707 543712 375124 572484 631023 1162762 1186275
14774A186275P6010k30793l68664K4121J28570k66325J50777k38359L02220j11709
$$ 1186275 1262285 1031492 662828 686949 815519 549194 699971 461612 763832 652123
14764F52123q162l01939K45704n660J72151l16049R4927K40968K17626l29029
$$ 652123 643961 342022 587726 582066 754217 438168 533095 774063 991689 662660
14754F62660J84024l88608l9174j4972K66155r6247K22637j83192m6124Q4257
$$ 662660 846684 458076 418902 403930 670085 573838 796475 613283 567159 651416
14744F51416J20415K3840k68428K49494M8740r4507j10543m025J09567J65829
$$ 651416 771831 795671 527243 776737 825477 730970 620427 616402 725969 891798
14734H91798j17926J73262k9417k54721P92613m0782K9832K37814K40526l83854
$$ 891798 773872 947134 917717 662996 1455609 1414827 1444659 1682473 1922999 1539145
14724A539145j124j97219k63907j6286J55757m24932k47576M48368j95111J89744
$$ 1539145 1538021 1340802 1076895 1060609 1216366 791434 543858 992226 797115 986859
14714I86859k33937K94328R2030k6107n55705L42884K9457j64925K73517K39041
$$ 986859 752922 1047250 1139280 1113173 557468 900352 929809 764884 1038401 1277442
14704A277442J73895j87995N04550Q5929N4674l20098k10211k25020J8845n342
$$ 1277442 1451337 1263342 1767892 1853821 1908495 1588397 1378186 1153166 1172011 1166669
14694A166669k45525J72799J13255k67306J48492k25766J31610J16222l59815
$$ 1166669 921144 1093943 1207198 939892 1088384 862618 994228 1110450 750635
14685G50635L4011N8543L24300j98166k15326L3777L17024k35701p7958K66280
$$ 750635 784646 843189 1167489 969323 753997 787774 1104798 869097 791139 1057419
14675A057419l09767K79369O9402j07774L47171l74365K68468n43244L55764k34374
$$ 1057419 747652 1027021 1096423 988649 1335820 961455 1229923 686679 1042443 808069
14665H08069L13942l0117J99634l68994L62197k08095j07981J45043j52785J0854
$$ 808069 1122011 1091894 1291528 922534 1284731 1076636 968655 1113698 960913 971767
14655I71767L17133J35468K430O5415k98781K67402j15804l25761M40683n04685
$$ 971767 1288900 1424368 1426798 1492213 1193432 1460834 1345030 1019269 1459952 955267
14645I55267J49556L039K14668J9236m68525L61894k24509o0424K27493M26172
$$ 955267 1104823 1107862 1322530 1341766 873241 1235135 1010626 950202 1177695 1603867
14635A603867l77315p5115l61461P57273k64841j6451J07817L0450K7192j42166
$$ 1603867 1226552 1151437 789976 1547249 1282408 1265957 1373774 1404224 1431416 1289250
14625A289250j49981J87813M48316l10978m8230j40276j22782L47480j76222n0608
$$ 1289250 1139269 1327082 1775398 1464420 1416190 1275914 1153132 1500612 1324390 1273782
14615A273782j16013M01496j91502K73601j63073p8732j50458N02779k09765r3259
$$ 1273782 1157769 1559265 1367763 1641364 1478291 1399559 1249101 1751880 1542115 1448856
14605A448856K21065q8898L0555j03483Q4941j79812J56926O7775O3497l81999
$$ 1448856 1669921 1581023 1611578 1508095 1593036 1413224 1570150 1637925 1701422 1319423
14595A319423p975M33445m7819L9870l056J84373j51567K22805n45745Q03580
$$ 1319423 1311448 1744893 1697074 1736944 1733888 1918261 1766694 1989499 1443754 2247334
14585B247334k46305j78476n0347j6956k49402N94063J15360p05341P45426j42106
$$ 2247334 2001029 1822553 1772206 1755250 1505848 2099911 2215271 1509930 2255356 2113250
14575B113250j79184L79607O787l76290N953j09518K37860O9255j51108L99028
$$ 2113250 1934066 2313673 2320460 1944170 1950123 1840605 2078465 2147720 1996612 2395640
14565B395640k18399L00964j21413P488P5497L65914j29283J28772R5202J89238
$$ 2395640 2177241 2478205 2356792 2364280 2439777 2805691 2676408 2805180 2900382 3089620
14555C089620J56169K02550J59329N67827K11494J365589J708348L468193P245042
$$ 3089620 3245789 3448339 3607668 4175495 4386989 5752578 7460926 10929119 18174161
14546A8174161K0483616P094210A9254267H642814l457318j699727n20973k23991
$$ 18174161 38657777 45751987 19254267 8642814 5185496 3485769 2964796 2740805
14538B740805L39730P27736K290317k260568j344848l81291j0953J41494K86723
$$ 2740805 3080535 3808271 6098588 3838020 2493172 2111881 2100928 2242422 2529145
14529B529145l88138K9373J24611q4040q0104J69242L2517J07760q6150K51233
$$ 2529145 2141007 2170380 2294991 2210951 2130847 2300089 2332606 2440366 2354216 2605449
14519B605449K7713j55858R9665J04559J1451k58425M22316j37680j03452J25358
$$ 2605449 2633162 2477304 2576969 2681528 2692979 2434554 2856870 2719190 2615738 2741096
14509B741096j655K34794l25560K22500J03849j53843M36076l93355L73476j81956
$$ 2741096 2739441 2974235 2648675 2871175 2975024 2821181 3257257 2863902 3237378 3055422
14499C055422O3914J126n0053M30093l71403L33607k27217r138K98857j35669
$$ 3055422 3119336 3120462 3070409 3500502 3129099 3462706 3235489 3226351 3525208 3389539
14489C389539J47405J02577j88253K0922K41646j66117j03483J13708K26744j53895
$$ 3389539 3536944 3639521 3451268 3472190 3713836 3547719 3444236 3557944 3784688 3630793
14479C630793K75177q3142J21002O7192K3173M02727m76423K99022J6077m8599
$$ 3630793 3905970 3822828 3943830 4011022 4034195 4436922 3960499 4259521 4275598 4226999
14469D226999j25545P1274O1296L54597K1320N9537p8444j035O0533K30507j62965
$$ 4226999 4101454 4172728 4234024 4588621 4609941 4669478 4591034 4589999 4650532 4881039 4718074
14458D718074J43589K30159j85954K75581K21948l06724R3068m5309K25792K24218
$$ 4718074 4861663 5091822 4905868 5181449 5403397 5096673 5189741 5144432 5370224 5594442
14448E594442o2266K92481j09467K9241m424O7224J36618K16786q5145J10727
$$ 5594442 5532176 5824657 5715190 5744431 5740007 5807231 5943849 6160635 6075490 6186217
14438F186217j28016j12163P70607j89102K5580M65950q4547k72246L00131o6084
$$ 6186217 6058201 5946038 6716645 6527543 6553123 7019073 6934526 6662280 6962411 6896327
14428F896327O05369k73475K37922k43929N26094N3488L55763q343K12690Q8338
$$ 6896327 7501696 7228221 7466143 7222214 7748308 7801796 8157559 8149216 8361906 8450244
14418H450244J04664j80925K91210J43523j2113K65095n6689j35095K25745J98336
$$ 8450244 8554908 8373983 8665193 8808716 8796603 9061698 9005009 8869914 9095659 9293995
14408I293995P0201N94648J47211K37320N2507j08474K10309j620J92167R4797
$$ 9293995 9364196 9958844 10106055 10343375 10395882 10287408 10497717 10496097 10688264 10783061
14398A0783061J40537K89378o036J69933M90715J64987P9429N7772M88939J3662
$$ 10783061 10923598 11212976 11206940 11376873 11867588 12032575 12112004 12169776 12658715 12672377
14388A2672377M07235L37323J45190J8289q5941R29090L99694L32341K1587L95207
$$ 12672377 13079612 13416935 13562125 13580414 13494473 14423563 14823257 15155598 15177185 15572392
14378A5572392p4564Q7903N37010j0530L88500K75036O00611M0873N81893L25786
$$ 15572392 15497828 15585731 16122741 16112211 16500711 16775747 17376358 17417231 17999124 18324910
14368A8324910P02139M97806O51682j49706K92796O11162M51080O49208P3469
$$ 18324910 19027049 19524855 20176537 20026831 20319627 20930789 21381869 22031077 22104546
14359B2104546J96537J114410o6040J180037J43681O94450P35482M16614M74102
$$ 22104546 22301083 23415493 23349453 24529490 24673171 25367621 26103103 26519717 26993819
14350B6993819J008115M00801R58947P06395Q84055L50229Q16515J441796N67150
$$ 26993819 28001934 28402735 29361682 30068077 30952132 31302361 32118876 33560672 34127822
14341C4127822R03605J084241R79154R31486J421898M61369J493999J341566J454011
$$ 34127822 35031427 36115668 37094822 38026308 39448206 39909575 41403574 42745140 44199151
14332D4199151J362930J074442J407991J596924J667028J593132K039016J581684
$$ 44199151 45562081 46636523 48044514 49641438 51308466 52901598 54940614 56522298
14324E6522298J909587K154080K055326K568379K193339K626941K475301K523205
$$ 56522298 58431885 60585965 62641291 65209670 67403009 70029950 72505251 75028456
14316G5028456K600659K530860L463732L476159L300504L960194L753832M256776
$$ 75028456 77629115 80159975 83623707 87099866 90400370 94360564 98114396 102371172
14308A02371172M248250M259580N092488M994837N690644N929402O260232O361816
$$ 102371172 106619422 110879002 115971490 120966327 126656971 132586373 138846605 145208421
14300A45208421O770040P096587P848109Q208406Q530578R005275R999879J0098016
$$ 145208421 151978461 159075048 166923157 175131563 183662141 192667416 202667295 212765311
14292B12765311J0775725J1029164J1869235J2874661J2902321J3362848J4119912
$$ 212765311 223541036 234570200 246439435 259314096 272216417 285579265 299699177
14285B99699177J4204624J4811326J4948726J5125283J5200877J4499973J4390529
$$ 299699177 313903801 328715127 343663853 358789136 373990013 388489986 402880515
14278D02880515J3616329J2716480J1513230R651941O874623L412093J710604
$$ 402880515 416496844 429213324 440726554 450378495 457253118 460665211 462375815
14271D62375815P78440P83233l726035n145487q090501r391212r920789j0185367
$$ 462375815 463154255 463937488 460211453 455065966 446975465 437584253 427663464 417478097
14263D17478097j1648391j2811987j4394107j4520363j5138994j5505214j5317449
$$ 417478097 405829706 393017719 378623612 364103249 348964255 333459041 318141592
14256C18141592j5207181j4733373j4332260j3642193j2919189j2430106j1766558
$$ 318141592 302934411 288201038 273868778 260226585 247307396 234877290 223110732
14249B23110732j1343896j0873456q542032q674074r072433q147700q170418p323077
$$ 223110732 211766836 200893380 192351348 183677274 174604841 166457141 158286723 150963646
14241A50963646p118596o420174o256623n412600n290727n577373m909009m529598
$$ 150963646 143845050 137424876 131168253 125755653 120464926 114887553 109978544 105448946
14233A05448946m469869m033397l226599l872214l350810l520682l189924l092954
$$ 105448946 100979077 96945680 93719081 89846867 86496057 82975375 79785451 76692497
14225G6692497k924398k582635k519517k235417k426743j948455k315874j779168
$$ 76692497 73768099 71185464 68665947 66430530 64003787 62055332 59739458 57960290
14217E7960290k141624j876215j510232j039894j844327j756436j177741j514704
$$ 57960290 55818666 53942451 52432219 51392325 49547998 47791562 46613821 45099117
14209D5099117j195140j068105j021872j008471j632792r08219j224758j059731
$$ 45099117 43903977 42835872 41814000 40805529 39172737 38264518 37039760 35980029
14201C5980029m14296j057498r34658j149214r42673o58537o51751o87442o15649
$$ 35980029 35565733 34508235 33573577 32424363 31481690 30823153 30171402 29483960 28868311
14192B8868311p64909n88694r60993n52885k30373q55578q27236m23526n49500
$$ 28868311 28103402 27514708 26553715 26000830 25770457 24914879 24087643 23664117 23114617
14183B3114617k67592m75626l62210m87122n55642m99445m25487l15387n16943
$$ 23114617 22847025 22371399 22009189 21522067 20966425 20466980 20041493 19726106 19209163
14174A9209163l55836m51858j83393m43509l13141j01485n30727l85847k04501
$$ 19209163 18853327 18401469 18218076 17774567 17461426 17359941 16829214 16443367 16238866
14165A6238866m44311k03288n66261j10802L39100o48359l54916l83108l75412
$$ 16238866 15794555 15591267 15025006 14914204 15253304 14604945 14250029 13866921 13491509
14156A3491509k21940k61275K39034j75563k17448m13130J40044n29504M6475
$$ 13491509 13269569 13008294 13247328 13071765 12854317 12441187 12581231 12051727 12098202
14147A2098202n08303J30227m9780k44993m48206k29045R4995m34296n1238k13892
$$ 12098202 11589899 11720126 11670346 11425353 10977147 10748102 10843097 10408801 10357563 10143671
14137A0143671J82013l56427k18577j41089L83903m82893m3620j69329o98139
$$ 10143671 10325684 9969257 9750680 9609591 9993494 9510601 9466981 9297652 8599513
14128H599513L098K60374k46730l87848R4182P5543k48773J15905r3535l14997
$$ 8599513 8602611 8862985 8616255 8228407 8322589 8398132 8149359 8265264 8171729 7856732
14118G856732r6003j98726j54988l5954K40200l69987j6024J52057m45395L1263
$$ 7856732 7760729 7562003 7407015 7371061 7611261 7241274 7225250 7377307 6931912 6963175
14108F963175L6697k55059j44952o7071j35357J55818k04340k67833J87026k30723
$$ 6963175 6999872 6744813 6599861 6532790 6397433 6553251 6348911 6081078 6268104 6037381
14098F037381q0109K576M8654k81066J37759j93620j46346J47984r0474k68709
$$ 6037381 5957272 5959848 6008502 5727436 5865195 5671575 5525229 5673213 5582739 5314030
14088E314030j48920L01469l51247K21933k22617R1560J6173j102Q7055m67264
$$ 5314030 5165110 5466579 5115332 5337265 5114648 5206208 5222381 5221279 5308334 4841070
14078D841070J94085r0680j60316K24666k22864Q5783n67848K24125q2653O2221
$$ 4841070 5035155 4944475 4784159 5008825 4785961 4871744 4303896 4528021 4445368 4507589
14068D507589j41134K32878l27002N4066j43630L01159k82658L2127M1181m0057
$$ 4507589 4366455 4599333 4272331 4326397 4182767 4483926 4201268 4233395 4274576 4234519
14058D234519K64423n66898L18988j50395m0778o25512M27683r7130n6948R3975
$$ 4234519 4498942 3932044 4251032 4100637 4059859 3434347 3862030 3764900 3707952 3801927
14048C801927j45729r1009J62176k70732J24563L40793m63270k42800L60231l38645
$$ 3801927 3656198 3565189 3727365 3456633 3581196 3921989 3458719 3215919 3576150 3237505
14038C237505p1578j02908L59583l89792j03799Q8096J61687j00508m091o3602
$$ 3237505 3165927 3063019 3422602 3032810 2929011 3017107 3178794 3078286 3074195 3010593
14028C010593J12673j8738l44628J48102L67227m38935J59707R4398m69352J42008
$$ 3010593 3123266 3104528 2759900 2908002 3275229 2836294 2996001 3090399 2621047 2763055
14018B763055p7717r1854L31882l74979M8500R205k80225K72366j73664J03417
$$ 2763055 2685338 2593484 2925366 2550387 2598887 2608092 2327867 2600233 2426569 2529986
14008B529986j40940R8708q7537J42687J00173k83954o6658o2362k31947L89943
$$ 2529986 2389046 2487754 2400217 2542904 2643077 2359123 2292465 2230103 1998156 2388099
13998B388099k83066j5128j10878L5910J99866K6131K63300J70621J80473J006174
$$ 2388099 2105033 2089905 1979027 2014937 2214803 2240934 2504234 2674855 2855328 3861502
13988C861502J904238N176934J6684881K1606286k2725203j2823281m808710k335125
$$ 3861502 5765740 10942674 27627555 49233841 26508638 13685357 8876647 6541522
13980F541522j152621j122344n51812J98305k87216o75988r2873j03181o1105
$$ 6541522 5388901 4266557 3714745 3913050 3625834 2949846 2856973 2753792 2692687
13971B692687j08264J54142j20862k99526K23262j55325j64963Q3511j2905K17618
$$ 2692687 2584423 2738565 2617703 2318177 2541439 2386114 2221151 2304662 2291757 2509375
13961B509375O221m32709K46349m06536O02532l21235n22j30224m1460K8316J58760
$$ 2509375 2515596 2082887 2329236 1922700 2525232 2203997 2203475 2073251 2031791 2060107 2218867
13950B218867k73858J46049J97807r6982j30296k558k19627m4425J04748j43321
$$ 2218867 1945009 2091058 2288865 2191883 2061587 2059029 1839402 1794977 1899725 1756404
13940A756404K5318L0559k06612K09336k55614M72587o30995l2227M11217K29901
$$ 1756404 1781722 1812281 1605669 1815005 1559391 2031978 1400983 1368756 1779973 2009874
13930B009874r6588j92376n24279N43450O2394n5288j8416k02993K90382l69175
$$ 2009874 1913286 1720910 1196631 1740081 1802475 1747187 1728771 1525778 1816160 1446985
13920A446985M32629k84977N5277o0856l46426L60422k20890M86081n18233J13222
$$ 1446985 1879614 1594637 1649914 1589058 1242632 1603054 1382164 1868245 1350012 1463234
13910A463234J54501k63843J28349J89634m2217O5203J50310k74316j95101L11558
$$ 1463234 1617735 1353892 1482241 1671875 1629658 1694861 1845171 1570855 1375754 1687312
13900A687312k55725j3897J07190p6483l8220j70915L09113m4332q0017l305j66737
$$ 1687312 1431587 1417690 1524880 1448397 1410177 1239262 1548375 1504043 1424026 1420721 1253984
13889A253984J45356j71953j03435n722J72342n5279l0475r5502L42325j67394
$$ 1253984 1399340 1227387 1123952 1118230 1290572 1235293 1204818 1109316 1451641 1284247
13879A284247j18118J00668J27023j43758j70780R6119o1478R9047j63820j37757
$$ 1284247 1166129 1266797 1393820 1250062 1079282 1175401 1113923 1212970 1049150 911393
13869I11393O17567k87756K52043l71617m62300L93524J64375K60975k61813j3744
$$ 911393 1528960 1241204 1493247 1121630 659330 1052854 1217229 1478204 1216391 1202647
13859A202647J80072o487l84861l7928K11282q5163l54575L59430P2517K35920
$$ 1202647 1382719 1376232 991371 953443 1164725 1079562 724987 1084417 1156934 1392854
13849A392854k51254l0308k40893j33111N4367P7957J88733j03790J09613O0359
$$ 1392854 1141600 1111292 870399 737288 791655 869612 1058345 954555 1064168 1124527
13839A124527K38445j50377l94565L18066k7105k37623Q6302k47255L45479j45559
$$ 1124527 1362972 1212595 818030 1136096 1108991 871368 957670 710415 1055894 910335
13829I10335J32857j17335L0117j74821Q9151L8975K03551q1224P28j85395o3827
$$ 910335 1043192 925857 955974 781153 870304 909279 1112830 1031606 1032334 846939 783112
13818G83112o5368M52050j33528l11694J94917J27276j95874l7855J93509j29661
$$ 783112 717744 1169794 1036266 724572 919489 1046765 850891 813036 1006545 876884
13808H76884J80293k27832K509j30301K67792j06784N8380j98854J90982m7888
$$ 876884 1057177 829345 831854 701553 969345 862561 920941 722087 913069 865181
13798H65181k08371K33442C05311O22022j87236J65686k61561J42411J57877m68368
$$ 865181 656810 890252 305311 927333 740097 905783 644222 786633 944510 476142
13788D76142L36512j48887k49853K79815J68580j35606J92418j27596k80968J11038
$$ 476142 812654 663767 413914 693729 862309 726703 919121 791525 510557 621595
13778F21595J43429q6819l3949m9173j47399K73244J18343k0870k4397J5645j10657
$$ 621595 765024 678205 644256 595083 447684 720928 839271 818401 794004 809649 698992
13767F98992L94126r6323l46658K5066J10316J08871p8129n1648R6414B16758
$$ 698992 1093118 996795 650137 675203 785519 894390 816261 764613 861027 216758
13756C05227M29659k99466N2021Q1698J12411L51005j17457k15430J9995L31650
$$ 305227 734886 435420 487441 569139 681550 1032555 915098 699668 719663 1051313
13746A051313m75377j07919J38610J9044J09538C43367K99941n1812J69857C29067
$$ 1051313 575936 468017 606627 625671 735209 343367 643308 591496 761353 329067
13735F06690N8522k4991L34263C60254J10608K3963K02103k7718j78952Q7434
$$ 606690 665212 640221 974484 360254 470862 494825 696928 669210 490258 577692
13725E77692J56822n013k94541J37427o7140K02486j18452j42914M5740L1901
$$ 577692 734514 729501 434960 572387 505247 707733 589281 446367 492107 524008
13715E24008l208K01054j31990K5494L4232j28902J31944O1932O9817l3459l35151
$$ 524008 520800 721854 589864 615358 649590 520688 652632 714564 784381 750922 415771
13704D15771K3930K93000l40027L77604l02484J48880l6183J1005j05322o5719
$$ 415771 439701 732701 392674 770278 467794 616674 580491 591496 486174 420455
13694D20455j80890J84190J98226n1016M0055j65770j4656K66761k72137M7451
$$ 420455 239565 423755 621981 570965 611020 445250 430594 697355 425218 472669
13684D72669q3260M36675j50004k01059K74610l37428j06096j5228L84513p0836
$$ 472669 389409 826084 676080 475021 749631 412203 306107 290879 675392 604556
13674F04556N3868k28196P0022A20566M12550q6227j10311R5267L78857j65027
$$ 604556 658424 430228 500250 120566 533116 446889 336578 431845 810702 645675
13664F45675j45834j59723k6693J99488P4308k40853m8927A22934M24782j29339
$$ 645675 499841 340118 313425 512913 587221 346368 297441 122934 547716 418377
13654D18377J65157J90946k55303J09824k24766M63604C36629K16698A86094J09685
$$ 418377 583534 774480 519177 629001 404235 867839 336629 553327 186094 295779
13644B95779J84564J85090j94455B00736P9813L42506j66607q2951K03045n0322
$$ 295779 480343 665433 470978 200736 280549 623055 456448 373497 576542 526220
13634E26220P2609p2433j27884k5631J86978A93482L51265j27064k9849K37163
$$ 526220 598829 526396 398512 372881 559859 193482 544747 417683 387834 624997
13624F24997p9279k28244J90402j90146J92288A92538M22750j3140k88006J92918
$$ 624997 545718 317474 507876 317730 510018 192538 615288 602148 314142 507060
13614E07060k21784L38561B80492M64189k54863K16685j14527k45130n9787j20109
$$ 507060 285276 623837 280492 744681 489818 706503 591976 346846 287059 166950
13604A66950L12290J91999l07854j1664n624J54337p4881M3857O2772j73461j61184
$$ 166950 479240 671239 363385 351721 346097 500434 425553 469410 532182 358721 197537
13593A97537K49147k16983d2201B75187K09067j30731l0472J19672N210b71871
$$ 197537 446684 229701 -42201 275187 484254 353523 323051 442723 447933 -271871
13582C30210M1151M4137j33384Q1703o1702b40126B49013J36256K90632m438k51047
$$ 330210 371361 415498 282114 363817 302115 -240126 249013 385269 675901 671463 420416
13571D20416B08923H6724P01943l50608C7597M81661B54212J03215A55869Q6002
$$ 420416 208923 86724 788667 438059 37597 519258 254212 357427 155869 241871
13561B41871R742J52086m1176n0942Q2428j66358J82254R9433k52141J50243q8499
$$ 241871 251613 403699 362523 311581 394009 227651 409905 509338 257197 407440 318941
13550C18941J49785k06069j25403K15913J64198B43518K24209A02082L48691n2624
$$ 318941 468726 262657 137254 353167 517365 243518 467727 102082 450773 398149
13540C98149a4927B51663K46044n7278J30955d1887A67696K02839M3041I7863
$$ 398149 -14927 251663 497707 440429 571384 -41887 167696 370535 413576 97863
13529C15638J8311j51072J06929M4696L3920P4209A45463C5909M32206k10247
$$ 315638 333949 182877 289806 334502 368422 442631 145463 35909 468115 257868
13519B57868M7456A01237M54379j87701j35528K96655j67605R6492A60722J40497
$$ 257868 305324 101237 555616 367915 232387 529042 361437 457929 160722 301219
13509C01219N5797L8360M3267B16898G0742L01300K53755C6931L07979g2803H38425
$$ 301219 357016 395376 438643 216898 70742 372042 625797 36931 344910 -72803 838425
13497C96579p5035A37765J16640o1869n5621P7513J24585N389o0775O499r4066
$$ 396579 321544 137765 254405 192536 136915 214428 339013 344402 283627 290126 196060
13486A96060m4025P6824R1033o8400m4481J38900J1488l4540J00916H428J00294
$$ 196060 152035 228859 319892 251492 207011 345911 357399 322859 423775 8428 108722
13475A08722J9993K046e373C7171M43092B07069J35892N0666J55980B01897q0370
$$ 108722 128715 130761 -5373 37171 480263 207069 342961 393627 549607 201897 121527
13464A21527M54952k63014F5097L76430a11794A7693K65317n4059J00971q2729
$$ 121527 576479 313465 65097 441527 -111794 17693 283010 228951 329922 247193
13454B47193K72426A4091L96878j07472J79549A41974R8465c0897C89101e1993
$$ 247193 519619 14091 410969 303497 483046 141974 240439 -30897 389101 -51993
13443F3021L71442j36014A05296J54501j14400Q1848l0024J59843K39887f7339
$$ 63021 434463 298449 105296 259797 145397 227245 197221 357064 596951 -67339
13432D01315j85061m6919D1888L07013o6801N6064D4175L27872j16819q3989J0186
$$ 401315 216254 169335 41888 348901 282100 338164 44175 372047 255228 171239 181425
13421A81425E2627J61471H8693M32650j17907j04956F5016a01227A47573B5203
$$ 181425 52627 214098 88693 521343 403436 298480 65016 -101227 147573 25203
13410A78383K64126P07O392A60752J37028K27203k23337j45247n202n7120b56159
$$ 178383 442509 443216 449608 160752 297780 524983 301646 156399 151197 94077 -256159
13398D02376a5155B95144K33204I1637P7194J0260L69725n992j74542a5971D19404
$$ 402376 -15155 295144 528348 91637 168831 179091 548816 542824 368282 -15971 419404
13386B21216K1187a3382A73450n5305k7925a46442D34624l4516J46767I5470h657
$$ 221216 242403 -13382 173450 118145 90220 -146442 434624 400108 546875 95470 -8657
13374B60334K7761L3606A45655m3259J07258f8343A60227J02183j22277J58092
$$ 260334 288095 321701 145655 102396 209654 -68343 160227 262410 140133 298225
13364B98225a32047A60715K16237J65959A91554J93483b26055C6855N40905B25558
$$ 298225 -132047 160715 376952 542911 191554 385037 -226055 36855 577760 225558
13353B61764o284J42618j29786o2542J47713F3440K02451J55354J66809A19332
$$ 261764 255480 398098 268312 205770 353483 63440 265891 421245 588054 119332
13342I9496J12543o1652P1220K97076H8213L31530I9056K40984J3358Q2768j81464
$$ 99496 212039 150387 221607 518683 88213 419743 99056 340040 353398 436166 254702
13331B54702j7074M7768J9926Q7904F9226J5409L18770j49123B3120M48478A80975
$$ 254702 237628 285396 305322 393226 69226 84635 403405 254282 23120 471598 180975
13319b19023B34774J65272h6075B11101R5628l6213K36786A09347A876L03038
$$ -219023 234774 400046 -86075 211101 306729 270516 507302 109347 1876 304914
13309C04914l3782A19698J25623A18470m041A1774K38602l0920N8689j3786n1321
$$ 304914 271132 119698 245321 118470 114429 11774 250376 219456 278145 264359 213038
13298B13038j05680f7947E4038a67085D83979b39631A87624a360B30874M4628
$$ 213038 107358 -67947 54038 -167085 483979 -239631 187624 -1360 230874 275502
13288B75502n7461K2766J08790A63763Q1951q1454J02596r1706N2709J50093F0583
$$ 275502 218041 240807 349597 163763 245714 164260 266856 175150 227859 377952 60583
13276e6694A14119M740M0800d1143j05380A75265c1436I0800g1438B0596L33912
$$ -56694 114119 118859 159659 -41143 -146523 175265 -31436 90800 -71438 20596 354508
13265C54508C7374N36958B32816K47306A51585R9032J63652I1525k2126A7992
$$ 354508 37374 574332 232816 480122 151585 250617 414269 91525 69399 17992
13254D1084J25150J65838i4647c7356F8049a48273C07095m4200A17447L90051
$$ 41084 166234 332072 -94647 -37356 68049 -148273 307095 262895 117447 507498
13244E07498D9708L81556b08385B88852f8249D7515J07615E4352J1693R8925f319
$$ 507498 49708 431264 -208385 288852 -68249 47515 155130 54352 66045 164970 -6319
13232B05780G3759M6745b3418C33083b24359g7082C76543m4133K8045j54401b36335
$$ 205780 73759 120504 -23418 333083 -224359 -77082 376543 332410 360455 206054 -236335
13220A56498m0654c11H520M3825f6092A39987J29601o0971A04040f0094A79820
$$ 156498 115844 -311 8520 52345 -66092 139987 269588 208617 104040 -60094 179820
13208b2186F2699K35166g647j52848A27323m4614a8070C94905F1335b04480G8137
$$ -22186 62699 297865 -7647 -160495 127323 82709 -18070 394905 61335 -204480 78137
13196b67046B33406a78084C16799a26255A05348a63828A02902C4099N7346a5425
$$ -267046 233406 -178084 316799 -126255 105348 -163828 102902 34099 91445 -15425
13185E7205J55952h2458A14838J63371C2335e9662C3552c157k35640A14123K79099
$$ 57205 213157 -82458 114838 278209 32335 -59662 33552 -3157 -238797 114123 393222
13174C93222A16770e3329r677F1373b4902A32335C5376J69274I9705Q0544o4545
$$ 393222 116770 -53329 -63006 61373 -24902 132335 35376 204650 99705 180249 115704
13163A15704n3878J68619F0168a09561G9662K1018K52335K6233D2350b0685A9388
$$ 115704 61826 230445 60168 -109561 79662 100680 353015 379248 42350 -20685 19388
13151B2735M45537c23463G6031J57773a07848j19284E6704K38034B8612O9112
$$ 22735 468272 -323463 76031 233804 -107848 -227132 56704 294738 28612 97724
13141I7724J72221c7297A18385K47146P4728j44645F6452b58193K8429P5978B68961
$$ 97724 269945 -37297 118385 365531 440259 295614 66452 -258193 -229764 -153786 268961
13129B81655b8994B67557q3553N7025A10128j1502a37666e8990A23863D9115a74567
$$ 281655 -28994 267557 184004 241029 110128 98626 -137666 -58990 123863 49115 -174567
13117B33688E6916O9154h6614B90296B0998K40760I8818j3454a55k01716D80607
$$ 233688 56916 126070 -86614 290296 20998 261758 98818 85364 -155 -201871 480607
13105a29676B88073q7209q5637b35908I5739b54049B77869o3211b54372A20544
$$ -129676 288073 200864 115227 -235908 95739 -254049 277869 214658 -254372 120544
13094i584k2192B46090G4711P1820A0048h0134B14289L34719H0087P9685J7542
$$ -9584 -31776 246090 74711 146531 10048 -80134 214289 549008 80087 159772 177314
13083A77314B0870J40761a57281b7535l6197A32667J26347c03844R868B51833
$$ 177314 20870 161631 -157281 -27535 -63732 132667 259014 -303844 -293976 251833
13072A03276m1328R7135N9557E1027R3592l340J55723K7594F2853M911P598Q0422
$$ 103276 61948 159083 218640 51027 144619 141279 297002 324596 62853 67764 75362 155784
13060A55784l1015a26948A64052A5015J59026l6049A9495O2458J82478A00032
$$ 155784 124769 -126948 164052 15015 174041 137992 19495 81953 264431 100032
13049C09082K9647I2191M5282c3761q2500E94668A59978F6636l0109J4707K35562
$$ 309082 338729 92191 137473 -33761 -116261 594668 159978 66636 36527 51234 286796
13038B86796I4556j5511c9932C6643e3350j73409a06137a3839B5716a00615A85885
$$ 286796 94556 79045 -39932 36643 -53350 -226759 -106137 -13839 25716 -100615 185885
13026i1016A72550J20495A45903C3459C967O1937K47194E4884J2488b60713D26421
$$ -91016 172550 293045 145903 33459 3967 65904 313098 54884 67372 -260713 426421
13014A51793R7346J80492B5790K00031o4930M4157g1658j58825B21442g5927B57809
$$ 151793 249139 429631 25790 225821 160891 205048 -71658 -230483 221442 -75927 257809
13002a73435A73794a88770B14900K7565F8412L25226A90087b23515c3902I1808
$$ -173435 173794 -188770 214900 242465 68412 393638 190087 -223515 -33902 91808
12991I8638b4827l30574A40616d6523C41188j34843l5193E8305a42212C0857b2547
$$ 98638 -24827 -355401 140616 -46523 341188 206345 171152 58305 -142212 30857 -22547
12979B81018K43637F9809a50075g0450F7323a05919b4699B84573f5449A94273
$$ 281018 524655 69809 -150075 -70450 67323 -105919 -24699 284573 -65449 194273
12968B66323N2035c6395B61526c4944A72308R1800r6537C7075J71482a0699D3010
$$ 266323 318358 -36395 261526 -34944 172308 264108 167571 37075 208557 -10699 43010
12956C629J82025b98013A17911J15309b18161B91825b2015D0638J87415c4659
$$ 3629 185654 -298013 117911 233220 -218161 291825 -22015 40638 228053 -34659
12945a53870P0281C8064K08095J62136a49204J6033B33442B3273a1300J107H5844
$$ -153870 -83589 38064 246159 408295 -149204 -133171 233442 23273 -11300 -10193 85844
12933C38704a98181A98430n4969h2095J8627H8680j0722M6307R0004Q165a72874
$$ 338704 -198181 198430 143461 -82095 -63468 88680 77958 124265 214269 222434 -172874
12921B86214o5744b42241D3174J96677q8586B2417K70326j36437n6498b6625l8314
$$ 286214 220470 -242241 43174 239851 151265 22417 292743 156306 99808 -26625 -64939
12910f4939B91878c6157A9731d4343A8535K87817c00342A41203J83395g5420C7157
$$ -64939 291878 -36157 19731 -44343 18535 306352 -300342 141203 324598 -75420 37157
12898a33208G1207C0747h7925B58346o3947b09492C31026G9261a76056B0807L1739
$$ -133208 71207 30747 -87925 258346 194399 -209492 331026 79261 -176056 20807 52546
12887E2546j7080N1210a29971o0508N7221H7577e6210D3982d42985a65685j01425
$$ 52546 35466 86676 -129971 -190479 -133258 87577 -56210 43982 -442985 -165685 -267110
12876b67110n9679A15638k2799b662r7454E5981d0170B05620Q0847h059l1675
$$ -267110 -326789 115638 92839 -2662 -100116 55981 -40170 205620 286467 -8059 -39734
12865c9734E08934a91644a0474C5953K48388b13885B09280C0511a48194A43683
$$ -39734 508934 -191644 -10474 35953 284341 -213885 209280 30511 -148194 143683
12854f8923J1318C8176b66607a02864A8016m689N9604J66639a71105E5592R7403
$$ -68923 -57605 38176 -266607 -102864 18016 13327 72931 239570 -171105 55592 152995
12843A52995a26263C1417J19636C5599a77904A66930D2081a07390n3173P6506
$$ 152995 -126263 31417 151053 35599 -177904 166930 42081 -107390 -160563 -84057
12833h4057M247p1277m7766r3818A45913J13663a23129A35253f1440F5123O0578
$$ -84057 -79810 -151087 -198853 -292671 145913 259576 -123129 135253 -61440 65123 125701
12822A25701n2301N3036J98234d9343B655J55598J25133C8030K35145C3174M427
$$ 125701 73400 126436 324670 -49343 2655 158253 283386 38030 273175 33174 37601
12811C7601a13788e053D13316a89859B8278J98085p6726f5609C66283j81260p8420
$$ 37601 -113788 -5053 413316 -189859 28278 226363 149637 -65609 366283 185023 106603
12800A06603b34009A69389j3942F4206J35883Q9597J33796b02722m3830h1635
$$ 106603 -234009 169389 155447 64206 200089 289686 423482 -202722 -246552 -81635
12789b48344A60629d8796K8A93114e4099E355O1892g7437j10346F2555L22005
$$ -248344 160629 -48796 -48768 193114 -54099 5355 67247 -77437 -187783 62555 384560
12778C84560A79261b80871A04507J20978a22382d3389a1751j90662b922r6744
$$ 384560 179261 -280871 104507 225485 -122382 -43389 -11751 -202413 -2922 -99666
12768i9666j85505c2783A63141a65434A54781a36449e8383E1463A9222b37191
$$ -99666 -285171 -32783 163141 -165434 154781 -136449 -58383 51463 19222 -237191
12757A69792h8274A29931a94172I82J27099g6600l81107i3633a0433E142R654
$$ 169792 -88274 129931 -194172 982 128081 -76600 -457707 -93633 -10433 5142 14796
12746A4796L6686c7371j18456H4321J30449q7412L16730F9726a56821A67563g971
$$ 14796 51482 -37371 -155827 84321 214770 127358 444088 69726 -156821 167563 -7971
12734B14140k7931H9885B9858d2641C35664A35901j5431a6876C46680c2003C461
$$ 214140 186209 89885 29858 -42641 335664 135901 120470 -16876 346680 -32003 3461
12722d84687B19814d3070A06562Q8602a59972B59067J56411j63346c28007L6502
$$ -484687 219814 -43070 106562 195164 -159972 259067 415478 252132 -328007 -291505
12712b91505C41077a3416F0754M17913k35907K33612G0362a52788l1579b9102
$$ -291505 341077 -13416 60754 478667 242760 476372 70362 -152788 -184367 -29102
12701F764c6669A24357a1411E1815B1404a34290q6447A45631n7674B904e9036
$$ 6764 -36669 124357 -11411 51815 21404 -134290 -220737 145631 87957 2904 -59036
12689A37702R2000r2723e7642k02423H9112F040c954B17731a46C18567K4730q7329
$$ 137702 229702 136979 -57642 -260065 89112 6040 -3954 217731 -146 318567 343297 255968
12677B55968A7991b415k46362A02508a76621j08728e558A8264J59468d8384j01639
$$ 255968 17991 -2415 -248777 102508 -176621 -285349 -5558 18264 177732 -48384 -150023
12666a50023I6550J56583F0930L91885B00385a074B11599r3658b10850A32611
$$ -150023 96550 253133 60930 452815 200385 -1074 211599 117941 -210850 132611
12655a70262E2879b00963O0851l4688A7468K9745K32726l7249g6269B24703g8395
$$ -170262 52879 -200963 -140112 -174800 17468 47213 279939 242690 -76269 224703 -78395
12643d3283n4430A11533d8682A21122C088K1836N4629L93941A05726l6411a28898
$$ -43283 -97713 111533 -48682 121122 3088 24924 79553 473494 105726 69315 -128898
12631a78980g8715J0579B02467r4082K67490j61210R427b97287A39103J08294
$$ -178980 -78715 -68136 202467 108385 375875 214665 224092 -297287 139103 247397
12621B47397K01912j75917l8007l0778R9975a08445d0794A95550h2435I3082m3373
$$ 247397 449309 273392 235385 204607 304582 -108445 -40794 195550 -82435 93082 49709
12610D9709a82996E0184c45261H5830a6411j41735D7201K96342d2909B23485b28433
$$ 49709 -182996 50184 -345261 85830 -16411 -158146 47201 343543 -42909 223485 -228433
12598b69497E03256k11672l5999j446h412E07015B3858J96336m2286J16302d3516
$$ -269497 503256 291584 255585 254139 -8412 507015 23858 220194 177908 294210 -43516
12586A35288N1105J14780A38954c9910C03420E5263a39037A25997J15223b99095
$$ 135288 186393 301173 138954 -39910 303420 55263 -139037 125997 241220 -299095
12575d9968A91658a89058c706j01084A77141J7B1370a50654A65232L8989h2153
$$ -49968 191658 -189058 -3706 -104790 177141 177158 21370 -150654 165232 204221 -82153
12563C09789j41521C2803N6630c95710g867o4446C4318d2761a4285k0730j64793
$$ 309789 168268 32803 89433 -395710 -7867 -72313 34318 -42761 -14285 -35015 -199808
12552a99808C02619C9153a08642d861B56033a34859b6626B40768c2759q9523M1380
$$ -199808 302619 39153 -108642 -4861 256033 -134859 -26626 240768 -32759 -122282 -80902
12541h0902H7353a31281A46751M5779k0133i7452A42557A1180K69191a06948I7352
$$ -80902 87353 -131281 146751 192530 172397 -97452 142557 11180 280371 -106948 97352
12529a25790M2854A68943a40081j77388A73423f3642A01042P467a13834m54544
$$ -125790 -82936 168943 -140081 -317469 173423 -63642 101042 108509 -113834 -568378
12519e68378K21966A13092l1777a05038C87448A26046d9561E1720a35422I454
$$ -568378 -346412 113092 81315 -105038 387448 126046 -49561 51720 -135422 9454
12508b70068A84953f4559A08713f5293B94128c4628A46955c89258a56508k41682
$$ -270068 184953 -64559 108713 -65293 294128 -34628 146955 -389258 -156508 -398190
12498c98190d1252C29446a60753F9261m631i2670j22489A60029m8270a62685k01683
$$ -398190 -41252 329446 -160753 69261 64630 -92670 -215159 160029 111759 -162685 -364368
12487c64368A38822d7261j31254A93922D3468a9401C1815J63502E419J39800F3784
$$ -364368 138822 -47261 -178515 193922 43468 -19401 31815 195317 5419 145219 63784
12475B26639a90355j1288B01043m1417h4158L5571A9787J45890f7381p5786A4902
$$ 226639 -190355 -201643 201043 159626 -84158 -48587 19787 165677 -67381 -143167 14902
12463g1914o3420O0225q7355B51730C0007g4810A390N9931j4344R9425c6572l69887
$$ -71914 -135334 -75109 -162464 251730 30007 -74810 1390 61321 46977 146402 -36572 -406459
12451d06459o4326a09384q4613G3603q237a92932j71115C1852b5378A16114K1517
$$ -406459 -470785 -109384 -193997 73603 65366 -192932 -364047 31852 -25378 116114 137631
12440A37631J16055I3953O552L4670c3654p4321n2833a3095l30268H9724J65269
$$ 137631 253686 93953 100505 135175 -33654 -107975 -160808 -13095 -343363 89724 254993
12429B54993Q9171A39082E2431L8061c83385J78274N8874P0450L1354D1077c0128
$$ 254993 344164 139082 52431 90492 -383385 -205111 -146237 -75787 -44433 41077 -30128
12417d2716B17679a04418D9074i6112c6570A07920o434Q1971c03753J20425j01560
$$ -42716 217679 -104418 49074 -96112 -36570 107920 101486 183457 -303753 -183328 -284888
12406b84888A22067I580K2801K36961a88652A36869c9812m7673J1783A3879Q6560
$$ -284888 122067 9580 32381 269342 -188652 136869 -39812 -87485 -75702 13879 100439
12395A00439J13422G0341N5483n6497M7796K64690A4232K65882p3914L39121a11901
$$ 100439 213861 70341 125824 69327 117123 381813 14232 280114 206200 545321 -111901
12383F0946N0102J23569a60307j23903n173C43924j03014b25400a02013F3575
$$ 60946 111048 234617 -160307 -284210 -289383 343924 240910 -225400 -102013 63575
12372B2850b3271A32922N3555K8429A0169L42871A71334D8271a88371B80207b03898
$$ 22850 -23271 132922 186477 214906 10169 353040 171334 48271 -188371 280207 -203898
12360f6256H3357f7932J3835H3027a21877j1823M6970A35673k7163a16427C7628
$$ -66256 83357 -67932 -54097 83027 -121877 -133700 -86730 135673 108510 -116427 37628
12348C64332b5577A44928a58422I0537K481f7369A02972a60332F6200J07182J21371
$$ 364332 -25577 144928 -158422 90537 93018 -67369 102972 -160332 66200 173382 294753
12337B94753n781b75955c2944j13628k15648A97619L7k1038K1407c0760L19F4650
$$ 294753 288972 -275955 -32944 -146572 -362220 197619 197656 176618 198025 -30760 -30441 64650
12324A31574J80407J93633C2575O1049K30051R7251H004J82785O177q6669J98706
$$ 131574 311981 505614 32575 93624 323675 420926 8004 190789 196966 110297 309003
12313C09003m2046L047D0467R3496J64133I8575Q0904a07751B34450a05609C130
$$ 309003 266957 270004 40467 133963 298096 98575 179479 -107751 234450 -105609 3130
12301B94650A16238h4957A63574J63551A3265a48093f9468K4298F9545O5545a33928
$$ 294650 116238 -84957 163574 327125 13265 -148093 -69468 -45170 69545 135090 -133928
12289C40162A58506b45423a9060j94598B89315A16121J77758J8349H1169J24028
$$ 340162 158506 -245423 -19060 -213658 289315 116121 293879 312228 81169 205197
12279B05197k217J5325d344A57466J67610J1483j36541i8654A9984K88487o8353
$$ 205197 202980 218305 -4344 157466 325076 336559 200018 -98654 19984 308471 240118
12268B40118I4284L09317A36395M42733A02017a47820C01118j30441a30838F3654
$$ 240118 94284 403601 136395 579128 102017 -147820 301118 170677 -130838 63654
12257a25674B5349K90756c82543C45919A53776f1902A71645J61490j03583D5037
$$ -125674 25349 316105 -382543 345919 153776 -61902 171645 333135 229552 45037
12246I8042R1347a50735A32430b2698A1746P8823L7490e5252B36339m5601a8270
$$ 98042 189389 -150735 132430 -22698 11746 90569 128059 -55252 236339 190738 -18270
12234A3122L694K14232q8283O9398m2056P0562q5515L9385R4497A15977a21205
$$ 13122 16816 231048 142765 212163 170107 240669 155154 194539 289036 115977 -121205
12222D703J81534H5480J29687K9058F631L47940A41726m7199J22331I5201J0103
$$ 4703 186237 85480 215167 244225 6631 354571 141726 94527 216858 95201 105304
12211A05304A4509J50832N6209q9764i985C2197K9260K74119o6535B5779N1102
$$ 105304 14509 165341 221550 131786 -9985 32197 61457 335576 269041 25779 76881
12200G6881O7845E2656J69154A7379a99964D3894M00949A26567R951R1332A577
$$ 76881 144726 52656 221810 17379 -199964 43894 444843 126567 136518 227850 1577
12188A69320J46496r8995a85647B05550p8951M1833n6113D0115e1300E93097A11772
$$ 169320 315816 216821 -185647 205550 126599 168432 112319 40115 -51300 593097 111772
12176A64911K28997j53221M8190J48386k05263o7590b42861A94838e747B36905
$$ 164911 393908 240687 288877 437263 232000 164410 -242861 194838 -5747 236905
12165I8307L26338M1595A52468J41008a83439G7052K4835K0046Q8559R0373p3965
$$ 98307 424645 466240 152468 293476 -183439 77052 101887 121933 210492 300865 226900
12154B26900p5675b26490B11785J72109J13099A11034P1801n3528a42319k3368
$$ 226900 151225 -226490 211785 383894 496993 111034 182835 129307 -142319 -165687
12144a65687B55389b1841i229j54240J2919b8984E69305B13857J17438f9471j36481
$$ -165687 255389 -21841 -9229 -163469 -150550 -28984 569305 213857 331295 -69471 -205952
12133b05952A48624f0552j7286l3386A24399d2391C91615m767f1381B96428j04972
$$ -205952 148624 -60552 -77838 -111224 124399 -42391 391615 386848 -61381 296428 191456
12122A91456L7093L2452A3168J35124F3708J10363j3129Q0320l5766E9931J5432
$$ 191456 228549 261001 13168 148292 63708 174071 160942 241262 205496 59931 75363
12111G5363b4836B3743e1393B2101L73921a52314j81637A5637i683B8598P5394
$$ 75363 -24836 23743 -51393 22101 396022 -152314 -333951 15637 -9683 28598 103992
12100A03992j5498K63418A01357q902d5112D30190A09419a12450b4393A55637
$$ 103992 88494 351912 101357 92455 -45112 430190 109419 -112450 -24393 155637
12089A31080h6957q1284B52827F651K33020B8770R8989F0193J45017c2646A38904
$$ 131080 -86957 -168241 252827 6651 239671 28770 127759 60193 205210 -32646 138904
12077C48510f7276A67662J70638r2305F5595J64020J92094B05252P4483j21042
$$ 348510 -67276 167662 338300 245995 65595 229615 421709 205252 279735 158693
12067A58693g1472D60220k21531b26755I0577L9616J41217I2798D0962K0703a71531
$$ 158693 -71472 460220 238689 -226755 90577 130193 271410 92798 40962 61665 -171531
12055A7274J36029c5100H5457O7341M943Q1750a91563R2098A58514m9993K8373
$$ 17274 153303 -35100 85457 152798 157741 239491 -191563 -99465 158514 108521 136894
12044A36894J35419I811J96638a01368F3845B5604a3541G7183a8115j15547a8072
$$ 136894 272313 9811 206449 -101368 63845 25604 -13541 77183 -18115 -133662 -18072
12032c10984J34770A9617a17075j87743J19468J1473A48517c71203B2732e555
$$ -310984 -176214 19617 -117075 -304818 -185350 -173877 148517 -371203 22732 -5555
12021E5105K09442l1403a43814m8490K3546h0592B77665F8846b8565j22294E3876
$$ 55105 264547 233144 -143814 -192304 -168758 -80592 277665 68846 -28565 -150859 53876
12009a36495B75468A9636J02382n3726a56457A78964O8493a61753B28435I1969
$$ -136495 275468 19636 122018 68292 -156457 178964 247457 -161753 228435 91969
11998C80782C1524P6529m9720k914K79411A44801j4247a49946f8210a6289I275
$$ 380782 31524 108053 58333 55419 334830 144801 130554 -149946 -68210 -16289 9275
11986a05632B35555c96526A1527J21305J41260H2664J0172l1598a60082L1328
$$ -105632 235555 -396526 11527 132832 274092 82664 92836 61238 -160082 -128754
11976a28754C2004a39833q5738R9235I3319B347J24282b88551A33907n2206I161
$$ -128754 32004 -139833 -225571 -126336 93319 2347 126629 -288551 133907 81701 9161
11964A31773a20640C58163f9865B96741f0405C43325E8631K9622I871i3627B80209
$$ 131773 -120640 358163 -69865 296741 -60405 343325 58631 88253 9871 -93627 280209
11952a28571n9599B07379c14684g3626q2089D9962k4340i6925A74521o6170b76345
$$ -128571 -188170 207379 -314684 -73626 -155715 49962 25622 -96925 174521 108351 -276345
11940b02724L4211A54556a98675D558a25088l08030A39674J01229k9352c15802
$$ -202724 -168513 154556 -198675 4558 -125088 -433118 139674 240903 211551 -315802
11929D5442j1291a61062c7728l535A92872i3568k84279e630C4435h1529j1779
$$ 45442 34151 -161062 -37728 -41263 192872 -93568 -377847 -5630 34435 -81529 -93308
11918i3308A78626J34772a87467H121h9487D708Q6615d8760A78194C2294a18931
$$ -93308 178626 313398 -187467 8121 -89487 4708 91323 -48760 178194 32294 -118931
11906a39593B55135i0407d3038k014A98252b22321f8728J6617j25540D91074B0593
$$ -139593 255135 -90407 -43038 -45052 198252 -222321 -68728 -52111 -177651 491074 20593
11894A16302c4040k14672H0058Q7705E9842K49157a47544C59153B3169a39053
$$ 116302 -34040 -248712 80058 167763 59842 308999 -147544 359153 23169 -139053
11883i3483n1636H1318P2354M2435o3309A7294K34332H5475a98675A26703m2405
$$ -93483 -145119 81318 153672 196107 132798 17294 251626 85475 -198675 126703 84298
11872H4298e8002A64972A0080a08011M0472l13143R671C9949O7625a03918k2234
$$ 84298 -58002 164972 10080 -108011 -67539 -380682 -371011 39949 107574 -103918 -126152
11861a26152e2184k44685a24476H614b82168J13273f5289b5955j30635B26437
$$ -126152 -52184 -296869 -124476 8614 -282168 -168895 -65289 -25955 -156590 226437
11850D7015J35432D7090M43929A08689a18367L1008D13760C2193R462N4889c69635
$$ 47015 182447 47090 491019 108689 -118367 -87359 413760 32193 41655 96544 -369635
11838g8809p1037A492L7453a20478B65612a93697j08308J16417f8443j30992G7019
$$ -78809 -149846 1492 38945 -120478 265612 -193697 -302005 -185588 -68443 -199435 77019
11826a48223c5650B17335e4500j86020H1544e5019A28897K0332K45242r7916d23049
$$ -148223 -35650 217335 -54500 -240520 81544 -55019 128897 149229 394471 296555 -423049
11814f05j31895A70688d3951m32333a31069C52886H6547M4398e9485r0054K4190
$$ -605 -132500 170688 -43951 -476284 -131069 352886 86547 130945 -59485 -149539 -125349
11803a25349L9576F2710c536m74695d5442q0798L4606B4677g4416k72934e7595
$$ -125349 -85773 62710 -3536 -478231 -45442 -126240 -91634 24677 -74416 -347350 -57595
11791H7088b44934a05984K4147J4890j04560b457A54837P293b56847a27028J4346
$$ 87088 -244934 -105984 -81837 -66947 -171507 -2457 154837 162130 -256847 -127028 -112682
11780a12682N5994b2330j5979j68993O3248o8323B11111b02856d3595k3939b6141
$$ -112682 -56688 -22330 -38309 -207302 -144054 -212377 211111 -202856 -43595 -67534 -26141
11768c4099C0781P9243L36440b98863h3149j46955e8071a1050r631F19K0423e4019
$$ -34099 30781 110024 446464 -298863 -83149 -230104 -58071 -11050 -20681 619 21042 -54019
11755i2431a5863F4257M6467b23642c4086F5761R1871F0937b86605B13492H4940
$$ -92431 -15863 64257 110724 -223642 -34086 65761 157632 60937 -286605 213492 84940
11743I249b12768N8920e4086j9470C4965b8345A0516c0258A73877K5666a51960
$$ 9249 -212768 -153848 -54086 -73556 34965 -28345 10516 -30258 173877 199543 -151960
11731C10914j45508e1589c372A7314a56068C14976a16066C7912c17666c7353D8598
$$ 310914 165406 -51589 -3372 17314 -156068 314976 -116066 37912 -317666 -37353 48598
11719B04893q3471a72137P1474K9266A89471e74350c0969B14933a96549O5031
$$ 204893 121422 -172137 -100663 -71397 189471 -574350 -30969 214933 -196549 -131518
11709a31518K7088b9189G7055A2952c41746B72033E8922f2150j16705F7444j4474
$$ -131518 -104430 -29189 77055 12952 -341746 272033 58922 -62150 -178855 67444 52970
11698E2970J72354m308J6343a41182e0199k4494k43210C38264r8685J40911e8665
$$ 52970 225324 221016 237359 -141182 -50199 -74693 -317903 338264 239579 380490 -58665
11686B27240j07154D4898b12792d4669A73774J45658i32B68690c79137A62544
$$ 227240 120086 44898 -212792 -44669 173774 319432 -932 268690 -379137 162544
11675c5343A86346a0810q535P825q465C15918B6478L9247a05708C6220a00401
$$ -35343 186346 -10810 -19345 -11520 -19985 315918 26478 65725 -105708 36220 -100401
11663b7544F3189c21345f3082j17766p8919A81491l616K2035p5283g8171G0674
$$ -27544 63189 -321345 -63082 -180848 -259767 181491 177875 199910 124627 -78171 70674
11651B09549A6697m056a31010L9847G2178i0864A06004h5051I8228A6825g6714
$$ 209549 16697 12641 -131010 -91163 72178 -90864 106004 -85051 98228 16825 -76714
11639B75521q5925f4537B22784a5052B03908N2004p9149d6120J3106B16264a91114
$$ 275521 189596 -64537 222784 -15052 203908 255912 176763 -46120 -33014 216264 -191114
11627a27926B1226J36764J1231a04981a8659A91115i5057k79665c4734A02983
$$ -127926 21226 157990 169221 -104981 -18659 191115 -95057 -374722 -34734 102983
11616A43330L5666F1903R7398b35209g1636h984a129q2586o3032a4567C8687a85772
$$ 143330 178996 61903 159301 -235209 -71636 -8984 -1129 -83715 -146747 -14567 38687 -185772
11603i1108j3454J4740J2223B40941f5243r7929O3810D1473A3392d7408l4991
$$ -91108 -104562 -89822 -77599 240941 -65243 -163172 -99362 41473 13392 -47408 -82399
11592h2399B87209a27799A01070i8959H507b24785J6016d5820F9258f1786C39511
$$ -82399 287209 -127799 101070 -98959 8507 -224785 -208769 -45820 69258 -61786 339511
11580B7134f9169B18442D5347K05061q0006b2406o7292J2397r742A02533a3568
$$ 27134 -69169 218442 45347 250408 170402 -22406 -89698 -77301 -87043 102533 -13568
11568a7096H5860b38034B94118j38005h1212A07184P4559p3847P1393a11359A44044
$$ -17096 85860 -238034 294118 156113 -81212 107184 181743 107896 179289 -111359 144044
11556h7819k66460f5318j85646A18149J40116D5184J75810a97529d0728n9784
$$ -87819 -354279 -65318 -250964 118149 258265 45184 220994 -197529 -40728 -100512
11546a00512D2172g9624j52999A09944h8972A083L83768b32937d7551B03732j00109
$$ -100512 42172 -79624 -232623 109944 -88972 1083 384851 -232937 -47551 203732 103623
11535A03623K40817j23791f8690D76181A871R7262J26628f718D0014p403K2960
$$ 103623 344440 220649 -68690 476181 1871 99133 225761 -6718 40014 32611 55571
11524E5571d9886r7217A91807D4262K4989J88147A12210O2556J30106b55937A44390
$$ 55571 -49886 -147103 191807 44262 69251 257398 112210 174766 304872 -255937 144390
11512A00404E0094a74365A49367b62283F5557K71365a38258B61294K70252k28866
$$ 100404 50094 -174365 149367 -262283 65557 336922 -138258 261294 531546 302680
11502C02680q2823M3398E9889a24199b0728k4710C401K3723C147e1259C58212
$$ 302680 219857 263255 59889 -124199 -20728 -45438 3401 27124 3147 -51259 358212
11490f9205A44855K91093B09677f0492D21599B6759a28516G9698Q0217c2345j21651
$$ -69205 144855 435948 209677 -60492 421599 26759 -128516 79698 159915 -32345 -153996
11479a53996A67170D3102N3319b15704c1284A30730H066N3315P0003j0661k8722
$$ -153996 167170 43102 96421 -215704 -31284 130730 8066 61381 131384 120723 92001
11468I2001f1566j27684m6727C31222j32131E2908L99986A58209c3785m1166r2547
$$ 92001 -61566 -189250 -235977 331222 199091 52908 452894 158209 -33785 -74951 -167498
11457a67498B91445a04833C32161p2747B4371J45111c841j40718B4631J34869
$$ -167498 291445 -104833 332161 259414 24371 169482 -3841 -144559 24631 159500
11447A59500O3870N2833C7996L47J54148B3529K14822b30963A00518j6673d3031
$$ 159500 223370 276203 37996 38343 192491 23529 238351 -230963 100518 83845 -43031
11435C07847B2947g2643j23724A54214j6700M1718G5819c4294n4010D1339b67432
$$ 307847 22947 -72643 -196367 154214 137514 179232 75819 -34294 -88304 41339 -267432
11423C82544A2614h360j61632B0854J04136a36627B7838R5911K57230j88052b66271
$$ 382544 12614 -8360 -169992 20854 124990 -136627 27838 123749 380979 192927 -266271
11411a13065F791h6911B02056H002J62893a11211B37101q645f125B35685j13817
$$ -113065 6791 -86911 202056 8002 170895 -111211 237101 228456 -6125 235685 121868
11400A21868L5493a10278m2688f6669C85409j92490R1674j22811a74360b7823
$$ 121868 157361 -110278 -152966 -66669 385409 192919 284593 161782 -174360 -27823
11389b5028l24446A70551h5234l5964j56021A99949r6886i9292A54970e1205A89695
$$ -25028 -349474 170551 -85234 -121198 -277219 199949 103063 -99292 154970 -51205 189695
11377e9647A5747h8052L6838k70892A48508n052b16816a0164A65987b99523e0816
$$ -59647 15747 -88052 -51214 -322106 148508 143456 -216816 -10164 165987 -299523 -50816
11365b82540a05132j9948B01881d03073D34655b93305A87249F6693J71929a6650
$$ -282540 -105132 -125080 201881 -403073 434655 -293305 187249 66693 238622 -16650
11354d9201r7089E86334B4602K9487a56133p1386c075A5331b18891A44O089J39441
$$ -49201 -146290 586334 24602 54089 -156133 -227519 -3075 15331 -218891 144 6233 145674
11342A45674a00920j36621G516b48394A16780f2843D8773a44120e6180B9767b38219
$$ 145674 -100920 -237541 7516 -248394 116780 -62843 48773 -144120 -56180 29767 -238219
11330E6445O0175b63444k7440E615b3000m4212p6233B57880f1697G1112f1326
$$ 56445 116620 -263444 -290884 5615 -23000 -67212 -143445 257880 -61697 71112 -61326
11318d6343j39158r9712P4619H3462K31850E4623a12065A11719a71085j92352
$$ -46343 -185501 -285213 -210594 83462 315312 54623 -112065 111719 -171085 -363437
11308c63437A53315c58398C300M2379A9498M5441b09723e1329m12079A32985i0911
$$ -363437 153315 -358398 3300 45679 19498 64939 -209723 -51329 -463408 132985 -90911
11296B46377g5835o4312J7342e1895B78738c37220a21080j40541J03223J7131
$$ 246377 -75835 -140147 -122805 -51895 278738 -337220 -121080 -261621 -158398 -141267
11286a41267J1119H1388b79707K4627D2269A0266R0174M638d14660E0609L3973
$$ -141267 -130148 81388 -279707 -255080 42269 10266 100440 105078 -414660 50609 84582
11275H4582b36225E4489J43013a59313A31478b3150j33938A57642N567D4290K7793
$$ 84582 -236225 54489 197502 -159313 131478 -23150 -157088 157642 163209 44290 72083
11264G2083a8595l42541k3629J62649a04955m3612l76870a98830P4589M5704Q923
$$ 72083 -18595 -361136 -384765 -222116 -104955 -148567 -525437 -198830 -124241 -78537 -69614
11253f9614B31157a26q9086l17662A80152A3640K8743J69424a9953B14616a93384
$$ -69614 231157 -126 -89212 -406874 180152 13640 42383 211807 -19953 214616 -193384
11241a83013j9582A01413g0147l1355m9889l3086J3334n2922q2568F5435g9399
$$ -183013 -202595 101413 -70147 -101502 -151391 -184477 -171143 -224065 -306633 65435 -79399
11229a74567A7695d4476A77518A0485b96495A6248J36018b28858k6231B78775
$$ -174567 17695 -44476 177518 10485 -296495 16248 152266 -228858 -255089 278775
11218d8149E62c76570a03355M9102A00997K7795D2840A247b28459F2735a06251
$$ -48149 562 -376570 -103355 -54253 100997 128792 42840 1247 -228459 62735 -106251
11206C8531a76241q2214j03420J32067A15174b42845A64417G8142O4033O2576
$$ 38531 -176241 -258455 -361875 -229808 115174 -242845 164417 78142 142175 204751
11196B04751P4509a14167j70876J17991M081l44468B78584b8428I6928L7708a30977
$$ 204751 279260 -114167 -285043 -167052 -162971 -507439 278584 -28428 96928 134636 -130977
11184B0347O9204b02040r1759R9291L5674Q268A89846a60435e2818J4901j24326
$$ 20347 89551 -202040 -293799 -194508 -158834 -150566 189846 -160435 -52818 -37917 -162243
11173a62243r1046A8978a41620C0416a15251j4260m7207B12683a17706k3332e8299
$$ -162243 -253289 18978 -141620 30416 -115251 -129511 -176718 212683 -117706 -141038 -58299
11161c1837C9364b96946C37837A31779a60641j16347g6214j81127G2781b49284
$$ -31837 39364 -296946 337837 131779 -160641 -276988 -76214 -257341 72781 -249284
11150c20469L1884A49535b977I7239a41045j4473A51017j5274b2251A2916J36846
$$ -320469 -288585 149535 -2977 97239 -141045 -155518 151017 135743 -22251 12916 149762
11139A49762a2013r3546e512A15526e9206E7774K0388g6537F6113a45455B741
$$ 149762 -12013 -105559 -5512 115526 -59206 57774 78162 -76537 66113 -145455 2741
11127a70169A58528p9033d7204o2648C12909a3053A75341p12n1313b64276B797
$$ -170169 158528 79495 -47204 -109852 312909 -13053 175341 174629 123316 -264276 2797
11115C72715A53095E0797K5640a02766A93243P0927I0497j7742J77624H1471L2291
$$ 372715 153095 50797 76437 -102766 193243 264170 90497 72755 250379 81471 113762
11104A13762O0599B3906J65036I2733K53856q6573j02247a33612C92800a69423
$$ 113762 174361 23906 188942 92733 346589 260016 157769 -133612 392800 -169423
11093B85683j38487J20689o2251l6360K1650f0249b7801J535A42151e0406A59393
$$ 285683 147196 267885 205634 169274 190924 -60249 -27801 -26266 142151 -50406 159393
11081A74405F6109P8862A2951o164K2030L38050j80485q0372K12793C9525g232
$$ 174405 66109 144971 12951 6787 28817 366867 186382 106010 318803 39525 -7232
11069D7798K20561O8120j06237k1032E8514K19895j29727M86310A38368J98502
$$ 47798 268359 336479 230242 209210 58514 278409 148682 634992 138368 336870
11059C36870j14653J81019P3610j08315L83428K3421C86353q2149R551K17942
$$ 336870 222217 403236 476846 368531 751959 775380 386353 304204 313755 531697
11049E31697p8875J34922j73134Q5687J60278l598j84361R5212M5163J09555j28623
$$ 531697 452822 587744 414610 500297 660575 656977 472616 567828 612991 722546 593923
11038E93923k10880M1916L36900l43323J58407M7820o6488n896j02166n2623J72878
$$ 593923 383043 424959 761859 418536 576943 624763 558275 552379 450213 397590 570468
11027E70468k6216n9163k9838J81116K9930l9335K10840A76787O06975O9C69431
$$ 570468 544252 485089 455251 636367 666297 626962 837802 176787 783762 783831 369431
11015C67861M07927l31707o2296A77085N07052j30427k16315J71629L207k03104
$$ 367861 775788 444081 381785 177085 684137 553710 337395 509024 512231 309127
11005C09127M43360J1926l62130j3923O5655K17326A88631M41736B64652K66987
$$ 309127 752487 764413 402283 388360 454015 671341 188631 630367 264652 531639
10995E31639O6440r6438P6467k5391j61075L85323l44990L16503j2426j3671k98149
$$ 531639 598079 501641 578108 552717 391642 776965 431975 748478 736052 722381 424232
10984D24232p8173J32026R3950K11005m2953k9696j98452N65150j60212M02464
$$ 424232 346059 478085 572035 783040 740087 710391 511939 1077089 916877 1319341
10974A319341R646k15947J08300K00527M55022K75841j13215J37790m06597K27504
$$ 1319341 1328987 1113040 1221340 1421867 1876889 2152730 2039515 2177305 1770708 1998212
10964A998212k71736J00416k52324k08041p7385j95789J04390K30261l19421J81596
$$ 1998212 1726476 1826892 1574568 1366527 1289142 1093353 1197743 1428004 1108583 1290179
10954A290179L7809k29860J65217K08101j4878J34007m02842p8434k96605J48968
$$ 1290179 1327988 1098128 1263345 1471446 1456568 1590575 1187733 1109299 812694 961662
10944I61662l20486q708J5377I3467C2334L45548j57192o7727o0777R5797J49478
$$ 961662 641176 632468 647845 93467 32334 377882 220690 152963 92186 187983 337461
10933C37461j61278j1686O0398A3137h8925A46800N905F4515Q2254k6084e088
$$ 337461 176183 164497 224895 13137 -88925 146800 152705 64515 146769 120685 -5088
10921G4529j8958h1265B72690q6297f7567F4010b67383a19374l8248A29573f9746
$$ 74529 55571 -81265 272690 186393 -67567 64010 -267383 -119374 -157622 129573 -69746
10909c69431B12805E0542K84831A60031g5401j22917B49321i0843d3830m3779
$$ -369431 212805 50542 335373 160031 -75401 -198318 249321 -90843 -43830 -87609
10899h7609K3972D2539a48076O7843F3115h743A45190c06571M1310F5856h928
$$ -87609 -63637 42539 -148076 -80233 63115 -8743 145190 -306571 -265261 65856 -8928
10887A89174e3250G6504K03265E0798P7405l2094b39742i6387A65200c46496O4813
$$ 189174 -53250 76504 279769 50798 128203 96109 -239742 -96387 165200 -346496 -281683
10876b81683d3757k13521B12439a70419E4627c2548I9590c5647A26789b7983H5459
$$ -281683 -43757 -257278 212439 -170419 54627 -32548 99590 -35647 126789 -27983 85459
10864C65927b53077D6809N4082e0699j42959A1042a4796p7106m1377A9508a36475
$$ 365927 -253077 46809 100891 -50699 -193658 11042 -14796 -91902 -133279 19508 -136475
10852c1416B48576G5731e8772k2165p5225B37556J80582a19054l6682p5101R2931
$$ -31416 248576 75731 -58772 -80937 -156162 237556 418138 -119054 -155736 -230837 -137906
10841a37906C530c89187B78231H0477R1068i6486j90484E4717f8261A36187a7707
$$ -137906 3530 -389187 278231 80477 171545 -96486 -286970 54717 -68261 136187 -17707
10829e3949j11942M0810j34534J05601c8181C73644L1800A07849a91964J6905
$$ -53949 -165891 -125081 -259615 -154014 -38181 373644 405444 107849 -191964 -175059
10819a75059C2765a31108P011A68290r203a97176B29979b94392e2900l1688C8793
$$ -175059 32765 -131108 -124097 168290 159087 -197176 229979 -294392 -52900 -84588 38793
10807d9719a4278B89468b77025H9960a00725j73990b4967B74424k8444a00600
$$ -49719 -14278 289468 -277025 89960 -100725 -274715 -24967 274424 245980 -100600
10796a30795B8571a30541D8665J02721o9615c27507A87589j4099i4892a1812H2454
$$ -130795 28571 -130541 48665 151386 81771 -327507 187589 173490 -94892 -11812 82454
10784d0681j63916J6858C2746c07054f5203B66215a15241H6727a73833F9257h815
$$ -40681 -204597 -187739 32746 -307054 -65203 266215 -115241 86727 -173833 69257 -8815
10772B85903a74078j68204I1869Q139a85155a0346l55276a18986B94942b02863
$$ 285903 -174078 -342282 91869 100008 -185155 -10346 -365622 -118986 294942 -202863
10761F0190J20666e9621J5377o7170A56210A3444a21666l9473p8608o3417a02917
$$ 60190 180856 -59621 -44244 -111414 156210 13444 -121666 -161139 -239747 -303164 -102917
10749B52678o7353h81n2366H4042a1494j65895r4576a01381j47482A53417G6446
$$ 252678 185325 -881 -53247 84042 -11494 -177389 -271965 -101381 -248863 153417 76446
10737a67882A7599K27296M7970A17712a74866H4908c62202A99575a82773C7663
$$ -167882 17599 244895 292865 117712 -174866 84908 -362202 199575 -182773 37663
10726a33223A02833B1190b00617k9829b0587C0238f2142j89602C8310a43828f8801
$$ -133223 102833 21190 -200617 -230446 -20587 30238 -62142 -251744 38310 -143828 -68801
10714C3051a51777A12160a70882A62328a71686B01643f9283E9099J81319a36590
$$ 33051 -151777 112160 -170882 162328 -171686 201643 -69283 59099 240418 -136590
10703B78194b74115c1622L600A2396f2878o7922p3251M6267C3233a45313A98430
$$ 278194 -274115 -31622 -28022 12396 -62878 -130800 -204051 -157784 33233 -145313 198430
10691b4349E03244d72922g2861A08193G27b01193l9932a17172A4539a44075G9145
$$ -24349 503244 -472922 -72861 108193 727 -201193 -241125 -117172 14539 -144075 79145
10679A45881i1813I6313a31305A74307a31996j6427l9021d5370H0507j9905a39556
$$ 145881 -91813 96313 -131305 174307 -131996 -148423 -187444 -45370 80507 60602 -139556
10667a43263A51719c38988N1500B5488b56208A6618a56363b6810j12232C76453
$$ -143263 151719 -338988 -287488 25488 -256208 16618 -156363 -26810 -139042 376453
10656C4111a21538j79407k5909C0904b7833m40178K15899J265C9398a60804D8276
$$ 34111 -121538 -300945 -326854 30904 -27833 -468011 -252112 -250847 39398 -160804 48276
10644B03134G3283h6276k06A39482O6059a21117j03556f7782k34053k0272a32600
$$ 203134 73283 -86276 -86482 139482 205541 -121117 -224673 -67782 -301835 -322107 -132600
10632b44923J12559q9008H0857g8925j20003B02021E7153g1197m4389k74056g5170
$$ -244923 -132364 -221372 80857 -78925 -198928 202021 57153 -71197 -115586 -389642 -75170
10620B27842b47960a14670I252i9415d5556A72715F8304J17885A0885a82132C1015
$$ 227842 -247960 -114670 9252 -99415 -45556 172715 68304 186189 10885 -182132 31015
10608c3348A37722c26481a26307M1892j81538f3976j25774G4525e6849A3671J65180
$$ -33348 137722 -326481 -126307 -84415 -265953 -63976 -189750 74525 -56849 13671 178851
10597A78851c37383D7900b64078A73850d1372j92500k6781O0621R4004C08254
$$ 178851 -337383 47900 -264078 173850 -41372 -233872 -260653 -200032 -106028 308254
10586c3944q1307r9259J7476l2058A69023E2751J0730d2283o5990j59810Q206
$$ -33944 -115251 -214510 -197034 -229092 169023 52751 63481 -42283 -108273 -268083 -259877
10575b59877A0233K53112a38482B51826b76083a1402B0598a19652G3766a6455
$$ -259877 10233 263345 -138482 251826 -276083 -11402 20598 -119652 73766 -16455
10564F560c69018L6471i7546d2419k97381L8298g4532A13012J50201a89360N7414
$$ 6560 -369018 -332547 -97546 -42419 -339800 -301502 -74532 113012 263213 -189360 -131946
10553a31946C2458a38036C43589c8106p1258k59124h1884l2525k32020d017F4533
$$ -131946 32458 -138036 343589 -38106 -109364 -368488 -81884 -114409 -346429 -4017 64533
10541b36100e0703A8254a34311p6066b8368k22277B9672a31978e4325D441a02425
$$ -236100 -50703 18254 -134311 -210377 -28368 -250645 29672 -131978 -54325 4441 -102425
10529G4091e3883F9670a75376j08902B3736K2163M1718C5939J24L6421d9445j93189
$$ 74091 -53883 69670 -175376 -284278 23736 45899 87617 35939 36063 72484 -49445 -242634
10517b42634I318N4161K13545f7782r6147a4793d492B56941a34651r5927A43425
$$ -242634 9318 63479 277024 -67782 -163929 -14793 -4492 256941 -134651 -230578 143425
10505g7834o7591k12261e70j04327F8242d16838A85357C7003P889E781c8028j31868
$$ -77834 -145425 -357686 -570 -104897 68242 -416838 185357 37003 44892 5781 -38028 -169896
10493a69896n4686C32851g8552m0172G9900Q6689f1925j21604B3410b31671a03962
$$ -169896 -224582 332851 -78552 -118724 79900 166589 -61925 -183529 23410 -231671 -103962
10481G6034K93625b47595A10126c18208J50503C2037O57379k18067K55058A93649
$$ 76034 369659 -247595 110126 -318208 -167705 32037 689416 471349 726407 193649
10470D51782o2342A85223R2651A12564f0953E3072K0523O3021J82875A05748d9364
$$ 451782 389440 185223 277874 112564 -60953 53072 73595 136616 319491 105748 -49364
10458a99510M1036B89161j3395a70935p3535i082A70858a2033B57845d19781J30496
$$ -199510 -158474 289161 275766 -170935 -244470 -9082 170858 -12033 257845 -419781 -289285
10447b89285b7485j07994C4116a46445K1447q4178e6894Q572n4982l7000M9844
$$ -289285 -27485 -135479 34116 -146445 -124998 -209176 -56894 -48322 -103304 -140304 -90460
10436i0460A48576B42K83815A6727Q6918K58067a06286j01780r4802P5353Q9201
$$ -90460 148576 242 284057 16727 103645 361712 -106286 -208066 -302868 -227515 -138314
10425a38314c1673k72724a45866j51099d8070j00521I0786a5539G1766h466r3730
$$ -138314 -31673 -304397 -145866 -296965 -48070 -148591 90786 -15539 71766 -8466 -102196
10414a02196E3006i9471k08627a39825c5076A22891g1816G0662h6738J24j1500
$$ -102196 53006 -99471 -308098 -139825 -35076 122891 -71816 70662 -86738 -86614 -98114
10403i8114A33665i4979k1656a5641C0626c6012a1921j72079P2494E1937J54931
$$ -98114 133665 -94979 -116635 -15641 30626 -36012 -11921 -184000 -111506 51937 206868
10392B06868A0739J55740b64087J08186O6943A8814a748A68628K89518b04235
$$ 206868 10739 166479 -264087 -155901 -88958 18814 -1748 168628 458146 -204235
10381A60640D7845i3232G5519l6437M18105A33907J19204e676A91197l892N1758
$$ 160640 47845 -93232 75519 39082 457187 133907 253111 -5676 191197 187305 239063
10370B39063K46034A2514J76466L69403A88137J60115L4057n8494k2450d1670
$$ 239063 485097 12514 188980 558383 188137 348252 382309 323815 301365 -41670
10359F2231N6242L6233i1683H8667f1096A68444n3420k1348J71543A01076K16636
$$ 62231 118473 154706 -91683 88667 -61096 168444 115024 93676 265219 101076 317712
10348C17712C0892Q4076L96578B30920K2579e3792A28280P077a07737C43051G4469
$$ 317712 30892 114968 511546 230920 253499 -53792 128280 135357 -107737 343051 74469
10336A40821j5985m3926J74745E5483f3913A79750l631l7384b14747f9278j56323
$$ 140821 124836 80910 255655 55483 -63913 179750 176119 138735 -214747 -69278 -225601
10325b25601A16137B9309J48374F7345K1911J39317E1694F815a57319C80723D2747
$$ -225601 116137 29309 177683 67345 89256 228573 51694 6815 -157319 380723 42747
10313b13694A39290a91393A55251a79848o9039J11199j18868H8905L02500a51822
$$ -213694 139290 -191393 155251 -179848 -248887 -137688 -256556 88905 391405 -151822
10302B58158d12576J11157i9743k34958f9692A46394b78714c9847l83185J28312
$$ 258158 -412576 -301419 -99743 -334701 -69692 146394 -278714 -39847 -423032 -294720
10292b94720j9008a22659A11010a44243J157A48113J08675a852r1508D3253a06695
$$ -294720 -313728 -122659 111010 -144243 -143086 148113 256788 -1852 -93360 43253 -106695
10280A21274D0574a6418j87428b0296m41531a38836c7942J6299j50983a5087l08614
$$ 121274 40574 -16418 -203846 -20296 -461827 -138836 -37942 -21643 -172626 -15087 -323701
10269c23701d2348A82367e0911D03070a4772r4698N0786G7141J1513b54882N1117
$$ -323701 -42348 182367 -50911 403070 -14772 -109470 -58684 77141 88654 -254882 -203765
10258b03765d85A58233E8079a59049q8804A26586J03398P18N9245r1747q9179
$$ -203765 -485 158233 58079 -159049 -247853 126586 229984 230702 289947 198200 109021
10247A09021O0768a49392A94333i5245k7876C47550b18665A29092e7218G8751
$$ 109021 169789 -149392 194333 -95245 -123121 347550 -218665 129092 -57218 78751
10236A19707C3270Q2713c61963A23159c5293E2477B2262L59993E1363c43235G9445
$$ 119707 33270 115983 -361963 123159 -35293 52477 22262 382255 51363 -343235 79445
10224h1230p3424N0033j1803l01719G7343Q3450J734f6341A33J45401a54624e8337
$$ -81230 -154654 -104621 -116424 -418143 77343 160793 162527 -66341 133 145534 -154624 -58337
10211C10J38343R163C7502a47467A47160o3738f1077b7324q364j62329L4241A0075
$$ 310 138653 147816 37502 -147467 147160 83422 -61077 -27324 -35688 -198017 -163776 10075
10198A28144a22043j82704G4572O9894f9621l3841A23247m6099a23973N2984K6335
$$ 128144 -122043 -304747 74572 144466 -69621 -103462 123247 77148 -123973 -70989 -44654
10187d4654m3665n0652N8725l35657b3791j46839J0078c2175B70144C4507J2214
$$ -44654 -88319 -138971 -80246 -415903 -23791 -170630 -160552 -32175 270144 34507 46721
10176D6721a19227J1061A20007Q0553k2104i3342J7112j87639g6590o5146p9783
$$ 46721 -119227 -108166 120007 200560 178456 -93342 -76230 -263869 -76590 -141736 -221519
10165b21519d7751l58325b4462k21135j59166a35430A97574f3749A11783b93309
$$ -221519 -47751 -406076 -24462 -245597 -404763 -135430 197574 -63749 111783 -293309
10154C560L36552F5572e2810o2052A03416d1577C1435a06594C8221b27648A4323
$$ 3560 340112 65572 -52810 -114862 103416 -41577 31435 -106594 38221 -227648 14323
10142a20388o9805L3049A58041f9285L23L3991k45018g2619r1220R827m3880j33666
$$ -120388 -190193 -157144 158041 -69285 -68962 -34971 -279989 -72619 -163839 -154012 -197892 -331558
10130c31558a0097l3516C4918L4636b08501Q4892l305c1142j00328L1179j85979
$$ -331558 -10097 -43613 34918 69554 -208501 -123609 -126914 -31142 -131470 -100291 -286270
10119b86270a4515o1456n244l09670G6713b46278j12862c7113p4943B64114b94297
$$ -286270 -14515 -75971 -81215 -390885 76713 -246278 -359140 -37113 -112056 264114 -294297
10107d12562b6733r5516r1749P4830O9474A90791O4074b8178q3388a636p1968
$$ -412562 -26733 -122249 -213998 -139168 -69694 190791 254865 -28178 -111566 -1636 -73604
10096g3604A25659b26317j09922A53324J16634g9094G8968f490k25503q6727R3632
$$ -73604 125659 -226317 -336239 153324 269958 -79094 78968 -6490 -231993 -318720 -225088
10085b25088K2265g3543J0629k92099J22553J1547H1528l6144l787J46638g3583
$$ -225088 -202823 -73543 -62914 -355013 -232460 -220913 81528 45384 41597 188235 -73583
10073A65655b58494A51736f7717j18398A7692i0384m51822i2725A15774c6952
$$ 165655 -258494 151736 -67717 -186115 17692 -90384 -542206 -92725 115774 -36952
10062a73705q697h7814f783q8762j64743d2414j81477g1371A55427K794b24398
$$ -173705 -182402 -87814 -6783 -95545 -260288 -42414 -223891 -71371 155427 158221 -224398
10050D2898A6002c6105B7013d7918A30851c83501b8698l6991A2641b47788N418
$$ 42898 16002 -36105 27013 -47918 130851 -383501 -28698 -65689 12641 -247788 -242370
10039b42370B38951a74941N4760B21919d2481j66201g609k13372N8858o8022D6991
$$ -242370 238951 -174941 -120181 221919 -42481 -208682 -7609 -220981 -162123 -230145 46991
10027H1903b73008M0109L9386B9465a40869p3419C48963A29171R3480f6900r2017
$$ 81903 -273008 -232899 -193513 29465 -140869 -214288 348963 129171 222651 -66900 -158917
10016a58917C91172r7845B3485e3324j70208f4151k57895A26303a30910r0167
$$ -158917 391172 293327 23485 -53324 -223532 -64151 -322046 126303 -130910 -221077
10006b21077P4986n5166d9149p1021C016a77451B85006I1900J05760b8754o0766
$$ -221077 -146091 -201257 -49149 -120170 3016 -177451 285006 91900 197660 -28754 -89520
9995h9520F7623Q854c4756A04915c35550R5631H3107A3929M2342J5308J05417
$$ -89520 67623 76477 -34756 104915 -335550 -239919 83107 13929 56271 71579 176996
9984A76996C9059c39038a64330q531A03795c31096N6225K3255B39465a28145L2702
$$ 176996 39059 -339038 -164330 -172861 103795 -331096 -274871 -251616 239465 -128145 -95443
9973i5443o184j33814G6449a48779H5534R6449c22803a31520e9516B5423f4094
$$ -95443 -101627 -235441 76449 -148779 85534 181983 -322803 -131520 -59516 25423 -64094
9961i3749b2944j87429o2053c3131l35050B03012B6890h4727K6669j78284l5216
$$ -93749 -22944 -210373 -272426 -33131 -368181 203012 26890 -84727 -58058 -236342 -271558
9950b71558A28717c1335l66514E13564F3807J81190a81487B55141b60785h0934
$$ -271558 128717 -31335 -397849 513564 63807 244997 -181487 255141 -260785 -80934
9939b18402Q0779j18466J10389A89959e8793r4803O4414G3013c55203L098a48448
$$ -218402 -137623 -256089 -145700 189959 -58793 -153596 -89182 73013 -355203 -352105 -148448
9927B76957b90450L0377F4011c00100k4825b9721k7329j16195H476b19712B54518
$$ 276957 -290450 -260073 64011 -300100 -324925 -29721 -57050 -173245 8476 -219712 254518
9915F3297g2984j04075j7435j6754A12803b77930h1566F374J75990a41331j06010
$$ 63297 -72984 -177059 -194494 -211248 112803 -277930 -81566 6374 182364 -141331 -247341
9904b47341A87084F5385a60601k3408N6165E6383B613J44415d25459A83291O8167
$$ -247341 187084 65385 -160601 -184009 -127844 56383 2613 147028 -425459 183291 251458
9893B51458a69733j5637A04770j2581a05636j510B23840A0249d27505A06623D2740
$$ 251458 -169733 -185370 104770 92189 -105636 -107146 223840 10249 -427505 106623 42740
9881B9487c1183C0811b0667l02527b0207A93763b07420L4578B58189I2892a06377
$$ 29487 -31183 30811 -20667 -323194 -20207 193763 -207420 -172842 258189 92892 -106377
9869g094H6985K1873B6616b965H785c15178a53478A83268a24334E8139c49417
$$ -7094 86985 108858 26616 -2965 8785 -315178 -153478 183268 -124334 58139 -349417
9857A02847a9089A9481P4057d14893g1761G656b35167R2987J9076k64299A29843
$$ 102847 -19089 19481 93538 -414893 -71761 7656 -235167 -142180 -123104 -387403 129843
9845A2049N3793a39889j20580A41559K60074B4520c43789A17457n5685B5855a42673
$$ 12049 65842 -139889 -260469 141559 401633 24520 -343789 117457 61772 25855 -142673
9833a67779j21466C96863a93463k19946b1335A0706a39727n6646g5489E2484a52088
$$ -167779 -289245 396863 -193463 -413409 -21335 10706 -139727 -196373 -75489 52484 -152088
9821b08920E4490J48908b53809l9398N8111E7075a21480l0374j28433c5048q7888
$$ -208920 54490 203398 -253809 -293207 -235096 57075 -121480 -151854 -280287 -35048 -122936
9810a22936G7211b89065H1397k1986L417l0385J87880a61078B90023b16980H5702
$$ -122936 77211 -289065 81397 59411 62828 32443 220323 -161078 290023 -216980 85702
9798c56082C3859K21916G0850d08913J88826k12066j19105b68452a19883M783
$$ -356082 33859 255775 70850 -408913 -220087 -432153 -551258 -268452 -119883 -115100
9788a15100o721C6764c06881H8524a53981a5988H7871a85395g2616k47976A06688
$$ -115100 -121821 36764 -306881 88524 -153981 -15988 87871 -185395 -72616 -320592 106688
9776a94341A14053a31996B8634a47267d0592A22099O5836a52248b4747m5306j14237
$$ -194341 114053 -131996 28634 -147267 -40592 122099 187935 -152248 -24747 -70053 -184290
9765a84290b2297A13235h2946k05540J29415A73131L5297c06229a04634G3541
$$ -184290 -22297 113235 -82946 -288486 -159071 173131 208428 -306229 -104634 73541
9754e4620j37992B38621j13088c4936l7841j4361K5762b6783C4384J43798c11248
$$ -54620 -192612 238621 125533 -34936 -72777 -87138 -61376 -26783 34384 178182 -311248
9742I033d05592h5911k34021H6490b28388a2158A5627L60855f781I1491P419a25630
$$ 9033 -405592 -85911 -319932 86490 -228388 -12158 15627 376482 -6781 91491 98910 -125630
9729C0689c43870H9156N3557h1457K3601I856b50301j4014J27002e8400D445a74663
$$ 30689 -343870 89156 142713 -81457 -57856 9856 -250301 -264315 -137313 -58400 4445 -174663
9716a13558A03605a35573k8844d9428l48312a32036j13824a12056h739I281L21284
$$ -113558 103605 -135573 -164417 -49428 -397740 -132036 -245860 -112056 -8739 9281 330565
9705C30565b3747k52327A93532b9767A46654g6315K4919k8083j39082h8825j58989
$$ 330565 -23747 -276074 193532 -29767 146654 -76315 -51396 -79479 -218561 -88825 -247814
9694b47814M3968j1385a2409l2425l1341m2744a0673B21985D2661P0666l2113
$$ -247814 -203846 -215231 -12409 -44834 -76175 -118919 -10673 221985 42661 113327 81214
9683H1214J11397b15419A30763J423f8408j09904B078a83469j87434a4930A54262
$$ 81214 192611 -215419 130763 132186 -68408 -178312 2078 -183469 -370903 -14930 154262
9671B22938c120k91145J20002b2552j6597n1943j4177L2383m7643d3922b0100
$$ 222938 -3120 -294265 -174263 -22552 -39149 -91092 -105269 -72886 -120529 -43922 -20100
9659a8116B06046a87939A35748N6408b28137g6451a7677k75863J16777A30372
$$ -18116 206046 -187939 135748 192156 -228137 -76451 -17677 -293540 -176763 130372
9648a56386c0905A18489k2399c5885o3116o8810B25752c1820k22621K7809A21001
$$ -156386 -30905 118489 96090 -35885 -99001 -167811 225752 -31820 -254441 -226632 121001
9636c87893A89643m3828a4663n3896l27239J88814j1213A96182a3419k25259A13635
$$ -387893 189643 145815 -14663 -68559 -395798 -206984 -218197 196182 -13419 -238678 113635
9624a58497A99881G3366b57117A07573c46876d5878j58295i903D356d9229q6025
$$ -158497 199881 73366 -257117 107573 -346876 -45878 -204173 -9903 4356 -49229 -135254
9613a35254c1596l18033i4043j5351q0796F8428b88985B3084b63602Q0380g3747
$$ -135254 -31596 -349629 -94043 -109394 -190190 68428 -288985 23084 -263602 -183222 -73747
9601d4684l66682I8016K59613b6165j07961A88841A4551J28164K45768H7560Q7514
$$ -44684 -411366 98016 357629 -26165 -134126 188841 14551 142715 388483 87560 175074
9590A75074h3737n1198m4605A58497b86844Q5383f6026E3424e8621k00129h7228
$$ 175074 -83737 -134935 -179540 158497 -286844 -201461 -66026 53424 -58621 -258750 -87228
9578e306H6360a93713g9246r5022D0040c80053J69070A38502A4481e0976M238
$$ -5306 86360 -193713 -79246 -174268 40040 -380053 -210983 138502 14481 -50976 -46738
9567d6738B62762r812i9447j9544L5945B51654c8267n744B1810b91148a08593
$$ -46738 262762 252950 -99447 -118991 -83046 251654 -38267 -44011 21810 -291148 -108593
9555b50764a00872k41166i5273c6537p7494H4867c08273A20130B7703a0059B67439
$$ -250764 -100872 -342038 -95273 -36537 -114031 84867 -308273 120130 27703 -10059 267439
9543h1219j06644h5340q2075L1664H8339c9628j40265A8731b89862j50645b14066
$$ -81219 -187863 -85340 -167415 -135751 88339 -39628 -179893 18731 -289862 -440507 -214066
9531C6047f9343D078b50103G6209a86253A44491R80a39968o6100N7871b2701o8397
$$ 36047 -69343 4078 -250103 76209 -186253 144491 145471 -139968 -206068 -148197 -22701 -91098
9519i1098m3315L4245A18178P4537a22036N0863j5750K8311q8756M3039o8415
$$ -91098 -134413 -100168 118178 192715 -122036 -71173 -86923 -58612 -147368 -104329 -172744
9508a72744G2213a29426K776j03356f5077j82440G8404b84857k49249b08303O9955
$$ -172744 72213 -129426 -126650 -230006 -65077 -247517 78404 -284857 -534106 -208303 -138348
9497a38348O703M6670F0870b89075J116a28453K3842d535j98994m6334Q6523P6455
$$ -138348 -131645 -84975 60870 -289075 -287959 -128453 -104611 -4535 -203529 -249863 -163340 -86885
9485h6885k45271l6544B24367e3687q4826N0414A55635F470a05139J7550j0809
$$ -86885 -332156 -368700 224367 -53687 -138513 -88099 155635 6470 -105139 -87589 -98398
9474i8398C45116b77892a14867o1346G1632O5671B4854a54632L6603J4594B48318
$$ -98398 345116 -277892 -114867 -176213 71632 137303 24854 -154632 -118029 -103435 248318
9462a40227A06621a30053n5259Q8576m8021e7592j20292C879O380J82019Q5200
$$ -140227 106621 -130053 -185312 -96736 -144757 -57592 -177884 3879 10259 192278 277478
9451B77478a84422B15048i3141b5787D0725L4066E06a7055o134k20130A6026f377
$$ 277478 -184422 215048 -93141 -25787 40725 74791 506 -17055 -23189 -243319 16026 -6377
9438d0520a6852j59702j39985A0361a97792A6509a31118j18868a12080L0469m9860
$$ -40520 -16852 -176554 -316539 10361 -197792 16509 -131118 -249986 -112080 -81611 -131471
9427a31471A96361c39252r6294J38348h0633C524h8743A99475e9239C8624O1878
$$ -131471 196361 -339252 -435546 -297198 -80633 3524 -88743 199475 -59239 38624 100502
9416A00502d47882b13116A87840a05239A06706D4678b82810g6911C6220J00346
$$ 100502 -447882 -213116 187840 -105239 106706 44678 -282810 -76911 36220 136566
9406A36566l8212a23309o785j91940N9675i5176j85453O6690h8500C37081f2684
$$ 136566 98354 -123309 -130094 -322034 -262359 -95176 -280629 -213939 -88500 337081 -62684
9394a74190n3902f8879A36356e2323G6263a90876n4855n569C4249J1835f7849
$$ -174190 -228092 -68879 136356 -52323 76263 -190876 -245731 -251300 34249 46084 -67849
9382E6552d01017A9538J46637e0556j17797e636j42056C2331a51266e7294r226
$$ 56552 -401017 19538 166175 -50556 -168353 -5636 -147692 32331 -151266 -57294 -66520
9371f6520o2950f4027A94330M7578A05252c3758j45409c2557k49808E5497D475
$$ -66520 -129470 -64027 194330 241908 105252 -33758 -179167 -32557 -282365 55497 4475
9359b01695A53758d8643p5238D7537c8370p3630A11632J61522A06748B7112a38629
$$ -201695 153758 -48643 -123881 47537 -38370 -112000 111632 273154 106748 27112 -138629
9347a00819A50090b34820j17220A08103a77236Q7882I0897a91324F9232b69640
$$ -100819 150090 -234820 -352040 108103 -177236 -89354 90897 -191324 69232 -269640
9336a44809M7341A94034a63834l2990B0240b6849o9031K0441m2184H1792a79330
$$ -144809 -97468 194034 -163834 -196824 20240 -26849 -95880 -75439 -117623 81792 -179330
9324E8603J19388c96655d5298A3867c38177b9306q8515C2316d72150C67706B3941
$$ 58603 177991 -396655 -45298 13867 -338177 -29306 -117821 32316 -472150 367706 23941
9312B30074e26752b37606P6586C23134j31637a90511g9245m3217G1131Q7308a38806
$$ 230074 -526752 -237606 -161020 323134 191497 -190511 -79245 -122462 71131 158439 -138806
9300c20430a38815M7815m0699M0387c547l25040a05827B1829c15516j96555A52558
$$ -320430 -138815 -91000 -131699 -91312 -3547 -328587 -105827 21829 -315516 -512071 152558
9288E4892a9430j81160D6165b98134i7004j40234B66809F6910c90373B9334K17624
$$ 54892 -19430 -200590 46165 -298134 -97004 -237238 266809 66910 -390373 29334 246958
9277B46958b41548m283J10779k8830n416B9876N5356K9146A3652J99863a02203
$$ 246958 -241548 -245831 -135052 -163882 -169298 29876 85232 114378 13652 213515 -102203
9265a91523q949i2799A96283b83271A40293a35033F0278M3832D9471b45474Q9826
$$ -191523 -200472 -92799 196283 -283271 140293 -135033 60278 104110 49471 -245474 -155648
9254a55648h548j48741o9637j88481I0953M5860c9308H7041h5350j33284N9898
$$ -155648 -8548 -157289 -226926 -415407 90953 136813 -39308 87041 -85350 -218634 -158736
9243a58736L4372m9750g1866o8465k63722J80466c1447G6197J76439b80756I6957
$$ -158736 -124364 -174114 -71866 -140331 -404053 -223587 -31447 76197 252636 -280756 96957
9231E43199c24304E186f5429k04367J471b7212p8745B86133c75104F2795c84295
$$ 543199 -324304 5186 -65429 -269796 -268325 -27212 -105957 286133 -375104 62795 -384295
9219A34618a44150B33334c7190I9234C8536J12910a35831A48956c46810R1202
$$ 134618 -144150 233334 -37190 99234 38536 151446 -135831 148956 -346810 -255608
9209b55608a08036e0434K2415D9323a46521l4839M1789o7527D8654A9167e5162
$$ -255608 -108036 -50434 -28019 49323 -146521 -181360 -139571 -207098 48654 19167 -55162
9197A90046e4408I1251b78135h7884F8839A4903J39310C6165c25249D9838b4522
$$ 190046 -54408 91251 -278135 -87884 68839 14903 154213 36165 -325249 49838 -24522
9185d6569k36973c6103k67149a35178l7331e4944G3b04597B31344E3133A3842
$$ -46569 -283542 -36103 -303252 -135178 -172509 -54944 73 -204597 231344 53133 13842
9173a69619g9733D7847J44409a20900j83645A54914b30492J0268i1690a6263p7813
$$ -169619 -79733 47847 192256 -120900 -304545 154914 -230492 -220224 -91690 -16263 -94076
9162i4076q290B3343e0621A74379b57563B4444b3345I8968J21776j04808b04084
$$ -94076 -102366 23343 -50621 174379 -257563 24444 -23345 98968 220744 115936 -204084
9150a46825A28324b76649J22478l9625j88524a68107B36180d2661D0312a6166
$$ -146825 128324 -276649 -154171 -193796 -382320 -168107 236180 -42661 40312 -16166
9139E535O5849l3740L12334d21686A58606c88964B03550c2113n5082n154k20987
$$ 5535 71384 37644 349978 -421686 158606 -388964 203550 -32113 -87195 -92349 -313336
9128c13336D9831a06427m2781J9080n7397j96830d5971j40604P7491L7896A34290
$$ -313336 49831 -106427 -149208 -130128 -187525 -384355 -45971 -186575 -109084 -71188 134290
9116a91602I6441m8050J45459F2224D388J56029a44066j66021j22296A5792c11123
$$ -191602 96441 48391 193850 62224 4388 160417 -144066 -310087 -432383 15792 -311123
9104a4575k4672B27288a48829C2552h0549B49765a75165K9869A01160j9793a35096
$$ -14575 -39247 227288 -148829 32552 -80549 249765 -175165 -145296 101160 81367 -135096
9092c4817B75584f3516n4336A09802a59453j62120j23165a77411I2001Q0161a33686
$$ -34817 275584 -63516 -117852 109802 -159453 -321573 -444738 -177411 92001 172162 -133686
9080e8203K0587F2180c45351A2235J34705J8286a21413K189J8093m4249i13j14613
$$ -58203 -37616 62180 -345351 12235 146940 165226 -121413 -119224 -101131 -145380 -913 -115526
9068a15526m5913d6103p8709N2243B23433C4497c0121j12745C8080a73698k8796
$$ -115526 -161439 -46103 -124812 -72569 223433 34497 -30121 -142866 38080 -173698 -202494
9057b02494F2447b67600E4834h8666i373r2367d593l77820C1383h0041A8109a94623
$$ -202494 62447 -267600 54834 -88666 -9373 -101740 -4593 -382413 31383 -80041 18109 -194623
9044c5950A72773h7265A75541a5931p8213j56001B7687c4194j794I758J68642
$$ -35950 172773 -87265 175541 -15931 -94144 -250145 27687 -34194 -35988 9758 178400
9033A78400a61579A35589a85226c8744k01851h6867j7635c4688j29281j4584B08183
$$ 178400 -161579 135589 -185226 -38744 -240595 -86867 -104502 -34688 -163969 -178553 208183
9021d671k24269a04824k5032D5150a03277A32598e7965B13419a15800E1775a06866
$$ -4671 -228940 -104824 -129856 45150 -103277 132598 -57965 213419 -115800 51775 -106866
9009B80103D8112K27946e8489b2734k065m3669q3325k7836O5735L2968j92912
$$ 280103 48112 276058 -58489 -22734 -24799 -68468 -151793 -179629 -113894 -80926 -273838
8998b73838F1590j519a14708j66596G2805L4109a34792K1828J3408p1522l2207
$$ -273838 61590 60071 -114708 -281304 72805 106914 -134792 -112964 -99556 -171078 -203285
8987b03285A25389b29485B199Q3b05957L8291J6227k08290l5718O9770J15721
$$ -203285 125389 -229485 2199 2282 -205957 -167666 -151439 -359729 -395447 -325677 -209956
8976b09956K3753h7504B58012l6019A2961b46286J0081h1390b3699N972l26152
$$ -209956 -186203 -87504 258012 221993 12961 -246286 -236205 -81390 -23699 -17727 -343879
8965c43879M4364a05406d6503l4049a352j17759j96732e5788A08091k2013a69796
$$ -343879 -299515 -105406 -46503 -80552 -1352 -119111 -315843 -55788 108091 86078 -169796
8953c29756C04474g1991L446J1635m2094A96389a27928A9491L50810c5540O885
$$ -329756 304474 -71991 -68545 -56910 -99004 196389 -127928 19491 370301 -35540 -28655
8942b8655a747A19560L05170i6187a0454k8166A357O5021i875B62481j07160b56659
$$ -28655 -1747 119560 424730 -96187 -10454 -38620 1357 66378 -9875 262481 155321 -256659
8929H6702A9706L27005i2945B26569C9013J20538J1883J91282O82540L97662N153834
$$ 86702 19706 346711 -92945 226569 39013 159551 171434 362716 1045256 1442918 6596752
8918F596752j549798A571237C65229J69787k12341I2620f0112j02327g8980C7196
$$ 6596752 5046954 1571237 365229 535016 322675 92620 -60112 -162439 -78980 37196
8907B62947A23676e5005H7124f0222f535A32801i718b411C8420J8911c18867D3844
$$ 262947 123676 -55005 87124 -60222 -6535 132801 -9718 -2411 38420 57331 -318867 43844
8894A16645J58075d6097B20550h2836G6333K19619a54446n9073a323k57320B8086
$$ 116645 274720 -46097 220550 -82836 76333 295952 -154446 -213519 -1323 -258643 28086
8882b46323B23627b9739H1492d2434j78487D701a05740j87370B314d0798h132
$$ -246323 223627 -29739 81492 -42434 -220921 4701 -105740 -293110 2314 -40798 -8132
8870B19101a42876j30384B18600h6004a2334l70766a91303A18078j4443K31866
$$ 219101 -142876 -273260 218600 -86004 -12334 -383100 -191303 118078 103635 335501
$$ [...]
##END NTUPLES=NMR SPECTRUM
##END=
