
##TITLE=AC1299_CHIAH12111_6534668_LnVXKvkR13
##JCAMPDX= 6.0         $$ Bruker NMR JCAMP-DX V2.0
##DATA TYPE= NMR SPECTRUM
##DATA CLASS= NTUPLES
##ORIGIN= BRUKER
##OWNER= Administrator
$$ 1.72 TOPSPIN		Version 2.1
$$ 2012-07-17 16:11:48.781 -0500  Administrator@TOPSPIN
$$ Compression mode = diff/dup
##.OBSERVE FREQUENCY= 400.02188249412
##.OBSERVE NUCLEUS= ^1H
##.ACQUISITION MODE= SIMULTANEOUS (DQD)
##.ACQUISITION SCHEME= undefined
##.AVERAGES= 64
##.DIGITISER RES= 22
##SPECTROMETER/DATA SYSTEM= spect
##.PULSE SEQUENCE= noesygpps1d.comp
##.SOLVENT NAME= COFFEE_meoh
##.SHIFT REFERENCE= INTERNAL, COFFEE_meoh, 1, 14.96108
##AUDIT TRAIL= $$ (NUMBER, WHEN, WHO, WHERE, PROCESS, VERSION, WHAT)
$$ ##TITLE= Audit trail, TOPSPIN		Version 2.1
$$ ##JCAMPDX= 5.01
$$ ##ORIGIN= Bruker BioSpin GmbH
$$ ##OWNER= Administrator
$$ $$ C:\Bruker\TOPSPIN/data/COFFEE/nmr/AC1299_CHIAH12111_6534668_LnVXKvkR13/12/pdata/1/auditp.txt
$$ ##AUDIT TRAIL=  $$ (NUMBER, WHEN, WHO, WHERE, PROCESS, VERSION, WHAT)
(   1,<2012-07-17 16:11:43.234 -0500>,<Administrator>,<TOPSPIN>,<go>,<TOPSPIN 2.1>,
      <created by zg
	started at 2012-07-17 16:00:12.968 -0500,
	POWCHK enabled, PULCHK disabled,
       configuration hash MD5:
       6B 1B 68 BB D9 2E 58 E2 7F 35 AD 54 07 DF 0E 41
       data hash MD5: 64K
       71 4C 60 DA 60 4E AD 6F CC 08 59 02 BF 21 45 6A>)
(   2,<2012-07-17 16:11:46.281 -0500>,<Administrator>,<TOPSPIN>,<proc1d>,<TOPSPIN 2.1>,
      <Start of raw data processing
       efp LB = 0.3 FT_mod = 6 PKNL = 1 PHC0 = 0 PHC1 = 0 SI = 128K 
       data hash MD5: 128K
       CA E1 6A F6 72 78 52 F4 B8 E2 D7 C5 D7 E6 B3 C4>)
(   3,<2012-07-17 16:11:47.406 -0500>,<Administrator>,<TOPSPIN>,<proc1d>,<TOPSPIN 2.1>,
      <pk PHC0 = -1.40625 PHC1 = 0 
       data hash MD5: 128K
       F2 72 D2 B3 9F 3D CE 63 1F 2E 45 36 A7 54 28 2E>)
(   4,<2012-07-17 16:11:48.421 -0500>,<Administrator>,<TOPSPIN>,<proc1d>,<TOPSPIN 2.1>,
      <abs ABSG = 1 
       data hash MD5: 128K
       2F 25 AF 38 38 B6 0B 66 2F F4 67 13 49 0B 83 B1>)
(   5,<2012-07-17 16:11:48.500 -0500>,<Administrator>,<TOPSPIN>,<proc1d>,<TOPSPIN 2.1>,
      <abs ABSG = 2 
       data hash MD5: 128K
       23 60 9F 83 34 2C B6 EC E0 AE 5D 1C 1A C0 80 DA>)
(   6,<2012-07-17 16:11:48.562 -0500>,<Administrator>,<TOPSPIN>,<proc1d>,<TOPSPIN 2.1>,
      <abs ABSG = 3 
       data hash MD5: 128K
       41 8D 94 0A A8 5F 70 6C 99 3F BD 11 D0 5E BE 84>)
(   7,<2012-07-17 16:11:48.625 -0500>,<Administrator>,<TOPSPIN>,<proc1d>,<TOPSPIN 2.1>,
      <abs ABSG = 4 
       data hash MD5: 128K
       7E AB 64 A8 06 C9 B3 FD 1A C1 38 FC F0 60 97 E9>)
(   8,<2012-07-17 16:11:48.671 -0500>,<Administrator>,<TOPSPIN>,<proc1d>,<TOPSPIN 2.1>,
      <abs ABSG = 5 
       data hash MD5: 128K
       32 A1 C9 61 0D 2E 25 FD 6C A3 EE 65 46 39 96 37>)
$$ ##END=
$$ 
$$ $$ hash MD5
$$ $$ 4F E4 13 9D 35 B9 1B D3 34 77 95 D7 D3 4F C3 F3
##$RELAX= 
##$RELAX= 
##$RELAX= 
##$RELAX= 
##$RELAX= 
##$RELAX= 
##$RELAX= 
##$RELAX= 
$$ Bruker specific parameters
$$ [...]
##$TP07= 0
##$TPNAME0= <>
##$TPNAME1= <>
##$TPNAME2= <>
##$TPNAME3= <>
##$TPNAME4= <>
##$TPNAME5= <>
##$TPNAME6= <>
##$TPNAME7= <>
##$TPOAL= (0..7)
0.5 0.5 0.5 0.5 0.5 0.5 0.5 0.5
##$TPOFFS= (0..7)
0 0 0 0 0 0 0 0
##$TUNHIN= 0
##$TUNHOUT= 0
##$TUNXOUT= 0
##$USERA1= <user>
##$USERA2= <user>
##$USERA3= <user>
##$USERA4= <user>
##$USERA5= <user>
##$V9= 5
##$VALIST= <valist>
##$VCLIST= <CCCCCCCCCCCCCCC>
##$VD= 0
##$VDLIST= <DDDDDDDDDDDDDDD>
##$VPLIST= <PPPPPPPPPPPPPPP>
##$VTLIST= <TTTTTTTTTTTTTTT>
##$WBST= 2048
##$WBSW= 25
##$XGAIN= (0..3)
0 0 0 0
##$XL= 0
##$YL= 0
##$YMAX_a= 12938754
##$YMIN_a= -10031427
##$ZGOPTNS= <>
##$ZL1= 120
##$ZL2= 120
##$ZL3= 120
##$ZL4= 120
##$ABSF1= 14.96108
##$ABSF2= -5.597102
##$ABSG= 5
##$ABSL= 3
##$ALPHA= 0
##$AQORDER= 0
##$ASSFAC= 0
##$ASSFACI= 0
##$ASSFACX= 0
##$ASSWID= 0
##$AUNMP= <proc_prof1d_extract.lims>
##$AXLEFT= 0
##$AXNAME= <>
##$AXNUC= <1H>
##$AXRIGHT= 0
##$AXTYPE= 0
##$AXUNIT= <>
##$AZFE= 0.1
##$AZFW= 0.1
##$BCFW= 0
##$BC_mod= 0
##$BYTORDP= 0
##$COROFFS= 0
##$CY= 15
##$DATMOD= 1
##$DC= 0
##$DFILT= <>
##$DTYPP= 0
##$F1P= 0
##$F2P= 0
##$FCOR= 0.5
##$FTSIZE= 131072
##$FT_mod= 6
##$GAMMA= 0
##$GB= 0
##$INTBC= 1
##$INTSCL= 1
##$ISEN= 128
##$LB= 0.3
##$LEV0= 0
##$LPBIN= 0
##$MAXI= 10000
##$MC2= 0
##$MEAN= 0
##$ME_mod= 0
##$MI= 0
##$NCOEF= 0
##$NC_proc= -2
##$NLEV= 6
##$NOISF1= 0
##$NOISF2= 0
##$NSP= 0
##$NTH_PI= 0
##$NZP= 0
##$OFFSET= 14.96108
##$PC= 1
##$PHC0= -1.40625
##$PHC1= 0
##$PH_mod= 1
##$PKNL= yes
##$PPARMOD= 0
##$PPDIAG= 0
##$PPIPTYP= 0
##$PPMPNUM= 2147483647
##$PPRESOL= 1
##$PSCAL= 4
##$PSIGN= 0
##$PYNMP= <proc.py>
##$REVERSE= no
##$SF= 400.020009606343
##$SI= 131072
##$SIGF1= 0
##$SIGF2= 0
##$SINO= 400
##$SIOLD= 131072
##$SPECTYP= <>
##$SREGLST= <1H.CDCl3>
##$SSB= 0
##$STSI= 131072
##$STSR= 0
##$SW_p= 8223.68421052631
##$SYMM= 0
##$S_DEV= 0
##$TDeff= 65536
##$TDoff= 0
##$TI= <>
##$TILT= no
##$TM1= 0
##$TM2= 0
##$TOPLEV= 0
##$USERP1= <user>
##$USERP2= <user>
##$USERP3= <user>
##$USERP4= <user>
##$USERP5= <user>
##$WDW= 1
##$XDIM= 131072
##$YMAX_p= 412391388
##$YMIN_p= -12170
##$CURPLOT= <Network HP LaserJet P1505>
##$CURPRIN= <$Network HP LaserJet P1505>
##$DFORMAT= <normdp>
##$LAYOUT= <+/1D_H.xwp>
##$LFORMAT= <normlp>
##$PFORMAT= <normpl>
##$SURQMSG= 1
$$ End of Bruker specific parameters
$$ ---------------------------------
##NTUPLES= NMR SPECTRUM
##VAR_NAME=  FREQUENCY,     SPECTRUM/REAL,   SPECTRUM/IMAG
##SYMBOL=    X,             R,               I
##VAR_TYPE=  INDEPENDENT,   DEPENDENT,       DEPENDENT
##VAR_FORM=  AFFN,          ASDF,            ASDF
##VAR_DIM=   131072,        131072,          131072
##UNITS=     HZ,            ARBITRARY UNITS, ARBITRARY UNITS
##FACTOR=    0.0627417313425164, 1,          1
##FIRST=     8223.62146879497, 2589,         -59824
##LAST=      0,             3232,            -59508
##MIN=       0,             -12170,          0
##MAX=       8223.62146879497, 412391388,    0
$$ Real data points
##PAGE= N=1
##DATA TABLE= (X++(R..R)), XYDATA
$$ [...]
$$ plain form
61483 320993 322463 323805 324869 325454 325543 325520 325826 326390 326798 327013 327552 328875 330923 333306 335591 337343 338221
61466 338221 338202 337518 336378 334935 333463 332277 331490 331074 330987 331002 330699 330030 329673 330321 331834 333587 335390
61449 335390 337384 339248 340346 340638 340682 340687 340338 339651 339195 339244 339448 339594 340062 341252 343167 345762 349083 352806
61431 352806 356292 359338 362306 365305 367925 370072 372248 374553 376098 375995 374518 372845 372083 372844 375198
61416 375198 378480 381572 383847 385570 387099 388260 388865 389270 389829 390246 390008 389130 387939 386465 384623 382702
61400 382702 381109 379748 378184 376313 374461 372868 371461 370130 368974 368275 368366 369386 371050 372802 374267
61385 374267 375370 376013 376021 375533 375121 375312 376214 377644 379276 380640 381438 381969 382884 384424 386278 388168 390091
61368 390091 392007 393892 396093 398889 401601 402988 402821 402247 402353 403154 404360 406120 408417 410615 412368
$$ packed form
61483C20993J470J342J064N85Q9k3L06N64M08K15N39J323K048K383K285J752Q78
61466C38221j9o84j140j443j472j186p87m16q7J5l03o69l57O48J513J753J803
61449C35390J994J864J098K92M4Nl49o87m56M9K04J46M68J190J915K595L321L723
61431C52806L486L046K968K999K620K147K176K305J545j03j477j673p62P61K354
61416C75198L282L092K275J723J529J161O05M05N59M17k38q78j191j474j842j921
61400C82702j593j361j564j871j852j593j407j331j156o99R1J020J664J752J465
61385C74267J103O43Qm88m12J91R02J430J632J364P98N31R15J540J854J890J923
61368C90091J916J885K201K796K712J387j67n74J06Q01J206J760K297K198J753
$$ plain form
61353 412368 414274 416910 419959 423103 427045 432636 439533 446757 454148 462174 470521 478059 484238 489547
61339 489547 494463 498847 502655 506457 510855 515794 520761 525287 529129 532166 534282 535210 534632 532626 529891
61324 529891 527223 524932 522998 521550 520779 520529 520361 519988 519432 518961 519137 520609 523531 527411 531853 537143
61308 537143 543730 551485 559933 568990 578978 590122 602431 615812 629871 643813 656922 668855
61296 668855 679094 686547 690372 691024 689873 687943 685455 682254 678009 672193 664648 656221 648195 641038
61282 641038 634207 627166 620059 613306 607108 601465 596286 591398 586780 582883 580352 579388 579633 580685 582405
61267 582405 584639 586930 588581 589080 588630 588325 589438 592291 596220 600854 606876 614929 624193 632820 639708
61252 639708 645285 650590 656087 661373 665661 668492 670225 671673 673102 673858 673221 671165 667944 663530 658157
$$ packed form
61353D12368J906K636L049L144L942N591O897P224P391Q026Q347P538O179N309
61339D89547M916M384L808L802M398M939M967M526L842L037K116R28n78k006k735
61324E29891k668k291j934j448p71k50j68l73n56m71J76J472K922L880M442N290
61308E37143O587P755Q448R057R988J1144J2309J3381J4059J3942J3109J1933
61296F68855J0239P453L825O52j151j930k488l201m245n816p545q427q026p157
61282F41038o831p041p107o753o198n643n179m888m618l897k531r64K45J052J720
61267E82405K234K291J651M99m50l05J113K853L929M634O022Q053R264Q627O888
61252F39708N577N305N497N286M288K831J733J448J429P56o37k056l221m414n373
$$ plain form
61237 658157 652913 648933 646177 643759 641323 639295 637931 636989 636497 637037 639021 642255 646407 651441 657374
61222 657374 663998 671047 678408 686109 694323 703233 712656 721998 730921 739791 749088 758642 767874 776481
61208 776481 784325 791014 796252 800419 804153 807564 810457 813023 815637 818252 820886 824454 830170 838160
61194 838160 847594 858160 870429 884675 900302 916655 933451 950098 965392 978358 988819 996938
61182 996938 1002885 1007126 1010299 1012509 1013396 1013067 1012217 1011000 1008564 1004094 997654 989732 980726 971214 961912
61167 961912 952681 942294 929855 915917 901592 887089 871879 855905 839801 823997 808290 792326
61155 792326 776082 759878 744300 730120 718012 708258 700776 695262 691277 688491 686947 686789 687509
61142 687509 687795 686421 683160 678598 673320 667571 661580 655861 651041 647446 644911 643160 642394 643316 646354
$$ packed form
61237F58157n244l980k756k418k436k028j364r42m92N40J984L234M152N034N933
61222F57374O624P049P361P701Q214Q910R423R342Q923Q870R297R554R232Q607
61208G76481P844O689N238M167L734L411K893K566K614K615K634L568N716P990
61194H38160R434J0566J2269J4246J5627J6353J6796J6647J5294J2966J0461Q119
61182I96938N947M241L173K210Q87l29q50j217k436m470o440p922r006r512r302
61167I61912r231j0387j2439j3938j4325j4503j5210j5974j6104j5804j5707j5964
61155G92326j6244j6204j5578j4180j2108r754p482n514l985k786j544j58P20
61142F87509K86j374l261m562n278n749n991n719m820l595k535j751p66R22L038
$$ plain form
61127 646354 651125 656932 663603 671487 680878 691909 704820 719788 736591 754974 775281 798102
61115 798102 823312 849997 877362 905232 933713 962896 992867 1023411 1053703 1082871 1110814
61104 1110814 1137877 1163817 1187812 1209402 1228587 1244925 1257388 1265317 1268725 1267590 1261764 1251780
61092 1251780 1238788 1223271 1204660 1182623 1157970 1131767 1104301 1075471 1045631 1015576 986198
61081 986198 958410 932761 908755 885244 861887 839628 819489 801629 785884 772294 760566
61070 760566 749943 740276 732418 726868 722797 719138 715941 713818 712732 712243 712432 713686 715903 718701
61056 718701 722091 726269 731103 736484 742860 750825 760478 771625 784148 797688 811660 826226 842594
61043 842594 861595 882561 904437 927360 952199 979042 1007161 1036089 1065786 1096051 1126711
$$ packed form
61127F46354M771N807O671P884R391J1031J2911J4968J6803J8383K0307K2821
61115G98102K5210K6685K7365K7870K8481K9183K9971L0544L0292K9168K7943
61104A110814K7063K5940K3995K1590J9185J6338J2463P929L408j135n826r984
61092A251780j2992j5517j8611k2037k4653k6203k7466k8830k9840l0055k9378
61081I86198k7788k5649k4006k3511k3357k2259k0139j7860j5745j3590j1728
61070G60566j0623r667p858n550m071l659l197k123j086m89J89J254K217K798
61056G18701L390M178M834N381O376P965R653J1147J2523J3540J3972J4566J6368
61043H42594J9001K0966K1876K2923K4839K6843K8119K8928K9697L0265L0660
$$ plain form
61032 1126711 1158142 1190756 1224258 1258239 1293124 1329617 1367571 1406458 1446590 1488800 1532977
61021 1532977 1577905 1622465 1666310 1709768 1754080 1801443 1853884 1912326 1977555 2051306 2135090
61010 2135090 2228549 2330619 2442080 2565668 2704556 2863024 3048565 3271164 3540731 3868112
61000 3868112 4269400 4767305 5388977 6166994 7142997 8362369 9855646 11620317 13614227
60991 13614227 15749496 17875504 19775313 21219534 22073870 22382802 22349654 22224331 22193463
60982 22193463 22344170 22678090 23112790 23467905 23496712 22989707 21884063 20286937 18400028
60973 18400028 16420038 14487542 12688563 11070889 9653176 8432252 7393837 6520212
60965 6520212 5791189 5184221 4677788 4254131 3898181 3595950 3335538 3108529 2909090
$$ packed form
61032A126711L1431L2614L3502L3981L4885L6493L7954L8887M0132M2210M4177
61021A532977M4928M4560M3845M3458M4312M7363N2441N8442O5229P3751Q3784
61010B135090R3459J02070J11461J23588J38888J58468J85541K22599K69567L27381
61000C868112M01288M97905O21672P78017R76003J219372J493277J764671J993910
60991A3614227K135269K126008J899809J444221Q54336L08932l3148j25323l0868
60982B2193463J50707L33920M34700L55115K8807n07005j105644j597126j886909
60973A8400028j979990j932496j798979j617674j417713j220924j038415q73625
60965F520212p29023o06968n06433m23657l55950l02231k60412k27009j99439
$$ plain form
60956 2909090 2732416 2574644 2433134 2305712 2190162 2085174 1991059 1908505 1836831 1773911
60946 1773911 1717358 1665151 1615489 1566867 1518521 1470586 1423902 1379598 1338298 1299418 1261518
60935 1261518 1223644 1186041 1149503 1114582 1081745 1051672 1024793 1000838 979324 960167 943369
60924 943369 928407 914508 901349 889019 877593 867248 858529 851777 846385 841337 836440 832395 829653
60911 829653 827934 826993 827008 827902 829016 829981 831367 833886 837411 841326 845429 849871 854522 859082 863615
60896 863615 868244 872432 875305 876802 877882 879347 880966 881910 881614 880034 877543 874873 872766 871308 869758
60881 869758 867249 863498 858762 853436 847871 842257 836443 830116 823362 816751 810689 805006 799420 794041
60867 794041 789034 784054 778467 772059 765282 758927 753705 749910 747134 744520 741605 738717 736224 733654
$$ packed form
60956B909090j76674j57772j41510j27422j15550j04988r4115q2554p1674o2920
60946A773911n6553n2207m9662m8622m8346m7935m6684m4304m1300l8880l7900
60935A261518l7874l7603l6538l4921l2837l0073k6879k3955k1514j9157j6798
60924I43369j4962j3899j3159j2330j1426j0345q719o752n392n048m897m045k742
60911H29653j719r41J5Q94J114R65J386K519L525L915M103M442M651M560M533
60896H63615M629M188K873J497J080J465J619R44k96j580k491k670k107j458j550
60881H69758k509l751m736n326n565n614n814o327o754o611o062n683n586n379
60867G94041n007m980n587o408o777o355n222l795k776k614k915k888k493k570
$$ plain form
60853 733654 730033 724963 718930 712654 706603 701136 696526 692681 689174 685721 682325 678844 674745 669514
60839 669514 663106 655814 647887 639399 630319 620584 610271 599827 589995 581365 574046 567839 562563 558000
60825 558000 553672 548996 543854 538857 534803 531863 529523 527320 525351 523841 522529 520893 518818 516552
60811 516552 514108 511318 508524 506479 505268 504020 502218 500658 500397 501109 501389 500557 499330 498622 498377 497866
60795 497866 496593 494600 492240 489924 487820 485661 483094 480329 478137 477085 477030 477397 477631 477232 475768
60780 475768 473179 469927 466647 463723 461191 458798 456048 452530 448446 444628 441863 440252 439304 438443 437297
60765 437297 435700 433763 431917 430699 430362 430653 430968 430874 430551 430625 431415 432467 433111 433332 433726 434631 435755
60748 435755 436801 438032 439924 442497 445286 447847 450033 451855 453229 453900 453571 452175 450075 447820 445649
$$ packed form
60853G33654l621n070o033o276o051n467m610l845l507l453l396l481m099n231
60839F69514o408p292p927q488r080r735j0313j0444r832q630p319o207n276m563
60825E58000m328m676n142m997m054k940k340k203j969j510j312j636k075k266
60811E16552k444k790k794k045j211j248j802j560k61P12K80q32j227p08k45n11
60795D97866j273j993k360k316k104k159k567k765k192j052n5L67K34l99j464
60780D75768k589l252l280k924k532k393k750l518m084l818k765j611r48q61j146
60765D37297j597j937j846j218l37K91L15r4l23P4P90J052O44K21L94R05J124
60748D35755J046J231J892K573K789K561K186J822J374O71l29j396k100k255k171
$$ plain form
60733 445649 443300 440350 436673 432575 428610 425221 422361 419497 416195 412708 409719 407537 405880 404480
60719 404480 403465 402917 402508 401904 401210 400615 399756 397952 395028 391593 388462 386024 384177 382608 381087 379665
60703 379665 378637 378137 377826 377206 376255 375460 375187 375294 375523 375950 376751 377662 378045 377503 376222 374720 373501
60686 373501 373008 373606 375321 377706 380154 382379 384532 386914 389675 392733 395882 398998 402228 405866 409943
60671 409943 414065 417842 421330 424793 428108 430758 432447 433350 433656 433211 431860 429903 427918 426245 424861
60656 424861 423685 422815 422475 422840 423886 425347 426953 428735 430919 433425 435685 437166 437970 438696 439738
60641 439738 440781 440933 439358 435940 431448 426893 422671 418511 414274 410466 407790 406424 405935 405685 405174
60626 405174 404275 403390 403173 403836 404860 405612 405970 406152 406198 405998 405649 405373 405170 404861 404397 403853 403191 402320 401326
$$ packed form
60733D45649k349k950l677m098l965l389k860k864l302l487k989k182j657j400
60719D04480j015n48m09o04o94n95q59j804k924l435l131k438j847j569j521j422
60703C79665j028n00l11o20r51p95k73J07K29M27Q01R11L83n42j281j502j219
60686C73501m93N98J715K385K448K225K153K382K761L058L149L116L230L638M077
60671D09943M122L777L488L463L315K650J689R03L06m45j351j957j985j673j384
60656D24861j176q70l40L65J046J461J606J782K184K506K260J481Q04P26J042
60641D39738J043J52j575l418m492m555m222m160m237l808k676j366m89k50n11
60626D05174q99q85k17O63J024P52L58J82M6k00l49k76k03l09m64n44o62q71r94
$$ plain form
60607 401326 400421 399743 399431 399720 400665 401885 402886 403607 404380 405375 406299 406667 406288 405563 405326 406169 407896 409943
60589 409943 412333 415594 419563 422947 424694 425225 425655 426266 426552 426450 426501 426789 426719 426063 425524 425905 427296
60572 427296 429380 432066 435523 439923 445417 452117 460020 469196 480038 492937 507683 523567 540014
60559 540014 556607 572455 586187 596775 603954 607612 607372 603108 595562 586149 576379 567552 560530
60546 560530 555352 551311 547745 544699 542788 542681 544837 549404 556049 564155 573487 584612 598385 614957
60532 614957 633295 651640 668481 683180 695701 705827 712908 716455 716617 713863 708626 701665 694298
60519 694298 687577 681355 674774 667587 660398 653754 647764 642625 638761 636262 634778 634098 634271 635047 635923
60504 635923 636996 639164 643261 649527 658105 669430 683876 701698 723659 751026 784476 823520
$$ packed form
60607D01326r05o78l12K89R45J220J001P21P73R95R24L68l79p25k37Q43J727K047
60589D09943K390L261L969L384J747N31M30O11K86j02N1K88p0o56n39L81J391
60572D27296K084K686L457M400N494O700P903R176J0842J2899J4746J5884J6447
60559E40014J6593J5848J3732J0588P179L658k40m264p546r413r770q827p022
60546E60530n178m041l566l046j911j07K156M567O645Q106R332J1125J3773J6572
60532F14957J8338J8345J6841J4699J2521J0126P081L547J62k754n237o961p367
60519F94298o721o222o581p187p189o644n990n139l864k499j484o80J73P76Q76
60504F35923J073K168M097O266Q578J1325J4446J7822K1961K7367L3450L9044
$$ plain form
60492 823520 867353 915662 968094 1023447 1079912 1135680 1188752 1236589 1276621 1306885 1325787
60481 1325787 1331647 1323276 1301060 1267020 1223780 1173711 1118893 1061381 1003255 946370 892079 841247
60469 841247 794633 753023 716666 684872 656753 632250 611706 594504 579059 564390 550803
60458 550803 538666 527510 516928 507453 499732 493431 487768 482502 477566 472297 466142 459807 454658
60445 454658 451051 448154 445330 442742 440570 438574 436707 435342 434526 433631 432170 430488 429263 428688 428491
60430 428491 428457 428475 428227 427289 425643 423879 422647 421970 421275 420111 418654 417354 416357 415559 414994 414771 414773 414925
60412 414925 415619 417278 419557 421679 423539 425664 427949 429422 429648 429383 429303 429082 428447 428158 428892 429905
60396 429905 430032 429539 429792 431393 433753 436296 438841 440921 442039 442778 444495 447520 450644 452732 453920
$$ packed form
60492H23520M3833M8309N2432N5353N6465N5768N3072M7837M0032L0264J8902
60481A325787N860q371k2216l4040m3240n0069n4818n7512n8126n6885n4291n0832
60469H41247m6614m1610l6357l1794k8119k4503k0544j7202j5445j4669j3587
60458E50803j2137j1156j0582r475p721o301n663n266m936n269o155o335n149
60445D54658l607k897k824k588k172j996j867j365q16q95j461j682j225n75j97
60430D28491l4J8k48r38j646j764j232o77o95j164j457j300r97p98n65k23KJ52
60412D14925O94J659K279K122J860K125K285J473K26k65q0k21o35k89P34J013
60396D29905J27m93K53J601K360K543K545K080J118P39J717L025L124K088J188
$$ plain form
60381 453920 454889 455933 457302 459545 462677 465624 467297 467899 468523 469783 471501 473517 476048 479138 482302
60366 482302 484971 487056 488930 490953 493151 495290 497163 498711 499895 500648 501103 501685 502671 503735 504177
60351 504177 503707 502849 502602 503799 506659 510717 515253 519968 525088 530602 535687 539349 541534 543026 544208
60336 544208 544479 543149 540492 537528 534956 532633 530014 526858 523472 520471 518345 517140 516404 515439 513771
60321 513771 511499 509078 506652 503824 500384 496980 494524 492985 491505 489850 489014 489954 492390 495438 498902
60306 498902 503282 508926 516018 525175 537264 552567 570703 591287 613998 637855 660981 681274
60294 681274 697049 707119 710819 708163 699786 686725 670428 652685 635009 618089 602151 587682
60282 587682 575302 565091 556631 549702 544367 540342 536826 533158 529282 525500 522037 518836 515403 511007
$$ packed form
60381D53920R69J044J369K243L132K947J673O02O24J260J718K016K531L090L164
60366D82302K669K085J874K023K198K139J873J548J184P53M55N82R86J064M42
60351E04177m70q58k47J197K860M058M536M715N120N514N085L662K185J492J182
60336E44208K71j330k657k964k572k323k619l156l386l001k126j205p36r65j668
60321E13771k272k421k426k828l440l404k456j539j480j655q36R40K436L048L464
60306D98902M380N644P092R157J2089J5303J8136K0584K2711K3857K3126K0293
60294F81274J5775J0070L700k656q377j3061j6297j7743j7676j6920j5938j4469
60282E87682j2380j0211q460o929n335m025l516l668l876l782l463l201l433m396
$$ plain form
60268 511007 505457 499654 494921 491791 489845 488530 487574 486658 485388 483737 482035 480460 479016 477980 477695
60253 477695 477821 477454 476228 474749 473684 473014 472505 472380 472946 473858 474304 473943 473397 473667 475055 476705 477398
60236 477398 476874 476065 475789 475666 474855 473518 472833 473698 476113 479749 484288 489121 493502 497319 501122 505118
60220 505118 508741 511503 513779 516385 519783 523894 528322 532579 536458 540369 545008 550670 557225 564627
60206 564627 572817 581230 589137 596626 604467 612796 620664 627206 632616 637580 642372 646841 650721 653587
60192 653587 655051 655339 655187 654971 654522 653891 653409 652693 650601 646786 642369 638344 634209 629081 623356 618140
60176 618140 613541 608767 603660 598948 595084 591865 589259 587583 586633 585482 583506 581039 578785 577120
60162 577120 576133 575714 575357 574399 572828 571463 571055 571502 572207 572928 573960 575598 577664 579558 580751 581312
$$ packed form
60268E11007n550n803m733l130j946j315r56r16j270j651j702j575j444j036k85
60253D77695J26l67j226j479j065o70n09j25N66R12M46l61n46K70J388J650O93
60236D77398n24q09k76j23q11j337o85Q65K415L636M539M833M381L817L803L996
60220E05118L623K762K276K606L398M111M428M257L879L911M639N662O555P402
60206E64627Q190Q413P907P489P841Q329P868O542N410M964M792M469L880K866
60192F53587J464K88j52k16m49o31m82p16k092l815m417m025m135n128n725n216
60176F18140m599m774n107m712l864l219k606j676r50j151j976k467k254j665
60162E77120r87m19l57r58j571j365m08M47P05P21J032J638K066J894J193N61
$$ plain form
60146 581312 581969 583501 586060 589166 592328 595547 599256 603906 609536 615637 621554 627170 633076 639885
60132 639885 647545 655515 663383 670955 677880 683684 688230 691796 694568 696324 696775 696067 694773 693517 692698
60117 692698 692461 692770 693528 694668 696183 698058 700136 702063 703408 703896 703487 702258 700364 698164 696089
60102 696089 694080 691368 687265 682102 676925 672259 667723 663031 658736 655552 653347 651419 649563 648389
60088 648389 648567 650129 652533 655114 657447 659536 661797 664791 668791 673538 678334 682460 685631 688045
60074 688045 689812 690424 688995 685083 679026 671472 662887 653578 643871 634056 624360 615094 606600 598909
60060 598909 591685 584629 577755 571208 565059 559377 554231 549536 545125 541052 537588 534905 533075 532314
60046 532314 532754 533996 535463 537300 540298 544756 550142 556190 563495 572346 581617 589683 596107 601644
$$ packed form
60146E81312O57J532K559L106L162L219L709M650N630O101N917N616N906O809
60132F39885P660P970P868P572O925N804M546L566K772J756M51p08j294j256q19
60117F92698k37L09P58J140J515J875K078J927J345M88m09j229j894k200k075
60102F96089k009k712m103n163n177m666m536m692m295l184k205j928j856j174
60088F48389J78J562K404K581K333K089K261K994M000M747M796M126L171K414
60074F88045J767O12j429l912o057p554q585r309r707r815r696r266q494p691
60060E98909p224p056o874o547o149n682n146m695m411m073l464k683j830p61
60046E32314M40J242J467J837K998M458N386O048P305Q851R271Q066O424N537
$$ plain form
60032 601644 606783 611104 614051 615565 615734 614363 611143 605999 599194 591380 583479 576120 569133 561886
60018 561886 554165 546428 539161 532342 525703 519299 513574 508921 505308 502363 499786 497578 495748 493982
60004 493982 491892 489613 487767 486695 486075 485482 484996 484989 485570 486563 487810 489215 490662 492197 494108 496580
59988 496580 499418 502386 505588 509270 513424 517935 522865 528179 533298 537334 539804 540852 540750 539526
59974 539526 537149 533930 530574 527811 525848 524178 522068 519286 516245 513538 511620 510910 511687 513661 516082
59959 516082 518589 521649 525819 530823 535670 539495 542024 543506 544482 545429 546319 546674 546267 545521 544981 544695
59943 544695 544435 544277 544540 545245 545952 546045 545099 543209 541113 539642 538794 537677 535644 533131 531056 529753
59927 529753 528965 528575 528749 529444 530248 530774 531017 531326 532125 533511 535143 536847 539308 543619 549977 557451
$$ packed form
60032F01644N139M321K947J514J69j371l220n144o805p814p901p359o987p247
60018E61886p721p737p267o819o639o404n725m653l613k945k577k208j830j766
60004D93982k090k279j846j072o20n93m86pN81R93J247J405J447J535J911K472
59988D96580K838K968L202L682M154M511M930N314N119M036K470J048j02j224
59974E39526k377l219l356k763j963j670k110k782l041k707j918p10P77J974K421
59959E16082K507L060M170N004M847L825K529J482R76R47Q90L55m07p46n40k86
59943E44695k60j58K63P05P07R3r46j890k096j471q48j117k033k513k075j303
59927E29753p88l90J74O95Q04N26K43L09P99J386J632J704K461M311O358P474
$$ plain form
59911 557451 565247 573424 581940 589780 595907 600593 604974 609548 613795 617003 618789 619062 618208 617106 616357
59896 616357 615653 614472 613124 612359 612200 611951 611253 610425 609898 610018 611267 613846 617152 620416 623836 628224
59880 628224 633559 638777 643110 646787 650237 653510 656770 660457 664454 667756 669479 669718 668962 667197 664087
59865 664087 659740 654756 649703 644864 640360 636218 632438 629116 626391 624181 622198 620265 618420 616720
59851 616720 615237 614261 614211 615296 617471 620725 625138 630721 637463 645440 654475 663707 671854 677914 681479
59836 681479 682648 682189 681599 682337 684737 687980 691014 693097 693631 692164 688719 683670 677175 669150 659810
59821 659810 649863 640128 631235 623510 616651 609700 602023 594204 587405 582029 577763 574722 573411 573407 573248
59806 573248 572118 570741 570029 569684 568851 567502 566310 565524 564732 563592 562151 560492 558586 556547 554652
$$ packed form
59911E57451P796Q177Q516P840O127M686M381M574M247L208J786K73q54j102p49
59896F16357p04j181j348p65j59k49o98q28n27J20J249K579L306L264L420M388
59880F28224N335N218M333L677L450L273L260L687L997L302J723K39p56j765l110
59865F64087m347m984n053m839m504m142l780l322k725k210j983j933j845j700
59851F16720j483r76n0J085K175L254M413N583O742P977R035R232Q147O060L565
59836F81479J169m59n90P38K400L243L034K083N34j467l445n049o495q025r340
59821F59810r947r735q893p725o859o951p677p819o799n376m266l041j311mj59
59806E73248j130j377p12l45q33j349j192p86p92j140j441j659j906k039j895
$$ plain form
59791 554652 553015 551402 549405 546806 543809 540820 537829 534253 529778 525196 521827 520108 519309 518630 517860
59776 517860 516788 514810 511700 508309 505961 505357 506291 508036 509658 510367 510034 509256 508671 508468 508675 509548
59760 509548 511341 513971 517209 520979 525272 529969 534944 540183 545776 552023 559439 568154 577349 585915
59746 585915 593753 601794 610571 619418 627356 634025 639413 643415 646221 648478 650445 651592 651640 651377 651621
59731 651621 651860 650900 648606 646086 644204 642805 641502 640360 639492 638586 637263 635565 633777 632041 630392
59716 630392 628962 627876 627003 625971 624462 622488 620399 618630 617396 616644 616233 616072 616135 616486 617226 618226
59700 618226 619024 619383 619849 621311 623877 626677 628945 630776 632585 634319 635691 636782 637886 638975 639799
59685 639799 640355 640815 641111 641021 640668 640517 640797 641154 640995 639998 638261 636039 633347 629869 625339 619941 614132
$$ packed form
59791E54652j637j613j997k599k997k989k991l576m475m582l369j719p99o79p70
59776E17860j072j978l110l391k348o04R34J745J622P09l33p78n85k03K07Q73
59760E09548J793K630L238L770M293M697M975N239N593O247P416Q715R195Q566
59746E85915P838Q041Q777Q847P938O669N388M002K806K257J967J147M8k63K44
59731F51621K39r60k294k520j882j399j303j142q68r06j323j698j788j736j649
59716F30392j430j086q73j032j509j974k089j769j234p52m11j61O3L51P40J000
59700F18226P98L59M66J462K566K800K268J831J809J734J372J091J104J089Q24
59685F39799N56M60K96r0l53j51K80L57j59r97j737k222k692l478m530n398n809
$$ plain form
59668 614132 608157 602129 596549 592239 589436 587354 584934 581826 578417 575235 572658 570965 570355 570956 572870
59653 572870 575924 579332 582130 584234 586612 590032 594072 597766 600732 602995 604051 602956 599441 594364
59639 594364 588945 583966 579708 576127 572882 569564 566176 563227 561308 560646 560976 561568 561438 559974 557468
59624 557468 554760 552259 549623 546605 543785 542008 541158 540009 537519 534000 530687 528347 526747 525429
59610 525429 524436 523941 523659 523169 522651 522739 523647 524929 526212 527684 529658 531901 533617 534001 532846 530779
59594 530779 528849 527581 526534 525031 523188 521771 521129 520848 520476 520044 519678 519257 518677 518058 517435 516576 515273
59577 515273 513510 511301 508741 506259 504344 502900 501361 499497 497574 495695 493699 491886 491019 491197 491489
59562 491489 491164 490676 490834 491605 492379 492971 493660 494579 495719 497322 499637 502418 505145 507660 510212 513059
$$ packed form
59668F14132n975o028n580m310k803k082k420l108l409l182k577j693o10O01J914
59653E72870L054L408K798K104K378L420M040L694K966K263J056j095l515n077
59639E94364n419m979m258l581l245l318l388k949j919o62L30N92j30j464k506
59624E57468k708k501k636l018k820j777q50j149k490l519l313k340j600j318
59610E25429r93m95k82m90n18Q8R08J282J283J472J974K243J716L84j155k067
59594E30779j930j268j047j503j843j417o42k81l72m32l66m21n80o19o23q59j303
59577E15273j763k209k560k482j915j444j539j864j923j879j996j813q67J78K92
59562D91489l25m88J58P71P74N92O89R19J140J603K315K781K727K515K552K847
$$ plain form
59546 513059 516278 519745 523020 525633 527729 530050 533015 536495 540933 547920 558799 573200 589873
59533 589873 608465 629113 650184 667656 677551 678757 673439 665255 657311 651098 646665 643669 642274
59520 642274 642964 645642 649313 652758 655271 656697 657084 656465 654759 651710 646930 640116 631355 621238 610593
59505 610593 599962 589454 579281 570198 562891 556973 551209 544904 538599 533221 529083 525976 523659
59492 523659 521868 520302 519017 518417 518514 518641 518318 517894 517937 518490 519389 520776 522665 524569 526292 528683 532742
59475 532742 538194 543675 548197 551789 554953 558219 562120 566809 571572 575314 577588 578789 579486 580107 581097
59460 581097 582768 585000 587575 590703 594712 599383 604311 609884 617194 626767 637892 649313 660172
59447 660172 670241 679628 688336 695802 700961 703107 702560 699985 695313 687977 678201 667323 656701 646877
$$ packed form
59546E13059L219L467L275K613K096K321K965L480M438O987J0879J4401J6673
59533E89873J8592K0648K1071J7472R895J206n318q184p944o213m433k996j395
59520F42274O90K678L671L445K513J426L87o19j706l049m780o814q761j0117j0645
59505F10593j0631j0508j0173r083p307n918n764o305o305n378m138l107k317
59492E23659j791j566j285o00R7J27l23m24M3N53Q99J387J889J904J723K391M059
59475E32742N452N481M522L592L164L266L901M689M763L742K274J201O97O21R90
59460E81097J671K232K575L128M009M671M928N573P310R573J1125J1421J0859
59447F60172J0069R387Q708P466N159K146n47k575m672p336r776j0878j0622r824
$$ plain form
59433 646877 637936 630017 623172 617181 611914 607610 604573 602864 602490 603600 606238 610105 614893 620832
59419 620832 628707 639197 652206 666900 682538 699213 717599 737951 759671 781986 804751 828069
59407 828069 850952 870399 882143 882999 873188 856415 837350 819092 803171 791052 784298 783315 787090
59394 787090 794186 802541 808049 805447 792259 771136 747214 723924 702246 682669 665866 651740
59382 651740 639575 629334 621582 616118 611842 608170 605504 604260 604321 605570 607974 611011 613840 616200
59368 616200 618452 620740 622946 625383 628611 632488 636347 640242 645123 651507 658786 666144 673515 681367
59354 681367 690107 699817 710123 720365 730467 741498 754715 770199 787129 805061 824002 843430
59342 843430 862464 880994 899493 917624 934150 948387 960482 969921 975122 975174 970990 964044 954812
$$ packed form
59433F46877q941p919o845n991n267m304l037j709l74J110K638L867M788N939
59419F20832P875J0490J3009J4694J5638J6675J8386K0352K1720K2315K2765K3318
59407H28069K2883J9447J1744Q56r811j6773j9065j8258j5921j2119o754r83L775
59394G87090P096Q355N508k602j3188k1123k3922k3290k1678j9577j6803j4126
59382F51740j2165j0241p752n464m276l672k666j244O1J249K404L037K829K360
59368F16200K252K288K206K437L228L877L859L895M881O384P279P358P371P852
59354F81367Q740R710J0306J0242J0102J1031J3217J5484J6930J7932J8941J9428
59342H43430J9034J8530J8499J8131J6526J4237J2095R439N201N2m184o946r232
$$ plain form
59329 954812 943109 929161 913550 896666 878878 860908 843529 827150 811883 797606 783931
59318 783931 770783 759112 750187 743920 738713 733297 727873 723060 718706 714446 710657 708022 706523 705521
59304 705521 704550 703693 703480 704638 707492 711472 715859 721204 729181 740667 754695 769609 784180 796906
59290 796906 805265 806928 801542 790602 775972 759212 741953 725903 712259 701438 693267 687179
59278 687179 682522 679102 677289 677426 679475 683441 689606 697915 707602 717910 728888 740981 754067
59265 754067 767254 779456 789874 798152 804345 808515 810213 808688 803806 796418 787651 778165 768172
59252 768172 757656 746424 734441 722426 711619 702744 695631 690021 686081 683846 682793 682458 682981
59239 682981 684653 687334 690752 694999 700293 706482 713031 719282 724672 729094 733069 737061 740600 742581
$$ packed form
59329I54812j1703j3948j5611j6884j7788j7970j7379j6379j5267j4277j3675
59318G83931j3148j1671q925o267n207n416n424m813m354m260l789k635j499j002
59304G05521r71q57k13J158K854L980M387N345P977J1486J4028J4914J4571J2726
59290G96906Q359J663n386j0940j4630j6760j7259j6050j3644j0821q171o088
59278F87179m657l420j813J37K049L966O165Q309R687J0308J0978J2093J3086
59265G54067J3187J2202J0418Q278O193M170J698j525m882p388q767r486r993
59252G68172j0516j1232j1983j2015j0807q875p113n610l940k235j053l35N23
59239F82981J672K681L418M247N294O189O549O251N390M422L975L992L539J981
$$ plain form
59225 742581 742421 740217 735894 729208 720822 712263 704326 696450 688211 680431 674086 668931 664100 659455
59211 659455 655514 652480 650142 648410 647337 646894 647179 648383 650102 651174 650738 649017 646698 644141 641699
59196 641699 640077 639617 639700 639508 638963 638398 637918 637692 638268 639860 641797 643368 644720 646310 648071 649881
59180 649881 652208 655366 658679 661320 663633 666588 670246 673791 676889 680045 683711 687976 693131 699667
59166 699667 707603 716498 726126 736485 747124 757234 766487 775163 783268 790050 794604 796576 796185 793864
59152 793864 789932 784453 777431 769259 760726 752382 744203 736044 727971 719848 711165 701822 692614 684344
59138 684344 676833 669439 662221 655889 650773 646478 642463 638432 634295 630266 626871 624464 622907 622026
59124 622026 622021 622976 624404 625837 627529 629979 633153 636860 641549 647860 655537 663525 671168 678664 686367
$$ packed form
59225G42581j60k204m323o686q386q559p937p876q239p780o345n155m831m645
59211F59455l941l034k338j732j073m43K85J204J719J072m36j721k319k557k442
59196F41699j622m60Q3j92n45n65m80k26N76J592J937J571J352J590J761J810
59180F49881K327L158L313K641K313K955L658L545L098L156L666M265N155O536
59166F99667P936Q895R628J0359J0639J0110R253Q676Q105O782M554J972l91k321
59152G93864l932n479p022q172q533q344q179q159q073q123q683r343r208q270
59138F84344p511p394p218o332n116m295m015m031m137m029l395k407j557q81
59124F22026nR55J428J433J692K450L174L707M689O311P677P988P643P496P703
$$ plain form
59109 686367 694326 702522 710994 719550 727768 735358 742297 748639 754478 759986 765181 769754 773285 775467
59095 775467 776074 775107 773206 771431 770301 769469 768650 768256 768673 769472 769917 769772 769000 767166 763804 759044 753303
59078 753303 746651 739018 730626 721704 712246 702619 693810 686348 679447 672030 664209 657014 651057 646274
59064 646274 642640 640183 638449 636751 634833 632697 630083 626791 623204 619775 616357 612760 609560 607406
59050 607406 605878 604024 601845 600213 599398 598670 597495 596216 595383 595057 594959 594776 594282 593581 593128 593183 593433
59033 593433 593599 594030 595229 597278 600266 604702 610744 617691 625140 633975 645066 657548 669800 681790
59019 681790 694974 709872 725160 739330 751864 762466 770424 775367 777760 778090 776330 772582 767618
59006 767618 762367 757395 753071 749767 747674 746931 747902 750821 755261 760643 767141 775246 784463 793324 800780
$$ packed form
59109F86367P959Q196Q472Q556Q218P590O939O342N839N508N195M573L531K182
59095G75467O07r67j901j775j130q32q19l94M17P99M45j45p72j834l362m760n741
59078G53303o652p633q392q922r458r627q809p462o901p417p821p195n957m783
59064F46274l634k457j734j698j918k136k614l292l587l429l418l597l200k154
59050F07406j528j854k179j632q15p28j175j279q33l26r8j83m94p01m53N5K50
59033E93433J66M31J199K049K988M436O042O947P449Q835J1091J2482J2252J1990
59019F81790J3184J4898J5288J4170J2534J0602P958M943K393L30j760l748m964
59006G67618n251m972m324l304k093p43R71K919M440N382O498Q105R217Q861P456
$$ plain form
58991 800780 806822 811707 815499 818493 821151 823246 823810 822232 818843 814266 808930 803396 798439 794429
58977 794429 791145 788407 786444 785584 786135 788659 793681 800956 809547 818805 828812 839862 852047 865368
58963 865368 879654 894315 908664 922550 936228 949645 962233 973167 981378 985707 985823 982734
58951 982734 977618 970393 960266 947383 932921 917678 901671 885130 868823 853203 838229 824171
58939 824171 811750 801227 792212 784533 778539 774323 771382 769213 767613 766330 765074 763915 763026 762158
58925 762158 761069 760256 760302 760699 760330 759069 757836 757058 756169 754692 752706 750169 746986 743959 742441 742665
58909 742665 743440 743839 744166 745025 746615 749401 754301 761520 770083 779165 789160 800950 814799 830312
58895 830312 846717 862804 877423 890672 904027 919009 936259 955972 978314 1003048 1029515
$$ packed form
58991H00780O042M885L792K994K658K095N64j578l389m577n336n534m957m010
58977G94429l284k738j963q60N51K524N022P275Q591R258J0007J1050J2185J3321
58963H65368J4286J4661J4349J3886J3678J3417J2588J0934Q211M329J16l089
58951I82734n116p225j0127j2883j4462j5243j6007j6541j6307j5620j4974j4058
58939H24171j2421j0523r015p679n994m216k941k169j600j283j256j159q89q68
58925G62158j089q13M6L97l69j261j233p78q89j477j986k537l183l027j518K24
58909G42665P75L99L27Q59J590K786M900P219Q563R082R995J1790J3849J5513
58895H30312J6405J6087J4619J3249J3355J4982J7250J9713K2342K4734K6467
$$ plain form
58884 1029515 1057307 1086198 1115188 1142510 1166932 1188283 1206387 1220339 1229234 1232858 1231339 1224907
58872 1224907 1214299 1200545 1183966 1164163 1141385 1117207 1093526 1071532 1051747 1034179 1018202
58861 1018202 1003170 989410 977743 967872 958290 948067 937648 927540 917432 907159 897457 888968
58849 888968 881322 873819 866294 858780 851084 843264 835851 829066 822408 815327 807691 799417 790458 781404
58835 781404 773160 765715 758093 749790 741348 733266 725378 717735 711034 705749 701754 699144 698372 699196 700557
58820 700557 701970 704024 707109 710796 714881 719788 725418 730892 736066 742012 749195 756352 762046 766205
58806 766205 769298 771130 771492 771002 770318 769249 767493 765394 763134 760014 755399 749669 743514 737069 730389
58791 730389 723913 717749 711345 704522 697989 692274 687157 682755 680072 679715 681085 683521 687112 691676
$$ packed form
58884A029515K7792K8891K8990K7322K4422K1351J8104J3952Q895L624j519o432
58872A224907j0608j3754j6579j9803k2778k4178k3681k1994j9785j7568j5977
58861A018202j5032j3760j1667r871r582j0223j0419j0108j0108j0273r702q489
58849H88968p646p503p525p514p696p820p413o785o658p081p636q274q959r054
58835G81404q244p445p622q303q442q082p888p643o701n285l995k610p72Q24J361
58820G00557J413K054L085L687M085M907N630N474N174N946P183P157N694M159
58806G66205L093J832L62m90o84j069j756k099k260l120m615n730o155o445o680
58791G30389o476o164o404o823o533n715n117m402k683l57J370K436L591M564
$$ plain form
58777 691676 696268 700604 705663 711814 717479 720828 721688 720696 717769 712753 706558 700225 693661 686549 679680
58762 679680 674071 669542 665447 662155 660451 660114 660324 660978 662453 664598 667014 669778 672886 675565 677132
58747 677132 677932 678521 678771 678717 679342 681349 684003 686464 689388 693844 699346 704400 708381 711589 714108 716114
58731 716114 718781 723332 729422 735657 741361 746677 751477 755551 759566 764477 770074 775276 779641 783643
58717 783643 787746 792231 797625 804291 811894 820034 828930 838608 848039 856085 862707 868237 872160 873769
58703 873769 873306 871263 867103 859909 849775 837393 822851 806080 787930 769501 750984 732420
58691 732420 715001 700217 688100 677689 668717 661462 655330 649149 642645 636333 630197 623859 617791
58678 617791 612993 609518 606448 603240 600051 597079 594672 593803 595246 598465 602287 606378 611180 616930
$$ packed form
58777F91676M592M336N059O151N665L349Q60r92k927n016o195o333o564p112o869
58762F79680n609m529m095l292j704l37K10O54J475K145K416K764L108K679J567
58747F77132Q00N89K50n4O25K007K654K461K924M456N502N054L981L208K519K006
58731G16114K667M551O090O235N704N316M800M074M015M911N597N202M365M002
58717G83643M103M485N394O666P603Q140Q896R678R431Q046O622N530L923J609
58703H73769m63k043m160p194j0134j2382j4542j6771j8150j8429j8517j8564
58691G32420j7419j4784j2117j0411q972p255o132o181o504o312o136o338o068
58678F17791m798l475l070l208l189k972k407q69J443L219L822M091M802N750
$$ plain form
58664 616930 623762 632109 641845 651643 660397 668564 676713 683520 686902 686730 684770 682287 679314 676055
58650 676055 673170 670518 667065 662415 657404 653121 650087 648206 646720 644643 642064 640421 640613 641682
58636 641682 642466 643551 646204 650345 655140 660656 667083 673152 677337 680046 682627 684695 684604 682285 679403
58621 679403 676745 673521 669390 665245 661706 658560 655988 654828 655377 657264 660459 665016 670024 674312
58607 674312 677999 681775 684922 685903 684809 683382 682553 681745 680682 680073 680221 680562 680824 681173 681157 680079 678546
58590 678546 678134 679463 681980 685529 690540 696682 703051 709753 717758 727204 737437 748554 761135 774443
58576 774443 786727 797470 807683 817920 827739 837122 846673 856274 865304 874369 885125 898319 913617
58563 913617 931316 952363 976634 1002973 1030891 1060370 1090027 1117527 1141929 1163619 1181832
$$ packed form
58664F16930O832Q347R736R798Q754Q167Q149O807L382j72j960k483k973l259
58650F76055k885k652l453m650n011m283l034j881j486k077k579j643J92J069
58636F41682P84J085K653M141M795N516O427O069M185K709K581K068r1k319k882
58621F79403k658l224m131m145l539l146k572j160N49J887L195M557N008M288
58607F74312L687L776L147R81j094j427q29q08j063o09J48L41K62L49j6j078j533
58590F78546m12J329K517L549N011O142O369O702Q005R446J0233J1117J2581J3308
58576G74443J2284J0743J0213J0237R819R383R551R601R030R065J0756J3194J5298
58563I13617J7699K1047K4271K6339K7918K9479K9657K7500K4402K1690J8213
$$ plain form
58552 1181832 1194465 1200738 1202035 1199759 1194365 1186861 1179193 1172485 1166589 1161599 1157965 1154784 1149956 1142501
58538 1142501 1132998 1121516 1107056 1089324 1069243 1047485 1024393 1001450 980686 962438 945772
58527 945772 931190 920551 914008 909477 905629 903094 902268 902347 903074 904992 907322 908060 906893 905652 905110
58512 905110 903843 901118 898452 897179 896741 896368 896216 895822 893718 889772 885813 882962 880378 877499 875214
58497 875214 873794 871991 869325 867085 865964 864896 863339 862453 862862 863497 863850 865152 868165 872105 876885
58482 876885 884073 894319 906237 919171 934568 953049 972522 990909 1008448 1025535 1040569 1051916
58470 1051916 1060026 1065720 1068248 1066918 1062881 1057550 1050894 1042896 1034969 1028290 1022390 1016932 1013257 1012724
58456 1012724 1015136 1020015 1027628 1037538 1048205 1059301 1072270 1087151 1101092 1111519 1118572 1122798
$$ packed form
58552A181832J2633O273J297k276n394p504p668o708n896m990l634l181m828p455
58538A142501r503j1482j4460j7732k0081k1758k3092k2943k0764j8248j6666
58527I45772j4582j0639o543m531l848k535q26P9P27J918K330P38j167j241n42
58512I05110j267k725k666j273m38l73j52l94k104l946l959k851k584k879k285
58497H75214j420j803k666k240j121j068j557q86M09O35L53J302L013L940M780
58482H76885P188J0246J1918J2934J5397J8481J9473J8387J7539J7087J5034J1347
58470A051916Q110N694K528j330m037n331o656p998p927o679n900n458l675n33
58456A012724K412M879P613R910J0667J1096J2969J4881J3941J0427P053M226
$$ plain form
58444 1122798 1122940 1118069 1109767 1100056 1089022 1076471 1064028 1053490 1044755 1037274 1031888 1029360 1028713
58431 1028713 1028816 1030059 1032861 1036285 1039845 1044939 1052838 1062923 1074301 1087279 1101736 1116018 1128986
58418 1128986 1141095 1152023 1159531 1162335 1161892 1159715 1155323 1148548 1141220 1134546 1127272 1118481 1109747 1102399
58404 1102399 1095287 1087520 1080846 1076794 1073853 1070118 1066452 1064553 1064131 1064546 1066912 1071965 1078001 1083518
58390 1083518 1089609 1097177 1104249 1108878 1112367 1116665 1120842 1123170 1124585 1126980 1130056 1132859 1136418 1141809
58376 1141809 1147631 1152420 1157621 1165109 1173696 1181246 1188317 1196587 1205594 1214200 1223496 1235029 1247834
58363 1247834 1260311 1273293 1288317 1304694 1321257 1339021 1358993 1379254 1397385 1413836 1429788
58352 1429788 1443764 1453653 1460155 1465041 1468063 1468879 1469835 1473316 1478254 1482603 1487240 1494076 1502474 1510973
$$ packed form
58444A122798J42m871q302r711j1034j2551j2443j0538q735p481n386k528o47
58431A028713J03J243K802L424L560N094P899J0085J1378J2978J4457J4282J2968
58418A128986J2109J0928P508K804m43k177m392o775p328o674p274q791q734p348
58404A102399p112p767o674m052k941l735l666j899m22M15K366N053O036N517
58390A083518O091P568P072M629L489M298M177K328J415K395L076K803L559N391
58376A141809N822M789N201P488Q587P550P071Q270R007Q606R296J1533J2805
58363A247834J2477J2982J5024J6377J6563J7764J9972K0261J8131J6451J5952
58352A429788J3976R889O502M886L022Q16R56L481M938M349M637O836Q398Q499
$$ plain form
58338 1510973 1520439 1532137 1544980 1558078 1573458 1592565 1612742 1631026 1648832 1668885 1690198
58327 1690198 1710396 1730274 1751439 1771927 1788813 1802977 1816687 1828813 1837110 1843009 1849443 1856099
58315 1856099 1861474 1867204 1875544 1885014 1893428 1902754 1915976 1931760 1947387 1964126 1984166 2005119
58303 2005119 2023679 2042088 2064620 2089941 2113409 2134790 2157170 2180230 2201349 2221643 2244236
58292 2244236 2268097 2290229 2312346 2338710 2368881 2399318 2430494 2465494 2503112 2539450 2574981
58281 2574981 2612986 2652516 2690103 2726992 2767240 2809980 2851103 2891286 2934686 2980919 3026166
58270 3026166 3071140 3120060 3172733 3225537 3279212 3337744 3400692 3464602 3530725 3603088 3680288
58259 3680288 3757637 3835835 3918742 4004335 4087271 4168800 4254440 4343381 4430297 4516218 4607150
$$ packed form
58338A510973R466J1698J2843J3098J5380J9107K0177J8284J7806K0053K1313
58327A690198K0198J9878K1165K0488J6886J4164J3710J2126Q297N899O434O656
58315A856099N375N730Q340R470Q414R326J3222J5784J5627J6739K0040K0953
58303B005119J8560J8409K2532K5321K3468K1381K2380K3060K1119K0294K2593
58292B244236K3861K2132K2117K6364L0171L0437L1176L5000L7618L6338L5531
58281B574981L8005L9530L7587L6889M0248M2740M1123M0183M3400M6233M5247
58270C026166M4974M8920N2673N2804N3675N8532O2948O3910O6123P2363P7200
58259C680288P7349P8198Q2907Q5593Q2936Q1529Q5640Q8941Q6916Q5921R0932
$$ plain form
58248 4607150 4703196 4799795 4898450 5005049 5118636 5233454 5351126 5478924 5616876 5758921
58238 5758921 5906054 6065440 6237030 6414286 6597888 6795282 7006916 7226781 7456275
58229 7456275 7703246 7967713 8243468 8533458 8848008 9188364 9548381 9931757 10349998
58220 10349998 10803849 11285510 11798994 12358644 12967836 13620438 14323549 15096331 15945999
58211 15945999 16869238 17878419 19000893 20251553 21634234 23172547 24910445 26881631
58203 26881631 29112148 31657021 34600790 38022437 42003813 46681662 52254660 58946736
58195 58946736 67030101 76908148 89135458 104361092 123306822 146738830 175235534
58188 175235534 208785355 246522364 286660943 326318078 361277183 386485214 397778186
$$ packed form
58248D607150R6046R6599R8655J06599J13587J14818J17672J27798J37952J42045
58238E758921J47133J59386J71590J77256J83602J97394K11634K19865K29494
58229G456275K46971K64467K75755K89990L14550L40356L60017L83376M18241
58220A0349998M53851M81661N13484N59650O09192O52602P03111P72782Q49668
58211A5945999R23239J009181J122474J250660J382681J538313J737898J971186
58203B6881631K230517K544873K943769L421647L981376M677849N572998O692076
58195E8946736Q083365R878047J2227310J5225634J8945730K3432008K8496704
58188A75235534L3549821L7737009M0138579L9657135L4959105K5208031J1292972
$$ plain form
58181 397778186 393877842 376953817 351260968 321151753 289952518 259857558 232091322
58174 232091322 206991659 184268732 163506409 144527776 127374672 112104620 98688580
58167 98688580 87023536 76951895 68279928 60820546 54416832 48920709 44180834 40069458
58159 40069458 36497621 33390352 30669399 28271052 26156822 24292485 22634460 21145865
58151 21145865 19806610 18597889 17493950 16477383 15545326 14692101 13900964 13159552 12467170
58142 12467170 11819086 11198630 10592942 10003659 9435794 8889384 8368445 7884528 7443094
58133 7443094 7036439 6655822 6300272 5968869 5655903 5359607 5085494 4835575 4603600
58124 4603600 4385442 4184492 4002319 3833648 3675221 3530363 3400204 3279374 3164766
$$ packed form
58181C97778186l900344j6924025k5692849l0109215l1199235l0094960k7766236
58174B32091322k5099663k2722927k0762323j8978633j7153104j5270052j3416040
58167I8688580j1665044j0071641q671967p459382o403714n496123m739875m111376
58159D0069458l571837l107269k720953k398347k114230j864337j658025j488595
58151B1145865j339255j208721j103939j016567r32057q53225p91137p41412o92382
58142A2467170o48084o20456o05688n89283n67865n46410n20939m83917m41434
58133G443094m06655l80617l55550l31403l12966k96296k74113k49919k31975
58124D603600k18158k00950j82173j68671j58427j44858j30159j20830j14608
$$ plain form
58115 3164766 3059736 2965267 2875638 2787318 2703839 2627518 2554573 2482811 2416083 2356476 2299632
58104 2299632 2242329 2187526 2137523 2089136 2039935 1992552 1948693 1905431 1861418 1820296 1783996
58093 1783996 1748998 1713102 1679625 1650936 1623932 1595936 1569280 1546169 1524647 1503331 1484489
58082 1484489 1468751 1452316 1433122 1414330 1398100 1381415 1361861 1342141 1324892 1308124 1289779
58071 1289779 1271941 1256573 1241701 1225635 1210521 1197974 1185609 1171643 1158693 1149347 1141936 1134200
58059 1134200 1127168 1122021 1116929 1110319 1103542 1097228 1088875 1077131 1064683 1053987 1044029 1034086 1026452
58046 1026452 1022245 1018615 1013321 1008153 1004700 1000883 995113 989824 987168 984948 980542 975333 971626 968548
58032 968548 964636 961179 959237 956428 950299 942114 934034 925506 915783 906959 900952 896208 890741 885644
$$ packed form
58115C164766j05030r4469q9629q8320q3479p6321p2945p1762o6728n9607n6844
58104B299632n7303n4803n0003m8387m9201m7383m3859m3262m4013m1122l6300
58093A783996l4998l5896l3477k8689k7004k7996k6656k3111k1522k1316j8842
58082A484489j5738j6435j9194j8792j6230j6685j9554j9720j7249j6768j8345
58071A289779j7838j5368j4872j6066j5114j2547j2365j3966j2950r346p411p736
58059A134200p032n147n092o610o777o314q353j1744j2448j0696r958r943p634
58046A026452m207l630n294n168l453l817n770n289k656k220m406n209l707l078
58032I68548l912l457j942k809o129q185q080q528r723q824o007m744n467n097
$$ plain form
58018 885644 882316 879126 874330 869565 866963 865405 863048 860928 860534 860331 858324 855764 854817 854786 854090 853738
58002 853738 855313 857547 858446 858903 860719 862951 863763 864189 866546 870508 874033 876777 879445 881147 880619
57987 880619 878958 878217 878324 877997 877418 877407 877351 876500 875872 876375 876567 874885 872521 871389 870856 869277 867336
57970 867336 866993 868356 870255 872673 875933 878782 879971 880619 882482 885086 886995 888619 891198 894266 896642
57955 896642 898674 900978 902322 901446 899695 899143 899292 898377 896842 896646 898022 899714 901683 904917 909182
57940 909182 913544 918524 925318 933424 941317 948950 957462 967063 977209 988107 999977 1011549 1021263
57927 1021263 1029225 1036222 1041943 1046007 1049448 1053001 1055111 1053985 1050497 1046736 1042848 1037740 1031894 1026807
57913 1026807 1022404 1017503 1012222 1007661 1003807 999970 996654 994871 994312 994183 994888 996815 998508 998348 997051
$$ packed form
58018H85644l328l190m796m765k602j558k357k120l94k03k007k560r47l1o96l52
58002H53738J575K234Q99M57J816K232Q12M26K357L962L525K744K668J702n28
57987H80619j661p41J07l27n79j1n6q51o28N03J92j682k364j132n33j579j941
57970H67336l43J363J899K418L260K849J189O48J863K604J909J624K579L068K376
57955H96642K032K304J344q76j751n52J49r15j535j96J376J692J969L234M265
57940I09182M362M980O794Q106P893P633Q512R601J0146J0898J1870J1572R714
57927A021263P962O997N721M064L441L553K110j126l488l761l888n108n846n087
57913A026807m403m901n281m561l854l837l316j783n59j29P05J927J693j60j297
$$ plain form
57898 997051 996171 995226 992920 990252 989597 991222 993337 995149 997360 1000146 1003167 1007200 1013292 1020537 1026933
57883 1026933 1032113 1037120 1042047 1046276 1050532 1056151 1062529 1067618 1070783 1073006 1074631 1075174 1075129 1075669 1076675
57868 1076675 1077105 1077045 1077444 1078159 1078277 1077911 1077667 1076891 1074621 1071711 1069824 1068928 1068072 1067949 1070125 1074280 1078825
57851 1078825 1083778 1090323 1097859 1104392 1109741 1115558 1122130 1127933 1132521 1137071 1141780 1145389 1147722 1150090
57837 1150090 1152705 1154213 1154344 1154587 1155598 1156271 1156106 1156318 1157851 1160237 1163026 1166432 1170146 1173449 1176940
57822 1176940 1182141 1188997 1195813 1201995 1208625 1215863 1222172 1226952 1231751 1237865 1244602 1250848 1256579 1261950
57808 1261950 1266544 1270347 1273964 1277187 1278892 1278934 1278607 1278718 1278812 1278787 1279573 1281637 1284396 1287614 1291709 1296220
57792 1296220 1299786 1302251 1305135 1309391 1314323 1319234 1324362 1329532 1333701 1336716 1339973 1344548 1350127 1356418
$$ packed form
57898I97051q80r45k306k668o55J625K115J812K211K786L021M033O092P245O396
57883A026933N180N007M927M229M256N619O378N089L165K223J625N43m5N40J006
57868A076675M30o0L99P15J18l66k44p76k270k910j887q96q56j23K176M155M545
57851A078825M953O545P536O533N349N817O572N803M588M550M709L609K333K368
57837A150090K615J508J31K43J011O73j65K12J533K386K789L406L714L303L491
57822A176940N201O856O816O182O630P238O309M780M799O114O737O246N731N371
57808A261950M594L803L617L223J705M2l27J11R4k5P86K064K759L218M095M511
57792A296220L566K465K884M256M932M911N128N170M169L015L257M575N579O291
$$ plain form
57778 1356418 1364007 1373068 1382708 1392401 1402715 1414069 1426139 1438963 1453044 1467869 1481934 1494761
57766 1494761 1507152 1518927 1528364 1534799 1539955 1545637 1551750 1557587 1563417 1569473 1574751 1578079 1579389
57753 1579389 1579071 1577166 1574004 1570381 1566370 1561244 1555305 1550349 1547425 1545547 1543616 1542218 1542381 1543811
57739 1543811 1545603 1547676 1550345 1553309 1556077 1558743 1561602 1564765 1568697 1574157 1581007 1588095 1594867 1601941
57725 1601941 1609588 1616967 1623629 1630512 1638507 1647113 1655332 1662843 1669631 1675602 1681376 1688258 1696506 1704650
57711 1704650 1711311 1716653 1721379 1725551 1729277 1733272 1737651 1741250 1743222 1744424 1746265 1749093 1752646 1757110
57697 1757110 1762612 1768434 1773771 1778744 1783937 1789559 1795657 1802392 1809476 1816123 1822116 1828124 1834518 1840834
57683 1840834 1846897 1853320 1860377 1867524 1874768 1883279 1893862 1905912 1918654 1932387 1947819 1965379
$$ packed form
57778A356418P589R061R640R693J0314J1354J2070J2824J4081J4825J4065J2827
57766A494761J2391J1775R437O435N156N682O113N837N830O056N278L328J310
57753A579389l18j905l162l623m011n126n939m956k924j878j931j398J63J430
57739A543811J792K073K669K964K768K666K859L163L932N460O850P088O772P074
57725A601941P647P379O662O883P995Q606Q219P511O788N971N774O882Q248Q144
57711A704650O661N342M726M172L726L995M379L599J972J202J841K828L553M464
57697A757110N502N822N337M973N193N622O098O735P084O647N993O008O394O316
57683A840834O063O423P057P147P244Q511J0583J2050J2742J3733J5432J7560
$$ plain form
57671 1965379 1986020 2011521 2043055 2080484 2123758 2173642 2230008 2290437 2351257 2408481 2456750
57660 2456750 2489301 2501393 2493586 2470631 2437926 2400036 2361213 2325053 2293475 2267141 2246586
57649 2246586 2232018 2222536 2216692 2213642 2212981 2213998 2216017 2219048 2223330 2228620 2234621 2241517 2249410 2257801
57635 2257801 2266308 2275280 2285014 2295031 2304820 2314575 2324546 2334414 2343993 2353794 2364138 2374420 2383936
57622 2383936 2392744 2401139 2409122 2416970 2425393 2434461 2443371 2451872 2460809 2470569 2480296 2489529 2499241 2510132
57608 2510132 2521171 2531184 2540822 2551537 2563540 2576122 2589103 2602544 2615772 2628121 2640034
57597 2640034 2652168 2664115 2675185 2685701 2696224 2706337 2715567 2724684 2734487 2744140 2752474 2760407
57585 2760407 2770145 2782152 2794709 2806452 2817712 2829195 2840878 2852616 2864670 2877125 2889631
$$ packed form
57671A965379K0641K5501L1534L7429M3274M9884N6366O0429O0820N7224M8269
57660B456750L2551J2092p807k2955l2705l7890l8823l6160l1578k6334k0555
57649B246586j4568r482n844l050o61J017K019L031M282N290O001O896P893Q391
57635B257801Q507Q972R734J0017R789R755R971R868R579R801J0344J0282R516
57622B383936Q808Q395P983P848Q423R068Q910Q501Q937R760R727R233R712J0891
57608B510132J1039J0013R638J0715J2003J2582J2981J3441J3228J2349J1913
57597B640034J2134J1947J1070J0516J0523J0113R230R117R803R653Q334P933
57585B760407R738J2007J2557J1743J1260J1483J1683J1738J2054J2455J2506
$$ plain form
57574 2889631 2901941 2914037 2925764 2937007 2948190 2959917 2972207 2984646 2997036 3009321 3021314
57563 3021314 3033197 3045752 3059276 3072784 3085256 3097289 3110476 3125434 3141324 3157083 3172240
57552 3172240 3186771 3201031 3215790 3231695 3248758 3266701 3285378 3304509 3323622 3342664 3361885
57541 3361885 3380715 3397833 3413069 3428109 3444354 3461176 3477358 3493142 3509491 3526285 3542693
57530 3542693 3558634 3574435 3589794 3604509 3619607 3636253 3654033 3671747 3689300 3707380 3725889
57519 3725889 3744333 3763275 3783677 3805094 3826175 3846721 3867668 3889255 3910911 3932792 3955733
57508 3955733 3979630 4003525 4027396 4052247 4078216 4104119 4129236 4154166 4179532 4205066 4230315
57497 4230315 4255136 4279231 4302198 4324262 4345966 4367115 4387063 4406073 4425207 4444752 4463899
$$ packed form
57574B889631J2310J2096J1727J1243J1183J1727J2290J2439J2390J2285J1993
57563C021314J1883J2555J3524J3508J2472J2033J3187J4958J5890J5759J5157
57552C172240J4531J4260J4759J5905J7063J7943J8677J9131J9113J9042J9221
57541C361885J8830J7118J5236J5040J6245J6822J6182J5784J6349J6794J6408
57530C542693J5941J5801J5359J4715J5098J6646J7780J7714J7553J8080J8509
57519C725889J8444J8942K0402K1417K1081K0546K0947K1587K1656K1881K2941
57508C955733K3897K3895K3871K4851K5969K5903K5117K4930K5366K5534K5249
57497D230315K4821K4095K2967K2064K1704K1149J9948J9010J9134J9545J9147
$$ plain form
57486 4463899 4482147 4499944 4517754 4535537 4553344 4571476 4589873 4608247 4626895 4646549 4667404
57475 4667404 4689058 4711167 4733265 4754337 4773808 4792701 4812588 4833581 4854697 4875999 4898734
57464 4898734 4923264 4948417 4973228 4997920 5022856 5047846 5073001 5099051 5126349 5154511 5183301
57453 5183301 5212837 5242678 5271868 5300164 5328257 5356517 5384596 5412417 5440367 5468239 5495188
57442 5495188 5521096 5546868 5573051 5599293 5625542 5652546 5680634 5709028 5736980 5764652 5792391
57431 5792391 5820038 5847490 5875160 5903377 5931950 5960598 5989177 6017327 6044757 6072034 6100270
57420 6100270 6129787 6159874 6189893 6219669 6248832 6276956 6304556 6332813 6361950 6390958 6419265
57409 6419265 6447607 6476865 6507007 6537606 6568442 6599174 6629260 6658517 6687049 6714572 6740869
$$ packed form
57486D463899J8248J7797J7810J7783J7807J8132J8397J8374J8648J9654K0855
57475D667404K1654K2109K2098K1072J9471J8893J9887K0993K1116K1302K2735
57464D898734K4530K5153K4811K4692K4936K4990K5155K6050K7298K8162K8790
57453E183301K9536K9841K9190K8296K8093K8260K8079K7821K7950K7872K6949
57442E495188K5908K5772K6183K6242K6249K7004K8088K8394K7952K7672K7739
57431E792391K7647K7452K7670K8217K8573K8648K8579K8150K7430K7277K8236
57420F100270K9517L0087L0019K9776K9163K8124K7600K8257K9137K9008K8307
57409F419265K8342K9258L0142L0599L0836L0732L0086K9257K8532K7523K6297
$$ plain form
57398 6740869 6766986 6794704 6824413 6854595 6883825 6912194 6940412 6968677 6997052 7025944 7055597
57387 7055597 7085801 7116473 7147687 7178986 7209725 7240379 7272322 7305901 7339852 7373065 7405721
57376 7405721 7438282 7470610 7502777 7535443 7568580 7600869 7631348 7660769 7690524 7720979 7751685
57365 7751685 7782505 7813615 7844907 7876120 7907216 7938218 7969158 8000457 8032724 8065927 8099438
57354 8099438 8133040 8167075 8201401 8235230 8268274 8300998 8333394 8364646 8394482 8423777 8453254
57343 8453254 8482597 8511358 8539787 8568182 8596408 8624560 8653105 8681882 8710059 8737605 8765640
57332 8765640 8794741 8824114 8853091 8882110 8911403 8940066 8967549 8994939 9023521 9052907 9081741
57321 9081741 9109486 9136531 9163285 9190200 9217974 9246677 9275210 9302534 9328822 9354697 9380164
$$ packed form
57398F740869K6117K7718K9709L0182K9230K8369K8218K8265K8375K8892K9653
57387G055597L0204L0672L1214L1299L0739L0654L1943L3579L3951L3213L2656
57376G405721L2561L2328L2167L2666L3137L2289L0479K9421K9755L0455L0706
57365G751685L0820L1110L1292L1213L1096L1002L0940L1299L2267L3203L3511
57354H099438L3602L4035L4326L3829L3044L2724L2396L1252K9836K9295K9477
57343H453254K9343K8761K8429K8395K8226K8152K8545K8777K8177K7546K8035
57332H765640K9101K9373K8977K9019K9293K8663K7483K7390K8582K9386K8834
57321I081741K7745K7045K6754K6915K7774K8703K8533K7324K6288K5875K5467
$$ plain form
57310 9380164 9405136 9430145 9455483 9480346 9503941 9526851 9550274 9574417 9598619 9622527 9646186
57299 9646186 9669417 9692033 9714316 9736496 9758174 9779027 9799565 9820456 9841544 9862209 9882218
57288 9882218 9901578 9920178 9938244 9956461 9974974 9992914 10009671 10025842 10042129 10058114 10073081
57277 10073081 10087257 10101172 10114481 10126565 10137771 10148951 10160160 10170777 10180434 10188852 10195263 10199132
57265 10199132 10201160 10202621 10204012 10205119 10205881 10206167 10205143 10202040 10197297 10191967 10186200 10179307 10171146 10162431
57251 10162431 10153677 10144668 10135032 10124730 10114045 10103583 10094093 10085751 10077900 10069925 10061994 10054446 10047029
57238 10047029 10039431 10032102 10025777 10020513 10015849 10011549 10007527 10003368 9998553 9992890 9986300 9978593 9969873 9960607
57224 9960607 9950761 9939473 9926079 9910898 9894520 9877015 9858359 9838817 9818292 9796046 9771729
$$ packed form
57310I380164K4972K5009K5338K4863K3595K2910K3423K4143K4202K3908K3659
57299I646186K3231K2616K2283K2180K1678K0853K0538K0891K1088K0665K0009
57288I882218J9360J8600J8066J8217J8513J7940J6757J6171J6287J5985J4967
57277A0073081J4176J3915J3309J2084J1206J1180J1209J0617R657Q418O411L869
57265A0199132K028J461J391J107P62K86j024l103m743n330n767o893q161q715
57251A0162431q754r009r636j0302j0685j0462r490q342p851p975p931p548p417
57238A0047029p598p329o325n264m664m300m022m159m815n663o590p707q720r266
57224I960607r846j1288j3394j5181j6378j7505j8656j9542k0525k2246k4317
$$ plain form
57213 9771729 9745931 9719163 9691186 9661977 9632307 9602522 9571785 9539403 9505911 9471916 9437002
57202 9437002 9400866 9364371 9328224 9291641 9253707 9215075 9176809 9138524 9099272 9059433 9019979
57191 9019979 8980556 8940107 8898927 8858282 8818280 8777826 8736488 8694818 8652935 8610370 8567184
57180 8567184 8523801 8479808 8434327 8387474 8340060 8292002 8242441 8191218 8138702 8084258 8026495
57169 8026495 7965144 7901183 7834979 7765724 7692855 7616621 7536976 7453271 7365419 7274212 7180174
57158 7180174 7083195 6983604 6882580 6781189 6679822 6578794 6478861 6381118 6287002 6198106
57148 6198106 6115297 6038379 5967333 5903136 5846447 5796356 5751767 5713116 5680949 5653489 5627494
57137 5627494 5601099 5573830 5544165 5509354 5467868 5420018 5365993 5305336 5238919 5169592 5100261
$$ packed form
57213I771729k5798k6768k7977k9209k9670k9785l0737l2382l3492l3995l4914
57202I437002l6136l6495l6147l6583l7934l8632l8266l8285l9252l9839l9454
57191I019979l9423m0449m1180m0645m0002m0454m1338m1670m1883m2565m3186
57180H567184m3383m3993m5481m6853m7414m8058m9561n1223n2516n4444n7763
57169H026495o1351o3961o6204o9255p2869p6234p9645q3705q7852r1207r4038
57158G180174r6979r9591j01024j01391j01367j01028r9933r7743r4116q8896
57148F198106q2809p6918p1046o4197n6689n0091m4589l8651l2167k7460k5995
57137E627494k6395k7269k9665l4811m1486m7850n4025o0657o6417o9327o9331
$$ plain form
57126 5100261 5032860 4969595 4913471 4866853 4830765 4805970 4793225 4791973 4800150 4815809 4837747 4864530
57114 4864530 4894612 4928104 4967273 5015155 5075085 5151584 5249866 5373885 5526175 5709699 5928482
57103 5928482 6187013 6491935 6855505 7296050 7835191 8497137 9311413 10314261 11547113
57094 11547113 13056265 14894285 17117576 19778571 22918189 26560766 30706970 35325283
57086 35325283 40351076 45696313 51261085 56941412 62636655 68250077 73661445 78672472
57078 78672472 82975116 86200200 88037663 88346981 87182458 84734708 81249198 76973249
57070 76973249 72137664 66953942 61613324 56285036 51113669 46215402 41674708 37544085
57062 37544085 33847005 30582507 27730665 25259069 23129305 21301428 19736141 18396510
$$ packed form
57126E100261o7401o3265n6124m6618l6088k4795j2745j252Q177J5659K1938K6783
57114D864530L0082L3492L9169M7882N9930P6499R8282J24019J52290J83524K18783
57103E928482K58531L04922L63570M40545N39141O61946Q14276J002848J232852
57094A1547113J509152J838020K223291K660995L139618L642577M146204M618313
57086C5325283N025793N345237N564772N680327N695243N613422N411368N011027
57078G8672472M302644L225084J837463L09318j164523k447750l485510m275949
57070G6973249m835585n183722n340618n328288n171367m898267m540694m130623
57062C7544085l697080l264498k851842k471596k129764j827877j565287j339631
$$ plain form
57054 18396510 17250339 16271794 15440549 14739510 14153447 13668921 13274055 12957868 12710284
57045 12710284 12522719 12387937 12299387 12251526 12240772 12264676 12318587 12391671 12463774 12503845 12472646
57034 12472646 12332870 12063578 11669416 11177898 10627897 10057695 9497757 8968657 8482798
57025 8482798 8047582 7667117 7341932 7069212 6844324 6660516 6505305 6358473 6197176
57016 6197176 6005867 5782585 5536836 5282245 5030114 4787145 4556694 4340939 4141612
57007 4141612 3959199 3792531 3639741 3499183 3369063 3246906 3130306 3018058 2910000
56998 2910000 2805989 2705608 2608601 2515031 2425014 2338690 2256348 2178312 2104863 2036494 1973890
56987 1973890 1917355 1866558 1821040 1780593 1744822 1712607 1682083 1650755 1615688 1574495 1526794
$$ packed form
57054A8396510j146171r78545q31245p01039n86063m84526l94866l16187k47584
57045A2710284j87565j34782q8550m7861j0754K3904N3911P3084P2103M0071l1199
57034A2472646j39776k69292l94162m91518n50001n70202n59938n29100m85859
57025H482798m35216l80465l25185k72720k24888j83808j55211j46832j61297
57016F197176j91309k23282k45749k54591k52131k42969k30451k15755j99327
57007D141612j82413j66668j52790j40558j30120j22157j16600j12248j08058
56998B910000j04011j00381r7007r3570r0017q6324q2342p8036p3449o8369o2604
56987A973890n6535n0797m5518m0447l5771l2215l0524l1328l5067m1193m7701
$$ plain form
56976 1526794 1474432 1420053 1365809 1313342 1263999 1218457 1176627 1138310 1103458 1071665 1042269
56965 1042269 1015371 992000 972825 957453 945446 937250 933495 934046 938201 944892 951894 955469 951748
56952 951748 938490 915609 884884 849557 813163 777834 744140 712737 685116 662167 643188
56941 643188 627203 614245 604482 597195 591938 589956 593204 602483 617618 638687 665545 696312 727313
56928 727313 754289 772886 778981 770438 748890 718794 684520 648877 613752 580677 550433 523025
56916 523025 498349 476364 456775 439215 423673 410170 398230 387320 377582 369452 362768 356979
56904 356979 351985 347973 344628 341304 337963 335248 333626 333030 333288 334452 336759 340605 346378 354074 363459
56889 363459 374828 388961 405949 424771 444419 464413 483331 497831 504516 502498 493343 479142
$$ packed form
56976A526794n2362n4379n4244n2467m9343m5542m1830l8317l4852l1793k9396
56965A042269k6898k3371j9175j5372j2007q196l755N51M155O691P002L575l721
56952I51748j3258k2881l0725l5327l6394l5329l3694l1403k7621k2949j8979
56941F43188j5985j2958r763p287n257j982L248R279J5135K1069K6858L0767L1001
56928G27313K6976J8597O095q543k1548l0096l4274l5643l5125l3075l0244k7408
56916E23025k4676k1985j9589j7560j5542j3503j1940j0910r738q130o684n789
56904C56979m994m012l345l324l341k715j622n96K58J164K307L846N773P696R385
56889C63459J1369J4133J6988J8822J9648J9994J8918J4500O685k018r155j4201
$$ plain form
56877 479142 461727 443085 424932 407842 391852 377827 367198 360532 357424 357807 362324 371435 385237
56864 385237 404322 429881 462680 502552 548819 600236 654044 705479 748469 777042 787099
56853 787099 778219 754091 720589 683059 645222 609653 578233 552143 532112 518582 511328 509537
56841 509537 513062 523343 542425 571514 611144 662184 725498 800568 884837 973590 1059350 1131914
56829 1131914 1180806 1199007 1185093 1143138 1081389 1009787 936519 866057 800542 742109 692727
56818 692727 652543 620254 595331 578655 570926 571775 580829 598693 626463 664797 713395 770398
56806 770398 831844 891925 943712 979841 994044 983903 952303 905397 849312 789132 729605
56795 729605 674581 625584 582374 545033 514358 490336 471811 457994 449147 445656 447653 455724
$$ packed form
56877D79142j7415j8642j8153j7090j5990j4025j0629o666l108L83M517R111J3802
56864C85237J9085K5559L2799L9872M6267N1417N3808N1435M2990K8573J0057
56853G87099q880k4128l3502l7530l7837l5569l1420k6090k0031j3530p254j791
56841E09537L525J0281J9082K9089L9630N1040O3314P5070Q4269Q8753Q5760P2564
56829A131914M8892J8201j3914m1955o1749p1602p3268p0462o5515n8433m9382
56818F92727m0184l2289k4923j6676p729Q49R054J7864K7770L8334M8598N7003
56806G70398O1446O0081N1787L6129J4203j0141l1600m6906n6085o0180n9527
56795G29605n5024m8997m3210l7341l0675k4022j8525j3817q847l491J997Q071
$$ plain form
56783 455724 470630 491882 517597 545837 574770 601123 619954 626997 620846 602766 575474 542454
56771 542454 507254 472351 438925 407792 379829 355261 333453 313967 297201 283620 272882
56760 272882 264052 256188 248528 240650 232712 225181 218274 211981 206401 201522 196906 192292 188236 185392
56746 185392 183395 181324 179048 177156 175766 174412 173025 171980 171216 170308 169372 168871 168590 167863 166770 166006
56730 166006 165590 164870 163845 163260 163277 163310 163366 164324 166534 169231 171653 173735 175476 176696 177671 178939 180228
56713 180228 180650 180232 180172 181265 183119 185168 187338 189370 190736 191679 193306 196106 199334 202214 204756
56698 204756 207005 208615 209660 210890 212650 214467 216083 217889 219858 221126 221222 220787 220478 220082 219356 218852
56682 218852 219168 220027 220734 221030 221022 220863 220947 221861 223766 226217 228763 231178 233064 233963 234072 234201 234894 236120
$$ packed form
56783D55724J4906K1252K5715K8240K8933K6353J8831P043o151j8080k7292l3020
56771E42454l5200l4903l3426l1133k7963k4568k1808j9486j6766j3581j0738
56760B72882q830p864p660p878p938p531o907o293n580m879m616m614m056k844
56746A85392j997k071k276j892j390j354j387j045p64r08r36n01k81p27j093p64
56730A66006m16p20j025n85J7L3N6R58K210K697K422K082J741J220R75J268J289
56713A80228M22m18o0J093J854K049K170K032J366R43J627K800L228K880K542
56698B04756K249J610J045J230J760J817J616J806J969J268R6m35l09l96p26n04
56682B18852L16Q59P07K96qj59Q4R14J905K451K546K415J886Q99J09J29O93J226
$$ plain form
56664 236120 237718 239405 240501 240555 240116 240003 239995 239288 238002 236995 236382 235574 234717 234631 235234 235404 234580 233141
56646 233141 231179 228389 225244 222699 220546 217750 214608 212805 212917 213658 214111 214839 216158 217172 217416
56631 217416 217738 218627 219244 219045 218765 218821 218271 216445 214161 212234 210197 207574 205046 203165 201155 198167
56615 198167 194635 191406 188631 186353 184954 184190 183092 181685 181354 182588 183891 184019 183675 183845 184034 183530
56599 183530 182840 182459 181676 180185 179383 180394 182098 182870 183088 184105 185861 187350 188541 189963 191187 191505
56583 191505 191445 191938 192663 192800 192719 193247 193933 193703 192739 192110 192065 192147 192414 193077 193538 193316 193374 195014 197967 201032
56563 201032 203982 207338 210924 214414 218836 225785 235382 246437 258123 269791 279550 285066 286002 284250
56549 284250 281679 278831 275652 272131 268168 263918 260158 257378 254872 251764 248418 245675 243334 240719
$$ packed form
56664B36120J598J687J096N4m39j13qp07j286j007o13q08q57q6O03J70q24j439
56646B33141j962k790l145k545k153k796l142j803J12P41M53P28J319J014K44
56631B17416L22Q89O17j99k80N6n50j826k284j927k037k623k528j881k010k988
56615A98167l532l229k775k278j399p64j098j407l31J234J303J28l44J70J89n04
56599A83530o90l81p83j491q02J011J704P72K18J017J756J489J191J422J224L18
56583A91505o0M93P25J37q1N28O86k30r64o29m5Q2K67O63M61k22N8J640K953L065
56563B01032K950L356L586L490M422O949R597J1055J1686J1668R759N516R36j752
56549B84250k571k848l179l521l963m250l760k780k506l108l346k743k341k615
$$ plain form
56535 240719 238199 236643 235811 234767 233493 232598 231785 230207 228102 226477 225346 223856 222082 221083 221085 221112
56519 221112 220615 220127 220126 220375 220533 220324 219215 217053 214923 214124 214278 213664 211502 208719 206440 204890 203900
56502 203900 203383 203052 202552 202038 201927 202091 201950 201214 199915 198058 195967 194524 194220 194396 194156 193501 192776
56485 192776 191860 190908 191001 192684 194621 195181 194706 194723 195491 195985 195896 195896 196089 195938 195705 196430 198316 200411 201984
56466 201984 203059 203660 203740 203784 204366 205240 205830 206314 207134 207883 207917 207639 207890 208509 208888 209501 211305 213889 215735
56447 215735 216208 215959 215592 215262 215333 216035 216651 216336 215505 215146 215231 215117 214946 215207 215450 215137 215185 216847 219468
56428 219468 221209 221711 222199 223209 224132 224820 225661 226166 225425 223954 223183 223093 222346 220809 219932 220484 221847
56411 221847 223778 226826 230609 233610 235209 236280 237424 238316 239116 240740 243325 246093 249062 253150 258197
$$ packed form
56535B40719k520j556q32j044j274q95q13j578k105j625j131j490j774r99KK7
56519B21112m97m88jK49J58k09j109k162k130p99J54o14k162k783k279j550r90
56502B03900n17l31n00n14j11J64j41p36j299j857k091j443l04J76k40o55p25
56485A92776r16r52R3J683J937N60m75J7P68M94q9%J93j51k33P25J886K095J573
56466B01984J075O01Q0M4N82Q74N90M84Q20P49L4k78K51O19L79O13J804K584J846
56447B15735M73k49l67l30P1P02O16l15q31l59Q5j14j71K61K43l13M8J662K621
56428B19468J741N02M88J010R23O88Q41N05p41j471p71r0p47j537q77N52J363
56411B21847J931L048L783L001J599J071J144Q92Q00J624K585K768K969M088N047
$$ plain form
56396 258197 262656 265824 268737 272256 275798 278549 280590 282324 283979 285970 288514 290796 291854 292177
56382 292177 292832 293096 290863 285578 278924 272318 265582 258389 251150 243914 236077 227727 219847 212903 206777
56367 206777 202181 200283 200742 201898 203092 204845 206660 207023 206099 206153 208491 212097 216048 221092 227693
56352 227693 234578 240553 246219 252602 259354 265364 270096 273549 276025 278506 281994 286050 289176 290983
56338 290983 292617 294928 297806 301440 306379 312074 317192 321723 326880 332641 337527 341232 345251 350282
56324 350282 355290 359899 365365 372124 378513 383109 386412 389095 390524 390266 389287 388427 387326 385919 385323
56309 385323 386092 387203 387923 389109 391585 394756 397908 401430 405687 410025 413859 417494 421193 424821 428911
56294 428911 434458 441038 446906 451578 456524 462635 468916 474458 479748 485169 490194 495020 501107 509073
$$ packed form
56396B58197M459L168K913L519L542K751K041J734J655J991K544K282J058L23
56382B92177O55K64k233n285o654o606o736p193p239p236p837q350p880o944o126
56367B06777m596j898M59J156J194J753J815L63r24N4K338L606L951N044O601
56352B27693O885N975N666O383O752O010M732L453K476K481L488M056L126J807
56338B90983J634K311K878L634M939N695N118M531N157N761M886L705M019N031
56324C50282N008M609N466O759O389M596L303K683J429k58r79q60j101j407n96
56309C85323P69J111P20J186K476L171L152L522M257M338L834L635L699L628M090
56294D28911N547O580N868M672M946O111O281N542N290N421N025M826O087P966
$$ plain form
56280 509073 517753 526181 534793 544004 553520 563717 575645 588982 602109 614869 628853 644245
56268 644245 659076 672678 687208 704411 723456 743419 765325 789996 816346 843652 873418
56257 873418 907245 944945 986443 1033423 1087356 1147891 1214919 1290153 1375010 1468963 1571715
56246 1571715 1684917 1809953 1946089 2092546 2250171 2418922 2595543 2775726 2956742
56237 2956742 3136143 3309772 3473112 3622892 3755443 3865306 3947542 4000144 4022790 4015142
56227 4015142 3978170 3915202 3829746 3723867 3600193 3463495 3318431 3167524 3012947 2858177
56217 2858177 2706096 2557530 2413472 2276665 2149150 2030385 1919575 1817554 1724462 1638064
56207 1638064 1556656 1481371 1413433 1351483 1293926 1241547 1195278 1153632 1114894 1079632 1048432
$$ packed form
56280E09073Q680Q428Q612R211R516J0197J1928J3337J3127J2760J3984J5392
56268F44245J4831J3602J4530J7203J9045J9963K1906K4671K6350K7306K9766
56257H73418L3827L7700M1498M6980N3933O0535O7028P5234Q4857R3953J02752
56246A571715J13202J25036J36136J46457J57625J68751J76621J80183J81016
56237B956742J79401J73629J63340J49780J32551J09863Q2236N2602K2646p648
56227D015142l6972o2968q5456j05879j23674j36698j45064j50907j54577j54770
56217B858177j52081j48566j44058j36807j27515j18765j10810j02021r3092q6398
56207A638064q1408p5285o7938o1950n7557n2379m6269m1646l8738l5262l1200
$$ plain form
56196 1048432 1019448 991000 964477 941743 921606 901799 882695 866120 852046 839238 827711
56185 827711 817889 808755 799294 790337 782826 775973 769229 764032 761319 759419 756731 754241 753005 751652
56171 751652 749101 747235 747896 749613 750366 751192 753875 757370 759918 762551 767136 772943 778434 784337 791633
56156 791633 798795 804534 811032 820683 831783 841372 850402 862080 876817 892803 909986 929543 950842
56143 950842 972839 997219 1026648 1061349 1100755 1146761 1201690 1264808 1334382 1411128 1495675
56132 1495675 1584503 1672309 1756586 1836181 1907890 1969169 2022460 2072274 2119583 2163131 2203894
56121 2203894 2243162 2277937 2303344 2318506 2325564 2324685 2315100 2299461 2281635 2260802 2232472 2194415
56109 2194415 2147056 2089568 2021002 1944723 1866941 1791299 1718988 1652627 1595091 1545638 1501973
$$ packed form
56196A048432k8984k8448k6523k2734k0137j9807j9104j6575j4074j2808j1527
56185H27711r822r134r461q957p511o853o744n197k713j900k688k490j236j353
56171G51652k551j866O61J717P53Q26K683L495K548K633M585N807N491N903P296
56156G91633P162N739O498R651J1100R589R030J1678J4737J5986J7183J9557K1299
56143I50842K1997K4380K9429L4701L9406M6006N4929O3118O9574P6746Q4547
56132A495675Q8828Q7806Q4277P9595P1709O1279N3291M9814M7309M3548M0763
56121B203894L9268L4775K5407J5162P058q79r585j5639j7826k0833k8330l8057
56109B194415m7359n7488o8566p6279p7782p5642p2311o6361n7536m9453m3665
$$ plain form
56098 1501973 1464951 1436552 1414801 1395929 1380157 1370138 1365029 1361571 1359666 1361301 1365190 1368238
56086 1368238 1371181 1376985 1384737 1391029 1396411 1404387 1414851 1424553 1433289 1443563 1454837 1464326 1472919
56073 1472919 1484199 1498074 1511376 1524024 1538547 1554448 1569365 1584897 1604633 1627324 1648740
56062 1648740 1669373 1693149 1719391 1743631 1765950 1790822 1818719 1845420 1869773 1894650 1920156
56051 1920156 1943412 1965258 1989623 2016073 2040573 2063725 2090441 2121291 2152133 2182464 2215901
56040 2215901 2252027 2286196 2318171 2352665 2390676 2428547 2466165 2507555 2552692 2597374 2641801
56029 2641801 2690501 2743207 2794906 2845568 2900473 2960117 3019444 3077928 3140616 3208237 3276267
56018 3276267 3344738 3418629 3497482 3575372 3652408 3735371 3825623 3917628 4010797 4111064 4219018
$$ packed form
56098A501973l7022k8399k1751j8872j5772j0019n109l458j905J635L889L048
56086A368238K943N804P752O292N382P976J0464R702Q736J0274J1274R489Q593
56073A472919J1280J3875J3302J2648J4523J5901J4917J5532J9736K2691K1416
56062A648740K0633K3776K6242K4240K2319K4872K7897K6701K4353K4877K5506
56051A920156K3256K1846K4365K6450K4500K3152K6716L0850L0842L0331L3437
56040B215901L6126L4169L1975L4494L8011L7871L7618M1390M5137M4682M4427
56029B641801M8700N2706N1699N0662N4905N9644N9327N8484O2688O7621O8030
56018C276267O8471P3891P8853P7890P7036Q2963R0252R2005R3169J00267J07954
$$ plain form
56007 4219018 4328414 4438406 4555108 4679145 4804283 4930471 5065222 5209817 5357586
55998 5357586 5508325 5670493 5846378 6029288 6218313 6421089 6638936 6864507 7097410
55989 7097410 7346487 7613588 7891760 8182737 8498520 8841967 9204405 9586431 10001335
55980 10001335 10453466 10934191 11444630 12000514 12608705 13262069 13964331 14735864 15587726
55971 15587726 16515724 17528321 18653360 19908913 21297253 22837775 24575124 26545411
55963 26545411 28770410 31298851 34217934 37613874 41567577 46210616 51745925 58405376
55955 58405376 66454899 76281996 88436995 103576271 122429682 145799822 174376988
55948 174376988 208322166 246929939 288543881 330427545 368470342 397421814 412391388
$$ packed form
56007D219018J09396J09992J16702J24037J25138J26188J34751J44595J47769
55998E357586J50739J62168J75885J82910J89025K02776K17847K25571K32903
55989G097410K49077K67101K78172K90977L15783L43447L62438L82026M14904
55980A0001335M52131M80725N10439N55884O08191O53364P02262P71533Q51862
55971A5587726R27998J012597J125039J255553J388340J540522J737349J970287
55963B6545411K224999K528441K919083L395940L953703M643039N535309O659451
55955E8405376Q049523R827097J2154999J5139276J8853411K3370140K8577166
55948A74376988L3945178L8607773M1613942M1883664L8042797K8951472J4969574
$$ plain form
55941 412391388 411015460 394564993 367036360 333139710 296809949 260834943 227043985
55934 227043985 196488229 169593907 146386310 126672410 110102242 96220135 84574338
55927 84574338 74787532 66533193 59511407 53481839 48279924 43773412 39832323 36354962
55919 36354962 33284506 30575921 28171779 26024415 24111733 22412553 20889586 19511074
55911 19511074 18266172 17144834 16123623 15184301 14326152 13547101 12830634 12162063 11539048
55902 11539048 10954737 10388195 9823623 9264271 8718010 8184845 7668170 7182207 6736623
55893 6736623 6326291 5945135 5596896 5283477 4996070 4727436 4481152 4260070 4057298
55884 4057298 3867094 3693386 3539161 3398295 3266062 3147140 3044915 2952705 2863442 2778455
$$ packed form
55941D12391388j375928j6450467k7528633l3896650l6329761l5975006l3790958
55934B27043985l0555756k6894322k3207597j9713900j6570168j3882107j1645797
55927H4574338r786806q254339p021786o029568n201915m506512l941089l477361
55919C6354962l070456k708585k404142k147364j912682j699180j522967j378512
55911A9511074j244902j121338j021211r39322q58149p79051p16467o68571o23015
55902A1539048n84311n66542n64572n59352n46261n33165n16675m85963m45584
55893F736623m10332l81156l48239l13419k87407k68634k46284k21082k02772
55884D057298j90204j73708j54225j40866j32233j18922j02225r2210q9263q4987
$$ plain form
55874 2778455 2699047 2619069 2533891 2448036 2366311 2285669 2202978 2122361 2047485 1974564 1900257
55863 1900257 1828929 1765037 1705627 1647128 1592388 1544205 1498846 1452753 1409143 1371485 1336811
55852 1336811 1301812 1269245 1241913 1216214 1187862 1158405 1130358 1101669 1070762 1041370 1016538
55841 1016538 993243 968490 945235 926656 909950 891510 873091 857295 842035 825053 808991
55830 808991 796426 784643 770798 757536 748066 740197 730731 721267 714155 706964 696496 684376 673382
55817 673382 662151 648718 635439 625129 615927 605117 594499 586925 580972 574103 567775 564393 562367
55804 562367 559132 556101 555928 557802 559973 563886 571122 579125 584580 588306 592474 595808 595971 593958 591740
55789 591740 588186 581588 573595 566455 558992 549486 539904 533070 528122 522734 517142 511888 504471 492646
$$ packed form
55874B778455p9408p9978q5178q5855q1725q0642q2691q0617p4876p2921p4307
55863A900257p1328o3892n9410n8499n4740m8183m5359m6093m3610l7658l4674
55852A336811l4999l2567k7332k5699k8352k9457k8047k8689l0907k9392k4832
55841A016538k3295k4753k3255j8579j6706j8440j8419j5796j5260j6982j6062
55830H08991j2565j1783j3845j3262r470p869r466r464p112p191j0468j2120j0994
55817F73382j1231j3433j3279j0310r202j0810j0618p574n953o869o328l382k026
55804E62367l235l031j73J874K171L913P236Q003N455L726M168L334J63k013k218
55789E91740l554o598p993p140p463r506r582o834m948n388n592n254p417j1825
$$ plain form
55775 492646 478654 465991 454493 442737 432548 426495 423161 419463 415697 413994 413741 412774 411270
55762 411270 410297 408410 403773 397974 393709 390377 385772 380266 375418 370316 363364 355966 350497 346266
55748 346266 341312 336349 332898 329279 322704 313964 306024 299369 292658 286537 282653 280057 276568 272692
55734 272692 270468 269539 268104 266573 266492 267041 266353 265159 265244 265409 262976 258379 254288 250897 246098 239818
55718 239818 234322 230446 227106 224284 223142 223378 223558 223662 224405 224810 223589 222188 223189 226397 229694
55703 229694 232854 236995 240958 242015 239971 237088 234130 229817 224060 218425 213372 208169 203455 200810
55689 200810 199751 198188 195847 194349 193996 193406 192415 192388 193507 194549 195503 197753 201418 205048 208114 211372
55673 211372 214637 216554 216763 216153 215020 213072 211064 210286 210556 210721 210710 211114 211402 210836 210501 212006 214756
$$ packed form
55775D92646j3992j2663j1498j1756j0189o053l334l698l766j703k53r67j504
55762D11270r73j887m637n799m265l332m605n506m848n102o952p398n469m231
55748C46266m954m963l451l619o575q740p940o655o711o121l884k596l489l876
55734B72692k224r29j435j531q1N49o88j194Q5J65k433m597m091l391m799o280
55718B39818n496l876l340k822j142K36J80J04P43M05j221j401J001L208L297
55703B29694L160M141L963J057k044k883k958m313n757n635n053n203m714k645
55689B00810j059j563k341j498l53n90r91k7J119J042R54K250L665L630L066L258
55673B11372L265J917K09o10j133j948k008p78K70J65j1M04K88n66l35J505K750
$$ plain form
55656 214756 216950 218619 221137 224309 226675 228234 230224 232604 234355 235770 237718 239172 238334 235835
55642 235835 233883 232447 229283 223665 217190 210887 204347 197803 192263 187474 182369 177575 174783 173642
55628 173642 172047 169540 167585 166411 164613 162170 160791 160662 159731 157088 154417 153176 152612 151435 149423
55613 149423 146696 143385 140498 139196 138926 138148 136923 136572 136800 135708 132955 130435 129296 128650 127738 127027
55597 127027 126628 125827 124775 124504 124788 124096 122104 120162 118877 117418 115645 114665 114782 115062 115388 116721
55581 116721 118809 119951 119706 119662 120834 122424 123855 125853 128699 131361 133212 134789 136251 136972 137299
55566 137299 138793 142003 145686 148689 150856 151828 150992 149049 147587 146569 144355 140687 137454 135908 135269
55551 135269 134803 135022 136012 136676 136586 136713 137558 138452 139294 140924 143083 144230 144212 144905 147275 150003 152048
$$ packed form
55656B14756K194J669K518L172K366J559J990K380J751J415J948J454q38k499
55642B35835j952j436l164n618o475o303o540o544n540m789n105m794k792j141
55628A73642j595k507j955j174j798k443j379j29r31k643k671j241n64j177k012
55613A49423k727l311k887j302k70p78j225l51K28j092k753k520j139o46r12p11
55597A27027l99q01j052k71K84o92j992j942j285j459j773r80J17K80L26J333
55581A16721K088J142k45m4J172J590J431J998K846K662J851J577J462P21L27
55566A37299J494L210L683L003K167R72q36j943j462j018k214l668l233j546o39
55551A35269m66K19R90O64r0J27Q45Q94Q42J630K159J147j8O93K370K728K045
$$ plain form
55534 152048 154393 158016 162231 166344 171001 176509 181599 185265 188235 191373 194231 196375 198533 201162
55520 201162 203329 204226 204369 204210 203079 200616 197749 195062 191590 186355 179759 172405 163980 154400 144666
55505 144666 135443 126141 116487 107709 101053 96378 93159 91484 91058 90628 89597 88944 89448 90254 90280 89809
55489 89809 89572 89423 89038 88885 89449 90403 91322 92217 92804 92508 91841 92343 94438 96802 98629 100898 104478
55472 104478 108577 112150 115333 118322 120283 120557 119679 118151 115615 112219 109293 107471 105643 103022 100740
55457 100740 99986 100046 99682 99172 99355 99791 99473 98445 97273 95802 93856 92306 92050 92629 93070 93341 93850
55440 93850 94335 94370 94212 94117 93677 92767 92222 92637 93462 94181 95260 96897 98085 98093 97696 97761 97743 96926 95970 95845
55420 95845 96262 96540 97013 98147 99210 99299 98846 98684 98460 97464 96268 96067 96927 97979 98753 99174 98896 97895
$$ packed form
55534A52048K345L623M215M113M657N508N090L666K970L138K858K144K158K629
55520B01162K167Q97J43j59j131k463k867k687l472n235o596p354q425r580r734
55505A44666r223r302r654q778o656m675l219j675m26m30j031o53N04Q06K6m71
55489H9809k37j49l85j53N64R54R19Q95N87k96o67N02K095K364J827K269L580
55472A04478M099L573L183K989J961K74q78j528k536l396k926j822j828k621k282
55457A00740p54O0l64n10J83M36l18j028j172j471j946j550k56N79M41K71N09
55440I3850M85L5j58r5m40r10n45M15Q25P19J079J637J188Ql97O5j8q17r56j25
55420I5845M17K78M73J134J063Q9m53j62k24r96j196k01Q60J052P74M21k78j001
$$ plain form
55402 97895 97039 96952 97039 96646 96278 96475 96542 95782 95049 95531 96788 97548 97698 97914 98001 97283 96186 95798 96175 96526
55382 96526 96735 97258 97840 97778 97269 97168 97548 97664 97147 96148 94640 92700 91180 90911 91484 91795 91488 90885
55364 90885 89986 88723 87842 88326 90069 92056 93574 94399 94292 93370 92613 92958 94149 95331 96309 97309 98057
55347 98057 98130 97788 97465 96907 95799 94736 94570 95216 96063 97045 98349 99604 100338 100676 100696 99819 97841 95785
55329 95785 94649 94095 93556 93676 95193 97119 97715 96767 95449 94471 93817 93782 94641 95601 95659 95150 94994 94832
55311 94832 93579 91493 89991 89554 89467 89518 90238 91498 92590 93779 96015 98924 100773 100840 100264 100113 100163
55294 100163 100080 100308 100993 101275 100554 99502 99092 99317 99476 99135 98371 97584 97335 97805 98299 97886 96612 95458
55276 95458 95084 95349 96035 97139 98361 99114 99261 99189 99065 98710 98236 98121 98572 99387 100384 101353 101759 101250 100355
$$ packed form
55402I7895q56q7Q7l93l68J97O7p60p33M82J257P60J50K16Q7p18j097l88L77L51
55382I6526K09N23N82o2n09j01L80J16n17r99j508j940j520k69N73L11l07o03
55364I0885q99j263q81M84J743J987J518Q25j07r22p57L45J191J182R78J000P48
55347I8057P3l42l23n58j108j063j66O46Q47R82J304J255P34L38K0q77j978k056
55329I5785j136n54n39J20J517J926N96r48j318r78o54l5Q59R60N8n09j56j62
55311I4832j253k086j502m37q7N1P20J260J092J189K236K909J849O7n76j51N0
55294A00163q3K28O85K82p21j052m10K25J59l41p64p87k49M70M94m13j274j154
55276I5458l74K65O86J104J222P53J47p2j24l55m74j15M51Q15R97R69M06n09q95
$$ plain form
55257 100355 99923 99968 99824 99274 98748 98548 98681 99333 100626 102025 102848 103269 103974 104918 105339 104991 104455 104218
55239 104218 104204 104213 104128 103791 103292 103195 103769 104384 104475 104597 105447 106276 105602 103370 101123 100048 100065 100823 102246 103800
55219 103800 104474 103980 103141 102808 103105 103836 104736 105210 104748 103763 103186 103143 102865 102015 101131 100613 100215 99829 99936
55200 99936 100895 102333 103522 103919 103361 102231 101325 101012 100840 100454 100400 101082 101552 100566 98595 97409 97783 98900
55182 98900 100018 101298 102753 103735 103961 104010 104386 104881 105134 104974 104169 102718 101463 101407 102364 103297 103966 105013
55164 105013 106309 106655 105583 104214 103771 104236 105000 105851 106750 107468 108008 108654 109234 109118 108244 107381 107058 107029
55146 107029 107050 107270 107518 107129 105934 104636 103840 103400 102992 102550 101866 100657 99315 98792 99395 100499 101618
55129 101618 102852 104085 104791 105005 105456 106322 106854 106679 106478 106870 107576 108221 109007 110027 110780 110982 111042 111229
$$ packed form
55257A00355m32M5j44n50n26k00J33O52J293J399Q23M21P05R44M21l48n36k37
55239A04218j4Rq5l37m99r7N74O15R1J22Q50Q29o74k232k247j075J7P58J423J554
55219A03800O74m94q39l33K97P31R00M74m62r85n77m3k78q50q84n18l98l86J07
55200I9936R59J438J189L97n58j130r06l13j72l86n4O82M70r86j971j186L74J117
55182I8900J118J280J455R82K26M9L76M95K53j60q05j451j255n6R57R33O69J047
55164A05013J296L46j072j369m43M65P64Q51Q99P18N40O46N80j16q74q63l23k9
55146A07029K1K20K48l89j195j298p96m40m08m42o84j209j342n23O03J104J119
55129A01618J234J233P06K14M51Q66N32j75k01L92P06O45P86J020P53K02O0J87
$$ plain form
55111 111229 111218 110970 111072 111602 111631 110648 109565 109482 110205 110868 111277 111761 112354 113092 114549 117020 119531 120650
55093 120650 120178 119236 118774 118774 118857 118990 119368 119975 120523 120735 120655 120601 120690 120656 120447 120658 121769 123213 124023 124268
55073 124268 124853 125830 126108 125181 124012 123546 123276 122147 120220 118569 117929 118116 118537 118677 118298 117628 117231
55056 117231 117482 118269 119197 119745 119296 117680 115740 114746 115040 115779 116071 115757 115093 114473 114550 115797 117772 119599
55038 119599 121226 123263 125476 126619 126106 124761 123454 122057 120359 118907 118202 117891 117468 117011 116620 115985
55022 115985 115186 115026 115760 116337 115769 114539 113750 113548 113314 112878 112589 112562 112668 112969 113449 113734 113752 114191 115561
55003 115561 117162 117825 117388 116774 116760 117311 117951 118340 118595 119280 120755 122387 123026 122497 121887 121890 121749 120561
54985 120561 118859 117957 118209 118798 118958 118626 118124 117915 118494 119948 121746 123360 124752 125952 126674 126850 127032
$$ packed form
55111A11229j1k48J02N30K9r83j083q3P23O63M09M84N93P38J457K471K511J119
55093A20650m72r42m62%Q3J33L78O07N48K12q0n4Q9l4k09K11J111J444Q10K45
55073A24268N85R77K78r27j169m66k70j129j927j651o40J87M21J40l79o70l97
55056A17231K51P87R28N48m49j616j940r94K94P39K92l14o64o20P7J247J975J827
55038A19599J627K037K213J143n13j345j307j397j698j452p05l11m23m57l91o35
55022A15985p99j60P34N77n68j230p89k02k34m36k89k7J06L01M80K85J8M39J370
55003A15561J601O63m37o14j4N51O40L89K55O85J475J632O39n29o10Lj41j188
54985A20561j702r02K52N89J60l32n02k09N79J454J798J614J392J200P22J76J82
$$ plain form
54968 127032 127706 128676 129600 130582 131618 132131 131821 131464 132012 133279 134344 134914 135460 136165 136641 136632 136333 135991
54950 135991 135685 135467 135316 135044 134533 133888 133177 132364 131678 131512 131680 131388 130322 129111 128291 127614 126951 126984
54932 126984 128123 129442 129772 129351 129443 130685 132788 135446 138395 140785 141723 141587 141935 143962 147716 152797
54916 152797 158965 165882 172939 179621 185605 190457 193675 195116 195016 193583 190856 186908 181864 175896
54902 175896 169508 163568 158638 154432 150391 146559 143482 141448 140313 139860 139856 139865 139495 138754 137866 136884 135830
54885 135830 134994 134764 135288 136590 138741 141609 144652 147296 149419 151364 153763 157318 162192 167508 172042
54870 172042 175685 179490 183993 188250 190928 191578 190260 186869 181641 175766 170584 166483 163081 159974
54856 159974 156737 152920 148771 145375 143282 141579 139126 136089 133445 131588 130396 130008 130388 130608 129753
$$ packed form
54968A27032O74R70R24R82J036N13l10l57N48J267J065N70N46P05M76rk99l42
54950A35991l06k18j51k72n11o45p11q13o86j66J68k92j066j211q20o77o63L3
54932A26984J139J319L30m21R2J242K103K658K949K390R38j36L48K027L754N081
54916A52797O168O917P057O682N984M852L218J441j00j433k727l948n044n968
54902A75896o388n940m930m206m041l832l077k034j135m53mRl70p41q88r82j054
54885A35830q36k30N24J302K151K868L043K644K123J945K399L555M874N316M534
54870A72042L643L805M503M257K678O50j318l391n228n875n182m101l402l107
54856A59974l237l817m149l396k093j703k453l037k644j857j192l88L80K20q55
$$ plain form
54841 129753 128364 127889 128855 130490 131907 132702 132602 131566 130192 129182 128543 128061 128094 128882 129469 128627 126734
54824 126734 125465 125566 126163 126342 126198 125989 125446 124509 123837 124037 124901 125777 126142 125653 124343 123036 122881 124085
54806 124085 125571 126231 126116 126181 127200 129078 130919 131722 131324 130591 130413 130672 130641 130094 129401 128721 127828 126742
54788 126742 125877 125549 125835 126857 128560 130269 131151 131206 131269 131961 133170 134473 135567 136228 136459 136701 137440
54771 137440 138596 139686 140588 141752 143738 146876 151169 156129 160975 165482 170379 176422 183356 190236
54757 190236 196354 201287 204507 205747 205429 204022 201331 197124 192010 186795 181378 175272 168896 163320
54743 163320 158949 155469 152939 151810 151935 152552 153307 154325 155350 155718 155249 154314 153170 152069 151741 152643
54727 152643 153949 154432 154283 154879 156854 159703 163205 167727 172893 177500 181198 184911 189086 192795 195136
$$ packed form
54841A29753j389m75R66J635J417P95j00j036j374j010o39m82L3P88N87q42j893
54824A26734j269J01N97J79j44k09n43r37o72K00Q64Q76L65m89j310j307j55J204
54806A24085J486O60j15O5J019J878J841Q03l98p33j78K59l1n47o93o80q93j086
54788A26742q65l28K86J022J703J709Q82N5O3O92J209J303J094O61K31K42P39
54771A37440J156J090R02J164J986L138M293M960M846M507M897O043O934O880
54757A90236O118M933L220J240l18j407k691m207n114n215n417o106o376n576
54743A63320m371l480k530j129J25O17P55J018J025L68m69r35j144j101l28R02
54727A52643J306M83j49N96J975K849L502M522N166M607L698L713M175L709K341
$$ plain form
54712 195136 196260 196347 194814 191453 187353 183783 180852 178012 175128 172307 169300 165871 162328 159098 156187
54697 156187 153475 151056 148964 147079 145587 144865 144654 144091 142927 141997 142022 142642 143051 142976 142641 142396 142629
54680 142629 143324 143519 142108 139462 137262 136334 135771 134783 134123 134685 135699 135627 134262 132774 132005 131784 131720
54663 131720 131753 131838 131763 131353 130535 129366 128252 127792 128060 128438 128486 128548 129147 130270 131646 133224 134868 136026
54645 136026 136262 135767 135017 134289 133859 134099 134900 135494 135362 134844 134454 134122 133672 133500 134114 135366 136680 137709
54627 137709 138292 138206 137549 136993 137048 137395 137459 137271 137189 137116 136690 136019 135606 135673 136050 136590 137232 137775 138039 138147 138321
54606 138321 138538 138685 138892 139397 140247 141312 142362 142983 142736 141651 140292 139167 138413 138088 138231 138487 138281
54589 138281 137691 137534 138251 139331 140188 140949 141875 142662 142938 142930 142962 142758 141982 141106 141027 141974 143339 144423 144911
$$ packed form
54712A95136J124Q7j533l361m100l570k931k840k884k821l007l429l543l230k911
54697A56187k712k419k092j885j492p22k11n63j164r30K5O20M09p5l35k45K33
54680A42629O95J95j411k646k200r28n63r88o60N62J014p2j365j488p69k21o4
54663A31720L3Q5p5m10q18j169j114m60K68L78M8O2N99J123J376J578J644J158
54645A36026K36m95p50p28m30K40Q01N94j32n18l90l32m50j72O14J252J314J029
54627A37709N83q6o57n56N5L47O4j88q2p3m26o71m13O7L77N40O42N43K64J08J74
54606A38321K17J47K07N05Q50J065J050O21k47j085j359j125p54l25J43K56k06
54589A38281n90j57P17J080Q57P61R26P87K76qL2k04p76q76p9R47J365J084M88
$$ plain form
54570 144911 144875 144767 145157 146022 146552 146021 144584 142937 141654 141206 142031 143937 145803 146555 146210 145487 144723
54553 144723 143769 142666 141817 141533 141824 142478 143055 143131 142840 142867 143578 144612 145664 147042 148936 150716 151704
54536 151704 152246 153303 155199 157416 159364 160717 161279 161165 160976 161127 161211 160612 159539 158768 158465 157964 156764
54519 156764 155184 153855 153008 152426 151903 151640 152127 153397 154430 153844 151507 148922 147652 147729 148053 147858 147230
54502 147230 146540 146017 145750 145661 145561 145490 145680 145963 145732 144864 144100 144019 144244 144271 144496 145574 147180 148296 148525
54483 148525 148348 148215 148104 147908 147645 147330 147081 147200 147771 148455 149092 150102 151762 153550 154849 155886 157211
54466 157211 158630 159465 159613 159520 159307 158761 158081 157876 158384 159352 160585 161950 162979 163142 162505 161563 160577 159668
54448 159668 159302 159865 160855 161268 160782 159857 158739 157098 154806 152388 150561 149706 149813 150496 151112 151262 151089
$$ packed form
54570A44911l6j08L90Q65N30n31j437j647j283m48Q25J906J866P52l45p23p64
54553A44723r54j103q49k84K91O54N77P6k91K7P11J034J052J378J894J780R88
54536A51704N42J057J896K217J948J353N62j14j89J51Q4n99j073p71l03n01j200
54519A56764j580j329q47n82n23k63M87J270J033n86k337k585j270P7L24j95o28
54502A47230o90n23k67q9j00p1J90K83k31q68p64q1K25K7K25J078J606J116K29
54483A48525j77j33j11j96k63l15k49J19N71O84O37J010J660J788J299J037J325
54466A57211J419Q35J48r3k13n46o80k05N08R68J233J365J029J63o37r42r86r09
54448A59668l66N63R90M13m86r25j118j641k292k418j827q55J07O83O16J50j73
$$ plain form
54431 151089 150773 150107 149039 148214 148324 149254 150481 151852 153224 153874 153325 152467 152751 154389 156336 157895
54415 157895 159245 160497 161462 162442 164047 165934 166861 166378 165520 165434 166143 167067 167844 168249 168071 167592 167556 168208
54397 168208 168961 169327 169541 169994 170659 171468 172542 173708 174374 174293 173916 173661 173430 173122 173083 173621 174639 176000
54379 176000 177663 179185 179759 179232 178472 178271 178434 178371 178045 177768 177557 177323 177339 177903 178767 179385 179599 179721 180064
54360 180064 180678 181347 181685 181475 181102 181320 182397 183845 185159 186439 188034 189928 191773 193266 194282 194978
54344 194978 195947 197950 201227 205329 209695 214067 218224 221847 224831 227338 229274 230129 229574 227842 225270
54329 225270 221890 217713 213010 208038 202852 197641 192893 188930 185655 182963 181006 179751 178726 177534
54315 177534 176312 175365 174685 174118 173696 173510 173562 173968 174929 176187 176908 176472 175123 173541 172092 170823 169847
$$ packed form
54431A51089l16o66j068q25J10R30J227J371J372O50n49q58K84J638J947J559
54415A57895J350J252R65R80J605J887R27m83q58q6P09R24P77M05j78m79l6O52
54397A68208P53L66K14M53O65Q09J074J166O66q1l77k55k31l08l9N38J018J361
54379A76000J663J522N74n27p60k01J63o3l26k77k11k34J6N64Q64O18K14J22L43
54360A80064O14O69L38k10l73K18J077J448J314J280J595J894J845J493J016O96
54344A94978R69K003L277M102M366M372M157L623K984K507J936Q55n55j732k572
54329B25270l380m177m703m972n186n211m748l963l275k692j957j255j025j192
54315A77534j222r47o80n67m22j86N2M06R61J258P21m36j349j582j449j269r76
$$ plain form
54298 169847 169326 169232 169414 169766 170151 170483 171003 172136 173793 175215 175785 175650 175233 174602 173690 172800 172359 172402
54280 172402 172661 172974 173273 173420 173470 173784 174481 174987 174648 173681 173012 173198 173912 174508 174688 174553 174314 174108 173932
54261 173932 173676 173268 172837 172648 172926 173738 174963 176310 177487 178332 178718 178457 177607 176769 176606 176993 177114 176595
54243 176595 176068 176307 177235 178228 179030 179807 180442 180406 179455 178015 176660 175446 174049 172501 171498 171703 172784
54226 172784 173471 172804 171161 169795 169485 169983 170625 171016 171109 171098 171396 172325 173598 174444 174398 173766 173219 173250 174013
54207 174013 175224 176064 175693 174201 172681 172094 172294 172486 172344 172384 173393 175702 178816 181563 182839 182462
54191 182462 181180 179788 178472 177109 175839 175033 174928 175448 176267 176953 177262 177334 177350 177047 176033 174673 174099
54174 174099 175057 177089 179085 180206 180052 178484 175853 173117 171221 170431 170540 171381 172706 173815 173920 172968
$$ packed form
54298A69847n21r4J82L52L85L32N20J133J657J422N70j35m17o31r12q90m41M3
54280A72402K59L13K99J47N0L14O97N06l39r67o69J86P14N96J80j35k39k06j76
54261A73932k56m08m31j89K78Q12J225J347J177Q45L86k61q50q38j63L87J21n19
54243A76595n27K39R28R93Q02P77O35l6r51j440j355j214j397j548j003K05J081
54226A72784O87o67j643j366l10M98O42L91R3j1K98R29J273Q46m6o32n47L1P63
54207A74013J211Q40l71j492j520n87K00J92j42M0J009K309L114K747J276l77
54191A82462j282j392j316j363j270q06j05N20Q19O86L09P2J6l03j014j360n74
54174A74099R58K032J996J121j54j568k631k736j896p90J09Q41J325J109J05r52
$$ plain form
54158 172968 171748 171089 171188 171701 172257 172717 173013 172932 172258 171209 170480 170564 171121 171346 170937 170327 170074 170411 171374
54139 171374 172861 174436 175515 175903 175856 175652 175562 176091 177536 179208 179883 179306 178520 178415 178716 178798 178659 178446
54121 178446 177776 176417 175128 174860 175439 175859 175668 175247 174887 174545 174515 175439 177300 179127 180085 180415 180902 181839
54103 181839 182915 183855 184653 185235 185380 185207 185378 186375 187599 187735 186312 184461 183673 184092 184678 184854 185142
54086 185142 186044 187151 187788 187955 188123 188538 189146 189877 190610 191182 191735 192696 194128 195513 196431 197002 197374 197360
54068 197360 197051 197198 198381 200230 202069 203875 205969 208149 209919 211391 213225 215767 218885 222561 227035
54053 227035 232403 238620 245874 254464 264332 275033 285887 295654 302419 304654 302526 297731 292069 286654
54039 286654 282170 279005 276949 275467 274538 274761 276555 279741 283992 289134 294794 300324 305370 310136 314803
$$ packed form
54158A72968j220o59R9N13N56M60K96q1o74j049p29Q4N57K25m09o10k53L37R63
54139A71374J487J575J079L88m7k04r0N29J445J672O75n77p86j05L01Q2j39k13
54121A78446o70j359j289k68N79M20j91m21l60l42l0R24J861J827R58L30M87R37
54103A81839J076R40P98N82J45j73J71R97J224J36j423j851p88M19N86J76K88
54086A85142R02J107O37J67J68M15O08P31P33N72N53R61J432J385R18N71L72j4
54068A97360l09J47J183J849J839J806K094K180J770J472J834K542L118L676M474
54053B27035N368O217P254Q590R868J0701J0854R767O765K235k128m795n662n415
54039B86654m484l165k056j482r29K23J794L186M251N142N660N530N046M766M667
$$ plain form
54024 314803 319077 322580 325378 327827 330065 331895 333012 333223 332674 331996 331996 332899 333934 333839 331817 328014
54008 328014 323220 318187 313191 308065 302574 296734 290903 285628 281304 277822 274605 271227 267922 265175
53994 265175 262936 260674 258189 255806 253659 251455 249194 247505 246758 246370 245511 244094 242538 240980 239311
53979 239311 237643 236084 234366 232353 230656 229996 230120 230091 229535 228877 228415 228020 227811 228244 229184 229617 228727
53962 228727 226859 225133 224500 225381 227729 231030 234482 237531 240172 242710 245501 248964 253461 258909 264812
53947 264812 270864 277297 284377 291675 298057 302407 304392 304680 304458 304621 305323 306202 306846 307011 306740 306579
53931 306579 307463 309989 313839 318113 322093 325562 328699 332030 336202 341290 346514 351133 355490 360572
53917 360572 366618 372774 378243 383224 388547 394818 402146 410333 419077 428128 437351 446480 454996 462533
$$ packed form
54024C14803M274L503K798K449K238J830J117K11n49o78%R03J035r5k022l803
54008C28014m794n033m996n126n491n840n831n275m324l482l217l378l305k747
53994B65175k239k262k485k383k147k204k261j689p47l88q59j417j556j558j669
53979B39311j668j559j718k013j697o60J24k9n56o58m62l95k09M33R40M33q90
53962B28727j868j726o33Q81K348L301L452L049K641K538K791L463M497N448N903
53947B64812O052O433P080P298O382M350J985K88k22J63P02Q79O44J65k71j61
53931C06579Q84K526L850M274L980L469L137L331M172N088N224M619M357N082
53917C60572O046O156N469M981N323O271P328Q187Q744R051R223R129Q516P537
$$ plain form
53903 462533 469357 476048 482831 489655 496883 505288 515303 526755 539355 552668 565182 573998 576205
53890 576205 570706 558529 541657 521820 500225 477878 455831 435084 416332 399869 385734 373864
53878 373864 364055 355957 349271 343772 339015 334289 329158 323871 318880 314105 309073 303739 298699 294527
53864 294527 291246 288463 285655 282291 278116 273547 269501 266562 264421 262301 259868 257600 256221 255782
53850 255782 255432 254296 252521 251072 250403 249875 248849 247823 247806 248764 249395 248566 246445 244040 242010 240184
53834 240184 238065 235609 233467 232428 232642 233628 235053 237060 239596 241911 243175 243314 242794 241926 240896
53819 240896 240182 240282 241140 242330 243671 245189 246669 247820 248723 249586 250307 250861 251862 253954 256789 259462
53803 259462 261927 265207 270069 276221 282876 289394 295197 299873 303730 307706 312394 317579 322861 328206
$$ packed form
53903D62533O824O691O783O824P228Q405J0015J1452J2600J3313J2514Q816K207
53890E76205n499j2177j6872j9837k1595k2347k2047k0747j8752j6463j4135j1870
53878C73864r809q098o686n499m757m726n131n287m991m775n032n334n040m172
53864B94527l281k783k808l364m175m569m046k939k141k120k433k268j379m39
53850B55782l50j136j775j449o69n28j026j026j7R58O31q29k121k405k030j826
53834B40184k119k456k142j039K14R86J425K007K536K315J264J39n20q68j030
53819B40896p14J00Q58J190J341J518J480J151R03Q63P21N54J001K092K835K673
53803B59462K465L280M862O152O655O518N803M676L857L976M688N185N282N345
$$ plain form
53789 328206 333686 339101 344060 348117 350830 352138 352626 352936 352993 352422 351523 350969 350502 348910 345519 340896
53773 340896 335724 329903 323265 316454 310387 305312 300866 296663 292406 287832 282967 278152 273546 269042
53759 269042 264850 261653 259781 258681 257524 255954 254044 251999 250219 249082 248314 247055 244937 242594
53745 242594 240745 239316 237920 236721 236230 236535 237212 237754 237718 236756 234956 233001 231698 231479 232437 234419
53729 234419 236847 238928 240399 241718 243203 244439 244887 244709 244606 245086 246244 247910 249712 251255 252546
53714 252546 253997 255853 257901 259864 261662 263158 264202 265125 266622 268834 271085 272803 274218 275856
53700 275856 277939 280578 283871 287381 290179 291922 293330 295183 297490 300121 303420 307465 311409 314343
53686 314343 316289 317618 318103 317440 316097 314687 312980 310568 308082 306611 306205 306105 306259 307239 308652 309029
$$ packed form
53789C28206N480N415M959M057K713J308M88L10N7n71q99n54m67j592l391m623
53773C40896n172n821o638o811o067n075m446m203m257m574m865m815m606m504
53759B69042m192l197j872j100j157j570j910k045j780j137p68j259k118k343
53745B42594j849j429j396j199m91L05O77N42l6r62j800j955j303k19R58J982
53729B34419K428K081J471J319J485J236M48j78j03M80J158J666J802J543J291
53714B52546J451J856K048J963J798J496J044R23J497K212K251J718J415J638
53700B75856K083K639L293L510K798J743J408J853K307K631L299M045L944K934
53686C14343J946J329M85o63j343j410j707k412k486j471m06j00J54R80J413L77
$$ plain form
53670 309029 307763 306015 305160 305258 305637 306056 306479 306347 305038 302853 300809 299456 298423 297182 295778 294670
53654 294670 294122 294030 294234 294783 295767 297004 298083 298704 298843 298568 297968 297305 296967 297117 297574 298142 298756 299252
53636 299252 299390 299359 299843 301254 303218 305157 307000 308955 310933 312730 314503 316589 318997 321581 324513
53621 324513 328045 331854 335121 337338 338747 340054 341985 344946 348748 352722 356410 360021 363898 367811
53607 367811 371243 374227 377388 381167 385389 389618 393589 397280 400805 404224 407324 409773 411680 413733
53593 413733 416377 419105 420955 421595 421572 421612 422055 422849 423748 424573 425555 427267 429921 432834 434857 435225 433815
53576 433815 430942 427188 423116 418766 413710 407895 402066 396915 392262 387650 383365 380201 378439 377648
53562 377648 377366 377373 377438 377395 377365 377445 377388 377155 377531 379416 382543 385529 387237 387634 387486 387836 389602 392942 396898
$$ packed form
53670C09029j266j748q55R8L79M19M23j32j309k185k044j353j033j241j404j108
53654B94670n48r2K04N49R84J237J079O21J39k75o00o63l38J50M57N68O14M96
53636B99252J38l1M84J411J964J939J843J955J978J797J773K086K408K584K932
53621C24513L532L809L267K217J409J307J931K961L802L974L688L611L877L913
53607C67811L432K984L161L779M222M229L971L691L525L419L100K449J907K053
53593D13733K644K728J850O40k3M0M43P94Q99Q25R82J712K654K913K023L68j410
53576D33815k873l754m072m350n056n815n829n151m653m612m285l164j762p91
53562C77648k82PO5m3l0Q0n7k33L76J885L127K986J708L97j48L50J766L340L956
$$ plain form
53543 396898 400247 402733 404990 407424 409871 412326 415254 418999 423436 428355 433671 439267 445107 451519
53529 451519 458875 467026 475586 484654 494581 505140 515697 526272 537671 550399 564104 578245
53517 578245 592690 607528 622894 639107 656376 674325 692469 711185 731442 753474 776554
53506 776554 800180 824537 849479 874072 897740 921042 944762 968866 992887 1016614 1039768
53495 1039768 1061653 1081889 1101075 1120095 1139197 1158261 1177419 1196681 1215427 1233154 1250455
53484 1250455 1268391 1286985 1305087 1321843 1337664 1353601 1370214 1387161 1403579 1418746 1432538
53473 1432538 1445195 1456592 1465999 1472843 1477387 1480215 1481225 1479708 1475342 1468580 1459956 1449444 1436826
53460 1436826 1422446 1407331 1392518 1378292 1364048 1348895 1332458 1315083 1297336 1279405 1261028
$$ packed form
53543C96898L349K486K257K434K447K455K928L745M437M919N316N596N840O412
53529D51519P356Q151Q560R068R927J0559J0557J0575J1399J2728J3705J4141
53517E78245J4445J4838J5366J6213J7269J7949J8144J8716K0257K2032K3080
53506G76554K3626K4357K4942K4593K3668K3302K3720K4104K4021K3727K3154
53495A039768K1885K0236J9186J9020J9102J9064J9158J9262J8746J7727J7301
53484A250455J7936J8594J8102J6756J5821J5937J6613J6947J6418J5167J3792
53473A432538J2657J1397R407O844M544K828J010j517m366o762q624j0512j2618
53460A436826j4380j5115j4813j4226j4244j5153j6437j7375j7747j7931j8377
$$ plain form
53449 1261028 1241826 1221678 1200925 1180210 1159942 1139907 1119672 1099464 1080388 1063627 1049621
53438 1049621 1038066 1028438 1020345 1013652 1008446 1004784 1002375 1000730 999741 999838 1001405 1004265 1007908 1012007
53424 1012007 1016611 1022033 1028770 1037265 1047537 1059188 1071928 1085913 1101455 1118616 1137286 1157399
53412 1157399 1178879 1201520 1225224 1250196 1276726 1304825 1334289 1365056 1397366 1431588 1467887
53401 1467887 1505995 1545315 1585462 1626751 1669933 1715419 1763009 1812400 1863612 1916682 1971172
53390 1971172 2026241 2081200 2135909 2190738 2246109 2301864 2356991 2410181 2460768 2508958 2555118
53379 2555118 2599099 2640320 2678245 2712592 2743284 2770326 2793593 2812718 2827333 2837383 2842936
53368 2842936 2843678 2839000 2828608 2812634 2790977 2762968 2728069 2686718 2640288 2590401 2538412 2485243
$$ packed form
53449A261028j9202k0148k0753k0715k0268k0035k0235k0208j9076j6761j4006
53438A049621j1555r628q093o693n206l662k409j645r89R7J567K860L643M099
53424A012007M604N422O737Q495J0272J1651J2740J3985J5542J7161J8670K0113
53412A157399K1480K2641K3704K4972K6530K8099K9464L0767L2310L4222L6299
53401A467887L8108L9320M0147M1289M3182M5486M7590M9391N1212N3070N4490
53390A971172N5069N4959N4709N4829N5371N5755N5127N3190N0587M8190M6160
53379B555118M3981M1221L7925L4347L0692K7042K3267J9125J4615J0050N553
53368B842936P42m678j0392j5974k1657k8009l4899m1351m6430m9887n1989n3169
$$ plain form
53356 2485243 2431301 2376588 2321117 2265255 2209696 2155266 2102751 2052589 2004540 1957863 1912012
53345 1912012 1867093 1823513 1781364 1740283 1699844 1660023 1621286 1584295 1549459 1516850 1486476
53334 1486476 1458400 1432501 1408488 1386488 1367240 1351218 1337812 1325893 1314915 1304751 1294676
53323 1294676 1283508 1270945 1257907 1245278 1233049 1221032 1209635 1199361 1190137 1181712 1174221 1167808
53311 1167808 1162141 1156949 1152749 1150343 1149697 1149909 1150299 1151117 1153143 1156937 1162536 1169699 1178337 1188689 1201019
53296 1201019 1215252 1231124 1248620 1267944 1289103 1311944 1336562 1363119 1391128 1419477 1447371
53285 1447371 1474712 1501372 1526670 1549925 1570981 1589912 1606759 1621836 1635589 1647635 1656588
53274 1656588 1661498 1662954 1662052 1658751 1652093 1641821 1628911 1614450 1598590 1580725 1560337 1537613
$$ packed form
53356B485243n3942n4713n5471n5862n5559n4430n2515n0162m8049m6677m5851
53345A912012m4919m3580m2149m1081m0439l9821l8737l6991l4836l2609l0374
53334A486476k8076k5899k4013k2000j9248j6022j3406j1919j0978j0164j0075
53323A294676j1168j2563j3038j2629j2229j2017j1397j0274r224q425p491o413
53311A167808n667n192m200k406o46K12L90Q18K026L794N599P163Q638J0352J2330
53296A201019J4233J5872J7496J9324K1159K2841K4618K6557K8009K8349K7894
53285A447371K7341K6660K5298K3255K1056J8931J6847J5077J3753J2046Q953
53274A656588M910J456r02l301o658j0272j2910j4461j5860j7865k0388k2724
$$ plain form
53262 1537613 1513374 1488307 1462227 1434483 1405208 1375528 1346134 1316399 1285603 1254409 1224175
53251 1224175 1195146 1166361 1137294 1108638 1081322 1055454 1030489 1005875 981305 956750 932428
53240 932428 908556 885185 862534 841239 821715 803485 785669 768167 751834 737512 725322
53229 725322 714850 705456 696413 687244 678069 669259 660842 652564 644380 636295 627823 618246 607454 595975
53215 595975 584082 571443 557793 543445 529031 515202 502672 491945 482755 474234 465893 458061
53203 458061 451164 445003 438980 432657 425866 418603 411106 403777 396761 389776 382509 375061 367854 361246
53189 361246 355234 349398 343286 337110 331894 328478 326473 324692 322503 320148 317783 315101 312177 309812
53175 309812 308443 307379 305812 304115 303254 303163 302672 301165 299518 298944 299389 299632 298774 297097 295404 293890
$$ packed form
53262A537613k4239k5067k6080k7744k9275k9680k9394k9735l0796l1194l0234
53251A224175k9029k8785k9067k8656k7316k5868k4965k4614k4570k4555k4322
53240I32428k3872k3371k2651k1295j9524j8230j7816j7502j6333j4322j2190
53229G25322j0472r394r043r169r175q810q417q278q184q085q472r577j0792j1479
53215E95975j1893j2639j3650j4348j4414j3829j2530j0727r190q521q341p832
53203D58061o897o161o023o323o791p263p497p329p016o985p267p448p207o608
53189C61246o012n836o112o176n216l416k005j781k189k355k365k682k924k365
53175C09812j369j064j567j697q61r1m91j507j647n74M45K43q58j677j693j514
$$ plain form
53159 293890 292027 289432 286503 284064 282552 281731 281081 280271 279286 278322 277627 277302 277171 276885 276185 275059 273748
53142 273748 272651 272092 272111 272550 273382 274682 276163 277088 277012 276414 276129 276286 276314 275975 275844 276504 277704 278652
53124 278652 278930 278808 278735 278830 278937 279031 279404 280386 281956 283773 285590 287385 288996 289942 289962 289534 289461 289934 290377
53105 290377 290230 289558 288801 288215 287697 286963 285807 284298 282768 281470 280310 279099 277993 277350 277118 276710
53089 276710 275694 274327 273224 272563 271887 270684 269071 267821 267649 268503 269601 270205 270209 269977 269813 269801 269982
53072 269982 270432 271156 272019 272702 272748 271919 270643 269817 269888 270421 270824 271182 271945 273099 274208 275143 276165 277268
53054 277268 278037 278242 278067 277610 276606 274903 272866 271016 269575 268508 267751 267156 266450 265520 264612 264061 263897
53037 263897 263882 263844 263843 264029 264438 264975 265552 266124 266482 266110 264632 262500 260940 260876 262065 263489 264370 264560 264250
$$ packed form
53159B93890j863k595k929k439j512q21o50q10r85r64o95l25j31k86p00j126j311
53142B73748j097n59J9M39Q32J300J481R25p6n98k85J57K8l39j31O60J200R48
53124B78652K78j22p3R5J07R4L73R82J570J817J817J795J611R46K0m28p3M73M43
53105B90377j47o72p57n86n18p34j156j509j530j298j160j211j106o43k32m08
53089B76710j016j367j103o61o76j203j613j250j72Q54J098O04Mk32j64j2J81
53072B69982M50P24Q63O83M6q29j276q26P1N33M03L58P63J154J109R35J022J103
53054B77268P69K05j75m57j004j703k037j850j441j067p57n95p06r30r08n51j64
53037B63897j5l8jJ86M09N37N77N72L58l72j478k132j560o4J189J424Q81J90l10
$$ plain form
53018 264250 263773 263578 263917 264580 265233 265900 266801 267861 268871 269949 271329 272672 273201 272635 271591 270897 270874
53001 270874 271364 272026 272478 272556 272578 273010 273744 274005 273212 271651 270193 269566 269957 271021 272152 272954 273549 274294
52983 274294 275316 276553 278090 280042 282149 283973 285486 287022 288643 290046 291164 292311 293593 294682
52969 294682 295339 295707 295909 295845 295669 295944 296961 298269 299251 299856 300427 301081 301653 302140 302794 303759 304720 304965
52951 304965 303906 301677 299094 296793 294580 292037 289559 288152 288109 288498 288131 286611 284317 281903 280000
52936 280000 278897 278197 277217 275845 274530 273354 271783 269637 267578 266176 265106 263844 262609 262002 262122
52921 262122 262640 263407 264300 264774 264295 263147 262213 261984 262275 262847 263752 264956 266123 266989 267679 268504 269531
52904 269531 270433 270770 270494 270140 270294 270869 271215 270999 270516 270000 269183 267931 266799 266429 266763 267344 268108 269264
$$ packed form
53018B64250m77j95L39O63O53O67R01J060J010J078J380J343N29n66j044o94k3
53001B70874M90O62M52P8K2M32P34K61p93j561j458o27L91J064J131Q02N95P45
52983B74294J022J237J537J952K107J824J513J536J621J403J118J147J282J089
52969B94682O57L68K02o4j76K75J017J308R82O05N71O54N72M87O54R65R61K45
52951C04965j059k229k583k301k213k543k478j407m3L89l67j520k294k414j903
52936B80000j103p00r80j372j315j176j571k146k059j402j070j262j235o07J20
52921B62122N18P67Q93M74m79j148r34k29K91N72R05J204J167Q66O90Q25J027
52904B69531R02L37k76l54J54N75L46k16m83n16q17j252j132l70L34N81P64J156
$$ plain form
52886 269264 270554 271307 271278 270913 270698 270586 270195 269336 268292 267729 268175 269381 270366 270327 269425 268474 268088 268375
52868 268375 269222 270467 271947 273700 276054 279203 282867 286649 290467 294270 297591 299838 300897 301004 300218
52853 300218 298516 296350 294470 293103 291725 289755 287112 283994 280539 276870 273193 269672 266343 263179
52839 263179 260110 257046 254092 251682 250256 249833 250052 250511 250856 250788 250409 250381 251278 252777 253934 254223 253875
52822 253875 253248 252415 251528 250974 250830 250574 249803 248954 248908 249948 251434 252506 252850 252799 252959 253904 256008 259251
52804 259251 263083 266648 269403 271463 273211 274567 274939 273940 271886 269366 266551 263203 259244 255024 251076
52789 251076 247809 245486 244284 244231 245025 245956 246200 245450 244221 243292 242930 242985 243634 245392 248189 251038 253006
52772 253006 254099 254847 255515 256235 257390 259149 260881 261683 261367 260364 258882 256919 254989 253981 254056 254336
$$ packed form
52886B69264J290P53k9l65k15j12l91q59j044n63M46J206R85l9r02r51l86K87
52868B68375Q47J245J480J753K354L149L664L782L818L803L321K247J059J07p86
52853C00218j702k166j880j367j378j970k643l118l455l669l677l521l329l164
52839B63179l069l064k954k410j426m23K19M59L45o8l79k8Q97J499J157K89l48
52822B53875o27q33q87n54j44k56p71q49m6J040J486J072L44n1J60R45K104L243
52804B59251L832L565K755K060J748J356L72r99k054k520k815l348l959m220l948
52789B51076l267k323j202n3P94R31K44p50j229r29l62N5O49J758K797K849J968
52772B53006J093P48O68P20J155J759J732Q02l16j003j482j963j930j008P5K80
$$ plain form
52756 254336 253975 253025 252068 251505 251517 252246 253574 254976 255953 256550 257220 258219 259267 259786 259518 259016 259322 260917
52738 260917 263083 264709 265661 266905 269215 272228 274919 276642 277448 277758 278030 278564 279329 280030 280456 280704
52722 280704 281014 281543 282326 283234 283910 283911 283028 281377 279229 276926 274907 273482 272490 271453 270195 269083 268520
52705 268520 268414 268276 267770 267011 266418 266316 266652 267081 267358 267526 267656 267634 267418 267279 267432 267605 267416 267119 267517
52686 267517 269028 271227 273366 274967 275837 275948 275575 275237 275219 275314 275187 274773 274138 273174 271716 269954 268550
52669 268550 268239 269177 270619 271384 270888 269676 268749 268483 268477 268319 268102 268175 268719 269631 270577 271234 271736 272792 275004
52650 275004 278178 281708 285417 289381 292994 295026 294861 293111 290760 288299 285917 283913 282445 281364
52636 281364 280629 280453 280665 280567 279944 279675 280690 282686 284557 285791 286696 287484 287940 288021 288070 288248 288243 287660 286398
$$ packed form
52756B54336l61r50r57n63J2P29J328J402R77N97O70R99J048N19k68n02L06J595
52738B60917K166J626R52J244K310L013K691J723Q06L10K72N34P65P01M26K48
52722B80704L10N29P83R08O76Jq83j651k148k303k019j425r92j037j258j112n63
52705B68520j06j38n06p59n93j02L36M29K77J68J30k2k16j39J53J73j89k97L98
52686B67517J511K199K139J601Q70J11l73l38j8R5j27m14o35r64j458j762j404
52669B68550l11R38J442P65m96j212r27k66oj58k17P3N44R12R46O57N02J056K212
52650B75004L174L530L709L964L613K032j65j750k351k461k382k004j468j081
52636B81364p35j76K12r8o23k69J015J996J871J234R05P88M56Q1M9J78nn83j262
$$ plain form
52617 286398 284625 282760 281415 280905 280844 280669 280476 280773 281445 281667 281055 280206 279743 279433 278751 277839 277290 277282 277553
52598 277553 278039 278856 279576 279232 277362 274711 272573 271648 271840 272834 274429 276255 277623 278025 277720 277555 278130
52581 278130 279304 280613 281975 283667 285625 287176 287760 287690 287821 288485 289119 289020 288112 286874 285869 285536 286038
52564 286038 286875 286954 285581 283271 281053 279088 276645 273537 270828 269765 270515 272304 274270 275699 276005
52549 276005 275186 274088 273572 273591 273585 273461 273429 273181 272128 270520 269364 268990 268604 267656 266804 266880 267569 267937 267872
52530 267872 268185 269420 271202 272721 273326 272736 271282 270003 270005 271500 273745 275915 277727 279233 280497 281647
52514 281647 282929 284533 286527 288962 291791 294695 297434 300440 304592 310069 315769 320211 322754 323633
52500 323633 323051 320878 317192 312619 307864 303255 298927 295142 292128 289750 287665 285759 284178 282980
$$ packed form
52617B86398j773j865j345n10o1j75j93K97O72K22o12q49m63l10o82r12n49qK71
52598B77553M86Q17P20l44j870k651k138r25J92R94J595J826J368M02l05j65N75
52581B78130J174J309J362J692J958J551N84p0J31O64O34r9r08j238j005l33N02
52564B86038Q37P9j373k310k218j965k443l108k709j063P50J789J966J429L06
52549B76005q19j098n16J9oj24l2k48j053j608j156l74l86r48q52P6O89L68o5
52530B67872L13J235J782J519O05n90j454j279KJ495K245K170J812J506J264J150
52514B81647J282J604J994K435K829K904K739L006M152N477N700M442K543Q79
52500C23633n82k173l686m573m755m609m328l785l014k378k085j906j581j198
$$ plain form
52486 282980 282029 281313 281124 281747 283061 284586 285882 286874 287848 289179 290952 292821 294322 295370 296343 297635
52470 297635 299279 301065 302892 304789 306688 308353 309603 310608 311980 314499 318478 323286 327684 330794
52456 330794 332578 333266 332663 330367 326521 321883 317117 312358 307575 303014 299106 296079 293836 292118 290679
52441 290679 289305 287777 285912 283789 281956 281175 281718 282978 283968 284167 283726 283063 282576 282630 283384 284496 285332
52424 285332 285599 285582 285659 285855 285983 286033 286207 286704 287613 288906 290409 291856 293094 294211 295463 297125 299466
52407 299466 302770 307292 313200 320511 329102 338784 349346 360375 371013 380102 386646 390053 389971 386312
52393 386312 379683 371453 362999 355058 347941 341917 336918 332275 327491 323187 320576 320026 320704 321580 322103
52378 322103 321926 320947 319975 320545 323427 327774 332239 336490 341106 346402 351994 357360 362202 366316 369587
$$ packed form
52486B82980r51p16j89O23J314J525J296R92R74J331J773J869J501J048R73J292
52470B97635J644J786J827J897J899J665J250J005J372K519L979M808M398L110
52456C30794J784O88o03k296l846m638m766m759m783m561l908l027k243j718j439
52441B90679j374j528j865k123j833p81N43J260R90J99m41o63m87N4P54J112Q36
52424B85332K67j7P7J96J28N0J74M97R09J293J503J447J238J117J252J662K341
52407B99466L304M522N908P311Q591R682J0562J1029J0638R089O544L407q2l659
52393C86312o629q230q454p941p117o024m999m643m784m304k611n50O78Q76N23
52378C22103j77r79r72N70K882M347M465M251M616N296N592N366M842M114L271
$$ plain form
52363 369587 372228 374667 377051 378946 379579 378420 375736 372614 370168 368613 367425 366455 366410 367900 370418
52348 370418 372751 374222 375188 376448 378495 381212 383932 385927 387087 388029 389377 391169 393255 395911 399555
52333 399555 404070 409013 414499 421324 430034 440259 451187 462439 474298 487282 501655 517187
52321 517187 533261 549262 565030 580904 597323 614334 631464 648024 663621 678449 693090
52310 693090 708123 724001 741094 759527 778937 798781 818993 839954 861592 882902 902711
52299 902711 920730 937569 954011 970596 987534 1004378 1019799 1032201 1040780 1045812 1047972 1047700
52287 1047700 1045213 1040720 1034481 1026870 1018464 1009877 1001407 993019 984663 976495 968780 961807 955894 951279
52273 951279 947949 945703 944415 944099 944715 946196 948741 952942 959407 968189 978579 989502 1000212 1010755
$$ packed form
52363C69587K641K439K384J895O33j159k684l122k446j555j188r70m5J490K518
52348C70418K333J471R66J260K047K717K720J995J160R42J348J792K086K656L644
52333C99555M515M943N486O825Q710J0225J0928J1252J1859J2984J4373J5532
52321E17187J6074J6001J5768J5874J6419J7011J7130J6560J5597J4828J4641
52310F93090J5033J5878J7093J8433J9410J9844K0212K0961K1638K1310J9809
52299I02711J8019J6839J6442J6585J6938J6844J5421J2402Q579N032K160k72
52287A047700k487m493o239p611q406q587q470q388q356q168p715o973n913m615
52273I51279l330k246j288l16O16J481K545M201O465Q782J0390J0923J0710J0543
$$ plain form
52259 1010755 1021765 1033817 1047007 1061080 1075756 1090856 1106328 1122331 1139113 1156544 1173803
52248 1173803 1189677 1203100 1213411 1220383 1224297 1225837 1225539 1223330 1218792 1211794 1202615 1191514 1178601
52235 1178601 1164226 1149162 1134121 1119194 1103940 1088034 1071635 1055117 1038603 1021929 1005038
52224 1005038 988246 972017 956610 942135 928856 917224 907568 899900 893955 889239 885113 881161
52212 881161 877565 874850 873241 872501 872449 873240 874993 877542 880718 884515 888606 892078 894148 895084 896051 897992
52196 897992 900857 903885 906436 908567 910933 914186 918458 923466 929013 935047 941251 946931 951458 954601
52182 954601 956384 956927 956482 955191 952615 947938 940894 932145 922589 912806 903407 895287 888866 883501 878253
52167 878253 873059 868689 865744 864249 864013 864841 866506 868996 872711 877983 884460 891342 898037 904174 909193
$$ packed form
52259A010755J1010J2052J3190J4073J4676J5100J5472J6003J6782J7431J7259
52248A173803J5874J3423J0311O972L914J540k98k209m538o998r179j1101j2913
52235A178601j4375j5064j5041j4927j5254j5906j6399j6518j6514j6674j6891
52224A005038j6792j6229j5407j4475j3279j1632r656p668n945m716m126l952
52212H81161l596k715j609p40n2P91J753K549L176L797M091L472K070R36R67J941
52196H97992K865L028K551K131K366L253M272N008N547O034O204N680M527L143
52182I54601J783N43m45j291k576m677p044q749r556r783r399q120o421n365n248
52167H78253n194m370k945j495k36Q28J665K490L715N272O477O882O695O137N019
$$ plain form
52152 909193 912513 914091 914429 914105 913645 913675 914665 916558 919041 922001 925300 928399 930882 933245 936476 940718
52136 940718 944940 948059 950025 951706 954063 957473 961497 965408 969288 974458 982435 993619 1007416 1023380
52122 1023380 1041611 1062259 1085398 1111311 1140042 1170634 1201498 1231699 1261234 1290084 1317798
52111 1317798 1344119 1369149 1392616 1413795 1432488 1449346 1464848 1478720 1490796 1501704 1512183
52100 1512183 1522329 1532076 1541785 1551657 1561027 1568945 1575106 1579661 1582433 1582846 1580345 1574304 1563919 1548826
52086 1548826 1529761 1508149 1485233 1461963 1439271 1417774 1397440 1378203 1360720 1345868 1333607
52075 1333607 1322990 1313360 1304946 1298246 1293423 1290452 1289351 1290116 1292834 1297980 1306090 1316877 1329072
52062 1329072 1341426 1353618 1366021 1378970 1392586 1406959 1421971 1437026 1451429 1465155 1478885
$$ packed form
52152I09193L320J578L38l24m60L0R90J893K483K960L299L099K483K363L231M242
52136I40718M222L119J966J681K357L410M024L911L880N170P977J1184J3797J5964
52122A023380J8231K0648K3139K5913K8731L0592L0864L0201K9535K8850K7714
52111A317798K6321K5030K3467K1179J8693J6858J5502J3872J2076J0908J0479
52100A512183J0146R747R709R872R370P918O161M555K772M13k501o041j0385j5093
52086A548826j9065k1612k2916k3270k2692k1497k0334j9237j7483j4852j2261
52075A333607j0617r630q414o700m823k971j101P65K718N146Q110J0787J2195
52062A329072J2354J2192J2403J2949J3616J4373J5012J5055J4403J3726J3730
$$ plain form
52051 1478885 1493091 1507302 1520464 1531777 1540890 1547478 1551118 1551701 1549514 1544684 1536903 1526058 1512809
52038 1512809 1498054 1482013 1464417 1445572 1426591 1408390 1390971 1373958 1357430 1341845 1327360
52027 1327360 1313528 1299579 1284955 1269768 1254805 1240713 1227115 1212918 1197702 1182371 1168208
52016 1168208 1155703 1144646 1134838 1126106 1117917 1109723 1101712 1094667 1088922 1083812 1078317 1071998 1065083
52003 1065083 1057777 1049653 1039766 1027412 1012726 996446 979182 961207 942948 925258 908890 894044
51991 894044 880709 869145 859538 851330 843392 834915 825807 816147 805680 794055 781414 768499 756143
51978 756143 744650 733662 722542 710777 697999 683950 668921 654169 641325 631116 623059 616598
51966 616598 612012 609808 609823 611697 615838 623005 632827 643591 653777 663193 672277 680833 687906 692485
$$ packed form
52051A478885J4206J4211J3162J1313R113O588L640N83k187m830p781j0845j3249
52038A512809j4755j6041j7596j8845j8981j8201j7419j7013j6528j5585j4485
52027A327360j3832j3949j4624j5187j4963j4092j3598j4197j5216j5331j4163
52016A168208j2505j1057r808q732q189q194q011p045n745n110n495o319o915
52003A065083p306q124r887j2354j4686j6280j7264j7975j8259j7690j6368j4846
51991H94044j3335j1564r607q208p938q477r108r660j0467j1625j2641j2915j2356
51978G56143j1493j0988j1120j1765j2778j4049j5029j4752j2844j0209q057o461
51966F16598m586k204J5J874M141P167R822J0764J0186R416R084Q556P073M579
$$ plain form
51952 692485 693779 691150 684485 674803 664002 653806 645070 638075 633052 630138 629072 629438 631299 635325
51938 635325 642083 651345 662292 674307 687234 700812 714221 726519 737364 746844 754506 758969
51926 758969 758850 753990 745459 734415 721283 706095 689190 671217 652748 634334 616848 601197
51914 601197 587568 575393 564338 554955 547990 543336 540149 537872 536757 537457 540514 546257 554815 566051
51900 566051 579641 595179 612072 629430 646380 662355 676678 687936 694258 694383 688226 676483
51888 676483 660190 640839 620378 600627 582774 567494 555196 545876 538938 533627 529688 527516
51876 527516 527695 530517 535932 543833 554170 566587 579968 592697 603582 612310 618872 622950 624273
51863 624273 623148 620047 614933 607656 598806 589458 580146 570925 562453 556113 552736 551970 553122 555840
$$ packed form
51952F92485J294k629o665r682j0801j0196q736o995n023k914j066L66J861M026
51938F35325O758R262J0947J2015J2927J3578J3409J2298J0845R480P662M463
51926G58969j19m860q531j1044j3132j5188j6905j7973j8469j8414j7486j5651
51914F01197j3629j2175j1055r383o965m654l187k277j115P00L057N743Q558J1236
51900E66051J3590J5538J6893J7358J6950J5975J4323J1258O322J25o157j1743
51888F76483j6293j9351k0461j9751j7853j5280j2298r320o938n311l939k172
51876E27516J79K822N415P901J0337J2417J3381J2729J0885Q728O562M078J323
51863F24273j125l101n114p277q850r348r312r221q472o340l377p66J152K718
$$ plain form
51849 555840 559568 563135 565506 566422 565857 563435 558990 553176 546879 540319 533255 525766 518292 511169 504574
51834 504574 498666 493413 488633 484592 482170 481940 483415 485642 488199 491074 493978 496339 497769 498023 496826
51819 496826 494223 490827 487187 483276 479151 475689 473858 473530 473810 474388 475714 477890 480267 482336 484293
51804 484293 486417 488375 489419 489023 487199 484508 481807 479715 478290 477375 476990 477101 477287 477089 476511 475724
51788 475724 474521 472603 470198 467772 465311 462537 459762 457814 457030 456923 456909 456823 456611 456118 455407 454865 454836
51771 454836 455431 456716 458769 461650 465708 471764 480407 491174 502927 514999 527382 539804 551249
51758 551249 560507 566743 569537 568895 565369 559659 552115 543015 533117 523281 513648 503995 494809 487135
51744 487135 481274 476574 472768 470523 470230 471105 472139 473349 475601 479734 486315 495568 506902 518876
$$ packed form
51849E55840L728L567K371R16n65k422m445n814o297o560p064p489p474p123o595
51834E04574n908n253m780m041k422k30J475K227K557K875K904K361J430K54j197
51819D96826k603l396l640l911m125l462j831l28K80N78J326K176K377K069J957
51804D84293K124J958J044l96j824k691k701k092j425r15l85J11J86j98n78p87
51788D75724j203j918k405k426k461k774k775j948p84j07j4q6k12m93p11n42k9
51771D54836N95J285K053K881M058O056Q643J0767J1753J2072J2383J2422J1445
51758E51249R258O236K794o42l526n710p544r100r898r836r633r653r186p674
51744D87135n861m700l806k245k93Q75J034J210K252M133O581R253J1334J1974
$$ plain form
51730 518876 530213 540511 549544 556432 560256 561236 560703 560075 560289 561876 564823 568212 570481 570271 567029
51715 567029 561120 553690 546269 540047 535416 532149 529705 527222 523653 518484 512267 506150 500913 496721
51701 496721 493650 492134 492704 495322 498984 502142 503801 504193 504175 504134 503908 503711 504353 506197 508394 509622
51685 509622 509294 507686 505134 501572 496831 491123 485197 480027 476191 473609 472064 471831 473281 475964 478725
51670 478725 480880 482711 484632 486645 489033 492895 499344 508522 519835 532610 545881 557921 566785
51657 566785 571318 571328 567131 559525 550016 540404 532081 525989 522888 523072 525935 530364 535563 541002 545611
51642 545611 547598 545394 538714 528748 517443 506403 496202 486781 478366 471571 466424 461999 457531
51629 457531 453393 450299 447972 445491 442795 440918 440609 441438 442478 443309 444049 444835 445554 445827 445123 443111
$$ packed form
51730E18876J1337J0298R033O888L824R80n33o28K14J587K947L389K269k10l242
51715E67029n909p430p421o222m631l267k444k483l569n169o217o117n237m192
51701D96721l071j516N70K618L662L158J659L92j8m1k26j97O42J844K197J228
51685E09622l28j608k552l562m741n708n926n170l836k582j545k33J450K683K761
51670D78725K155J831J921K013K388L862O449R178J1313J2775J3271J2040Q864
51657E66785M533J0m197p606r509r612q323o092l101J84K863M429N199N439M609
51642E45611J987k204o680r966j1305j1040j0201r421q415o795n147m425m468
51629D57531m138l094k327k481k696j877l09Q29J040Q31P40P86P19K73p04k012
$$ plain form
51613 443111 440013 436445 432959 429944 427769 426625 426246 426139 426081 426124 426347 426991 428568 431248 434299 436864
51597 436864 439313 443088 449053 456709 465296 474885 485890 497965 509985 520750 529224 534399 535664
51584 535664 533423 528924 523350 517257 510959 505187 501049 499295 499733 501704 505212 511240 520627 532941
51570 532941 546984 562213 579001 597510 617194 637744 659669 683243 707375 730472 752385
51559 752385 774942 800599 831079 867189 908983 955534 1004757 1053806 1099643 1139340 1170365
51548 1170365 1191019 1200557 1198761 1185685 1162069 1129742 1091073 1047859 1001041 951586 901353 852753
51536 852753 807688 767077 731302 700655 675088 653768 635308 618560 603059 588746 575572
51525 575572 563573 553081 544456 537540 531653 526219 521178 516627 512339 507990 503685 499802 496271 492506
$$ packed form
51613D43111l098l568l486l015k175j144l79j07n8M3K23O44J577K680L051K565
51597D36864K449L775N965P656Q587R589J1005J2075J2020J0765Q474N175J265
51584E35664k241m499n574o093o298n772m138j754M38J971L508O028R387J2314
51570E32941J4043J5229J6788J8509J9684K0550K1925K3574K4132K3097K1913
51559G52385K2557K5657L0480L6110M1794M6551M9223M9049M5837L9697L1025
51548A170365K0654R538j796j3076k3616l2327l8669m3214m6818m9455n0233m8600
51536H52753m5065m0611l5775l0647k5567k1320j8460j6748j5501j4313j3174
51525E75572j1999j0492q625o916n887n434n041m551m288m349m305l883l531l765
$$ plain form
51511 492506 488268 484224 481233 479304 477675 475772 473695 471812 470326 469304 468738 468402 467956 467401 467239
51496 467239 468011 469804 472257 474915 477452 479705 481567 482800 483065 482373 481379 480820 480646 480112 478838 477236
51480 477236 475694 473845 471110 467601 463954 460444 456732 452434 447554 442378 437294 432656 428570 424768
51466 424768 420954 417241 413955 411046 407998 404463 400775 397706 395806 394976 394626 394164 393437 392700 392240 392138
51450 392138 392392 393083 394311 396145 398778 402568 407800 414579 423057 433540 446162 460563 476069 491996
51436 491996 507597 521894 533811 542494 547492 548963 547954 546151 544832 543924 542155 538081 530979 521119
51422 521119 509595 497838 486992 477616 469858 463625 458512 453928 449592 445748 442808 441046 440711 441830
51408 441830 443642 444848 444996 445160 446612 449203 451781 453896 456238 459486 463603 468364 473760 479623 485494
$$ packed form
51511D92506m238m044k991j929j629j903k077j883j486j022n66l36m46n55j62
51496D67239P72J793K453K658K537K253J862J233K65o92r94n59j74n34j274j602
51480D77236j542j849k735l509l647l510l712m298m880n176n084m638m086l802
51466D24768l814l713l286k909l048l535l688l069j900q30l50m62p27p37m60j02
51450C92138K54O91J228J834K633L790N232O779Q478J0483J2622J4401J5506J5927
51436D91996J5601J4297J1917Q683M998J471j009j803j319r08j769m074p102r860
51422E21119j1524j1757j0846r376p758o233n113m584m336l844k940j762l35J119
51408D41830J812J206J48J64J452K591K578K115K342L248M117M761N396N863N871
$$ plain form
51393 485494 491147 496768 502393 507756 513006 519104 527098 537237 549072 562176 576645 593213 613055
51380 613055 637225 666095 699619 738212 783002 834964 894048 959143 1028294 1098545 1165941
51369 1165941 1226335 1276439 1314212 1338518 1348725 1344630 1326668 1296235 1255637 1207351 1153161
51358 1153161 1094187 1031796 968184 905979 847418 793873 745818 703101 665509 633167 606197
51347 606197 584070 565681 550119 536912 525496 514993 504906 495605 487689 481101 475187 469467
51335 469467 463995 459077 454850 451128 447604 444302 441772 440471 439894 438775 436400 433313 430441 427912
51321 427912 425145 421822 418210 414700 411488 408715 406451 404466 402381 400207 398519 397891 398303 399227 400291
51306 400291 401648 403540 405655 407246 408070 408854 410501 413054 415915 418853 422101 425435 427916 428939 428995
$$ packed form
51393D85494N653N621N625N363N250O098P994J0139J1835J3104J4469J6568J9842
51380F13055K4170K8870L3524L8593M4790N1962N9084O5095O9151P0251O7396
51369A165941O0394N0104L7773K4306J0207m095j7962l0433m0598m8286n4190
51358A153161n8974o2391o3612o2205n8561n3545m8055m2717l7592l2342k6970
51347F06197k2127j8389j5562j3207j1416j0503j0087r301p916o588n914n720
51335D69467n472m918m227l722l524l302k530j301n77j119k375l087k872k529
51321D27912k767l323l612l510l212k773k264j985k085k174j688o28M12R24J064
51306D00291J357J892K115J591Q24P84J647K553K861K938L248L334K481J023N6
$$ plain form
51291 428995 428964 429049 428801 427830 426068 423662 421118 419272 418556 418371 417685 416293 415176 415587 418023 421982 426466
51274 426466 430654 434231 437039 438540 438050 435730 432865 430761 429672 429209 429403 430696 432999 435493 437469
51259 437469 438913 440101 441036 441485 441291 440437 438898 436555 433370 429786 426892 425741 426201 426801 426069 423741
51243 423741 420433 416646 412747 409501 407677 407128 406962 406685 406596 407065 408129 409798 411978 413971 414882 414791
51227 414791 414807 415606 416659 417217 417231 416792 415470 413074 410454 408679 407757 406914 405837 404823 404007 403341 403186
51210 403186 404029 405568 406933 407897 409110 411004 413361 416214 420225 425585 431264 436065 439965 443708 447438
51195 447438 450581 452903 454930 457074 458925 459652 458890 457057 454996 453366 452216 451038 449300 446897 444058
51180 444058 441004 437893 435004 432708 431219 430469 430169 429953 429662 429617 430329 431674 432572 431942 429833 427278
$$ packed form
51291D28995l1Q5k48r71j762k406k544j846p16j85o86j392j117M11K436L959M484
51274D26466M188L577K808J501m90k320k865k104j089m63J94J293K303K494J976
51259D37469J444J188R35M49j94q54j539k343l185l584k894j151M60O00p32k328
51243D23741l308l787l899l246j824n49j66k77q9M69J064J669K180J993R11r1
51227D14791J6P99J053N58J4m39j322k396k620j775r22q43j077j014q16o66j55
51210D03186Q43J539J365R64J213J894K357K853M011N360N679M801L900L743L730
51195D47438L143K322K027K144J851P27p62j833k061j630j150j178j738k403k839
51180D44058l054l111k889k296j489p50l00k16k91m5P12J345Q98o30k109k555
$$ plain form
51164 427278 425207 423960 423682 424515 426318 428805 432142 436814 442617 448325 452790 455896 458009 458977 458408
51149 458408 456639 454585 452546 449892 446206 442209 439121 437399 436572 436142 436164 436780 437598 438001 438022 438473 439952
51132 439952 442052 443892 445154 446083 446611 446185 444674 442803 441295 440124 439020 438268 438327 439009 439700 440283
51116 440283 441218 442726 444467 446132 447819 449666 451489 453022 454301 455732 457854 460935 464550 467805
51102 467805 470287 472587 475446 478703 481720 484627 488211 492539 496601 499645 502034 504282 505947 506177
51088 506177 504904 502833 500514 498049 495562 493402 491833 490837 490175 489418 488076 486015 483633 481465 479732
51073 479732 478423 477496 476795 476139 475744 476201 477642 479346 480651 481952 484216 487746 492105 497163 503575
51058 503575 512157 523313 537046 552820 569175 584106 596289 605773 613456 620419 628005 637931 651511
$$ packed form
51164D27278k071j247k78Q33J803K487L337M672N803N708M465L106K113R68n69
51149D58408j769k054k039k654l686l997l088j722q27m30K2O16Q18M03K1M51J479
51132D39952K100J840J262R29N28m26j511j871j508j171j104p52N9O82O91N83
51116D40283R35J508J741J665J687J847J823J533J279J431K122L081L615L255
51102D67805K482K300K859L257L017K907L584M328M062L044K389K248J665K30
51088E06177j273k071k319k465k487k160j569r96o62p57j342k061k382k168j733
51073D79732j309r27p01o56l95M57J441J704J305J301K264L530M359N058O412
51058E03575Q582J1156J3733J5774J6355J4931J2183R484P683O963P586R926J3580
$$ plain form
51045 651511 668654 687861 707139 724837 739908 751851 760414 765186 765593 761653 754700 746972 740252
51032 740252 734892 730013 724160 715682 703162 686330 666692 646822 628711 612942 599336 587920
51020 587920 578950 572479 568415 566879 567954 571122 575422 580257 585649 591638 597903 604178 610675 617802
51006 617802 625735 634462 643965 654104 664604 675456 687084 699828 713422 727230 740808 753995
50994 753995 766757 779297 792072 805195 817970 829492 839653 849043 857796 865121 870333 873999
50982 873999 877603 882161 887550 893280 899525 907051 916227 926549 937330 948477 960253 972676 985797
50969 985797 1000535 1018515 1040857 1067680 1099033 1135632 1178206 1226584 1280008 1338001 1400351
50958 1400351 1466593 1536056 1608245 1682531 1757526 1831241 1901733 1967230 2025976 2076713 2119206
$$ packed form
51045F51511J7143J9207J9278J7698J5071J1943Q563M772M07l940o953p728o720
51032G40252n360m879n853q478j2520j6832j9638j9870j8111j5769j3606j1416
51020E87920q970o471m064j536J075L168M300M835N392N989O265O275O497P127
51006F17802P933Q727R503J0139J0500J0852J1628J2744J3594J3808J3578J3187
50994G53995J2762J2540J2775J3123J2775J1522J0161R390Q753P325N212L666
50982H73999L604M558N389N730O245P526R176J0322J0781J1147J1776J2423J3121
50969I85797J4738J7980K2342K6823L1353L6599M2574M8378N3424N7993O2350
50958A400351O6242O9463P2189P4286P4995P3715P0492O5497N8746N0737M2493
$$ plain form
50947 2119206 2153651 2179678 2196633 2204767 2205346 2199551 2188158 2172478 2154559 2135760 2115643 2092763
50935 2092763 2066176 2035894 2002512 1967073 1930981 1895428 1860934 1827638 1795647 1764778 1734341
50924 1734341 1703639 1672375 1640204 1606301 1569974 1531507 1491793 1451297 1409947 1367930 1326029
50913 1326029 1285152 1246059 1209580 1176536 1147206 1121128 1097505 1075557 1054658 1034726 1016570
50902 1016570 1001241 988723 977603 966327 954451 942542 931357 921517 913503 907272 902026 896956
50890 896956 892234 888745 886738 885317 883571 881766 880952 881665 883462 885683 888165 891115 894676 898891 903822
50875 903822 909490 915725 922328 929327 937022 945824 956105 967949 980902 994227 1007748 1022353 1039267
50862 1039267 1058912 1080844 1104830 1131452 1161431 1194844 1231460 1271595 1316120 1365790 1421095
$$ packed form
50947B119206L4445K6027J6955Q134N79n795j1393j5680j7919j8799k0117k2880
50935B092763k6587l0282l3382l5439l6092l5553l4494l3296l1991l0869l0437
50924A734341l0702l1264l2171l3903l6327l8467l9714m0496m1350m2017m1901
50913A326029m0877l9093l6479l3044k9330k6078k3623k1948k0899j9932j8156
50902A016570j5329j2518j1120j1276j1876j1909j1185r840q014o231n246n070
50890H96956m722l489k007j421j746j805q14P13J797K221K482K950L561M215M931
50875I03822N668O235O603O999P695Q802J0281J1844J2953J3325J3521J4605J6914
50862A039267J9645K1932K3986K6622K9979L3413L6616M0135M4525M9670N5305
$$ plain form
50851 1421095 1482881 1552554 1631379 1719780 1817603 1924842 2041773 2168496 2304625 2449492
50841 2449492 2602375 2762438 2928514 3098915 3271208 3441968 3606829 3760900 3899311
50832 3899311 4017655 4112433 4181472 4223944 4239803 4229349 4193633 4135362 4059064 3970076 3873320
50821 3873320 3773003 3673125 3577772 3490644 3414198 3349109 3294305 3247407 3205357 3164994 3123547
50810 3123547 3078985 3030092 2976075 2915962 2848462 2772605 2688567 2597775 2502254 2403953 2304640
50799 2304640 2206095 2110100 2018223 1931758 1851856 1779487 1715068 1658158 1607734 1562955 1523687
50788 1523687 1490268 1462848 1441042 1424137 1411493 1402641 1397091 1394112 1392758 1392154 1391736 1391187 1390157
50775 1390157 1388222 1385172 1381128 1376215 1370288 1363201 1355130 1346332 1336678 1325780 1313471 1299839 1284856
$$ packed form
50851A421095O1786O9673P8825Q8401R7823J07239J16931J26723J36129J44867
50841B449492J52883J60063J66076J70401J72293J70760J64861J54071J38411
50832C899311J18344R4778O9039M2472J5859j0454l5716n8271p6298q8988r6756
50821C873320j00317r9878r5353q7128p6446o5089n4804m6898m2050m0363m1447
50810C123547m4562m8893n4017o0113o7500p5857q4038r0792r5521r8301r9313
50799B304640r8545r5995r1877q6465p9902p2369o4419n6910n0424m4779l9268
50788A523687l3419k7420k1806j6905j2644q852n550k979j354o04m18n49j030
50775A390157j935l050m044m913n927p087q071q798r654j0898j2309j3632j4983
$$ plain form
50762 1284856 1268475 1251059 1233238 1215286 1197140 1179150 1162173 1146681 1132437 1119404 1108338
50751 1108338 1099936 1093963 1089909 1088075 1089240 1093547 1100518 1110025 1122443 1137939 1156393 1178085 1203671
50738 1203671 1233380 1266986 1304731 1347514 1395910 1449790 1509232 1574933 1647142 1724832 1806630
50727 1806630 1892008 1980766 2071675 2162622 2252147 2340149 2426909 2511823 2593195 2668855 2736766
50716 2736766 2795171 2842236 2875564 2892403 2890711 2870103 2831786 2778059 2712232 2638561 2561391
50705 2561391 2484257 2410084 2341863 2282144 2231684 2189366 2153846 2124728 2101832 2083994 2069197
50694 2069197 2055395 2040539 2022214 1998148 1967254 1929674 1885965 1836917 1784149 1730010 1676423
50683 1676423 1624332 1574569 1528642 1488048 1453149 1423376 1398404 1378588 1364314 1355527 1352019 1353828
$$ packed form
50762A284856j6381j7416j7821j7952j8146j7990j6977j5492j4244j3033j1066
50751A108338q402n973m054j834J165M307O971R507J2418J5496J8454K1692K5586
50738A203671K9709L3606L7745M2783M8396N3880N9442O5701P2209P7690Q1798
50727A806630Q5378Q8758R0909R0947Q9525Q8002Q6760Q4914Q1372P5660O7911
50716B736766N8405M7065L3328J6839j692k0608l8317n3727o5827p3671p7170
50705B561391p7134p4173o8221n9719n0460m2318l5520k9118k2896j7838j4797
50694B069197j3802j4856j8325k4066l0894l7580m3709m9048n2768n4139n3587
50683A676423n2091m9763m5927m0594l4899k9773k4972j9816j4274q787l508J809
$$ plain form
50671 1353828 1361185 1374291 1393076 1416863 1444257 1473720 1504259 1535214 1565547 1593948 1619804
50660 1619804 1643454 1665234 1684862 1702150 1717837 1733101 1748466 1763662 1778406 1792880 1807528
50649 1807528 1822791 1838980 1856099 1873866 1892240 1911889 1933926 1959355 1988986 2023563 2063469
50638 2063469 2108354 2157464 2210327 2266737 2326166 2387563 2449694 2511348 2571389 2629132 2684640
50627 2684640 2738163 2789229 2836669 2879306 2915823 2943707 2959107 2958505 2940710 2907452 2862677 2811535
50615 2811535 2759319 2710381 2667517 2632120 2604555 2584296 2570261 2561531 2557761 2558637 2563030 2568792
50603 2568792 2573228 2573585 2567274 2552044 2526268 2489252 2441430 2384196 2319365 2248756 2174294 2098177
50591 2098177 2022500 1948611 1877131 1808535 1743476 1682695 1627085 1577746 1535324 1499120 1467434
$$ packed form
50671A353828P357J3106J8785K3787K7394K9463L0539L0955L0333K8401K5856
50660A619804K3650K1780J9628J7288J5687J5264J5365J5196J4744J4474J4648
50649A807528J5263J6189J7119J7767J8374J9649K2037K5429K9631L4577L9906
50638B063469M4885M9110N2863N6410N9429O1397O2131O1654O0041N7743N5508
50627B684640N3523N1066M7440M2637L6517K7884J5400o02j7795l3258m4775n1142
50615B811535n2216m8938m2864l5397k7565k0259j4035q730l770Q76M393N762
50603B568792M436L57o311j5230k5776l7016m7822n7234o4831p0609p4462p6117
50591B098177p5677p3889p1480o8596o5059o0781n5610m9339m2422l6204l1686
$$ plain form
50580 1467434 1439010 1413721 1391675 1372332 1354984 1339591 1326464 1315398 1305704 1296987 1289415 1283308
50568 1283308 1278876 1276369 1276060 1277985 1281913 1287634 1295139 1304545 1316016 1329747 1345945 1364864 1386842
50555 1386842 1412070 1440277 1470887 1503586 1538363 1574746 1611343 1646532 1679496 1710316 1739213
50544 1739213 1766067 1790640 1813054 1834091 1855180 1877887 1903161 1931162 1962058 1996836 2036998
50533 2036998 2083559 2136626 2195961 2261659 2334153 2413725 2500272 2593624 2694049 2802198 2918363
50522 2918363 3041882 3171480 3305904 3443725 3582571 3719283 3851055 3975907 4091716
50513 4091716 4195370 4283386 4352991 4402197 4429291 4433030 4413262 4370914 4307516 4225301 4127633
50502 4127633 4018725 3902743 3783524 3665051 3551722 3447926 3357522 3283559 3228043 3191839
$$ packed form
50580A467434k8424k5289k2046j9343j7348j5393j3127j1066r694q717p572o107
50568A283308m432k507l09J925L928N721P505R406J1471J3731J6198J8919K1978
50555A386842K5228K8207L0610L2699L4777L6383L6597L5189L2964L0820K8897
50544A739213K6854K4573K2414K1037K1089K2707K5274K8001L0896L4778M0162
50533B036998M6561N3067N9335O5698P2494P9572Q6547R3352J00425J08149J16165
50522B918363J23519J29598J34424J37821J38846J36712J31772J24852J15809
50513D091716J03654Q8016O9605M9206K7094L739j9768m2348o3398q2215r7668
50502D127633j08908j15982j19219j18473j13329j03796r0404p3963n5516l6204
$$ plain form
50492 3191839 3174963 3176895 3196232 3230091 3274174 3323519 3373043 3417496 3451356 3469098 3465877 3438565
50480 3438565 3386750 3312766 3220408 3113529 2995828 2871245 2743643 2615935 2490049 2367823
50470 2367823 2251385 2142431 2041541 1948428 1862596 1783699 1711685 1646876 1589620 1539576 1495569
50459 1495569 1456388 1421644 1391699 1366905 1347118 1331820 1320521 1312958 1309026 1308597 1311502 1317634
50447 1317634 1326894 1338892 1352914 1368343 1385004 1402895 1421680 1440627 1458848 1475361 1489084
50436 1489084 1499224 1505810 1509695 1512073 1514008 1516149 1518503 1520576 1522046 1523246 1524760 1526801 1529417 1533189
50422 1533189 1539174 1548079 1559872 1574214 1590910 1609895 1631330 1655813 1684196 1716955 1753994 1795115
50410 1795115 1840398 1890055 1944207 2002759 2065137 2130055 2195945 2261711 2326728 2390098 2450461
$$ packed form
50492C191839j6876J932J9337L3859M4083M9345M9524M4453L3860J7742l221k7312
50480C438565n1815p3984r2358j06879j17701j24583j27602j27708j25886j22226
50470B367823j16438j08954j00890r3113q5832p8897p2014o4809n7256n0044m4007
50459A495569l9181l4744k9945k4794j9787j5298j1299p563l932m29K905O132
50447A317634R260J1998J4022J5429J6661J7891J8785J8947J8221J6513J3723
50436A489084J0140O586L885K378J935K141K354K073J470J200J514K041K616L772
50422A533189N985Q905J1793J4342J6696J8985K1435K4483K8383L2759L7039M1121
50410A795115M5283M9657N4152N8552O2378O4918O5890O5766O5017O3370O0363
$$ plain form
50399 2450461 2506721 2558470 2605301 2646003 2678787 2702050 2714596 2715270 2702816 2676226 2635277 2580891
50387 2580891 2515110 2440649 2360453 2277617 2195342 2116440 2042871 1976179 1918310 1871371 1836456
50376 1836456 1813260 1801065 1799402 1807305 1822537 1842271 1864245 1886617 1906973 1922281 1929909 1928210
50364 1928210 1916186 1893355 1860254 1818621 1770611 1718029 1662387 1605302 1548402 1492958 1439839
50353 1439839 1389580 1342120 1296611 1252017 1208227 1166320 1127552 1092269 1060064 1030765 1004846
50342 1004846 982832 964695 949997 938292 929151 922066 916719 913291 912293 914082 918644 925659 934567
50329 934567 944772 956059 968749 983191 999268 1016631 1035122 1054467 1073592 1090755 1104435
50318 1104435 1113799 1118437 1118254 1113841 1106521 1097740 1088520 1079439 1070707 1062127 1053528 1045419 1038834 1034271
$$ packed form
50399B450461N6260N1749M6831M0702L2784K3263J2546O74j2454k6590m0949n4386
50387B580891o5781p4461q0196q2836q2275p8902p3569o6692n7869m6939l4915
50376A836456k3196j2195j663P903J5232J9734K1974K2372K0356J5308P628j699
50364A928210j2024k2831l3101m1633m8010n2582n5642n7085n6900n5444n3119
50353A439839n0259m7460m5509m4594m3790m1907l8768l5283l2205k9299k5919
50342A004846k2014j8137j4698j1705r141p085n347l428r98J789M562P015Q908
50329I34567J0205J1287J2690J4442J6077J7363J8491J9345J9125J7163J3680
50318A104435R364M638j83m413p320q781r220r081q732q580q599q109o585m563
$$ plain form
50304 1034271 1031162 1028644 1026433 1024627 1023171 1022104 1022084 1024004 1028047 1033594 1040164 1048027 1057697 1069181
50290 1069181 1082065 1096298 1112622 1132063 1155020 1181017 1209166 1238278 1265892 1287442 1297422
50279 1297422 1292293 1272498 1241785 1204969 1166413 1129674 1097264 1070205 1048152 1030211 1015668
50268 1015668 1004039 994973 988354 984269 982513 982225 982290 982144 981948 981985 982123 982051 981733 981275 980487 978990 976836
50251 976836 974546 972411 970180 967760 965799 965011 965166 965310 965010 964909 966050 969079 974217 981516 990938
50236 990938 1002412 1016019 1031985 1050466 1071470 1094720 1119225 1143168 1164818 1183691 1200388
50225 1200388 1215400 1228700 1240535 1251789 1263084 1274049 1283785 1291471 1296027 1295795 1289415 1276979
50213 1276979 1259798 1239099 1215393 1189048 1161046 1133025 1106770 1083663 1064409 1049159 1037730
$$ packed form
50304A034271l109k518k211j806j456j067k0J920M043N547O570P863R670J1484
50290A069181J2884J4233J6324J9441K2957K5997K8149K9112K7614K1550R980
50279A297422n129j9795l0713l6816l8556l6739l2410k7059k2053j7941j4543
50268A015668j1629r066o619m085j756k88O5j46j96L7J38p2l18m58p88j497k154
50251I76836k290k135k231k420j961p88J55J44l00j01J141L029N138P299R422
50236I90938J1474J3607J5966J8481K1004K3250K4505K3943K1650J8873J6697
50225A200388J5012J3300J1835J1254J1295J0965R736P686M556k32o380j2436
50213A276979j7181k0699k3706k6345k8002k8021k6255k3107j9254j5250j1429
$$ plain form
50202 1037730 1029518 1023289 1017457 1010663 1001807 989590 972819 951639 928028 904511 882477 861964
50190 861964 842651 824523 807808 792842 779982 769291 760281 752149 744244 736216 728021 720038 712900
50177 712900 706916 701881 697612 694232 691595 688964 685864 682883 680955 680072 679430 678674 678292 678691 679671 680979
50161 680979 682766 685140 687722 690015 691983 694045 696723 700432 705398 711542 718571 726339 735034 744890
50147 744890 755709 766692 776753 785075 791373 795581 797472 796943 794570 791285 787367 782364 776456 771281
50133 771281 768678 769006 771389 775285 780915 788249 796638 805741 816077 828270 842322 858105 876165
50120 876165 897545 922959 952351 985107 1020477 1057921 1097177 1137981 1179690 1221333 1262063
50109 1262063 1301548 1340094 1378495 1417483 1457024 1496287 1534428 1570876 1604345 1632121 1651308
$$ packed form
50202A037730q212o229n832o794q856j2217j6771k1180k3611k3517k2034k0513
50190H61964j9313j8128j6715j4966j2860j0691r010q132p905q028q195p983p138
50177G12900n984n035m269l380k637k631l100k981j928q83o42p56l82L99R80J308
50161F80979J787K374K582K293J968K062K678L709M966O144P029P768Q695R856
50147G44890J0819J0983J0061Q322O298M208J891n29k373l285l918n003n908n175
50133G71281k603L28K383L896N630P334Q389R103J0336J2193J4052J5783J8060
50120H76165K1380K5414K9392L2756L5370L7444L9256M0804M1709M1643M0730
50109A262063L9485L8546L8401L8988L9541L9263L8141L6448L3469K7776J9187
$$ plain form
50098 1651308 1660743 1660983 1652516 1634979 1608254 1573354 1531798 1484989 1434696 1383430 1333576 1286533
50086 1286533 1243153 1204416 1170943 1142171 1116833 1094181 1074244 1056922 1041397 1026510 1011464
50075 1011464 996200 981328 967598 955249 944002 933783 925072 918226 912785 907866 903010 898197
50063 898197 893277 887937 882181 876350 870595 864703 858478 851987 845376 838773 832364 826246 820224 814106
50049 814106 808266 803463 799959 797176 794525 792305 791368 792064 793995 796900 801338 808063 816806 826165 834874
50034 834874 842936 851286 860599 870719 881057 891096 900549 909524 918587 928164 937715 945972 952248
50021 952248 957041 961055 964158 965851 966379 966573 966709 966145 964250 961124 957181 952420 946464 939257 931584
50006 931584 924848 920219 917851 917002 917105 918607 922682 930407 942584 960019 983281 1012034 1045035
$$ packed form
50098A651308R435K40q467j7537k6725l4900m1556m6809n0293n1266m9854m7043
50086A286533m3380l8737l3473k8772k5338k2652j9937j7322j5525j4887j5046
50075A011464j5264j4872j3730j2349j1247j0219q711o846n441m919m856m813
50063H98197m920n340n756n831n755n892o225o491o611o603o409o118o022o118
50049H14106n840m803l504k783k651k220r37O96J931K905M438O725Q743R359Q709
50034H34874Q062Q350R313J0120J0338J0039R453Q975R063R577R551Q257O276
50021I52248M793M014L103J693N28J94J36n64j895l126l943m761n956p207p673
50006I31584o736m629k368q49J03J502M075P725J2177J7435K3262K8753L3001
$$ plain form
49993 1045035 1080869 1118283 1155791 1191545 1224012 1252610 1277585 1299641 1319773 1338861 1356779
49982 1356779 1372029 1382516 1386646 1383563 1372731 1353840 1327122 1293460 1254253 1211354 1166918 1122895
49970 1122895 1080653 1041179 1005321 973402 944820 918595 894344 872306 852514 834589 818461
49959 818461 804685 793663 785070 778336 773312 770108 768736 769424 772856 779444 788531 798920 810095
49946 810095 822325 835528 848676 860482 870196 877605 882831 886384 888952 890708 891105 889610 886326
49933 886326 881569 875114 866247 854347 839138 820745 800008 778643 758520 740633 724960 711204
49921 711204 699270 689135 680750 674266 669975 667805 667068 666905 666871 667027 667635 668861 670671 672936 675712
49906 675712 679368 684279 690455 697666 705933 715582 726780 739303 752940 767866 784304 801881 819557
$$ packed form
49993A045035L5834L7414L7508L5754L2467K8598K4975K2056K0132J9088J7918
49982A356779J5250J0487M130l083j0832j8891k6718l3662l9207m2899m4436m4023
49970A122895m2242l9474l5858l1919k8582k6225k4251k2038j9792j7925j6128
49959H18461j3776j1022q593o734n024l204j372O88L432O588R087J0389J1175
49946H10095J2230J3203J3148J1806R714P409N226L553K568J756L97j495l284
49933H86326m757o455q867j1900j5209j8393k0737k1365k0123j7887j5673j3756
49921G11204j1934j0135q385o484m291k170p37j63l4J56O08J226J810K265K776
49906F75712L656M911O176P211Q267R649J1198J2523J3637J4926J6438J7577J7676
$$ plain form
49893 819557 836178 850916 863158 872295 877904 880161 879773 877243 872288 864219 852893 839064 823774
49880 823774 807700 791224 774761 758680 743133 728224 714203 701228 689232 678380 669351 662571
$$ packed form
49893H19557J6621J4738J2242R137N609K257l88k530m955q069j1326j3829j5290
49880H23774j6074j6476j6463j6081j5547j4909j4021j2975j1996j0852r029o780
$$ [...]
##END NTUPLES=NMR SPECTRUM
##END=
