
##TITLE=AC1302_PERAH12114_6535671_KetVU1Pe3j
##JCAMPDX= 6.0         $$ Bruker NMR JCAMP-DX V2.0
##DATA TYPE= NMR SPECTRUM
##DATA CLASS= NTUPLES
##ORIGIN= BRUKER
##OWNER= Administrator
$$ 1.72 TOPSPIN		Version 2.1
$$ 2012-07-16 15:07:53.953 -0500  Administrator@TOPSPIN
$$ Compression mode = diff/dup
##.OBSERVE FREQUENCY= 400.02188249412
##.OBSERVE NUCLEUS= ^1H
##.ACQUISITION MODE= SIMULTANEOUS (DQD)
##.ACQUISITION SCHEME= undefined
##.AVERAGES= 64
##.DIGITISER RES= 22
##SPECTROMETER/DATA SYSTEM= spect
##.PULSE SEQUENCE= noesygpps1d.comp
##.SOLVENT NAME= COFFEE_meoh
##.SHIFT REFERENCE= INTERNAL, COFFEE_meoh, 1, 14.96065
##AUDIT TRAIL= $$ (NUMBER, WHEN, WHO, WHERE, PROCESS, VERSION, WHAT)
$$ ##TITLE= Audit trail, TOPSPIN		Version 2.1
$$ ##JCAMPDX= 5.01
$$ ##ORIGIN= Bruker BioSpin GmbH
$$ ##OWNER= Administrator
$$ $$ C:\Bruker\TOPSPIN/data/COFFEE/nmr/AC1302_PERAH12114_6535671_KetVU1Pe3j/12/pdata/1/auditp.txt
$$ ##AUDIT TRAIL=  $$ (NUMBER, WHEN, WHO, WHERE, PROCESS, VERSION, WHAT)
(   1,<2012-07-16 15:07:47.859 -0500>,<Administrator>,<TOPSPIN>,<go>,<TOPSPIN 2.1>,
      <created by zg
	started at 2012-07-16 14:56:17.484 -0500,
	POWCHK enabled, PULCHK disabled,
       configuration hash MD5:
       6B 1B 68 BB D9 2E 58 E2 7F 35 AD 54 07 DF 0E 41
       data hash MD5: 64K
       A4 12 3D E5 18 A9 79 66 4D 6E 8E EF C5 11 CC A0>)
(   2,<2012-07-16 15:07:50.968 -0500>,<Administrator>,<TOPSPIN>,<proc1d>,<TOPSPIN 2.1>,
      <Start of raw data processing
       efp LB = 0.3 FT_mod = 6 PKNL = 1 PHC0 = 0 PHC1 = 0 SI = 128K 
       data hash MD5: 128K
       AC DE 6F 83 FC BD F2 FC 12 78 44 B4 60 8D 39 9E>)
(   3,<2012-07-16 15:07:52.109 -0500>,<Administrator>,<TOPSPIN>,<proc1d>,<TOPSPIN 2.1>,
      <pk PHC0 = -1.455688 PHC1 = 0 
       data hash MD5: 128K
       D0 A8 ED B7 B3 AF C0 52 7E EE B8 2A 50 9D 12 F4>)
(   4,<2012-07-16 15:07:52.921 -0500>,<Administrator>,<TOPSPIN>,<proc1d>,<TOPSPIN 2.1>,
      <abs ABSG = 1 
       data hash MD5: 128K
       9F 2F 00 5E A9 88 E3 B5 AA EB BC EE 49 3F 5F E4>)
(   5,<2012-07-16 15:07:53.062 -0500>,<Administrator>,<TOPSPIN>,<proc1d>,<TOPSPIN 2.1>,
      <abs ABSG = 2 
       data hash MD5: 128K
       44 D4 8E BD 29 68 34 FD 9F ED 9E 1C E2 A0 F2 6F>)
(   6,<2012-07-16 15:07:53.218 -0500>,<Administrator>,<TOPSPIN>,<proc1d>,<TOPSPIN 2.1>,
      <abs ABSG = 3 
       data hash MD5: 128K
       8E A2 9B 4B 6C 35 90 8E AC A7 1A 09 20 5C 72 7F>)
(   7,<2012-07-16 15:07:53.625 -0500>,<Administrator>,<TOPSPIN>,<proc1d>,<TOPSPIN 2.1>,
      <abs ABSG = 4 
       data hash MD5: 128K
       75 F8 53 5B 7A 05 F2 5B EC 3B B9 1A 6A D4 DE 81>)
(   8,<2012-07-16 15:07:53.765 -0500>,<Administrator>,<TOPSPIN>,<proc1d>,<TOPSPIN 2.1>,
      <abs ABSG = 5 
       data hash MD5: 128K
       7F BC 30 C9 99 09 59 C6 5B D3 39 BF 96 6E A2 B5>)
$$ ##END=
$$ 
$$ $$ hash MD5
$$ $$ DD 7B D3 3D 90 FE 96 4E AF 27 ED 57 B9 0F 2C FC
##$RELAX= 
##$RELAX= 
##$RELAX= 
##$RELAX= 
##$RELAX= 
##$RELAX= 
##$RELAX= 
##$RELAX= 
$$ Bruker specific parameters
$$ [...]
##$TP07= 0
##$TPNAME0= <>
##$TPNAME1= <>
##$TPNAME2= <>
##$TPNAME3= <>
##$TPNAME4= <>
##$TPNAME5= <>
##$TPNAME6= <>
##$TPNAME7= <>
##$TPOAL= (0..7)
0.5 0.5 0.5 0.5 0.5 0.5 0.5 0.5
##$TPOFFS= (0..7)
0 0 0 0 0 0 0 0
##$TUNHIN= 0
##$TUNHOUT= 0
##$TUNXOUT= 0
##$USERA1= <user>
##$USERA2= <user>
##$USERA3= <user>
##$USERA4= <user>
##$USERA5= <user>
##$V9= 5
##$VALIST= <valist>
##$VCLIST= <CCCCCCCCCCCCCCC>
##$VD= 0
##$VDLIST= <DDDDDDDDDDDDDDD>
##$VPLIST= <PPPPPPPPPPPPPPP>
##$VTLIST= <TTTTTTTTTTTTTTT>
##$WBST= 2048
##$WBSW= 25
##$XGAIN= (0..3)
0 0 0 0
##$XL= 0
##$YL= 0
##$YMAX_a= 11511945
##$YMIN_a= -9244175
##$ZGOPTNS= <>
##$ZL1= 120
##$ZL2= 120
##$ZL3= 120
##$ZL4= 120
##$ABSF1= 14.96065
##$ABSF2= -5.597531
##$ABSG= 5
##$ABSL= 3
##$ALPHA= 0
##$AQORDER= 0
##$ASSFAC= 0
##$ASSFACI= 0
##$ASSFACX= 0
##$ASSWID= 0
##$AUNMP= <proc_prof1d_extract.lims>
##$AXLEFT= 0
##$AXNAME= <>
##$AXNUC= <1H>
##$AXRIGHT= 0
##$AXTYPE= 0
##$AXUNIT= <>
##$AZFE= 0.1
##$AZFW= 0.1
##$BCFW= 0
##$BC_mod= 0
##$BYTORDP= 0
##$COROFFS= 0
##$CY= 15
##$DATMOD= 1
##$DC= 0
##$DFILT= <>
##$DTYPP= 0
##$F1P= 0
##$F2P= 0
##$FCOR= 0.5
##$FTSIZE= 131072
##$FT_mod= 6
##$GAMMA= 0
##$GB= 0
##$INTBC= 1
##$INTSCL= 1
##$ISEN= 128
##$LB= 0.3
##$LEV0= 0
##$LPBIN= 0
##$MAXI= 10000
##$MC2= 0
##$MEAN= 0
##$ME_mod= 0
##$MI= 0
##$NCOEF= 0
##$NC_proc= -2
##$NLEV= 6
##$NOISF1= 0
##$NOISF2= 0
##$NSP= 0
##$NTH_PI= 0
##$NZP= 0
##$OFFSET= 14.96065
##$PC= 1
##$PHC0= -1.455688
##$PHC1= 0
##$PH_mod= 1
##$PKNL= yes
##$PPARMOD= 0
##$PPDIAG= 0
##$PPIPTYP= 0
##$PPMPNUM= 2147483647
##$PPRESOL= 1
##$PSCAL= 4
##$PSIGN= 0
##$PYNMP= <proc.py>
##$REVERSE= no
##$SF= 400.020009774962
##$SI= 131072
##$SIGF1= 0
##$SIGF2= 0
##$SINO= 400
##$SIOLD= 131072
##$SPECTYP= <>
##$SREGLST= <1H.CDCl3>
##$SSB= 0
##$STSI= 131072
##$STSR= 0
##$SW_p= 8223.68421052631
##$SYMM= 0
##$S_DEV= 0
##$TDeff= 65536
##$TDoff= 0
##$TI= <>
##$TILT= no
##$TM1= 0
##$TM2= 0
##$TOPLEV= 0
##$USERP1= <user>
##$USERP2= <user>
##$USERP3= <user>
##$USERP4= <user>
##$USERP5= <user>
##$WDW= 1
##$XDIM= 131072
##$YMAX_p= 378725361
##$YMIN_p= -12934
##$CURPLOT= <Network HP LaserJet P1505>
##$CURPRIN= <$Network HP LaserJet P1505>
##$DFORMAT= <normdp>
##$LAYOUT= <+/1D_H.xwp>
##$LFORMAT= <normlp>
##$PFORMAT= <normpl>
##$SURQMSG= 1
$$ End of Bruker specific parameters
$$ ---------------------------------
##NTUPLES= NMR SPECTRUM
##VAR_NAME=  FREQUENCY,     SPECTRUM/REAL,   SPECTRUM/IMAG
##SYMBOL=    X,             R,               I
##VAR_TYPE=  INDEPENDENT,   DEPENDENT,       DEPENDENT
##VAR_FORM=  AFFN,          ASDF,            ASDF
##VAR_DIM=   131072,        131072,          131072
##UNITS=     HZ,            ARBITRARY UNITS, ARBITRARY UNITS
##FACTOR=    0.0627417313425164, 1,          1
##FIRST=     8223.62146879497, 1124,         -57285
##LAST=      0,             1678,            -57220
##MIN=       0,             -12934,          0
##MAX=       8223.62146879497, 378725361,    0
$$ Real data points
##PAGE= N=1
##DATA TABLE= (X++(R..R)), XYDATA
$$ [...]
63953F70652L2615L6302M1190M7739N5916O5311P5523Q6520R8409J10926J23571
63942A444674J36321J49658J63509J76609J87455J95758K02254K07106K09016
63933C072360K06243J98089J85105J68163J47809J24441R8707P1366M2870J3291
63923D328444j7197m7881p7602j05202j29690j50234j66388j78452j87159j92746
63913C075893j94723j92865j87995j81246j72901j62610j50635j38033j25542
63904A569343j13137j00935q9724p9993p1136o2343n3904m6839m1369l6606l1839
63893H41518k7420k4037k1635j9526j7293j5117j3238j1518r731q009o751o087
63881F61156n672n119m395l619k671j282N81K685M892P281R855J2448J4901J7073
$$ plain form
63953 670652 703267 739569 780759 828498 884414 949725 1025248 1111768 1210177 1321103 1444674
63942 1444674 1580995 1730653 1894162 2070771 2258226 2453984 2656238 2863344 3072360
63933 3072360 3278603 3476692 3661797 3829960 3977769 4102210 4200917 4272283 4315153 4328444
63923 4328444 4311247 4263366 4185764 4080562 3950872 3800638 3634250 3455798 3268639 3075893
63913 3075893 2881170 2688305 2500310 2319064 2146163 1983553 1832918 1694885 1569343
63904 1569343 1456206 1355271 1265547 1185554 1114418 1052075 998171 951332 909963 873357 841518
63893 841518 814098 790061 768426 748900 731607 716490 703252 691734 682003 673994 667243 661156
63881 661156 655484 650365 645970 642351 639680 638398 638979 641664 646556 653837 663692 676140 691041 708114
63867G08114J8653J9424J9850K0898K2949K5176K6353K6070K4878K3456K1930
63856I57751J9911J7022J3402R756O674L893O41l241p040j0261j3225j6205j8650
63843I60428k0078k1225k3335k6467k9347l0932l1347l1259l1064l0894l0667
63832F53813k9910k8130k5661k3624k2697k2388k1763k0490j8870j7281j5944
63821D07055j4965j4228j3378j2158j0687r317q339p841p541o910n786m821m728
63808B86356n146m934l783k751k701l000k477j184l74p80j747k193j838j273j115
63793B51060j380j608j478j262j491k251l045l414l409l209k724j876j051p38
63779B22124q56q19k79M91R45P78Q9p36j293j464j405j236q79l42J40L75M43M54
$$ plain form
63867 708114 726767 746191 766041 786939 809888 835064 861417 887487 912365 935821 957751
63856 957751 977662 994684 1008086 1017842 1024516 1028409 1029050 1025809 1018769 1008508 995283 979078 960428
63843 960428 940350 919125 895790 869323 839976 809044 777697 746438 715374 684480 653813
63832 653813 623903 595773 570112 546488 523791 501403 479640 459150 440280 422999 407055
63821 407055 392090 377862 364484 352326 341639 332322 323983 316142 308601 301691 295905 291084 286356
63808 286356 281210 276276 272493 269742 267041 264041 261564 260380 260006 259226 257479 255286 253448 252175 251060
63793 251060 249680 248072 246594 245332 243841 241590 238545 235131 231722 228513 225789 223913 222862 222124
63779 222124 221268 220449 220170 220661 221606 222384 222473 221737 220444 218980 217575 216339 215460 215118 215258 215633 216076 216530
63761B16530L18J5k16k24k55m92n95j64N05P46N12M46Q69J259J016K91k20j24
63743B20217L64P69P79M73K69N82J332J968K070J863J908K337K662K422J876J771
63727B43662K413L259L601L454L431L813M196M177L971M059M495M898M926M421
63713B98776L320J751J94q56j377j724k061k206k029j707j462j320j219j209j374
63698B85497j584j480q00K14Q90Q00L20K51Q32J565K066K630L570M489M738M358
63682C08356L892L460K667J454M37J18K18J09l63p64o68j33M01O71R19J514K216
63665C24504K274J454N03J94K73n5r16j784k483l330m188m308l407k228j700k045
63649C02758k964m122n030n047l996k425r52K64J122J284P46K81O42J608K416
$$ plain form
63761 216530 216848 216863 216647 216423 216168 215676 215081 214917 215422 216168 216680 217126 217995 219254 220270 220561 220341 220217
63743 220217 220581 221350 222129 222602 222871 223453 224785 226753 228823 230686 232594 234931 237593 240015 241891 243662
63727 243662 246075 249334 252935 256389 259820 263633 267829 272006 275977 280036 284531 289429 294355 298776
63713 298776 302096 303847 304041 303185 301808 300084 298023 295817 293788 292081 290619 289299 288080 286871 285497
63698 285497 283913 282433 281633 281847 282737 283537 283857 284108 284940 286505 288571 291201 294771 299260 303998 308356
63682 308356 312248 315708 318375 319829 320266 320384 320602 320711 320348 319584 318916 318783 319184 319855 320774 322288 324504
63665 324504 326778 328232 328735 328929 329202 329147 328231 326447 323964 320634 316446 312138 308731 306503 304803 302758
63649 302758 299794 295672 290642 285595 281599 279174 278222 278486 279608 280892 281638 281919 282561 284169 286585
63634B86585K842L251L698L760L309K923L255M263N239N546N273N277O337Q248
63620C49806R911J0498J0243R900R890J0353J1606J3796J6303J8209J9487K1074
63608E11076K3542K6237K8104K8975K9523L0096L0073K8602K5621K1858J7858
63597H01565J3565Q963M753J703l82k406m573o058o405o483p477r474j1805j4275
63583G61211j7167k0171k2321k3141k3149k2913k2294k0894j8833j6731j5150
63572E38447j4176j3288j1669q994n927l426j617J61K165L813M608M910N406O311
63558E06724P412Q523R469R986J0126J0541J1976J4512J7507K0239K2530K4865
63546F74410K7971L1932L5753L8167L8896L8477L6795L2706K5695J7167R258K839
$$ plain form
63634 286585 289427 292678 296376 300136 303445 306368 309623 313886 319125 324671 329944 335221 341558 349806
63620 349806 359717 370215 380458 390358 400248 410601 422207 436003 452306 470515 490002 511076
63608 511076 534618 560855 588959 617934 647457 677553 707626 736228 761849 783707 801565
63597 801565 815130 824093 828846 830549 830167 827761 823188 817130 810725 804242 796765 787291 775486 761211
63583 761211 744044 723873 701552 678411 655262 632349 610055 589161 570328 553597 538447
63572 538447 524271 510983 499314 490320 484393 480967 479350 479511 481676 485489 490097 495007 500413 506724
63558 506724 514136 522659 532128 542114 552240 562781 574757 589269 606776 627015 649545 674410
63546 674410 702381 734313 770066 808233 847129 885606 922401 955107 980802 997969 1007227 1010066
63534A010066k463o697r235r942r690r305q909q666r358j1571j4725j7701k0251
63521H71553k3123k6738l0313l2551l2950l2145l1109l0213k9125k7414k5084
63510E50788k2557k0296j8505j7072j5729j4344j3049j1989j0955r573p913o634
63498C82172o209o241n944n102m185l542k942k089j180o26m48k16L65J067J401
63483C46281J231R54J038J435J716J737J914K640L683M422M489L937K944J701
63469C80122N07l53q61j208j564k071k819l548l626k784j754j563k289l013l059
63454C50117k642k187j633p46L91J571K730L704M132L983L869M435N639O961Q072
63439C88396R080J0385J2519J5752J9568K2935K5432K7637K9965L1603L1242K8583
$$ plain form
63534 1010066 1007603 1000906 991671 981729 972039 962734 953825 945159 935801 924230 909505 891804 871553
63521 871553 848430 821692 791379 758828 725878 693733 662624 632411 603286 575872 550788
63510 550788 528231 507935 489430 472358 456629 442285 429236 417247 406292 396719 388806 382172
63498 382172 375963 369722 363778 358676 354491 350949 348007 345918 344738 344112 343664 343448 343813 344880 346281
63483 346281 347512 348466 349504 350939 352655 354392 356306 358946 362629 367051 371540 375477 378421 380122
63469 380122 380629 380276 379415 378207 376643 374572 371753 368205 364579 361795 360041 358478 356189 353176 350117
63454 350117 347475 345288 343655 342909 343300 344871 347601 351305 355437 359420 363289 367724 373363 380324 388396
63439 388396 397476 407861 420380 436132 455700 478635 504067 531704 561669 593272 624514 653097
63427F53097K4484J9849J5088J0621P104N041M554N559P752J0529J3469J6751
63415G93898K0611K4522K7596K9621L0901L1118K9409K5734K1195J6598J1638
63404A062841O129J048k485m601o222p670q770r987j2283j5739j9283k2069k4397
63391I36512k6936k9612l1685l2584l2252l1006k9379k7933k6864k5791k4120
63380F18350k1654j8796j6118j3832j1712r433o924m359j951P3J488K428L563
63367E21123N485P863R739J0829J1925J3655J5600J7199J8985K1910K5753K9220
63355G09286L1629L3561L5565L7098L7187L5579L2745K9211K5258K0932J5956
63344A044007J0063L820j293m169n286o127p575r300j0698j1901j3689j6604k0353
$$ plain form
63427 653097 677581 697430 712518 723139 730243 735284 739838 745397 753149 763678 777147 793898
63415 793898 814509 839031 866627 896248 927149 958267 987676 1013410 1034605 1051203 1062841
63404 1062841 1068970 1070018 1067533 1062932 1056710 1049040 1040270 1030283 1018000 1002261 982978 960909 936512
63391 936512 909576 879964 848279 815695 783443 752437 723058 695125 668261 642470 618350
63380 618350 596696 577900 561782 547950 536238 526805 519881 515522 513571 513644 515132 517560 521123
63367 521123 526608 534471 544210 555039 566964 580619 596219 613418 632403 654313 680066 709286
63355 709286 740915 774476 810041 847139 884326 919905 952650 981861 1007119 1028051 1044007
63344 1044007 1054070 1057890 1056597 1052428 1047142 1041015 1033440 1024140 1013442 1001541 987852 971248 950895
63331I50895k4039k6922k8863k9978l0095k9055k7407k6160k5498k4292k1389
63320F57197j6983j2236p962m435k277k542n496r851j3660j5823j6587j6856j7207
63307E15282j7484j7115j5880j4255j2917j1981j1040r891q793p963p191o254
63295C74518n355m813m525m075l368k782k571k456k082j700j956k869l514l096
63281C29356k153j989k880l536k780j110L7J61j3Q2J49j19l29j6N62P90N30J57
63263C16899P9N40J566K770L394L047K226J749J818K030K165K486L248M269N149
63248C53435N678N968O316O882P437P593P469P805R085J0836J2241J3301J4663
63235D68709J6424J7839J8461J8838J9681K0858K1783K2345K2827K3127K2817
$$ plain form
63331 950895 926856 899934 871071 841093 810998 781943 754536 728376 702878 678586 657197
63320 657197 640214 627978 620016 615581 613304 610762 605266 595415 581755 565932 549345 532489 515282
63307 515282 497798 480683 464803 450548 437631 425650 414610 404719 395926 387963 380772 374518
63295 374518 369163 364350 359825 355750 352382 349600 347029 344573 342491 340791 338835 335966 332452 329356
63281 329356 327203 325214 322334 318798 316018 314908 314945 315106 315093 315175 315324 315205 314876 314860 315422 316212 316742 316899
63263 316899 316978 317518 319084 321854 325248 328295 330521 332270 334088 336118 338283 340769 344017 348286 353435
63248 353435 359113 365081 371397 378279 385716 393309 400778 408583 417668 428504 440745 454046 468709
63235 468709 485133 502972 521433 540271 559952 580810 602593 624938 647765 670892 693709
63224F93709K1971K1364K1616K2536K3438K3787K3482K2865K2646K3335K4361
63213I45110K4183K1732J7655J3539J0019O244J358m206r286j3427j7081k0636
63201I75204k3802k6076k7283k7529k7037k6188k5284k4089k1957j8678j4890
63190G12391j1333q122n051k274%K188N020Q466J1641J3950J5760J7688J9628
63177G79952K0917K1164K0595J9774J9243J9211J9328J8930J7781J6367J5230
63166I88492J4237J2715J0138O295J186m762j0489j5001j8367k1565k5152k8557
63154I09170l0880l1998l2424l2524l2220l1345k9855k7764k5274k2858k0872
63143E91156j9100j7091j4991j3514j2888j2326j0977r039p409o439n642m595
$$ plain form
63224 693709 715680 737044 758660 781196 804634 828421 851903 874768 897414 920749 945110
63213 945110 969293 991025 1008680 1022219 1032238 1038482 1039840 1035634 1026348 1012921 995840 975204
63201 975204 951402 925326 898043 870514 843477 817289 792005 767916 745959 727281 712391
63190 712391 701058 692936 687885 685611 685611 687799 692819 701285 712926 726876 742636 760324 779952
63177 779952 800869 822033 842628 862402 881645 900856 920184 939114 956895 973262 988492
63166 988492 1002729 1015444 1025582 1031877 1033063 1028301 1017812 1002811 984444 962879 937727 909170
63154 909170 878290 846292 813868 781344 749124 717779 687924 660160 634886 612028 591156
63143 591156 572056 554965 539974 526460 513572 501246 490269 481230 473821 467382 461740 457145
63131D57145l484k539j558l76O05Q98O74N72Q65J271J532J734K040K470K960L327
63115D68136L286K866K761L598M867N238M205K733J992K003K139K260K597K900
63101E11581K659K020J686J823J858J530J356J741K222K132J535J060J043J300
63087E35546J529J524J120L58l02l05L99J302J937K345K946M022N403O575P136
63072E71535P196P261P680Q309Q786R045R412J0224J1516J3011J4420J5752J7328
63059G11475J9390K1738K3884K5611K7203K9123L1673L4940L8788M2698M5976
63048A052499M8400N0457N2644N4722N6003N6300N6102N5922N5846N5839N6054
63037A650788N6541N6994N7063N6803N6452N5825N4316N1444M7174M1547L4352
$$ plain form
63131 457145 453661 451122 449564 449188 449793 450691 451365 451937 452802 454073 455605 457339 459379 461849 464809 468136
63115 468136 471422 474288 477049 480647 485514 490752 494957 497690 499682 501685 503824 506084 508681 511581
63101 511581 514240 516260 517946 519769 521627 523157 524513 526254 528476 530608 532143 533203 534246 535546
63087 535546 537075 538599 539719 540077 539775 539470 539869 541171 543108 545453 548399 552421 557824 564399 571535
63072 571535 578731 585992 593672 601981 610767 619812 629224 639448 650964 663975 678395 694147 711475
63059 711475 730865 752603 776487 802098 829301 858424 890097 925037 963825 1006523 1052499
63048 1052499 1100899 1151356 1204000 1258722 1314725 1371025 1427127 1483049 1538895 1594734 1650788
63037 1650788 1707329 1764323 1821386 1878189 1934641 1990466 2044782 2096226 2143400 2184947 2219299
63026B219299K5445J5232M500o225j6867k7339l7219m6019n3540n9655o4031o6409
63014A887172o7004o6260o4234o0591n5260m8737m1673l4515k7600k1160j5035
63003A385103q765k268L957R536J4725J9797K4303K7604K9931L2161L4455L5849
62991A606388L5570L4281L3496L3920L4755L4579L2574K8872K4060J8588J2599
62980A929682O097r36q602j7027k6045l4906m2606m8641n3384n7536o1158o3497
62968A521441o3843o2469o0428n8349n5792n2075m7468m3100l9676l6871l4133
62957I67237l1538k9461k7776k6032k4182k2611k1454k0417j9279j8171j7189
62946G09127j6198j5195j4449j4056j3679j3051j2542j2723j3400j3482j2169
$$ plain form
63026 2219299 2244744 2259976 2264476 2258251 2241384 2214045 2176826 2130807 2077267 2017612 1953581 1887172
63014 1887172 1820168 1753908 1689674 1629083 1573823 1525086 1483413 1448898 1421298 1400138 1385103
63003 1385103 1376338 1374070 1378027 1387563 1402288 1422085 1446388 1473992 1503923 1536084 1570539 1606388
62991 1606388 1641958 1676239 1709735 1743655 1778410 1812989 1845563 1874435 1898495 1917083 1929682
62980 1929682 1935779 1934843 1926241 1909214 1883169 1848263 1805657 1757016 1703632 1646096 1584938 1521441
62968 1521441 1457598 1395129 1334701 1276352 1220560 1168485 1121017 1077917 1038241 1001370 967237
62957 967237 935699 906238 878462 852430 828248 805637 784183 763766 744487 726316 709127
62946 709127 692929 677734 663285 649229 635550 622499 609957 597234 583834 570352 558183
62935E58183j0059q686q797r440r096p547o014n375n011l956k559k082k794l440
62921D73327k892j546o42o57j017j074p71m09j69p3j64n32j147j765k061j985
62905D56423j867k010k272k324k204k249k485k523k223j944j912j755j111l26
62891D29218r1n01r87j099r50q52q74r17q76o31j8R38J877K285J957J255Q20R37
62873D31491J190R74K67l56n06m58o65j134j503j547j292q30l34o8j05j21J86
62856D25189N97N96Q9m04l30L86J356K101K337K180J955J777J379O48P9L09J204
62839D41448J858J609P10j28n44p36j040j529j951j942j349l47P98J948K928L331
62823D45064K847J798R31O88R64J572K481L404L754L385L002L334M127M494M159
$$ plain form
62935 558183 548124 539438 530641 521201 512105 504558 498544 493169 488158 484202 481643 479561 476767 473327
62921 473327 470435 468889 468247 467590 466573 465499 464728 464319 464150 464077 463913 463381 462234 460469 458408 456423
62905 456423 454556 452546 450274 447950 445746 443497 441012 438489 436266 434322 432410 430655 429544 429218
62891 429218 429127 428626 427639 426540 425590 424738 423864 422947 422071 421440 421422 422360 424237 426522 428479 429734 430554 431491
62873 431491 432681 433655 433922 433566 433060 432602 431937 430803 429300 427753 426461 425631 425297 425229 425124 425003 425189
62856 425189 425786 426382 426471 426067 425737 426123 427479 429580 431917 434097 436052 437829 439208 439856 439935 440244 441448
62839 441448 443306 444915 445625 445497 444953 444217 443177 441648 439697 437755 436406 436059 436857 438805 441733 445064
62823 445064 447911 449709 450640 451328 452292 453864 456345 459749 463503 466888 469890 473224 477351 481845 486004
62808D86004L794M058M795N376N557N669O143P069Q197R155R726J0028J0481J1457
62794E87509J2942J4543J5835J6733J7573J8816K0705K3110K5758K8587L1850
62783H13961L5796M0338M5137N0054N5367O1397O7949P4280P9656Q3883Q7203
62772A495021Q9718R0926Q9923Q6005P9185P0099N9439M7505L4362K0260N754
62761B168197q615k2504l5605m7437n7519o5665p2033p6882q0283q2102q2267
62750A537285q1091p9188p6890p3917o9873o5001o0094n5621n1330m6906m2546
62739H34828l8557l4788l0882k6948k3517k0892j8900j7181j5434j3491j1479
62728E82759r882q963q286p140n432l686k220q09P39K205L376M389N431O403P203
$$ plain form
62808 486004 489798 493856 498651 504027 509584 515253 521396 528465 536662 545817 555543 565571 576052 587509
62794 587509 600451 614994 630829 647562 665135 683951 704656 727766 753524 782111 813961
62783 813961 849757 890095 935232 985286 1040653 1102050 1169999 1244279 1323935 1407818 1495021
62772 1495021 1584739 1675665 1765588 1851593 1930778 2000877 2060316 2107821 2142183 2162443 2168197
62761 2168197 2159582 2137078 2101473 2054036 1996517 1930852 1858819 1781937 1701654 1619552 1537285
62750 1537285 1456194 1377006 1300116 1226199 1156326 1091325 1031231 975610 924280 877374 834828
62739 834828 796271 761483 730601 703653 680136 659244 640344 623163 607729 594238 582759
62728 582759 572877 563914 555628 548488 543056 539370 537150 536341 537080 539285 542661 547050 552481 558884 566087
62713E66087P965Q824R713J0702J2198J4515J7402K0360K3269K6393K9928L3836
62701G81192L8044M2496M7012N1378N5541N9557O3362O6819O9913P2662P4813
62690A422789P5762P4897P1931O6905N9941N1050M0260K7928J4772J486j1672
62679A896049k4609l6831m7467n5974o2486o7426p1080p3659p5258p5466p3507
62668A232286o9329o4269o0007n6946n4103n0504m6153m1599l7223l3184k9642
62657F89327k6669k4197k2226k0760j9417j7463j4694j1936j0269r827r841r731
62645D92297r594r476q829p246n420m593m951n206m147k188p93o29r32p12N8P06
62629D28345P33J24p87j378j079j36L63k39j145j061k0O25R9o69k35J604L772
$$ plain form
62713 566087 574052 582876 592589 603291 615489 630004 647406 667766 691035 717428 747356 781192
62701 781192 819236 861732 908744 960122 1015663 1075220 1138582 1205401 1275314 1347976 1422789
62690 1422789 1498551 1573448 1645379 1712284 1772225 1823275 1863535 1891463 1906235 1907721 1896049
62679 1896049 1871440 1834609 1787142 1731168 1668682 1601256 1530176 1456517 1381259 1305793 1232286
62668 1232286 1162957 1098688 1038681 981735 927632 877128 830975 789376 752153 718969 689327
62657 689327 662658 638461 616235 595475 576058 558595 543901 531965 521696 511869 502028 492297
62645 492297 482703 473227 464398 457152 451732 447139 442188 436982 432835 430647 429854 429225 428293 427581 427639 428345
62629 428345 429078 429202 428415 427037 425958 425822 426185 425946 424801 423740 423720 424345 424444 423775 423540 425144 428916
62612D28916N227N769N778N664N730O218P285Q880J0624J1958J2669J3269J4548
62599E42535J6649J8918K0775K2436K4503K7211L0394L3910L7569M0790M2829
62588H58519M3424M2883M1482L9131L5701L1319K6156K0089J2928M893l291j0785
62576A142449j7152k2446k6939l0751l3856l6317l8261l9625m0067l9367l7679
62565G79989l5301l2403k9281k6577k4761k3461k1830j9602j7331j5444j3630
62554E20368j1474r265p692o976o751o663o623o526o142n443m635l813k806j566
62540D33993m26K26M03N20R28J586K115K153J693J169J081J593K466L400M292
62525D57192N251O525Q342J0587J2621J3782J4287J5274J7639K1038K4348K6973
$$ plain form
62612 428916 434143 439912 445690 451354 457084 463302 470587 479467 490091 502049 514718 527987 542535
62599 542535 559184 578102 598877 621313 645816 673027 703421 737331 774900 815690 858519
62588 858519 901943 944826 986308 1025439 1061140 1092459 1118615 1138704 1151632 1156525 1153234 1142449
62576 1142449 1125297 1102851 1075912 1045161 1011305 974988 936727 897102 857035 817668 779989
62565 779989 744688 712285 683004 656427 631666 608205 586375 566773 549442 533998 520368
62554 520368 508894 499629 491937 484961 478210 471547 464924 458398 452256 446813 442178 438365 435559 433993
62540 433993 433567 433793 434196 434716 435644 437230 439345 441498 443191 444360 445441 447034 449500 452900 457192
62525 457192 462443 468968 477310 487897 500518 514300 528587 543861 561500 582538 606886 633859
62513F33859K9301L1929L4963L8182M1325M3977M5465M5351M3881M1592L8613
62502A068438L4603K9349K3087J6319R562L258k484q020j3666j8901k2537k3935
62490A095073k3682k2662k0896j7893j3881r895o452k875J743P297J2896J7903
62478A016676K2202K5621K7735K8400K8000K6909K4956K1744J7302J2187O845
62467A258577J076n721j3648k1776k8762l4048l8186m1839m4821m6518m6929m6676
62455H90729m6010m4480m1795l8416l5017l1742k8411k5009k1633j8254j4990
62444E44972j2286j0361q735o794m691l052j959q64M86J712K435K715K646K111
62430E08335J207L72j86q30j926l309m570n548o247o662o985p560q269q409p640
$$ plain form
62513 633859 663160 695089 730052 768234 809559 853536 899001 944352 988233 1029825 1068438
62502 1068438 1103041 1132390 1155477 1171796 1181358 1184616 1182132 1174112 1160446 1141545 1119008 1095073
62490 1095073 1071391 1048729 1027833 1009940 996059 986164 979712 976837 978580 985877 998773 1016676
62478 1016676 1038878 1064499 1092234 1120634 1148634 1175543 1200499 1222243 1239545 1251732 1258577
62467 1258577 1259653 1253932 1240284 1218508 1189746 1155698 1117512 1075673 1030852 984334 937405 890729
62455 890729 844719 800239 758444 720028 685011 653269 624858 599849 578216 559962 544972
62444 544972 532686 522325 513590 506796 502105 499053 497094 496230 496716 498428 500863 503578 506224 508335
62430 508335 509542 509914 509728 508898 506972 503663 499093 493545 487298 480636 473651 466091 457822 449413 441773
62415D41773o608o070n798n096m059l472l504l496l145l007l409l675l066j943
62401C85425j250j166r84l15L02K20k81k27R10K554L656L805L489L233K900K140
62385D04411J221Q59J244J832K260K833L807M750N143N122N160N276N270N401
62371D54589O176P482Q617R301J0007J1149J2534J3858J5248J6952J8928K1084
62359F05925K3611K6692L0131L3641L7293M1320M5579M9539N2691N4691N5183
62348A056296N3865N0780M6246M0504L3609K5766J7590R932L270k747r061j6182
62336A309868k3453k9625l4191l7666m0466m2153m2223m1055l9433l7495l4905
62325I07203l1803k8811k6164k3641k1343j9822j9204j8945j8613j8239j7828
$$ plain form
62415 441773 435165 429095 423297 418201 414142 410670 407166 403670 400525 397518 394109 390434 387368 385425
62401 385425 384175 383009 382025 381710 382012 382232 381951 381724 382634 385188 388844 392649 396138 399371 402271 404411
62385 404411 405632 406491 407735 409567 411827 414660 418467 423217 428360 433482 438642 443918 449188 454589
62371 454589 460765 468247 476864 486165 496172 507321 519855 533713 548961 565913 584841 605925
62359 605925 629536 656228 686359 720000 757293 798613 844192 893731 946422 1001113 1056296
62348 1056296 1110161 1160941 1207187 1247691 1281300 1307066 1324656 1334588 1337858 1335111 1326050 1309868
62336 1309868 1286415 1256790 1222599 1184933 1144467 1102314 1060091 1019036 979603 942108 907203
62325 907203 875400 846589 820425 796784 775441 755619 736415 717470 698857 680618 662790
62314F62790j7180j6511j6372j6698j6676j5992j5325j5001j4184j2260j0203
62303D96388r335r258q416o427m574l814l593l041k249j772j638j493j215q85
62289D38678n06j25J41M64J255K487L510L867L868M061M511M939N173N150M822
62274D82295M383M200M284M275M231M866O493Q354R583J0414J1650J3374J5041
62261E83443J6659J8947K2138K5546K8597L1693L5642M0552M5671N0070N3227
62250I52185N5141N6038N5959N4580N1499M6682M0411L3006K4781J6272Q077L91
62238A395022p096j4755k2677l0667l8357m5118n0172n2936n3461n2516n1186
62227I76081n0057m8696m6202m2430l8337l4812l1637k8106k4358k1321j9416
$$ plain form
62314 662790 645610 629099 612727 596029 579353 563361 548036 533035 518851 506591 496388
62303 496388 487053 477795 469379 462952 458378 454564 450971 447930 445681 443909 442271 440778 439563 438678
62289 438678 438172 438047 438188 438652 439907 442394 445904 449771 453639 457700 462211 467150 472323 477473 482295
62274 482295 486678 490878 495162 499437 503668 508534 515027 523381 532964 543378 555028 568402 583443
62261 583443 600102 619049 641187 666733 695330 727023 762665 803217 848888 898958 952185
62250 952185 1007326 1063364 1119323 1173903 1225402 1272084 1312495 1345501 1370282 1386554 1394631 1395022
62238 1395022 1387926 1373171 1350494 1319827 1281470 1236352 1186180 1133244 1079783 1027267 976081
62227 976081 926024 877328 831126 788696 750359 715547 683910 655804 631446 610125 590709
62216E90709j7991j6220j3987j1659r531p815o763o380o207n704m742l527k248
62203D77935r93J08Q84J353J818K727M261O069P510Q306Q753R152R421R579J0221
62188E57104J1842J3810J4786J4284J3158J2422J2095J1608J0695R533Q314P176
62176F96827O234N374M206K565R65K50R30K907N587Q240J0541J3044J6734K1784
62162G96188K7100L1331L4096L5889L7169L7815L7332L5219L1339K6186K0590
62151A150254J4914Q878K399l863r196j3702j7943k2047k5718k8904l1719l3816
62139I89537l4572l3924l2487l0694k8384k5394k2006j8577j5144j1683q425n650
62127G22597l438j802p42M0J152K844M555N506N675N793O347O943O808N749M316
$$ plain form
62216 590709 572718 556498 542511 530852 521321 513506 506743 500363 494156 488452 483710 480183 477935
62203 477935 476942 477050 477934 479287 481105 483832 488093 494162 501672 509978 518731 527883 537304 546883 557104
62188 557104 568946 582756 597542 611826 624984 637406 649501 661109 671804 681337 689651 696827
62176 696827 703061 708435 712641 715206 716171 716421 717351 720258 725845 734085 744626 757670 774404 796188
62162 796188 823288 854619 888715 924604 961773 999588 1036920 1072139 1103478 1129664 1150254
62151 1150254 1165168 1174046 1176445 1172582 1163386 1149684 1131741 1109694 1083976 1055072 1023353 989537
62139 989537 954965 921041 888554 857860 829476 804082 782076 763499 748355 736672 728247 722597
62127 722597 719159 717357 716615 716655 717807 720651 725206 730712 736387 742180 748527 755470 762278 768027 772343
62112G72343L053J912N59r39k061k486k516k774l624n016o589p794q151p699o999
62097G21219o436n694m207k090j53J001J590K281L403M733N828O491O892P343
62083G42201P955Q608R228R958J0959J2182J3441J4573J5441J5972J6325J6850
62071H93693J7712J8787J9923K1012K1776K1943K1889K2411K3564K4381K4353
62060A131444K4464K5768K7547K8004K6643K4615K2705K0302J6735J2426Q056
62049A368709L577j222o049j0774j5983k1896k7430l1359l3977l6570l9462m1711
62037A105853m2673m2760m2409m1320l9234l6705l4524l2717l0622k7810k4576
62026G10503k1632j9531j8229j7110j5519j3404j1324r872r179q940q743q385
$$ plain form
62112 772343 775396 777308 777867 776928 774867 772381 769865 767091 763467 758451 751862 744068 735917 728218 721219
62097 721219 714783 709089 704882 702792 702639 703640 705230 707511 710914 715647 721475 727966 734858 742201
62083 742201 750156 758764 767992 777950 788909 801091 814532 829105 844546 860518 876843 893693
62071 893693 911405 930192 950115 971127 992903 1014846 1036735 1059146 1082710 1107091 1131444
62060 1131444 1155908 1181676 1209223 1237227 1263870 1288485 1311190 1331492 1348227 1360653 1368709
62049 1368709 1372286 1371064 1365015 1354241 1338258 1316362 1288932 1257573 1223596 1187026 1147564 1105853
62037 1105853 1063180 1020420 978011 936691 897457 860752 826228 793511 762889 735079 710503
62026 710503 688871 669340 651111 634001 618482 605078 593754 583882 574703 565763 557020 548635
62014E48635q023p985q295q472q073p237o422n686m745l616k687k025j152K15
62000D74432J605K336K333K124K146K419K756K998L041K808K242J294pj470k860
61985D98197m117n259o079o236n876n740o330p162p270o437n455n110n217m917
61971D16992l759k248j301j303j757j835j213l04K89M48N26P85J028Q85L43j84
61955D07392l05n9K27M30Q52J870L398M848N588N461M858M448M734N792P334R046
61939D65914J0774J2401J3711J4563J5116J5592J5858J5672J5272J5300J5856
61928F26029J6087J5211J3551J2014J0770R158O902M628K866J241p92k922m345
61915G10398m866m938m764m078k880j634m88J018L149N415P311R042J0887J2268
$$ plain form
62014 548635 540612 532627 524332 515860 507787 500550 494128 488442 483697 480081 477394 475369 474217 474432
62000 474432 476037 478373 480706 482830 484976 487395 490151 493149 496190 498998 501240 502534 502527 501057 498197
61985 498197 494080 488821 482742 476506 470630 464890 458560 451398 444128 437691 432236 427126 421909 416992
61971 416992 413233 410985 409684 408381 406624 404789 403576 403272 403561 404009 404535 405320 406348 407233 407576 407392
61955 407392 407087 407028 407255 407685 408537 410407 413805 418653 424241 429702 434560 439008 443742 449534 456868 465914
61939 465914 476688 489089 502800 517363 532479 548071 563929 579601 594873 610173 626029
61928 626029 642116 657327 670878 682892 693662 702820 709722 714350 717216 718457 717665 714743 710398
61915 710398 705532 700594 695830 691752 688872 687238 686750 687768 690917 696332 703643 712685 723572 735840
61901G35840J2263J0969R418Q106O377L580J12l128n813q171j0274j1989j3398
61888G33892j4679j5598j5661j4836j3675j2704j2038j1608j1364j1163j0820
61877E89746j0426j0271j0284r975r207q578q667r113r001p999o655n486m326
61864D79758k803j061L80J307J960K591L284M225N690P581R371J0808J2378J4662
61850E50131J7462K0082K2309K4468K6488K7677K7735K7253K6804K6085K4556
61839H21050K2313J9607J5999J1029N497R94j924m107o158p511p560o710n546
61826H56973l782r91K262M944O941Q881J0786J1820J1494J0194Q362N893K647
61813I36424j084n017r194j3505j7315k0063k1952k3632k5342k6741k7394k7125
$$ plain form
61901 735840 748103 759072 768490 776596 782973 786553 786665 783537 777724 769553 759279 747290 733892
61888 733892 719213 703615 687954 673118 659443 646739 634701 623093 611729 600566 589746
61877 589746 579320 569049 558765 548790 539583 531005 522338 513225 504224 496225 489570 484084 479758
61864 479758 476955 475894 476274 477581 479541 482132 485416 489641 495331 502912 512283 523091 535469 550131
61850 550131 567593 587675 609984 634452 660940 688617 716352 743605 770409 796494 821050
61839 821050 843363 862970 878969 889998 895495 896489 894565 890458 884300 876789 869229 862519 856973
61826 856973 853191 852200 854462 859406 866347 875228 886014 897834 909328 919522 927884 933777 936424
61813 936424 935340 930323 921129 907624 890309 870246 848294 824662 799320 772579 745185 718060
61801G18060k5968k4175k2256k0712j9524j8106j5942j3271j1044j0032j0026
61790E27004j0042r373q312p664p692p786p224n999m776m146m051l971l587l151
61776D39230l032l078k711j751q06n39q87j221j071l88N63J223R38k54j257r68
61760D23991L78J582K027K206K605K944K826K443K168K035J951K004K102J822
61746D53084J035K73Rj6k99q44j375j891k482k912k934k748k580k172j244j89
61730D32715L39L53L83O41R70J446K213K834K663J896J440J610J803J704J925
61715D54935K907L951M013L022J809J055Q24R07J023Q05M4j019j919k515l029
61700D66813l605m057m069l494k494j496r53j059j612k233k568k493k213k146
$$ plain form
61801 718060 692092 667917 645661 624949 605425 587319 571377 558106 547062 537030 527004
61790 527004 516962 507589 499277 491613 483921 476135 468911 462912 458136 453990 449939 445968 442381 439230
61776 439230 436198 433120 430409 428658 427852 427313 426426 425205 424134 423746 424309 425532 426470 426216 424959 423991
61760 423991 424369 425951 427978 430184 432789 435733 438559 441002 443170 445205 447156 449160 451262 453084
61746 453084 454119 454392 454401 454385 454086 453242 451867 449976 447494 444582 441648 438900 436320 434148 432904 432715
61730 432715 433054 433407 433790 434431 435401 436847 439060 441894 444557 446453 447893 449503 451306 453010 454935
61715 454935 457842 461793 465806 468828 470637 471692 472516 473423 474446 475251 475295 474276 472357 469842 466813
61700 466813 463208 459151 455082 451588 449094 447598 446645 445586 443974 441741 439173 436680 434467 432321
61686D32321k456k786k727k434k382k554k326j325L9J073J409J017M3j048j605
61671D14259j436j072j055j282j357j260j211j113o56J00O54O75L18m9k18k32
61655D05065k49l43l46jO37J156J295J259J355J508J426J090P86P58J052J596
61639D18044K199K548K469K043J407N90k48p68r34j225j964k733k919k644k506
61624D13359k595k381j751j334j581k051k074j720j576j757j705j075l15j53o79
61609C90612j331j726k160l038m101m619m353l884l818m029l972l497l010k944
61595C44130l360l958m269l949l097k219j729j663j896k400k972l174k810k260
61581C04374j955j868j865k140k762l127k640j665j049q56m69J60L28j42m56j12
$$ plain form
61686 432321 429865 427079 424352 421918 419536 416982 414656 413331 413370 414443 415852 416869 416912 415864 414259
61671 414259 412823 411751 410696 409414 408057 406797 405586 404473 403817 403917 404571 405246 405564 405515 405297 405065
61655 405065 404816 404473 404127 404126 404763 405919 407214 408473 409828 411336 412762 413852 414638 415396 416448 418044
61639 418044 420243 422791 425260 427303 428710 429300 429052 428284 427350 426125 424161 421428 418509 415865 413359
61624 413359 410764 408383 406632 405298 403717 401666 399592 397872 396296 394539 392834 391759 391444 391291 390612
61609 390612 389281 387555 385395 382357 378256 373637 369284 365400 361582 357553 353581 350084 347074 344130
61595 344130 340770 336812 332543 328594 325497 323278 321549 319886 317990 315590 312618 309444 306634 304374
61581 304374 302419 300551 298686 296546 293784 290657 288017 286352 285303 284447 283978 284138 284466 284324 283868 283756
61565B83756K77l8q29j407j591j499r34K07J233J270M97qL88J194J627J500J124
61548B86767Q24P27Q06Q69O88K72q1j08J69N12P13P57P95R00Q91N77J60J33N71
61529B96942Q94O35J21j4K45L18o4n29o91o53p11q99j108j360j686j927j863j480
61511B86170j007p18p59j036j157o96L59J442J829J203j09j360j829j264q5Q83
61495B81866J056N06k21o26n39o9N56J095J354J245P71M4o79j020p29J1O28O63
61477B85912K77J21O55J639K399K509K090J521J060P86P06P59Q38R30J112J270
61461C04584J002Pj397k423k579k058j372p44r5O19J245J620J693J458R97N44
61445C03101L46L87M63N57Q51J229J126K71o52n41Q69K699L891M090L532K537
$$ plain form
61565 283756 284033 283995 283166 281759 280168 278669 277735 277942 279175 280445 280942 280934 281322 282516 284143 285643 286767
61548 286767 287591 288318 289124 289993 290681 290953 290872 290764 290933 291445 292158 292915 293710 294610 295501 296078 296238 296371 296942
61529 296942 297836 298471 298592 298578 298823 299141 299077 298548 297857 297204 296493 295594 294486 293126 291440 289513 287650 286170
61511 286170 285163 284445 283686 282650 281493 280797 281156 282598 284427 285630 285521 284161 282332 281068 280983 281866
61495 281866 282922 283428 283207 282581 282042 281973 282529 283624 284978 286223 286994 287038 286359 285339 284610 284621 285249 285912
61477 285912 286189 286310 286965 288604 291003 293512 295602 297123 298183 298969 299675 300434 301272 302202 303314 304584
61461 304584 305586 305593 304196 301773 299194 297136 295764 295020 294925 295544 296789 298409 300102 301560 302557 303101
61445 303101 303447 303834 304297 304854 305705 306934 308060 308331 307679 307138 308007 310706 314597 318687 322219 324756
61429C24756J479Q13P80J153J566J897K128K089J735J416J459J644J550J303J439
61414C47207K027K482K343J789J235P91L82j3l71o73p85n77l12m70j115j711j860
61397C50369j835k065k416k356j667o66J79O41Q31J069J485J727J318M45j02m6
61381C46911j08q45j496q21J096K741L013K373J901J854J709J111K74m21p62p08
61365C57822m01j05N6K58O64J077J194J058R97J145J367J667K311L380M490N185
61349C82165N423N503N646N870O147O409O486O250N788N268M733M281M221M685
61335D58875N162M910L903K831K082J368O49O36J673K700K338P41o14r78j150
61320D85126j944k873k976k222j325n62L51J390K057K198K399L222M440N347N708
$$ plain form
61429 324756 326235 327048 327828 328981 330547 332444 334572 336661 338396 339812 341271 342915 344465 345768 347207
61414 347207 349234 351716 354059 355848 357083 357874 358256 358243 357872 357199 356414 355837 355525 355055 353940 352229 350369
61397 350369 348534 346469 344053 341697 340030 339364 339543 340184 341015 342084 343569 345296 346614 347059 346957 346911
61381 346911 346803 345958 344462 343641 344737 347478 350491 352864 354765 356619 358328 359439 359713 359292 358530 357822
61365 357822 357421 357316 357372 357630 358294 359371 360565 361623 362620 363765 365132 366799 369110 372490 376980 382165
61349 382165 387588 393091 398737 404607 410754 417163 423649 429899 435687 440955 445688 449969 454190 458875
61335 458875 464037 468947 472850 475681 477763 479131 479780 480416 482089 484789 487127 487868 487254 486276 485126
61320 485126 483182 480309 477333 475111 473786 473224 473575 474965 477022 479220 481619 484841 489281 494628 500336
61305E00336O068P030Q435R536R944J0106J0477J0639R698P548N069L044J486
61292E99416K06o89j351k465m296n925o336n918n972o833p484p181o483o225o220
61277E26244n767m875m150l725l033j814o56k05k62l1Q25J786K160J917J722K210
61261E12346L336M443M939M882M836N171N627N712N431N294N577N863N599M792
61247E83848L880L096K339J628J165R32N49k54j327k295k894l003k664k191j986
61232E80823k099k175j921j441r62m66K82J402K680L681M141M357M916N811O196
61217F05225N504M464M257M884N240M845M459M669M948M613L891L314K786K036
61203F65135J403J382J790K180K646L471M344M750M923N573O832Q204R323J0106
$$ plain form
61305 500336 506404 513434 521869 531405 541349 551455 561932 572571 582269 589817 594886 597930 599416
61292 599416 599622 598933 597582 595117 590821 584896 578560 572642 566670 559837 552353 545172 538689 532464 526244
61277 526244 520477 515602 511452 507727 504694 502880 502224 502019 501757 501726 502551 504337 506497 508414 510136 512346
61261 512346 515682 520125 525064 529946 534782 539953 545580 551292 556723 562017 567594 573457 579056 583848
61247 583848 587728 590824 593163 594791 595956 596888 597437 597183 595856 593561 590667 587664 585000 582809 580823
61232 580823 578724 576549 574628 573187 572225 571759 572041 573443 576123 579804 583945 588302 593218 599029 605225
61217 605225 610729 615193 619450 624334 629574 634419 638878 643547 648495 653108 656999 660313 663099 665135
61203 665135 666538 667920 669710 671890 674536 678007 682351 687101 692024 697597 704429 712633 721956 732062
61189G32062J0359R965R353R015Q745Q042O981N893M436K149k40j301q39k88p94
61174H03538j962k881l382l699l745l530l639m529n815o850p614q442r273r719
61160G28458r666r342r017r027r660j0626j0975j0121q673p668p263o755n725
61147F13940m485l404k539k050k367l555m879n483n331n172n554o252o613o254
61133E50002n177l581j808l81L55O49J065J771K473L149M279O039P815R016R930
61118E85596J1241J2998J4720J6269J7911J9566K0689K1029K1011K1226K1883
61107G84139K2722K3203K2903K2042K1299K0764J9533J6981J3955J1758J0338
61096I89637Q454N527K166j101m388p585j0067j1687j3066j4545j5763j6656j7763
$$ plain form
61189 732062 742421 752386 761739 770754 779499 787541 794522 800415 804851 807000 806760 805459 804620 804332 803538
61174 803538 801576 798695 795313 791614 787869 784339 780700 776171 770356 763506 755892 747450 738177 728458
61160 728458 718792 709450 700433 691406 681746 671120 660145 650024 641351 633683 626420 619665 613940
61147 613940 609455 606051 603512 601462 599095 595540 590661 585178 579847 574675 569121 562869 556256 550002
61133 550002 544825 541244 539436 539055 539410 540059 541124 542895 545368 548517 552796 558835 566650 575666 585596
61118 585596 596837 609835 624555 640824 658735 678301 698990 720019 741030 762256 784139
61107 784139 806861 830064 852967 875009 896308 917072 936605 953586 967541 979299 989637
61096 989637 998091 1003618 1005784 1004683 1000295 992710 982643 970956 957890 943345 927582 910926 893163
61083H93163j9157k0055k0068j9832j9822j9521j8512j7377j6609j5603j3747
61072F92860j1701j0455r700q434o681n401m909m504l659k519j248J39J277J714
61058F26779J801K522M144N819O766P243P996R176J0277J0873J1101J1476J2345
61045G28318J3629J5107J6744J8577K0386K1942K3557K5773K8408L0645L2272
61034I75358L4088L6607L9207M1152M2798M4898M7257M9014M9926N0673N1951
61023A462929N4064N7157O1253O6076P1342P7136Q3757R1344R9909J09405J19842
61012B354214J32162J48913J72899K04940K44650K94027L58177M41272N44163
61003D895417O67966Q16805R92112J184450J374487J540162J656069J685962J589859
$$ plain form
61083 893163 874006 853951 833883 814051 794229 774708 756196 738819 722210 706607 692860
61072 692860 681159 670704 661004 652570 645889 640488 635579 631075 627416 624897 623649 623788 625065 626779
61058 626779 628580 631102 635246 641065 647831 655074 663070 672246 682523 693396 704497 715973 728318
61045 728318 741947 757054 773798 792375 812761 834703 858260 884033 912441 943086 975358
61034 975358 1009446 1046053 1085260 1126412 1169210 1214108 1261365 1310379 1360305 1410978 1462929
61023 1462929 1516993 1574150 1635403 1701479 1772821 1849957 1933714 2025058 2124967 2234372 2354214
61012 2354214 2486376 2635289 2808188 3013128 3257778 3551805 3909982 4351254 4895417
61003 4895417 5563383 6380188 7372300 8556750 9931237 11471399 13127468 14813430 16403289
60994A6403289J355361J026276O91356M34450K90204K42009K50435K73219K62792
60985B1229391J65990n2040l76718p42664j070389j308564j447360j502860j496920
60976A3397866j447932j368987j267640j148411j017683q85179p59833o46204
60968D855997n45906m60214l89350l31047k82208k41394k08185j81080j57947
60959B058666j38004j21612j08224r6198q4679p4266o5634n8449n1978m6011m0887
60948A172724l7092l4759l3253l1524k9214k7009k5376k3621k0954j7973j6000
60937H75949j5330j5079j4595j4030j3536j2899j2124j1569j1375j1322j1317
60926G32773j1403j1313j0694r732q955q422p782p107o880p056o894n993m849
$$ plain form
60994 16403289 17758650 18784926 19476282 19910732 20200936 20442945 20693380 20966599 21229391
60985 21229391 21395381 21343341 20966623 20223959 19153570 17845006 16397646 14894786 13397866
60976 13397866 11949934 10580947 9313307 8164896 7147213 6262034 5502201 4855997
60968 4855997 4310091 3849877 3460527 3129480 2847272 2605878 2397693 2216613 2058666
60959 2058666 1920662 1799050 1690826 1594628 1509949 1435683 1370049 1311600 1259622 1213611 1172724
60948 1172724 1135632 1100873 1067620 1036096 1006882 979873 954497 930876 909922 891949 875949
60937 875949 860619 845540 830945 816915 803379 790480 778356 766787 755412 744090 732773
60926 732773 721370 710057 699363 689631 680676 672254 664472 657365 650485 643429 636535 630542 625693
60913F25693m098l779l543l121k293r59N36J516J756J803K323L465M950O387P301
60898F37937P442P316P959R734J1686J2564J2251J1738J1839J2421J2929J3140
60886G68956J3213J3265J3217J3014J2765J2570J2374J2040J1549J1005J0493
60875I04461J0019R506Q776P667O303N079M087K804P66j612l425m550n742p364
60861I36775q732r230r413j0259j1797j3175j3856j4116j4416j4937j5630j6176
60849G85038j6033j5040j3975j3828j4515j4894j4206j2944j2077j1947j2223
60838F33356j2542j2790j2952j2999j2933j2788j2592j2289j1717j0805r876r398
60826D89675r207q381o379m087l046l631m639m750l843k669j815j362j128q97
$$ plain form
60913 625693 621595 617816 614273 611152 608859 607900 608436 609952 611708 613511 615834 619299 624249 630636 637937
60898 637937 645379 652695 660654 670388 682074 694638 706889 718627 730466 742887 755816 768956
60886 768956 782169 795434 808651 821665 834430 847000 859374 871414 882963 893968 904461
60875 904461 914480 923986 932762 940429 946732 951811 955898 958702 959468 957856 954431 949881 944139 936775
60861 936775 928043 918813 909400 899141 887344 874169 860313 846197 831781 816844 801214 785038
60849 785038 769005 753965 739990 726162 711647 696753 682547 669603 657526 645579 633356
60838 633356 620814 608024 595072 582073 569140 556352 543760 531471 519754 508949 499073 489675
60826 489675 480468 472087 465708 461621 458575 454944 450305 445555 441712 439043 437228 435866 434738 433841
60812D33841n55k14j12k76m89o07o11m51j25K9l29q61p42K08J119J101L27k85
60794D30968j44O28J541J976J392j49j737k381k075j705j884k295k315j888j513
60779D18419j587k023k480k732k744k549k208j869j721j852k140k398k492k302
60765C87322j716q48j46j05p84j769k538k743k330j623j211j341j487r03L38J265
60749C69381J205O09L86P51J219J543K042K943L818L970L215K036J005K54m27
60734C93950j125j599j631j408j377j713k132k281k189k196k557l174l662l631
60720C63275l035k335k151k620l181l186k654k296k760l861m597l988k034R6J017
60705C25690L65r82j908k067j808j438r49l32K13M75M16R6l60p16p60n77m64m96
$$ plain form
60812 433841 433286 433072 432960 432684 432195 431588 430977 430526 430401 430430 430101 429240 428498 428706 429825 430926 431253 430968
60794 430968 430824 431452 432993 434969 436361 436212 434475 432094 430019 428314 426430 424135 421820 419932 418419
60779 418419 416832 414809 412329 409597 406853 404304 402096 400227 398506 396654 394514 392116 389624 387322
60765 387322 385606 384758 384612 384507 383723 381954 379416 376673 374343 372720 371509 370168 368681 367778 368116 369381
60749 369381 370586 371195 371581 372332 373551 375094 377136 380079 383897 387867 391082 393118 394123 394377 393950
60734 393950 392825 391226 389595 388187 386810 385097 382965 380684 378495 376299 373742 370568 366906 363275
60720 363275 360240 357905 355754 353134 349953 346767 344113 341817 339057 335196 330599 326611 324577 324673 325690
60705 325690 326055 325073 323165 321098 319290 317852 316903 316571 316784 317259 317675 317771 317411 316695 315935 315358 314894 314398
60687C14398l63J46Q04J319J827K657L662M160L705K670J940K117L064M066M420
60672C50592M029L455L260L357L267K932K793K924K705J728N89J37K68J61m12
60657C81785p47l00N62J167J386J472J541J556J507J354J021P00P58J142J242
60642C96146O94r4o11j040j858k958l770m090m209m353m485m599m650m296l254
60627C52573j977j268j219j152o94k76l06n04m88m15n53o48l58M7O6j72p4M81
60609C43063R81J147J256J440J279M71n12r35p04l05M2O39J641K655L133K929
60593C58220K276J483Q15M34K11j45n71n33K19J052J102M27p6J26O66J034J268
60576C68008J513J508J067P24J280K827M649O083P119Q094R146J0013J0280R849
$$ plain form
60687 314398 314035 314181 314985 316304 318131 320788 324450 328610 332315 334985 336925 339042 342106 346172 350592
60672 350592 354621 358076 361336 364693 367960 370892 373685 376609 379314 381042 381631 381768 382036 382197 381785
60657 381785 381038 380738 381300 382467 383853 385325 386866 388422 389929 391283 392304 393004 393762 394904 396146
60642 396146 396840 396746 396135 395095 393237 390279 386509 382419 378210 373857 369372 364773 360123 355827 352573
60627 352573 350596 349328 348109 346957 346263 345987 345681 345177 344689 344274 343721 343073 342715 342762 342828 342656 342582 343063
60609 343063 344044 345191 346447 347887 349166 349637 349125 348190 347486 347181 347223 347862 349503 352158 355291 358220
60593 358220 360496 361979 362794 363228 363439 363294 362723 362190 362409 363461 364563 364990 364914 365040 365706 366740 368008
60576 368008 369521 371029 372096 372820 374100 376927 381576 387659 394778 402872 412018 422031 432311 442160
60562D42160R166Q748Q365P140M678J784m15j718k687l590m102l988l402k529
60548D59610j480n62m6L64J286K787M320N666P210R131J0910J2049J2647J2818
60534E36710J2120J0169P471N031L295J946N24j137k917m351m788m093l124k924
60520E53932l522m009l822l378l238l242k798j698k96R48J779K122K117K130K576
60505E39601L659N384P686J0344J2901J5000J6918J9454K3105K7450L1549L4756
60493G47807L6971L8213L8366L7317L5008L1241K5789J8836J1015K749o087j5488
60481A001737k4515l1695l6266l8684l9810l9973l8978l6837l4099l1410k8872
60470F20598k6069k2821j9710j7521j6243j5007j3155j0944q964p379o165n620
$$ plain form
60562 442160 451326 460074 468439 475579 480257 482041 481626 479908 477221 473631 469529 465541 462139 459610
60548 459610 458130 457568 457522 457886 459172 461959 466279 471945 479155 488286 499196 511245 523892 536710
60534 536710 548830 558999 566470 571501 574796 576742 577266 576129 573212 568861 564073 559980 556856 553932
60520 553932 550410 546401 542579 539201 535963 532721 529923 528225 527929 528877 530656 532778 534895 537025 539601
60505 539601 543260 548644 556330 566674 579575 594575 611493 630947 654052 681502 713051 747807
60493 747807 784778 822991 861357 898674 933682 964923 990712 1009548 1020563 1023312 1017225 1001737
60481 1001737 977222 945527 909261 870577 830767 790794 751816 714979 680880 649470 620598
60470 620598 594529 571708 551998 534477 518234 503227 490072 479128 470164 462785 456620 451000
60458D51000n963o622o605n553l993k615j825j856k650l581l921l622l170k733
60444C96291k086j392j180j439j513j172r10r03n68K40N57l02j442j529q10p70
60428C81072j947l101k830j170O52J512J181K91k78k16m3k84o44m09M35J166J389
60411C76776J449J673J840J711J477J360J212R09P61J040J436J471J234J218J512
60396C97079J636J245O56N29J201K330L101K866J858J159J613K734L128K162Q50
60381D24147O78J824L076L391K993K721K849K991K862K547K133J558J027J086
60367D55883J946K956L113K135Q55M57J307K596L134K505J405Q79J306K258L081
60352D85816L457L486L560M079N105O261P156P685P697O742M732K647J708J766
$$ plain form
60458 451000 445037 438415 431810 426257 422264 419649 417824 415968 413318 409737 405816 402194 399024 396291
60444 396291 394205 392813 391633 390194 388681 387509 386599 385696 385128 385368 385925 385623 384181 382652 381842 381072
60428 381072 379125 376024 373194 372024 372676 374188 375369 375660 375382 375166 375123 374839 374195 373786 374221 375387 376776
60411 376776 378225 379898 381738 383449 384926 386286 387498 388407 389168 390208 391644 393115 394349 395567 397079
60396 397079 398715 399960 400616 401145 402346 404676 407777 410643 412501 413660 415273 418007 421135 423297 424147
60381 424147 424825 426649 429725 433116 436109 438830 441679 444670 447532 450079 452212 453770 454797 455883
60367 455883 457829 460785 463898 466033 466888 467345 468652 471248 474382 476887 478292 479171 480477 482735 485816
60352 485816 489273 492759 496319 500398 505503 511764 518920 526605 534302 541044 545776 548423 550131 551897
60338E51897J310n54k913m367m782m988n315n368n045m747m572m159l541l372
60324D99484l903m436m236l483k826k412j961j533j554k012k269j823q18M25J904
60309D68547L657N388O853Q462J0804J3703J6318J8267J9871K1027K0703J8201
60297F31801J4359J0496O588J604m451r987j3675j5798j7258j8172j8113j7056
60285E50338j5311j2955j0186p795o508o008n345m165l003k420k414k616k618
60272D68994k239j860k172l159l746l214k402k564l393l422k367j606k013k646
60258D32191k321j368r04j107j308j279j340j446j134m29N3n7m59p44q23o95l10
60241D16520K55P77J231J743K227K371K109J730J455J198Q84O85P85J202J897
$$ plain form
60338 551897 553207 552653 549740 545373 540591 535603 530288 524920 519875 515128 510556 506397 502856 499484
60324 499484 495581 491145 486909 483426 480600 478188 476227 474694 473140 471128 468859 467036 466218 466643 468547
60309 468547 472204 477592 484445 492907 503711 517414 533732 551999 571870 592897 613600 631801
60297 631801 646160 656656 663244 664848 660397 650410 636735 620937 603679 585507 567394 550338
60285 550338 535027 522072 511886 504091 497583 491575 486230 482065 479062 476642 474228 471612 468994
60272 468994 466755 464895 462723 459564 455818 452604 450202 447638 444245 440823 438456 436850 434837 432191
60258 432191 429870 428502 427598 426491 425183 423904 422564 421118 419984 419555 419608 419551 419092 418348 417525 416830 416520
60241 416520 416775 417552 418783 420526 422753 425124 427233 428963 430418 431616 432500 433185 433970 435172 437069
60226D37069K758L284K748J065p36j340m83Q61J632J694J671K090K965M023M994
60211D64295N617N675N259M855M915N326N547N358N191N464N886N831N307N017
60197E39543N279N450M854L858L409L666L829L368K696K282J775O49p18j351j039
60182E77550o67j101k259l484m392m976n256n162m774m373m193m119l728k747
60168E26319j544r58j395k314k888k940k792k433j574n15j57q55j837k160j656
60153E00301o55O29J863K350J780Q42M94P79J035R65Q40P62N75M64R44K055L175
60136E19198L866M339M901N390N525N354N084M686M016L141K312J708J301R02
60122E71723L50k53m82o7O96J221J334J370J580J851K058K318K682K829K374J361
$$ plain form
60226 437069 439827 443111 445859 446924 446188 444848 444365 445226 446858 448552 450223 452313 455278 459301 464295
60211 464295 469912 475587 480846 485701 490616 495942 501489 506847 512038 517502 523388 529219 534526 539543
60197 539543 544822 550272 555126 558984 562393 566059 569888 573256 575952 578234 580009 580658 579940 578589 577550
60182 577550 576883 575782 573523 570039 565647 560671 555415 550253 545479 541106 536913 532794 529066 526319
60168 526319 524775 523817 522422 520108 517220 514280 511488 509055 507481 506966 506809 505954 504117 501957 500301
60153 500301 499646 500275 502138 504488 506268 507110 507604 508383 509418 510383 511223 511985 512560 513024 513968 516023 519198
60136 519198 523064 527403 532304 537694 543219 548573 553657 558343 562359 565500 567812 569520 570821 571723
60122 571723 572073 571820 571338 571271 571967 573188 574522 575892 577472 579323 581381 583699 586381 589210 591584 592945
60106E92945L17j75K9M82M84k80j449k454l015l095k652j820j097q60p98l16N58
60089E76804J225J440J625K144K787L129L029K574J986J604J559J421O29o39j641
60074E99676k163k699l451l938m007m368n497o659o863o309o082o629p382p734
60060E25895p660p392p094o878o676o146n138m165l853l986l738k830j831j155
60046D57353m93N22J648K543L421M583N641N843N186M576M687N052M728L629K662
60031E11581K531K841K717J975J121L78o60k167l565m255m442m731n194n502n726
60016D86902o281p030p202o471n476m881m431l526k331j615j635j804j642j393
60002D31184j433j540j230o07k60m43p32p14m82l03j22K32O40Q58R67J242J684
$$ plain form
60106 592945 593262 593087 593116 593598 594082 593802 592353 589899 586884 583789 581137 579317 578220 577360 576562 576246 576804
60089 576804 578029 579469 581094 583238 586025 589154 592183 594757 596743 598347 599906 601327 601956 601317 599676
60074 599676 597513 594814 591363 587425 583418 579050 573553 566894 560031 553722 547640 541011 533629 525895
60060 525895 518235 510843 503749 496871 490195 484049 478911 474746 470893 466907 463169 460339 458508 457353
60046 457353 456860 457382 459030 461573 464994 469577 475218 481061 486247 490823 495510 500562 505290 508919 511581
60031 511581 514112 516953 519670 521645 522766 523144 522484 520317 516752 512497 508055 503324 498130 492628 486902
60016 486902 480621 473591 466389 459918 454442 449561 445130 441604 439273 437658 436023 434219 432577 431184
60002 431184 429751 428211 426981 426374 426114 425671 424939 424225 423743 423440 423318 423550 424190 425048 426015 427257 428941
59985D28941K001K123K262K489K654K739K913L041K667J705P41L24K59ro18j299
59969D52933j903k442k728k503j873j264q86o88o53p97q19l37M52R10R10J139
59953D39451K005K775K398R65k60k65O99J649J987J834J598J478J426J341J309
59938D60390J512J894J928J112k95j309j241m61J48K04o1m69j055j555j417o13
59922D58712P0L5k61M7R88J789K064K282K923L768M317M470M435M259L807L125
59906D96830K477K028J577P63n05j730k094j265O7P67L86m77r64p39L5J052J955
59889E00163K458K685L126L988M827N142N041M900M662M017L213L086L969N078
59875E56355N297M387L128K314J909J291J39j205k246k940l511l935m023m020
$$ plain form
59985 428941 430942 433065 435327 437816 440470 443209 446122 449163 451830 453535 454276 454600 454859 454850 454232 452933
59969 452933 451030 448588 445860 443357 441484 440220 439334 438646 437993 437196 436377 436040 436492 437402 438312 439451
59953 439451 441456 444231 446629 447594 447334 447069 447768 449417 451404 453238 454836 456314 457740 459081 460390
59938 460390 461902 463796 465724 466836 466541 465232 463991 463530 463678 463882 463821 463352 462297 460742 459325 458712
59922 458712 458782 458817 458556 458603 459591 461380 463444 465726 468649 472417 476734 481204 485639 489898 493705 496830
59906 496830 499307 501335 502912 503675 503170 501440 499346 498081 498148 498915 499301 498824 497860 497121 497156 498208 500163
59889 500163 502621 505306 508432 512420 517247 522389 527430 532330 536992 541009 544222 547308 551277 556355
59875 556355 561652 566039 569167 571481 573390 574681 574820 573615 571369 568429 564918 560983 556960 552940
59861E52940m506n454n873m924l091j637j060o82K57J727L305M829O266P370P910
59846E57377P959P628O755N265L607K365J564Q52K62J91N08L91o75k221l510m486
59830E83832n443o163o080n259m469m258m420m568m616m541m180l623l363l652
59816E19197m142m441m591m597m013k622j133m77o19q14q52j212j945k313j795
59801D83631p75N9M53L91j88j089j713j735j537j608j807j667j150o30k62J42
59785D70515O80J106J121O87O2m41p78j165j646j799j212k15L44J66k01k99m02
59768D66523q54j251r49p7N39M02j13k46L94J462K162K008J479J547K430L236
59752D78692L199K742K740L194L379L121L107L797M703N043M649M046L808M007
$$ plain form
59861 552940 548434 542980 537107 532183 529092 527455 526395 525713 525970 527697 531002 535831 542097 549467 557377
59846 557377 565336 572964 579719 584984 588591 590956 592520 593372 593634 593825 594333 594724 594049 591828 588318 583832
59830 583832 578389 572226 566146 560887 556418 552160 547740 543172 538556 534015 529835 526212 522849 519197
59816 519197 515055 510614 506023 501426 497413 494791 493658 493181 492562 491748 490896 489684 487739 485426 483631
59801 483631 482856 482915 483368 483759 483571 482482 480769 479034 477497 475889 474082 472415 471265 470635 470373 470515
59785 470515 471195 472301 473422 474109 474171 473730 472952 471787 470141 468342 467130 466915 467259 467425 467224 466925 466523
59768 466523 465669 464418 463469 463392 463931 464333 464220 463974 464368 465830 467992 470000 471479 473026 475456 478692
59752 478692 481891 484633 487373 490567 493946 497067 500174 503971 508674 513717 518366 522412 526220 530227
59738E30227M087L383J954P81P90J821K897L397L379K939J987Q29J86K69M14P1
59722E59411l40j59L00N1j130k241k236j111L20J305J463P05n99j518j247n6R12
59705E53830R35M42K49M75O81O81P19R45J328J969K933L746L650K578J424R98
59689E77583J194J371J178O80O7m36o45o99r60j408j544j160q23j193k147l043
59673E68015l502l566l385l231l529m336m958m605l387k252j987k576l419l810
59659E19472l290k010o58K50Q72J591K263K412J962J382J115J273J712K062J861
59644E32269J060K50p3k12p64j663k336k650k956l257l082k358j763j836k246
59629E08383k283j752j137j095j848k915l413k920j996j551j764k069k099k104
$$ plain form
59738 530227 534314 537697 539651 540432 541222 543043 545940 549337 552716 555655 557642 558471 558657 558926 559340 559411
59722 559411 559071 558912 559212 559263 558133 555892 553656 552545 552865 554170 555633 556338 555739 554221 552974 552918 553830
59705 553830 554765 555207 555456 555931 556612 557293 558012 558957 560285 562254 565187 568933 572583 575161 576585 577583
59689 577583 578777 580148 581326 582006 582073 581637 580992 580293 579333 577925 576381 575221 574398 573205 571058 568015
59673 568015 564513 560947 557562 554331 550802 546466 541508 536903 533516 531264 529277 526701 523282 519472
59659 519472 516182 514172 513514 513764 514636 516227 518490 520902 522864 524246 525361 526634 528346 530408 532269
59644 532269 533329 533579 533506 533294 532530 530867 528531 525881 522925 519668 516586 514228 512465 510629 508383
59629 508383 506100 504348 503211 502116 500268 497353 493940 491020 489024 487473 485709 483640 481541 479437
59615D79437k324k555k524k335k196k049j714j206o64j00N83J365J941J841Q61
59600D68361n14j370j261o81l28j95K15R53J487J419Q93K67k23m47m22l53l73
59583D67428l12l5K05P0l50p91j332k101k759k832k488k271k277k238k249k549
59567D43119k734k132j058o74j324j930j474k55P64J133R06K18n37o54P6R15J027
59550D35386N66L73R35K026L166L995M414M674N177O023O941P746Q586R658J1100
59535E10766J3099J5451J6879J5608J1160N159j33l665n701o660o611n620m030
59522E55702k282p17N09J445K103K257J760R61L66j10r05j879k424k645l515n440
59506E45186p458q406q168p295o191n260n086n669o108n773n181m953m655l589
$$ plain form
59615 479437 477113 474558 472034 469699 467503 465454 463740 462534 461870 461770 462353 463718 465659 467500 468361
59600 468361 467847 466477 465216 464535 464207 464012 464227 465180 466667 468086 468979 469246 469023 468576 468154 467801 467428
59583 467428 467116 467081 467286 467356 467006 466215 464883 462782 460023 457191 454703 452432 450155 447917 445668 443119
59567 443119 440385 438253 437195 436521 435197 433267 431793 431538 432302 433435 434341 434559 434022 433368 433444 434359 435386
59550 435386 435952 436325 437260 439286 442452 446447 450861 455535 460712 466735 473676 481422 490008 499666 510766
59535 510766 523865 539316 556195 571803 582963 588122 587989 584324 578623 571963 565352 559732 555702
59522 555702 553420 552703 553212 554657 556760 559017 560777 561738 562104 561994 561089 559210 556786 554141 550626 545186
59506 545186 537728 529322 521154 513859 507668 502408 497322 491653 485545 479772 474591 469638 464983 461394
59492D61394k211j534j542j307n13K84P42J109J459J573J614J986K438K270J595
59477D69357J380K028K842L185L287L423L300K809K613L151L739L397K198J035
59463E07744L43n8j44M46J556K352K353K042K144K658L127L524M297N526O608
59448E44518P027P056P303P778P828O988N454L642J657n43k724m426n439n982
59434E80137o360o571o374n772n303n507o049n793m108j779j43M68Q27J603K844
59419E32120M559O847R269J1065J2406J4493J7764K0959K2718K3260K3425K2710
59407G21595J9649J3946P049N63m772q491j0029r454p723n606l038j22J863J274
59393G16704k221p324j2284j6017j8240j9136j9114j8552j7559j6063j4181j2283
$$ plain form
59492 461394 459183 457649 456107 454800 454287 454571 455313 456422 457881 459454 461068 463054 465492 467762 469357
59477 469357 470737 472765 475607 478792 482079 485502 488802 491611 494224 497375 501114 504511 506709 507744
59463 507744 508087 508029 507885 508331 509887 512239 514592 516634 518778 521436 524563 528087 532384 537910 544518
59448 544518 551545 558601 565904 573682 581510 588498 593952 597594 599251 598708 595984 591558 586119 580137
59434 580137 573777 567206 560832 555060 549757 544250 538201 532408 528300 526521 526378 526846 527673 529276 532120
59419 532120 536679 543526 552795 563860 576266 590759 608523 629482 652200 675460 698885 721595
59407 721595 741244 755190 762239 762802 758030 749539 739510 730056 722333 716727 713689 713567 715430 716704
59393 716704 714483 707159 694875 678858 660618 641482 622368 603816 586257 570194 556013 543730
59381E43730j0617q959o933m630k703j671j277q69j85M84R01J205J601K124K781
59366E14982L486L792L220K111J663K608M254N330N465N269N278N484N914O915
59352E75771Q601J0443J1670J1949J1601J1291J1514J2244J3054J3685J4321J5184
59340G21328J6037J6292J5533J3825J1647R699Q431P545O135L646N22k330m574
59327H23736o538q527j0362j1646j2237j2388j2504j2686j2578j1914j1121j0927
59315F90308j1239j1045r674p649n897m594l351k085j070l11N79J962L990O624
59301F46548R411J1506J2320J1945J0619Q213M646M82l458o717r031j0003r688
59288F76793r053r016r298q984p960o873n898m607l095k124j856j410j92J156
$$ plain form
59381 543730 533113 524154 517221 512591 509888 508217 506940 506071 505886 506370 507271 508476 510077 512201 514982
59366 514982 518468 522260 525480 527591 529254 531862 536116 541446 546911 552180 557458 562942 568856 575771
59352 575771 584372 594815 606485 618434 630035 641326 652840 665084 678138 691823 706144 721328
59340 721328 737365 753657 769190 783015 794662 804361 812792 820337 826472 830118 830640 828310 823736
59327 823736 817198 808671 798309 786663 774426 762038 749534 736848 724270 712356 701235 690308
59315 690308 679069 668024 658350 650701 644804 640210 636859 634774 633704 633393 633972 635934 639924 646548
59301 646548 655959 667465 679785 691730 702349 710562 715208 715690 712232 705515 696484 686481 676793
59288 676793 667740 658724 649426 640442 632482 625609 619711 615104 612009 609885 608029 606619 606427 607583
59274F07583J707J638J954L128M596N606O114O668P569Q335Q213P121N760M688
59260F80680L765K715J645N42j146l663o078p173p038o908p474q192q367p996
59246F25312p330o357n158m156l612l225k544j461j79R80J655J692J431J377J566
59231E99991J607J368J197J378J737J889J573P78k10r64j454k234l631n024n522
59216E92479n148m714m600m384l713k781j930j371j337j888k447k262j413p41
59202E53750o64p31n03j26K20P38J510K166K399K397K443K517K500K451K458K580
59186E76105L011L839M603M533L473K149J402J446J914K258K130J716J622K044
59172F12245K365J987J275R73J131J358J727K420K910K672K559L954O520Q277
$$ plain form
59274 607583 609290 610928 612882 616010 620606 626212 632326 638994 646563 654898 663111 670232 675992 680680
59260 680680 684445 687160 688805 689347 688201 684538 678460 671287 664249 657341 649867 641675 633308 625312
59246 625312 617982 611625 606467 602311 598699 595474 592930 591469 591290 592270 593925 595617 597048 598425 599991
59231 599991 601598 602966 604163 605541 607278 609167 610740 611518 611308 610344 608890 606656 603025 598001 592479
59216 592479 587331 582617 578017 573633 569920 567139 565209 563838 562501 560613 558166 555904 554491 553750
59202 553750 553086 552355 551852 551726 551946 552684 554194 556360 558759 561156 563599 566116 568616 571067 573525 576105
59186 576105 579116 582955 587558 592091 595564 597713 599115 600561 602475 604733 606863 608579 610201 612245
59172 612245 614610 616597 617872 618845 619976 621334 623061 625481 628391 631063 633622 637576 644096 652373
59158F52373Q181P170O253N155L565K195J498O12j239l209l962l594l277l539
59144F68182m049m636n364n898n779n218m793m534m072l518l379l737m172m351
59130F04682m194l583k580j731j597j972k112j667r61l94P2Q02K023L447M398
59115E94633M543M407M691N243N363N152N520O614P302O804N878N603N870N973
59101F73596N893N961N796M718L022J774J416J414J224Q20L35j91o20q35r66j161
59085G02196j301j336j612k371l309m030m657n371n868n833n656n876o342o571
59071F42063o702p217p934q122p554o758o174n711n111m263l176k139j748k257
59057E67197l108l609l785m011m075l401k101j012o73q81j213j415j301q74n56
$$ plain form
59158 652373 660554 667724 673977 679132 682697 684892 686390 687002 685763 682554 678592 674998 671721 668182
59144 668182 664133 659497 654133 648235 642456 637238 632445 627911 623839 620321 616942 613205 609033 604682
59130 604682 600488 596905 594325 592594 590997 589025 586913 585246 584285 583891 583963 584765 586788 590235 594633
59115 594633 599176 603583 608274 613517 618880 624032 629552 636166 643468 650272 656150 661753 667623 673596
59101 673596 679489 685450 691246 695964 698986 700760 702176 703590 704814 705634 705969 705778 705158 704323 703357 702196
59085 702196 700895 699559 697947 695576 692267 688237 683580 678209 672341 666508 660852 654976 648634 642063
59071 642063 635361 628144 620210 612088 604534 597776 591602 585891 580780 576517 573341 571202 569454 567197
59057 567197 564089 560480 556695 552684 548609 545208 543107 542095 541422 540541 539328 537913 536612 535738 535182
59042E35182p51j217j399j273j259j352j055k81M15O15N54O66J111J920L113M403
59026E39392N221N320N063N054N604O707Q238R923J1263J1718J1088R827Q818
59013F43236Q622Q812Q349O680M213J754j08j032r43l40l4k77n12k37L84J057
58997F79624J816K623L103L121L005K802K040Q06J43O17J289J043K33j24j93j007
58981G00941k641l983m275l793k906j661l68L96O97J328K668M179N253N932O538
58966G08305P170P791Q382Q834R049R157R310R338Q997Q342P437N996L843J497
58952H13448l61j772l259m921o461p868r299j0457j0871j0675j0449j0382j0271
58939G16402j0127j0034r615q496p128o290n842m956l502k312j865j703j283p24
$$ plain form
59042 535182 534431 533214 531815 530542 529283 527931 526876 526595 527010 527625 528179 528845 529956 531876 534989 539392
59026 539392 544613 549933 554996 560050 565654 572361 580599 590522 601785 613503 624591 634418 643236
59013 643236 651858 660670 669019 675699 679912 681666 681558 680526 679583 679243 679209 678932 678420 678183 678567 679624
58997 679624 681440 684063 687166 690287 693292 696094 698134 698940 699083 699700 700989 702032 702265 702141 701948 700941
58981 700941 698300 694317 690042 686249 683343 681682 681314 681710 682407 683735 686403 690582 695835 701767 708305
58966 708305 715475 723266 731648 740482 749531 758688 767998 777336 786333 794675 802112 808108 811951 813448
58952 813448 813087 811315 808056 803135 796674 788806 779507 769050 758179 747504 737055 726673 716402
58939 716402 706275 696241 686626 678130 671002 664712 658870 653914 650412 648100 646235 644532 643249 642525
58925F42525m17n57j121j811k001j370m65q4k08k73k24n35j254j904k141j844
58909F26316q09P27J740J625J440K656N008O938P973R007J0223J0622J0032R756
58895G03254J0491J1175J0806J0047R935J0275J0417J0676J1713J3240J4441J5181
58883H41651J5809J6231J6025J5111J3643J1668R447P567O097M178J172k324n230
58870I51045p300r015j0584j1743j2239j1986j1130j0272j0096j0401j0173r127
58858H26979q342q686r444r493r073r216r896j0032r300q643q823r407r593r202
58844F97829q512p656o713o006n827n995n991n570n086n050n465n807n669n257
58830F13225m916m476l521k262j539j792k474k661j943n92P38J401J209P41Q73
$$ plain form
58925 642525 642108 641551 640430 638619 636618 635248 634783 634699 634491 634218 633994 633459 632205 630301 628160 626316
58909 626316 625507 626234 627974 629599 631039 633695 638703 645641 653614 662621 672844 683466 693498 703254
58895 703254 713745 724920 735726 745773 755708 765983 776400 787076 798789 812029 826470 841651
58883 841651 857460 873691 889716 904827 918470 930138 939585 947152 953249 957427 958599 956275 951045
58870 951045 943745 934730 924146 912403 900164 888178 877048 866776 856680 846279 836106 826979
58858 826979 818637 809951 800507 791014 781941 772725 762829 752797 743497 734854 726031 716624 707031 697829
58844 697829 689317 681661 674948 668942 663115 657120 651129 645559 640473 635423 629958 624151 618482 613225
58830 613225 608309 603833 600312 598050 596511 594719 592245 589584 587641 587049 587787 589188 590397 591138 592011
58815E92011J862L126L920L968L485L015L088L668M013L588K805K306J813O56
58801F33324q07j423j045q95j827l270m314m885n255n349n173n158n423n347m488
58786E78665l293k361j597p01J42O18Q53J108J441K029L173M532N072M362L139
58771E97182K150J187j09j363k187k959l954m454l767k642k489l519m622m869
58757E63585m220l004j647q08q88j350j204j92J072J990K441K507K368K340K553
58742E65543K693K562K598L270M231M759M807M940N332N520N189M656M409M592
58728F25101M950N065M648L872L234K920K593K105J943K576L662M414M551M457
58714F76091M620N287O432P620Q166P780O790N566M075K359Q47k64j467l159m907
$$ plain form
58815 592011 593873 596999 600919 604887 608372 611387 614475 618143 622156 625744 628549 630855 632668 633324
58801 633324 632517 631094 630049 629154 627327 624057 619743 614858 609603 604254 599081 593923 588500 583153 578665
58786 578665 575372 573011 571414 570713 570855 571473 572326 573434 574875 576904 580077 584609 589681 594043 597182
58771 597182 599332 600519 600410 599047 596860 593901 589947 585493 581726 579084 576595 573076 568454 563585
58757 563585 559365 556361 554714 553906 553018 551668 550464 550272 551344 553334 555775 558282 560650 562990 565543
58742 565543 568236 570798 573396 576666 580897 585656 590463 595403 600735 606255 611444 616100 620509 625101
58728 625101 630051 635116 639764 643636 646870 649790 652383 654488 656431 659007 662669 667083 671634 676091
58714 676091 680711 685998 692430 700050 708216 715996 722786 728352 732427 734786 735633 735369 733902 730743 725836
58699G25836o100p012q416j0392j2211j3296j3699j3677j3353j2787j2018j1064
58687E91811j0159r678r556r098p831o230n202n051n382n642n376m301k677j372
58673E04256j034j361j539j141k33J044K498L788M695N365N947O371O659P046
58659E42361P439P276O280M838L360J830M22k53p3P5n92j756k739l481m039l895
58643E57053k785j601j354j673j506q67o93j157j364q82l07j73k23j27n6j60j68
58626E41957J44N90Q82R49P35J53o47j279j540j575j540j290m92J024K891M261
58610E45223M530M084L869M217M617M739M856M959M404L015J727J335J308O81
58596E93564n21j654k627l682m381l962k520r49K07J042J678K179K903M193N749
$$ plain form
58699 725836 719736 712724 704308 693916 681705 668409 654710 641033 627680 614893 602875 591811
58687 591811 581652 571974 562418 553320 545489 539259 534057 529006 523624 517982 512606 508305 505628 504256
58673 504256 503222 501861 500322 499181 498948 499992 502490 506278 510973 516338 522285 528656 535315 542361
58659 542361 549800 557076 563356 568194 571554 573384 573806 573553 573480 573555 572963 571207 568468 564987 560948 557053
58643 557053 554268 552667 551313 549640 548134 547267 546574 545417 544053 543171 542864 542691 542468 542341 542285 542125 541957
58626 541957 542101 542691 543573 544522 545257 545410 544763 543484 541944 540369 538829 537539 537047 538071 540962 545223
58610 545223 549753 553837 557706 561923 566540 571279 576135 581094 585498 588513 590240 591575 592883 593564
58596 593564 593043 591389 588762 585080 580699 576737 574217 573268 573475 574517 576195 578374 581277 585470 591219
58581E91219O986P823Q518Q943Q789Q223P705P318O954O885P497Q619R755J0696
58567G05930J1369J1517J1204J1226J2250J3907J5467J6995J8926K0922K2086
58556H71799K2132K1491K0450J8963J7069J4761J1737Q063M659K325O16j365l459
58543A009241m784n237n642o525p764r294j1156j2978j4318j5410j6709j7885
58531H81539j8149j7437j6395j5371j4232j2923j1456r636p562o004n335m717
58519G42322l329j870j517j930j768q51j93j17M2K24n66k366l613l078j388q8
58503G19914k8j057k438l283l185k647k300j909r12K75O26Q3l56j00N52J315K225
58486G06775K948L016K771L066L922M633N172O241P863R199J0012J0999J2363
$$ plain form
58581 591219 598205 606028 614546 623489 632278 640501 648206 655524 662478 669363 676860 685479 695234 705930
58567 705930 717299 728816 740020 751246 763496 777403 792870 809865 828791 849713 871799
58556 871799 893931 915422 935872 954835 971904 986665 998402 1006465 1011124 1013449 1014065 1012700 1009241
58543 1009241 1004457 999220 993578 987053 979289 969995 958839 945861 931543 916133 899424 881539
58531 881539 863390 845953 829558 814187 799955 787032 775576 765940 758378 752374 747039 742322
58519 742322 738993 737123 735606 733676 731908 731057 730864 730747 730789 731013 730447 728081 724468 721390 720002 719914
58503 719914 719886 718829 716391 713108 709923 707276 704976 703067 702155 702430 703056 703139 702783 702683 703235 704550 706775
58486 706775 709723 712739 715510 718576 722498 727131 732303 738544 746407 755606 765618 776617 788980
58473G88980J3269J3158J2435J1436R816P483N044K823M17k275m458n537n961
58460H46630o415o769o428n262l701k103l69J947N021Q095R850R862R202R008
58446H68568Q996Q177O384M144J552j446m172n799o535p021p009n941m431l597
58432H51870l245k284p32L68Q89J800L263M416N189O649R052J1138J1892J1618
58418I11883J0783R196O925M715K961J260n51j957k750l449m396n310n906o147
58404I17257n896n158m547m503m404l484k233j547j025K99J990K781K781L273
58390H95584M394M948M514L872L262K194J036Q21J285J072J36k3J230K948M499
58375I31772O201P829Q546Q608R107R768R201P652P141Q409R955J0700J1259J2023
$$ plain form
58473 788980 802249 815407 827842 839278 849094 856577 861621 864444 864861 862586 858128 852591 846630
58460 846630 840215 833446 827018 821756 818055 815952 815583 817530 822551 830646 840496 850358 859560 868568
58446 868568 877564 885741 892125 896269 897821 896375 892203 886404 879869 872848 865839 859898 855467 851870
58432 851870 848625 846341 845609 845977 846866 848666 851929 856345 861534 868183 877235 888373 900265 911883
58418 911883 922666 931862 938787 943502 946463 947723 947172 945215 942465 939016 934620 929310 923404 917257
58404 917257 911361 906203 901656 897153 892749 889265 887032 885485 884460 884759 886749 889530 892311 895584
58390 895584 899978 904926 909440 913312 916574 918768 919804 920625 921910 922982 923118 923095 924325 927273 931772
58375 931772 937973 945802 954348 962956 972063 981831 991032 998684 1005825 1014234 1024189 1034889 1046148 1058171
58361A058171J2356J2405J3298J4798J5179J4281J4107J5321J5755J3897J1364
58350A210932J0287J0247R601Q106O560N318M574M875O181P556Q512R422J0208
58337A312379J0270J0067J0866J2522J3563J3828J4699J6321J7156J6889J7030
58326A465590J7874J7740J6198J5105J5271J4957J3146J1379J0858J0557R811
58315A618486R896J1277J2004J0880R642J0085J1453J2517J3780J5659J6962J7184
58303A769825J7920K0114K2235K2937K3138K3682K3639K2806K3094K5301K7221
58292B021912K7141K6610K7473K8807K9149K9181K9959L0832L1391L2882L5588
58281B350925L7479L7609L8073M0397M2899M3994M5019M7233M9123M9433M9913
$$ plain form
58361 1058171 1070527 1082932 1096230 1111028 1126207 1140488 1154595 1169916 1185671 1199568 1210932
58350 1210932 1221219 1231466 1241067 1249173 1255733 1261051 1265625 1270500 1276681 1284237 1292749 1302171 1312379
58337 1312379 1322649 1332716 1343582 1356104 1369667 1383495 1398194 1414515 1431671 1448560 1465590
58326 1465590 1483464 1501204 1517402 1532507 1547778 1562735 1575881 1587260 1598118 1608675 1618486
58315 1618486 1628382 1639659 1651663 1662543 1672185 1682270 1693723 1706240 1720020 1735679 1752641 1769825
58303 1769825 1787745 1807859 1830094 1853031 1876169 1899851 1923490 1946296 1969390 1994691 2021912
58292 2021912 2049053 2075663 2103136 2131943 2161092 2190273 2220232 2251064 2282455 2315337 2350925
58281 2350925 2388404 2426013 2464086 2504483 2547382 2591376 2636395 2683628 2732751 2782184 2832097
58270B832097N2237N4990N6541N8062O1060O4636O7759P1293P5426P8387Q0055
58259C552543Q3154Q8394R2496R3827R5549R9891J03934J04837J04826J06811
58249D526262J09490J11133J13974J20110J27080J32235J37592J45698J54707
58240E678281J62301J70371J80918J91607K00299K09675K22324K35873K48206
58231G499855K62523K81595L02059L20329L39029L61514L85577M09030M35717
58222A0597228M69035N05463N41688N81910O30437O83850P38705P99924Q72653
58213A6420893R53397J038959J136267J252817J385726J531651J698895J897473
58205B7316078K126839K387426K694809L068128L516373M053851M718114N554599
$$ plain form
58270 2832097 2884334 2939324 2995865 3053927 3114987 3179623 3247382 3318675 3394101 3472488 3552543
58259 3552543 3635697 3724091 3816587 3910414 4005963 4105854 4209788 4314625 4419451 4526262
58249 4526262 4635752 4746885 4860859 4980969 5108049 5240284 5377876 5523574 5678281
58240 5678281 5840582 6010953 6191871 6383478 6583777 6793452 7015776 7251649 7499855
58231 7499855 7762378 8043973 8346032 8666361 9005390 9366904 9752481 10161511 10597228
58222 10597228 11066263 11571726 12113414 12695324 13325761 14009611 14748316 15548240 16420893
58213 16420893 17374290 18413249 19549516 20802333 22188059 23719710 25418605 27316078
58205 27316078 29442917 31830343 34525152 37593280 41109653 45163504 49881618 55436217
58197E5436217O597705P888690R495409J1484798J3886695J6704512J9921156
58190A41415182K3426220K6933734L0012046L2170439L2849535L1384399K7203580
58183C45395135K0269117J1340766J720343p321595j4941877k0753334k4692905
58176C11015650k6922986k7739055k7444669k6282210k4470506k2251386j9857942
58169A36046896j7460377j5169553j3068297j1208655r595956q207080p021455
58162E4315523o021042n176326m455882l843788l331816k902514k535392k222257
58154B3826506j961420j742868j552736j386722j246027j125029j014949r15266
58146A2881489q29940p56210o87576o24179n70074n23615m79991m40128m07984
$$ plain form
58197 55436217 62033922 69922612 79418021 90902819 104789514 121494026 141415182
58190 141415182 164841402 191775136 221787182 253957621 286807156 318191555 345395135
58183 345395135 365664252 377005018 378725361 371403766 356461889 335708555 311015650
58176 311015650 284092664 256353609 228908940 202626730 178156224 155904838 136046896
58169 136046896 118586519 103416966 90348669 79140014 69544058 61336978 54315523
58162 54315523 48294481 43118155 38662273 34818485 31486669 28584155 26048763 23826506
58154 23826506 21865086 20122218 18569482 17182760 15936733 14811704 13796755 12881489
58146 12881489 12051549 11295339 10607763 9983584 9413510 8889895 8409904 7969776 7561792
58137G561792l81785l56489l32261l12396k95470k77394k58900k43395k29696
58128D874006k14108j97664j84242j73398j61776j49789j40448j33238j25409
58119C393934j17602j12222j07938j01686r4560q9800q6536q1364p4771p0151
58109B457304o7501o3776n8679n4879n2973n1177m9420m9103m9394m8153m5839
58098A866410m4456m3623m1720l9670l9362l9527l7572l4343l2663l2221l0460
58087A450793k7594k6094k5911k4805k2986k2872k4383k4811k3487k2472k2516
58076A182862k2161k1059k0519k0506j9534j7759j6905j7038j6501j5151j4528
58065I81201j4772j4404j3216j2497j2392j1803j0871j0744j1109j0663r877j0378
$$ plain form
58137 7561792 7180007 6823518 6491257 6178861 5883391 5605997 5347097 5103702 4874006
58128 4874006 4659898 4462234 4277992 4104594 3942818 3793029 3652581 3519343 3393934
58119 3393934 3276332 3164110 3056172 2954486 2859926 2770126 2683590 2602226 2527455 2457304
58109 2457304 2389803 2326027 2267348 2212469 2159496 2108319 2058899 2009796 1960402 1912249 1866410
58098 1866410 1821954 1778331 1736611 1696941 1657579 1618052 1580480 1546137 1513474 1481253 1450793
58087 1450793 1423199 1397105 1371194 1346389 1323403 1300531 1276148 1251337 1227850 1205378 1182862
58076 1182862 1160701 1139642 1119123 1098617 1079083 1061324 1044419 1027381 1010880 995729 981201
58065 981201 966429 952025 938809 926312 913920 902117 891246 880502 869393 858730 848853 838475
58053H38475j1853j2382j1773j1621j2148j1861j0451r333r068q790q235q000
58041G12960p813o935o034o307p032o553n302n193o279o840o584o900p952q390
58027F18846q093q375r222r112p981p563q273q348o865n184m628m796m944n067
58013E20395m953m025k701k243k812l219k847k282j886j405j037j289j740j571
57999D86385j117j281j665j211l12k20o08N2J767K876K662J937J028n17k063k030
57983D85683l97R61Q62o3j069k161k975k787k001j887k592l023k832k706k702
57968D60311k161j327j097j166m91N38N46j95l4J009J057l27j239o37N5m65j399
57951D52978j584j300j154q99l99k72o55p31j60M41R58K084L616M248L821L974
$$ plain form
58053 838475 826622 814240 802467 790846 778698 766837 756386 747053 737985 729195 720960 712960
58041 712960 705147 698212 692178 685871 678839 672286 666984 661791 655512 648672 642088 635188 627236 618846
58027 618846 610753 602378 593156 584044 576063 568500 560227 551879 545014 539830 535202 530406 525462 520395
58013 520395 515442 511417 508716 506473 503661 500442 497595 495313 493427 492022 490985 489696 487956 486385
57999 486385 485268 483987 482322 481111 480799 480579 479971 480023 481790 484666 487328 489265 490293 489776 487713 485683
57983 485683 485286 486247 487109 487046 485977 483816 480841 478054 476053 474166 471574 468551 465719 463013 460311
57968 460311 458150 456823 455726 454560 454069 454607 455153 454958 454924 455933 456990 456663 455424 454787 454842 454377 452978
57951 452978 451394 450094 448940 448041 447642 447370 446715 445984 445824 446265 447223 449307 452923 457171 460992 464966
57935D64966N747Q108R653J0218J0053Q997P361O226O030O033N635M955L767J636
57921E59385n65j165l76m71k491m751n583n638o173o862o755o021n330m698m148
57906D98358m329n331o034n673m916m419l620k092p94p76j592k156k255k173j776
57891D50422r84l22r0J88P86J195J204J473K263K786K592K398K640K574J807J398
57875D72330K091K684J637n88k270k761k711k546k150j730j788k331k959l482
57861D53426l837l734l078k276j611p91L63J430K052K474K933L218L287L499L746
57846D61101L289K039R72O36K58q58k069k414k042j626j262q85r70j795k591k489
57830D49294j738j051m35M57J325J636J581J685J884J846J851K494L719M911N667
$$ plain form
57935 464966 470713 478821 488474 498692 508745 517742 525103 531329 537359 543392 549027 553982 557749 559385
57921 559385 558820 557655 557279 556808 554317 549566 543983 538345 532172 525310 518555 512534 507204 502506 498358
57906 498358 494029 488698 482664 476991 472075 467656 464036 461944 461150 460374 458782 456626 454371 452198 450422
57891 450422 449438 449116 449026 449214 450000 451195 452399 453872 456135 458921 461513 463911 466551 469125 470932 472330
57875 472330 474421 477105 478742 478154 475884 473123 470412 467866 465716 463986 462198 459867 456908 453426
57861 453426 449589 445855 442777 440501 438890 438099 438462 439892 441944 444418 447351 450569 453856 457355 461101
57846 461101 464390 466429 467401 468037 468295 467437 465368 462954 460912 459286 458024 457139 456169 454374 451783 449294
57830 449294 447556 446505 446070 446527 447852 449488 451069 452754 454638 456484 458335 460829 464548 469459 475126
57815D75126N905N457M238K590J003l64j579k648l655m631n156m602l063j470
57801D67151n76l92p38j466j970j470j66P69P55M37M29M78K69O3k8k70l80M53
57783D63348K038K922K404J623J803K596L152L603M328M814M506L979M045M453
57769E09614M547M506M693M573L438J737N08k0k53k51P9L69L45N04J259J960J754
57752E39362Q99K25j94q10j521j841j775j667j535j349j396j670j559r24p24j556
57736E21965k474k404j894k133k891l002k326j662j084O0J519K104J434M44r6
57721E07560l25l49K55J554K739L050K684K390K569K964L001K387J525J148J465
57706E34617J976K276K398K200J312P0m00L08J201J382J285J559J779J383R37
$$ plain form
57815 475126 481031 486488 490726 493316 494319 493955 492376 489728 486073 481442 476286 471684 468621 467151
57801 467151 466575 466183 465445 463979 462009 460539 460373 461142 461897 462334 462763 463241 463510 463573 463545 463275 462895 463348
57783 463348 465386 468308 470712 472335 474138 476734 479886 483489 487817 492631 497137 501116 505161 509614
57769 509614 514161 518667 523360 527933 531371 533108 533616 533596 533343 533092 533171 533540 533885 534389 535648 537608 539362
57752 539362 540261 540486 540292 539482 537961 536120 534345 532678 531143 529794 528398 526728 525169 524245 523521 521965
57736 521965 519491 517087 515193 513060 510169 507167 504841 503179 502095 502155 503674 505778 507212 507656 507560
57721 507560 507235 506886 507141 508695 511434 514484 517168 519558 522127 525091 528092 530479 532004 533152 534617
57706 534617 536593 538869 541267 543467 544779 544849 544449 544757 545958 547340 548625 550184 551963 553346 554283
57691E54283J218J763J658J093P99N58k32j063q65K45J184J658K278L221M094
57676E71892N058O695Q881J1080J3670J7550K2578K7650L2308L6849M0824M2797
57664H37832M1751L7556L0075J9329O759n080j4544k1630k6586k9208k9752k9191
57652H17311k7982k5769k2667j9681j7319j4896j1862q819o591n159m099l270
57640F49197k520j487k72M36L98L25Q81J819K616L265L945M398M228L428K286
57625F72943J115L55L97J056J659J826J782J733J507J010N50M69Q10J435K093
57610F90740K373K110J692J556J530J291J214J908L034L578L303K929K797K401
57596G22456J603J153J551K177K232J847J671J832J944J829J761K064K702L232
$$ plain form
57691 554283 555501 557264 558922 560015 560814 561372 561140 560077 559212 559457 560641 562299 564577 567798 571892
57676 571892 576950 583645 592526 603606 617276 634826 657404 685054 717362 754211 795035 837832
57664 837832 879583 917139 947214 966543 973302 968222 953678 932048 905462 876254 846502 817311
57652 817311 789329 763560 740893 721212 703893 688997 677135 668316 661725 656566 652467 649197
57640 649197 646677 645190 644918 645354 645752 646077 646958 648777 651393 654658 658603 663001 667229 670657 672943
57625 672943 674058 674413 674810 675866 677525 679351 681133 682866 684373 685383 685933 686402 687212 688647 690740
57610 690740 693113 695223 696915 698471 700001 701292 702506 704414 707448 711026 714329 717258 720055 722456
57596 722456 724059 725212 726763 728940 731172 733019 734690 736522 738466 740295 742056 744120 746822 750054
57582G50054L227K852K728L010L049K547K352L242M382M295L115K475L065L735
57568G94128L421K706K683L289L649L407K991K916L332L991M425M498M701N423
57554H45560O119O038N664O307Q074R433R235Q063P041O350N682N243N382N830
57540I40021O118O290O587O839O812O730O857O955O692O263O143O477P038P458
57526A033280P271O221M820M097M473N345O061O680P408P961Q024P820P671P393
57512A124525O649N606M758M409M634N363O209O546O119N269M343L325K332J845
57498A191932K087K582K749K544K178J691J197J108J676K594L416M116M903N795
57484A230568O636P257P488P336P264P832Q897R740J0072J0349J0814J0986J0513
$$ plain form
57582 750054 753281 756133 758861 761871 764920 767467 769819 773061 777443 781738 784853 787328 790393 794128
57568 794128 797549 800255 802938 806227 809876 813283 816274 819190 822522 826513 830938 835436 840137 845560
57554 845560 851679 857717 863381 869688 877762 887195 896430 904493 911534 917884 923566 928809 934191 940021
57540 940021 946139 952429 959016 965855 972667 979397 986254 993209 999901 1006164 1012307 1018784 1025822 1033280
57526 1033280 1040551 1046772 1051592 1055689 1060162 1065507 1071568 1078248 1085656 1093617 1101641 1109461 1117132 1124525
57512 1124525 1131174 1136780 1141538 1145947 1150581 1155944 1162153 1168699 1174818 1180087 1184430 1187755 1190087 1191932
57498 1191932 1194019 1196601 1199350 1201894 1204072 1205763 1206960 1208068 1209744 1212338 1215754 1219870 1224773 1230568
57484 1230568 1237204 1244461 1251949 1259285 1266549 1274381 1283278 1293018 1303090 1313439 1324253 1335239 1345752
57471A345752R861R676R884R958R685R268Q959Q956R336R867J0129J0025R845
57458A471201R727R547R376R485R733R603R058Q695Q873R279R665J0237J1035
57445A595514J1573J1544J1303J1215J1185J1084J1132J1393J1569J1587J1814
57434A720913J2358J2801J2923J3003J3109J2931J2614J2837J3578J3821J3057
57423A863945J2128J1888J1967J1748J1610J2187J3181J3957J4649J5606J6313
57412B009179J6048J5210J4808J4966J4975J4673J4592J4853J4927J4556J4026
57401B172813J3477J2756J2047J1908J2503J3399J4169J4778J5324J5892J6581
57390B325647J7267J7460J6834J5838J5309J5615J6464J7411J8137J8483J8556
$$ plain form
57471 1345752 1355613 1365289 1375173 1385131 1394816 1404084 1413043 1421999 1431335 1441202 1451331 1461356 1471201
57458 1471201 1480928 1490475 1499851 1509336 1519069 1528672 1537730 1546425 1555298 1564577 1574242 1584479 1595514
57445 1595514 1607087 1618631 1629934 1641149 1652334 1663418 1674550 1685943 1697512 1709099 1720913
57434 1720913 1733271 1746072 1758995 1771998 1785107 1798038 1810652 1823489 1837067 1850888 1863945
57423 1863945 1876073 1887961 1899928 1911676 1923286 1935473 1948654 1962611 1977260 1992866 2009179
57412 2009179 2025227 2040437 2055245 2070211 2085186 2099859 2114451 2129304 2144231 2158787 2172813
57401 2172813 2186290 2199046 2211093 2223001 2235504 2248903 2263072 2277850 2293174 2309066 2325647
57390 2325647 2342914 2360374 2377208 2393046 2408355 2423970 2440434 2457845 2475982 2494465 2513021
57379B513021J8641J8715J8362J7468J6585J6198J6074J5805J5508J5486J5619
57368B697482J5749J6156J7022J7801J7875J7552J7671J8478J9503K0311K0776
57357B896376K0845K0690K0851K1564K2214K2099K1426K0972K0936K0939K0841
57346C129753K0841K0896K0746K0447K0282K0250K0176K0139K0256K0252J9888
57335C353926J9545J9782K0510K1168K1557K1897K2258K2494K2511K2198K1365
57324C589211K0309J9918K0616K1698K2305K2514K2722K2632K1899K1199K1436
57313C826459K2222K2369K1675K1008K0769K0604K0565K1199K2261K2599K1764
57302D063494K0684K0347K0718K1268K1754K2053K2009K1776K1710K1691K1300
$$ plain form
57379 2513021 2531662 2550377 2568739 2586207 2602792 2618990 2635064 2650869 2666377 2681863 2697482
57368 2697482 2713231 2729387 2746409 2764210 2782085 2799637 2817308 2835786 2855289 2875600 2896376
57357 2896376 2917221 2937911 2958762 2980326 3002540 3024639 3046065 3067037 3087973 3108912 3129753
57346 3129753 3150594 3171490 3192236 3212683 3232965 3253215 3273391 3293530 3313786 3334038 3353926
57335 3353926 3373471 3393253 3413763 3434931 3456488 3478385 3500643 3523137 3545648 3567846 3589211
57324 3589211 3609520 3629438 3650054 3671752 3694057 3716571 3739293 3761925 3783824 3805023 3826459
57313 3826459 3848681 3871050 3892725 3913733 3934502 3955106 3975671 3996870 4019131 4041730 4063494
57302 4063494 4084178 4104525 4125243 4146511 4168265 4190318 4212327 4234103 4255813 4277504 4298804
57291D298804K0712K0670K1320K1945K2072K1990K1926K1573K0891K0526K0880
57280D533309K1431K1533K1345K1399K1716K1865K1682K1496K1743K2553K3569
57269D773641K4159K4049K3597K3210K2837K2464K2690K3845K4895K4314K2069
57258E031770J9752J8558J8159J7800J7402J7147J6886J6563J6412J6294J5530
57247E222273J3952J2460J1962J2392J3187J4090J4894J5129J4667J4222J4596
57236E373824J5664J6597J6773J6118J4931J3812J3330J3390J3287J2716J2224
57225E532666J2283J2453J2017J1042J0176R702R413R257R425R801R763Q785P094
57212E663877N567M943N087N165M718M303M661N528N925N573N259N659O477P117
$$ plain form
57291 4298804 4319516 4340186 4361506 4383451 4405523 4427513 4449439 4471012 4491903 4512429 4533309
57280 4533309 4554740 4576273 4597618 4619017 4640733 4662598 4684280 4705776 4727519 4750072 4773641
57269 4773641 4797800 4821849 4845446 4868656 4891493 4913957 4936647 4960492 4985387 5009701 5031770
57258 5031770 5051522 5070080 5088239 5106039 5123441 5140588 5157474 5174037 5190449 5206743 5222273
57247 5222273 5236225 5248685 5260647 5273039 5286226 5300316 5315210 5330339 5345006 5359228 5373824
57236 5373824 5389488 5406085 5422858 5438976 5453907 5467719 5481049 5494439 5507726 5520442 5532666
57225 5532666 5544949 5557402 5569419 5580461 5590637 5600339 5609752 5619009 5628434 5638235 5647998 5656783 5663877
57212 5663877 5669444 5674387 5679474 5684639 5689357 5693660 5698321 5703849 5709774 5715347 5720606 5726265 5732742 5739859
57198E739859P479P731P724P191O174M903L536K296J521J264J135Q21M07Ko99
57183E791344k063l880n343n662m818l793l788m929o073o318o273p083q593r511
57169E713217r354r033r280r567r043p721o168m751l630k893k229j151J19O62
57155E639178J27p23j160j491k373l790n293o736q211r764j1518j3647j5900j7840
57141E540859j9788k2678k6479k9738l1343l1946l2767l3695l3574l1900k9271
57130E217680k6393k3491k0552j7623j4872j2741j1733j1783j2265j2804j3477
57119E039946j3969j3396j1410q654n521j265M862J2376K0228K7989L5651M3052
57107E129889N0471N9217P0693Q5429J03808J26971J55987J90914K31858K80471
$$ plain form
57198 5739859 5747338 5755069 5762793 5769984 5776158 5781061 5784597 5786893 5788414 5789678 5790813 5791634 5792041 5792043 5791344
57183 5791344 5789281 5785401 5780058 5774396 5769578 5765785 5761997 5757068 5750995 5744677 5738404 5731321 5722728 5713217
57169 5713217 5703863 5694830 5685550 5675983 5666940 5659219 5653051 5648300 5644670 5641777 5639548 5638397 5638516 5639178
57155 5639178 5639305 5638582 5637422 5635931 5633558 5629768 5624475 5617739 5609528 5599764 5588246 5574599 5558699 5540859
57141 5540859 5521071 5498393 5471914 5442176 5410833 5378887 5346120 5312425 5278851 5246951 5217680
57130 5217680 5191287 5167796 5147244 5129621 5114749 5102008 5090275 5078492 5066227 5053423 5039946
57119 5039946 5025977 5012581 5001171 4992517 4986996 4985731 4990593 5002969 5023197 5051186 5086837 5129889
57107 5129889 5180360 5239577 5310270 5395699 5499507 5626478 5782465 5973379 6205237 6485708
57097F485708L39195M09359M90977N83840O87445P99836R17213J034312J144666
57088A2892551J241445J319165J374330J404636J409280J389869J346635J270796
57080B3648707J145130R59103P23140M61525J89507r6707m03876p20884j019293
57071B4886352j271853j465228j596829j667343j679939j642764j567731j466845
57063A2527820j350590j228041j106175r89186q79489p79029o88847o08162n35321
57054D362980m69652m11548l60936l16681k77717k43829k14902j89999j67836
57045A709880j47859j30296j15240j02213r0648q0328p1134o2778n4989m7679
57035H06716m0717l3819k6888k0114j3385o035K391J1307J9431K5528K8257K5807
$$ plain form
57097 6485708 6824903 7234262 7725239 8309079 8996524 9796360 10713573 11747885 12892551
57088 12892551 14133996 15453161 16827491 18232127 19641407 21031276 22377911 23648707
57080 23648707 24793837 25752940 26476080 26937605 27127112 27030405 26626529 25905645 24886352
57071 24886352 23614499 22149271 20552442 18885099 17205160 15562396 13994665 12527820
57063 12527820 11177230 9949189 8843014 7853828 6974339 6195310 5506463 4898301 4362980
57054 4362980 3893328 3481780 3120844 2804163 2526446 2282617 2067715 1877716 1709880
57045 1709880 1562021 1431725 1316485 1214272 1123624 1043296 972162 909384 854395 806716
57035 806716 765999 732180 705292 685178 671793 665758 668149 679456 698887 724415 752672 778479
57023G78479J6859K329j4523l0004m1841m9449n3347n4614n4206n2305m8690m3822
57011C54866l8956l4904l1302k7494k3584k0120j7240j4680j2276r930p479n121
56999A11780l581l222l248k446o45J195K300K831L261L648L874M133M794N904
56985A30578P077P794P711O765N140L117Q51j647m357p120r642j1594j2686j2777
56971A09210j1955j0532q916p427o093m622k672k42K329M776P185R738J2288J4360
56957A07427J5551J5764J5050J3353J0534O622J984k678o522q841r498r141q760
56944A40845q732q478p263n269l341j756R5K590N138P110Q994J1751J5262J8221
56930A75167J9586J9318J7492J3622P504K13o460j1420j4688j6664j7603j7787
$$ plain form
57023 778479 795338 797667 783144 753140 711299 661850 608503 553889 499683 447378 398688 354866
57011 354866 315910 281006 249704 222210 198626 178506 161266 146586 134310 124380 116901 111780
56999 111780 108199 104977 101729 99283 98638 99833 102133 104964 108225 111873 115747 119880 124674 130578
56985 130578 137655 145449 153160 159925 165065 168182 169033 167386 163029 155909 146267 134673 121987 109210
56971 109210 97255 86723 77807 70380 64287 59665 56993 56751 59080 63856 71041 80779 93067 107427
56957 107427 122978 138742 153792 167145 177679 184301 186285 183607 177085 168244 158746 149605 140845
56944 140845 132113 123635 116372 111103 107762 106006 106101 108691 113829 120939 129933 141684 156946 175167
56930 175167 194753 214071 231563 245185 252689 252902 246442 235022 220334 203670 186067 168280
56918A68280j7617j7221j6321j4730j2777j0984r418p755n971m589m050m086l980
56905C8781l346k356j390p41o09r16j071m06J038K559L743M899O291P561Q387
56890F2424R220J0740J2866J4870J6231J6855J6639J5448J3397J0717P444L729
56878B10580K31k374m081n123n255m194k557j293k20J817N114Q563J1393J4358
56864B26959J8452K3321K7854L1676L5054L7574L7973L5285K9566K1469J1812
56853E36995J650p735j5272k0411k3052k3429k1995j9207j5393j0928o254j464
56841C73505L896J0293J7596K5337L3349M1644M9683N6290O0340O1068N7610M8918
56829H39529L4837J7185q51j6607k9136l8592m5014m8189m8409m6644m3650l9358
$$ plain form
56918 168280 150663 133442 117121 102391 89614 78630 69212 61457 55486 50897 46847 42761 38781
56905 38781 35435 33079 31689 30948 30339 29423 28352 27946 28984 31543 35286 40185 46476 54037 62424
56890 62424 71644 82384 95250 110120 126351 143206 159845 175293 188690 199407 206851 210580
56878 210580 210811 208437 204356 199233 193978 189784 187227 185934 185714 187531 192645 201208 212601 226959
56864 226959 245411 268732 296586 328262 363316 400890 438863 474148 503714 525183 536995
56853 536995 538645 530910 515638 495227 472175 448746 426751 407544 392151 381223 374969 373505
56841 373505 377401 387694 405290 430627 463976 505620 555303 611593 671933 733001 790611 839529
56829 839529 874366 891551 890700 874093 844957 806365 761351 713162 664753 618109 574459 535101
56817E35101l3451k6220j8395j0375k113O310J4467K2013K8924L5097L9945M2376
56805F33679M1103L5188K4844J1757j706j3771k3683l1194l6237l9027l9887l8828
56793E22238l5808l1481k7082k3255j9541j5225j0204m756R37O552J1448J5242
56781C89065J8163K0209K0326J7238J1027L327m115j0589j6121k0697k4101k6297
56769C77435k7531k8011k7596k5965k3161j9928j7167j5069j3067j0821q845p806
56757A52468p475o925n743m551m144m442m656m242l409k619j938j172m65l31r83
56742I9373j929k531k618k330j635n65L12K64o65j573j765j414j054q52o42l55
56726H0021j24p6k06l09q9M81R36Q02K29j97j64K90J152K278K938K362R08j61
$$ plain form
56817 535101 501650 475430 457035 446660 444547 450857 465324 487337 516261 551358 591303 633679
56805 633679 674782 709970 734814 746571 744865 731094 707411 676217 639980 600953 561066 522238
56793 522238 486430 454949 427867 404612 385071 369846 359642 354886 355823 362375 373823 389065
56781 389065 407228 427437 447763 465001 476028 479355 475240 464651 448530 427833 403732 377435
56769 377435 349904 321893 294297 268332 245171 225243 208076 193007 179940 169119 160274 152468
56757 152468 144993 138068 132325 127774 123630 119188 114532 110290 106881 104262 102324 101152 100687 100356 99373
56742 99373 97444 94913 92295 89965 88330 87765 88077 88341 87676 86103 84338 82924 81870 81018 80376 80021
56726 80021 79897 79821 79615 79306 79217 79698 80634 81436 81665 81468 81304 81594 82746 85024 87962 90324 91232 91071
56708I1071k56m6j21mQ74K016K462K037J281N21j47l76J34R59J279Q68J38n55
56690A02135j149j501j416j008n54k2P39J411J357M40p44j537j777j677j458j246
56674I1993j063q62o39m15q3N46J417K168K579K749K797K708K697L140L968M630
56658A18330N002N655O711P200O330M860M195M515M764M293L469K708J951J186
56644A81169O51K18n79j690k445k544k484k709l034l273l685m356m695m147l066
56629A43331k300k183k368k466k414k276k078j875j736j632j513j416j408j399
56615A16267j122l57P26J557J630J070M74J93Ll17n33l95j28j8J56O81J133P87
56597A21807k58j048r96m80j07K0K8j09l28l17L4M06N45O97J141J587J457O44
$$ plain form
56708 91071 90815 90769 90648 90644 91518 93534 95996 98033 99314 99835 99688 99312 99446 100405 101684 102552 102690 102135
56690 102135 100986 99485 98069 97061 96507 96485 97224 98635 99992 100432 99688 98151 96374 94697 93239 91993
56674 91993 90930 90068 89429 89014 88931 89477 90894 93062 95641 98390 101187 103895 106592 109732 113700 118330
56658 118330 123332 128987 135698 142898 149228 154088 158283 162798 167562 171855 175324 178032 179983 181169
56644 181169 181820 182038 181459 179769 177324 174780 172296 169587 166553 163280 159595 155239 150544 146397 143331
56629 143331 141031 138848 136480 134014 131600 129324 127246 125371 123635 122003 120490 119074 117666 116267
56615 116267 115145 114788 115514 117071 118701 119771 120245 120438 120441 120124 119591 119196 119068 119050 119206 119887 121020 121807
56597 121807 121549 120501 119505 119025 118918 118938 118966 118857 118529 118212 118246 118652 119197 119894 121035 122622 124079 124723
56579A24723l52r60r20k31R41K193K990K989K317J444Q36P50J317K521M035N242
56563A49835N826O256P276Q855J0133J0562J0573J0773J0962J0419Q890O831M864
56550B62055L454K832K752K516J655N17k42m88n68o58p63j067j746k514k972l255
56534B61508l757m367m540m138l621l420l611m128m730m937m527l989l842l741
56520B04160l044k059j767k303k706k388j941k116k815l500l876l783l089k051
56506A66722j261q84n48j42n4k89k54J97L43k11o99l45L37K92m33p47o3R74J356
56487A64291P59k82q50l86P27J403J031J64k24M1L53K69m8k76l31k70j24N4K26
56468A66527M47P32R65J096J308J799K431K783K539J748P78L3l75o67r90j076
$$ plain form
56579 124723 124371 123411 122491 122260 123201 125394 128384 131373 133690 135134 135970 136720 138037 140558 144593 149835
56563 149835 155661 161917 169193 178048 188181 198743 209316 220089 231051 241470 250360 257191 262055
56550 262055 265509 268341 271093 273609 275264 275781 275539 275051 274483 273825 273062 271995 270249 267735 264763 261508
56534 261508 257751 253384 248844 244706 241085 237665 234054 229926 225196 220259 215732 211743 207901 204160
56520 204160 201116 199057 197290 194987 192281 189893 187952 185836 183021 179521 175645 171862 168773 166722
56506 166722 165461 164577 164029 163887 163833 163544 163290 163487 163830 163619 162920 162575 162912 163204 162771 162024 161961 162935 164291
56487 164291 165050 164768 163918 163532 164259 165662 166693 166857 166633 166674 167027 167296 167248 166972 166641 166371 166247 166301 166527
56468 166527 166974 167706 168671 169767 171075 172874 175305 178088 180627 182375 183153 183186 182811 182144 181154 180078
56452A80078o12J39N28L92K40L69L62j52p06n16L46R31O55J2j37L26P81Q32P87
56433A84655J021J254R35J29m84n79n07n55m89j78nj68j76L44Q72P58L02K51O26
56414A88006R35J170J609J908J554J004J187J883J935J136O25R99J392J011M26
56399B06780N69J336J945K011J580P41j88o66o14o19j041j519j699j747j764j447
56383B03658p42j11K79P76J282R86l20j607k017k000k262k439j813o43K17N82
56367A93826R18J445K039K660L202L315K954K657K666K452J719J161J454K095
56353B24563K211J904J818J930J780J515J659K097K224J967J736J602J305R37
56339B49248Q81J226J831K636L332L232K217J345J650K775L638M004M361M667
$$ plain form
56452 180078 179466 179605 180133 180525 180765 181134 181496 181344 180638 180122 180468 181399 182054 182066 181929 182255 183036 183868 184655
56433 184655 185676 186930 187865 187994 187510 186931 186424 185869 185380 185202 185197 185029 184853 185197 186069 186827 187129 187380 188006
56414 188006 188941 190111 191720 193628 195182 196186 197373 199256 201191 202327 202952 203951 205343 206354 206780
56399 206780 207349 208685 210630 212641 214221 214962 214774 214108 213494 212875 211834 210315 208616 206869 205105 203658
56383 203658 202916 202805 203084 203860 205142 206128 205808 204201 202184 200184 197922 195483 193670 193027 193244 193826
56367 193826 194744 196189 198228 200888 204090 207405 210359 213016 215682 218134 219853 221014 222468 224563
56353 224563 226774 228678 230496 232426 234206 235721 237380 239477 241701 243668 245404 247006 248311 249248
56339 249248 250129 251355 253186 255822 259154 262386 264603 265948 267598 270373 274011 278015 282376 287043
56325B87043M357L474K775K670K841K836K401J448L77J1N37R20K75p08o96M03
56309C10964J572K264K614K442J503N71Q54K219L304L449L283L242K895K176J911
56294C45263K518L247L379L293L622M150M252L942L763L989M465M956N267N252
56280D01358M966M735M928N714O995Q299R005Q934Q671Q907R678J0612J1547J2514
56266E16863J3376J4053J4838J6016J7489J9209K1516K4417K7107K9028L0934
56255G44846L4019L8313M2872M7350N2356N8426O5450P3029Q0708Q8061R5149
56244A420579J02476J09757J15427J18322J19242J19612J19091J15853J08904
56235B449263R8719Q5840P0421N3135L5124J6882j677k0029l7095n2522o6549
$$ plain form
56325 287043 291400 294874 297649 300319 303160 305996 308397 309845 310222 310233 310770 311690 311965 311257 310561 310964
56309 310964 312536 314800 317414 319856 321359 321930 322784 325003 328307 331756 335039 338281 341176 343352 345263
56294 345263 347781 351028 354407 357700 361322 365472 369724 373666 377429 381418 385883 390839 396106 401358
56280 401358 406324 411059 415987 421701 428696 436995 446000 454934 463605 472512 482190 492802 504349 516863
56266 516863 530239 544292 559130 575146 592635 611844 633360 657777 684884 713912 744846
56255 744846 778865 817178 860050 907400 959756 1018182 1083632 1156661 1237369 1325430 1420579
56244 1420579 1523055 1632812 1748239 1866561 1985803 2105415 2224506 2340359 2449263
56235 2449263 2547982 2633822 2704243 2757378 2792502 2809384 2807707 2787678 2750583 2698061 2631512
56224B631512p8685q7875r4154r8727j02212j04063j04004j02669j00495r7161
56214A661467r2517q6998q0951p4565o8622o3949o0052n5538n0198m5296m1484
56203I41297l7967l4154l0723k8279k6240k3796k1046j8493j6259j4336j2850
56192F77154j1695j0593r671r127q421o821m744l297k549j649o90q31k220l418
56178F01428l391k647j932j149j88O08J241K130L068L403L419L970M657M230L134
56163F21981L408N460P193P266P001P695Q351P793P154Q191J0551J2602J3910
56150G28556J5129J6326J7241J8510K1057K4703K8679L3011L8284M4584N1558
56139A037638N8876O5943P1906P6584Q0349Q2573Q1604P7173P1332O6030O1161
$$ plain form
56224 2631512 2552827 2464952 2370798 2272071 2169859 2065796 1961792 1859123 1758628 1661467
56214 1661467 1568950 1481952 1401001 1326436 1257814 1193865 1133813 1078275 1028077 982781 941297
56203 941297 903330 869176 838453 810174 783934 760138 739092 720599 704340 690004 677154
56192 677154 665459 654866 645195 636068 627647 620826 616082 612785 610236 608587 607897 607066 604846 601428
56178 601428 598037 595390 593458 592309 592121 592729 593970 596100 599168 602571 605990 609960 614617 618847 621981
56163 621981 625389 630849 638042 645308 652309 660004 668355 676148 683302 691493 702044 714646 728556
56150 728556 743685 760011 777252 795762 816819 841522 870201 903212 941496 986080 1037638
56139 1037638 1096514 1162457 1234363 1310947 1391296 1473869 1555473 1632646 1703978 1770008 1831169
56128A831169N6167N1798M8692M5609M0938L4919K8732K2382J5205P614N60o116
56116B177669j3315k1201k9547l8752m8994n8865o6382p0936p3149p3363p1462
56105A611703o7709o2573n6293m9483m3364l8368l3441k7778k2265j8034j4659
56094A177736j1237q187o401n368l780j511M79J779K863M145N709P485Q903R145
56080A181760Q419Q058Q639R201R177R580J1166J2895J3565J3637J4070J4753
56068A314920J5409J6619J8379J9257J8581J7961J8907K0482K1178K1536K2776
56057A526005K4211K4437K3921K4162K5200K6024K6548K7170K7370K6671K6023
56046A807742K6340K6832K6600K6590K7929K9681L0424L0736L1875L3309L3946
$$ plain form
56128 1831169 1887336 1939134 1987826 2033435 2074373 2109292 2138024 2160406 2175611 2183225 2183785 2177669
56116 2177669 2164354 2143153 2113606 2074854 2025860 1966995 1900613 1829677 1756528 1683165 1611703
56105 1611703 1543994 1481421 1425128 1375645 1332281 1293913 1260472 1232694 1210429 1192395 1177736
56094 1177736 1166499 1158312 1151911 1146543 1142763 1141252 1141731 1143510 1146373 1150518 1156227 1163712 1172615 1181760
56080 1181760 1190179 1198237 1206876 1216077 1225254 1234834 1246000 1258895 1272460 1286097 1300167 1314920
56068 1314920 1330329 1346948 1365327 1384584 1403165 1421126 1440033 1460515 1481693 1503229 1526005
56057 1526005 1550216 1574653 1598574 1622736 1647936 1673960 1700508 1727678 1755048 1781719 1807742
56046 1807742 1834082 1860914 1887514 1914104 1942033 1971714 2002138 2032874 2064749 2098058 2132004
56035B132004L4474L6167L8497M0307M2063M4618M7129M8566M9923N2467N5307
56024B621522N7231N9236O2561O6003O8104P0179P3982P8196Q0656Q2315Q5392
56013C405377Q9211R1763R3885R7872J03142J07345J10690J15219J20807J25822
56003D461133J30726J37089J44137J50226J56563J65369J75606J84732J93366
55994E898947K03871K15789K27256K39404K54507K71293K87098L03119L22337
55985H223621L43964L65453L88335M16080M47922M81023N16938N59363O07217
55976A2349916O57055P10563P72432Q42697R18960J004243J104236J218987J346377
55967B0925466J491723J664362J867238K100856K375214K706707L106746L587498
$$ plain form
56035 2132004 2166478 2202645 2241142 2281449 2323512 2368130 2415259 2463825 2513748 2566215 2621522
56024 2621522 2678753 2737989 2800550 2866553 2934657 3004836 3078818 3157014 3237670 3319985 3405377
56013 3405377 3494588 3586351 3680236 3778108 3881250 3988595 4099285 4214504 4335311 4461133
56003 4461133 4591859 4728948 4873085 5023311 5179874 5345243 5520849 5705581 5898947
55994 5898947 6102818 6318607 6545863 6785267 7039774 7311067 7598165 7901284 8223621
55985 8223621 8567585 8933038 9321373 9737453 10185375 10666398 11183336 11742699 12349916
55976 12349916 13006971 13717534 14489966 15332663 16251623 17255866 18360102 19579089 20925466
55967 20925466 22417189 24081551 25948789 28049645 30424859 33131566 36238312 39825810
55959C9825810M176818M913715N833146O972256Q386341J0135287J2252845J4743901
55951A07240119J7590751K0706842K3862446K6678969K8690538K9364113K8088790
55944B82222568K4327205J7991654R742658Q40763p400003j4112605j8999514
55937B94612726k2156099k3853109k4395861k4042259k2979479k1369144j9400076
55930A36416699j7276464j5164010j3167930j1351921r750999q367300p178826
55923E4159249o162237n300063m570985l949883l419577k971219k593001k269230
55915B2923054j990447j754036j554349j381399j229549j098735r86645q87596
55907A2040298p99353p23483o58636o00357n47580n02557m64359m28912l95413
$$ plain form
55959 39825810 44002628 48916343 54749489 61721745 70108086 80243373 92496218 107240119
55951 107240119 124830870 145537712 169400158 196079127 224769665 254133778 282222568
55944 282222568 306549773 324541427 334284085 335124848 327724845 313612240 294612726
55937 294612726 272456627 248603518 224207657 200165398 177185919 155816775 136416699
55930 136416699 119140235 103976225 90808295 79456374 69705375 61338075 54159249
55923 54159249 47997012 42696949 38125964 34176081 30756504 27785285 25192284 22923054
55915 22923054 20932607 19178571 17624222 16242823 15013274 13914539 12927894 12040298
55907 12040298 11240945 10517462 9858826 9258469 8710889 8208332 7743973 7315061 6919648
55898F919648l66387l41436l17108k93010k71956k53978k36032k17838k02187
55889D419716j89170j75726j61429j49121j39314j29336j18827j10912j06773
55880C139108j03992j01158r9500r8848r6587r1998q7398q3823p9554p4111o9760
55869B152379o7621o5878o3223o0754n9200n7445n4980n2916n1497m9402m6364
55858A523099m3697m1630l8877l5466l3055l1854l0220k7971k6974k7641k7897
55847A157817k6645k5371k5222k5249k4590k3881k3416k2354k0769k0038k0324
55836H99958k0005j8485j7209j6899j6267j4510j2829j2276j2178j1750j1371
55825G36179j1270j0870j0176j0076j0578j0614j0151j0423j1554j2128j1681
$$ plain form
55898 6919648 6553261 6211825 5894717 5601707 5329751 5075773 4839741 4621903 4419716
55889 4419716 4230546 4054820 3893391 3744270 3604956 3475620 3356793 3245881 3139108
55880 3139108 3035116 2933958 2834458 2735610 2639023 2547025 2459627 2375804 2296250 2222139 2152379
55869 2152379 2084758 2018880 1955657 1894903 1835703 1778258 1723278 1670362 1618865 1569463 1523099
55858 1523099 1479402 1437772 1398895 1363429 1330374 1298520 1268300 1240329 1213355 1185714 1157817
55847 1157817 1131172 1105801 1080579 1055330 1030740 1006859 983443 961089 940320 920282 899958
55836 899958 879953 861468 844259 827360 811093 796583 783754 771478 759300 747550 736179
55825 736179 724909 714039 703863 693787 683209 672595 662444 652021 640467 628339 616658
55814F16658j1390j1707j1502j0385r586r639r407q256p081o321n110l256j938
55801E11080j540r97o1J64k72K83J935K398P66o16J73J686J920J607K259L006
55785E23791K135K80o53o94j535l790o728r983j3427j5941j6348j5242j4197j3463
55771D14205j2087r909p855o364n033l759l033l084l643m410n014m913m014l024
55757C38063k482k095j600j513k130k623k205j485j568k424l227l752m370n051
55743C01538n461n725o069o059n172l878l223l457l884l924l564k934k109j349
55729B44730r73j045j462k185l147m127m897n211m736l482k277j967k244k123
55715B04854j631j692k234j890k51J154J086M90R10K203L139L361L282K702J095
$$ plain form
55814 616658 605268 593561 582059 571674 562088 552449 543042 534786 527705 521384 516274 513018 511080
55801 511080 509540 508543 508482 508646 508374 508657 510592 512990 513756 513140 513313 514999 516919 518526 520785 523791
55785 523791 525926 526206 525553 524859 523324 519534 512806 502823 489396 473455 457107 441865 427668 414205
55771 414205 402118 392209 384354 377990 372957 369198 366165 363081 359438 355028 350014 345101 341087 338063
55757 338063 335581 333486 331886 330373 328243 325620 323415 321930 320362 317938 314711 310959 306589 301538
55743 301538 296077 290352 284283 278224 273052 269174 265951 262494 258610 254686 251122 248188 246079 244730
55729 244730 243757 242712 241250 239065 235918 231791 226894 221683 216947 213465 211188 209221 206977 204854
55715 204854 203223 201531 199297 197407 197156 198310 199396 199886 200796 202999 206138 209499 212781 215483 216578
55700B16578j047k505k917k975l202l447l522l481l324l085k984l034k776k039
55686A76240j422j382j372o13P46K073L279M520N400N429M941M470L634J782n23
55671B07202j944k251k518l280l733l113j865q37j52M52Q25O35J54J12P76J610
55655A92073J969J806J558J467J329R63N83M29K73k57j040j611j905k209k422
55640A93006k095j336r41j302j983k632l556m836n615n067l562k207j599j615
55626A54660k003k538k844k726k521k586k688k332j509o43m9J40k57j218k272
55611A28614k875k954k766k422j911j369r85q07q72j280j910k361k424k285k106
55596I9287j780j330j079j148j165p84r7O65J381J773J400L49n50o20k7O43J095
$$ plain form
55700 216578 215531 213026 210109 207134 203932 200485 196963 193482 190158 187073 184089 181055 178279 176240
55686 176240 174818 173436 172064 171451 172197 174270 177549 182069 187469 192898 197839 202309 205943 207725 207202
55671 207202 205258 203007 200489 197209 193476 190363 188498 187661 187509 187961 188786 189421 189575 189687 190463 192073
55655 192073 194042 195848 197406 198873 200202 201165 201748 202177 202450 202193 201153 199542 197637 195428 193006
55640 193006 190911 189575 188634 187332 185349 182717 179161 174325 168710 163643 160081 157874 156275 154660
55626 154660 152657 150119 147275 144549 142028 139442 136754 134422 132913 132270 132221 132361 132104 130886 128614
55611 128614 125739 122785 120019 117597 115686 114317 113332 112525 111653 110373 108463 106102 103678 101393 99287
55596 99287 97507 96177 95098 93950 92785 92001 91904 92569 93950 95723 97123 97472 96922 96302 96275 96918 98013
55579I8013J315J332J387J808K465K805K706K735L322M281N359O558P543P565
55565A49194O416M768L153J361o77k315l123l582m160m495m244l965m348n157
55551A28826n710n739n164l783j977q56q05p26L08J519J716J194J010J156R42
55536A11911O13R01J372R53k4j52O61Q80j71j210j045l07k53r48j552j581j058
55519A08990q5R64J269L47j167k101j988j372j089j446k115k581k707k772k942
55504H9205k966k599k047j718j823k436l543m591m614l368j939j485j798j872
55490E2406j461j102r52o14r0J14p3j54L3J12o2j67k3J97M44P59Q75N65L15P73
55470E1895J632J931J464R28O93M90M08R99K035K359J486L88Oo3o54j566j875
$$ plain form
55579 98013 99328 100660 102047 103855 106320 109125 111831 114566 117888 122169 127528 134086 141629 149194
55565 149194 155610 160378 163531 164892 164215 161900 158777 155195 151035 146540 142296 138331 133983 128826
55551 128826 123116 117377 112213 108430 106453 105597 104792 104066 104374 105893 107609 108803 109813 110969 111911
55536 111911 112524 113425 114797 115750 115726 115574 116235 117115 116944 115734 114689 114382 114129 113181 111629 110048 108990
55519 108990 108905 109869 111138 111485 110318 108217 106229 104857 103768 102322 100207 97626 94919 92147 89205
55504 89205 86239 83640 81593 79875 78052 75616 72073 67482 62868 59500 57561 56076 54278 52406
55490 52406 50945 49843 48891 48277 48187 48301 48228 48074 48107 48219 48157 47990 47967 48164 48608 49367 50242 50807 51122 51895
55470 51895 53527 55458 56922 57850 58543 59033 59441 60440 62475 64834 66320 66708 66714 66651 65997 64431 62556
55453F2556j243j84P02J130J057P44P03J103J440J125K46n64q46o77m89o12r17
55436F5274q70k27M98N98J14k92l51m06o58p87n97l53k94k51rL95Q57J251J249
55417F5141O54j3pM53K79q61j834j483k14N41M9j123j967j991j406p10j54M22
55399E5776J103J467J071L01Q2O31J101P38j91q70q16q6R28J588J450Q17M40M69
55381F5999L09k94p44n79k11k45n56o26l22J35N70P49L71m12q95p21l93m10m41
55362F1284J1O73R05O50K94q7n83q98o76j86O0J47M84Q84Q13L86K66N16N22J19
55342F5584r9J10J54l17p03m32N9P8j17J87Q58J023M31k18m54o83j306j861j661
55323F0633q38j59k6j67k10n2K52N09L81j27k89N77J934K357J292k21r20p61m56
$$ plain form
55453 62556 61313 61129 61831 62961 64018 64762 65465 66568 68008 69133 69379 68815 67969 67292 66803 66191 65274
55436 65274 64404 64177 64675 65273 65387 65095 64744 64338 63680 62893 62296 61943 61649 61398 61389 61784 62641 63892 65141
55417 65141 65795 65782 65775 66228 66507 65646 63812 62329 62115 62656 62705 61582 59615 57624 56218 55508 55354 55776
55399 55776 56879 58346 59417 59718 59800 60431 61532 62270 62079 61209 60393 60307 61235 62823 64273 65090 65530 65999
55381 65999 66308 66014 65270 64691 64480 64235 63679 63053 62731 62866 63436 64185 64556 64144 63249 62528 62135 61725 61284
55362 61284 61295 61968 62873 63523 63817 63730 63147 62249 61573 61387 61447 61594 62078 62962 63775 64161 64427 64943 65465 65584
55342 65584 65485 65595 65749 65432 64729 64297 64356 64434 64317 64504 65362 66385 66816 66598 66144 65461 64155 62294 60633
55323 60633 59795 59636 59610 59443 59233 59181 59433 59942 60323 60196 59907 60484 62418 64775 66067 65846 64926 64165 63709
55304F3709k43J43O20P07K46l82p15n12K19J053J312Q33K93K70M38L02K12P83
55286F9288J658J909J516J280J328Q75l29j436j788j700j559j136l33L23N30P09
55270G1135J090J080L03n85q65q23r84r89k60P56J086P03M10M13P4q32j552j427
55252F8733p42k34j97l30k10K67P21O09n8n81m82k69p15j591j868j140j62K41
55234F1992J63K10N92R80R99N67n0l63q3M86P30M57Q7m6j09k75k58J86O18L94
55214F7277k89n18L1N12N4r63j358o79L29P62N18N0k56k24J71O38P07L19k7l9
55194F7015o6l85n06J43J195J749J622J371J197P30l2m03NO70Q71M99j12o29p47
55175G4187l17L01M98K39J21L75N22K51O2M52J098J284Q03n1r35j448j181k74
$$ plain form
55304 63709 63466 63609 64229 64936 65182 64800 64085 63573 63792 64845 66157 66990 67283 67553 67991 68293 68505 69288
55286 69288 70946 72855 74371 75651 76979 77854 77525 76089 74301 72601 71042 69906 69573 69896 70426 71135
55270 71135 72225 73305 73608 73023 72158 71335 70351 69362 69102 69858 70944 71647 72057 72470 72544 71712 70160 68733
55252 68733 67991 67757 67560 67230 67020 67287 68008 68617 68559 67978 67496 67227 66512 64921 63053 61913 61751 61992
55234 61992 62155 62365 62957 63937 64936 65503 65453 65090 65007 65493 66223 66680 66767 66721 66612 66337 66079 66265 66883 67277
55214 67277 66988 66470 66501 67013 67067 66104 64746 64067 64396 65158 65676 65726 65470 65246 65417 66055 66762 67081 67054 67015
55194 67015 66949 66564 66058 66201 67396 69145 70767 72138 73335 74065 74033 73630 73635 74305 75176 75675 75563 74934 74187
55175 74187 73870 74171 74669 74908 75029 75404 75926 76177 76239 76691 77789 79073 79876 79825 78890 77442 76261 75987
55157G5987M63M60L2k78m77o98n72J78R43Q76P9n97q10r53j176j095n41M8L42
55138G2211N25P54P36K23l99n13q2K96J65k14j78M71J153J210P66N60Q93J186
55120G9763P76j98j028j253r35l59J55K98k5n61r83j231j368j285q03K9R42J638
55102G3572J835J377N14j46k23P7L03K82J32K7J39N26R14R20O27N66R13J220J195
55083H4770J217J580J789J226J49o06p00m58k14n4m1j25k6L17L83k24r76r69j26
55064H6912P78J163J052N80j03m88q7O73P44j00q98q20k24J15Q6rk54q61j442
55045H6817j293l90M57O39L74J89J66N4k27n61r04j200j151n30K52M22j05m93
55027H2516j38M35M09j42n40o48p80p59o3R67J207L93l64j60M68N83K47J50M80
$$ plain form
55157 75987 76450 76910 76942 76664 76187 75489 74917 75095 76038 76914 76993 76396 75586 74633 73457 72362 71821 71869 72211
55138 72211 72736 73490 74226 74449 74050 73537 73455 73751 73916 73702 73524 73995 75148 76358 77124 77684 78577 79763
55120 79763 80539 80341 79313 78060 77125 76766 76921 77219 77194 76633 75650 74419 73051 71766 70963 70992 71934 73572
55102 73572 75407 76784 77298 77152 76929 77006 77309 77591 77723 77750 77889 78415 79329 80249 80876 81442 82355 83575 84770
55083 84770 85987 87567 89356 90582 90731 90125 89425 88967 88753 88699 88658 88533 88507 88824 89207 88983 88007 87038 86912
55064 86912 87690 88853 89905 90485 90382 89894 89807 90480 91224 91124 90226 89406 89182 89297 89383 89374 89120 88259 86817
55045 86817 85524 85134 85591 86230 86604 86793 86959 87013 86786 86225 85321 84121 82970 82440 82692 83114 83009 82516
55027 82516 82378 82813 83222 83080 82540 81892 81112 80353 80290 81257 82464 82857 82493 82333 82801 83384 83631 83781 84261
55008H4261R40J340J475R20k55j092q78j88L1j61j69j86p97j533j200K92J617
54991H4417J817J365J081R73O58J70k15m63o56p09n51l09j00O7J21rj03J81P53
54972H8488J107R98P48P78J141J554J631J111J72n50o19l26k42m52o10o04n56
54955I3769l78J06O76R17Q17O47L78j40n56l00N19J109R35J38q81j717j924j441
54937I2674r50j077j414j101j99N02R64J870L067L306K044M21k53j0M07P78J192
54920A02221J360J041P44J208K371L510M157M391M448M411M181L556K524J525
54906A41648J021P39m8j394k483k802k745k786k803k635k606k904l184l224l315
54891A10479l490l091j889p98o45q55m09M45O29R7k0Q39J802J842J082M19M13
$$ plain form
55008 84261 85201 86541 88016 88936 88681 87589 86711 86523 86554 86393 86224 86038 85241 83708 82508 82800 84417
54991 84417 86234 87599 88680 89653 90311 90481 90266 89803 89147 88438 87887 87578 87478 87545 87666 87657 87554 87735 88488
54972 88488 89595 90593 91341 92119 93260 94814 96445 97556 97728 97178 96559 96233 95991 95539 94929 94325 93769
54955 93769 93391 93497 94173 95090 95907 96554 96932 96792 96236 95936 96455 97564 98499 98637 97756 96039 94115 92674
54937 92674 91724 90647 89233 88132 87933 88435 89399 91269 94336 97642 99686 100107 99854 99844 100251 101029 102221
54920 102221 103581 104622 105366 106574 108945 112455 116612 121003 125451 129862 134043 137599 140123 141648
54906 141648 142669 143408 143360 141966 139483 136681 133936 131150 128347 125712 123106 120202 117018 113794 110479
54891 110479 106989 103898 102009 101211 100566 99711 99302 99747 100376 100473 100453 101292 103094 104936 106018 106437 106850
54874A06850R45J666K396L155L909M423M451M153L925L705K918J429Jo77r70j609
54858A40670k416k558j976j654k306l474m186m023l296k569k234k295k387k164
54844A03132j684j235q75n02k64m62r79j242r15l35m7k08n31o78n00j03K44K84
54826I3100L1k71l67j69K70P28Q74N73J22K8M27Q64P40l4q55r81l39L12J85n33
54806I4705q87l95K79K63k55k66O29J558J474M22o18j015j074j266j372p97M50
54789I1835J613K057J831J243M04m48p08r9O95P44J34j47M37J438K215K570K425
54772A08239J625M60k67j39L90P87J218K043L007L542L624L672L843L975M097
54757A40116M392M619M140K755J090o8o33j155k038l034l598l639l612l829l953
$$ plain form
54874 106850 107795 109461 111857 115012 118921 123344 127795 131948 135873 139578 142496 143925 143926 143249 142279 140670
54858 140670 138254 135696 133720 132066 129760 126286 122100 118077 114781 112212 109978 107683 105296 103132
54844 103132 101448 100213 99338 98836 98572 98110 97131 95889 94974 94639 94592 94384 93853 93175 92675 92572 92816 93100
54826 93100 93131 92860 92493 92324 92594 93322 94196 94769 94891 94919 95346 96210 96950 96916 96061 95080 94741 95053 95238 94705
54806 94705 93818 93423 93702 93965 93710 93444 94073 95631 97105 97527 96909 95894 94820 93554 92182 91385 91835
54789 91835 93448 95505 97336 98579 98983 98535 97827 97728 98423 99167 99301 99154 99591 101029 103244 105814 108239
54772 108239 109864 110324 110057 109918 110308 111095 112313 114356 117363 120905 124529 128201 132044 136019 140116
54757 140116 144508 149127 153267 156022 157112 157044 156411 155256 153218 150184 146586 142947 139335 135506 131553
54742A31553l489k553j749j308r35n04m14r40j720k135j965j411p83l39k11k37
54726A10860q1L40P64J000J128J294J610K247L211L964L853L039K412K444K672
54711A40757K569K197J702Q27n69j990k895l361l683l703l100k096j331j212j671
54696A22441k322k622k217j394q23o40l63J27K32l25r38j104j184j464j300j98
54680A05906R22P46n03j325r95k60K1j60m87r25j432j728j633j240o74p3K22m3
54662I6339n70q00n59J6Q87J862K210J350j26r66p38j07L89R14J535J747J202
54645A04585L30k11k92k37l36o09q18o49j45R9l54j068j206o51j0L76P04J017
54627A00525J028P98P64R01O08k54r61r27m46k6L54P90R36O01L14N80R42O32j45
$$ plain form
54742 131553 128064 125511 123762 122454 121519 121015 120601 119661 117941 115806 113841 112430 111647 111308 111097 110860
54726 110860 110779 111119 111883 112883 114011 115305 116915 119162 122373 126337 130190 133229 135641 138085 140757
54711 140757 143326 145523 147225 148052 147483 145493 142598 139237 135554 131851 128751 126655 125324 124112 122441
54696 122441 120119 117497 115280 113886 113063 112423 112060 112187 112419 112094 111156 110052 108868 107404 106104 105906
54680 105906 106828 107574 107071 105746 104751 104491 104512 104352 103865 102940 101508 99780 98147 96907 96233 96160 96382 96339
54662 96339 95769 94969 94410 94426 95313 97175 99385 100735 100609 99643 98905 98798 99187 100101 101636 103383 104585
54645 104585 104915 104704 104412 104175 103839 103230 102412 101763 101618 101717 101363 100295 99089 98438 98428 98804 99508 100525
54627 100525 101553 102351 103115 104016 104624 104370 103409 102482 102036 102010 102364 103154 104090 104691 105005 105585 106527 107159 107014
54608A07014m11N3L12l52j307j435o63m0k50p60o60Q9P85J072J196J201O16o20
54590A05840j534j171R8R66P38r7p99j166j289j107n64J19O15Q20Q94J048J290
54573A04701J325Q83K31K8M22O27r8j331j933j485o73k04O2P47J979L063L004
54556A11348J539l50j186n84L58N45J76R6M17O43P17R51J147P96R0k16M1L47O15
54537A17490J333K388K833K178J046K01k69m50j76L51L83l53j103j157p81n42
54521A23372l88o8J21j55m83k19M50P37L49k74p36j077j421j692j762j515q40
54504A14399J38Q86Q49Q1p17q48k25O47J216J375J360J188N47m64j027n37L74
54487A19242N51r5n39j90M19O55O25N98M02j11o12p66n88l8J012K053K086J048
$$ plain form
54608 107014 106603 106656 106968 106616 105309 103874 103211 103171 102921 102161 101501 101590 102375 103447 104643 105844 106460 105840
54590 105840 104306 103135 103233 104199 104937 104840 104041 102875 101586 100479 99915 100034 100649 101469 102363 103411 104701
54573 104701 106026 106909 107140 107168 107590 108217 108119 106788 104855 103370 102697 102493 102555 103302 105281 108344 111348
54556 111348 112887 112537 111351 110767 111125 111670 111846 111942 112359 113002 113719 114670 115817 116613 116703 116487 116528 116875 117490
54537 117490 118823 121211 124044 126222 127268 127469 127200 126750 126574 126925 127308 126955 125852 124695 123914 123372
54521 123372 122984 122916 123037 122882 122399 122180 122630 123367 123716 123442 122706 121629 120208 118516 116754 115239 114399
54504 114399 114537 115423 116272 116353 115636 114788 114563 115210 116426 117801 119161 120349 120896 120432 119405 118868 119242
54487 119242 119793 119698 119159 118969 119388 120043 120668 121266 121668 121557 120945 120179 119591 119553 120565 122618 124704 125752
54469A25752K34N72J303J249O23M13O22M06l06o40k12M05P95J182J534J282L81
54452A35595k72o3L91K22l62n27k34k86r55j378p64L79P49j27j320j640r81k54
54434A28173j76n42p05m65k91p13j621k257j966r20J41Q81J670K690L230K536
54418A29665J026j3K4N38P61O15L36q1o75j121j003l00N72J051P99Q8k80J59Q62
54399A33023R63M95K22L63L61O7J08Q16J586J749J341O34k80j001q17J92Q53L57
54381A41032o55j143j030p72l96Q1N0p66j370o98O17J037L50j47K85R20R77P54
54363A39126Q20J062J074Q66O31L48M0L9M92R73R36M29P5L81J242K025K147J631
54345A54337J088J030J379J751J959J955J474K66j343k611l104l057k930k893
$$ plain form
54469 125752 125986 126558 127861 129110 129733 130146 130768 131174 130868 130228 130016 130421 131216 132398 133932 135214 135595
54452 135595 135323 135260 135651 135873 135511 134984 134750 134464 133509 132131 131367 131746 132495 132368 131048 129408 128427 128173
54434 128173 127997 127455 126750 126285 125994 125281 123660 121403 119437 118517 118658 119539 121209 123899 127129 129665
54418 129665 130691 130678 130702 131240 132001 132616 132952 132871 132196 131075 130072 129772 130344 131395 132194 132282 132002 132161 133023
54399 133023 133986 134481 134703 135066 135427 135494 135602 136418 138004 139753 141094 141728 141448 140447 139630 139822 140675 141032
54381 141032 140377 139234 138204 137432 137036 137117 137167 136401 135031 134333 134950 135987 136337 136190 136475 137395 138372 139126
54363 139126 139946 141008 142082 142948 143579 143927 143967 144006 144498 145471 146407 146836 146911 147292 148534 150559 152706 154337
54345 154337 155425 156455 157834 159585 161544 163499 164973 165239 163896 161285 158181 155124 152194 149301
54331A49301k812k540k152j862j707j438r00m23m50p59o41Q1P78R34P17L92j11
54314A36408o02m20N42J278R02j38q00q83q31o52r8M32K63m10p63o85q52j420
54296A31271j699j309p14l55m7L69N47K41j67j54L09R23J457J730J547R43K49
54279A35141k09l21j57J25L69O56J193J720J463J74j202j547r81n04m58k97K50
54262A35415P63R31R22P86L20k17j22P13J437J348P42L30L17M68N85N68L13j19
54244A45500m94p39r68j168j146r63r39j185j430j361q80q4O59P98K19l76k95
54227A35148J92L30Pl10m95o92n66K45J053P34m50r59k35N31M00R5N08J053O92
54208A37281k06l92L18Q28M12m18q02n94l31n32j118j494j242p14n24n49j07Q45
$$ plain form
54331 149301 146489 143949 141797 139935 138228 136790 135890 135467 135017 134258 133617 133698 134476 135410 136127 136519 136408
54314 136408 135806 135386 135928 137206 138108 137970 137170 136287 135456 134804 134706 135138 135401 134991 134228 133543 132691 131271
54296 131271 129572 128263 127549 127194 127147 127516 128063 128304 128137 127983 128292 129215 130672 132402 133949 134892 135141
54279 135141 134932 134611 134454 134579 134948 135604 136797 138517 139980 140154 138952 137405 136424 135920 135462 135165 135415
54262 135415 136178 137109 138031 138817 139137 138920 138798 139511 140948 142296 143038 143368 143685 144153 144738 145306 145619 145500
54244 145500 145006 144267 143299 142131 140985 140022 139083 137898 136468 135107 134227 134143 134802 135600 135819 135443 135148
54227 135148 135340 135670 135677 135367 134872 134180 133614 133859 134912 135646 135196 134237 134002 134533 134933 135028 135536 136589 137281
54208 137281 137075 136683 137001 137829 138241 137823 137021 136427 136096 135564 134446 132952 131710 130996 130472 129923 129816 130661
54190A30661J471J293Q04M15k05j133j457n34P50J027K92l06j84K21M72N74M12
54173A34573k20r42j002l76J01o0l73k09L54Q53J121J231J138P38J94j59j29K27
54155A37060O88R15N56m88j775k492k066p36N62J009N92p1m15l06Q9M66N57M35
54137A34580M82P63O88j41j038r78j36K76j79m98J64J203J517J019M42J81P1l9
54119A38377j77l87m77J6J065J777J437N71K14M66N84K49r0j35j61l64m24o5M85
54100A42961Q03P64N39L23K22K59L78M46K38m10j297j742j230j20O74Q18Q06J001
54082A45433J099Q05L89J92K06M92J299K268K395J373L22L09Q52Q08J02m35m73
54065A57436l02P9Q78J700J958J915K260K792K709K103K005K746L566M015M642
$$ plain form
54190 130661 132132 133425 134229 134644 134439 133306 131849 131315 132065 133092 133384 133078 132894 133115 133587 134161 134573
54173 134573 134353 133411 132409 132033 132134 132074 131701 131492 131846 132699 133820 135051 136189 136927 137121 136962 136833 137060
54155 137060 137748 138663 139219 138731 136956 134464 132398 131662 132224 133233 133825 133754 133339 133033 133122 133588 134145 134580
54137 134580 135062 135825 136513 136372 135334 134356 134220 134496 134317 133819 133983 135186 136703 137722 138164 138345 138416 138377
54119 138377 138200 137813 137336 137352 138417 140194 141631 142202 142416 142882 143466 143715 143625 143490 143329 142965 142541 142476 142961
54100 142961 143764 144528 145067 145390 145612 145871 146249 146695 146933 146523 145226 143484 142254 142134 142808 143626 144432 145433
54082 145433 146532 147337 147726 147918 148124 148616 149915 152183 154578 155951 156273 156582 157434 158242 158344 157909 157436
54065 157436 157134 157213 158091 159791 161749 163664 165924 168716 171425 173528 175533 178279 181845 185860 190502
54050A90502N812O876P029O164M546K474O35j70q6k10j002j587j194l38R6K76
54034B19823R52K151L193L713L933M053M037L855L482K795J853J061O92N67N04
54019B56664P31J358J847J562O20l57j120j916k855l662m046l993l692l448l557
54004B34136m009m413m444m103l471k556j678j507k218k985k921k205j661j498
53990A94467j236p66o33j056j438j234p23m92n79o02m50l63m18l57j4L93N08K65
53972A85272q5l12m44o75j064j444j592j383p83J41J113J761J958J979K088K119
53956A88649J767J153P77R20J319J584J693K000K871M424O307P707P836O654M993
53941B40654L740L075K651K320K289K637L113L453L619L573L148K365J594J180
$$ plain form
54050 190502 196314 203190 210219 216383 220929 223403 224038 223868 223782 223572 222570 220983 219789 219451 219547 219823
54034 219823 220775 222926 226119 229832 233765 237818 241855 245710 249192 251987 253840 254901 255593 256160 256664
54019 256664 257395 258753 260600 262162 262782 262425 261305 259389 256534 252872 248826 244833 241141 237693 234136
54004 234136 230127 225714 221270 217167 213696 211140 209462 207955 205737 202752 199831 197626 195965 194467
53990 194467 193231 192465 191832 190776 189338 188104 187381 186889 186310 185708 185258 184895 184477 184120 184106 184499 185007 185272
53972 185272 185187 184875 184431 183756 182692 181248 179656 178273 177490 177631 178744 180505 182463 184442 186530 188649
53956 188649 190416 191569 192346 193266 194585 196169 197862 199862 202733 207157 213464 221171 229007 235661 240654
53941 240654 244394 247469 250120 252440 254729 257366 260479 263932 267551 271124 274272 276637 278231 279411
53927B79411J087J116J260J554J841K022K375L154M034M419M299M284M735N371
53913C20962N900O445P090P536P643P814Q387R042R410R833J0860J2099J2450
53900D35471J1392R355O656K979j719o449j0000j2133j3412j4147j4207j3804
53888C79982j3627j3879j3794j2622j0781r409q887q527p799p087o793o388n180
53875B55209l640k943l310l790l827l965m519m655l652k282j850k300k423j746
53861B10307j076j100j570k049k557l017k919k070j087o29o08o23p44j232j787
53846A87239j715q32K17O08J11p63j213q23N9O88O95L41J9j86l22l35j99m6O7
53827A83610K95P06J112J342J465J510J316R19P40J044J435J375J011R77J418
$$ plain form
53927 279411 280498 281614 282874 284428 286269 288291 290666 293820 297854 302273 306572 310856 315591 320962
53913 320962 326862 333307 340397 347933 355576 363390 371777 380819 390229 400062 410922 423021 435471
53900 435471 446863 456218 462874 465853 464134 457685 447685 435552 422140 407993 393786 379982
53888 379982 366355 352476 338682 326060 315279 305870 296983 288456 280657 273570 266777 260389 255209
53875 255209 251569 248626 245316 241526 237699 233734 229215 224560 220908 218626 216776 214476 212053 210307
53861 210307 209231 208131 206561 204512 201955 198938 196019 193949 192862 192233 191625 191002 190258 189026 187239
53846 187239 185524 184692 184909 185517 185628 184865 183652 182829 182888 183576 184271 184612 184631 184445 184123 183788 183589 183543 183610
53827 183610 183905 184611 185723 187065 188530 190040 191356 192275 193015 194059 195494 196869 197880 198857 200275
53812B00275J739J456Q70O44R96J588K047K300K487K746L141L650M103M282M180
53797B36504M098M335M758M874M396L610L042K908L052L240L216K606J197n86
53783B81250j795j811r83l04n38j692l136m089m131l406k416j690j581k217l296
53768B48165m132m235l879l827m374m985m957m122k800j417m35k63q70j601j791
53753B04477j489j301j518j769j614j204j084j451j873j784j117k90L29P71J231
53738A90314J624J614J003J14l46R8J068J538R18j07k52P85J896J978J258P48
53722B04251Q30J028R51P33N66M42M26O76J057J282J455J965K729L086K701K060
53706B26238J772J801J720J421J184J284J716K197K350K113J912K130K511K551
$$ plain form
53812 200275 202014 203470 204340 204984 205980 207568 209615 211915 214402 217148 220289 223939 228042 232324 236504
53797 236504 240602 244937 249695 254569 258965 262575 265617 268525 271577 274817 278033 280639 281836 281250
53783 281250 279455 277644 276661 276357 275819 274127 270991 266902 262771 259365 256949 255259 253678 251461 248165
53768 248165 244033 239798 235919 232092 227718 222733 217776 213654 210854 209437 209002 208739 207869 206268 204477
53753 204477 202988 201687 200169 198400 196786 195582 194498 193047 191174 189390 188273 187983 188312 189083 190314
53738 190314 191938 193552 194555 194669 194323 194421 195489 197027 197945 197838 197586 198371 200267 202245 203503 204251
53722 204251 205081 206109 207060 207793 208359 208801 209227 209903 210960 212242 213697 215662 218391 221477 224178 226238
53706 226238 228010 229811 231531 232952 234136 235420 237136 239333 241683 243796 245708 247838 250349 252900
53692B52900K386K586L088L181K682K297K329K010Q09m38o51j45p9o54j005p78
53676B70518o39r80j230r17n75r02j547j550p97k92p64j578j457j61J119J185
53660B59433K19o67q93q23q03o76m31n21j039j260o29L15P26P00R72J606J899
53643B58128J503Q69N25O12J090J793K226K013J527J436J668J580J202J288J961
53628B79421K280J714J081J321K042K196J682J356J688K225K406K202J977K115
53614C05706K754L530L813L574L633M498N350N098M138L928M738N068L872K195
53600C61895J763K689L649L867L766L753L458K544J408O84M85N56O86O33p7j669
53584C90090l546m587m165k799j733j797k625l062k500j610j477k191k837k780
$$ plain form
53692 252900 255286 257872 260960 264141 266823 269120 271449 273459 274268 273830 273179 273034 272955 272301 271296 270518
53676 270518 269879 268899 267669 266752 266177 265275 263728 262178 261381 261089 260325 258747 257290 257129 258248 259433
53660 259433 259652 258985 258092 257269 256466 255790 255359 254838 253799 252539 251910 252225 252951 253651 254623 256229 258128
53643 258128 259631 260500 261025 261637 262727 264520 266746 268759 270286 271722 273390 274970 276172 277460 279421
53628 279421 281701 283415 284496 285817 287859 290055 291737 293093 294781 297006 299412 301614 303591 305706
53614 305706 308460 311990 315803 319377 323010 327508 332858 337956 342094 346022 350760 355828 359700 361895
53600 361895 363658 366347 369996 373863 377629 381382 384840 387384 388792 389476 389961 390517 391203 391836 391759 390090
53584 390090 386544 381957 377792 374993 373260 371463 368838 365776 363276 361666 360189 357998 355161 352381
53570C52381k333k003j789j590j628j905j758o92P04J345J018N05M83R27J462
53555C45127J675J194J55m79K20J883L183L525L541L753L712K980K125K016K626
53540C77236L317L876M577N357N747N669N713O441P739Q966R591R681R860J0642
53526D74412J1778J2469J2354J1966J2003J2502J3124J3827J4844J6084J7133
53515F22496J7799J8293J8875J9653K0724K2139K3627K4647K4870K4501K4057
53504H61681K3873K3867K3761K3490K3249K3066K2574K1499K0265J9665J9898
53493A106888K0356K0420K0041J9422J8655J7899J7484J7537J7786J7940J7897
53482A312325J7528J6791J6129J6077J6249J5402J3049J0222Q105O618N013L152
$$ plain form
53570 352381 350048 348045 346256 344666 343038 341133 339375 338683 339387 340732 341750 342255 342738 343665 345127
53555 345127 346802 347996 348151 347672 347892 349775 352958 356483 360024 363777 367489 370469 372594 374610 377236
53540 377236 380553 384429 389006 394363 400110 405779 411492 417933 425672 434638 444229 453910 463770 474412
53526 474412 486190 498659 511013 522979 534982 547484 560608 574435 589279 605363 622496
53515 622496 640295 658588 677463 697116 717840 739979 763606 788253 813123 837624 861681
53504 861681 885554 909421 933182 956672 979921 1002987 1025561 1047060 1067325 1086990 1106888
53493 1106888 1127244 1147664 1167705 1187127 1205782 1223681 1241165 1258702 1276488 1294428 1312325
53482 1312325 1329853 1346644 1362773 1378850 1395099 1410501 1423550 1433772 1441877 1448495 1453508 1456660
53470A456660J312p49l440o344q584j0018j1208j2371j3195j3679j4268j5095
53458A349021j5884j6649j7767j9246k0550k1256k1311k0787j9973j9550j9885
53447A136163k0263j9680j8259j6940j5883j4282j1939r795q536p693o663n616
53435I80614m824l941k622j137K49J777L492M811N480O265P819R538J0503J0991
53421A029015J2082J3995J5910J7342J8633K0072K1329K2144K2848K3918K5375
53410A242663K6960K8588L0439L2681L5206L7557L9270M0414M1594M3230M5085
53399A643687M6739M8256M9951N1748N3221N4172N4826N5443N6005N6217N5646
53388B225911N4100N2071N0464M9545M8552M6738M4423M2343M0327L7463L3460
$$ plain form
53470 1456660 1457972 1457223 1453783 1447439 1438855 1428837 1417629 1405258 1392063 1378384 1364116 1349021
53458 1349021 1333137 1316488 1298721 1279475 1258925 1237669 1216358 1195571 1175598 1156048 1136163
53447 1136163 1115900 1096220 1077961 1061021 1045138 1030856 1018917 1009122 1000586 992893 986230 980614
53435 980614 975790 971849 969227 968090 968339 970116 973608 978419 983899 990164 997983 1007521 1018024 1029015
53421 1029015 1041097 1055092 1071002 1088344 1106977 1127049 1148378 1170522 1193370 1217288 1242663
53410 1242663 1269623 1298211 1328650 1361331 1396537 1434094 1473364 1513778 1555372 1598602 1643687
53399 1643687 1690426 1738682 1788633 1840381 1893602 1947774 2002600 2058043 2114048 2170265 2225911
53388 2225911 2280011 2332082 2382546 2432091 2480643 2527381 2571804 2614147 2654474 2691937 2725397
53377B725397K9005K4680K0277J5530J0728O157J449l934r903j5901k1669k7409
53365B754407l3217l8723m3370m6833m9229n0994n2507n3724n4239n3843n2810
53354B224918n1536n0089m8372m6609m5225m4344m3726m3309m3328m3716m3689
53343A720975m2467m0189l7705l5542l3597l1765l0213k8766k6775k4027k1337
53332A368592j9566j8446j7150j5684j4831j4834j5084j5188j5359j5451j4682
53321A192317j2916j1296j0755j0639r704p961o462n595m751l610k587j794o02
53308A103645J264L099M247N154O689Q865J0923J2465J3823J5417J7265J9196
53296A222052K1053K2540K3301K3388K3428K4042K5193K6274K6754K6585K5975
$$ plain form
53377 2725397 2754402 2779082 2799359 2814889 2825617 2831774 2833223 2829289 2819386 2803485 2781816 2754407
53365 2754407 2721190 2682467 2639097 2592264 2543035 2492041 2439534 2385810 2331571 2277728 2224918
53354 2224918 2173382 2123293 2074921 2028312 1983087 1938743 1895017 1851708 1808380 1764664 1720975
53343 1720975 1678508 1638319 1600614 1565072 1531475 1499710 1469497 1440731 1413956 1389929 1368592
53332 1368592 1349026 1330580 1313430 1297746 1282915 1268081 1252997 1237809 1222450 1206999 1192317
53321 1192317 1179401 1168105 1157350 1146711 1137007 1129046 1122584 1116989 1112238 1108628 1106041 1104247 1103645
53308 1103645 1104909 1108008 1112255 1117409 1124098 1132963 1143886 1156351 1170174 1185591 1202856 1222052
53296 1222052 1243105 1265645 1288946 1312334 1335762 1359804 1384997 1411271 1438025 1464610 1490585
53285A490585K5013K3564K1488J8819J5813J2884J0359Q171N802K800o39l835
53273A630824o367q512j0787j3301j5758j7882j9640k1038k2025k2678k3363k4538
53261A424935k6315k8198k9389k9522k9018k8535k8233k7854k7414k7240k7221
53250A115996k6697k5466k4422k4515k5463k6100k5852k5156k4494k3810k3014
53239H41007k2350k1841k1025j9662j8251j7291j6383j4769j2576j0831j0136
53228F55892r974r601r078q987r444j0011j0450j1018j1933j2935j3637j3942
53216E24882j3867j3295j2252j1166j0486j0132r767r441r453r632r362q436p366
53203C90227o644o274o240o775p684q047p281o148n878o523o929o285m985l816
$$ plain form
53285 1490585 1515598 1539162 1560650 1579469 1595282 1608166 1618525 1626696 1632498 1635298 1634659 1630824
53273 1630824 1624457 1615945 1605158 1591857 1576099 1558217 1538577 1517539 1495514 1472836 1449473 1424935
53261 1424935 1398620 1370422 1341033 1311511 1282493 1253958 1225725 1197871 1170457 1143217 1115996
53250 1115996 1089299 1063833 1039411 1014896 989433 963333 937481 912325 887831 864021 841007
53239 841007 818657 796816 775791 756129 737878 720587 704204 689435 676859 666028 655892
53228 655892 645918 636317 627239 618252 608808 598797 588347 577329 565396 552461 538824 524882
53216 524882 511015 497720 485468 474302 463816 453684 443917 434476 425023 415391 406029 397593 390227
53203 390227 383583 377309 371069 364294 356610 348563 341282 335134 329256 322733 315804 309519 304534 300718
53189C00718l122k931l241l764l890l330k506j965j753j692j886k479l115l186
53175B61858k612j924j551j342r48l47J43K76P7l04p33j049j093q74o93q67j311
53158B46706j575j378r46o62n62m25k10j13k59n36p86q82p80o31p42j104j162
53141B33953n05L23L79l07n44M51J913K414J563K49m90m28l9Q0k74p70q85n64
53123B36519k63j65J68R83J634J367N30K35P62J157O66k29o05l62j42k99n53n12
53105B40891j65J65P0o05j462j763j212l44O2k03q06j487k133k458k091j106p8
53088B25275M74M55L7m93p52m93P0M88O70Q55R67N86k71q38n34K10N69L76O9k10
53068B27510o94j271j361p59n1J74R0K04M49K81l79q10l49O91J306R66J51l01
$$ plain form
53189 300718 297596 294665 291424 287660 283770 280440 277934 275969 274216 272524 270638 268159 265044 261858
53175 261858 259246 257322 255771 254429 253481 253134 253277 253553 253630 253326 252593 251544 250451 249577 248884 248017 246706
53158 246706 245131 243753 242807 242145 241583 241158 240948 240835 240576 240040 239254 238372 237592 236961 236219 235115 233953
53141 233953 233448 233771 234150 233843 233299 233750 235663 238077 239640 239889 239399 238971 238932 239012 238738 237968 237083 236519
53123 236519 236256 236091 236259 237242 238876 240243 240773 241008 241770 242927 243593 243364 242759 242397 242255 241956 241403 240891
53105 240891 240726 240891 240961 240356 238894 237131 235919 235575 235637 235434 234628 233141 231008 228550 226459 225353 225275
53088 225275 225749 226204 226241 225748 224996 224503 224573 225061 225731 226586 227553 228139 227868 227030 226496 226706 227275 227651 227720 227510
53068 227510 226816 225545 224184 223425 223374 223548 223638 223842 224291 224572 224193 223383 223034 223725 225031 225997 226148 225847
53050B25847j42K38M67M77K30l44r89j156p32k94l51n74l33K71N01P4m25k99M60
53031B22926J257J428O94n35j341j196o06m39o68m94K47O77J87n91p21k67M9K5
53013B20632J08N20R41R85N51k04q69r30l22L68O49P16Q69Q03K03l67j39N03M19
52994B25436m82r47j90J088J892K166K171J576J69j169j244j19R92J224P65K22
52978B33550M1M79J414K117J938J240J047J660K347K505K364K219J803R70L51
52963B56045O32J516K095J937J308N03l05p29m23K00J68q97k277l026k938k405
52947B51404j777j265j107j393j776j800j423j002p60o25n64p30j138j423j215
52932B33406o61l01m04o71o91n13m71n39l28K41O52N01J47J56L97K65l42q83j079
$$ plain form
53050 225847 225705 225943 226410 226887 227117 226773 225784 224628 223896 223602 223251 222677 222344 222615 223116 223190 222765 222466 222926
53031 222926 224183 225611 226305 225770 224429 223233 222627 222188 221520 221026 221273 221950 222137 221546 220825 220558 220607 220632
53013 220632 220740 221260 222201 223186 223737 223533 222664 221734 221412 221780 222429 223145 224014 224817 225020 224653 224514 225017 225436
52994 225436 224954 224007 223817 224905 226797 228963 231134 232710 232879 231710 230466 230347 231339 232563 233328 233550
52978 233550 233591 234070 235484 237601 239539 240779 241826 243486 245833 248338 250702 252921 254724 255694 256045
52963 256045 256677 258193 260288 262225 263533 264036 263731 263002 262579 262779 262947 262050 259773 256747 253809 251404
52947 251404 249627 248362 247255 245862 244086 242286 240863 239861 239101 238476 237912 237182 236044 234621 233406
52932 233406 232745 232444 232040 231369 230678 230165 229694 229155 228827 229068 229720 230221 230368 230524 230921 231186 230844 229961 228882
52913B28882j252j603j779j476r21l84K20P88P22k01j131j063j61N86P78Q28R67
52896B23800R32P10O70Q13O22j8m86l24J41M18N34P06Q43P38L84j75q87j322q52
52877B27247L69J247R79O4m68l15J17N20P57N83K3k31M02J356J508P69K81Q22
52859B36030J770J926R10n88j587j608r08k59k42p25j135j215j300j719k333k756
52843B24261k875k932l132l358l261k686j888j188n55J78P07M43m87j000l71P64
52827B02620J311J290J617K460K790J812P9j199j486j118o31l19k59l79n09n33
52811B07546l99m1N32J067J251J141J088J225J266R70M83J06m6j11l71j085k146
52794B12476k943k958k401j890j508q74j84l17j439k273j548K03J252Q84J73L52
$$ plain form
52913 228882 227630 226027 224248 222772 221851 221467 221687 222475 223197 222996 221865 220802 220641 221227 222005 222833 223800
52896 223800 224732 225442 226112 226925 227547 227529 227043 226719 226860 227278 227812 228518 229361 230099 230483 230308 229421 228099 227247
52877 227247 227616 228863 229842 229906 229438 229123 229240 229760 230517 231100 231123 230892 231294 232650 234158 234927 235208 236030
52859 236030 237800 239726 240636 240048 238461 236853 235945 235686 235444 234719 233584 232369 231069 229350 227017 224261
52843 224261 221386 218454 215322 211964 208703 206017 204129 202941 202386 202564 203271 203714 203227 202227 201856 202620
52827 202620 203931 205221 206838 209298 212088 213900 213979 212780 211294 210176 209545 209226 208967 208588 208079 207546
52811 207546 207147 207106 207638 208705 209956 211097 212185 213410 214676 215646 216129 216235 216189 216078 215707 214622 212476
52794 212476 209533 206575 204174 202284 200776 199902 199718 199401 197962 195689 194141 194344 195596 196480 196653 197005
52778A97005J263J855J682J228J057J148J185J049Q08N37K74O4j16l23n08n28
52762B07680m21m39n73l95K93Q65N38m54j019o42J6K49L09O79J030P46P7q0N02
52743B08961J174J487J625J685J364P07M06Q96J684K059K017J952J878J533J093
52728B30521J052J432J628J166K84m55q42j072j265j263r08l75l6j07n59j279
52712B27922k121k731k695k009j193p22n58m18k82k87l17n3O07J389J840J557
52696B19929N04o80j020k05R62J471J158N33l0m36m94j29K88L88L61M41K40n80
52678B22701j271p44P39J733J583J115J124J257Q60K2q00j351j349n45N06N94
52662B26174n36j552j223J4R58J297J471J549J297R78J084J485J699J765J948
$$ plain form
52778 197005 198268 200123 201805 203033 204090 205238 206423 207472 208280 208817 209091 209155 209039 208716 208208 207680
52762 207680 207259 206820 206247 205852 206145 207010 207548 207094 206075 205433 205449 205698 206007 206686 207716 208462 208539 208459 208961
52743 208961 210135 211622 213247 214932 216296 217003 217409 218305 219989 222048 224065 226017 227895 229428 230521
52728 230521 231573 233005 234633 235799 236083 235628 234786 233714 232449 231186 230278 229903 229867 229760 229201 227922
52712 227922 225801 223070 220375 218366 217173 216451 215893 215475 215193 214906 214589 214536 215143 216532 218372 219929
52696 219929 220433 219753 218733 218528 219490 220961 222119 222652 222622 222186 221692 221563 221851 222239 222600 223041 223281 222701
52678 222701 221430 220686 221425 223158 224741 225856 226980 228237 229097 229119 228319 226968 225619 225074 225580 226174
52662 226174 225638 224086 222863 222877 223835 225132 226603 228152 229449 230427 231511 232996 234695 236460 238408
52647B38408J904J059k15q45n23j38n25j453k136k164j733j273j136j325j513
52632B26392j371q57lJ213K521L215K910K212J972K084J626K56j177j568p36N06
52616B39195J205J097O85M80K91l74j268j461o96L7j64q80j194j076j081j177
52600B33619r00l37P4M72J234J886J616P69N59J154J326M64m34m23j09n55j503
52583B38912j791j038L4P21R82J061J104J196J329J335J083O32J12l28l47L58
52567B45355J404J804J097j0n94p28j132j916k365k001j215o79n30m57l41m27
52551B37265p58q09j0J302J935J169k79j143j175j122j266r96o7O50L36n40r58
52534B33534q23q04j050r44k15N80Q97Q45P32N29J75m2J53N50P53P15O37M63L3
$$ plain form
52647 238408 240312 241371 241156 240311 239788 239650 239125 237672 235536 233372 231639 230366 229230 227905 226392
52632 226392 225021 224164 224161 225374 227895 231110 234020 236232 238204 240288 241914 242170 240993 239425 238689 239195
52616 239195 240400 241497 242182 242662 242953 242579 241311 239850 239154 239191 239027 238147 236953 235877 234796 233619
52600 233619 232719 232382 232456 232928 234162 236048 237664 238433 238992 240146 241472 241936 241502 241079 240970 240415 238912
52583 238912 237121 236083 236117 236838 237820 238881 239985 241181 242510 243845 244928 245560 245672 245344 244997 245355
52567 245355 246759 248563 249660 249650 249056 248328 247196 245280 242915 240914 239699 239020 238490 238033 237692 237265
52551 237265 236507 235698 235688 236990 238925 240094 239815 238672 237497 236375 235109 234113 234046 234696 235032 234492 233534
52534 233534 232711 231907 230857 229913 229698 230278 231175 232020 232752 233281 233456 233414 233567 234117 234870 235585 236222 236685 236718
52515B36718l87k15N99J336J457J372J829K766L389L311K951K705K377J776J261
52500B63245J121R22J10j037j759j934k132k560k739k327j600r81n83m99q89j530
52484B44828j771j316n62Q5P34J467J872J650J301J503K046K057J284N13N51J252
52468B57494J743J443N95n0N4P75J497J733J556J433J693K141K197J424O1j069
52452B74720j380j153j068j251j204p67n24j043k109k986l202k768k012j431j452
52437B50370j966k236j692o12K14L94K11J13K15L02J40k16l80m6N41P88N64L90
52419B47094N91P90O28O05J463K873L587K969J844J458K101L182M335N851P907
52404B87278R872J0719J0012Q199N967L608J175j132l060m579n709o274o199n872
$$ plain form
52515 236718 236331 236116 236715 238051 239508 240880 242709 245475 248864 252175 255126 257831 260208 261984 263245
52500 263245 264366 265288 265398 264361 262602 260668 258536 255976 253237 250910 249310 248329 247746 247247 246358 244828
52484 244828 243057 241741 241179 241264 241998 243465 245337 246987 248288 249791 251837 253894 255178 255691 256242 257494
52468 257494 259237 260680 261275 261225 261279 262054 263551 265284 266840 268273 269966 272107 274304 275728 275789 274720
52452 274720 273340 272187 271119 269868 268664 267897 267373 266330 264221 261235 258033 255265 253253 251822 250370
52437 250370 248404 246168 244476 243864 244078 244472 244683 244796 245011 245313 245453 245237 244857 244811 245352 246140 246704 247094
52419 247094 247685 248475 249103 249708 251171 254044 257631 260600 262444 263902 266003 269185 273520 279371 287278
52404 287278 297150 307869 317881 326080 332047 335655 336830 335698 332638 328059 322350 316076 309877 304005
52390C04005n646n152l790j945q08p66q15r5Q24R27L46K6K41M72N93J114K154
52373B91685L030L224L059L152L686M447N157N493N189M331L308K407J744J528
52359C41440J840K090J441nj053q57N6O82R50J498K368K731K033Q83M74J347K850
52342C60768L807L613K864K752L809N380O494P019P668Q906J0305J1117J1214
52329D45716J1207J1747J2945J4482J6034J7466J8697J9624K0278K0830K1327
52318F30353K1562K1366K0906K0437J9954J9317J8680J8311J7992J7160J5836
52307H41874J4876J4834J5023J4278J2495J0744R819R331Q513P365O490O021N279
52294I76942L630J294r10k462l502m393n190n809o380p135p881q024p271o055
$$ plain form
52390 304005 298359 293207 289417 287472 286664 285898 285083 284988 285812 286739 287085 287111 287352 287824 288417 289531 291685
52373 291685 294715 297939 300998 304150 307836 312283 317440 322933 328122 332453 335761 338168 339912 341440
52359 341440 343280 345370 346811 346806 345753 344896 344952 345634 346584 348082 350450 353181 355214 356097 356571 357918 360768
52342 360768 364575 368188 371052 373804 377613 382993 389487 396506 404174 413080 423385 434502 445716
52329 445716 456923 468670 481615 496097 512131 529597 548294 567918 588196 609026 630353
52318 630353 651915 673281 694187 714624 734578 753895 772575 790886 808878 826038 841874
52307 841874 856750 871584 886607 900885 913380 924124 933943 943274 951787 959152 965642 971663 976942
52294 976942 980572 981866 980956 978494 974992 970599 965409 959600 953220 946085 938204 930180 922909 916854
52280I16854m940l892k560j006L73J686L608O314Q855J0170J0419J0772J1934
52267I68587J3444J4506J4996J5315J5578J5346J4255J2599J1147J0456J0428
52256A116657J0530J0295R537Q279O768N540N058N081M672L081N06k282m752o738
52242A172232q100q864r566j0788j2268j3024j2623j1736j1230j1161j1006j0481
52230A041385r750r054q488p926p027n591m156l651m184m599l805k051l66Q79
52216I71616K033L161L825L925L982M360M807M983M979N114N549O206O729O596
52202A037865N666M588M125M162L900L085K319K122K367K866L720M721N055M214
52188A090775K760J675J304J365J543J594J155Pj564l045m185m935n262n391n882
$$ plain form
52280 916854 911914 908022 905462 904456 904829 906515 910123 916437 925292 935462 945881 956653 968587
52267 968587 982031 996537 1011533 1026848 1042426 1057772 1072027 1084626 1095773 1106229 1116657
52256 1116657 1127187 1137482 1147019 1155298 1162066 1167606 1172664 1177745 1182417 1185498 1186004 1183722 1178970 1172232
52242 1172232 1164132 1155268 1145702 1134914 1122646 1109622 1096999 1085263 1074033 1062872 1051866 1041385
52230 1041385 1031635 1022581 1014093 1006167 999140 993549 989393 985742 981558 976959 973154 971103 970737 971616
52216 971616 973649 976810 980635 984560 988542 992902 997709 1002692 1007671 1012785 1018334 1024540 1031269 1037865
52202 1037865 1043531 1048119 1052244 1056406 1060306 1063391 1065710 1067832 1070199 1073065 1076785 1081506 1086561 1090775
52188 1090775 1093535 1095210 1096514 1097879 1099422 1101016 1102171 1102178 1100614 1097569 1093384 1088449 1083187 1077796 1071914
52173A071914o943p894p870o959o042n576n088m019k536j239m28K9L36O11J058
52158A019354J905L025L820L846L471L477L895L708K196J47r75q18l36k47k06
52143A046262K51Q80J269J521J816J879J468R53P80R11J268K325M454P111R367
52128A082515J1139J3092J5511J7938J9882K1293K2433K3747K5712K8230L0337
52117A311829L1149L0904L0439K9866K8612K6659K4692K2909K0703J7778J4720
52106A590260J2002R268O189L287J186l85k087l882n203n952o576p237p693p958
$$ plain form
52173 1071914 1064971 1057077 1049207 1042248 1036206 1030630 1025542 1021523 1018987 1017748 1017320 1017349 1017685 1018296 1019354
52158 1019354 1021259 1024284 1028104 1031950 1035421 1038898 1042793 1046501 1048697 1048844 1047869 1047051 1046715 1046468 1046262
52143 1046262 1046513 1047393 1048662 1050183 1051999 1053878 1055346 1056299 1057079 1057990 1059258 1061583 1066037 1073148 1082515
52128 1082515 1093654 1106746 1122257 1140195 1160077 1181370 1203803 1227550 1253262 1281492 1311829
52117 1311829 1342978 1373882 1404321 1434187 1462799 1489458 1514150 1537059 1557762 1575540 1590260
52106 1590260 1602262 1611530 1617719 1621006 1622192 1621807 1619720 1615838 1610635 1604683 1598107 1590870 1583177 1575219
$$ [...]
##END NTUPLES=NMR SPECTRUM
##END=
