
##TITLE=AC1302_PERAH12114_6535671_KetVU1Pe3j
##JCAMPDX= 6.0         $$ Bruker NMR JCAMP-DX V2.0
##DATA TYPE= NMR SPECTRUM
##DATA CLASS= NTUPLES
##ORIGIN= BRUKER
##OWNER= Administrator
$$ 1.72 TOPSPIN		Version 2.1
$$ 2012-07-17 15:01:09.953 -0500  Administrator@TOPSPIN
$$ Compression mode = diff/dup
##.OBSERVE FREQUENCY= 400.02188249412
##.OBSERVE NUCLEUS= ^1H
##.ACQUISITION MODE= SIMULTANEOUS (DQD)
##.ACQUISITION SCHEME= undefined
##.AVERAGES= 8
##.DIGITISER RES= 22
##SPECTROMETER/DATA SYSTEM= spect
##.PULSE SEQUENCE= zg30
##.SOLVENT NAME= COFFEE_meoh
##.SHIFT REFERENCE= INTERNAL, COFFEE_meoh, 1, 14.98509
##AUDIT TRAIL= $$ (NUMBER, WHEN, WHO, WHERE, PROCESS, VERSION, WHAT)
$$ ##TITLE= Audit trail, TOPSPIN		Version 2.1
$$ ##JCAMPDX= 5.01
$$ ##ORIGIN= Bruker BioSpin GmbH
$$ ##OWNER= Administrator
$$ $$ C:\Bruker\TOPSPIN/data/COFFEE/nmr/AC1302_PERAH12114_6535671_KetVU1Pe3j/20/pdata/1/auditp.txt
$$ ##AUDIT TRAIL=  $$ (NUMBER, WHEN, WHO, WHERE, PROCESS, VERSION, WHAT)
(   1,<2012-07-17 15:01:01.921 -0500>,<Administrator>,<TOPSPIN>,<go>,<TOPSPIN 2.1>,
      <created by zg
	started at 2012-07-17 14:59:54.531 -0500,
	POWCHK enabled, PULCHK disabled,
       configuration hash MD5:
       6B 1B 68 BB D9 2E 58 E2 7F 35 AD 54 07 DF 0E 41
       data hash MD5: 64K
       FD 6B 8B 89 8D F6 62 7D 67 1F 19 23 56 27 7F C5>)
(   2,<2012-07-17 15:01:05.031 -0500>,<Administrator>,<TOPSPIN>,<proc1d>,<TOPSPIN 2.1>,
      <Start of raw data processing
       efp LB = 0 FT_mod = 6 PKNL = 1 PHC0 = 0 PHC1 = 0 SI = 32K 
       data hash MD5: 32K
       84 06 C7 00 4C 7F 21 F5 5E 2F 4E 66 43 C4 FE FB>)
(   3,<2012-07-17 15:01:05.609 -0500>,<Administrator>,<TOPSPIN>,<proc1d>,<TOPSPIN 2.1>,
      <pk PHC0 = 175.5396 PHC1 = 0 
       data hash MD5: 32K
       44 C8 3A 4B 1F 7A 76 2D DC EA 4F FC 09 3D 2E 70>)
(   4,<2012-07-17 15:01:05.671 -0500>,<Administrator>,<TOPSPIN>,<proc1d>,<TOPSPIN 2.1>,
      <abs ABSG = 1 
       data hash MD5: 32K
       19 05 C0 BD C8 85 60 F6 22 72 EE 7E 88 09 35 F1>)
(   5,<2012-07-17 15:01:05.703 -0500>,<Administrator>,<TOPSPIN>,<proc1d>,<TOPSPIN 2.1>,
      <abs ABSG = 2 
       data hash MD5: 32K
       84 42 EB 96 75 02 AE 23 22 A6 A4 D0 65 25 0A 16>)
(   6,<2012-07-17 15:01:05.734 -0500>,<Administrator>,<TOPSPIN>,<proc1d>,<TOPSPIN 2.1>,
      <abs ABSG = 3 
       data hash MD5: 32K
       3B 91 EB 36 E4 44 4D EF 05 EA 78 E4 94 B2 B3 78>)
(   7,<2012-07-17 15:01:05.765 -0500>,<Administrator>,<TOPSPIN>,<proc1d>,<TOPSPIN 2.1>,
      <abs ABSG = 4 
       data hash MD5: 32K
       A9 2E 8D BD 54 D9 59 86 D1 DE 48 32 14 60 B7 87>)
(   8,<2012-07-17 15:01:05.796 -0500>,<Administrator>,<TOPSPIN>,<proc1d>,<TOPSPIN 2.1>,
      <abs ABSG = 5 
       data hash MD5: 32K
       8C 7E C8 1E 8A 1F 40 6A 3E 5D 8E 16 47 CF 63 08>)
$$ ##END=
$$ 
$$ $$ hash MD5
$$ $$ 73 91 CF 70 33 8B 27 63 C7 51 6E 25 A3 4B 43 2C
##$RELAX= 
##$RELAX= 
##$RELAX= 
##$RELAX= 
##$RELAX= 
##$RELAX= 
##$RELAX= 
##$RELAX= 
$$ Bruker specific parameters
$$ [...]
150 150 150 150 150 150 150 150
##$TP07= 0
##$TPNAME0= <>
##$TPNAME1= <>
##$TPNAME2= <>
##$TPNAME3= <>
##$TPNAME4= <>
##$TPNAME5= <>
##$TPNAME6= <>
##$TPNAME7= <>
##$TPOAL= (0..7)
0.5 0.5 0.5 0.5 0.5 0.5 0.5 0.5
##$TPOFFS= (0..7)
0 0 0 0 0 0 0 0
##$TUNHIN= 0
##$TUNHOUT= 0
##$TUNXOUT= 0
##$USERA1= <user>
##$USERA2= <user>
##$USERA3= <user>
##$USERA4= <user>
##$USERA5= <user>
##$V9= 5
##$VALIST= <valist>
##$VCLIST= <CCCCCCCCCCCCCCC>
##$VD= 0
##$VDLIST= <DDDDDDDDDDDDDDD>
##$VPLIST= <PPPPPPPPPPPPPPP>
##$VTLIST= <TTTTTTTTTTTTTTT>
##$WBST= 2048
##$WBSW= 25
##$XGAIN= (0..3)
0 0 0 0
##$XL= 0
##$YL= 0
##$YMAX_a= 500969
##$YMIN_a= -635825
##$ZGOPTNS= <>
##$ZL1= 120
##$ZL2= 120
##$ZL3= 120
##$ZL4= 120
##$ABSF1= 14.98509
##$ABSF2= -5.573092
##$ABSG= 5
##$ABSL= 3
##$ALPHA= 0
##$AQORDER= 0
##$ASSFAC= 0
##$ASSFACI= 0
##$ASSFACX= 0
##$ASSWID= 0
##$AUNMP= <proc_prof1d_extract_pilot.lims>
##$AXLEFT= 0
##$AXNAME= <>
##$AXNUC= <1H>
##$AXRIGHT= 0
##$AXTYPE= 0
##$AXUNIT= <>
##$AZFE= 0.1
##$AZFW= 0.1
##$BCFW= 0
##$BC_mod= 0
##$BYTORDP= 0
##$COROFFS= 0
##$CY= 15
##$DATMOD= 1
##$DC= 0
##$DFILT= <>
##$DTYPP= 0
##$F1P= 0
##$F2P= 0
##$FCOR= 0.5
##$FTSIZE= 32768
##$FT_mod= 6
##$GAMMA= 0
##$GB= 0
##$INTBC= 1
##$INTSCL= 1
##$ISEN= 128
##$LB= 0
##$LEV0= 0
##$LPBIN= 0
##$MAXI= 10000
##$MC2= 0
##$MEAN= 0
##$ME_mod= 0
##$MI= 0
##$NCOEF= 0
##$NC_proc= -8
##$NLEV= 6
##$NOISF1= 0
##$NOISF2= 0
##$NSP= 0
##$NTH_PI= 0
##$NZP= 0
##$OFFSET= 14.98509
##$PC= 1
##$PHC0= 175.5396
##$PHC1= 0
##$PH_mod= 1
##$PKNL= yes
##$PPARMOD= 0
##$PPDIAG= 0
##$PPIPTYP= 0
##$PPMPNUM= 2147483647
##$PPRESOL= 1
##$PSCAL= 4
##$PSIGN= 0
##$PYNMP= <proc.py>
##$REVERSE= no
##$SF= 400.02
##$SI= 32768
##$SIGF1= 0
##$SIGF2= 0
##$SINO= 400
##$SIOLD= 32768
##$SPECTYP= <>
##$SREGLST= <1H.CDCl3>
##$SSB= 0
##$STSI= 32768
##$STSR= 0
##$SW_p= 8223.68421052631
##$SYMM= 0
##$S_DEV= 0
##$TDeff= 65536
##$TDoff= 0
##$TI= <>
##$TILT= no
##$TM1= 0
##$TM2= 0
##$TOPLEV= 0
##$USERP1= <user>
##$USERP2= <user>
##$USERP3= <user>
##$USERP4= <user>
##$USERP5= <user>
##$WDW= 1
##$XDIM= 32768
##$YMAX_p= 478067050
##$YMIN_p= -725526
##$CURPLOT= <Network HP LaserJet P1505>
##$CURPRIN= <$Network HP LaserJet P1505>
##$DFORMAT= <normdp>
##$LAYOUT= <+/1D_H.xwp>
##$LFORMAT= <normlp>
##$PFORMAT= <normpl>
##$SURQMSG= 1
$$ End of Bruker specific parameters
$$ ---------------------------------
##NTUPLES= NMR SPECTRUM
##VAR_NAME=  FREQUENCY,     SPECTRUM/REAL,   SPECTRUM/IMAG
##SYMBOL=    X,             R,               I
##VAR_TYPE=  INDEPENDENT,   DEPENDENT,       DEPENDENT
##VAR_FORM=  AFFN,          ASDF,            ASDF
##VAR_DIM=   32768,         32768,           32768
##UNITS=     HZ,            ARBITRARY UNITS, ARBITRARY UNITS
##FACTOR=    0.250966925370066, 1,           1
##FIRST=     8223.43324360094, -101477,      50027
##LAST=      0,             -162309,         -121441
##MIN=       0,             -725526,         0
##MAX=       8223.43324360094, 478067050,    0
$$ Real data points
##PAGE= N=1
##DATA TABLE= (X++(R..R)), XYDATA
$$ [...]
$$ plain form
19536 -107546 20336 -318046 145415 -57971 -289314 -170681 1797 57703 209235 -589620
19525 248131 38087 10633 -174144 -169211 -304315 -417716 -122067 250753 40356 -281629
19514 43145 277110 129142 -267335 -122573 301593 30686 90159 -119709 -102282 65108
19503 -145096 -100239 -53067 -279613 26971 -90193 -17474 66953 -208678 145641 184326 -25568
19491 -174001 -204050 124108 240587 -234802 -177625 -181250 -136900 -87314 2624 266657 -124575
19479 -162194 -424067 34724 -148771 -182587 -53427 155899 -14118 44006 343264 10201 -367363
19467 -347949 -260536 -79190 249621 -119880 -204545 -256651 347567 -46017 -106863 -171657 -42698
19455 -34679 -210855 -63525 -5896 71161 49599 16757 -186380 -112707 -99219 -245445 207796
$$ packed form
19536a07546B0336c18046A45415e7971k31343J18633A797N5906J51532e89620
19525B48131C8087A0633a74144M933j35104j13401a22067B50753D0356b81629
19514D3145K33965A29142b67335a22573C01593C0686N9473a19709J7427F5108
19503a45096M4857M7172k26546B6971i0193a7474F6953b08678A45641L8685b5568
19491a74001l0049A24108J16479b34802N7177l625M4350M9586B624K64033a24575
19479a62194k61873C4724a48771l3816e3427A55899a4118D4006K99258A0201c67363
19467c47949Q7413g9190B49621a19880q4665n2106C47567d6017o0846o4794d2698
19455c4679j76176f3525e896G1161k1562A6757a86380P3673J3488j46226B07796
$$ plain form
19443 -60028 -132810 19091 -392632 48605 -123087 147165 172402 -41533 -39706 -167684 12597
19431 113775 -100919 -367290 7106 -305170 70969 45555 -100448 119215 -222733 -14518
19420 28011 -108813 -25731 233762 -162132 141958 -47899 -69339 -9163 41031 79861 109528
19409 109528 -328700 -12393 -117855 307538 25397 -33994 -35245 -33112 45839 -150927 -265523
19398 -265523 200793 -335738 48578 -247955 -247315 -46037 -112959 -71140 34538 235966 -459757
19386 -67875 -276616 -48255 -145274 -152908 198446 19909 -61408 -178800 485 -105477 173963
19374 -20119 -100015 23632 14008 79091 59251 248420 170837 -33265 194132 -120284 57090
19362 179842 -248642 27872 -168122 -67208 -120108 159839 92502 -190205 -119070 103329
$$ packed form
19443f0028p2782A9091c92632D8605a23087A47165K5237d1533J827j27978A2597
19431A13775a00919k66371G106c05170G0969k5414a00448A19215b22733a4518
19420B8011a08813b5731B33762a62132A41958d7899k1440i163D1031L8830K9667
19409A09528c28700a2393j05462C07538B5397c3994j251K133D5839a50927j14596
19398b65523B00793c35738D8578b47955O40d6037o6922M1819C4538K01428d59757
19386f7875k08741d8255r7019p634A98446A9909f1408j17392D85a05477A73963
19374b0119p9896B3632r624O5083j9840J89169p7583c3265A94132a20284E7090
19362A79842b48642B7872a68122f7208n2900A59839o7337a90205P1135A03329
$$ plain form
19351 220073 -171040 -152030 -367510 96551 -279503 80718 -269299 -99359 -233322 -200945
19341 -200945 -234746 13242 149903 60108 -136255 47858 -41914 96739 95738 4580 -272974
19329 -486765 -17104 59650 -217190 -113934 62392 301575 -1054 -314967 138706 -5417 29256
19317 -206462 25967 -265834 27521 -197405 -40802 73301 -333503 17141 -204345 130754
19306 182025 92469 -32829 -192681 -134657 1812 126062 128401 78961 -328542 -331221 -17303
19294 18632 167955 74349 -18083 37558 286493 7311 -134819 111 -208394 -95179 -226763
19283 -226763 -172839 -4220 -97518 -237687 80135 10802 114936 37365 30745 -288233 -321077
19272 -321077 -84805 -39083 -279571 -173151 52001 -150481 138800 -49336 223675 -37202
$$ packed form
19351B20073a71040J9010k15480I6551b79503H0718b69299i9359j33963L2377
19341b00945l3801A3242J36661F0108a36255D7858d1914I6739j001D580b72974
19329d86765a7104E9650b17190J03256F2392K39183a054l13913A38706e417B9256
19317b06462B5967b65834B7521a97405d0802G3301c33503A7141b04345A30754
19306A82025q9556c2829j59852N8024A812J24250K339m9440c28542k679a7303
19294A8632J49323G4349a8083C7558K48935G311a34819A11b08394i5179j31584
19283b26763N3924d220r3298j40169H0135A0802J04134C7365o620b88233l2844
19272c21077h4805c9083k40488J06420E2001a50481A38800d9336B23675c7202
$$ plain form
19261 271570 -170144 -272468 -65627 -90170 -112377 32151 -209004 84907 -102210 87907 -279417
19249 -53074 56486 -350167 -114186 168545 229044 162750 -195418 -58010 -11124 -121502 -29139
19237 -233651 92605 -250883 10435 -128319 -60906 -117816 -53926 279848 365911 36947 -177005
19225 -33563 -65856 39677 -336451 88036 75516 -189318 -525161 179216 -280857 -259139 -32497
19213 9243 -36235 32426 -188102 19206 -98987 242848 -286653 -370673 -192138 -28247 -93835
19202 -93835 -233191 -3026 43180 -204558 -301855 -125380 -101541 -181089 -225380 -168683 -97423
19191 -97423 -254256 -385962 238805 22921 87246 21873 26839 18045 -26596 -149267 27937
19179 -39751 -140277 -76830 34838 -311899 -168628 52672 115379 88882 -280288 82209 91974
$$ packed form
19261B71570a70144j02324f5627k4543k2207C2151b09004H4907a02210H7907b79417
19249e3074E6486c50167a14186A68545O0499o6294a95418e8010a1124j10378b9139
19237b33651I2605b50883A0435a28319f0906n6910e3926B79848Q6063C6947a77005
19225c3563l2293C9677c36451H8036j2520a89318l35843A79216b80857K1718c2497
19213I243c6235C2426a88102A9206i8987B42848b86653q4020J78535b8247o5588
19202i3835j39356c026D3180b04558r7297a25380K3839p9548m4291N6697P1260
19191i7423j56833j31706B38805B2921O4325B1873M966q794b6596j22671B7937
19179c9751j00526O3447C4838c11899J43271E2672O2707k6497b80288H2209R765
$$ plain form
19168 91974 136785 -319563 -156727 -147377 -221913 99218 -188342 -136243 -493096 -32123 21101
19156 -97630 -239747 215206 270739 -324226 -106384 -447511 129632 30506 -219860 -166972
19146 -166972 -235349 -70904 -225470 -68981 -262890 3990 222546 222056 -38713 -20986 173942
19134 226374 -39250 -110747 36963 -25772 67884 -117079 -404585 -59436 -204378 -256774 296512
19122 108243 -347414 1347 228390 262332 -274395 12277 -143337 -24803 123557 -132980
19111 17936 33122 16539 106875 -318118 60028 -540649 -282651 -17073 -226365 175933 62415
19099 -254934 -185533 -24488 -13916 133982 -4516 -197913 -100309 -345820 -385890 -147379 -167560
19088 -167560 270824 -27659 -51186 -136345 -57957 131761 50454 -437932 318243 -131234
$$ packed form
19168I1974M4811c19563a56727R350p4536I9218a88342N2099l56853c2123B1101
19156i7630j42117B15206N5533c24226a06384l41127A29632C0506b19860N2888
19146a66972o8377g0904j54566f8981j93909C990K18556m90c8713J7727A73942
19134B26374c9250p1497C6963b5772F7884a17079k87506e9436j44942n2396B96512
19122A08243c47414A347K27043L3942b74395A2277a43337b4803A23557a32980
19111A7936J5186A6539R0336c18118F0028e40649K57998a7073k09292A75933F2415
19099b54934O9401b4488J0572A33982d516j93397R7604k45511m0070a47379k0181
19088a67560B70824b7659k3527q5159e7957A31761E0454d37932C18243a31234
$$ plain form
19077 -57064 -14064 9380 -98636 -38911 -41554 -77409 -213035 -266101 318600 -18492 -276379
19066 -276379 275086 -139344 -148123 -94713 -282777 5616 56012 51632 -184943 171078 -103476
19054 -212006 -36873 29843 -177878 10986 -95624 -16150 50061 -281065 -138388 -338589 13471
19042 239559 -119962 64986 126418 -107103 -266458 -55759 -268962 -63857 -52800 -123861 24557
19030 180233 -51680 42745 278759 -55020 98117 361508 -62673 2081 22163 150687 -13036
19018 -9337 152543 -24260 211642 264688 62662 82568 -160556 -111172 -308679 42075 185398
19007 185398 -90193 95424 -237440 88166 -307559 -147091 -175406 4481 239746 -25884 -293719
18996 -293719 -292186 -509241 -125059 -172419 -377952 -281356 -36153 98824 -214496 105791 123888
$$ packed form
19077e7064a4064I380i8636c8911k643l5855j35626n3066C18600a8492k57887
19066b76379B75086a39344q779N3410j88064E616N0396m380a84943A71078a03476
19054b12006c6873B9843a77878A0986i5624a6150E0061b81065a38388k00201A3471
19042B39559a19962F4986O1432a07103j59355e5759k13203f3857J1057p1061B4557
19030A80233e1680D2745K36014e5020I8117K63391f2673B081K0082J28524a3036
19018i337A52543b4260B11642N3046F2662J9906a60556M9384j97507D2075J43323
19007A85398i0193I5424b37440H8166c07559a47091k8315D481K35265b5884k67835
18996b93719J533k17055a25059m7360k05533R6596c6153I8824b14496A05791J8097
$$ plain form
18985 123888 113631 -48039 -75379 -20439 -85035 -373947 9741 80447 -68489 -223594 99188
18973 -230015 -8260 -233840 -21066 -400827 -127244 -470 -110413 -105705 -107792 -85659 53724 -277923
18960 -207179 -278348 -253432 -56100 -189903 1370 379087 -90718 175232 155610 55327 -242233
18948 276882 -194089 -46261 77970 225703 -207412 -188561 41876 305553 -97103 -119135 -216509
18937 -216509 -116204 -147404 166061 -179104 -220624 -245682 -185611 -79815 -151122 -74019 20507
18925 10017 -180853 -264957 -213155 -165144 169950 -19428 10305 105065 -122645 -34311 206986
18913 -44995 55771 364460 128086 -316331 6599 -248139 -351775 -64943 91147 -72681 134767
18901 320009 -232239 92687 -237456 -156551 -92468 -107621 -175721 -72392 -34623 -225228 50909
$$ packed form
18985A23888j0257d8039k7340b0439o4596k88912I741P0706f8489j55105I9188
18973b30015h260k25580b1066l79761a27244d70j09943M708k087K2133E3724b77923
18960b07179p1169K4916e6100j33803A370L77717i0718A75232j9622E5327b42233
18948B76882a94089d6261G7970J47733b07412J8851D1876K63677i7103k2032r7374
18937b16509J00305l1200A66061a79104m1520k5058O0071g9815p1307g4019B0507
18925A0017a80853q4104N1802M8011A69950a9428A0305R4760a22645c4311B06986
18913d4995E5771L08689A28086c16331F599b48139j03636f4943I1147g2681A34767
18901C20009b32239I2687b37456Q0905O4083j5153o8100g2392c4623j90605E0909
$$ plain form
18889 -283883 -24770 -11608 151190 -70091 -17242 -264244 -74508 -99800 136713 21025 -67127
18877 -137445 44481 137593 44306 -109227 -203035 -212462 -27772 93192 -231234 -89103 34572
18865 255 -61274 -403261 157610 161248 -20039 -168118 70990 442515 -145896 257529 -335366
18853 -116436 -49570 103873 -331110 391637 -344834 -246943 134026 -31300 97390 39351
18842 146639 33090 -22682 -95753 -6281 -81623 -164280 142222 2326 150459 140156 -270295
18830 -141885 6126 -378361 38427 -90693 -234899 -48640 -251969 -25178 53521 -401807 -64056
18818 430919 14078 25437 15553 670 -165817 42062 201346 123743 -55665 108233 -163014
18806 228712 208238 84186 191803 -121697 -126390 -287162 98777 204682 -44497 -206584 139851
$$ packed form
18889b83883b4770a1608A51190g0091a7242k47002g4508k5292A36713B1025f7127
18877a37445D4481R3112D4306a09227r3808r427b7772I3192b31234h9103C4572
18865B55f1274l41987A57610L638b0039j48079G0990L71525a45896B57529c35366
18853a16436d9570A03873c31110C91637c44834R7891A34026c1300I7390C9351
18842A46639C3090b2682p3071f281p5342q2657A42222B326J48133j0303b70295
18830a41885F126c78361C8427i0693j44206d8640k03329b5178E3521d01807f4056
18818D30919A4078J1359r884F70a65817D2062J59284p7603e5665A08233a63014
18806B28712k0474H4186J07617a21697m693j60772I8777J05905d4497j62087A39851
$$ plain form
18794 289260 249814 -114284 -197687 34519 58774 -5854 196992 -121303 -183124 -161746 -328211
18783 -328211 18002 -30537 -4575 -199617 -51385 -90888 -170754 -328548 -131739 -151946 -27921
18771 -198609 157068 -183207 93666 188672 -18023 -385140 108756 211117 172309 124079
18761 124079 -4707 -241467 -170476 44201 126501 169425 -19126 -73664 -13165 -126462 -364666
18750 -364666 -374462 -116742 -145459 -259714 405931 -221562 24822 48139 87244 55347 180598
18739 180598 -186109 21171 -237240 -93780 -134960 -279677 -123576 -137477 -188770 -45162 -198520
18728 -198520 -78910 -263864 -292397 -4914 301369 -288819 -211943 -149263 -128084 138661 150082
18717 150082 392789 -266067 -39311 -52270 -383346 -124661 -348708 -294269 -61117 -160374
$$ packed form
18794B89260l9446a14284q3403C4519K4255e854A96992a21303o1821K1378j66465
18783c28211A8002c0537d575j95042e1385l9503p9866j57794a31739k0207b7921
18771a98609A57068a83207I3666R5006a8023l67117A08756J02361l8808m8230
18761A24079d707k36760P0991D4201Q2300M2924a9126n4538a3165j13297k38204
18750c64666r796a16742k8717j14255D05931b21562B4822K3317L9105l1897J25251
18739A80598a86109B1171b37240i3780m1180j44717a23576j3901n1293d5162j53358
18728a98520g8910j84954k8533d914C01369b88819P6876O2680K1179A38661J1421
18717A50082K42707b66067c9311j2959l31076a24661k24047N4439f1117r9257
$$ plain form
18707 -160374 -67325 -170341 -239357 53756 30403 -30219 179466 -116978 89832 99005 153152
18696 153152 25725 -226050 278087 -10796 -15620 173966 150149 -157926 249293 -172134
18685 -141506 -116723 -124980 135606 94592 1155 35134 -282807 97829 113250 146666 22840
18673 -266164 -204667 50404 -696904 10093 -109867 -357090 69469 -123976 -138431 -97189 -189583
18662 -189583 -215227 -344158 -73271 -316382 -38810 413552 -73690 55585 -172771 -80353 -32164
18650 -23052 -238866 -173729 15016 -312475 48732 -340507 -270910 -182759 -63406 157837 -124754
18638 94158 165065 63958 -542301 20875 -127222 -251274 -575233 -282566 88190 245489
18628 245489 -245415 88514 -117438 158466 -122702 251384 153286 52601 -112915 -173270
$$ packed form
18707a60374f7325j03016o9016E3756k3353c0219A79466a16978H9832R173N4147
18696A53152B5725b26050B78087a0796m824A73966k3817a57926B49293a72134
18685a41506K4783q257A35606m1014A155L3979b82807I7829J5421L3416B2840
18673b66164O1497E0404f96904A0093a09867k47223F9469a23976j4455M1242r2394
18662a89583k5644j28931g3271k43111c8810D13552g3690E5585a72771h0353c2164
18650b3052k15814O5137A5016c12475D8732c40507O9597Q8151f3406A57837a24754
18638I4158P0907F3958e42301B0875a27222j24052l23959b82566H8190J57299
18628B45489b45415H8514a17438A58466a22702B51384r8098E2601a12915o0355
$$ plain form
18618 -173270 634 281515 -46544 233919 -275535 102607 243017 -339874 -30908 -170392
18608 -170392 -180245 -168589 -176504 10661 43447 190716 166496 -215911 147407 -119007 107614
18596 -44467 86888 299374 -373473 135050 46838 -293666 -248634 -233730 113813 -186811
18585 -61759 -199940 -92838 -151368 -113537 157283 8451 10217 61075 273819 -96531 120766
18573 224130 30546 -121065 -61941 89303 -388265 123761 100134 -374606 -66668 -294281
18563 -294281 -219810 -188519 -183283 -149290 19891 -102553 -180141 27537 -299937 -182345 325551
18551 -225038 176937 135494 -69554 129066 -58134 250411 93181 -154925 -29076 135081
18540 259071 -86259 168615 -95391 -360658 -248786 -128160 106719 -2854 103262 156212
$$ packed form
18618a73270F34K80881d6544B33919b75535A02607J40410c39874c0908j39484
18608a70392r853J1656p915A0661L2786J47269k4220b15911A47407a19007A07614
18596d4467H6888K12486c73473A35050D6838b93666M5032J4904A13813a86811
18585f1759j38181i2838n8530L7831A57283H451J766N0858K12744i6531A20766
18573B24130C0546a21065N9124H9303c88265A23761k3627c74606f6668k27613
18563b94281P4471L1291N236L3993A9891a02553p7588B7537b99937J17592C25551
18551b25038A76937m1443f9554A29066e8134B50411I3181a54925b9076A35081
18540B59071h6259A68615i5391k65267J11872J20626A06719b854A03262N2950
$$ plain form
18530 156212 -107073 -11225 35070 43688 -154558 -120412 -42131 -3330 -122812 17632 35977
18519 35977 -190643 -207131 82484 -62338 -262815 -108680 -186634 -85885 -145149 -40037 112849
18507 54775 -210317 -90929 -177519 -395214 -72741 -27584 -393167 72631 -34626 -158325 -246424
18496 -246424 -147817 -160750 209680 -262219 206886 266461 -110737 76324 -76126 162856
18485 -252926 -204153 98191 191168 69887 41402 311750 -166044 74684 370785 318408 -93761
18473 57734 -150749 -29194 171552 -177598 171099 59785 42777 236790 -44337 -102630 179318
18461 196358 174927 24144 116911 -63282 -236491 -45096 207975 -210187 -234149 -119677 -160763
18450 -160763 -57233 -402716 155567 -23538 -309641 -95778 -81675 -137986 -325367 43302 -46426
$$ packed form
18530A56212a07073a1225C5070Q618a54558L4146d2131c330j19482A7632J8345
18519C5977a90643j6488H2484f2338k00477a08680p7954h5885n9264d0037A12849
18507E4775b10317i0929q6590k17695g2741b7584l65583G2631c4626j23699q8099
18496b46424R8607j2933B09680b62219B06886N9575a10737G6324g6126A62856
18485b52926M8773I8191R2977F9887k8485K70348a66044G4684K96101n2377i3761
18473E7734a50749b9194A71552a77598A71099E9785j7008J94013d4337n8293A79318
18461A96358k1431B4144R2767f3282j73209d5096B07975b10187k3962J14472m1086
18450a60763e7233l45483A55567b3538k86103i5778J4103n6311j87381D3302d6426
$$ plain form
18438 23648 -186112 38003 65747 77843 12562 311821 -205253 -496247 41534 222777 62944
18426 124281 -171210 248077 -165822 73143 -175095 -57184 248180 48495 -96307 -152579
18416 -152579 259110 94462 -17845 83244 58917 -177663 -309276 114464 103990 -100476
18405 -443209 247747 60826 -71765 -117836 -181215 -59908 52247 138307 -9751 -29388 349477
18393 -140126 204180 -393557 -47185 160695 16382 -186785 15114 -240177 -87755 -107745
18383 -107745 81778 181686 44271 64500 304193 -106556 -41164 157057 285665 104886
18372 37250 -28965 6657 -389749 -57294 -72004 -325365 88438 -2350 -143027 -47919 -246939
18361 -246939 -120044 93936 -129394 -242836 -378521 -19519 115643 -64796 158207 -96434
$$ packed form
18438B3648a86112C8003K7744J2096A2562K99259b05253k90994D1534J81243F2944
18426A24281a71210B48077a65822G3143a75095e7184B48180D8495i6307n6272
18416a52579B59110I4462a7845H3244k4327a77663j31613A14464j0474a00476
18405d43209B47747F0826g1765m6071o3379e9908E2247Q6060i751j9637C49477
18393a40126B04180c93557d7185A60695A6382a86785A5114b40177h7755j9990
18383a07745H1778R9908D4271K0229K39693a06556d1164A57057J28608A04886
18372C7250b8965F657c89749e7294j4710k53361H8438b350j40677d7919j99020
18361b46939a20044I3936a29394j13442j35685a9519A15643f4796A58207i6434
$$ plain form
18350 210602 -26017 -238002 -46669 74333 -87201 -67652 -32010 -104229 -239061 -122717 68544
18338 52876 36521 -55211 -239518 -60433 -138670 -219173 -265124 184189 -10990 -120302 -334679
18327 -334679 63647 98955 -13285 -375154 149198 -61298 265216 -255480 112025 81959
18317 81959 -242820 -146169 142051 -100802 -14741 116236 -159929 -226311 108092 -39318
18306 -63979 -6034 -435273 -115767 77330 57571 -103792 166634 -360902 -309076 206427 -268071
18294 -136633 -164601 -199967 10415 -56025 34699 -186475 752 -157601 154373 40923 -152718
18282 -351567 50264 -69340 12992 -342042 -437100 45474 255758 -190920 -128342 -300393 -77752
18270 -7622 -267838 90174 -63642 -243804 -252030 1609 -44308 -586619 -45193 -115004 -117644 -111581
$$ packed form
18350B10602b6017k11985d6669G4333h7201J9549c2010p2219j34832J16344F8544
18338E2876j6355e5211j84307f0433p8237q0503m5951A84189a0990j09312k14377
18327c34679F3647L5308a3285l61869A49198f1298B65216b55480A12025l0066
18317H1959b42820R6651A42051a00802a4741A16236a59929o6382A08092c9318
18306f3979f034m29239a15767G7330j9759a03792A66634c60902N1826B06427b68071
18294a36633k7968l5366A0415e6025C4699a86475G52a57601A54373D0923a52718
18282c51567E0264f9340A2992c42042r5058D5474K10284a90920O2578j72051g7752
18270g622k60216I0174f3642j80162q226A609d4308n42311d5193o9811k640O063
$$ plain form
18258 -111581 -16637 -106407 47656 162250 36475 404983 58471 -292870 -303710 -108273 -323611
18247 -323611 235886 145446 48621 -63752 -8950 -362083 -238302 -271903 -79239 -294283 233074
18235 -298933 128060 -161573 -108471 49055 -336021 50970 42429 48649 36022 161571 -218582
18223 -55314 138417 214934 230514 -175359 -51547 -147415 182650 -148407 -138518 -48007 -158668
18212 -158668 -235631 -196955 -183186 -285164 -111340 77727 -229379 12644 24257 -111782 96449
18200 -51675 -227837 -17742 -28178 -120343 86437 -35546 -19156 -132224 -29135 -76436 -175318
18189 -175318 -309108 -248694 25062 -216719 -95309 -75205 -17415 -17873 -413101 208783 96117
18177 -40481 252771 -201089 11894 -120738 -69208 -397442 -13408 10951 141105 273549
$$ packed form
18258a11581a6637q9770D7656J14594C6475L68508E8471b92870j0840a08273k15338
18247c23611B35886r0440D8621f3752h950l53133J23781l3601g9239k15044B33074
18235b98933A28060a61573N3102D9055c36021E0970q541O220j2627J25549b18582
18223e5314A38417P6517J5580a75359e1547r5868A82650a48407R889d8007j10661
18212a58668p6963L8676J3769j01978a11340G7727b29379A2644J1613a11782I6449
18200e1675j76162a7742j0436r2165H6437c5546J6390j13068b9135m7301r8882
18189a75318j33790O0414B5062b16719i5309K0104a7415m58l95228B08783I6117
18177d0481B52771b01089A1894a20738N1530l28234a3408A0951J30154J32444
$$ plain form
18167 273549 -125373 67032 -93750 -324330 -41880 -233854 97419 -126122 -18153 -48372 354702
18155 -240478 -4403 -90611 -26638 203150 -166568 54816 109537 39569 137470 -82457 157101
18143 240694 -24527 400085 64161 50369 41537 106518 130529 -191206 -214551 -4293 16733
18131 -338981 -110309 -36460 -76377 -349291 7171 -35541 22468 -126319 -275406 286267 -232325
18119 -335839 -60912 -67332 -255794 233201 -265525 -158360 -232219 -120960 118895 98171
18109 98171 6029 -139298 -141308 71515 27293 -53624 -180160 17749 -278018 -66713 -397890
18098 -397890 -93651 -11167 30954 -290565 -25072 27345 179273 173558 -169107 -69998 -193244
18087 -193244 14222 -151528 -293978 -151597 -266000 68832 9571 -4626 241379 -30494 -69330
$$ packed form
18167B73549a25373F7032i3750k30580d1880j91974I7419a26122a8153l0219C54702
18155b40478d403q6208b6638B03150a66568E4816N4721C9569R7901h2457A57101
18143B40694b4527D00085F4161j3792q832O4981K4011a91206k3345d293A6733
18131c38981a10309c6460l9917k72914G171c5541B2468a26319j49087B86267b32325
18119c35839f0912o420j88462B33201b65525J07165p3859J11259A18895k0724
18109I8171F029a39298k010G1515B7293e3624j26536A7749b78018f6713l31177
18098c97890i3651a1167C0954b90565b5072B7345J51928n715a69107f9998j23246
18087a93244A4222a51528j42450J42381j14403F8832I571d626B41379c0494l8836
$$ plain form
18076 -69330 15053 369244 -33542 45347 -43583 -20104 -469623 -20089 -108214 -384213 -115787
18064 -45048 8226 11262 3571 -111647 -35198 231150 161596 -88888 271060 -89530 -299662
18053 -299662 25508 193273 -45687 239950 -10248 -61047 -54885 -228467 93742 18910 -102460
18041 49473 81620 -91209 -105625 -195098 105353 -463557 -81115 -34016 10121 16117 201403
18030 201403 174868 44971 -151789 -268199 104466 290787 -15690 2998 -35988 -112481 2182
18018 -31735 74702 -110091 -74299 29443 184781 -143504 45680 -209993 -121510 380475 -55053
18006 396033 13001 -263184 240196 32490 73004 114965 -17326 -100889 -173004 162340 93909
17995 93909 -216231 -378202 86693 111192 -22752 10307 147256 31756 -289253 154505 77090
$$ packed form
18076f9330A5053L54191c3542D5347d3583b0104m49519b0089q8125k75999a15787
18064d5048H226L036C571a11647c5198B31150o9554h8888B71060h9530k10132
18053b99662B5508J67765d5687B39950a0248n0799O162j73582I3742A8910a02460
18041D9473L2147i1209j4416q9473A05353d63557h1115c4016A0121N996J85286
18030B01403k6535D4971a51789j16410A04466J86321a5690B998c5988p6493B182
18018c1735G4702a10091L5792B9443J55338a43504D5680b09993Q8483C80475e5053
18006C96033A3001b63184B40196C2490M0514M1961a7326q3563p2115A62340o8431
17995I3909b16231j61971H6693K4499b2752A0307J36949C1756b89253A54505G7090
$$ plain form
17983 124437 370119 155951 10483 -80745 203315 175473 -318338 90967 97665 -98027 88248
17971 -317958 -205405 81526 67175 34287 291660 -157005 -110869 -79550 -63689 162011 -205949
17959 -290295 100523 1067 65785 167196 -73710 175756 -239660 -268746 -270716 -88199 94824
17947 -21857 265028 126134 -41107 -135831 -158434 119358 -183284 109930 110154 -137509 779
17935 212776 -242577 -214547 41640 50406 -248156 -319704 -61668 22629 -181016 -76729 -41251
17924 -41251 295147 -414163 -215817 -86381 -217698 -67252 -108500 310889 -104685 -13747
17913 -366708 118178 191726 287572 -194121 -444129 -52231 -170845 -38194 116498 134203
17903 134203 -241530 -167551 -163135 -118604 504265 126193 -294147 -217357 4797 -47563 -188844
$$ packed form
17983A24437K45682A55951A0483h0745B03315k7842c18338I0967O698i8027H8248
17971c17958J12553H1526j4351l2888K57373a57005M6136L1319J5861A62011b05949
17959b90295A00523A067O4718J01411g3710A75756b39660k9086j970h8199I4824
17947b1857B65028A26134d1107r4724k2603A19358a83284A09930K24a37509G79
17935B12776b42577K8030D1640Q766b48156p1548f1668B2629a81016g6729L5478
17924d1251B95147d14163J98346h6381j31317f7252m1248C10889a04685a3747
17913c66708A18178P3548R5846a94121k50008e2231j18614c8194A16498J7705
17903A34203b41530P3979M416M4531E04265A26193b94147P6790D797d7563j41281
$$ plain form
17892 -188844 -273902 -62217 -193283 -61207 -215621 -173083 54918 -5530 170196 -17039 -102504
17881 -102504 210733 -187958 -306320 -43800 126813 -244103 68026 -232938 -376 -52653 -103045
17870 -103045 -85995 57188 -186582 121535 47010 151073 -80864 58492 -199604 -87537 -85870
17859 -85870 -320957 -132004 125795 -224032 21771 61336 204233 10027 -19860 231350
17848 366474 -11377 -206340 -192647 169359 116591 -66983 93764 125128 336596 -44794 -156902
17837 -156902 121194 233639 -134393 180954 -253380 8341 -63806 -399492 35540 39698 -30310
17825 37027 -43279 -36937 221538 -18879 82034 -9808 554371 -7538 22961 104054 -146092 -325406
17813 -325406 -356238 -47637 110114 70977 135552 504646 7415 -230651 225761 -37292 -228305
$$ packed form
17892a88844q5058f2217j31066f1207j54414M2538E4918e530A70196a7039q5465
17881a02504B10733a87958j18362d3800A26813b44103F8026b32938c76n2277n0392
17870a03045J7050E7188a86582A21535D7010J04063h0864E8492a99604h7537J667
17859h5870k35087a32004A25795b24032B1771L9565J42897A0027a9860B31350
17848C66474a1377j94963J3693A69359n2768f6983I3764L1364K11468d4794j12108
17837a56902A21194J12445a34393A80954b53380H341f3806l35686C5540M158c0310
17825C7027d3279O342B21538a8879H2034i808E54371g538B2961Q1093a46092j79314
17813c25406l0832d7637A10114l9137O4575L69094G415b30651B25761c7292j91013
$$ plain form
17802 -228305 -301448 -13180 124898 -330853 54783 59397 -162210 -76536 -76405 -316376 -48117
17790 -269931 248214 -226241 5708 -50399 -14175 -62232 240769 251288 171458 -63887 250236
17778 33313 176913 169743 -17073 -293181 502943 48256 134033 326547 -49733 -67328 -96733
17767 -96733 -124997 131706 224151 -71203 -79971 -231639 263004 9247 -129461 11057 80975
17756 80975 -167161 304421 -111143 155900 -200160 36306 -115719 -265442 134416 140532
17746 140532 -62348 -216958 -200287 19385 141611 -205541 34993 41252 -68132 103736 -61720
17734 -186195 189315 206331 -312007 224511 196014 16720 29169 -59913 -205135 39152 -112665
17722 200834 -33797 167628 126328 -137492 -125362 198640 -31522 -197843 158678 38674
$$ packed form
17802b28305p3143a3180A24898c30853E4783M614a62210g6536J31k39971d8117
17790b69931B48214b26241E708e0399a4175m8057B40769J0519p9830f3887B50236
17778C3313J43600p170a7073k76108E02943D8256Q5777J92514d9733j7595k9405
17767i6733k8264A31706R2445g1203q768j51668B63004I247a29461A1057O9918
17756H0975a67161C04421a11143A55900b00160C6306a15719j49723A34416O116
17746A40532f2348j54610J6671A9385J22226b05541C4993O259f8132A03736f1720
17734a86195A89315J7016c12007B24511k8497A6720J2449e9913j45222C9152a12665
17722B00834c3797A67628m1300a37492J2130A98640c1522j66321A58678C8674
$$ plain form
17711 -80776 -24019 169957 -170694 37859 195090 225129 243838 -273198 129017 -324274
17700 -56803 198405 -170342 29950 -239431 130350 -154800 -1993 164203 138876 86633 338627
17689 338627 -3076 82510 151350 89968 64685 28137 -289549 -144143 192557 36312 -95010
17677 -143503 -32625 -302414 -204248 80200 -179427 94085 128341 152022 52260 -534 414569
17665 21991 -23355 -129070 -274980 66548 96383 -23720 153322 45331 155050 291774 -81341
17653 -176125 -6723 -52398 78811 92775 -49674 243639 88980 249210 278141 -70595 -112192
17642 -112192 49105 19121 199874 350100 190381 -14493 317837 19058 -34830 368087
17631 -187078 169351 -11975 -79509 132607 -56377 208843 -14473 -136326 -379245 -417906
$$ packed form
17711h0776b4019A69957a70694C7859J57231L0039J8709b73198A29017c24274
17700e6803A98405a70342B9950b39431A30350a54800a993A64203k5327n2243K51994
17689C38627c076H2510O8840o1382k5283B8137b89549a44143A92557C6312i5010
17677a43503c2625k69789R8166H0200a79427I4085L4256K3681E2260e34D14569
17665B1991b3355j05715j45910F6548K9835b3720A53322D5331J09719J36724h1341
17653a76125f723m5675G8811J3964d9674B43639H8980J60230K8931g0595m1597
17642a12192D9105A9121J80753J50226j59719a4493C17837A9058c4830C68087
17631a87078A69351a1975o7534A32607e6377B08843a4473j21853k42919l8661
$$ plain form
17621 -417906 498 -61403 -141990 77893 157336 201388 -2500 -50787 -39910 -276054 -216927 -69271
17608 -39590 261281 47024 327286 93833 270621 -440330 197958 -150201 248022 -80022
17597 -46721 34084 205939 -17434 139850 -160000 -58033 -130205 61285 -61177 -128204 -2548
17585 151620 206820 -38796 123057 138124 179854 -132770 225974 -241775 24739 -72932 -1973
17573 326825 235752 73024 -146836 192979 206504 195065 173481 -38044 60001 133698 -156322
17561 172031 -33979 13290 85057 59418 -86995 -168364 200234 -19844 -38820 -106485 211141
17549 191494 -200698 258377 -69544 -203459 101833 -102974 60385 -5238 72416 179938
17539 179938 187874 -117686 252912 -234610 62872 69734 115505 54146 73957 -120036 70041
$$ packed form
17621d17906D98f1403q0587G7893P9443M4052b500m8287J0877k36144N9127f9271
17608c9590B61281D7024K80262I3833J76788d40330A97958a50201B48022h0022
17597d6721C4084J71855a7434A39850a60000e8033p2172F1285f1177o7027b548
17585A51620N5200c8796A23057J5067M1730a32770B25974b41775B4739g2932a973
17573C26825r1073G3024a46836A92979J3525j1439k1584c8044F0001P3697a56322
17561A72031c3979A3290P1767k5639h6995q1369B00234a9844j8976o7665B11141
17549A91494b00698B58377f9544j33915A01833a02974F0385e238G2416J07522
17539A79938P936a17686B52912b34610F2872O862M5771E4146J9811a20036G0041
$$ plain form
17527 -241648 208676 -245135 272687 176021 -156927 280698 -56299 92551 -150816 1069
17516 55955 -104414 -275399 119308 -131835 -94661 143759 50031 -28671 -26162 -55520 -188067
17505 -188067 -1410 139184 104368 104351 -64610 -22095 -110817 192352 -45852 -90222 -20045 21807
17492 91630 120989 127254 191845 -26527 264718 146723 342831 199458 -154930 -258382 202426
17480 191962 -161814 96253 15308 166872 176853 218204 314147 -115020 44310 -47997 80288
17468 393213 330351 191124 -72203 56943 427716 251632 209390 307658 137514 225492 -128603
17456 -103843 370376 177277 -55385 63846 -22257 -106631 -32033 120545 165743 247621 106972
17444 276778 -8778 460776 253971 178955 102910 304979 309630 152694 148495 351158 390791
$$ packed form
17527b41648B08676b45135B72687r6666a56927B80698e6299I2551a50816A069
17516E5955a04414j70985A19308a31835L7174A43759E0031b8671K509k9358j32547
17505a88067a410A39184l4816j7f4610b2095q8722A92352d5852m4370b0045B1807
17492I1630K9359O265O4591b6527B64718j17995J96108j43373a54930j03452B02426
17480A91962a61814I6253A5308J51564R981M1351R5943a15020D4310d7997H0288
17468C93213o2862j39227g2203E6943L70773j76084m2242R8268A37514Q7978a28603
17456a03843C70376A77277e5385F3846b2257q4374c2033A20545M5198Q1878A06972
17444B76778h778D60776k06805p5016p6045K02069M651A52694m199K02663L9633
$$ plain form
17433 390791 209283 160791 123848 308966 251311 146873 283432 433019 418666 176198
17422 -38466 204781 147208 208654 659175 -204243 153476 48159 296710 301646 184098 198327
17411 198327 -24641 109901 259058 145009 2705 -64352 228511 216493 366902 185723
17401 185723 -176589 123106 481321 214472 -80845 330210 139060 138427 -266060 108704
17390 176021 46656 246210 278912 313796 501347 -175042 245583 466009 203924 297113
17380 297113 250636 48989 14170 -151572 88237 -19047 59140 9729 51946 165610 71442
17368 98075 50345 -255023 137437 -51059 383199 270063 116507 306011 55435 2639 -99742
17356 157966 -56959 281819 68837 122597 -4360 -223321 -33098 356709 231707 78600 411492
$$ packed form
17433C90791j81508m8492l6943J85118n7655j04438J36559J49587j4353A76198
17422c8466B04781n7573O1446M50521b04243A53476D8159K48551M936j17548J4229
17411A98327b4641A09901J49157j14049B705f4352B28511j2018J50409j81179
17401A85723a76589A23106L58215B14472h0845C30210A39060o33b66060A08704
17390A76021D6656J99554L2702L4884J87551a75042B45583K20426B03924R3189
17380B97113m6477D8989A4170a51572H8237a9047E9140I729M2217J13664G1442
17368I8075m7730b55023A37437e1059C83199j13136A16507J89504E5435B639i9742
17356A57966e6959B81819F8837N3760d360k18961c3098C56709j25002G8600L32892
$$ plain form
17345 411492 266604 -197198 94330 131625 134295 -49491 -27244 305152 62999 17413 41718
17334 41718 114797 477744 43115 176561 -313057 184791 143417 58692 -49762 401432 112305
17322 -212269 333436 37163 114761 -62536 274356 419176 249501 301404 84228 21488 173565
17311 173565 178902 23692 -52889 546339 35809 139996 191411 90249 514104 66660 -9876
17299 281054 69845 163046 58437 233648 -126220 78003 201929 -68843 241098 -201036
17288 178721 402460 92825 211802 -4934 95911 62919 304079 296693 232275 99690 225294
17277 225294 142552 3182 111748 -138593 9741 91797 27816 -120392 353943 283787 201357
17266 201357 382142 425783 254099 123310 -89960 558579 174052 22000 425520 419307
$$ packed form
17345D11492j44888a97198I4330L7295K670d9491K2247C05152F2999A7413K4305
17334D1718P3079L62947D3115J33446c13057A84791m1374E8692d9762D01432A12305
17322b12269C33436C7163P7598f2536B74356J44820j69675N1903H4228B1488J52077
17311A73565N337B3692e2889E46339C5809J04187N1415I0249M23855F6660i876
17299B81054F9845R3201E8437J75211a26220G8003J23926f8843B41098b01036
17288A78721K23739I2825J18977d934I5911l2992K41160p386o4418I9690J25604
17277B25294q2742C182J08566a38593I741Q2056B7816a20392C53943p0156q2430
17266B01357J80785M3641j71684A23310h9960E58579A74052B2000M03520o213
$$ plain form
17256 419307 109943 124863 54048 655612 -176430 385976 -111922 -50247 274637 208094
17246 208094 -17722 55261 199441 339601 249112 -25601 399053 -47790 73214 -39464 254361
17234 479171 320852 379087 208850 233000 142372 249222 -94911 500231 285894 -90739
17223 117862 146176 47194 80134 235951 228307 467611 98303 280999 359826 16644 120615
17212 120615 682034 101301 433744 290345 171687 375967 201205 240774 384696 163911
17201 98200 347947 639135 415885 116474 174374 450898 308217 116563 442781 338905
17191 338905 67522 346195 337081 221566 233814 260651 272115 327736 173494 70741 350983
17180 350983 442682 135359 205401 158896 151267 -66942 128701 508954 434160 314547 561565
$$ packed form
17256D19307A09943J4920E4048O01564a76430C85976a11922e0247B74637o6543
17246B08094a7722E5261J44180J40160r0489b5601C99053d7790G3214c9464B54361
17234D79171j58319N8235j70237K4150r0628J06850i4911E00231k14337i0739
17223A17862K8314D7194L2940J55817p644K39304I8303J82696P8827A6644J03971
17212A20615N61419A01301L32443j43399j18658K04280j74762L9569J43922A63911
17201I8200K49747K91188k23250A16474N7900K76524j42681A16563L26218j03876
17191C38905F7522K78673r114j15515J2248K6837J1464N5621j54242G0741K80242
17180C50983R1699A35359P0042m6505p629f6942A28701L80253p4794j19613K47018
$$ plain form
17169 561565 206042 252313 224450 162439 388697 359447 -82960 313063 386112 199901 91812
17157 410421 74049 277802 316219 158034 132980 428927 -46232 -101409 44760 346893 301742
17146 301742 334561 291887 383768 274009 189423 103712 328088 269389 387215 360714 274049
17135 274049 397763 280282 172252 282010 378435 310126 470288 121039 270855 636011
17125 636011 614094 362377 723936 399826 422101 163092 216180 302756 184138 53497
17114 336189 306561 177154 121899 293178 472410 595701 303298 614504 288174 303994
17104 303994 506975 700045 150603 146561 140069 413310 347385 350653 495416 197339 404358
17093 404358 621938 515844 452634 322101 443654 235148 301866 654904 357457 459785
$$ packed form
17169E61565B06042M6271k7863o2011K26258k9250h2960C13063P3049j86211I1812
17157D10421G4049K03753L8417A58034k5054K95947d6232n5177D4760L02133m5151
17146C01742L2819m2674R1881j09759q4586q5711K24376n8699J17826k6501q6665
17135B74049J23714j17481j08030J09758R6425o8309J60162A21039J49816L65156
17125F36011k1917k51717L61559l24110K2275A63092N3088Q6576j18618E3497
17114C36189k9628j29407n5255J71279J79232J23291k92403L11206B88174J5820
17104C03994K02981J93070A50603m042o492K73241o5925L268J44763A97339K07019
17093D04358K17580j06094o3210j30533J21553k08506O6718L53038k97447J02328
$$ plain form
17083 459785 385578 159149 96259 375229 524196 397574 807307 432977 232305 227495
17073 227495 463955 509417 424270 483898 573273 464995 458362 419791 522523 384028 466426
17062 466426 455224 393013 424450 593755 365779 327973 476987 235997 450933 232081
17052 232081 368124 330202 558282 463406 558310 471703 759302 600762 434056 427473 634430
17041 634430 439493 711468 730389 494634 644824 524020 580974 691407 380842 533134
17031 533134 500477 739478 835695 566102 733751 559805 551188 654100 569501 792792
17021 792792 614052 612386 612767 733336 800184 671467 925207 928150 1160088 830921 957476
17010 957476 688078 771531 745506 599053 716676 814265 776103 716658 745391 949418 834053
$$ packed form
17083D59785p4207A59149o2890K78970J48967j26622M09733l74330k00672m810
17073B27495K36460M5462q5147N9628Q9375j08278o633l8571J02732j38495Q2398
17062D66426j1202o2211L1437J69305k27976l7806J49014B35997K14936k18852
17052B32081J36043l7922K28080r4876R4904q6607K87599j58540j66706o583K06957
17041F34430j94937K71975J8921k35755J50190j20804N6954J10433l10565J52292
17031E33134l2657K39001R6217k69593J67649j73946q617J02912q4599K23291
17021G92792j78740j666L81J20569O6848j28717K53740K943K31938l29167J26555
17010I57476k69398Q3453k6025j46453J17623R7589l8162n9445K8733K04027j15365
$$ plain form
16999 834053 282283 504784 638061 769655 1013182 741209 865015 994051 759602 1131017
16989 1131017 542675 651791 898200 542056 1009106 497647 202280 685637 773069 890431
16979 890431 686550 815587 991689 740866 1067631 929544 806800 886474 834162 765085
16969 765085 772603 1193036 776875 1212010 967881 839863 1010236 730933 913747 978555
16959 978555 942158 1346286 1140607 1103758 1026519 1147024 1093357 987423 767004 1047083
16949 1047083 1067925 1122071 970170 1409317 1116726 893574 1201674 1234920 1247482 1382868
16939 1382868 1122692 1200971 1427195 1151939 1053637 1520175 966791 1243875 1367961 1227993
16929 1227993 1331974 1451862 1565713 1425734 1071045 1396136 1620707 1301590 1314428 1519794
$$ packed form
16999H34053B82283K22501J33277J31594K43527k71973J23806J29036k34449L71415
16989A131017E42675J09116K46409l56144M67050D97647B02280M83357Q7432J17362
16979H90431k03881J29037J76102k50823L26765j38087j22744P9674n2312o9077
16969G65085P518M20433m16161M35135k44129j28018J70373k79303J82814O4808
16959I78555l6397M04128k05679l6849p7239J20505n3667j05934k20419K80079
16949A047083K0842N4146j51901M39147k92591k23152L08100L3246J2562J35386
16939A382868k60176P8279K26224k75256r8302M66538n53384K77084J24086j39968
16929A227993J03981J19888J13851j39979l54689L25091K24571l19117J2838K05366
$$ plain form
16919 1519794 1209697 1778358 1555137 1492687 1433829 1476119 1762427 1361073 1862292 1497921
16909 1497921 1426092 1550705 1752813 1748291 1944810 1548291 1638719 1675721 1780705 1622152
16899 1622152 1871627 1771373 1688491 1868754 2081298 1951052 2161245 1689558 1908992 1954127
16889 1954127 1981751 2168521 2153031 1995599 2079853 2117896 2255754 2077915 2255890 2191438
16879 2191438 2185199 2188454 2288725 2379175 2411521 2277545 2478312 2598163 2539669 2538816 2753237
16868 2753237 2555036 2555177 2728101 2884356 2773018 2433200 2521956 2534787 2656826 2439455
16858 2439455 2649685 3039233 3246111 3297877 3274431 3055145 3214193 2957682 3265927 3041225
16848 3041225 2807715 3212715 3389302 3430547 3351909 3529399 3713045 3809838 3950428 4061986
$$ packed form
16919A519794l10097N68661k23221o2450n8858M2290K86308m01354N01219l64371
16909A497921p1829J24613K02108m522J96519l96519R0428L7002J04984j58553
16899A622152K49475j00254q2882J80263K12544j30246K10193m71687K19434M5135
16889A954127K7624J86770j5490j57432Q4254L8043J37858j77839J77975o4452
16879B191438o239L255J00271R0450L2346j33976K00767J19851n8494q53K14421
16868B753237j98201J41J72924J56255j11338l39818Q8756J2831J22039k17371
16858B439455K10230L89548K06878N1766k3446k19286J59048k56511L08245k24702
16848C041225k33510M05000J76587M1245p8638J77490J83646R6793J40590J11558
$$ plain form
16838 4061986 3691005 3855836 3757643 4125362 4558416 4338824 4194115 4172103 4526746 4546385
16828 4546385 4380896 4606091 4839823 5070622 5101117 5150277 5270137 4786766 5428044 5156320
16818 5156320 5630963 5642144 5555313 5804669 5717042 6195942 6311760 6291131 6677360 6731607
16808 6731607 6865845 6702048 7267345 7229171 7751297 7798532 7690438 7863073 8202416 8549077
16798 8549077 8524309 8787245 8928575 8984375 9749756 9720947 9749765 10173911 10525446 10521974
16788 10521974 10734270 11304008 11294421 12089384 12398624 12502144 13347429 13346113 13771195 13972464
16778 13972464 14733618 15163261 15331697 16063922 16497489 17178997 17512396 18205164 18683511
16769 18683511 19486866 19769200 20873442 21874137 22578993 23400249 24362602 24838667 25812207
$$ packed form
16838D061986l70981J64831r8193L67719M33054k19592j44709k2012L54643J9639
16828D546385j65489K25195K33732K30799L0495M9160J19860m83371O41278k71724
16818E156320M74643J1181q6831K49356q7627M78900J15818k0629L86229N4247
16808F731607J34238j63797N65297l8174N22126M7235j08094J72635L39343L46661
16798H549077k4768K62936J41330N5800P65381k8809K8818M24146L51535l472
16788A0521974K12296N69738r587P94963L09240J03520Q45285j316M25082K01269
16778A3972464P61154M29643J68436P32225M33567O81508L33399O92768M78347
16769A8683511Q03355K82334J104242J000695P04856Q21256R62353M76065R73540
$$ plain form
16760 25812207 27039583 28233403 29645696 30869222 32023900 33262981 34779796 36170279
16752 36170279 38073446 39638545 41685346 43838033 45897956 48301773 50865132 53652053
16744 53652053 56391962 59241177 62720385 65966222 69866457 73830377 78494371 83136799
16736 83136799 88085412 93317448 99175113 105210767 111582348 118413572 125756214 133085933
16728 133085933 141107693 148961088 157177925 165242429 172947871 180300495 187339293 193174150
16720 193174150 198161220 202137754 205109489 205743425 205370857 203407067 200222824 195545632
16712 195545632 190092681 183008081 175644614 168193830 159815816 151631786 143687876 135325415
16704 135325415 127190833 119554597 112528696 105765866 99341189 93125198 87129540 82098365
$$ packed form
16760B5812207J227376J193820J412293J223526J154678J239081J516815J390483
16752C6170279J903167J565099K046801K152687K059923K403817K563359K786921
16744E3652053K739909K849215L479208L245837L900235L963920M663994M642428
16736H3136799M948613N232036N857665O035654O371581O831224P342642P329719
16728A33085933Q021760P853395Q216837Q064504P705442P352624P038798N834857
16720A93174150M987070L976534K971735O33936l72568j963790l184243m677192
16712A95545632n452951p084600p363467p450784q378014q184030p943910q362461
16704A35325415q134582p636236p025901o762830o424677o215991n995658n031175
$$ plain form
16696 82098365 77276067 72618569 68219477 64525548 60658242 57493008 54231493 51338076
16688 51338076 48783469 46125825 43876410 41301061 39376047 37482608 35628695 34269455
16680 34269455 32674995 31107952 29505142 28322018 27224187 25990957 24809103 23822533
16672 23822533 22939036 21979585 21133014 20392135 19510540 19115257 18384407 17517663 16914630
16663 16914630 16418790 15914516 15133252 15139783 14459917 13662277 13475719 12926837 12514435 12009449
16653 12009449 11776007 11369626 11191062 10842061 10327230 10346148 9721281 9402719 9425950 9590618
16643 9590618 8864615 8566213 8122259 8206234 7762100 7914039 7551556 7728440 7159640 7342473
16633 7342473 7002857 6963161 6603319 6664010 6065382 6284314 6001046 5839839 5670866 5590836
$$ packed form
16696H2098365m822298m657498m399092l693929l867306l165234l261515k893417
16688E1338076k554607k657644k249415k575349j925014j893439j853913j359240
16680C4269455j594460j567043j602810j183124j097831j233230j181854r86570
16672B3822533q83497r59451q46571p40879q81595l95283p30850q66744o03033
16663A6914630m95840n04274p81264O531o79866p97640j86558n48882m12402n04986
16653A2009449k33442m06381j78564l49001n14831J8918o24867l18562K3231J64668
16643I590618p26003k98402m43954Q3975m44134J51939l62483J76884n68800J82833
16633G342473l39616l9696l59842O0691n98628K18932k83268j61207j68973q0030
$$ plain form
16623 5590836 5300734 5084114 5430274 5025026 5045597 4768126 4922803 4852642 4582766 4565902
16613 4565902 4225687 4358999 4132066 4426829 4159041 4055517 3918656 3718884 3888121
16604 3888121 3446759 3534454 3527736 3570504 3730643 3595350 3492789 3303195 3173991 3335275
16594 3335275 3124620 3115096 2849088 2989572 3058931 2859429 2886276 2997849 2842894 2606447
16584 2606447 2462803 2872847 2856670 2646701 2597639 2475287 2243651 2259360 2302914 1931448
16574 1931448 2198009 1994488 2055698 2371989 2072276 2078145 2255304 1725770 1936778 2194316
16564 2194316 2060101 1790258 1985246 2057554 1813607 1903593 1824810 1843652 1769864 1644845
16554 1644845 1672589 1538387 1960023 1385750 1505516 1703555 1319764 1391224 1355204 1576559
$$ packed form
16623E590836k90102k16620L46160m05248K0571k77471J54677p0161k69876j6864
16613D565902l40215J33312k26933K94763k67788j03524j36861j99772J69237
16604C888121m41362Q7695o718M2768J60139j35293j02561j89594j29204J61284
16594C335275k10655r524k66008J40484O9359j99502K6847J11573j54955k36447
16584B606447j43644M10044j6177k09969m9062j22352k31636J5709M3554l71466
16574A931448K66561k03521O1210L16291k99713N869J77159n29534K11008K57538
16564B194316j34215k69843J94988P2308k43947Q9986p8783J8842p3788j25019
16554A644845K7744j34202M21636n74273J19766J98039l83791P1460l6020K21355
$$ plain form
16544 1576559 1595423 1520819 1459136 1151891 1727812 1517080 1540725 1252140 1108229 1176193
16534 1176193 1075464 1266505 1124754 1070423 1536417 1413251 1357965 1026786 1096628 1330939
16524 1330939 1119434 842764 1096614 1247894 1265866 1105304 1143098 1253223 1123092 1024469
16514 1024469 975978 1135781 954555 852864 821877 1094748 1123890 820114 775841 867649
16504 867649 710672 696377 858726 906840 1056437 862406 768442 997422 1033432 1162301
16494 1162301 969258 509645 1008625 550921 448405 1040207 763863 666731 894355 889740
16484 889740 656248 604766 766540 959095 708719 862228 1034360 624150 515483 616130
16474 616130 798246 664505 979409 252300 674969 559109 749737 672978 468455 606939
$$ packed form
16544A576559J8864p4604o1683l07245N75921k10732K3645k88585j43911O7964
16534A176193j00729J91041j41751n4331M65994j23166n5286l31179O9842K34311
16524A330939k11505k76670K53850J51280J7972j60562L7794J10125j30131r8623
16514A024469m8491J59803j81226j01691l0987K72871K9142l03776m4273R1808
16504H67649j56977j4295J62349M8114J49597j94031r3964K28980L6010J28869
16494A162301j93043m59613M98980m57704j02516N91802k76344r7132K27624m615
16484H89740k33492n1482J61774J92555k50376J53509J72132m10210j08667J00647
16474F16130J82116j33741L14904B52300M22669j15860J90628p6759k04523J38484
$$ plain form
16464 606939 640628 494634 458103 531528 702416 717250 923850 360755 418867 226688
16454 226688 421659 525370 540760 676725 462787 612692 749958 933031 690868 502537
16444 502537 268288 454715 338542 331884 703600 506382 724257 160977 684316 565897
16434 565897 764555 435714 488715 417073 143784 385303 469249 597567 322367 469688
16424 469688 373335 532508 660017 432901 161446 328679 631000 502344 408937 261163
16414 261163 690365 492733 284617 376557 473105 496490 383018 373829 427361 372737 695968
16403 695968 739584 469148 234422 540881 326685 439198 325047 267029 375337 103174
16392 300842 565690 256148 296497 -37665 308627 362666 237649 436447 435924 415984 368240
$$ packed form
16464F06939L3689j45994l6531P3425J70888J4834K06600C60755N8112j92179
16454B26688J94971J03711J5390J35965k13938J49905J37266J83073k42163j88331
16444E02537k34249J86427j16173o658L71716j97218K17875A60977N23339j18419
16434E65897J98658l28841N3001p1642A43784K41519Q3946J28318k75200J47321
16424D69688r6353J59173J27509k27116A61446J67233L02321j28656r3407j47774
16414B61163M29202j97632k08116R1940R6548K3385j13472r189N3532n4624L23231
16403F95968M3616k70436B34422L06459k14196J12513j14151n8018J08308A03174
16392C00842K64848B56148M0349c7665C08627N4039j25017J98798n23j9940m7744
$$ plain form
16381 368240 222169 480117 226998 414835 375973 496732 495399 302672 355760 348758 321010
16370 321010 304320 590710 392261 344608 374844 83672 281323 64824 201575 325383
16360 325383 564130 395892 453330 174626 295473 136241 190238 645577 365800 204028
16350 204028 -230253 352492 220389 453104 -21284 561276 88163 413296 63465 6567
16339 222965 449388 308226 270920 322614 3491 187178 228505 402328 -7993 51148 486778
16328 486778 128879 95198 192046 -45657 194341 292073 -24710 191681 -293626 334677
16317 439700 295321 94220 121898 304948 22042 209752 246382 269234 143500 423172
16307 423172 156510 293012 335661 74205 -9449 -49988 151641 209141 599317 156028 139890
$$ packed form
16381C68240j46071K57948B26998J87837l8862J20759j333j92727N3088p002k7748
16370C21010j6690K86390j98449m7653L0236H3672J97651F4824J36751J23808
16360C25383K38747j68238N7438A74626J20847A36241N3997M55339k79777j61772
16350B04028b30253C52492j32103K32715b1284E61276H8163L25133F3465F567
16339B22965K26423j41162l7306N1694C491J83687M1327J73823g993E1148M35630
16328D86778A28879l3681R6848d5657A94341R7732b4710A91681b93626C34677
16317D39700j44379I4220K7678J83050B2042J87710L6630K2852j25734K79672
16307D23172A56510J36502M2649G4205i449m0539A51641N7500L90176A56028j6138
$$ plain form
16296 139890 446753 331211 -68929 319720 381575 264617 236160 334580 -109963 -186127
16286 -186127 82863 343358 108815 217119 83898 227481 28989 124552 540741 -52652
16275 316737 497083 657791 245324 -68589 311509 439283 178910 106347 -170395 281644
16264 66218 243943 274410 3459 86144 11543 -39419 217680 55501 195519 234298 135735
16253 135735 348515 164687 -183166 -72920 243596 239724 108001 228169 40453 508768
16243 508768 -36742 -22010 106946 212818 112330 213464 -27382 242321 14231 -125074
16232 -8473 204639 316754 31856 231521 -9549 -56390 -134791 -40746 -28348 -178246 25273
16220 360725 -113262 -79483 117383 267583 72963 147262 -290872 126121 112762 -13666
$$ packed form
16296A39890L06863j15542f8929C19720O1855j16958k8457R8420a09963p6164
16286a86127H2863K60495A08815J08304H3898J43583B8989R5563M16189e2652
16275C16737J80346J60708B45324f8589C11509J27774A78910p2563a70395B81644
16264F6218J77725L0467C459Q2685A1543c9419B17680E5501J40018L8779r8563
16253A35735K12780A64687a83166g2920B43596l872A08001J20168D0453M68315
16243E08768c6742J4732A06946J05872j00488J01134b7382B42321A4231a25074
16232h473B04639J12115C1856J99665i549m6841p8401d0746J2398j49898B5273
16220C60725a13262L3779A17383J50200G2963P4299b90872A26121j3359a3666
$$ plain form
16209 83384 46075 269389 512 238286 148876 226010 -35660 89722 28298 87370 87766 -186569
16196 246505 49612 239962 -105401 58187 -3604 -66303 -205846 1006 219942 111867 109789
16185 109789 -9578 154221 95715 31005 164651 216190 -163325 -127907 -226300 509015 149189
16173 -184976 123217 -1135 -50195 120486 -53840 -173012 -113143 -166352 -1122 139873 -206982
16161 92651 120617 183947 171058 -6134 46739 127859 191754 61450 118032 54691 -8525 -138486
16149 -138486 -140752 -57875 -27534 -102354 90184 -322014 -95010 -230030 250655 -50336 -72546
16138 -72546 75012 -105575 28023 -64518 306308 -269027 -351422 -54089 -211344 94151 83953
16127 83953 -136145 173888 197723 -39441 104502 -42528 215664 175141 344200 -123219
$$ packed form
16209H3384l7309K23314E12K37774q9410P7134c5660H9722B8298N9072L96a86569
16196B46505D9612J90350a05401E8187c604o2699j39543A006K18936j08075k078
16185A09789i578A54221n8506C1005J33646N1539a63325L5418r8393E09015A49189
16173a84976A23217a135m9060A20486e3840j19172N9869n3209a122A39873b06982
16161I2651K7966O3330j2889f134D6739Q1120O3895F1450N6582E4691h525j29961
16149a38486k266e7875b7534p4820I0184c22014i5010j35020B50655e0336k2210
16138g2546G5012a05575B8023f4518C06308b69027q2395e4089j57255I4151j0198
16127H3953a36145A73888K3835c9441A04502d2528B15664m0523J69059a23219
$$ plain form
16116 -165350 -154675 -162905 -89221 -87803 188911 -46988 25475 -71831 -119354 -125007 69308 -1383
16103 -125164 293924 96379 181147 109706 335945 691158 -124402 165098 -53320 -235951
16093 -235951 248787 -258485 80111 -67809 329088 129519 -175573 -207438 -24130 -139116
16083 -139116 -31671 -42391 -182118 -12462 40772 -178540 74823 -17463 -309888 -33084 137000
16071 -187515 87006 218536 58127 5343 76857 94332 109173 241095 291281 -16190 238109
16059 -235553 7806 24354 -243103 202450 -366692 -140492 -293673 165021 163812 235959 -172231
16047 -134919 -123845 -149898 56760 254729 -214129 335398 -19726 56443 -211779 183140
16036 -33507 -6637 -130123 108566 -88937 -174124 2465 -64626 -181575 112453 -56199 293463
$$ packed form
16116a65350J0675q230P3684J418A88911d6988B5475g1831m7523n653F9308a383
16103a25164B93924I6379Q4768p1441K26239L55213a24402A65098e3320j82631
16093b35951B48787b58485H0111f7809C29088A29519a75573l1865b4130j14986
16083a39116c1671j0720j39727a2462D0772a78540G4823a7463k92425c3084A37000
16071a87515H7006J31530E8127E343P1514J7475J4841J31922N0186a6190B38109
16059b35553G806J6548b43103B02450c66692a40492j53181A65021j209P2147a72231
16047a34919J1074k6053E6760J97969b14129C35398a9726E6443b11779A83140
16036c3507f637j23486A08566h8937q5187B465f4626j16949A12453e6199B93463
$$ plain form
16024 239326 -83446 -102258 168153 127268 -61669 -235779 -25679 -146073 -179882 111476 -5097
16012 327873 -52365 118733 -132120 18224 -148443 198172 -54141 21190 43512 301407
16002 301407 363428 -22793 223934 -389876 52273 -222589 -314753 -193432 -12312 247925
15991 -112683 -227007 -163043 -33238 -56169 96771 161826 2430 -313993 -32866 200896 333823
15980 333823 289719 250371 200472 187301 -75275 55825 -163567 146148 -119546 95018 71734
15969 71734 -206626 -63987 22504 277978 -82016 13853 -178295 19924 -160319 18065 204049
15958 204049 185655 -48633 146956 -68210 183022 -468698 -372407 -22847 76612 -2668 -15560
15947 -15560 200290 74884 -107873 -151954 -16626 -267694 202820 109704 -95328 12060 -125104
$$ packed form
16024B39326h3446j8812A68153m0885f1669j74110b5679j20394l3809A11476e097
16012C27873e2365A18733a32120A8224a48443A98172e4141B1190K2322K57895
16002C01407O2021b2793B23934c89876E2273b22589r2164J21321a2312B47925
15991a12683j14324O3964c3238k2931I6771O5055B430c13993c2866B00896J32927
15980C33823m4104l9348m9899j3171g5275E5825a63567A46148a19546I5018k3284
15969G1734b06626f3987B2504K55474h2016A3853a78295A9924a60319A8065J85984
15958B04049j8394d8633A46956f8210A83022d68698R6291b2847G6612b668j2892
15947a5560B00290G4884a07873m4081a6626k51068B02820r3116i5328A2060a25104
$$ plain form
15935 -478794 -79381 102810 -31469 174943 -34206 26929 47963 -14140 -357708 -9151 -88364
15924 -88364 225202 -77812 -217586 -218419 -89266 240685 255153 -446220 227486 -131796 235696
15912 77467 -97726 -24530 -126291 103164 70929 -183520 279203 -158875 -92970 40387 -292035
15900 344423 190970 -80962 246914 70713 207435 -439562 -67954 -204767 116009 123535
15890 123535 -124020 -126594 92706 -121105 -170136 193370 337446 -10307 -131768 -68320 165662
15878 -140340 -2963 -160898 -329365 22723 -8255 -110122 -82968 41253 -287238 196744 -278869
15866 -310287 -51572 194155 -141771 239305 129715 32768 117142 -119364 48236 -137829
15855 124712 -353153 -162626 9841 82577 100372 -87308 -47742 -174176 138392 -154286 -192401
$$ packed form
15935d78794g9381A02810c1469A74943c4206B6929K1034a4140l43568i151p9213
15924h8364B25202g7812j39774q33h9266B40685J4468d46220B27486a31796B35696
15912G7467i7726b4530j01761A03164l2235a83520B79203a58875O5905D0387b92035
15900C44423j53453h0962B46914G0713J36722d39562f7954j36813A16009P526
15890A23535a24020k574I2706a21105m9031A93370J44076a0307j21461O3448A65662
15878a40340b963j57935j68467B2723h255j01867K7154D1253b87238A96744b78869
15866c10287e1572A94155a41771B39305j09590C2768Q4374a19364D8236a37829
15855A24712c53153a62626I841P2736J7795h7308L9566j26434A38392a54286l8115
$$ plain form
15844 -192401 71277 -2495 101865 231502 150407 -66569 135854 -39480 -228962 120928 110659
15833 110659 -132046 -119767 -198452 163692 -292102 -394316 10331 -106748 125982 98033
15823 98033 -289594 -5509 216236 -64500 -251190 60085 216428 -135548 207954 169919 122426
15812 122426 -222829 -202071 -200049 17726 -192580 -156814 -546673 -96650 161975 -243786 84131
15800 78327 506499 -91318 -95099 -275461 48255 58474 117139 -189417 -99844 17871 28165
15789 28165 -63276 -24145 96515 -266979 -256644 -17240 -125394 165225 177936 -186239 -301633
15778 -301633 -328628 -281945 -143789 -81338 -128330 -140584 -241955 164582 70925 -36020 90153
15766 20928 222329 7004 -291587 100958 85120 -176515 -58629 47740 105538 -67961 -189822
$$ packed form
15844a92401G1277b495A01865J29637q1095f6569A35854c9480j89482A20928j0269
15833A10659a32046J2279p8685A63692b92102j02214A0331a06748A25982k7949
15823I8033b89594e509B16236f4500j86690F0085J56343a35548B07954l8035m7493
15812A22426b22829K0758K022A7726a92580L5766l89859i6650A61975b43786H4131
15800G8327M28172i1318l781j80362D8255J0219N8665a89417Q9573A7871J0294
15789B8165f3276b4145I6515b66979J0335a7240j08154A65225J2711a86239j15394
15778c01633k6995M6683J38156O2451m6992j2254j01371A64582G0925c6020I0153
15766B0928K01401G004b91587A00958j5838a76515e8629D7740N7798f7961j21861
$$ plain form
15755 -189822 -59964 133945 -49767 -111831 -8760 12748 -43237 248709 -165346 62327 91341
15744 91341 -39217 186412 145810 -113100 41506 12199 115856 -136458 108505 -427741
15733 240955 -170203 -420043 -306580 148251 332269 298141 -126172 -96714 -75851 -76000 -31004
15721 -273990 -136447 -357176 94574 -169869 109732 -324325 -260879 -114217 -172947 -93725
15711 -93725 -84531 30458 -98789 159725 31228 -138766 -3383 -48369 -182929 -93776 -374115
15700 -374115 -89013 -312672 -128640 54869 -258464 -216649 -77369 62632 -217181 251658
15689 38592 -127923 -158273 59295 116790 36746 12796 180297 -247891 249826 -85705 -125486
15678 -125486 -8041 -3579 -253780 -102238 -147396 130469 18124 76542 -28349 146841 359468
$$ packed form
15755a89822e9964A33945d9767o2064h760A2748d3237B48709a65346F2327K9014
15744I1341c9217A86412m0602a13100D1506A2199J03657a36458A08505d27741
15733B40955a70203k49840J13463A48251J84018l4128a26172K9458K0863j49c1004
15721b73990a36447k20729I4574a69869A09732c24325O3446a14217n8730P9222
15711i3725R194C0458i8789A59725C1228a38766c383m4986j34560Q9153k80339
15700c74115h9013k23659a28640E4869b58464M1815g7369F2632b17181B51658
15689C8592a27923l0350E9295N7495C6746A2796J67501b47891B49826h5705l9781
15678a25486h041c579k50201a02238m5158A30469A8124N8418b8349A46841K12627
$$ plain form
15667 359468 -105581 190513 85324 -4452 8505 103320 -124087 179168 -53234 -37251 -105915
15656 -105915 -116584 -200145 -45470 -77664 179821 -255210 -48610 -131157 317328 -230803 112558
15644 312613 186258 -40714 -196085 208623 -63434 -382027 172428 157724 146302 279251
15634 279251 -65115 93531 -134024 -144461 -56599 -171001 -63194 -84963 127325 232104 150933
15623 150933 85734 62691 -40588 74004 -160518 312759 9218 -90390 -120543 368066 23758
15611 -198613 142027 -67873 -192543 -74869 -243506 -131032 193348 299702 -50944 -287409
15601 -287409 -155522 -34589 425435 402936 57729 -173981 -148134 -65505 -184344 -56200 -197935
15590 -197935 102087 22895 352087 -182038 -148013 -206517 -93608 7499 -126384 -181403 95648
$$ packed form
15667C59468a05581A90513H5324d452H505R4815a24087A79168e3234J5983o8664
15656a05915j0669q3561d5470l2194A79821b55210d8610q2547C17328b30803A12558
15644C12613j26355d0714j55371B08623f3434l18593A72428j4704j1422J32949
15634B79251f5115I3531a34024j0437e6599j14402f3194k1769A27325J04779q1171
15623A50933o5199k3043d0588G4004a60518C12759I218i0390l0153C68066B3758
15611a98613A42027f7873j24670g4869j68637J12474A93348J06354e0944k36465
15601b87409J31887c4589D25435k2499E7729a73981K5847f5505j18839e6200j41735
15590a97935A02087B2895L29192a82038L4025n8504i3608G499a26384n5019I5648
$$ plain form
15578 230389 99997 -48953 -46319 -403118 -194295 46720 -123632 56710 53649 155687 130043
15567 130043 -30258 87415 106574 160677 -172057 93022 -229104 -6873 -86796 288447 -28679
15555 -42632 -221612 259425 166766 10707 98586 319702 87205 6380 -35817 203098 74514
15543 24404 -214419 7004 -105525 140403 -349039 -110245 911 256962 -69525 50488 129446
15532 129446 247124 34875 121517 131759 34846 158983 -70816 68407 -194636 -19875 23813
15520 -351835 -14863 -449051 -316282 35242 106447 7307 146160 105290 -193047 97203 329223
15509 329223 255482 223191 246746 86722 -15069 -498816 71517 -81327 137917 -60178 -13563
15497 113321 100264 -165065 292623 170031 -75542 -77172 -100970 -105817 -258331 -217002 -122560
$$ packed form
15578B30389I9997d8953K634l56799a94295D6720a23632E6710l061J02038k5644
15567A30043c0258H7415J9159N4103a72057I3022b29104f873p9923B88447b8679
15555d2632j78980B59425r2659A0707Q7879K21116H7205F380c5817B03098G4514
15543B4404b14419G004a05525A40403c49039a10245I11K56051f9525E0488P8958
15532A29446J17678C4875Q6642J0242C4846J24137g0816F8407a94636a9875B3813
15520c51835a4863m34188J32769C5242P1205G307J38853m0870a93047I7203K32020
15509C29223p3741l2291K3555H6722a5069m83747G1517h1327A37917f0178a3563
15497A13321j3057a65065B92623j22592g5542j630k3798m847j52514M1329R4442
$$ plain form
15486 -122560 180249 -53806 -274484 -6225 200899 -187493 162639 9738 45227 138275 -96660
15474 -50786 158255 113654 228722 -100032 236675 151202 62255 96433 -57606 -85828 -356625
15463 -356625 -34508 406746 20704 187689 -207745 -392578 127034 127829 -31948 179818 -5762
15451 42178 -34373 176335 -100168 -340789 -165900 66219 37304 -7868 195606 136761 27198
15439 -289276 -43821 296 -153566 -123817 -11079 38534 145044 236024 -35132 210358 -199423
15427 -13495 -8291 83911 -55187 59285 -312039 -167972 -322082 9066 55221 -69119 190658
15415 -56233 -34204 183549 -140236 23188 -46496 -170260 -428373 59679 -252346 -291112 -395847
15404 -395847 -306190 55631 -87670 89486 -115111 -291569 94312 163672 -175131 162917 -135295
$$ packed form
15486a22560A80249e3806k20678f225B00899a87493A62639I738L5489R3048i6660
15474e0786A58255m4601J15068a00032B36675q5473F2255L4178e7606k8222k70797
15463c56625c4508D06746B0704J66985b07745j84833A27034P95c1948A79818e762
15451D2178c4373A76335a00168k40621a65900F6219k8915g868A95606n8845B7198
15439b89276d3821B96a53566K9749a1079C8534J06510R0980c5132B10358a99423
15427a3495N204H3911e5187E9285c12039J44067j54110I066M6155f9119A90658
15415e6233K2029A83549a40236B3188d6496j23764k58113E9679b52346l8766j04735
15404c95847Q9657E5631h7670H9486a15111j76458I4312O9360a75131A62917a35295
$$ plain form
15392 49858 -53861 -131247 -3547 -208236 18327 -140446 -326487 -51199 -24524 87482 -34606
15380 -143900 -229016 -55959 -30098 -41283 -198833 -265539 -67857 -393721 -12120 162173 395924
15369 395924 41038 67769 -15095 39207 -2645 -183980 -14809 -5719 158853 148202 -112578
15357 18480 212129 -138142 115395 95629 144158 -208524 -220823 -82189 79193 88084 25229
15345 -360622 35092 -13204 -247085 105300 177693 262044 -127755 116893 -442247 110285
15334 67950 358606 126335 -393796 -147019 230620 -51882 -48943 -8611 370935 -401280 -372207
15323 -372207 216947 99795 89767 -214611 -42667 138291 -179210 101851 -30985 -46039
15313 -46039 335218 99166 -206047 206910 176601 174920 -422253 134578 86415 174182 -45514
$$ packed form
15392D9858e3861p7386c547k04689A8327a40446j86041e1199b4524H7482c4606
15380a43900q5116e5959K5861j1185j57550o6706f7857l25864a2120A62173K33751
15369C95924D1038K6731a5095C9207b645j81335a4809e719A58853j0651a12578
15357A8480J93649a38142A15395j9766M8529b08524j2299h2189G9193Q891B5229
15345c60622C5092a3204k33881A05300P2393Q4351a27755A16893d42247A10285
15334F7950K90656A26335c93796a47019B30620e1882K939h611C70935d01280K9073
15323c72207B16947I9795j0028b14611d2667A38291a79210A01851c0985j5054
15313d6039C35218I9166b06047B06910l0309j681d22253A34578m8163Q7767d5514
$$ plain form
15301 -221254 -25988 264132 259315 -14467 249333 210787 -374252 261179 241727 -227473 257801
15289 66586 -142933 132235 -8312 162222 -216252 81471 -182350 -99833 269083 -286217
15278 90026 107444 361808 120346 -142255 173145 -52194 -73889 -241562 73070 121960 76063
15267 76063 127532 201961 138366 142351 129994 228834 163543 -52650 55932 -63823 179281 170485
15255 170485 253429 146955 -26362 184654 -3682 451144 787606 1594855 1393748 1226090
15245 1226090 1474781 773729 -39806 28950 390609 -211897 217858 -85072 92015 337436
15235 337436 111851 141488 -49640 213720 400262 140297 77970 80224 142610 -222126 16309
15223 90275 134954 75199 -159321 130037 111559 141973 79532 257900 37696 240080 152516
$$ packed form
15301b21254b5988B64132m817a4467B49333l8546c74252B61179j9452b27473B57801
15289F6586a42933A32235h312A62222b16252H1471a82350Q2517B69083b86217
15278I0026J7418K54364A20346a42255A73145e2194k1695j67673G3070M8890m5897
15267G6063N1469P4429o3595L985j2357R8840o5291e2650E5932f3823A79281q796
15255A70485Q2944j06474b6362A84654c682D51144L36462Q07249k01107j67658
15245A226090K48691p01052c9806B8950L61659b11897B17858h5072I2015K45421
15235C37436A11851K9637d9640B13720J86542A40297o2327K254O2386b22126A6309
15223I0275M4679n9755a59321A30037j8478L0414o2441J78368C7696K02384q7564
$$ plain form
15212 152516 -5313 12332 -9238 24960 251128 -19201 98521 154417 -254544 340225 -19243
15200 234847 -42458 75172 160696 -11312 193594 216148 -83948 -207968 18079 -166562 185211
15188 302357 -108506 304546 263883 -182434 -34146 179365 -131814 -108736 -25688 166508
15177 -304898 -73964 43392 5602 71823 -29995 -5155 109789 263429 -72647 309119 -258729
15165 389036 129002 178537 -62566 -147592 -76776 -327569 307738 -56078 76573 -121546 2671
15153 40993 -150965 169444 89663 1956 -145609 168622 227832 71334 26676 39082 209230
15142 209230 168393 -72478 257462 -189624 105345 158871 -7886 -59508 -101673 136984 28199
15130 120667 159338 -98833 310572 -69287 105619 217166 229054 40672 208333 109622 254499
$$ packed form
15212A52516e313A2332i238B4960K26168a9201I8521N5896b54544C40225a9243
15200B34847d2458G5172Q5524a1312A93594K2554h3948j24020A8079a66562A85211
15188C02357a08506C04546m0663a82434c4146A79365a31814K3078b5688A66508
15177c04898g3964D3392E602O6221b9995e155A09789J53640g2647C09119b58729
15165C89036A29002M9535f2566q5026P0816k50793C07738e6078G6573a21546B671
15153D0993a50965A69444p9781A956a45609A68622N9210G1334B6676J2406J70148
15142B09230m0837g2478B57462a89624A05345N3526g886n1622m2165A36984B8199
15130A20667L8671i8833C10572f9287A05619J11547J1888D0672J67661r8711J44877
$$ plain form
15119 254499 59918 242878 220966 210709 -26923 31197 -43916 -76553 373298 -401798 79818
15107 -113504 238266 358146 -33175 -110617 76988 410227 -83794 31743 -143020 325824
15096 147126 50686 217237 304791 173271 -127812 51102 79077 147902 -236189 123556
15085 432717 183921 -89701 312150 204269 138552 -139975 -2292 52702 207189 786276
15075 786276 -219536 298505 -16901 79630 224262 521744 153419 201933 -53893 207325
15064 245932 7266 96299 17437 -174768 -133490 -16433 85849 264544 239036 -11328 76759
15052 123429 215264 237783 -119778 385742 -184919 8067 -196255 159497 75883 -53414 -6598
15040 31011 117146 176666 221361 202857 -74221 274340 293786 169030 154003 58211 256128
$$ packed form
15119B54499E9918J82960k1912j0257b6923C1197d3916l2637C73298d01798G9818
15107a13504B38266J19880c3175p7442G6988L33239h3794C1743a43020C25824
15096A47126E0686J66551Q7554j31520a27812E1102K7975O8825b36189A23556
15085D32717A83921h9701C12150j07881o5717a39975b292E2702J54487N79087
15075G86276b19536B98505a6901G9630J44632K97482A53419M8514e3893B07325
15064B45932G266Q9033A7437a74768M1278a6433H5849J78695k5508a1328G6759
15052A23429R1835K2519a19778C85742a84919H067a96255A59497G5883e3414f598
15040C1011Q6135N9520M4695j8504g4221B74340J9446j24756j5027E8211J97917
$$ plain form
15029 256128 218334 212117 329626 -11485 376628 136695 405984 126407 189491 102063 504768
15018 504768 187326 389776 110486 -88787 103108 372552 -8143 221677 434754 161769
15007 309823 307201 260820 455407 -123844 73956 85405 275954 251858 373316 95657 423006
14996 423006 598864 215317 -47978 413317 348177 275800 274585 371198 227959 258193 -11044
14984 89968 135901 773716 333880 316890 123112 17480 361122 185876 361722 235928
14974 235928 505544 293862 347048 272037 -50222 408069 303578 384012 180799 171609 155493
14963 155493 -7865 304045 260317 403847 286590 200148 442813 201024 338392 399419
14953 399419 301541 -56643 378374 339548 212297 341610 225641 246468 443471 475524
$$ packed form
15029B56128l7794o217J17509a1485C76628A36695K69289A26407O3084q7428M02705
15018E04768A87326K02450A10486h8787A03108K69444h143B21677K13077A61769
15007C09823k622m6381J94587a23844G3956J1449J90549k4096J21458I5657L27349
14996D23006J75858B15317d7978D13317o5140p2377j215R6613j43239L0234a1044
14984H9968M5933O37815C33880j6990A23112A7480L43642j75246J75846j25794
14974B35928K69616k11682N3186p5011e0222D08069j04491Q0434A80799r190j6116
14963A55493g865C04045m3728J43530j17257q6442K42665B01024J37368O1027
14953C99419r7878e6643C78374l8826j27251J29313j15969K0827J97003L2053
$$ plain form
14943 475524 246118 126110 582732 176789 280345 136144 95369 334923 231569 141786
14933 141786 25595 292548 183845 136352 440171 -83844 225016 365609 -675 117782 139961
14922 139961 244737 496105 299718 286428 85302 104147 320298 448721 482133 127383
14911 251107 556134 405414 402661 474656 479399 274454 177030 513703 417680 231203 195352
14900 195352 116826 218568 69292 477630 86881 202996 258183 98569 408592 533986
14890 533986 219068 379552 218799 399984 223618 309178 102733 318057 200327 -32669
14879 330022 479643 158276 337349 128143 435727 395055 484958 325264 216121 627633
14869 627633 313019 402256 635356 405066 329994 172662 388185 652032 81974 288937
$$ packed form
14943D75524k29406j20008M56622A76789J03556A36144m0775K39554j03354q9783
14933A41786B5595K66953j08703m7493L03819h3844B25016J40593f75A17782K2179
14922A39961J04776K51368j96387j3290H5302J8845K16151J28423L3412A27383
14911B51107L05027j50720k753P1995M743k04945r7424L36673r6023j86477l5851
14900A95352p8526J01742F9292M08338H6881J16115N5187I8569L10023J25394
14890E33986B19068J60484j60753J81185j76366Q5560A02733K15324j17730c2669
14879C30022J49621A58276J79073A28143L07584m0672Q9903j59694j09143M11512
14869F27633C13019Q9237K33100k30290p5072j57332K15523K63847H1974K06963
$$ plain form
14859 288937 233798 448168 292597 356459 392903 467736 528582 521738 517825 271417 788910
14848 788910 -82853 526028 521839 686400 480943 585251 454442 440669 276827 668901
14838 668901 308589 604735 601005 508084 380086 371104 637186 372643 438761 232183 479506
14827 479506 517520 366524 588246 322894 452576 370580 385034 489548 749277 418223
14817 418223 623384 625188 436895 246009 482889 345166 575915 564301 399256 584029
14807 584029 382650 480390 357157 698771 667106 992476 548993 476591 319217 399950
14797 399950 604945 208050 311213 422032 878652 444086 160746 728689 564634 511814
14787 511814 280936 359734 610942 368545 236131 505881 584965 727186 572395 533194
$$ packed form
14859B88937n5139K14370j55571O3862L6444P4833O0846o844l913k46408N17493
14848G88910h2853E26028m189J64561k05457J04308j30809j3773j63842L92074
14838F68901C08589K96146l730r2921j27998q982K66082k64543O6118k06578K47323
14827D79506L8014j50996K21722k65352J29682q1996J4454J04514K59729l31054
14817D18223K05161J804j88293j90886K36880j37723K30749j1614j65045J84773
14807E84029k01379R7740j23233L41614l1665L25370m43483p2402j57374Q0733
14797C99950K04995B08050J03163J10819M56620m34566A60746N67943j64055n2820
14787E11814k30878P8798K51208k42397j32414K69750P9084J42221j54791l9201
$$ plain form
14777 533194 655231 616939 612174 867991 744085 860786 843264 565107 761639 559240
14767 559240 930297 879290 433144 577037 632771 267223 349736 286368 683864 800567
14757 800567 527244 690182 508031 562590 597028 437030 713924 579287 585955 890107
14747 890107 531704 448004 736697 560123 570107 444819 571227 1012123 790081 729893
14737 729893 657200 577000 766056 1065285 880252 916378 406088 784213 1038686 1012705
14727 1012705 707875 503283 927948 785244 1071308 894043 1096655 926805 949354 1009404
14717 1009404 640902 507462 713260 839574 1114581 813269 981075 1019532 786410 1137276
14707 1137276 872896 954475 850884 911904 950240 1001979 943044 905953 1249313 886498
$$ packed form
14777E33194J22037l8292m765K55817j23906J16701j7522k78157J96532k02399
14767E59240L71057n1007D33144J43893N5734B67223Q2513o3368L97496J16703
14757H00567k73323J62938j82151N4559L4438j59998K76894j34637O668L04152
14747H90107l58403q3700K88693j76574R984j25288J26408M40896k22042o0188
14737G29893p2693q0200J89056K99229j85033L6126D06088L78125K54473k5981
14727A012705l04830k04592M24665j42704K86064j77265K02612j69850K2549O0050
14717A009404l68502j33440K05798J26314K75007l01312J67806L8457k33122L50866
14707A137276k64380Q1579j03591O1020L8336N1739n8935l7091L43360l62815
$$ plain form
14697 886498 925137 953690 1026041 1011909 1347161 1015324 1043135 1300110 1039156 1248487
14687 1248487 1107188 1176188 1074728 865471 1222603 1058445 838455 1069752 626641 1294726
14677 1294726 938509 1128760 1090156 747196 1183864 924688 1257497 1206138 1120273 1255002
14667 1255002 997298 1137282 1042419 968376 1170110 1298571 1319977 1150397 800947 1128687
14657 1128687 1071222 880889 1045109 1228630 1129940 1040532 1258112 1010824 982941 1066909
14647 1066909 971124 945241 1020168 1383941 1247633 1130677 910258 1492526 1334954 1339108
14637 1339108 1304913 1089600 1255174 1282122 1156622 1291243 1454881 1328474 1490902 1274967
14627 1274967 1297367 1452753 1777001 1572882 1265296 1597181 1473762 1403824 1384334 1385125
$$ packed form
14697H86498L8639K8553P2351j4132L35252l31837K7811K56975k60954K09331
14687A248487j41299O9000j01460k09257L57132j64158k19990K31297m43111O68085
14677A294726l56217J90251l8604l42960M36668k59176L32809n1359q5865J34729
14667A255002k57704J39984r4863p4043K01734J28461K1406j69580l49450L27740
14657A128687n7465j90333J64220J83521r8690q9408K17580k47288k7883Q3968
14647A066909r5785k5883P4927L63773j36308j16956k20419N82268j57572M154
14637A339108l4195k15313J65574K6948j25500J34621J63638j26407J62428k15935
14627A274967K2400J55386L24248k04119l07586L31885j23419o9938j9490P91
$$ plain form
14617 1385125 1696294 1472304 1671966 1774912 1582824 1586288 1874625 1503799 1408932 1746208
14607 1746208 1633776 1384542 1710471 1729834 1766682 1771059 1904877 2031559 1892118 1811152
14597 1811152 1782950 1611774 1961404 1506273 1645007 2106533 1719261 1651052 1965537 1844546
14587 1844546 2038140 1966570 2095930 2024290 2024007 2305411 2067871 2140128 1996287 1996573 2176774
14576 2176774 2006664 1910090 2196648 2094944 2349362 2235514 2010202 2376082 2519717 2737497
14566 2737497 2519845 2781887 2940149 2632851 2729812 2887234 3143925 2838008 3296185 3118871
14556 3118871 3350417 3455213 3873150 4016906 4327833 5167198 6032875 7308562 11016978
14547 11016978 21092615 39335090 42272365 24493833 11897597 6386567 4362564
$$ packed form
14617A385125L11169k23990J99662J02946j92088L464K88337l70826r4867L37276
14607A746208j12432k49234L25929J9363L6848M377J33818J26682j39441q0966
14597A811152k8202j71176L49630m55131J38734M61526l87272o8209L14485j20991
14587A844546J93594p1570J29360p1640k83K81404k37540P2257j43841K86J80201
14576B176774j70110r6574K86558j01704K54418j13848k25312L65880J43635K17780
14566B737497k17652K62042J58262l07298R6961J57422K56691l05917M58177j77314
14556C118871K31546J04796M17937J43756L10927Q39365Q65677J275687L708416
14547A1016978J0075637J8242475K937275j7778532A1897597n511030k024003
$$ plain form
14540 4362564 3214666 2617926 2321666 2178067 1906048 2075726 2446619 2243758 2353780
14531 2353780 2410531 2153176 2353243 2376594 2439157 2354365 2463011 2890292 2315713 2679924
14521 2679924 2436993 2653726 2544974 2749415 2907069 2756424 2830290 2961667 2793158 2729938
14511 2729938 2725883 3139980 3077734 3223964 3189609 3459907 3317848 3366244 3075963 3313069
14501 3313069 3543786 3578161 3476279 3355093 3270363 3594016 3205790 3492598 3734966 3594552
14491 3594552 3890779 3607218 3790075 3700656 3963937 4026749 3371467 4236274 4265296 3976036
14481 3976036 4179978 4180282 4041880 4616791 4361219 4724114 4232740 4544966 4626314 4381803
14471 4381803 4668851 4810053 4950966 4730044 4833782 4830030 4945909 5013742 4897077 4959149
$$ packed form
14540D362564j147898n96740k96260j43599k72019J69678L70893k02861J10022
14531B353780N6751k57355K00067K3351O2563q4792J08646M27281n74579L64211
14521B679924k42931K16733j08752K04441J57654j50645P3866J31377j68509o3220
14511B729938m055M14097o2246J46230l4355K70298j42059M8396k90281K37106
14501C313069K30717L4375j01882j21186q4730L23653l88226K86808K42368j40414
14491C594552K96227k83561J82857q9419K63281O2812o55282Q64807K9022k89260
14481C976036K03942L04j38402N74911k55572L62895m91374L12226Q1348k44511
14471D381803K87048J41202J40913k20922J03738l752J15879O7833j16665O2072
$$ plain form
14461 4959149 5280360 5191355 5403134 5267675 5557749 5545583 5402391 5526915 5731553 5477677
14451 5477677 6097731 6143681 6286754 6160576 6018460 5729748 6172054 6188661 6592472 6325586
14441 6325586 6391113 6607154 6595274 6665753 6829342 6830565 7038566 7282907 7296359 7511461
14431 7511461 7208336 7713041 7379114 7797376 7762749 7582923 7999129 7804893 7926616 7945767
14421 7945767 8558727 8665453 8929033 8671705 8866669 9226661 9165149 9314332 9502836 9302660
14411 9302660 9579772 10019603 9957273 9997914 10141204 10384344 10557648 10823321 10948626 11182568
14401 11182568 11295543 11690890 12008308 12097499 12158850 12461806 12587909 12667521 13046285 13012956
14391 13012956 13361043 13674474 13968563 13914192 14316719 14205584 14511150 15252652 15204526 15409655
$$ packed form
14461D959149L21211q9005K11779j35459K90074j2166j43192J24524K04638k53876
14451E477677O20054M5950J43073j26178j42116k88712M42306J6607M03811k66886
14441F325586O5527K16041j1880P0479J63589J223K08001K44341J3452K15102
14431G511461l03125N04705l33927M18262l4627j79826M16206j94236J21723J9151
14421G945767O12960J06726K63580k57328J94964L59992o1512J49183J88504k00176
14411I302660K77112M39831o2330M0641J43290K43140J73304K65673J25305K33942
14401A1182568J12975L95347L17418Q9191O1351L02956J26103P9612L78764l3329
14391A3012956L48087L13431K94089n4371M02527j11135L05566P41502m8126K05129
$$ plain form
14381 15409655 16069306 16212826 16316530 16670112 17068063 17293326 17616606 18152118 18335963
14372 18335963 18664766 18997254 19184708 19630221 20260691 20699554 21217062 21383558 21697781
14363 21697781 22466528 22893864 23359507 23777238 24371490 25124352 25578337 26156821 26769072
14354 26769072 27646644 27851018 28581759 29397191 30466933 30747274 31982255 32102053 33125413
14345 33125413 34338084 35041690 35910466 37251756 37941953 38708911 40249287 41313432 42439099
14336 42439099 43686291 44885881 45921730 47821961 49006894 50376591 51984914 53783478
14328 53783478 55521987 57425941 58481077 60999383 62772400 65103425 67103470 69877857
14320 69877857 72303125 74509777 77037224 80096138 83298447 86304516 89725567 93180595
$$ packed form
14381A5409655O59651J43520J03704L53582L97951K25263L23280N35512J83845
14372A8335963L28803L32488J87454M45513O30470M38863N17508J66496L14223
14363B1697781P68747M27336M65643M17731N94252P52862M53985N78484O12251
14354B6769072Q77572K04374P30741Q15432J069742K80341J234981J19798J023360
14345C3125413J212671P03606Q68776J341290O90197P66958J540376J064145J125667
14336D2439099J247192J199590J035849J900231J184933J369697J608323J798564
14328E3783478J738509J903954J055136K518306J773017K331025K000045K774387
14320F9877857K425268K206652K527447L058914L202309L006069L421051L455028
$$ plain form
14312 93180595 97033966 100921715 105017336 109379695 113624113 118571760 123633901 128796662
14304 128796662 134803855 140674356 147378823 153894296 160970410 168137307 176419652 184595286
14296 184595286 193454447 202801886 212934312 223155348 234303045 246015259 257644154
14289 257644154 270397329 283450085 297178247 311207856 325626683 340448694 355364134
14282 355364134 370458271 385534526 400247954 414442231 428107944 440606323 452033867
14275 452033867 461897841 469838138 475647469 478067050 475414508 469320717 464960655 459448331
14267 459448331 453650997 445505996 435731225 424816998 412583920 399230497 384408856
14260 384408856 369113673 353211685 337302479 321311732 305868565 291601337 277185113
$$ packed form
14312I3180595L853371L887749M095621M362359M244418M947647N062141N162761
14304A28796662O007193N870501O704467O515473P076114P166897Q282345Q175634
14296A84595286Q859161R347439J0132426J0221036J1147697J1712214J1628895
14289B57644154J2753175J3052756J3728162J4029609J4418827J4822011J4915440
14282C55364134J5094137J5076255J4713428J4194277J3665713J2498379J1427544
14275D52033867R863974P940297N809331K419581k652542o093791m360062n512324
14267D59448331n797334q145001r774771j0914227j2233078j3353423j4821641
14260C84408856j5295183j5901988j5909206j5990747j5443167j4267228j4416224
$$ plain form
14253 277185113 263760203 250679484 238050341 226355240 214986601 204480970 194311105
14246 194311105 184911468 176052160 168215595 160006140 152491723 145701817 139125790 132763360
14238 132763360 127322239 121956624 116782205 111719667 106636549 102782848 98540751 95029527
14230 95029527 91218410 87732626 84191698 81024376 78142677 75189383 72515649 69990276
14222 69990276 67516690 65682405 63489250 61095766 58824109 56908198 54998572 53289620
14214 53289620 51902904 50663656 48969219 47224539 45630954 44829379 43309125 43056321
14206 43056321 41699327 40335286 39187983 37633658 36622737 36235073 35801385 34516962
14198 34516962 33546183 32222081 31458758 31158374 30283203 29303739 29092746 28042334 27666290
$$ packed form
14253B77185113j3424910j3080719j2629143j1695101j1368639j0505631j0169865
14246A94311105r399637q859308p836565q209455p514417o789906o576027o362430
14238A32763360n441121n365615n174419n062538n083118l853701m242097l511224
14230I5029527l811117l485784l540928l167322k881699k953294k673734k525373
14222F9990276k473586j834285k193155k393484k271657j915911j909626j708952
14214E3289620j386716j239248j694437j744680j593585q01575j520254k52804
14206D3056321j356994j364041j147303j554325j010921l87664m33688j284423
14198C4516962r70779j324102p63323l00384q75171r79464k10993j050412l76044
$$ plain form
14189 27666290 26786838 26243884 25469845 25028422 24247422 23669425 23195389 22817319 22617227
14180 22617227 21841984 21439533 21039558 20278899 19992433 20012747 19454556 19050370 18744135
14171 18744135 18364594 18007137 17728589 17290552 17038847 16585752 16574683 16158483 15785969
14162 15785969 15718193 15227021 14910158 14524550 13831561 14046125 13867494 13739116 13411529
14153 13411529 13312621 12872002 12954635 12426482 12498994 12282536 11892113 11837511 11686015 11608734
14143 11608734 11363111 10873223 11047718 10699959 10363740 10397545 10421335 10219638 10267044 9977457
14133 9977457 9684926 9327675 9481664 9345737 9010810 9121573 8970187 8711501 8645604 8517415
14123 8517415 8282623 8060844 8284582 8413249 8208469 7674823 7768692 7585173 7879760 7667254
$$ packed form
14189B7666290q79452n42954p74039m41423p81000n77997m74036l78070k00092
14180B2617227p75243m02451l99975p60659k86466K0314n58191m04186l06235
14171A8744135l79541l57457k78548m38037k51705m53095j1069m16200l72514
14162A5785969o7776m91172l16863l85608o92989K14564j78631j28378l27587
14153A3411529r8908m40619Q2633n28153P2512k16458l90423n4602j51496p7281
14143A1608734k45623m89888J74495l47759l36219L3805K3790k01697M7406k89587
14133I977457k92531l57251J53989j35927l34927J10763j51386k58686o5897j28189
14123H517415k34792k21779K23738J28667k04780n33646R3869j83519K94587k12506
$$ plain form
14113 7667254 7318440 7386976 7277430 7228414 7254776 6902884 6671105 6904482 6482069 6484177
14103 6484177 6453960 6521174 6430338 6243946 5995802 6399629 6273963 5922668 5971990 6126403
14093 6126403 5676517 5446079 5514181 5542975 5307288 5985848 5642090 5360851 5366245 5039643
14083 5039643 5289656 4891767 5061211 5330710 4950075 5231975 4866702 4922338 4788279 4501177
14073 4501177 4598855 4172710 4709088 4678709 4356107 4238975 4722876 4467605 4145007 4353342
14063 4353342 4164509 3849519 4067189 4204193 4072983 4204159 4505507 4292595 4100276
14054 4100276 3860682 3977052 3827755 3576163 3621389 3627834 3840871 3404894 3377923 3631629
14044 3631629 3657176 3543027 3281050 3302985 3336925 3367252 3158773 3572646 3284243 3275925
$$ packed form
14113G667254l48814O8536j09546m9016K6362l51892k31779K33377m22413K108
14103F484177l0217O7214r0836j86392k48144M03827j25666l51295M9322J54413
14093F126403m49886k30438O8102K8794k35687O78560l43758k81239N394l26602
14083E039643K50013l97889J69444K69499l80635K81900l65273N5636j34059k87102
14073D501177R7678m26145N36378l0379l22602j17132M83901k55271l22598K08335
14063D353342j88833l14990K17670J37004j31210J31176L01348k12912j92319
14054D100276k39594J16370j49297k51592M5226O445K13037m35977k6971K53706
14044C631629K5547j14149k61977K1935L3940L0327k08479M13873k88403q318
$$ plain form
14034 3275925 3435071 3238623 3212016 3089230 2819913 3085748 3381698 2676844 2889715 2815520
14024 2815520 3050924 2867978 3019692 2776206 2662567 2582810 2617351 2714918 2743125 2571899
14014 2571899 2501253 2533242 2778292 2402998 2442496 2555727 2794835 2502764 2508638 2050177
14004 2050177 2570392 2251974 2136175 2456523 2403310 2248423 2312875 2214729 2188867 2648304
13994 2648304 2301373 2555441 2584504 2799118 3056437 3769485 5522123 13426781 32673096
13985 32673096 41880712 27579698 15614399 9775368 6938695 5521012 4395667 4453421
13977 4453421 3956232 3189027 2961204 3233466 2714752 2647853 2815852 2708160 2437780 2828554
13967 2828554 2676522 2354157 2224974 2076879 2525261 2571423 2157599 2057633 2370076 2107023
$$ packed form
14034C275925J59146j96448k6607j22786k69317K65835K95950p04854K12871p4195
14024B815520K35404j82946J51714k43486j13639p9757L4541R7567K8207j71226
14014B571899p0646L1989K45050l75294L9498J13231K39108k92071N874m58461
14004B050177N20215l18418j15799L20348n3213j54887O4452r8146k5862M59437
13994B648304l46931K54068K9063K14614K57319P13048J752638P904658J9246315
13985C2673096R207616j4301014j1965299n839031k836673j417683j125345N7754
13977D453421m97189p67205k27823K72262n18714o6899J67999j07692k70380L90774
13967B828554j52032l22365j29183j48095M48382M6162m13824r9966L12443k63053
$$ plain form
13957 2107023 1841155 2140488 2160875 1973598 2110804 1891822 2037336 1782771 2068723 1749476
13947 1749476 2022975 1885345 2080937 1936248 1935716 1695239 1895335 1896227 1992033 1909230 1528385
13936 1528385 1933883 1958748 1930170 1707527 1538065 1772636 1955763 1806166 1776558 1946336
13926 1946336 1666835 1645974 1508090 1404928 1635556 1749319 1607238 1411036 1566409 1590063
13916 1590063 1428830 1500276 1650145 1395706 1563865 1485988 1455706 1206570 1474557 1625607
13906 1625607 1245590 1576933 1272373 1905473 1494198 1733791 1400775 1066546 1198791
13897 1198791 1422622 1487829 1324958 1277355 1215320 1228493 1761963 1584764 1226844 1556819
13887 1556819 1362731 1205554 1593510 1159605 1378872 1238287 1296457 1363761 1448026 1073518
$$ packed form
13957B107023k65868K99333K0387j87277J37206k18982J45514k54565K85952l19247
13947A749476K73499j37630J95592j44689n32k40477K00096Q92R5806q2803l80845
13936A528385M05498K4865k8578k22643j69462K34571J83127j49597k9608J69778
13926A946336k79501k0861j37884j03162K30628J13763j42081j96202J55373K3654
13916A590063j61233P1446J49869k54439J68159p7877l0282k49136K67987J51050
13906A625607l80017L31343l04560O33100m11275K39593l33016l34229J32245
13897A198791K23831O5207j62871m7603o2035J3173N33470j77199l57920L29975
13887A556819j94088j57177L87956m33905K19267j40585N8170O7304Q4265l74508
$$ plain form
13877 1073518 1162294 1329004 1328997 1319705 1042774 1443777 1414265 1201762 1104044 1465328 1013600
13866 1013600 1068871 1211990 1326105 1332508 1220939 1160222 1122195 1439681 968890 1266694
13856 1266694 1029757 965017 1379416 845020 1218605 928516 1264309 1040404 1026655 1150618
13846 1150618 906570 1129642 792750 1155849 1157210 909152 967315 973710 1262393 1107883
13836 1107883 1132972 1180798 860011 569285 765568 876717 676283 1279595 725697 1021874
13826 1021874 712623 918743 751221 965975 1007128 1211040 949478 691074 604388 864774
13816 864774 1238766 1000892 972919 1043967 1027497 945736 967021 1205365 1052005 987259 1384505
13805 1384505 1297722 830928 743620 788826 797766 1023367 695800 961634 769554 677683
$$ packed form
13877A073518Q8776J66710pr292k76931M01003k9512k12503r7718L61284m51728
13866A013600N5271J43119J14115O403j11569o0717l8027L17486m70791K97804
13856A266694k36937o4740M14399n34396L73585k90089L35793k23905j3749J23963
13846A150618k44048K23072l36892L63099J361k48058N8163O395K88683j54510
13836A107883K5089M7826l20787k90726J96283J11149k00434O03312n53898K96177
13826A021874l09251K06120j67522K14754M1153K03912k61562k58404q6686K60386
13816H64774L73992k37874k7973P1048j6470q1761K1285K38344j53360o4746L97246
13805A384505q6783m66794q7308M5206Q940K25601l27567K65834j92080r1871
$$ plain form
13795 677683 672919 865548 651557 994038 688382 877827 1008467 725736 825985 786080
13785 786080 666099 749178 789937 961660 693059 1059383 664026 772425 860167 902981
13775 902981 682952 738655 582195 629722 872380 1265007 938417 762546 742034 621654
13765 621654 466868 762784 856671 659413 524596 672724 697604 344042 706971 657054
13755 657054 825602 470899 477975 828246 1063902 765454 372938 679283 582481 680546
13745 680546 565921 639653 597119 594104 823102 562329 577108 565707 725943 564028 476967
13734 476967 592323 361980 569282 1004424 767640 663553 176155 517562 652937 766454
13724 766454 466435 385019 664486 536803 565424 633014 534016 472836 1013857 507902
$$ packed form
13795F77683m764J92629k13991L42481l05656J89445J30640k82731J00249l9905
13785G86080j19981Q3079M0759J71723k68601L66324l95357J08399Q7742M2814
13775I02981k20029N5703j56460M7527K42658L92627l26590j75871k0512j20380
13765F21654j54786K95916R3887j97258j34817J48128K4880C44042L62929m9917
13755F57054J68548l54703P076L50271K35656k98448C72938L06345r6802R8065
13745F80546j14625P3732m2534l015K28998k60773J4779j1401J60236j61915q7061
13734D76967J15356k30343K07302M35142k36784j04087A76155L41407J35375J13517
13724G66454l00019q1416K79467j27683K8621O7590r8998o1180N41021n05955
$$ plain form
13714 507902 356504 598983 488715 594972 626455 677673 620317 887420 758853 504317
13704 504317 516198 873322 245253 404385 784627 512669 693306 501631 511830 371611
13694 371611 702169 621412 513442 328882 306026 712129 447808 543357 280802 644100
13684 644100 469519 582908 684879 501522 539960 383096 583333 415814 513583 580737
13674 580737 395719 429478 509156 627095 394121 349502 462090 358782 292422 894843
13664 894843 540363 557668 345973 588032 423819 256291 520609 583779 43339 211684
13654 211684 372407 687671 432607 493718 567303 180653 269747 688748 361484 99130
13643 407885 304429 8730 214820 410728 486209 440232 815451 249675 301196 614662
$$ packed form
13714E07902j51398K42479j10268J06257L1483N1218n7356K67103j28567k54536
13704E04317J1881L57124B45253J59132L80242k71958J80637j91675J0199j40219
13694C71611L30558q0757j07970j84560k2856M06103k64321R5549k62555L63298
13684F44100j74581J13389J01971j83357L8438j56864K00237j67519R7769O7154
13674E80737j85018L3759P9678J17939k32974m4619J12588j03308o6360O02421
13664H94843l54480J7305k11695K42059j64213j67528K64318O3170D3339J68345
13654B11684J60723L15264k55064O1111P3585A80653Q9094M19001l27264I9130
13643D07885j03456H730K06090J95908P5481m5977L75219B49675N1521L13466
$$ plain form
13633 614662 269734 620403 359842 419019 526810 408985 272502 543519 374306 153045
13622 238186 292997 359423 316259 257531 190728 255384 375197 544260 417794 442670 473033
13611 473033 572075 548545 50927 380890 227874 136242 359606 188395 721169 660589
13601 660589 284779 122399 556082 608863 362297 323402 167463 388599 161645 593654
13591 593654 540675 509937 295068 220806 124054 387377 374581 523159 141528 405418
13581 405418 469513 428414 301530 216256 450365 275611 482248 269127 266021 630169
13571 630169 565610 383278 459067 378609 472347 110658 465950 411649 495844 280655 310508
13560 310508 -189962 650983 523596 147450 547951 211874 108438 541329 463179 294064
$$ packed form
13633F14662B69734L50669k60561N9177J07791j17825j36483K71017j69213A53045
13622B38186N4811O6426m3164n8728o6803O4656J19813J69063j26466K4876L0363
13611D73033R9042k3530E0927L29963j53016r1632K23364j71211N32774o0580
13601F60589B84779A22399M33683N2781k46566l8895j55939K21136A61645M32009
13591E93654n2979l0738k14869p4262r6752K63323j2796J48578A41528K63890
13581D05418O4095m1099j26884q5274K34109j74754K06637k13121l106L64148
13571F30169o4559j82332P5789q0458R3738A10658L55292n4301Q4195k15189K9853
13560C10508a89962F50983j27387A47450M00501B11874j03436M32891p8150j69115
$$ plain form
13550 294064 -78695 367312 637624 236100 440837 21569 210006 456757 500198 24859
13539 455620 402133 269265 113722 246243 206729 466003 33861 509067 216846 448225
13529 448225 718433 368127 251575 103033 183349 283105 165745 406609 347016 174934
13519 174934 614919 45981 319400 -10323 394115 250097 237206 73821 239416 -27685
13508 501790 347697 175448 -205464 578794 206227 223305 150228 225196 362969 112442
13497 306699 127390 336157 330307 584132 247191 11156 349991 248574 243188 209510 -90581
13485 237289 219960 377429 217178 37531 449474 509584 403119 433158 259612 572696
13475 572696 208368 194576 323490 347184 96811 116521 336091 187828 366063 183908
$$ packed form
13550B94064g8695C67312K70312B36100K04737B1569J88437K46751M3441B4859
13539D55620n3487j32868A13722J32521l9514K59274C3861M75206B16846K31379
13529D48225K70208l50306j16552A03033Q0316R9756j17360K40864n9593j72082
13519A74934M39985D5981K73419a0323C94115j44018j2891G3821J65595b7685
13508E01790j54093j72249b05464E78794B06227J7078p3077P4968J37773A12442
13497C06699A27390K08767n850K53825B47191A1156L38835j01417n386l3678i0581
13485B37289j7329J57469j60251C7531M11943O0110j06465L0039j73546L13084
13475E72696B08368j3792J28914K3694I6811J9710K19570j48263J78235j82155
$$ plain form
13465 183908 320618 327637 231631 344692 480181 483039 413207 501383 198947 126388 55005
13453 316179 436641 232483 376672 194602 83042 -48505 250784 82940 98214 168355
13443 168355 90943 290682 203568 342140 -35617 -11690 123492 212674 49414 -3744 524264
13431 434874 68505 26740 221752 480615 208765 208191 -112301 510828 411281 395159 15129
13419 477379 340132 64697 386897 -183458 282829 123174 323865 93426 152123 -79596
13408 426499 206772 -11383 531580 139202 391358 418829 175996 239199 273194 375427
13398 375427 199547 47493 332943 410324 48829 341508 121055 -26686 124558 360387
13388 360387 70412 57018 209144 260531 24372 147556 376493 314496 226044 42816 392650
$$ packed form
13465A83908J36710P019r6006J13061J35489K858o9832Q8176A98947p2559E5005
13453C16179J20462k04158J44189j82070H3042d8505B50784H2940J5274P0141
13443A68355p7412J99739q7114J38572c5617a1690A23492Q9182D9414c744E24264
13431D34874F8505B6740J95012K58863B08765n74a12301E10828r9547j6122A5129
13419D77379j37247F4697L22200a83458B82829A23174K00691I3426N8697g9596
13408D26499B06772a1383E31580A39202K52156K7471A75996O3203L3995J02233
13398C75427j75880D7493K85450P7381D8829K92679A21055b6686A24558K35829
13388C60387G0412j3394J52126N1387B4372J23184K28937o1997q8452D2816L49834
$$ plain form
13377 392650 232328 370507 158633 114751 144860 241369 48123 -96201 -169856 -167509 502378
13365 365711 -99882 191622 41186 -34369 210182 402692 148835 274532 252412 165498
13355 165498 733966 315900 406219 315808 271965 228566 215513 213062 390037 172954 277990
13344 277990 373280 487851 130006 84326 202105 137812 399340 257187 317447 477991
13334 477991 394034 289205 426513 192093 251841 225850 519671 469558 13464 80007 348307
13323 348307 191872 120165 319520 640293 317402 144932 251526 370677 106062 547472
13313 547472 104666 -70826 218448 -6781 394503 278889 242139 45912 -33169 40555 295880
13302 295880 371128 -113168 207511 236724 159412 7618 377821 71052 86960 -31725 -123226
$$ packed form
13377C92650j60322J38179A58633m3882L0109R6509D8123i6201p3655K347E02378
13365C65711i9882A91622D1186c4369B10182J92510A48835J25697k2120q6914
13355A65498N68468C15900R0319r0411m3843m3399j3053k451J76975A72954J05036
13344B77990R5290J14571A30006m5680J17779o4293K61528j42153O0260J60544
13334D77991q3957j04829J37308A92093N9748k5991K93821n0113A3464O6543K68300
13323C48307j56435p1707J99355L20773C17402A44932J06594J19151A06062M41410
13313E47472A04666g0826B18448f781C94503j15614l6750D5912c3169D0555K55325
13302B95880P5248a13168B07511K9213p7312G618L70203G1052J5908c1725r1501
$$ plain form
13291 -123226 208137 136051 102219 199075 156630 -92300 188963 339963 152371 -61593 289776
13279 -76560 295282 28150 84400 346778 163841 541511 137112 429429 315006 234043
13269 234043 -420023 125349 202110 316514 20905 149880 238981 -32842 221490 7148 251467
13258 251467 295751 -15972 23682 89007 205467 116290 215645 403624 352256 119719 135077
13247 135077 56043 133888 224584 23328 111697 -144549 566319 -124056 -71715 -14993 276514
13235 70758 120741 338147 18811 34922 240554 -236212 130074 -101565 92874 -46369 -84033
13224 -84033 11558 172556 51279 124466 108091 224953 226459 241661 245781 -90402 -9696 250494
13211 80748 5908 -15725 12834 64227 81590 -16074 128052 159043 309506 -179005 -100509
$$ packed form
13291a23226B08137p2086l3832R6856m2445i2300A88963J51000A52371f1593B89776
13279g6560B95282B8150N6250K62378A63841L77670A37112K92317j14423q0963
13269B34043d20023A25349P6761J14404B0905J28975Q9101c2842B21490G148K44319
13258B51467M4284a5972B3682O5325J16460q9177R9355J87979n1368A19719J5358
13247A35077E6043P7845R0696B3328Q8369a44549E66319a24056N2341a4993B76514
13235G0758M9983K17406A8811J6111K05632b36212A30074a01565I2874d6369l7664
13224h4033A1558J60998E1279P3187j6375J16862J506J5202M120i0402i696B50494
13211H0748E908a5725A2834N1393J7363a6074A28052L0991J50463a79005P8496
$$ plain form
13200 -100509 -67673 70764 164825 -160043 265823 3682 79219 302583 233047 136719 137341
13189 137341 149937 -863 150501 111173 223158 -253745 193944 292243 378748 -69654 197899
13177 128956 -12641 291375 186009 -17938 83059 4899 57195 -107135 148473 26743 123334
13166 123334 195881 373927 318480 300894 64729 287832 249634 18192 -204960 37734 -118322
13154 198648 268421 -92871 133627 122017 359093 30862 -53011 254397 81542 76164 229734
13143 229734 75734 -170601 116642 -24724 2959 188551 -122502 382855 -8935 -216942 -31864
13131 209176 115646 -78878 -38427 -32369 12302 -134332 264424 224908 130857 -90288 116167
13119 56816 208495 130095 -6509 -171855 131661 81337 -122831 3719 51532 -221168 -26853
$$ packed form
13200a00509L2836G0764R4061a60043B65823C682P5537K23364o9536r6328O22
13189A37341J2596h63A50501l9328J11985b53745A93944R8299Q6505f9654A97899
13177A28956a2641B91375j05366a7938H3059D899N2296a07135A48473B6743R6591
13166A23334P2547J78046n5447j7586F4729K23103l8198A8192b04960C7734a18322
13154A98648O9773i2871A33627j1610K37076C0862e3011B54397H1542n378J53570
13143B29734G5734a70601A16642b4724B959J85592a22502C82855h935k08007c1864
13131B09176r3530g8878c8427O058A2302a34332B64424l9516r4051i0288A16167
13119E6816J51679p8400f509j65346A31661n0324a22831C719M7813b21168b6853
$$ plain form
13107 53112 -73209 -73573 118693 328901 65666 143478 99184 10361 162103 391038 36762
13095 328667 -57896 -5173 -15230 -3723 -11611 290592 58865 -403248 -31768 159109 175131
13084 175131 175697 136976 -10324 107198 361001 -4831 -60856 65811 24376 435948 298854
13073 298854 345937 -62975 107654 76968 134161 52144 238559 135669 51697 329710 -111316
13061 168334 334427 150363 446173 335172 -93284 -127233 194952 157335 53881 -75575
13050 270079 -32621 204841 196968 13216 265304 -66715 -386594 29163 61765 -13927 -19380
13039 -19380 148790 104359 177703 -44101 -73690 133303 177412 263366 130982 126781 210308
13028 210308 -67279 251697 329827 101360 292883 573280 -34972 119117 210962 11424
$$ packed form
13107E3112g3209l64A18693K10208F5666P7812m4294A0361J51742K28935C6762
13095C28667e7896e173j0057c723p888B90592E8865d03248c1768A59109J6022
13084A75131N66l8721a0324A07198K53803d831n6025F5811B4376M11572j37094
13073B98854M7083f2975A07654l0686N7193E2144J86415j02890E1697K78013a11316
13061A68334J66093A50363K95810j11001i3284l3949A94952l7617E3881g5575
13050B70079c2621B04841p873A3216K52088f6715l19879B9163L2602a3927n453
13039a9380A48790m4431P3344d4101k9589A33303M4109Q5954A30982m201Q3527
13028B10308f7279B51697P8130A01360J91523K80397c4972A19117R1845A1424
$$ plain form
13017 22974 -74209 83244 -80380 341063 296354 179295 -81936 303816 -1351 245536 -90235
13005 303120 320643 -74361 387137 324983 227229 -138824 159328 -132883 240103 5051 162755
12994 162755 118949 109004 -162878 -103256 -87303 -309097 37529 47442 37844 -15379 43924 275855
12982 275855 173779 -190830 123431 117622 29172 150165 261750 282133 -230263 278025
12971 -47347 212425 -149470 -178360 -124185 82199 20994 255810 -83628 -175239 -115447 -158742
12960 -158742 154744 173611 61898 -24804 -127046 319311 -197639 -85805 282644 -159146
12949 197640 16038 214898 -12039 -118248 -43087 116733 53338 86238 -65098 -84382 6628
12937 57834 128620 -175435 148144 58049 388596 138472 79789 -67700 31166 143313 160671
$$ packed form
13017B2974g4209H3244h0380C41063m4709j17059h1936C03816a351B45536i0235
13005C03120J7523g4361C87137o2154r7754a38824A59328a32883B40103E051J57704
12994A62755m3806r945a62878N9622J5953k21794C7529R913r598a5379D3924K31931
12982B75855j02076a90830A23431n809B9172J20993J11585K0383b30263B78025
12971d7347B12425a49470k8890N4175H2199B0994K34816h3628r1611N9792m3295
12960a58742A54744J8867F1898b4804j02242C19311a97639h5805B82644a59146
12949A97640A6038J98860a2039j06209d3087A16733E3338L2900f5098j9284F628
12937E7834P0786a75435A48144E8049L30547A38472n8683f7700C1166J12147J7358
$$ plain form
12926 160671 94135 92886 201044 334564 182964 -6963 193111 -121887 147260 243162 -260359
12914 -133812 -40923 -111700 -74841 1841 149457 -240416 93230 221139 -237764 -90218 167784
12902 165729 33724 -111426 8404 27129 -69673 190208 -279341 -60882 -117637 345251 122297
12890 297747 154096 174220 65222 -27225 234908 162775 286884 -33603 -137963 -14104 -7201
12879 -7201 148867 -72313 143992 78587 106730 179788 215498 216 -34504 47164 -96178 -135645
12867 -135645 265490 201385 184389 -13387 -180945 -138639 209155 -238224 -45006 62161 -80006
12855 -83558 -105678 29105 -111158 -257151 128741 -255488 -25787 196412 -113129 -149126
12845 -149126 110809 76093 -152328 45889 -76489 89892 45712 -42811 300192 98223 158840
$$ packed form
12926A60671o6536j249J08158J33520j51600f963A93111a21887A47260R5902b60359
12914a33812d0923p0777L6859A841J47616b40416I3230J27909b37764i0218A67784
12902A65729C3724a11426H404J8725f9673A90208b79341f0882n6755C45251A22297
12890B97747j43651K0124F5222b7225B34908p2133J24109c3603j04360a4104O903
12879g201A48867g2313A43992o5405K8143P3058L5710B16c4504D7164i6178l9467
12867a35645B65490o4105j6996a3387j67558M2306B09155b38224d5006F2161h0006
12855h3558k2120B9105a11158j45993A28741b55488b5787A96412a13129l5997
12845a49126A10809l4716a52328D5889g6489H9892m4180d2811C00192I8223O0617
$$ plain form
12834 158840 -283546 94385 -367450 118530 -238795 55789 229785 111322 154640 8950
12823 128457 -72097 -188531 191196 6832 -10264 247801 412989 134995 -3485 31971 -35516
12811 248844 -395878 -94687 64424 114116 91779 475557 -96946 5911 146365 187142 193075
12800 193075 -129720 -43863 -190573 28734 -180650 6226 153179 54220 105574 -181327 151302
12788 -193130 184810 -44968 197619 -337410 -198154 -25456 396339 76621 80230 246494
12778 246494 -66753 122305 -511652 179917 249678 -25770 134233 -111162 268539 -165469
12767 140476 247941 195643 20642 -173819 -287309 -141764 103788 224372 139106 323803
12757 323803 -43961 -108599 105209 128106 -125015 -77269 -35708 264444 186681 -294488 -13358
$$ packed form
12834A58840b83546I4385c67450A18530b38795E5789J73996A11322M3318H950
12823A28457g2097j16434A91196F832a0264B47801J65188A34995c485C1971c5516
12811B48844c95878i4687F4424M9692k2337L83778i6946E911J40454M0777N933
12800A93075a29720d3863j46710B8734a80650F226J46953E4220N1354a81327A51302
12788a93130A84810d4968A97619c37410J39256b5456C96339G6621L609J66264
12778B46494f6753A22305e11652A79917O9761b5770A34233a11162B68539a65469
12767A40476J07465n2298B0642a73819j13490a41764A03788J20584q5266J84697
12757C23803d3961o4638A05209K2897a25015M7746c5708B64444p7763b94488a3358
$$ plain form
12745 119011 -87301 -101085 90499 -249060 -52044 -17781 -120377 -232504 81294 256032 373975
12734 373975 315494 -68918 -35400 54964 42107 481636 -3564 98973 -85780 190104 -18144
12722 -191849 -25929 -198258 -34052 122481 -236646 -17251 -170299 -32077 -9158 396373 -118105
12710 242874 82172 217016 464467 264498 -57739 330278 47603 367999 83558 76533 -90711
12698 -198436 240754 460023 -129897 178400 96492 -38962 168079 293833 -43106 29714
12687 126105 -88531 60993 -27484 224206 394445 467387 77281 375775 31662 243099 -178678
12675 121352 210631 73324 424571 -23721 235961 -5152 30308 -17473 200306 -39475 -125442
12664 -125442 9394 341877 -22473 -16662 140814 -93983 219044 76177 172857 232273 29857
$$ packed form
12745A19011h7301j3784I0499b49060e2044a7781j02596j12127H1294J74738J17943
12734C73975n8481f8918L3518E4964j2857M39529c564I8973h5780A90104a8144
12722a91849b5929j72329c4052A22481b36646a7251j53048c2077i158C96373a18105
12710B42874H2172J34844K47451j99969e7739C30278D7603L20396H3558p025i0711
12698a98436B40754K19269a29897A78400q1908c8962A68079J25754d3106B9714
12687A26105h8531F0993b7484B24206J70239P2942G7281K98494C1662K11437a78678
12675A21352Q9279G3324L51247b3721B35961e152C0308a7473B00306c9475q5967
12664a25442I394L32483b2473N811A40814i3983B19044G6177R6680N9416B9857
$$ plain form
12652 -26862 100037 271586 386268 -97731 -34008 -31339 107514 306552 -183955 -154783 199359
12640 -12071 -6321 250453 440743 14759 15875 -14980 -125420 -583579 -4143 87189 187992
12629 187992 269534 198516 73424 546845 560514 224016 504229 397254 117627 622004
12619 622004 509538 348506 130662 96437 -5364 136077 -119043 81644 167203 320924
12609 320924 109333 110928 446765 323424 -76599 382158 68747 201865 -55394 498354
12598 -100459 406314 400383 99209 176932 -175422 276630 470284 135043 -86471 309695
12587 274417 310027 -74057 -303273 165766 -4080 -72433 -15925 127279 73794 389812 22403
12575 148179 413954 54602 379348 304149 -274854 -96974 -39920 -87126 -77973 481 -44140
$$ packed form
12652b6862A00037J71549J14682i7731c4008K669A07514J99038a83955K9172A99359
12640a2071N750B50453J90290A4759J116a4980j10440m58159d143H7189J00803
12629A87992Q1542p1018G3424M73421J3669B24016K80213j06975A17627N04377
12619F22004j12466j61032A30662l4225e364A36077a19043H1644Q5559J53721
12609C20924A09333J595L35837j23341g6599C82158F8747J33118e5394D98354
12598a00459D06314n931I9209P7723a75422B76630J93654A35043h6471C09695
12587B74417L5610g4057k29216A65766d080o8353a5925A27279n3485L16018B2403
12575A48179K65775E4602L24746p5199b74854i6974c9920m7206R153D81d4140
$$ plain form
12563 345812 -322723 204971 140944 -36353 -8742 160653 35221 74974 -193969 -78375 -343575
12552 -343575 42891 59898 100373 164191 51035 313430 -178060 -41258 -30018 -232985 -204810
12541 -204810 -242092 -403490 55935 22772 -118559 -352512 94378 77834 91525 -34464 310719
12529 378843 138306 47227 -151362 181300 265334 245180 -125550 -140187 -112019 -86305 28156
12517 437433 -3899 18111 -71562 11247 -193470 -236918 -110102 -212976 178606 14820 119948
12506 119948 82821 -20173 199603 -18384 -217883 -161611 -175927 5514 142704 216370 288347
12495 288347 -15393 -143287 83675 377793 -196263 -146631 -177248 22671 267926 125350
12484 20068 -43426 262 -579711 -264053 23974 -171967 16218 -199926 339450 -88752 -108623
$$ packed form
12563C45812c22723B04971o4027c6353h742A60653C5221L9753a93969g8375k65200
12552c43575D2891J7007M0475O3818E1035K62395a78060d1258J1240k02967K8175
12541b04810l7282j61398E5935B2772a18559k33953I4378j6544J3691c4464C10719
12529C78843A38306D7227a51362A81300Q4034k0154a25550j4637K8168K5714B8156
12517D37433c899A8111g1562A1247a93470m3448a10102j02874A78606A4820J05128
12506A19948l7127b0173A99603a8384j99499N6272j4316E514J37190P3666P1977
12495B88347a5393j27894H3675K94118a96263M9632l0617B2671K45255A25350
12484B0068d3426B62e79711b64053B3974a71967A6218a99926C39450h8752j9871
$$ plain form
12473 -108623 -69175 -215496 53974 198544 -289885 30215 -138493 53141 -407361 -28627
12462 296455 -323185 77489 54343 -116530 88330 -58360 212176 -237430 -21432 -240347
12452 -240347 -175112 -5494 103704 -56410 89115 149380 129309 153671 64527 68229 48569 3208
12439 115759 -58520 -238583 -186747 -354275 -228802 106674 34811 -146224 -326143 -298004
12429 -298004 97515 44709 152660 251180 -199477 -20656 -145481 -55849 55354 302802 330673
12418 330673 -6320 100554 -209083 293362 -89716 178174 -245334 -51928 -363550 284656
12407 19136 -36967 -142471 -40014 -82696 -52168 -48115 7482 -222806 103498 -132940 -94057
12396 -94057 33466 -241741 58675 52136 -237755 -42491 -207067 345575 25764 -156588 -282790
$$ packed form
12473a08623L9448j46321E3974J44570b89885C0215a38493E3141d07361b8627
12462B96455c23185G7489k3146a16530H8330e8360B12176b37430b1432k18915
12452b40347O5235e494A03704e6410H9115O0265k0071K4362F4527L702j9660C208
12439A15759e8520j80063N1836j67528J25473A06674C4811a46224j79919K8139
12429b98004I7515D4709J07951R8520a99477b0656j24825e5849E5354K47448K7871
12418C30673f320A00554b09083B93362h9716A78174b45334e1928l11622B84656
12407A9136c6967j05504d0014m2682L0528M053G482b22806A03498a32940L8883
12396i4057C3466b41741E8675o539b37755d2491j64576C45575B5764a56588j26202
$$ plain form
12385 -282790 547014 -53439 -55212 205750 -168119 -83049 -117739 4734 -206144 -1521 339690
12373 -290783 32056 133191 312647 172190 -244235 -112363 -197266 272593 -103649 81696
12362 -105579 -114893 66410 -135661 285569 267549 147241 18647 -119036 142662 59518 -53162
12350 -59961 154809 -219845 183866 87351 362992 -53737 -7373 -111903 -104104 126694 122925
12339 122925 -37600 -22153 -338060 274260 451382 239393 -125049 209028 240496 -24509
12328 -95422 159078 25953 3682 21069 21762 11152 -153465 -157192 -312131 84391 -220965 126369
12315 -115118 25393 -142840 111768 -126237 21787 8486 22697 29061 -41469 74630 -177249
12303 48853 118709 433273 -82427 55966 -373557 -317289 131633 262163 238767 40727 70487
$$ packed form
12385b82790E47014e3439j773B05750a68119h3049l4690D734b06144a521C39690
12373b90783C2056J01135J79456j40457b44235a12363q4903B72593a03649H1696
12362a05579r314F6410a35661B85569j8020j20308A8647a19036A42662E9518e3162
12350e9961A54809b19845A83866H7351K75641e3737g373j04530P799A26694l769
12339A22925c7600J5447l15907B74260J77122k11989a25049B09028L1468b4509
12328i5422A59078B5953C682J7387O93j0610a53465l727j54939H4391b20965A26369
12315a15118B5393a42840A11768a26237B1787H486J4211O364d1469G4630a77249
12303D8853O9856L14564h2427E5966c73557N6268A31633J30530k3396D0727K9760
$$ plain form
12292 70487 131297 -19601 2927 -33909 111719 186038 21439 206686 177668 -188011 -52785
12280 -75061 24915 -104796 -137363 96762 207163 381080 506421 157577 329132 426714
12270 426714 434828 -106111 12370 161437 44880 144470 205149 90679 76708 174076 -2145
12258 261940 315717 284568 -26332 262516 -151133 -16322 -129091 51594 309260 110732
12247 92709 -219689 41708 96454 129690 -48533 38238 36437 205706 321489 208462 316141
12236 316141 335817 61008 -28154 32185 293754 -4498 161002 139048 124381 276680 292589
12225 292589 233225 364683 -145018 500163 147463 196911 222952 368075 -163531 21503
12214 -269008 206080 294711 -3342 211529 39373 -19296 212049 78884 251309 28667 283280
$$ packed form
12292G0487O0810a9601B927c3909A11719P4319B1439J85247k9018a88011e2785
12280g5061B4915a04796l2567I6762J10401J73917J25341A57577J71555R7582
12270D26714Q114a06111A2370J49067D4880R9590O0679I0679j3971R7368b145
12258B61940N3777l1149b6332B62516a51133a6322j12769E1594K57666A10732
12247I2709b19689D1708N4746L3236d8533C8238j801J69269J15783j13027J07679
12236C16141J9676F1008b8154C2185K61569d498A61002k1954j4667J52299J5909
12225B92589n9364J31458a45018E00163A47463M9448K6041J45123a63531B1503
12214b69008B06080Q8631c342B11529C9373a9296B12049G8884J72425B8667K54613
$$ plain form
12203 283280 432688 376722 54885 114560 253943 185960 290830 198627 243900 278062 313812
12192 313812 434300 315010 10179 101197 -174921 -146716 95202 -17661 82781 277317 221326
12181 221326 75233 28289 -254839 -315485 358055 95989 86465 -39104 -61865 209404 258986
12170 258986 21462 213075 -73709 -36396 61902 390441 226635 271549 217172 -240875 316290
12158 -111859 12926 -61653 -19733 225738 178116 -55909 -163555 252629 -405535 -66765 148066
12146 -44010 57873 -2033 226448 -302998 157655 14893 -262250 334638 40815 232727 141779
12135 141779 347324 -164615 -211627 -161946 -190287 40690 145797 73349 228895 287066 12664
12123 -313386 206866 -65886 619349 239444 -18629 -101810 119371 21417 34089 35415 -25914
$$ packed form
12203B83280J49408n5966E4885N9675J39383o7983J04870r2203M5273L4162L5750
12192C13812J20488j19290A0179R1018a74921K8205I5202a7661H2781J94536n5991
12181B21326G5233B8289b54839o0646C58055I5989r524c9104k2761B09404M9582
12170B58986B1462J91613g3709c6396F1902L28539j63806M4914n4377b40875C16290
12158a11859A2926f1653a9733B25738m7622e5909j07646B52629d05535f6765A48066
12146d4010E7873b033B26448c02998A57655A4893b62250C34638D0815J91912r0948
12135A41779K05545a64615m7012M9681k8341D0690J05107p2448J55546N8171A2664
12123c13386B06866f5886F19349B39444a8629q3181A19371B1417J2672J326b5914
$$ plain form
12111 -67838 -176354 153368 324887 -152815 180959 -389504 200878 332756 -93340 -135716
12101 -135716 -62390 -258505 -898 183389 296221 81585 -43293 92429 -193478 150167 -136559
12089 -63574 36946 -37769 181746 257155 -165766 -404184 59513 44427 94273 23355 120547
12078 120547 -109801 -2935 -17342 -195365 -75551 409834 -80085 -74486 765028 1337757 1258317
12067 1258317 507094 123390 196027 151290 192104 125456 31804 44658 44860 129449 161983
12056 161983 -185382 -285267 103197 136530 -181167 79152 159310 258588 81660 -262710 212771
12044 114304 -252975 -219004 215003 141927 -239498 -131588 -161838 -30016 159210 -261796
12033 -48777 57362 -524784 -67288 -57292 -6916 -185916 -401 -69793 51894 5583 59728 283402
$$ packed form
12111f7838j08516A53368J71519a52815A80959c89504B00878J31878i3340m2376
12101a35716f2390j96115h98A83389J12832H1585d3293I2429a93478A50167a36559
12089f3574C6946c7769A81746P5409a65766k38418E9513j5086M9846B3355R7192
12078A20547a09801b935j4407j78023g5551D09834h0085N599G65028N72729p9440
12067A258317E07094A23390P2637m4737M0814o6648C1804J2854K02Q4589L2534
12056A61983a85382r9885A03197L3333a81167G9152Q0158R9278H1660b62710B12771
12044A14304b52975L3971B15003p3076b39498J07910l0250c0016A59210b61796
12033d8777E7362e24784f7288R996f916j79000d01o9392E1894E583N4145K23674
$$ plain form
12021 283402 -185412 -26015 223335 -246668 74648 18802 -192147 184120 -54473 -111686
12011 -111686 88866 -114278 105493 -113456 109077 -93791 126221 -271192 395177 -210459
12000 39995 -66602 96132 28106 -142358 5744 -234758 52517 31724 298952 23937 -121399
11988 35130 -227594 285421 -240516 141878 -194365 -231531 -115980 59580 68622 -179490
11977 117695 250009 287666 -161445 270099 30279 112310 -124983 -189503 -44323 -149350
11967 -149350 328802 221313 -64948 -65403 -176464 195638 -119533 -295428 140358 -330716
11956 139714 36072 103482 -309786 65071 -31610 -43498 153284 -60872 -76367 106535 99911
11945 99911 -265604 16062 18822 300666 127944 -141059 49703 -117961 -226377 214497
$$ packed form
12021B83402a85412b6015B23335b46668G4648A8802a92147A84120e4473n7213
12011a11686H8866a14278A05493a13456A09077i3791A26221b71192C95177b10459
12000C9995f6602I6132B8106a42358E744b34758E2517k0793K67228B3937a21399
11988C5130b27594B85421b40516A41878a94365l7166J15551E9580R042a79490
11977A17695J32314L7657a61445B70099C0279Q2031a24983o4520d4323j05027
11967a49350C28802j07489f4948m55j11061A95638a19533j75895A40358c30716
11956A39714C6072O7410c09786F5071c1610j1888A53284f0872j5495A06535o624
11945I9911b65604A6062K760K81844A27944a41059D9703a17961j08416B14497
$$ plain form
11934 96969 60056 80980 -79010 183169 83353 128496 237931 51096 -47279 -136482 -176993
11923 -176993 -212310 -51158 -42174 76095 -237878 231702 34462 -60263 -40533 32370 -17773
11911 97715 -40900 40679 -28628 -261243 -202808 98394 -166324 163070 325560 77126 90239
11900 90239 135949 123124 76575 -66869 -127323 -68618 -98588 119822 129160 -415472 19508
11888 222650 -69477 -17921 96094 -217340 59726 356865 91375 91386 121586 6112 -232516 -142919
11876 -142919 -75278 -18073 199696 -113653 179837 103403 -30195 -79550 36276 -60886 -216857
11865 -216857 -205285 -16334 -236108 317992 123487 -275515 32329 164121 -475230 80070
11854 -13928 -35523 51613 47748 -82711 -46460 80128 18653 -145324 365930 86878 -125750
$$ packed form
11934I6969l6913K0924g9010A83169H3353M5143J09435E1096d7279q9203m0511
11923a76993l5317e1158Q984G6095b37878B31702C4462f0263J9730C2370a7773
11911I7715d0900D0679b8628k32615N8435I8394a66324A63070J62490G7126J3113
11900I0239M5710j2825m6549f6869o0454N8705k9970A19822R338d15472A9508
11888B22650f9477a7921I6094b17340E9726K97139I1375J1L0200F112b32516Q9597
11876a42919O7641a8073A99696a13653A79837p6434c0195m9355C6276f0886j55971
11865b16857J1572a6334k19774C17992A23487b75515C2329J31792d75230H0070
11854a3928k1595E1613l865h2711L6251H0128A8653a45324C65930H6878a25750
$$ plain form
11842 21996 108557 21907 209437 -109370 147943 -327002 -24446 -116956 48640 47988 224405
11831 224405 -171272 6150 -68133 -69193 31847 5071 126527 32278 -3317 92891 -7029 -328406
11819 -328406 187822 -235574 244731 82400 176719 59868 123588 -196751 165858 10119
11808 29953 251913 19436 153291 -300961 -58727 -204562 215294 179388 -188207 -126289
11798 -126289 -222109 -52249 -132585 197530 -69527 -185414 104221 290751 107196 -280665
11787 -136512 257333 -74476 -26989 -24198 -132872 -10760 2121 -43480 97809 183383 349350
11776 349350 -156189 3584 -268395 105609 -21527 22276 -166807 141045 74079 -383814
11765 101874 91685 -245785 311547 180308 289442 87337 168759 -14069 -168931 188662
$$ packed form
11842B1996Q6561B1907J87530a09370A47943c27002b4446r2510D8640o52J76417
11831B24405a71272F150f8133j060C1847E071J21456C2278c317I2891g029l21377
11819c28406A87822b35574B44731H2400R4319E9868O3720a96751A65858A0119
11808B9953K21960A9436J33855c00961e8727j45835B15294l5906a88207O1918
11798a26289r5820e2249q0336A97530f9527j15887A04221J86530A07196b80665
11787a36512B57333g4476b6989K791j08674a0760B121d3480I7809Q5574J65967
11776C49350a56189C584b68395A05609b1527B2276a66807A41045o6966c83814
11765A01874j0189b45785C11547j31239J09134H7337Q1422a4069j54862A88662
$$ plain form
11754 -286608 -45401 -143766 -127748 -239936 -85623 167990 165896 77441 -269250 -86573 -221472
11743 -221472 -152635 128975 11319 -168072 97285 -20665 260303 -116701 -157942 163666
11732 103698 -170066 26100 35212 156006 -40883 125304 97994 89095 183247 -300414 201622
11720 -97578 350171 -382405 -164357 100943 -106419 -175041 -82889 -21376 93582 -146475
11709 -47747 -70628 93223 -48906 78504 41734 -3295 -155768 12116 -147391 -49319 -93752
11698 -93752 -74862 -16823 309480 -33934 61233 -70001 100236 244179 -41198 87235 204498
11687 204498 167274 55978 241975 71039 -364989 -23365 -58441 284248 328327 181855 -17584
11675 60950 101002 268186 -175031 201502 -80134 -178936 174955 87588 -108642 -73510 410034
$$ packed form
11754b86608d5401r8365J6018j12188h5623A67990k094G7441b69250h6573j34899
11743b21472O8837A28975A1319a68072I7285b0665B60303a16701m1241A63666
11732A03698a70066B6100R112J20794d0883A25304k7310q899R4152c00414B01622
11720i7578C50171c82405a64357A00943a06419o8622h2889b1376I3582a46475
11709d7747k2881I3223d8906G8504l6770c295j52473A2116a47391d9319m4433
11698i3752J8890a6823C09480c3934F1233g0001A00236J43943d1198H7235J17263
11687B04498l7224E5978J85997G1039c64989b3365l5076B84248M4079j46472a7584
11675F0950M0052J67184a75031B01502h0134r8802A74955q7367a08642L5132D10034
$$ plain form
11663 235419 -8932 -24144 459713 -183311 91221 185927 86755 189608 32088 140904 124031
11652 124031 46868 13426 132450 195282 139106 157428 -31767 -46368 317376 -141560 82800
11640 -131696 -334102 184180 -96412 -16079 20481 54257 122943 63014 57446 162088 96020
11629 96020 29027 6 -233989 163847 2367 212102 231206 -14833 -184622 186748 61765 -47587
11616 191733 188467 201378 -23244 144827 250670 217547 323820 -104222 -302586 -196407
11606 -196407 49132 86188 -9739 -36757 -179860 90953 143946 81746 -157925 229455 51931
11594 105178 76368 47457 -75470 84747 -5100 42698 147997 -3758 159915 272900 236876
11583 236876 -63395 46255 333127 188676 387273 64398 94816 92873 -50029 -145559 296713
$$ packed form
11663B35419h932j5212D59713a83311I1221R4706H6755J02853C2088J08816j6873
11652A24031D6868A3426J19024O2832n6176J8322c1767j4601C17376a41560H2800
11640a31696k02406A84180i6412a6079B0481L3776O8686n9929n568J04642o6068
11629I6020B9027Fb33989A63847B367K09735J9104a4833j69789A86748F1765d7587
11616A91733l266J2911b3244A44827J05843l3123J06273a04222j98364J06179
11606a96407D9132L7056i739k7018j43103I0953N2993o2200a57925B29455E1931
11594A05178k8810k8911g5470H4747e100D2698J05299c758A59915J12985l6024
11583B36876f3395D6255K86872j44451J98597F4398L0418j943e0029r5530B96713
$$ plain form
11571 451545 230472 192149 95260 -54235 98520 -232804 109766 105504 256584 -97276 304492
11559 36384 -102986 67467 241031 5359 -42354 305571 -105166 -72379 56181 -230072 39439
11547 -154 317433 12983 -20618 -63012 -292684 90542 307432 96515 -114596 41266 86682
11536 86682 23941 -344971 114528 -16812 51051 -371719 6029 -30320 -48406 371946 -317799
11524 215096 283556 -59111 80644 418752 380882 94402 283498 233833 431426 110767 185023
11513 185023 4200 220845 7580 29521 -164934 132553 -33413 32315 -123210 240477 409310
11502 409310 -107358 213542 -23594 259595 -16696 267395 237877 267256 121122 365654
11492 365654 -369687 325205 8234 132097 177257 137509 142394 240423 134572 -34053 145585
$$ packed form
11571D51545k21073l8323I5260e4235I8520b32804A09766m262J51080i7276C04492
11559C6384a02986F7467J73564E359d2354C05571a05166L2787E6181b30072C9439
11547a54C17433A2983b0618m2394k29672I0542K16890I6515a14596D1266M5416
11536H6682B3941c44971A14528a6812E1051c71719F029c0320j8086C71946c17799
11524B15096O8460e9111H0644L38108l7870I4402J89096m9665J97593A10767P4256
11513A85023D200K16645G580K1941a64934A32553c3413C2315a23210B40477J68833
11502D09310a07358B13542b3594B59595a6696B67395k9518K9379A21122K44532
11492C65654c69687C25205H234J23863M5160l9748M885R8029j05851c4053A45585
$$ plain form
11480 42661 154906 10818 359448 298230 181451 322373 276101 -20581 128574 431266
11470 431266 -236889 -94862 546588 305130 133452 -10832 -63263 139546 250028 224292
11460 224292 115720 76039 93461 364079 -587115 -397526 92101 -120695 -49187 152703
11449 -113421 189761 405308 71939 35643 106761 -42246 187147 16380 -80661 261623 4975
11437 354455 115170 -159902 -67732 116305 308969 -86595 -10923 -90869 219487 111014
11427 111014 173411 -39933 -84421 309473 -143999 107543 103590 5538 -29650 86500 143353
11416 143353 -55027 -16907 125024 -353405 -329526 -161954 41075 -278980 -81591 -280226
11406 -280226 330932 -244301 246226 -14271 74494 152907 159932 239967 106573 144985 -9874
$$ packed form
11480D2661J12245A0818L48630o1218j16779J40922m6272b0581A28574L02692
11470D31266b36889i4862E46588k41458A33452a0832n2431A39546J10482k5736
11460B24292j08572l9681J7422K70618e87115J89589I2101a20695d9187A52703
11449a13421A89761K15547G1939C5643P1118d2246A87147A6380h0661B61623D975
11437C54455A15170a59902f7732A16305J92664h6595a0923p9946B19487j08473
11427A11014O2397c9933m4488C09473a43999A07543l953E538b9650H6500N6853
11416A43353e5027a6907A25024c53405K3879a61954D1075b78980h1591j98635
11406b80226C30932b44301B46226a4271G4494P8413P025Q0035A06573L8412i874
$$ plain form
11394 165818 328702 107225 80723 46212 -5690 3748 12399 -3153 25486 -69243 47518 73658
11382 73658 -84247 172576 161171 -177232 -108565 234115 242293 163659 -40379 44533 242610
11371 242610 267288 -15522 769 -261635 -31825 -36432 -114523 -24426 -272750 -191359 -51295 -88115
11359 -88115 70952 -46171 51762 4299 -24771 136401 39713 112031 -195714 -308227 13305
11347 235504 203476 106148 227891 88243 -44600 103046 -342464 132336 66737 -214254
11336 -187046 -106639 228048 -245979 -108656 202239 97233 -104049 -159819 15737 -167969
11325 -119059 -77101 -53224 -171670 -52154 -149695 232180 26840 120564 -129901 -84618 -111630
11314 -111630 227947 -225072 12783 -374124 123718 62969 -232796 -171346 -68630 -3209 142426
$$ packed form
11394A65818J62884A07225k6502l4511e690C748Q651c153B5486f9243D7518K6140
11382G3658h4247A72576j1405a77232O8667B34115Q178p8634d0379D4533J98077
11371B42610K4678a5522G69b61635c1825m607p8091b4426k48324Q1391e1295l6820
11359h8115G0952d6171E1762D299b4771A36401C9713P2318a95714j12513A3305
11347B35504l2028r7328J21743H8243d4600A03046c42464A32336o5599b14254
11336a87046Q0407B28048b45979a08656B02239I7233a04049n5770A5737a67969
11325a19059M1958K3877j18446e2154r7541B32180B6840R3724a29901M5283k7012
11314a11630B27947b25072A2783c74124A23718o0749b32796O1450f8630c209A42426
$$ plain form
11302 -282540 1287 -109167 -38404 -6297 103096 61931 57400 -148394 -205206 76134 128583
11291 128583 -227824 -177266 235409 -101564 -64267 99076 262836 -33333 -62586 18683 2641
11279 -44420 -193672 -214615 -8460 -176621 -183865 -138222 6620 -191187 -37190 -131846 -152547 -53534
11266 -84184 189878 60095 129313 -147673 210068 -188155 -106486 -68872 -49614 -374307 -84948
11254 188582 -423329 -221333 338742 157645 -152918 -23727 -286144 -37685 197773 278388
11244 278388 78620 16502 -146615 -107516 -67637 -127063 -118760 71178 24859 -145976 -321986
11233 -321986 24771 -261405 120414 -479703 117341 -197426 91998 -128728 50204 -228376
11222 -184953 48749 118411 278547 -204970 -320856 9786 -297103 128941 -60219 -140847 -400829
$$ packed form
11302b82540A287a09167c8404f297A03096m1165m531a48394n6812G6134N2449
11291A28583b27824N0558B35409a01564L7297I9076J63760c3333k9253A8683B641
11279d4420j49252k0943h460j68161p244M5643F620a91187c7190r4656k0701e3534
11266h4184A89878F0095O9218a47673B10068a88155Q1669L7614J9258l24693h4948
11254A88582d23329K01996C38742A57645a52918b3727k62417c7685A97773Q0615
11244B78388G8620A6502a46615L9099L9879n9426Q303G1178B4859a45976j76010
11233c21986B4771b61405A20414d79703A17341a97426I1998a28728E0204b28376
11222a84953D8749O9662J60136b04970j15886I786b97103A28941f0219q0628k59982
$$ plain form
11211 -400829 -566253 -13420 65045 -251932 -319404 -76725 -105069 -58304 272730 -194978 -192880
11200 -192880 -340553 -152197 42200 195116 -336159 -527185 -252218 286669 -231934 -115519
11189 194473 41326 -48794 77277 143844 -268886 -421956 64929 -254919 163660 97972 -5288
11177 32091 45471 26680 -309062 -149603 -285887 -59048 -87122 -42416 35715 45605 -147790
11165 104817 -141559 72904 -202916 63866 281984 173570 146939 65964 136517 -4387 -31083
11154 -31083 -25422 -93220 -208631 403236 -4542 226557 369707 152767 196777 -418312 -53618
11142 239803 -297986 4464 -295183 -224482 -148639 21103 47330 -42551 -257896 -132363 -25376
11130 -117630 -957 -23447 60567 -185713 334146 60705 107773 162469 140435 280552 -117197
$$ packed form
11211d00829j65424a3420F5045b51932o7472g6725k8344M6765B72730a94978K098
11200a92880j47673a52197D2200J52916c36159j91026b52218B86669b31934a15519
11189A94473D1326d8794G7277O6567b68886j53070F4929b54919A63660o5688e288
11177C2091J3380j8791c09062a49603j36284e9048k8074d2416C5715R890a47790
11165A04817a41559G2904b02916F3866K18118j08414k6631F5964P0553d387k6696
11154c1083N661o7798j15411D03236d542B26557J43150A52767M4010d18312e3618
11142B39803b97986D464b95183P0701P5843B1103K6227d2551k15345J25533b5376
11130a17630i57k2490F0567a85713C34146F0705M7068N4696k2034J40117a17197
$$ plain form
11118 352034 239649 176853 -97175 359247 -387749 142304 9870 -314571 -79367 173069
11107 -24841 -63766 155847 -43122 149211 484706 90336 129579 285055 410804 -94733 288532
11095 245525 48597 267521 -46023 191355 347454 279236 -7265 353855 73604 630468 38471
11083 11386 180581 323205 368344 269857 261492 319753 257253 479742 345645 273040 571538
11072 571538 -106530 520272 302553 210713 287484 293158 163735 292929 543905 354801
11062 354801 915974 528064 463595 300077 495206 518841 689943 723431 653074 975152
11052 975152 715995 584511 753866 731737 618141 1093188 837653 854049 673146 701216
11042 701216 770475 793279 931001 750395 487177 709416 806690 778476 559859 556264 641216
$$ packed form
11118C52034j12385o2796i7175C59247c87749A42304I870c14571g9367A73069
11107b4841l8925A55847d3122A49211L35495I0336L9243J55476J25749i4733B88532
11095B45525D8597K18924d6023A91355J56099o8218g265C53855G3604N56864C8471
11083A1386J69195J42624M5139r8487q365N8261o2500K22489j34097p2605K98498
11072E71538a06530E20272k17719r1840P6771N674j29423J29194K50976j89104
11062C54801N61173l87910o4469j63518J95129K3635J71102L3488p0357L22078
11052I75152k59157j31484J69355k2129j13596M75047k55535J6396j80903K8070
11042G01216O9259K2804J37722j80606k63218K22239R7274k8214k18617l595Q4952
$$ plain form
11031 641216 393366 914661 994379 864123 478570 721249 862190 626828 880590 635006
11021 635006 741625 730948 787701 839511 808183 549811 542197 657162 542601 813387 448870
11010 448870 1063152 905523 390601 794720 880044 480035 679995 636638 658124 612140
11000 612140 739132 572651 824271 433874 545524 884594 656778 552442 780415 982623
10990 982623 678210 963525 956301 1197924 1035114 1240723 1074762 1211017 1271662 1138567
10980 1138567 1401111 1834339 1695537 1614655 1991659 2328500 2747433 2973815 2710280 3127938
10970 3127938 2958621 2961401 2699036 2802004 2332106 2196933 1699934 1537777 1709273 1863864
10960 1863864 1667361 1704745 1832187 1699594 1792762 1587037 1597873 1323115 856923 1237467
$$ packed form
11031F41216k47850N21295P9718j30256l85553K42679J40941k35362K53762k45584
11021F35006J06619j0677N6753N1810l1328k58372p614J14965j14561K70786l64517
11010D48870O14282j57629C90601M04119Q5324m00009J99960m3357K1486m5984
11000F12140J26992j66481K51620l90397J11650L39070k27816j04336K27973K02208
10990I82623l04413K85315p224K41623j62810K05609j65961J36255O0645j33095
10980A138567K62544M33228j38802q0882L77004L36841M18933K26382k63535M17658
10970C127938j69317K780k62365J02968m69898j35173m96999j62157J71496J54591
10960A863864j96503L7384J27442j32593R3168k05725J0836k74758m66192L80544
$$ plain form
10950 1237467 1032649 609194 955788 558458 413506 550762 241536 467034 319805
10941 319805 262912 176271 33403 -24520 217515 49190 275868 99112 118710 307475 37656
10929 -204282 352306 -3012 292756 86667 132458 150026 107456 313217 -164495 109256 -555
10917 -19622 -339678 -31460 -146107 104181 -305633 364219 -172073 208959 -288398 9498
10906 116042 163607 37724 3620 -43876 -42657 250698 85500 -139196 -41196 88829 -138895
10894 98760 -61397 260467 -476628 221662 -169302 -83364 -277860 53269 -265351 -259682 -16636
10882 -226048 12154 -280660 -256685 -82695 6590 266255 43704 124025 84875 -102820 47669
10870 249758 112722 -14902 20643 -134502 142760 64250 6631 28804 303828 219989 82507
$$ packed form
10950A237467k04818m23455L46594l97330j44952J37256B41536K25498j47229
10941C19805n6893q6641C3403b4520B17515D9190K26678I9112J9598J88765C7656
10929b04282C52306c012B92756H6667M5791J7568m2570K05761a64495A09256e55
10917a9622l20056c1460j14647A04181c05633C64219a72073B08959b88398I498
10906A16042M7565C7724C620d3876J219B50698H5500a39196d1196H8829a38895
10894I8760f1397B60467d76628B21662a69302h3364j94496E3269b65351N669a6636
10882b26048A2154b80660K3975h2695F590K59665D3704Q0321l9150a02820D7669
10870B49758A12722a4902B0643a34502A42760F4250F631K2173K75024q3839H2507
$$ plain form
10858 138969 -224882 -120457 -115708 -72387 -120844 -18333 -502862 24992 108970 92866 183257
10847 183257 -40148 123595 -96174 9745 -16318 -163593 123009 -74123 -239202 -312075 159234
10835 -168334 -281957 249219 -229752 -69256 133454 -99578 -156421 244054 57979 -37241
10824 49654 256102 -178926 -84803 -102280 -76537 -64920 -68789 -369816 154647 126446 -9594
10812 169653 121664 -116350 -206446 -224540 -144327 176538 -197704 -63018 -257863 -8619 14339
10800 -521044 -29840 222082 -10561 96750 -310160 141419 -71660 -150941 -41031 -264026 -60811
10788 31890 -224114 173227 90382 136141 6601 -71327 20601 -37925 186011 55430 154655
10777 154655 -126007 -185197 -30226 -167469 -109410 120545 99485 -190609 234684 -41477
$$ packed form
10858A38969b24882J04425M749M3321m8457a8333m84529B4992Q3978j6104R0391
10847A83257d0148A23595i6174I745a6318j47275A23009g4123j65079p2873A59234
10835a68334j13623B49219b29752f9256A33454i9578n6843B44054E7979c7241
10824D9654K06448a78926h4803j7477K5743J1617l869l01027A54647k8201i594
10812A69653m7989a16350r0096j8094Q0213A76538a97704f3018j94845h619A4339
10800e21044b9840B22082a0561I6750c10160A41419g1660p9281d1031k22995f0811
10788C1890b24114A73227q2845M5759F601g1327B0601c7925A86011E5430R9225
10777A54655a26007n9190c0226j37243N8059A20545k1060a90609B34684d1477
$$ plain form
10766 57015 159351 66740 -6022 102247 26492 -110198 -229851 -6612 -295969 -328881 -302800
10755 -302800 -362255 216212 95486 -76006 -150456 -17977 -189921 65969 309185 -76092 -56066
10744 -56066 91496 -165357 303029 -271194 22373 38000 -159397 -37811 54707 296024 232483
10733 232483 129013 44222 -2157 198905 200127 -127503 65853 91399 -14585 3098 -61573
10721 -204502 -361410 24993 40205 -134161 -7069 -275788 55508 -181387 106570 -323105
10710 -177653 -34128 23805 -180 -89674 83089 175653 -198267 -204405 -382 100133 -74241 -169879
10698 -169879 82131 38291 -264610 -145124 -77285 -23997 110308 -70440 -167206 267425 -255010
10686 -18224 -103665 93319 -249595 -409077 -67174 -5372 -234523 -199524 -164157 -3996 -101421
$$ packed form
10766E7015J02336F6740f022A02247B6492a10198j19653f612k89357l2912K6081
10755c02800n9455B16212I5486g6006p4450a7977j71944F5969K43216g6092K0026
10744e6066I1496a65357C03029b71194B2373J5627a59397c7811E4707K41317o3541
10733B32483j03470D4222b157A98905J222a27503F5853K5546a4585C098f1573
10721b04502j56908B4993J5212a34161g069k68719E5508a81387A06570c23105
10710a77653c4128B3805a80q9494H3089R2564a98267o138c82A00133g4241r5638
10698a69879H2131C8291b64610J19486O7839b3997A10308g0440r6766B67425b55010
10686a8224q5441I3319b49595j59482f7174e372k29151L4999L5367c996r7425
$$ plain form
10675 -101421 -86150 -403205 -120778 51343 -232290 74992 -15348 202841 64171 209133
10665 209133 -350314 -200756 -490473 -34712 -225619 99497 31978 -4774 136434 66246 74909
10654 74909 103336 15301 -315948 41112 -113451 -290620 -92467 7677 -267892 86557 -263247
10642 -86794 159695 6858 -68641 262512 -102376 334519 561 77455 -57937 130824 -104581
10630 24463 253814 15352 86994 -32034 87947 -584250 -20761 122039 116673 267848 -195727
10618 -13574 -284087 -270642 -144526 242150 321315 -5984 -357010 -58408 -275388 -48047 176788
10606 94945 248803 49947 -148432 164823 -43074 405283 -45344 338338 -268093 -7187 -375476
10595 -375476 77675 180055 -146960 48526 -267377 -114844 194936 -78401 -207283 -279126
$$ packed form
10675a01421J5271l17055a20778E1343b32290G4992a5348B02841F4171J44962
10665B09133c50314J49558k89717c4712j90907I9497C1978d774A36434F6246Q663
10654G4909K8427A5301c15948D1112a13451j77169i2467G677b67892H6557b63247
10642h6794A59695F858f8641B62512a02376C34519E61P6894e7937A30824a04581
10630B4463K29351A5352P1642c2034H7947e84250b0761A22039n366J51175a95727
10618a3574k70513J3445J26116B42150P9165e984l51026e8408k16980d8047A76788
10606I4945J53858D9947a48432A64823d3074D05283d5344C38338b68093g187l68289
10595c75476G7675J02380a46960D8526b67377a14844A94936g8401j28882p1843
$$ plain form
10585 -279126 -152366 258440 69017 175991 196080 97175 63830 158774 -124279 -94944 -17892
10573 -181086 49424 -264863 46743 -196245 32502 -30157 -21477 -4248 -44486 -73037 -149701
10562 -149701 -50780 70120 119564 82788 -75635 66441 94677 229093 -18294 25326 165748
10551 165748 314860 -145319 -166238 125774 -21325 -224398 120254 -100368 -86740 -281330
10541 -281330 -28207 112060 -406500 -125119 -117271 -87172 256347 -201123 -208850 -63751 -61661
10530 -61661 -103422 -348131 -103550 -170062 129327 47183 -129503 123578 81042 53318 -106482
10518 -119252 248083 301390 -72004 286661 145102 -50002 143287 50361 -65077 -138568 -63572
10506 -102053 -15107 -71686 127226 93444 -206347 26774 -91848 -224113 -166753 336872 103155
$$ packed form
10585b79126J26760B58440F9017J06974K0089I7175l3345R4944a24279K9335a7892
10573a81086D9424b64863D6743a96245C2502c0157Q680d248m0238k8551p6664
10562a49701e0780G0120M9444l6776g5635F6441K8236J34416a8294B5326J40422
10551A65748J49112a45319k0919A25774b1325k03073A20254a00368J3628j94590
10541b81330b8207A12060d06500a25119P848L0099B56347b01123p727f3751K090
10530f1661m1761k44709a03550o6512A29327D7183a29503A23578m2536k7724a06482
10518a19252B48083N3307g2004B86661j41559e0002A43287E0361f5077p3491f3572
10506a02053a5107n6579A27226l3782b06347B6774i1848j32265N7360C36872A03155
$$ plain form
10494 -178445 -281825 -96790 -124204 -48275 196703 -110336 62359 -173123 198720 225881
10484 225881 240795 124012 58967 795559 483874 66291 217408 159920 231367 5056 -37387
10472 -11963 142112 -209846 82894 217419 -446973 124874 31033 -144326 105788 -164639
10461 82152 313821 -202768 114985 -156252 205779 -26702 16727 280306 -238988 -122154
10451 -122154 -104258 -121478 -147174 -343906 -126128 51731 -77777 -321703 158946 40776 154442
10440 154442 -150235 12453 73606 151203 -70297 -200521 -20364 -81975 -280620 -113783 29359
10428 -130257 130521 -119005 -88569 95306 -45103 -340218 -86572 -185107 -207440 -27389 135912
10416 601925 131094 -28561 181886 -106803 -33770 212775 -13381 -8151 -47788 164169 164740
$$ packed form
10494a78445j03380i6790k7414d8275A96703a10336F2359a73123A98720K7161
10484B25881J4914j16783E8967P36592l11685F6291J51117n7488P1447E056c7387
10472a1963A42112b09846H2894J34525d46973A24874C1033a44326A05788a64639
10461H2152K31669b02768A14985a56252B05779b6702A6727K63579b38988J16834
10451a22154J7896j7220k5696j96732a26128E1731g7777k43926A58946D0776J13666
10440A54442a50235A2453O1153P7597g0297j30224b0364o1611j98645a13783B9359
10428a30257A30521a19005L0436I5306d5103k95115h6572r8535k2333b7389A35912
10416F01925A31094b8561A81886a06803c3770B12775a3381N230l9637A64169N71
$$ plain form
10405 164740 -462425 -237053 9064 54633 -220929 -294498 -436801 74033 64409 -33982 -25103
10394 -25103 145798 336949 56693 183669 12280 -180464 67531 275143 -38640 164864
10383 233844 33823 -65810 270787 -94525 4493 394394 -46707 363414 300965 282431 -53069
10371 332396 -29317 375724 321167 534451 634627 512849 331540 297988 327127 376078
10361 376078 540736 398449 266450 175883 193697 251333 25573 173479 461744 469532 116909
10349 665459 351464 364730 262905 328129 196992 572660 294783 450488 82521 307674
10339 307674 504536 -83413 188464 210744 216147 280089 70213 234876 167314 66882 25863
10327 6194 -110363 -196728 -27183 73637 220330 483923 -309675 339185 189494 183138 139
$$ packed form
10405A64740d62425K25372I064M5569b20929p3569j42303G4033r624c3982Q879
10394b5103A45798J91151E6693J26976A2280a80464F7531K07612c8640A64864
10383B33844C3823f5810B70787i4525D493L89901d6707C63414o2449j8534e3069
10371C32396b9317C75724n4557K13284J00176j21778j81309l3552K9139M8951
10361C76078J64658j42287j31999r0567J7814N7636B5573J47906K88265P788A16909
10349F65459l13995J3266j01825O5224j31137L75668k77877J55705H2521K25153
10339C07674J96862h3413A88464K2280N403O3942G0213J64663o7562F6882B5863
10327F194a10363q6365b7183G3637J46693K63593c09675C39185j49691o356A39
$$ plain form
10315 459086 -43395 5225 45014 212209 42986 385229 -14829 361619 57449 -1859 -93848
10304 -93848 -242105 147041 233496 267695 388691 273520 -186980 116626 51734 201732
10294 201732 31934 110165 -25497 -50576 84563 -54169 15932 -43398 174631 -59214 -98587
10283 -98587 28926 34854 -194646 -82576 -409256 -190969 -57219 -119062 -7311 -31901 -186283
10272 -186283 320378 -164186 190562 157275 -36216 240 120515 -179368 -17754 380050 81795
10260 222594 306644 209390 261497 55812 153328 486998 199905 275858 30629 -54841 84182
10248 -46533 44673 -259163 55177 373203 -5945 77568 -84364 -272897 82403 -249605 76418
10236 -84945 250699 -332377 -182785 -350121 22487 113461 41394 -97511 -359156 -272328 -358398
$$ packed form
10315D59086d3395E225L9789J67195D2986L42243a4829C61619E7449a859r1989
10304i3848j48257A47041Q6455L4199J20996j15171a86980A16626E1734J49998
10294B01732C1934P8231b5497k5079H4563e4169A5932d3398A74631e9214l9373
10283i8587B8926N928a94646h2576l26680a90969e7219o1843g311k4590j54382
10272a86283C20378a64186A90562l3287c6216B40J20275a79368a7754C80050H1795
10260B22594Q4050r7254N2107E5812R7516L33670A99905P5953C0629e4841H4182
10248d6533D4673b59163E5177L18026e945G7568h4364j88533H2403b49605G6418
10236h4945B50699c32377J49592j67336B2487R0974D1394i7511k61645Q6828q6070
$$ plain form
10225 -358398 183065 9136 29843 -21946 292515 -273122 152840 117812 78134 283579 83197
10213 220414 -59036 -312385 109564 -467597 -156863 3514 -252282 -32477 184405 -237020
10202 108572 -81112 3364 -420116 -142797 -23854 -141625 265470 -131373 -38645 -205808
10192 -205808 85738 219912 -147586 -86417 90638 -26851 221024 -341248 -121271 -230787
10182 -230787 -236652 -176439 134617 -355233 -335414 199857 226126 -68480 147055 128305 93277
10171 93277 189174 28125 -15081 -274855 -209573 -115826 -74234 -241221 -356827 -6895 143051
10159 47786 -304213 -63981 -185313 -254671 -18722 43186 81507 -68633 -236286 -24986 -236098
10148 -236098 -182297 -30659 -302219 59087 -29247 -49171 -469643 -256716 -189324 -68390 -208374
$$ packed form
10225c58398A83065I136K0707b1946B92515b73122A52840l5028l9678K05445H3197
10213B20414e9036k53349A09564d67597a56863C514b52282c2477A84405b37020
10202A08572h1112C364d20116a42797b3854j17771B65470a31373c8645j67163
10192b05808H5738J34174a47586O1169I0638b6851B21024c41248a21271j09516
10182b30787n865O0213A34617c55233J9819A99857K6269f8480A47055j8750l5028
10171I3277R5897B8125a5081k59774O5282R3747M1592j66987j15606f895A43051
10159D7786c04213f3981j21332o9358a8722D3186L8321f8633j67653b4986k11112
10148b36098N3801c0659k71560E9087b9247j9924m20472K12927O7392f8390j39984
$$ plain form
10137 -208374 -45279 -331250 68275 150184 87609 22698 -142384 -402503 -143303 120553
10126 -151123 -173918 -85382 -293235 -86454 62796 -101587 1226 179965 -72930 34896 -302353
10114 -277835 -27553 36842 -24618 116070 -48806 -22797 -41177 56045 -272300 245738 -151778
10102 154433 -216418 102046 36788 246170 -133092 184370 -421671 170245 -79834 -68045
10092 -68045 12041 -319939 -147197 191475 -54531 -67532 -88426 -92422 -76114 193594 -425591
10080 -108826 -281427 -152490 -227949 80025 74952 -168154 -124808 -191491 -259435 -58232 -84393
10069 -84393 -380151 28738 -192146 -271006 169463 -165440 -323099 60820 -132579 91289
10058 -284841 129677 305032 -163305 -356888 -96608 -270540 97176 73749 184350 8340
$$ packed form
10137b08374d5279k85971F8275Q1909o2575B2698a42384k60119a43303A20553
10126a51123k2795h5382k07853h6454F2796a01587A226J78739g2930C4896c02353
10114b77835b7553C6842b4618A16070d8806b2797j8380E6045b72300B45738a51778
10102A54433b16418A02046C6788K09382a33092A84370d21671A70245g9834J1789
10092f8045A2041c19939a47197A91475e4531j3001k0894l996J6308A93594d25591
10080a08826j72601J28937p5459H0025n073a68154M3346o6683o7944e8232k6161
10069h4393k95758B8738a92146p8860A69463a65440j57659F0820a32579I1289
10058b84841A29677J75355a63305j93583i6608j73932I7176k3427J10601H340
$$ plain form
10047 5919 97013 -75254 -55404 -404386 -120235 -61130 24066 -196751 -102348 -135403 -18485
10035 -361873 272147 193671 -52269 197155 -90017 -255456 -31315 -472119 8284 41382 -102602
10023 -300187 -94509 9396 -59075 -68652 -122702 -88598 -530277 270247 -211764 -272624 -268468
10012 -268468 317932 -201662 -316225 77905 -323209 -43799 -187596 -71350 -150790 -199338
10002 -199338 -251309 -22206 -43331 133744 70804 -142932 3615 146899 13940 -282538 5922
9990 37602 35169 104539 -323632 187938 45219 -181288 -140029 149447 252578 -459411 -20305
9978 286080 48744 201801 -117263 -230138 18806 -77690 -177707 -147911 3214 -225677 178255
9966 25204 -48294 -59863 -117200 34588 -109240 -274764 18165 -179869 66267 -317999 -203381
$$ packed form
10047E919R1094g5254J9850l48982a20235N9105B4066a96751R4403l3055a8485
10035c61873B72147p8476e2269A97155i0017j65439c1315m40804H284L3098a02602
10023c00187i4509I396e9075r577n4050L4104m41679B70247b11764o0860M156
10012b68468C17932b01662j14563G7905c23209d3799j43797g1350p9440m8548
10002a99338n1971b2206k1125A33744o2940a42932C615J43284A3940b82538E922
9990C7602k433O9370c23632A87938D5219a81288M1259A49447J03131d59411b0305
9978B86080D8744J53057a17263j12875A8806g7690j00017K9796C214b25677A78255
9966B5204d8294j1569n7337C4588a09240j65524A8165a79869F6267c17999J14618
$$ plain form
9955 -203381 -78063 149275 -28881 37066 149297 177853 119503 -47151 -169725 -91755 -248575
9944 -248575 168240 -280515 -97480 -130863 -333701 94291 -457001 -200539 -345652 -519536
9934 -519536 -34051 -128188 263370 147958 44208 -83402 -114030 55106 -100067 250017 -261923
9922 -92130 -149028 -168283 184044 55629 194339 -21414 54515 -251305 4315 -335904 -36771
9910 -377770 -34408 40653 -114933 -96870 -303376 -179689 200075 31922 -8982 -130161 -238178
9899 -238178 -121924 -138275 -328014 -134179 83199 -421454 -210802 169901 276721 -101865
9888 527328 -285432 -234531 -261462 245964 -121873 -571255 15654 23938 -143729 12853 91639
9877 91639 189038 -72122 667 -28083 51831 -115102 -14662 -281672 150138 102657 -74708 -56127
$$ packed form
9955b03381g8063A49275b8881C7066J12231K8556n8350d7151j22574P7970j56820
9944b48575A68240b80515i7480l3383k02838I4291d57001b00539j45113j73884
9934e19536c4051r4137B63370j15412D4208h3402l0628E5106a00067B50017b61923
9922i2130n6898j9255A84044E5629J38710b1414E4515b51305D315c35904c6771
9910c77770c4408D0653a14933J8063k06506J23687B00075C1922h982j21179j08017
9899b38178J16254j6351j89739a34179H3199d21454K10652A69901J06820a01865
9888E27328b85432N0901k6931B45964a21873m49382A5654Q284a43729A2853P8786
9877I1639R7399g2122F67b8083E1831a15102a4662k67010A50138m7481g4708J8581
$$ plain form
9865 -56127 -11336 353545 145837 53694 -452280 227435 -58503 -268384 284930 -374441
9854 -32963 -208105 -134858 -221274 -23312 -250220 -171766 -132962 -276992 -44274 -117851 189007
9842 17508 27049 -20115 -126516 -212499 68061 -22603 -345716 -127281 93012 48492 -43844
9830 -225101 -403753 79943 34184 -159025 -104231 -159823 -144772 -22081 -204971 -45334 62209
9818 -72244 111253 49956 -89912 -249803 -155659 370558 308153 -237403 273595 -232966 533076
9806 387883 319613 -81352 -103018 -36414 65260 -340030 -94492 -255958 168647 -130071 15590
9794 180848 -7165 124871 -148340 -351961 -162089 -204797 -253747 60818 -48131 -384624 -257695
9783 -257695 -156912 -288052 80188 230549 360436 -81257 -345696 -359633 -243252 -88972
$$ packed form
9865e6127a1336C53545A45837E3694d52280B27435e8503k09881B84930c74441
9854c2963j75142P3247q6416b3312k26908P8454L8804j44030d4274p3577A89007
9842A7508R541b0115j06401q5983F8061b2603l23113a27281I3012m4520d3844
9830b25101j78652G9943C4184a59025N4794n5592J5051b2081j82890d5334F2209
9818g2244A11253D9956h9912j59891R4144C70558o2405b37403B73595b32966E33076
9806C87883o8270h1352k1666c6414F5260c40030i4492j61466A68647a30071A5590
9794A80848g165A24871a48340k03621a62089m2708m8950F0818d8131l36493J26929
9783b57695J00783j31140H0188J50361J29887h1257k64439j3937J16381h8972
$$ plain form
9772 61946 -73116 -114688 -260286 -164754 -163926 -1671 -392359 155312 -44712 65859 184282 135843
9760 135843 -32176 -189113 -98670 -86147 -227328 382642 34500 -103197 75598 -373515 -82332
9748 224349 -84059 -266717 43099 138237 -7646 -186320 -454879 31312 19832 22606 -147234
9736 -349163 -10324 -80450 -302619 27013 -96963 36071 -125634 -402786 -157043 -53858 45045
9724 -196877 12258 -207397 66280 -45560 -160232 214268 -125443 -169477 -397036 -141906
9713 144917 58322 -301308 182441 70903 -268330 -16396 125802 -145401 -277693 -267897 -12630
9701 -249760 3502 304590 -19188 257676 -43636 -191262 -286043 -210329 -36577 -276175 41358
9689 -21591 -18930 11011 30148 44230 90529 -7321 131213 -5423 -238765 36988 -199232 91066
$$ packed form
9772F1946g3116m1572j45598R5532Q28a671l90688A55312d4712F5859J18423m8439
9760A35843c2176j56937R0443J2523j41181C82642C4500a03197G5598c73515h2332
9748B24349h4059j82658D3099R5138g646j78674k68559C1312j1480K774a47234
9736c49163a0324p0126k22169B7013i6963C6071a25634k77152a57043e3858D5045
9724a96877A2258b07397F6280d5560j14672B14268a25443m4034k27559a41906
9713A44917E8322c01308A82441G0903b68330a6396A25802a45401j32292R796a2630
9701b49760C502L01088a9188B57676d3636j47626r4781P5714c6577k39598D1358
9689b1591K661A1011J9137J4082M6299g321A31213e423k33342C6988a99232I1066
$$ plain form
9676 151237 -11337 -222304 15586 -86370 214828 105098 -126499 6635 151700 130050 64536
9664 154858 -64402 203248 103283 -20121 -382424 -386113 -9739 66652 -90256 -99978 -183311 -147556
9652 -147556 25225 -25918 -125989 73718 -69778 -153362 -275997 27559 -330032 188672 143824
9641 143824 -94872 -101952 -112959 -124031 -232111 -98342 -77460 -107993 -245817 -90002 -197863
9630 -197863 33915 -203532 69923 188160 -236627 351784 124830 185177 -27269 -99527 -252801
9619 -252801 -165545 -179784 270227 -173219 342749 201589 196225 -252834 43986 -328954 -221401
9608 -221401 -33875 -169129 -55984 -405128 50956 234373 -99167 -118463 218056 -300448 -288874
9597 -288874 -98533 68285 45539 84199 113269 -179660 -253480 -111684 -193825 11653 -8245
$$ packed form
9676A51237a1337k10967A5586h6370B14828A05098a26499F635J45065k1650F4536
9664A54858f4402B03248r9965b0121l62303l689i739F6652i0256r722q3333L5755
9652a47556B5225b5918j00071G3718f9778q3584j22635B7559c30032A88672m4848
9641A43824i4872p080j1007j1072j08080i8342K0882l0533j37824i0002j07861
9630a97863C3915b03532F9923J18237b36627C51784A24830O0347b7269p2258j53274
9619b52801Q7256j4239B70227a73219C42749j41160n364b52834D3986c28954J07553
9608b21401c3875j35254e5984l49144E0956J83417i9167j9296B18056c00448J1574
9597b88874i8533F8285k2746L8660K9070a79660p3820a11684q2141A1653h245
$$ plain form
9585 -113795 19403 75233 -49624 -253153 -291731 238581 150535 -207174 139075 2504 365355
9574 365355 95222 -96242 184742 -103555 6105 -66726 185240 -340568 -400309 121645 -293206
9562 172662 -31130 37665 4751 22702 -440094 -227345 13826 79807 -393638 102130 18385
9550 -402443 -181144 185188 -151823 -70967 -139130 161833 -284608 -156321 93856 -265415
9539 -99645 76928 160522 -214582 -458297 93672 248554 -375155 2871 111236 -368412 -64983
9527 28739 -189758 -286205 176970 274021 41006 102302 -153417 -184473 -144381 117884 -85372
9515 -188294 -1728 -209932 -174160 -34494 -89818 347484 -38564 -367852 -246761 -29826 -192448
9504 -192448 219008 -200125 58621 -197505 -305069 -154897 -191328 -211931 -78278 -220734
$$ packed form
9585a13795A9403N5830d9624k03529l8578B38581q8046b07174A39075B504L62851
9574C65355I5222i6242A84742a03555F105f6726A85240c40568n9741A21645b93206
9562A72662c1130C7665D751J7951d40094K12749A3826O5981c93638A02130A8385
9550d02443a81144A85188a51823g0967o8163A61833b84608J28287I3856b65415
9539i9645G6928Q3594b14582k43715I3672J54882c75155B871J08365c68412f4983
9527B8739a89758r6447A76970R7051D1006O1296a53417l1056M0092A17884h5372
9515a88294a728k08204L5772c4494n5324C47484c8564l29288J21091b9826j62622
9504a92448B19008b00125E8621a97505j07564J50172l6431k0603g8278j42456
$$ plain form
9494 -220734 -325545 -301458 -206986 -149268 20171 -60737 200318 -79127 -93606 107239 -122126
9482 -100250 121639 66468 64477 16786 -3480 56930 78622 91676 -146353 137430 -299166
9470 -131527 64827 -235319 -46665 -91661 -192965 72504 -70528 -94891 -244358 -93684 -45317
9458 -100351 -176040 103814 -50794 2408 -268380 -13906 -27875 -16548 -133679 -33676 -97588
9447 -97588 -132134 -97779 15968 266451 -121008 138319 6188 87779 -117181 53739 25529
9435 -439209 292041 604963 -135256 123947 -79967 188967 -155843 -63339 -136069 227099
9424 -92685 -194289 -103018 -3611 -355701 -221838 -87361 1758 45815 -36263 -59525 317442
9412 -481530 -225851 -241959 -183115 -228936 -209068 -28487 203368 -42511 66664 -384926 -128711
$$ packed form
9494b20734j04811K4087R4472N7718B0171f0737B00318g9127j4479A07239a22126
9482a00250A21639n5171j991A6786c480E6930K1692J3054a46353A37430b99166
9470a31527F4827b35319d6665m4996j01304G2504g0528k4363j49467i3684d5317
9458a00351p5689A03814e0794B408b68380a3906j3969J1327j17131c3676o3912
9447i7588l4546L4355A5968K50483a21008A38319F188Q1591a17181E3739B5529
9435d39209B92041L12922a35256A23947g9967A88967a55843f3339p2730B27099
9424i2685j01604R1271c611l52090J33863h7361A758M4057c6263k3262C17442
9412d81530b25851j6108N8844m5821J9868b8487B03368d2511F6664c84926a28711
$$ plain form
9400 77976 -31842 -91407 -621793 -57247 -120502 -58966 -83186 -162211 -141689 3471 -90633 397784
9387 -257125 -421886 -86076 -79151 70415 33644 -253437 -42761 -117704 41239 -280677 188887
9375 -354720 -122236 -364062 -219566 -43463 -17120 186051 -195399 3430 -195711 -14346 -182253
9364 -182253 383183 -215992 -219501 -271056 -235100 -82284 52835 -75706 -164306 4042 -24043 -96744
9352 -96744 -137046 -154394 15743 207137 -230559 -65458 -60665 -145658 -251452 35119 -118905
9340 -23973 -104231 93015 73459 -274044 -139042 -308006 -71873 -85308 258497 56913 -68191
9328 42335 -239479 -54304 -290586 -82737 -174754 -37330 6698 23478 -81566 179024 -177413
9316 56610 -352494 -33515 -29428 1208 -1169 160366 152932 86986 -272635 -172112 4499 -318998
$$ packed form
9400G7976c1842n9565n30386e7247o3255e8966k4220p9025K0522C471i0633C97784
9387b57125j64761h6076O925G0415C3644b53437d2761p4943D1239b80677A88887
9375c54720a22236k41826J44496d3463a7120A86051a95399C430a95711a4346j67907
9364a82253C83183b15992l509n1555L5956h2284E2835g5706q8600D042b4043p2701
9352i6744m0302j7348A5743J91394b30559f5458M793q4993j05794C5119a18905
9340b3973q0258I3015j9556b74044J35002j68964g1873j3435B58497E6913f8191
9328D2335b39479e4304k36282h2737r2017c7330F698J6780h1566A79024a77413
9316E6610c52494c3515M087A208a169A60366p434o5946b72635J00523D499c18998
$$ plain form
9303 12113 194334 -315970 -94309 -5032 -150415 -294157 30688 -252183 -84842 -127480 -136058
9292 -136058 33014 130712 -68725 25712 -23563 -341953 -199888 -15948 -120529 141438 -30663
9280 -68510 28330 -277710 -186039 -76970 -22898 -16964 -1266 88419 -46337 55461 -333840 -372998
9268 -372998 -207372 -45821 109249 -248733 -93034 20928 49880 111991 102108 53023 -92029
9256 20075 -62942 -355409 -148891 90548 -212465 -294455 -130196 -173874 -177589 26987 225321
9245 225321 89980 -273759 138693 296052 66901 -1092 -216538 -85177 -255678 -112238 -567883
9234 -567883 -202419 -226970 122514 159599 -48693 13074 -114789 -106304 -98592 -197240 -14608
9222 -422559 50893 8223 -71239 50614 -205351 -202294 -88326 -476145 -203635 66418 -139262
$$ packed form
9303A2113J82221c15970i4309e032j45383j43742C0688b52183h4842m2638q578
9292a36058C3014R7698f8725B5712b3563l18390J42065a5948j04581A41438c0663
9280f8510B8330b77710R1671g6970b2898N934a266H8419d6337E5461c33840l9158
9268c72998J65626d5821A09249b48733i3034B0928K8952O2111r883m9085i2029
9256B0075f2942k92467a48891I0548b12465q1990a30196m3678l715B6987J98334
9245B25321H9980b73759A38693J57359F6901a092k15446h5177j70501a12238m55645
9234e67883b02419k4551A22514L7085d8693A3074a14789Q485P712r8648a4608
9222d22559E0893H223g1239E0614b05351L057h8326l87819b03635F6418a39262
$$ plain form
9210 223839 88597 146625 -184177 147709 49978 -214535 -237898 -72969 -199914 -36853 132276
9198 -102976 180530 101556 339627 179487 -140366 -90445 30913 85524 56116 -195 1018
9186 -257160 8512 66077 -31740 -170939 -103107 444234 -174419 36665 155842 204759 112408
9175 112408 -23659 80444 -112827 61827 3590 -74299 -45539 89884 -712162 90180 -176423
9163 30929 17255 159352 70984 -206792 -85221 120053 -204345 -227724 -28955 -101930 119204
9151 -179249 -31835 119469 -323829 -206507 -163410 -35652 -306158 -323263 -75435 393296 -144519
9139 5807 -437018 -226393 86440 -16507 -64302 172555 -246703 88722 -431540 -104055 -30599
9127 92606 -133684 -306549 30151 -110973 -253557 -227928 -120172 -349862 -93024 329665
$$ packed form
9210B23839H8597N8028a84177A47709D9978b14535k3363g2969j26945c6853A32276
9198a02976A80530p8974K38071j60140a40366M9921C0913N4611k9408a95A018
9186b57160H512N7565c1740j39199O7832D44234a74419C6665J19177M8917r2351
9175A12408b3659H0444a12827F1827C590g4299K8760H9884g12162I0180a76423
9163C0929j3674J42097G0984b06792h5221A20053b04345k3379b8955p2975A19204
9151a79249c1835A19469c23829J17322M3097c5652k70506j7105g5435C93296a44519
9139E807d37018K10625H6440a6507m7795A72555b46703H8722d31540a04055c0599
9127I2606a33684j72865C0151a10973j42584K5629J07756k29690i3024C29665
$$ plain form
9116 217534 70229 57366 -116149 -313548 34872 -59982 -47665 -170102 45035 -432428 31570
9104 119597 -138275 -171577 -80659 -131504 -598303 -75681 -463569 40540 -6138 68990 -257849
9092 -35968 -341828 -174919 -66551 -134464 23926 -113100 39889 193545 164068 -204827 -123195
9081 -123195 -257434 111980 -319419 -360191 49412 14729 107308 24832 -23286 201518 -211767
9069 -192780 -162765 26272 24648 116499 136186 -108486 8824 28535 -238543 -62746 -322066
9058 -322066 52995 -54811 102816 -341235 19401 -38184 185538 180544 -81260 -135819 -169988
9047 -169988 134835 -65589 24274 -5024 -72927 -264431 -166560 132793 -177695 45884 -40041
9035 200364 -143384 -162313 38630 -45036 -140641 -325709 190261 236444 -406967 -24246 -184008
$$ packed form
9116B17534G0229j2863a16149j97399C4872e9982J2317j22437D5035d32428C1570
9104A19597a38275l3302h0659n0845m66799g5681l87888D0540f138F8990b57849
9092c5968l05860J66909f6551o7913B3926a13100C9889J53656k9477b04827Q1632
9081a23195j34239A11980c19419m0772D9412A4729R2579B4832b3286B01518b11767
9069a92780L0015B6272j624R1851J9687a08486H824J9711b38543f2746k59320
9058c22066E2995e4811A02816c41235A9401c8184A85538m994h1260n4559l4169
9047a69988A34835f5589B4274e024o7903j91504R7871A32793a77695D5884d0041
9035B00364a43384j8929C8630d5036r5605j85068A90261M6183d06967b4246j59762
$$ plain form
9024 -184008 232235 105866 -331034 51466 -72812 255140 9660 79677 -49885 -561621 -240529
9012 -69006 -191245 -56213 -382449 -42347 24800 -220212 -244958 -22296 -37432 -190600 81778
9000 371875 367340 148631 -98341 -144834 -125320 52090 -107767 9039 54308 -189163 -126894
8989 -126894 101170 -139927 -69059 -50859 126963 96542 -167915 -106223 -315798 37983 403179
8978 403179 98225 -240837 -173431 104754 -172366 64338 -108295 173496 12831 211939
8968 211939 101474 244854 19529 -232688 172736 -29082 -375086 -74290 -431552 -365804
8958 -365804 -226977 67683 227709 -296569 -4335 141737 -56207 -67655 -130409 88595 68276
8947 68276 -20953 -121359 -99618 -157710 66131 -95444 195452 -5719 221207 -142883 -109841
$$ packed form
9024a84008B32235A05866c31034E1466g2812B55140I660P0017d9885n11736b40529
9012f9006j22239e6213l26236d2347B4800b20212k4746b2296j5136j53168H1778
9000C71875m535A48631i8341m6493J9514E2090a07767I039M5269a89163O2269
8989a26894A01170a39927f9059J8200A26963l0421a67915O1692k09575C7983L65196
8978D03179I8225b40837O7406A04754a72366F4338a08295A73496A2831J99108
8968B11939A01474J43380A9529b32688A72736b9082l46004g4290l57262O5748
8958c65804J38827F7683J60026b96569d335A41737e6207j1448o2754H8595k0319
8947F8276b0953j00406K1741n8092F6131i5444A95452e719B21207a42883L3042
$$ plain form
8936 -109841 136585 -79729 241850 -365802 391210 333941 -196116 -45266 -23652 -186213
8926 -186213 -33731 127160 551919 2594433 5573796 3336367 940054 512840 258281
8917 258281 126210 237976 13702 178234 -10391 -27686 -230531 200242 241598 157945 -146448
8905 -243298 72982 -278985 -297440 -78735 20657 -356458 37611 -114638 -66853 -223641 -15534
8893 28215 121630 -342039 185192 347503 14667 -126971 -121162 -238919 33200 6360 -157529
$$ packed form
8936a09841A36585g9729B41850c65802C91210n7269a96116d5266K1614j62561
8926a86213c3731A27160M24759K042514K979363k237429I40054m27214k54559
8917B58281A26210J11766A3702J64532a0391j7295k02845B00242M1356q3653a46448
8905b43298G2982b78985j8455g8735B0657c56458C7611a14638M7785j56788a5534
8893B8215R3415c42039A85192J62311A4667a26971N809j17757C3200F360a57529
$$ [...]
##END NTUPLES=NMR SPECTRUM
##END=
