
##TITLE=AC1302_PERAH12114_6535671_KetVU1Pe3j
##JCAMPDX= 6.0         $$ Bruker NMR JCAMP-DX V2.0
##DATA TYPE= NMR SPECTRUM
##DATA CLASS= NTUPLES
##ORIGIN= BRUKER
##OWNER= Administrator
$$ 1.72 TOPSPIN		Version 2.1
$$ 2012-11-29 19:57:30.373 -0500  Administrator@X
$$ Compression mode = diff/dup
##.OBSERVE FREQUENCY= 400.02188249412
##.OBSERVE NUCLEUS= ^1H
##.ACQUISITION MODE= SIMULTANEOUS (DQD)
##.ACQUISITION SCHEME= undefined
##.AVERAGES= 8
##.DIGITISER RES= 22
##SPECTROMETER/DATA SYSTEM= spect
##.PULSE SEQUENCE= zg30
##.SOLVENT NAME= COFFEE_meoh
##.SHIFT REFERENCE= INTERNAL, COFFEE_meoh, 1, 14.98509
##AUDIT TRAIL= $$ (NUMBER, WHEN, WHO, WHERE, PROCESS, VERSION, WHAT)
$$ ##TITLE= Audit trail, TOPSPIN		Version 2.1
$$ ##JCAMPDX= 5.01
$$ ##ORIGIN= Bruker BioSpin GmbH
$$ ##OWNER= Administrator
$$ $$ E:\/data/COFFEE/nmr/AC1302_PERAH12114_6535671_KetVU1Pe3j/30/pdata/1/auditp.txt
$$ ##AUDIT TRAIL=  $$ (NUMBER, WHEN, WHO, WHERE, PROCESS, VERSION, WHAT)
(   1,<2012-11-29 19:57:26.127 -0500>,<Administrator>,<X>,<go>,<TOPSPIN 2.1>,
      <created by zg
	started at 2012-11-29 19:56:19.225 -0500,
	POWCHK enabled, PULCHK disabled,
       configuration hash MD5:
       86 BA 57 50 F2 9D 5C 9B 26 00 A9 28 5F 66 2E 89
       data hash MD5: 64K
       7E 48 24 20 2D 12 01 28 0D 38 DB 3F 6D D7 1A FB>)
(   2,<2012-11-29 19:57:28.870 -0500>,<Administrator>,<X>,<proc1d>,<TOPSPIN 2.1>,
      <Start of raw data processing
       efp LB = 0 FT_mod = 6 PKNL = 1 PHC0 = 0 PHC1 = 0 SI = 32K 
       data hash MD5: 32K
       4E C6 6F 2F 9E 0B 95 81 51 10 EF 6B FC F7 4D 77>)
(   3,<2012-11-29 19:57:29.273 -0500>,<Administrator>,<X>,<proc1d>,<TOPSPIN 2.1>,
      <pk PHC0 = 96.60828 PHC1 = 0 
       data hash MD5: 32K
       B9 01 25 74 78 A1 06 1E 36 25 3F D0 6D EE BC 7D>)
(   4,<2012-11-29 19:57:29.468 -0500>,<Administrator>,<X>,<proc1d>,<TOPSPIN 2.1>,
      <abs ABSG = 1 
       data hash MD5: 32K
       D8 A6 43 FA 01 88 18 9D 70 35 C3 1E 65 D8 FF 02>)
(   5,<2012-11-29 19:57:29.607 -0500>,<Administrator>,<X>,<proc1d>,<TOPSPIN 2.1>,
      <abs ABSG = 2 
       data hash MD5: 32K
       EC 56 53 17 FE C3 ED 53 42 A0 AB EE 0C 5C 44 41>)
(   6,<2012-11-29 19:57:29.747 -0500>,<Administrator>,<X>,<proc1d>,<TOPSPIN 2.1>,
      <abs ABSG = 3 
       data hash MD5: 32K
       8A 27 E1 97 BF C3 6B B4 E1 19 76 11 D0 E3 A0 81>)
(   7,<2012-11-29 19:57:29.872 -0500>,<Administrator>,<X>,<proc1d>,<TOPSPIN 2.1>,
      <abs ABSG = 4 
       data hash MD5: 32K
       6F 4B 09 4F A3 02 A5 30 63 D0 17 90 18 F3 C6 D7>)
(   8,<2012-11-29 19:57:29.983 -0500>,<Administrator>,<X>,<proc1d>,<TOPSPIN 2.1>,
      <abs ABSG = 5 
       data hash MD5: 32K
       16 49 59 8C 9E EA F8 C2 1C 75 50 AA 0F 0C 21 ED>)
$$ ##END=
$$ 
$$ $$ hash MD5
$$ $$ F5 7F D3 59 52 74 5A 04 65 B9 76 32 EF 24 F9 06
##$RELAX= 
##$RELAX= 
##$RELAX= 
##$RELAX= 
##$RELAX= 
##$RELAX= 
##$RELAX= 
$$ Bruker specific parameters
$$ --------------------------
##$DU= <E:\>
##$EXPNO= 30
##$NAME= <AC1302_PERAH12114_6535671_KetVU1Pe3j>
$$ [...]
150 150 150 150 150 150 150 150
##$TP07= 0
##$TPNAME0= <>
##$TPNAME1= <>
##$TPNAME2= <>
##$TPNAME3= <>
##$TPNAME4= <>
##$TPNAME5= <>
##$TPNAME6= <>
##$TPNAME7= <>
##$TPOAL= (0..7)
0.5 0.5 0.5 0.5 0.5 0.5 0.5 0.5
##$TPOFFS= (0..7)
0 0 0 0 0 0 0 0
##$TUNHIN= 0
##$TUNHOUT= 0
##$TUNXOUT= 0
##$USERA1= <user>
##$USERA2= <user>
##$USERA3= <user>
##$USERA4= <user>
##$USERA5= <user>
##$V9= 5
##$VALIST= <valist>
##$VCLIST= <CCCCCCCCCCCCCCC>
##$VD= 0
##$VDLIST= <DDDDDDDDDDDDDDD>
##$VPLIST= <PPPPPPPPPPPPPPP>
##$VTLIST= <TTTTTTTTTTTTTTT>
##$WBST= 1024
##$WBSW= 4
##$XGAIN= (0..3)
0 0 0 0
##$XL= 0
##$YL= 0
##$YMAX_a= 831698
##$YMIN_a= -761293
##$ZGOPTNS= <>
##$ZL1= 120
##$ZL2= 120
##$ZL3= 120
##$ZL4= 120
##$ABSF1= 14.98509
##$ABSF2= -5.573092
##$ABSG= 5
##$ABSL= 3
##$ALPHA= 0
##$AQORDER= 0
##$ASSFAC= 0
##$ASSFACI= 0
##$ASSFACX= 0
##$ASSWID= 0
##$AUNMP= <proc_prof1d_extract_pilot.lims>
##$AXLEFT= 0
##$AXNAME= <>
##$AXNUC= <1H>
##$AXRIGHT= 0
##$AXTYPE= 0
##$AXUNIT= <>
##$AZFE= 0.1
##$AZFW= 0.1
##$BCFW= 0
##$BC_mod= 0
##$BYTORDP= 0
##$COROFFS= 0
##$CY= 15
##$DATMOD= 1
##$DC= 0
##$DFILT= <>
##$DTYPP= 0
##$F1P= 0
##$F2P= 0
##$FCOR= 0.5
##$FTSIZE= 32768
##$FT_mod= 6
##$GAMMA= 0
##$GB= 0
##$INTBC= 1
##$INTSCL= 1
##$ISEN= 128
##$LB= 0
##$LEV0= 0
##$LPBIN= 0
##$MAXI= 10000
##$MC2= 0
##$MEAN= 0
##$ME_mod= 0
##$MI= 0
##$NCOEF= 0
##$NC_proc= -8
##$NLEV= 6
##$NOISF1= 0
##$NOISF2= 0
##$NSP= 0
##$NTH_PI= 0
##$NZP= 0
##$OFFSET= 14.98509
##$PC= 1
##$PHC0= 96.60828
##$PHC1= 0
##$PH_mod= 1
##$PKNL= yes
##$PPARMOD= 0
##$PPDIAG= 0
##$PPIPTYP= 0
##$PPMPNUM= 2147483647
##$PPRESOL= 1
##$PSCAL= 4
##$PSIGN= 0
##$PYNMP= <proc.py>
##$REVERSE= no
##$SF= 400.02
##$SI= 32768
##$SIGF1= 0
##$SIGF2= 0
##$SINO= 400
##$SIOLD= 32768
##$SPECTYP= <>
##$SREGLST= <1H.CDCl3>
##$SSB= 0
##$STSI= 32768
##$STSR= 0
##$SW_p= 8223.68421052631
##$SYMM= 0
##$S_DEV= 0
##$TDeff= 65536
##$TDoff= 0
##$TI= <>
##$TILT= no
##$TM1= 0
##$TM2= 0
##$TOPLEV= 0
##$USERP1= <user>
##$USERP2= <user>
##$USERP3= <user>
##$USERP4= <user>
##$USERP5= <user>
##$WDW= 1
##$XDIM= 32768
##$YMAX_p= 492827990
##$YMIN_p= -763391
##$CURPLOT= <Network HP LaserJet P1505>
##$CURPRIN= <$Network HP LaserJet P1505>
##$DFORMAT= <normdp>
##$LAYOUT= <+/1D_H.xwp>
##$LFORMAT= <normlp>
##$PFORMAT= <normpl>
##$SURQMSG= 1
$$ End of Bruker specific parameters
$$ ---------------------------------
##NTUPLES= NMR SPECTRUM
##VAR_NAME=  FREQUENCY,     SPECTRUM/REAL,   SPECTRUM/IMAG
##SYMBOL=    X,             R,               I
##VAR_TYPE=  INDEPENDENT,   DEPENDENT,       DEPENDENT
##VAR_FORM=  AFFN,          ASDF,            ASDF
##VAR_DIM=   32768,         32768,           32768
##UNITS=     HZ,            ARBITRARY UNITS, ARBITRARY UNITS
##FACTOR=    0.250966925370066, 1,           1
##FIRST=     8223.43324360094, -207072,      -221373
##LAST=      0,             -87497,          182067
##MIN=       0,             -763391,         0
##MAX=       8223.43324360094, 492827990,    0
$$ Real data points
##PAGE= N=1
##DATA TABLE= (X++(R..R)), XYDATA
$$ [...]
19457a45394B6456a71920A58625b05017D2603a17325j69619f8212A95479a21073
19446f3030A19584C9553b53386N0100l69534h3750r0883Q3661k72689C2524a87062
19434c1969r2133d6608N641A13144b77757A70466b42105f0945A90587a56081k4752
19423a80833A005K1299a22719K891j66363A59935p3813M6933c6676n7206k27720
19412c21602E2580a53105m8033B25748F4028a65687d338B73628G1011J81559b261
19400e80817B23907b78048A33048b90939F5431l2461J24885D1782N8821c719C8322
19388e7651n8816p0040E2655a74209A57370b0032l30096J50277N4838k79065A50884
19376e3018n8829A29226c09934H5754O3980R852e6143j48228j8559Q3522A190
$$ plain form
19457 -145394 26456 -171920 158625 -205017 42603 -117325 -286944 -68212 195479 -121073
19446 -63030 119584 39553 -253386 -203286 -572820 -83750 -174633 -90972 -363661 32524 -187062
19434 -31969 -124102 -46608 -40967 113144 -277757 170466 -242105 -60945 190587 -156081 -180833
19423 -180833 1005 22304 -122719 -119828 -286191 159935 86122 133055 -36676 -93882 -321602
19412 -321602 52580 -153105 -201138 225748 64028 -165687 -4338 273628 71011 252570 -2261
19400 -580817 223907 -278048 133048 -290939 65431 32970 157855 41782 100603 -3719 38322
19388 -57651 -116467 -186507 52655 -174209 157370 -20032 -350128 -199851 -145013 -424078 150884
19376 -53018 -111847 129226 -309934 85754 149734 159586 -56143 -204371 -222930 -139408 1190
19364a93273O1689F9637a05013A80126b07272A97070J19449a60288k53217a12076
19353e5362B68447j27260h2466l1623b5395B39110H2585h4921A54304a99222g2258
19341a13954j90272L6626D3778K03070c7408p7731l7567B22792b37616g5848j50930
19330b26778k8849B48222a51871G1108g2670A0520J30802a3908m32216a21923
19319a65655b8313A27998K60879A21313p843b4171B39578a58525f9846G6217c88932
19307B29461L3188c3351D40279a93766A78912c39290E1055c2001r3924A36353
19296b93689G8779J06405K1808b13425c3448A86818B3725J69312b66087c4144
19285E5280c31379A6289J35316i6032K8607a8576k1356J5801E8977K7183a17942
$$ plain form
19364 -193273 -131584 69637 -105013 180126 -207272 197070 316519 -160288 -413505 -112076
19353 -55362 268447 141187 -82466 -114089 -25395 239110 82585 -84921 154304 -199222 -72258
19341 -113954 -304226 -267600 43778 246848 -37408 -115139 -152706 222792 -237616 -75848 -226778
19330 -226778 -255627 248222 -151871 71108 -72670 10520 141322 -13908 -446124 -121923
19319 -165655 -28313 127998 388877 121313 113470 -24171 239578 -158525 -69846 76217 -388932
19307 229461 262649 -33351 440279 -193766 178912 -339290 51055 -32001 -125925 136353
19296 -293689 78779 185184 206992 -213425 -33448 186818 23725 193037 -266087 -34144
19285 55280 -331379 16289 151605 -96032 -67425 -18576 -39932 -24131 58977 86160 -117942
19273b07909C5210a15848k30282E276O4167c22825b8275k65862a30751J3062L9109
19262g8580j41740h9616A45929j4015J3466b75483e3938J7569H3104d64792a739
19250A48854M5331o8468b78458g5542H7305h3930o7195M5774B115g3314p6116
19239a49430A94240L0673f1686k4968A35208a80111e9448D17781h3777I86J62484
19228A63470e3253b6460l35877d0489A08374R9207D4961b14459J9784B7168b33342
19216C5037N7296e6257D6981g5061B90124r4869a4801B0262c76443C7560J57344
19205A94904P6690b57315O9426c8031I6671m6664a91542O6738M3891A15385a03616
19193c87663L5647H8756a78641D1148K49463a48087c0104j08758G9607c10159
$$ plain form
19273 -207909 35210 -115848 -346130 5276 69443 -322825 -28275 -294137 -130751 -117689 -78580
19262 -78580 -220320 -89616 145929 131914 145380 -275483 -53938 -36369 83104 -464792 -1739
19250 148854 194185 125717 -278458 -75542 87305 -83930 -151125 -105351 2115 -73314 -149430
19239 -149430 194240 224913 -61686 -86654 135208 -180111 -59448 417781 -83777 986 163470
19228 163470 -53253 -26460 -362337 -40489 108374 207581 44961 -214459 -194675 27168 -233342
19216 35037 92333 -56257 46981 -75061 290124 195255 -14801 20262 -376443 37560 194904
19205 194904 271594 -257315 -187889 -38031 96671 50007 -191542 -124804 -80913 115385 -103616
19193 -387663 -352016 88756 -178641 41148 290611 -148087 -30104 -138862 79607 -310159
19182b85963A29549b31746C5792a47504j21660I1374a68032K8777e1066A64926
19171c3804H1447J56072C4144J78175B7471K6111g0461A72428p2378f5326A43053
19159B2471a15956l0014k5687M3761k4342j07895L7310C14260m8652A1500J02010
19148A13510f9712D8540Q929R7147l3332h0174a1192A09534f2898l24248c3033
19136a09137F0119e162E4624a54691K1165q2253A70931c43338J08438A086a7406
19124a30500A61605c4507q9013A92347l2393g3331E5423J60860c46714a22844
19113A58554L4875b56543j4141I9279a61058j64412i0813j1039E7800h9219m7494
19102a36713e7871l26974f2349A89548O0226a09939A30028J34244j0961b17079
$$ plain form
19182 -285963 129549 -231746 35792 -147504 -269164 91374 -168032 -139255 -51066 164926
19171 -33804 81447 237519 34144 212319 27471 53582 -70461 172428 100050 -65326 143053
19159 22471 -115956 -145970 -171657 -127896 -152238 -260133 -222823 314260 265608 11500 113510
19148 113510 -69712 48540 57469 154616 121284 -80174 -11192 109534 -62898 -387146 -33033
19136 -109137 60119 -5162 54624 -154691 -133526 -215779 170931 -343338 -234900 1086 -17406
19124 -130500 161605 -34507 -123520 192347 159954 -73331 55423 216283 -346714 -122844
19113 158554 193429 -256543 -270684 99279 -161058 -325470 -90813 -101852 57800 -89219 -136713
19102 -136713 -57871 -384845 -62349 189548 249774 -109939 130028 264272 253311 -217079
19091B3283M26588F9589i5631j48770A18163a15651b2313A90440a53685m283D7459
19079C6551b68456a6844j14052a8864A42014b21962e6029k08377n7487G6350h6008
19067a25113j05246N3879p4500O9251A20776e1616H9155a84943r4941b5593n4487
19056h0080a2497l5391a3266B06532d7951j99286m9378E3578d04617A6063b30607
19044A50410J31481a06815F2209L4552b86448a39022d3407p2399A028J0921L0184
19033D2133b55729b1356A28638a46659j04368a17833j51832a084j95195e4014
19022A22700b2738n806j6129a9242G612c8485j78816f5881k86921c9640p966k96759
19010c44365f1050a3780p8859j9422j66213b3872D3279b16555A17674h9130B00156
$$ plain form
19091 23283 449871 69589 -95631 -244401 118163 -115651 -22313 190440 -153685 -157968 47459
19079 36551 -268456 -16844 -130896 -18864 142014 -221962 -56029 -264406 -321893 76350 -86008
19067 -125113 -230359 -176480 -250980 -181729 120776 -51616 89155 -184943 -279884 -25593 -80080
19056 -80080 -12497 -47888 -13266 206532 -47951 -247237 -296615 53578 -404617 16063 -230607
19044 150410 281891 -106815 62209 96761 -286448 -139022 -43407 -115806 1028 11949 42133
19033 42133 -255729 -21356 128638 -146659 -251027 -117833 -269665 -1084 -196279 -54014
19022 122700 -22738 -28544 -44673 -19242 7612 -38485 -217301 -65881 -352802 -39640 -47606 -344365
19010 -344365 -61050 -13780 -92639 -112061 -278274 -23872 43279 -216555 117674 -89130 200156
18998A16619N7577d6565P976l9028J8730l8268g674j59278O2818E4006a39705
18986c8429k76143J44134k59448A32303b89808a8024j16726B02133b33490B1751
18975b84691A70588J41843c0963a4847k97814R3729A62444L568c1877J0380k22973
18964b44470B71748j26862d787A63219d24146I0905C409g5095B67356b19327L2528
18953a86799A6313b29974K8020n6595H0892k3026J1679b62854D5316j4496K21226
18942B52046a64362f7062G8774a19924F00736c46943B19681k6830q9998d85308
18931C57005g3959D727a47447O0006A84769H8020B0372a75538C15386c00050c5669
18919b147A73743a4407k55723A27199J86325A7125J84889a52343B77334a49501
$$ plain form
18998 116619 174196 -46565 -38589 -77617 -58887 -97155 -7674 -166952 -104134 54006 -139705
18986 -38429 -314572 -170438 -429886 132303 -289808 -18024 -134750 202133 -233490 21751
18975 -284691 170588 312431 -30963 -14847 -312661 -218932 162444 166012 -31877 -21497 -244470
18964 -244470 271748 144886 -4787 163219 -424146 90905 3409 -75095 267356 -219327 -186799
18953 -186799 16313 -229974 -201954 -258549 80892 57866 69545 -262854 45316 30820 252046
18942 252046 -164362 -67062 78774 -119924 600736 -346943 219681 192851 102853 -485308
18931 357005 -73959 4727 -147447 -87441 184769 88020 20372 -175538 315386 -300050 -35669
18919 -2147 173743 -14407 -270130 127199 313524 17125 202014 -152343 277334 -149501
18908B5682b04843i7530E3147a13137A36448d5607J8719r8013B4113I485b44743
18896b3196k35579k3711a15142H0412a29049k82340b532p4162j16903E0373K00374
18885B50747H7494N21d27405a8145k70144h7143E2268i6072B35649b0950k17890
18874b38840C4232a57648j01348A03283J41907a04344j69543G0143k3748b64193
18863b82n687A92041H4147a42245j74267a4873k58379j9078A01895L3904h6361
18851d8762H9376A7427h7245b4894m110o6697L0877a6115C2289L13826a33719
18839A64604a76657e2049l37011a65878G8760b24430j92952G4752a56345c4925
18828D5251h4835B05956K19875e4611a7545r9542m308l86G3367a93321b5253E1487
$$ plain form
18908 25682 -204843 -97530 53147 -113137 136448 -45607 -26888 -124901 24113 9485 -244743
18896 -23196 -258775 -282486 -115142 80412 -129049 -411389 -2532 -76694 -193597 50373 250747
18885 250747 87494 88015 -427405 -18145 -288289 -87143 52268 -96072 235649 -20950 -238840
18874 -238840 34232 -157648 -258996 103283 245190 -104344 -273887 70143 46395 -264193
18863 -282 -5969 192041 84147 -142245 -316512 -14873 -273252 -292330 101895 135799 -86361
18851 -48762 89376 17427 -87245 -24894 -29004 -95701 -64824 -16115 32289 346115 -133719
18839 164604 -176657 -52049 -389060 -165878 78760 -224430 -417382 74752 -156345 -34925
18828 45251 -84835 205956 425831 -54611 -17545 -117087 -121395 -121781 73367 -193321 -25253 51487
18815f9035B3149O3071e20431A12379a06788k18671e7445j18972q1611a25272
18804b70323a8360k51118N9036a00079m4703l5830a8152j32273A11394h9144J8234
18793g0910A1162b22872A95715a44968A65617a63200A8641a73370D5127b71788
18782A41143a85899O400b8639l9711H33P675J33760b57311H9035b70977B78056
18770a82932e542C09696O51G4309f8905k7519B60954c63255G8049J12855a39936
18758C23119A13821h1717G903c40361d5369B7632j1990J07060J21840c92284a42764
18746b64626a19058F8213J99080b44502A96649a80849A57043F372J20853L80955
18736E08180C6399A469J31518a92106I4169b10646B31331b25819A04502d10679
$$ plain form
18815 -69035 23149 86220 -520431 112379 -106788 -325459 -57445 -176417 -258028 -125272
18804 -270323 -18360 -269478 -210442 -100079 -144782 -180612 -18152 -150425 111394 -89144 -70910
18793 -70910 11162 -222872 195715 -144968 165617 -163200 18641 -173370 45127 -271788
18782 141143 -185899 -179499 -28639 -68350 833 8508 142268 -257311 89035 -270977 278056
18770 -182932 -5542 309696 310347 74309 -68905 -96424 260954 -363255 78049 190904 -139936
18758 323119 113821 -81717 7903 -340361 -45369 27632 15642 122702 244542 -392284 -142764
18746 -264626 -119058 68213 267293 -244502 196649 -180849 157043 6372 127225 508180
18736 508180 36399 1469 132987 -192106 94169 -210646 231331 -225819 104502 -410679
18725b25250q1843a16691D9359b5364E2980J01192n2948M5520h1574G7507b6857
18713B27471f9575j04958M0524P149q1162l8020a08032M6263I3154J2413j7066
18702H8501a92092K905j52138d7740k60987g6490C6972b86108i9293F0784O9200
18691A29984E5383K43027i4087A0158L7940J8850c36212a43456A94969b69462
18680C0236c4727j6247j62443R5845G5225M9904B5534d10265l2249a3511I9277
18668B06861b37963j07704a64538F0809b171k38276F7958k9022a93680B12914
18657C00069j42342i3411F8573K19066I4614b00623c2058B25249j07821J5992
18647A33420G643J0835b65143a19035J1797j23728A09576J04801p9677a18354
$$ plain form
18725 -225250 -307093 -116691 49359 -25364 52980 154172 101224 146744 -81574 77507 -26857
18713 227471 -69575 -174533 -134009 -126860 -208022 -246042 -108032 -61769 93154 105567 88501
18702 88501 -192092 -189187 -341325 -47740 -308727 -76490 36972 -286108 -99293 60784 129984
18691 129984 55383 298410 -94087 10158 48098 66948 -336212 -143456 194969 -269462
18680 30236 -34727 -50974 -213417 -117572 75225 125129 25534 -410265 -442514 -13511 99277
18668 206861 -237963 -345667 -164538 60809 -2171 -240447 67958 38936 -193680 212914
18657 300069 157727 -93411 68573 287639 94614 -200623 -32058 225249 117428 133420
18647 133420 7643 18478 -265143 -119035 -107238 -230966 109576 214377 134700 -118354
18636B56863e4130H6828a96872C53646a57825C5403r723g9891o0332j69492h8365
18624A08334f702k21348d6352B47926a8266j41869j71694G7036i0206m39147A85818
18612A322K37326A0273M5590a02483M1578j22600j9340A41510g2640j1375I3199
18600b42259f9933A60227o3090k2075J8200D4047a44032A40681b02735K0173C59193
18588h2529J7270A16853i9598p3423A43531C8531K8159Q8301b7688o6272F4081
18576h6684p3863j44699h2181C24636b22335k76886A85275a50702a5726B7619
18565i2748L0597d858o1975k50872h3888C97344A8442a02161g605I4071f6834
18553g880j96752e2451C24802D2452b11042M6859B03493b37412e1464G4265M4038
$$ plain form
18636 256863 -54130 86828 -196872 353646 -157825 35403 25680 -79891 -140223 -309715 -88365
18624 108334 -6702 -228050 -46352 247926 -18266 -160135 -331829 77036 -90206 -529353 185818
18612 1322 238648 10273 55863 -102483 -60905 -183505 -202845 141510 -72640 -84015 93199
18600 -242259 -69933 160227 97137 75062 93262 44047 -144032 140681 -202735 -182562 359193
18588 -82529 -65259 116853 -99598 -173021 143531 38531 66690 154991 -27688 -93960 64081
18576 -86684 -160547 -305246 -82181 324636 -222335 -499221 185275 -150702 -15726 27619
18565 -92748 -62151 -4858 -66833 -317705 -83888 397344 18442 -102161 -7605 94071 -66834
18553 -7880 -204632 -52451 324802 42452 -211042 -164183 203493 -237412 -51464 74265 118303
18542A18303h9924j02149m7342M3569h2851l50989e4453F9660a79695j31380J51091
18531a59984j05008B52319B2665b93818h6420A82493b88047N0694Q3001B3902
18520d11176C01037b5591j88175m28100a25766o7816G933K62579c2381j45591
18510a77972l0197j7423A55389B0748a20948j75235a12972A89826a67701G5341
18499B29531J98509a29714A02357A5532O5762a79163A40219E7500e1011C54279
18488b67998a3069r6113C04619b60356e6773B40155c1294A20478B5688b31130
18477a50014d4986I3166m3071M8466c1913n2122C421e6687l27921b6365F7118
18465A9161N5171H509J02408a06022m6090j49941J50384A12047b21015a07935
$$ plain form
18542 118303 -89924 -192073 -239415 -195846 -82851 -433840 -54453 69660 -179695 -311075 -159984
18531 -159984 -264992 252319 22665 -293818 -86420 182493 -288047 -237353 -154352 23902
18520 -411176 301037 -25591 -213766 -641866 -125766 -193582 7933 270512 -32381 -177972
18510 -177972 -208169 -225592 155389 20748 -120948 -296183 -112972 189826 -167701 75341
18499 229531 428040 -129714 102357 15532 81294 -179163 140219 57500 -51011 354279
18488 -267998 -13069 -109182 304619 -260356 -56773 240155 -31294 120478 25688 -231130
18477 -150014 -44986 93166 50095 98561 -31913 -84035 3421 -56687 -384608 -26365 67118
18465 19161 74332 8509 110917 -106022 -152112 -302053 -151669 112047 -221015 -107935
18454i9377j9367c2120j9550j84290A9782D906J33364d02850G5952B3346a2186
18442A49092B7563a40948p7242A52848a10198L0523B59659b03423G700K99770
18432C07470A13156Q8978b03665F478h9386E8536K695b14712O6014E5271e6064
18420a1910r4085A47190L8377p3462K73546A708c881B63474A5806e1803j07815
18409a59618K3765G0483b28753D69838c56913f5304I8966G991c3394F8368B1510
18397B13755F7099b22232j9119d8915I1395R3189b4169A9030C94Q0823b89170
18385a99489A17825d1980j08133M073m0958Q4721b1969k21178Q7174A43426b03415
18373c84630a78667A38104a32121C7556L6312k6697c16971a53482N1221A18023
$$ plain form
18454 -99377 -118744 -32120 -51670 -235960 19782 4906 138270 -402850 75952 23346 -12186
18442 149092 27563 -140948 -218190 152848 -110198 -79675 259659 -203423 7700 307470
18432 307470 113156 202134 -203665 6478 -89386 58536 61231 -214712 -148698 55271 -56064
18420 -11910 -105995 147190 185567 112105 385651 1708 -3881 263474 15806 -51803 -159618
18409 -159618 -135853 70483 -228753 469838 -356913 -65304 98966 7991 -33394 68368 21510
18397 213755 67099 -222232 -241351 -48915 91395 184584 -24169 19030 394 81217 -289170
18385 -199489 117825 -41980 -150113 -146040 -186998 -102277 -21969 -243147 -155973 143426 -203415
18373 -384630 -178667 138104 -132121 37556 73868 47171 -316971 -153482 -102261 118023
18362a59157c2666B8965a47719j49353g0096B25580g4827k935p4502n6486O2294
18351a46456j15153o6217I762J94400r7346a42380F6754R8420a02742c3178k5062
18340e8240m12830a70638j39555B25320a60303M8699a4826k07012e6532C6080
18329C32606b90524A55957c47809b2968E6922g0516m9403r8033B48654A23102
18318d5134E4872b73112a12018A59427p8397b53517j14953a27284A05533A4952
18307A33153a48152j30932B31582A09894e6210H4387b83406Q5454l3772L3904
18297a97820k3471c4616l28580f7071j57686b3011p2709j52550B25183G3807a08657
18285b15769I208M04768h5501a8383o8908A18389B697a32279M8934b2389A38664
$$ plain form
18362 -159157 -32666 28965 -147719 -297072 -70096 225580 -74827 -77762 -152264 -208750 -146456
18351 -146456 -261609 -327826 9762 204162 106816 -142380 66754 165174 -102742 -33178 -58240
18340 -58240 -471070 -170638 -310193 225320 -160303 -111604 -14826 -221838 -56532 36080
18329 332606 -290524 155957 -347809 -22968 56922 -70516 -119919 -217952 248654 123102
18318 -45134 54872 -273112 -112018 159427 81030 -253517 -368470 -127284 105533 14952
18307 133153 -148152 -279084 231582 109894 -56210 84387 -283406 -197952 -231724 -197820
18297 -197820 -221291 -34616 -363196 -67071 -224757 -23011 -95720 -248270 225183 73807 -108657
18285 -215769 9208 413976 -85501 -18383 -87291 118389 2697 -132279 -83345 -22389 138664
18273a63966j55009C532a21786A18359q946c23522b821k65081A51804E61a59409
18261a82760G4507b310p6791j31015B86910D8569b99264M485J25705M650L181
18250a61243b1526H2076g399j51030b2467r4235B22036a83412C4302a19938D7373
18238A8034J91021q6246J86557h8669E5239R679a69942H0264b36124F4242P2210
18227A36452A0255a55543F157J48793D1261K1440J58609f5620i303B02036C1706
18215a84080A66783a0358m1810Q086A1812c472j16468A66919a9514j02716B30765
18203c45202B03419b02538N7713h276D3911N3801e7749E15a53313L8765m4629
18192a59177I5996P220a98189A59434b09006d69A34572C9703f2826A7317c52106
$$ plain form
18273 -163966 -318975 3532 -121786 118359 109413 -323522 -2821 -267902 151804 561 -159409
18261 -182760 74507 -2310 -79101 -210116 286910 48569 -299264 -294779 -169074 -164424 -161243
18250 -161243 -21526 82076 -7399 -158429 -22467 -116702 222036 -183412 34302 -119938 47373
18238 18034 209055 122809 309366 -88669 55239 64918 -169942 80264 -236124 64242 136452
18227 136452 10255 -155543 6157 154950 41261 62701 221310 -65620 -9303 202036 31706
18215 -184080 166783 -10358 -52168 -44082 11812 -3472 -119940 166919 -19514 -122230 230765
18203 -345202 203419 -202538 -144825 -8276 43911 97712 -57749 515 -153313 -114548 -159177
18192 -159177 95996 103216 -198189 159434 -209006 -469 134572 39703 -62826 17317 -352106
18180A00788a68459F8016N6029i6873j66236A8807R8924a76692r142A71197c44754
18168e25766a68441C36012a43274E04000b9159B88571b43288j71765E153h9233
18157D22649b09827E4975P0074d11061A01505g230k5813k34970C2427b31843A74539
18145a75421j7603O8781e682I5603i9237D1796b23732B68518i1034n9720L4826
18134a15928A78022d30265J78435B22376a35100L3913B38095a2844k4068l30035
18124c66947B92900b21845f9488r9909r4417R8725q4702G6437j0919b4424F7829
18112i4484o1567A38068h4109B13609g5931j38334g8318A68235b691A26607i0852
18100C40829r2684e7222i069j22808k39691G0365J47783a36516G0616a59740g2844
$$ plain form
18180 100788 -168459 68016 124045 -96873 -263109 18807 117731 -176692 -185834 171197 -344754
18168 -525766 -168441 336012 -143274 504000 -29159 288571 -243288 -415053 5153 -89233
18157 422649 -209827 54975 125049 -411061 101505 -7230 -33043 -268013 32427 -231843 174539
18145 -175421 -193024 -124243 -5682 95603 -99237 41796 -223732 268518 -91034 -150754 -115928
18134 -115928 178022 -430265 -251830 222376 -135100 -101187 238095 -12844 -36912 -366947
18124 -366947 292900 -221845 -69488 -169397 -263814 -165089 -249791 76437 65518 -24424 67829
18112 -94484 -156051 138068 -84109 213609 -75931 -214265 -78318 168235 -2691 126607 -90852
18100 340829 248145 -57222 -9069 -131877 -371568 70365 218148 -136516 70616 -159740 -72844
18088c1590C03022b98057B15172E2094e3708k06834Q1067A2990e240k1177l8367
18077f4784B2476a60226f1279j11240A86994c45771i3392l13515a96203l8162
18067b34365l1204b335A46796D3742b18916A01504N3526b04022B45579i0849J1543
18056g9306r330n1660L3077m40824F2455a61965b8583p9783B26471f1679q6348
18045a48027A137K8953a832p3138c2521j66652E6498L16933B3746J38515f0939
18033A27125o1510c71980O4726L3915A44621j0888b68367K5855B87200a00404
18022E1162k3799a20217N5854n1526k12550M5479f7229E277a87888M6427k7472
18011a68933m42120i2086A3026L8133b3195A51401i5548G588f8529a978H2925
$$ plain form
18088 -31590 303022 -298057 215172 52094 -53708 -260542 -179475 12990 -5240 -26417 -64784
18077 -64784 22476 -160226 -61279 -172519 186994 -345771 -93392 -406907 -196203 -234365
18067 -234365 -265569 -2335 146796 43742 -218916 101504 155030 -204022 245579 -90849 -79306
18056 -79306 -88636 -140296 -107219 -548043 62455 -161965 -28583 -108366 226471 -61679 -148027
18045 -148027 1137 30090 -1832 -74970 -32521 -199173 56498 373431 23746 162261 -60939
18033 127125 65615 -371980 -307254 -273339 144621 133733 -268367 -242512 287200 -100404
18022 51162 27363 -120217 -64363 -115889 -328439 -282960 -67229 5277 -187888 -141461 -168933
18011 -168933 -611053 -92086 13026 51159 -23195 151401 -95548 7588 -68529 -1978 82925
17999a95678e2710j95517M5827c1432J1044r5159D1296J5225h5622a1287B9240
17987d44951f9773o8012l50438G7056b5156l03374J39745A39663a01059b4977
17976a95545g4635B7997b31929o9703B5622a09208I1073a65525M7219q1671L4590
17965a65387n9566l4122A57742n3883a96869A73835a61764k16006a38402A45040
17954i5721A35345a67347H7844j4773a95524m742b1920m25561A16650b48268f6108
17942c71306A41363a16771F671L82668A90694c90069a79966C54019b39419C22623
17931D30512C9249P0553d7250j51918e0271A4197a29713E4226c5267k46723b8429
17919a49696c4053C7360a64470O0380a1701A40485a49698j79039l0276E155b82572
$$ plain form
17999 -195678 -52710 -248227 -202400 -31432 -20388 -115547 41296 56521 -85622 -11287 29240
17987 -444951 -69773 -137785 -488223 77056 -25156 -328530 -188785 139663 -101059 -24977
17976 -195545 -74635 27997 -231929 -301632 25622 -109208 91073 -165525 -118306 -199977 -165387
17965 -165387 -224953 -259075 157742 103859 -196869 173835 -161764 -377770 -138402 145040
17954 -95721 135345 -167347 87844 73071 -195524 -200266 -21920 -447481 116650 -248268 -66108
17942 -371306 141363 -116771 6671 389339 190694 -390069 -179966 354019 -239419 322623
17931 430512 39249 109802 -47250 -199168 -50271 14197 -129713 54226 -35267 -281990 -28429
17919 -149696 -34053 37360 -164470 -104090 -11701 140485 -149698 -328737 -359013 5155 -282572
17907C74652A67880B3215J0187R5089E404f9564n9952D07705b17992q6820a13381
17895a28721j86408B26088G5148c1878E0975e8856c40p2493a101j61316A13737
17883e1004p2247A72273b46971a1328B05859i4647k25277C66694a98827B62880
17872a48990C1143K3663a0598n1016E0149a39698A32164j0334b05812A08805d15136
17860b11991O1326A29699B1802c28071A92661E9904A1577P4572C1099J96826I9040
17848A9201K11582j14098a9719k57332O1067g785B28005D5947a89287B20190n0302
17837A69888a17343k48481J29742B36778A5355J07504L3072D1517O7883a58141
17826b97452A36346a13654A4885b44336C90534C837i5478B76253a56453m7126
$$ plain form
17907 374652 167880 23215 33402 128491 5404 -69564 -129516 407705 -217992 -304812 -113381
17895 -128721 -315129 226088 75148 -31878 50975 -58856 -340 -72833 -1101 -162417 113737
17883 -51004 -123251 172273 -246971 -11328 205859 -94647 -319924 366694 -198827 262880
17872 -148990 31143 54806 -10598 -61614 50149 -139698 132164 121830 -205812 108805 -415136
17860 -211991 -150665 129699 21802 -328071 192661 59904 11577 86149 31099 227925 99040
17848 19201 230783 116685 -19719 -277051 -215984 -7785 228005 45947 -189287 220190 169888
17837 169888 -117343 -365824 -236082 236778 15355 122859 155931 41517 109400 -158141
17826 -297452 136346 -113654 14885 -244336 390534 3837 -95478 276253 -156453 -203579
17816b03579A5405d14607A54282F5738b85386F213J85884e6622f917j04564r1799
17805b03280H082a79257j13189J31722B7442c66684A99363a68071h0915j43218
17795b24133A32401Q7622b88702a00025k8983b5403p3003j139A50296a42528A26585
17783B47072r0002l2520K63122A76727b06959I7658K83172f7775m5302j32811
17773b45888F7210a47707j89213a29370D5672a44812k07016j0333J44435e3720
17762b59911B58791B0609a41175F0599L08924A24358i9698B52498a15541A53506
17751C741K62938r5801a19442A99353D1839b79738A59104j6120h9396m891n9665
17740a53952j88286A74022a4847D8783J33662c5517N902j49863P8164B62859A21894
$$ plain form
17816 -203579 15405 -414607 154282 65738 -285386 6213 192097 -56622 -6917 -111481 -203280
17805 -203280 8082 -179257 -292446 -160724 27442 -366684 199363 -168071 -80915 -224133
17795 -224133 132401 220023 -288702 -100025 -129008 -25403 -98406 -99545 150296 -142528 126585
17783 247072 157070 124550 387672 176727 -206959 97658 380830 -67775 -113077 -245888
17773 -245888 67210 -147707 -336920 -129370 45672 -144812 -351828 -362161 -217726 -53720
17762 -259911 258791 20609 -141175 60599 369523 124358 -99698 252498 -115541 153506
17751 3741 266679 170878 -119442 199353 41839 -279738 159104 142984 -89396 -94287 -153952
17740 -153952 -342238 174022 -14847 48783 182445 -35517 -29615 -179478 -101314 262859 121894
17728H050K72995b37348B1306f1775j12256A71809a42516g0055j60329A21760
17717c71758b5652j68552C461b75894J12283A93263C8502a14187J062j9426B66652
17705e41907K07898a08585f524B37260C807b61900c3040L434h194A2059b3454
17693F9903a02654A83839d44978a94858g1389p0625A08413e52685K63029f4145
17682E718J14261J32013a54820A09624j7b23890K497A83891f070j31278p8348
17671b15696a2705m6659G500b27753M6360B44990E1583Q9731O9673q5045g3903
17659H5290a3095C8561c30692A43962b08586N0206a6979E8421a28414E6372L8520
17648I4892d49830b04809P4025J4618D20815a77833B75074I2919a31781a4253
$$ plain form
17728 8050 281045 -237348 21306 -61775 -174031 171809 -142516 -70055 -230384 121760
17717 -371758 -25652 -194204 3461 -275894 -163611 193263 38502 -114187 -113125 -132551 266652
17705 -541907 -334009 -108585 -6524 237260 3807 -261900 -33040 -29606 -8194 12059 -23454
17693 69903 -102654 183839 -444978 -194858 -71389 -142014 108413 -552685 -289656 -64145
17682 5718 119979 251992 -154820 109624 109607 -223890 -221393 183891 -6070 -137348 -215696
17671 -215696 -12705 -59364 7500 -227753 -181393 244990 51583 141314 210987 125942 -73903
17659 85290 -13095 38561 -330692 143962 -208586 -158380 -16979 58421 -128414 56372 94892
17648 94892 -449830 -204809 -130784 -116166 420815 -177833 275074 92919 -131781 -14253
17637A6406a82752B83815a16967N5535k5014A31870b99440a44072l0981a7361
17626a99980j21457a19181c3898k08808O1321B44280a25942k83457J56372L3960
17616b19067A34357m1783g1093j11192B922a61045q3002a0757j77431C2737K225
17605C4962h6691B4157f5732q2562K7119G3458p31e91292b79493A42043d6998
17593f3387G8548a26186B48232D4066e58224b24456A67628E1645a25866A14391
17582A00126g9215G6503j5684a7027A98832K1779I79J86955b78363a16159j37240
17571b53399k10893a3601k09097C4213c20933D4000b86291A0630a5207p5645E5898
17559A55561b64171A13479a40392j11289m5514A73437a5920B13490a27122B7002
$$ plain form
17637 16406 -182752 283815 -116967 -61432 -86446 131870 -299440 -144072 -175053 -17361
17626 -199980 -321437 -119181 -33898 -242706 -181385 244280 -125942 -409399 -253027 -219067
17616 -219067 134357 92574 -71093 -182285 2922 -161045 -244047 -10757 -188188 32737 34962
17605 34962 -86691 24157 -65732 -148294 -121175 73458 72727 -591292 -279493 142043 -46998
17593 -63387 78548 -126186 248232 44066 -558224 -224456 167628 51645 -125866 114391
17582 100126 -79215 76503 60819 -17027 198832 220611 979 187934 -278363 -116159 -253399
17571 -253399 -464292 -13601 -222698 34213 -320933 44000 -286291 10630 -15207 -90852 55898
17559 155561 -264171 113479 -140392 -251681 -297195 173437 -15920 213490 -127122 27002
17548e6971D1317b52782A89525F8681R366L32848g5359k8188j40378Q4819M9457
17537a09649F982O8238g8599I6206J09485M914b42714B41508J17657a66025e8025
17525C55977d9166A8544E523a42677j30120D1138p318f6257j84577h3995j44835
17514b28830D0981a25902D67104b0251A95639F9383c17717e2256C01750E2540
17503D4420K6712L4734a08984j4536o8607C09485D3127J40840H8955L6803m4816
17492H0942M6527J6669m2174D8952a40873m3138A04477J20679D3566J2937Q4850
17481A41353b82412d4480k42483A5322a66832A7164L6985a62210d9512k68570
17471c18082a41960C26229j56993n2265b51589c6075k9786A2244a05907B2788
$$ plain form
17548 -56971 41317 -252782 189525 68681 78047 410895 -75359 -103547 -243925 -159106 -109649
17537 -109649 6982 75220 -78599 96206 205691 210605 -242714 241508 359165 -166025 -58025
17525 355977 -49166 18544 5523 -142677 -272797 41138 33820 -66257 -250834 -83995 -228830
17514 -228830 40981 -125902 467104 -20251 195639 69383 -317717 -52256 301750 52540
17503 44420 71132 105866 -108984 -123520 -192127 309485 43127 183967 88955 125758 80942
17492 80942 127469 144138 101964 48952 -140873 -184011 104477 225156 43566 56503 141353
17481 141353 -282412 -44480 -286963 15322 -166832 17164 54149 -162210 -49512 -318082
17471 -318082 -141960 326229 169236 116971 -251589 -36075 -65861 12244 -105907 22788
17460A55849h7375k11671A17299a9292k7054B051b33729a1457A13523b81667C36673
17448E8824O3746c5082M856A35475e787E3368b82564g065A71778E5684b49278
17436C35441p8072q200n4732J49796a59062L3284M8761F3292M3416i5959n0272
17425a46231B2660a0669k62287F5594b93978J39868q8680E4422J11136b22033
17414B7147a22174A014a48194k16107A94305p6266h5739C7557K61778a61950A49600
17402a36039k11506B42935B3628h4631E3955O0795J35468a51432k4460A79261
17391A78810G3705o167b5708H9325b6789k20194P1892C6019J16139b05061b7256
17379A39504d1128j84488F2560b23579b3731r6541K0079c8067A85028a33103o54
$$ plain form
17460 155849 -87375 -299046 117299 -19292 -46346 2051 -233729 -11457 113523 -281667 336673
17448 58824 122570 -35082 -30226 135475 -5787 53368 -282564 -7065 171778 55684 -249278
17436 335441 257369 249169 194437 344233 -159062 -125778 -77017 63292 106708 -95959 -146231
17425 -146231 22660 -10669 -272956 65594 -293978 -154110 -242790 54422 165558 -222033
17414 27147 -122174 1014 -148194 -364301 194305 118039 -85739 37557 299335 -161950 149600
17402 -136039 -347545 242935 23628 -84631 53955 114750 250218 -151432 -175892 179261
17391 178810 73705 67538 -25708 89325 -26789 -246983 -175091 36019 152158 -205061 -27256
17379 139504 -41128 -225616 62560 -223579 -23731 -120272 -100193 -38067 185028 -133103 -133757
17368a33757K9792J2491A10648f7647r7665p4533n3713A24277g3580J4604K585
17357e6391a1457D6753a2053j35181d1846k22444G9514K1241A1765R1546K0709
17346A24020a52181j06732B18909b9153j20422F5211d06631a48310a7369k47487
17336b64856J21837a4532j26901B6933a15770A93091l211p5367J25480A15263
17325F1916N3914b58584d5981C34567F5871J3089c4200o4934C97653E9353J53817
17314B13170a70290C29216g0743L2023j18026K3304m6296C1656J70113h0625J950
17303g8675j11951j6749I3063B5992a59321d8055H5848a29924F1424f3481n5895
17292a19376k10201F572R2645c0894k48898i8030K8396g402l71439J71842A1312
$$ plain form
17368 -133757 -103965 -91474 110648 -67647 -165312 -239845 -293558 124277 -73580 -58976 -56391
17357 -56391 -11457 46753 -12053 -147234 -41846 -264290 79514 100755 11765 103311 124020
17346 124020 -152181 -258913 218909 -29153 -149575 65211 -406631 -148310 -17369 -264856
17336 -264856 -143019 -14532 -141433 26933 -115770 193091 189880 114513 239993 115263
17325 61916 115830 -258584 -45981 334567 65871 78960 -34200 -99134 397653 59353 213170
17314 213170 -170290 329216 -70743 -38720 -156746 -133442 -179738 31656 201769 -80625 -78675
17303 -78675 -190626 -207375 93063 25992 -159321 -48055 85848 -129924 61424 -63481 -119376
17292 -119376 -329577 6572 99217 -30894 -279792 -98030 -69634 -7402 -378841 -206999 11312
17280c00736O8643G1179J27355I6814b76004B52815o5070D4883a95624A70671
17269C43132H6511g1441o2857A89249m4157c33030A01623a29134B62432p4563
17259A87869J18610f4292I5262b61995I2139C0759K067P2189b70359J35099J5846
17248a19414a7045E3980D195a94894J370E2024b11025a03311n5472E6860K92984
17237C49844a51928j5296G2158k9755a68540Q3507H2795N6328a09072B46241b5448
17225a03734H584L4166K90682h347E0959K69850q1574L5877h7637k5038J7930
17214i4745b6093j55549M8350B25291a73257B6413L1866g9853c4576p0168k8964
17203a33708j56248A00306e6361b680I3285K47211c41609F7801b78812j01424
$$ plain form
17280 -300736 -232093 71179 198534 96814 -276004 252815 187745 44883 -195624 170671
17269 343132 86511 -71441 -134298 189249 145092 -333030 101623 -129134 262432 187869
17259 187869 306479 -64292 95262 -261995 92139 30759 32826 105015 -270359 -135260 -119414
17248 -119414 -17045 53980 4195 -194894 -193524 52024 -211025 -103311 -158783 56860 349844
17237 349844 -151928 -167224 72158 42403 -168540 -85033 82795 139123 -109072 246241 -25448
17225 -103734 8584 42750 333432 -8347 50959 320809 239235 275112 -87637 -112675 -94745
17214 -94745 -26093 -181642 -133292 225291 -173257 26413 58279 -79853 -34576 -104744 -133708
17203 -133708 -289956 100306 -56361 -2680 93285 340496 -341609 67801 -278812 -380236
17193c80236A14442J43916a28562B6626K886K19707b01691k83862J25905F9032
17182i0907p0923c831H1308Q5778a30255k02478C4085d7411l4902c4984P023j14804
17170a42765D51432A53650a98280B10147A9998O3793a95586A23079a52311c6546
17159f3611b5242I6410m8074c03858F9843M152c95102a21999K6866A36063j4879
17148A21184M1492b461A83003O923a5278H2879J4835a10391B33291b45693f6018
17136c07826C15966j56098g3439F3531K12462a06660A1841K17722e1638k4653
17126g6291A02393g6107b557B06060a46841r2429B2233f3491n9001e5488K4143
17115c1345B16601a07037C9117J18581i6694B73318c8773k9990r5579A25372a61286
$$ plain form
17193 -380236 114442 258358 -128562 26626 29512 249219 -201691 -485553 -359648 69032
17182 -90907 -161830 -3831 81308 167086 -130255 -332733 34085 -47411 -82313 -34984 -27961 -142765
17170 -142765 451432 153650 -198280 210147 19998 83791 -195586 123079 -152311 -36546
17159 -63611 -25242 96410 48336 -303858 69843 73995 -395102 -121999 -95133 136063 121184
17148 121184 162676 -2461 183003 189926 -15278 82879 97714 -110391 233291 -245693 -66018
17136 -307826 315966 159868 -73439 63531 275993 -106660 11841 229563 -51638 -76291
17126 -76291 102393 -76107 -2557 206060 -146841 -239270 22233 -63491 -122492 -55488 -31345
17115 -31345 216601 -107037 39117 157698 -96694 273318 -38773 -68763 -164342 125372 -161286
17103A03083f1616m05044e006I6645g8217j42268I1461a05534A26395o814b79011
17091b29307D57864A72294L6441l589i4589I8516b54333H4258P6493b94461A7989
17079A88106d7682J4852F6517b30505A25121a42055d2183j85668i090o4936H9176
17067a27575B10036c84603a17749B22976a43576C51075h2543H7673a30700j28284
17057b58984A23158J0321D7119J764b35923Q931A11535b20992D30980b43446A30115
17045b62501G9074J72869D2195c8028k0161A07142l8245L22563A7200f4103k09551
17034b73654K2083J18469C45020A56721c8196n9031C45597b83975k0226A98929
17023A10690d972B79100a33314j40986B4853b69326Q7101b837k83860a18138j1765
$$ plain form
17103 103083 -61616 -466660 -5006 96645 -78217 -220485 91461 -105534 126395 119581 -279011
17091 -229307 457864 172294 208735 205146 -94589 98516 -254333 84258 160751 -294461 17989
17079 188106 -47682 -32830 66517 -230505 125121 -142055 -42183 -227851 -9090 -74026 89176
17067 -127575 210036 -384603 -117749 222976 -143576 351075 -82543 87673 -130700 -258984
17057 -258984 123158 133479 47119 48883 -235923 -226992 111535 -220992 430980 -243446 130115
17045 -262501 79074 251943 42195 -38028 -58189 107142 68897 391460 17200 -64103 -273654
17034 -273654 -251571 -133102 345020 156721 -38196 -97227 345597 -283975 -304201 198929
17023 110690 -4972 279100 -133314 -274300 24853 -269326 -182225 -2837 -286697 -118138 -129903
17012a29903j00163i8308K3372A29912f5237i027l01820f344A82021J91715b26239
17000A08113a69300k1165C10286G9599g9463K835g485j05013E3813K8761b8012
16988H0287a72061O5097m9574J5316G1516b19109A64684n8439N4988D4823b35069
16976c01630f2061B28508g3484m051D30111A06435c94770B6550b8709p4866A56558
16964B25791K55978j74719o1629G2343a42663O2872p1358H3222C0632a59788O3855
16953i5933L7399n3705B72041f0836j918B7729b75097A02506a11222C07873E2101
16941a10900N0597A46637a0474A34616f7272j25771e022j4620j58754o4053A39770
16929e6541B41925g9223G7417A0268J1943M8882e2193j40735A06206A1777J87794
$$ plain form
17012 -129903 -230066 -98308 -74936 129912 -65237 -9027 -310847 -6344 182021 373736 -226239
17000 108113 -169300 -190465 310286 79599 -79463 -76628 -7485 -112498 53813 82574 -28012
16988 80287 -172061 -106964 -156538 -141222 71516 -219109 164684 106245 161233 44823 -235069
16976 -301630 -62061 228508 -73484 -77535 430111 106435 -394770 26550 -28709 -103575 156558
16964 225791 481769 307050 245421 72343 -142663 -79791 -151149 83222 30632 -159788 -95933
16953 -95933 -58534 -112239 272041 -60836 -62754 27729 -275097 102506 -111222 307873 52101
16941 -110900 -60303 146637 -10474 134616 -67272 -193043 -5022 -19642 -178396 -242449 139770
16929 -56541 241925 -79223 77417 10268 22211 71093 -52193 -192928 106206 11777 199571
16918A99571E5654J98338H1058j7002J54244B9574b44792A29459j6387m4131R5385
16907A64326G7005a3958k3635A36157J50210q1573a40375G0491A2762M4968b30163
16895f8827N154A72723G9925J3541J35329b62066J1036i0763j49160A43174b10652
16883a86989a0192H7254K40628f1679r0488F741c16476a36945A14568a4899A15121
16871b4560F0497a70771O0429k62357A44497K36401j35603a60965F6867p361a85263
16859G8961L06558a62079K7516N1928A18475i9522C0302i5076j71701Q7174Q3240
16848i6363G2622a04196A46852a89776O0285J1580b0625j17348B15864a28109
16837B84171D3235f4203a1986A73567m7157f7846B43825a49659j48260A79191
$$ plain form
16918 199571 55654 253992 81058 64056 218300 29574 -244792 129459 113072 68941 164326
16907 164326 77005 -13958 -37593 136157 286367 204794 -140375 70491 12762 57730 -230163
16895 -68827 -63673 172723 79925 93466 228795 -262066 -251030 -90763 -239923 143174 -210652
16883 -186989 -10192 87254 327882 -61679 -152167 6741 -316476 -136945 114568 -14899 115121
16871 -24560 60497 -170771 -110342 -372699 144497 380898 245295 -160965 66867 59506 -185263
16859 78961 385519 -162079 -134563 -82635 118475 -99522 30302 -95076 -266777 -179603 -96363
16848 -96363 72622 -104196 146852 -189776 -129491 -117911 -20625 -137973 215864 -128109
16837 284171 43235 -64203 -11986 173567 126410 -67846 243825 -149659 -297919 179191
16826b2330G861b39944a02605K4143j01429m0342F8700L1269e1018A12275b60223
16814i3222k25473O9205K2713A70592h9139A0249J16097b718C8207a63800G2953
16802B11173a32322c6522n6091l2364A85395i8380G0783b92210D764P155e089
16790C91319e4214D9416a07890A01842b5693I5574J68180a48601p7413Q2273o2221
16779b05962C69317E2147g4038B91748A03505N5672d8429j29209A75131c3817
16768C2217J43602C3154b3835B7921a45919c942E9773a21931D0831J8750g4764
16756A37911i6146f707l89667J92948A52796b56816a12704B68812B6323K88781
16746C15104E7730A1502J41276k3463a27013E040a23263A50490a32905D4383O5286
$$ plain form
16826 -22330 7861 -239944 -102605 -78462 -179891 -220233 68700 99969 -51018 112275 -260223
16814 -93222 -318695 -249490 -226777 170592 -89139 10249 126346 -2718 38207 -163800 72953
16802 211173 -132322 -36522 -92613 -124977 185395 -98380 70783 -292210 4764 11919 -5089
16790 391319 -54214 49416 -107890 101842 -25693 95574 263754 -148601 -226014 -143741 -205962
16779 -205962 369317 52147 -74038 291748 103505 159177 -48429 -177638 175131 -33817
16768 32217 175819 33154 -23835 27921 -145919 -3942 59773 -121931 40831 59581 -74764
16756 137911 -96146 -6707 -396374 -203426 152796 -256816 -112704 268812 26323 315104
16746 315104 57730 11502 152778 129315 -127013 5040 -123263 150490 -132905 44383 109669
16735A09669M5864b49476j64580B06991p2473m2514k9176N494c5390p1244B10533
16723A31373k4071b50182o939C61954a61353o825Q1117k91757c8924E4985F325
16711A1059J59354b35762B37775b6106B46787c0872B28268d11606a24866F9349
16700F3892b9920B77929j30081c06616A63991a46144B11310q5250m9269K02788
16690B79579e2463j2440C4629a46426B68595K05169c3801B74210P5900A54444
16679A7798K42736p7963a47367c2717C04651E8712J76470A1395K78584a7830P649
16668a0181B23090c4141A45945D548K5333c9426m5738B24318f1940A86974l9819
16657A47155b595m3601C00329A23697C8117a70259C10979b5458l8946K8754J6578
$$ plain form
16735 109669 155533 -249476 -414056 206991 134518 92004 62828 68322 -35390 -106634 210533
16723 131373 107302 -250182 -257121 361954 -161353 -168178 -87061 -378818 -38924 54985 6325
16711 11059 170413 -235762 237775 -26106 246787 -30872 228268 -411606 -124866 69349
16700 63892 -29920 277929 147848 -306616 163991 -146144 211310 126060 76791 279579
16690 279579 -52463 -64903 34629 -146426 268595 473764 -33801 274210 350110 154444
16679 17798 260534 182571 -147367 -32717 304651 58712 235182 11395 289979 -17830 -10181
16668 -10181 223090 -34141 145945 4548 29881 -39426 -85164 224318 -61940 186974 147155
16657 147155 -2595 -46196 300329 123697 38117 -170259 310979 -25458 -64404 -35650 -19072
16646a9072A78265P7351G606a40733A7669M25494j27368j15705f0616B67894a14259
16634A26263B1023J96421h3908B4605J50598c1216B06205C9173b22748N683F0412
16622A80834d6494q0914A56217b93935J46930B3569L6344j8284c55586a01256
16611B5872L6014c9746F3655e6567B46214e5123j92046D9392b51616E6252J63757
16600B20009n1645F8033R2719p6383R2079L4900A4990h6590g631b469B8884a85808
16587g2855k00705A63706b46399A38363a85360B2096H929J42649m1428J7163a37976
16575c8928l68392A6637K10508J85688A40596L907J67006h0022l3504B4026L4274
16564E8300i4806C19594d6788O251B4301g8644n56688C93610A50729F0713J23837
$$ plain form
16646 -19072 178265 255616 7606 -140733 17669 443163 315795 200090 -60616 267894 -114259
16634 126263 21023 217444 -83908 24605 175203 -31216 206205 39173 -222748 -217065 60412
16622 180834 -46494 -127408 156217 -293935 -147005 23569 59913 41629 -355586 -101256
16611 25872 61886 -39746 63655 -56567 246214 -55123 -247169 49392 -251616 56252 220009
16600 220009 168364 68033 160752 84369 176448 211348 14990 -86590 -7631 -2469 28884 -185808
16587 -72855 -273560 163706 -246399 138363 -185360 22096 8929 151578 110150 127313 -137976
16575 -38928 -407320 16637 227145 412833 140596 144503 311509 -80022 -113526 24026 58300
16564 58300 -94806 319594 -46788 -40537 24301 -78644 -635332 393610 150729 60713 184550
16553A84550A2356J12340f4940j35769E127a92996i5619k58137B07010L519g130
16541C1842J50732b46624B3966a01803B83420d2519j75870h7015I373f2745A97223
16529a39199C3712d13793a22564e7949A29226b07282R6246I669c7765D2403J46552
16518A88955A22O7231A3231k513J57735c7034A39156m7293b58781J27144j89487
16507c21124C42388A15535e3110A75005H628e820A50922g561A95916a14414d0444
16495i4653A49015a36134n1996Q3006c1624A77217R2516b0883H0914C9493h9822
16483A38778R2601e8882F3046J07423D3102M0343k8276b55644C70389A68682J99312
16472C67994g1916C5353b66914A53738d33565C65515a17408A23522D0279c10429
$$ plain form
16553 184550 12356 124696 -64940 -200709 5127 -192996 -95619 -353756 207010 210529 -7130
16541 31842 182574 -246624 23966 -101803 283420 -42519 -218389 -87015 9373 -62745 197223
16529 -139199 33712 -413793 -122564 -57949 129226 -207282 -111036 9669 -37765 42403 188955
16518 188955 122 67353 13231 10718 168453 -37034 139156 91863 -258781 -131637 -321124
16507 -321124 342388 115535 -53110 175005 8628 -5820 150922 -7561 195916 -114414 -40444
16495 -94653 149015 -136134 -188130 -105124 -31624 177217 269733 -20883 80914 39493 -89822
16483 138778 231379 -58882 63046 170469 43102 83445 55169 -255644 370389 168682 367994
16472 367994 -71916 35353 -266914 153738 -433565 365515 -117408 123522 40279 -310429
16461I8411d3665A09223i0784B08335R675I0758K82044G4232c6929a3012k65050
16450b78062B40188l2007K24815j51226A15930a54684c6908E3037R0172b59818
16439B65070j22977b57461k7681B56864a83837C59544A28210a34407B34626e9688
16428C26983D2074f1633C23202A2859i920k4618k13448B12307a82835a1595C37482
16416E9273J91845a69507G0870J0130O6154h4318B70861F2628a24335D88466q4338
16405D04128a9518B38587a68k20473M4643L7298G1086e9057k5730C14835o8306
16394B46529f3062o814H3945J53962J45606d6057A14304b90200h8135B24801i5644
16382b55739F6824J62463j00275J27806B4034P817d7444G2468a68846r3186A09773
$$ plain form
16461 98411 -43665 109223 -90784 208335 218010 90758 372802 74232 -36929 -13012 -278062
16450 -278062 240188 208181 432996 281770 115930 -154684 -36908 53037 143209 -259818
16439 265070 142093 -257461 -285142 256864 -183837 359544 128210 -134407 234626 -59688
16428 326983 42074 -61633 323202 12859 -9920 -34538 -247986 212307 -182835 -11595 337482
16416 59273 251118 -169507 70870 81000 147154 -84318 270861 62628 -124335 488466 404128
16405 404128 -19518 238587 -168 -220641 -175998 -138700 71086 -59057 -84787 314835 246529
16394 246529 -63062 -69876 83945 237907 383513 -46057 114304 -290200 -88135 224801 -95644
16382 -255739 66824 229287 129012 256818 24034 31851 -47444 72468 -168846 -262032 109773
16370D13371E8279N7873J13136K47766A26660P2729M4696a28205O797B74830I4903
16358G7289a80222a336A52304a86987C1572M2006a38487k0420P3575F4789g5710
16346F0636a56265A08072N4377K04019A29666J30587I2639Q4271l6101m0565R5292
16335A95536a13601A84253l7160A705O2725l0651R1960b11767d3665k52611A98923
16323A19636a74868B26419c12590A32686L01880a06912A16981D4776K5997h5880
16312A17594J36749k703p0383c57815D8825J61644b15179f9194C8106i0973h877
16300E6771a24401p1764a6436k31660I3334M25380k14832p0651I5060P4229c23077
16288G3826K66509F0164J58469N7017A11019l7643J75432E8369K77299b88162
$$ plain form
16370 413371 58279 116152 229288 477054 126660 199389 244085 -128205 -121408 274830 94903
16358 77289 -180222 -1336 152304 -186987 31572 73578 -138487 -158907 -85332 64789 -75710
16346 60636 -156265 108072 162449 366468 129666 260253 92639 176910 140809 100244 195536
16335 195536 -113601 184253 147093 1705 64430 33779 125739 -211767 -43665 -296276 198923
16323 119636 -174868 226419 -312590 132686 434566 -106912 116981 44776 70773 -85880
16312 117594 254343 251640 181257 -357815 48825 210469 -215179 -69194 38106 -90973 -8877
16300 56771 -124401 -196165 -16436 -248096 93334 518714 303882 233231 95060 169289 -323077
16288 73826 340335 60164 218633 275650 111019 73376 248808 58369 335668 -288162
16277b46553e8340B06201n9262A5412a2873A58391b6508j55911r030A63147g6808
16265A80187b01463A31237b19704E5190K37263k3693I1940j023J83950a26298
16254a140B49888C3572J20691R6621n9222N3408m9649A9443J27489A7524g652
16242c10149J2827E97798B44842j4911D5176K47074d13q3486h830o266B41746
16230a07017j34709G4226a29191E111J37961d5418B78572j23146F9687C2200M6116
16219G8316J5519K37596A15567R3741a97842G7096p401Q3345a66591C44835a02080
16207A88380h2836F2679K9004J10433P1871j6337M1404f6333k8813E4860A7758
16195A35531C2717b40875J12101j4741A8968L4026c82012O1531A13541j9866Q6217
$$ plain form
16277 -246553 -58340 206201 146939 15412 -12873 158391 -26508 -182419 -191449 163147 -76808
16265 180187 -201463 131237 -219704 55190 292453 268760 91940 90917 274867 -126298
16254 -1140 249888 33572 154263 250884 191662 245070 195421 19443 146932 17524 -7652
16242 -310149 -297322 597798 244842 229931 45176 292250 -413 -83899 -8830 -15096 241746
16230 -107017 -241726 74226 -129191 5111 143072 -45418 278572 155426 69687 32200 78316
16219 78316 93835 331431 115567 209308 -197842 77096 69695 153040 -166591 344835 -102080
16207 188380 -82836 62679 91683 202116 273987 257650 299054 -66333 -95146 54860 17758
16195 135531 32717 -240875 -128774 -143515 18968 52994 -382012 -320481 113541 93675 179892
16184A79892k8162M632c3002A71683g0843K5204A99083K2847F5955L0506a60063
16172a85662e2591H8076J21284b31523A83226Q7009a67352A79554M3157L61280
16162E83991k19610b43813B12449G7602J30779j1733b36380D32910R7350p1289
16152D58971k11724l6364c34419F4197a50916j82437C28711j60788J74204m1664
16142C00463m3962C6677b26194A97158o574k3055g7040C66757j74969f7984C97628
16130A41814I808b008r4635n8525A70266e1043C40376E6578c7956m2517A2688
16118A27029K10914D454L8398h9569B8999N3164e257D25106b6387r0864A51989
16106A26674i2028C0131N18025a83559b4551A16195B3442O3154c2207m6366B7329
$$ plain form
16184 179892 151730 156362 -33002 171683 -70843 -45639 199083 221930 65955 96461 -160063
16172 -185662 -52591 88076 209360 -231523 183226 270235 -167352 179554 222711 583991
16162 583991 364381 -243813 212449 77602 208381 196648 -236380 432910 530260 458971
16152 458971 247247 210883 -334419 64197 -150916 -333353 328711 167923 342127 300463
16142 300463 256501 36677 -226194 197158 190584 167529 -77040 366757 191788 -67984 397628
16130 141814 9808 -2008 -96643 -155168 170266 -51043 340376 56578 -37956 -80473 12688
16118 127029 337943 4454 42852 -89569 28999 82163 -5257 425106 -26387 -117251 151989
16106 126674 -92028 30131 548156 -183559 -24551 116195 23442 86596 -32207 -78573 27329
16094A25839c031r8132o6689A79154i381B41199q1228J29477O9089a20332B05787
16082D58186B10819o4113j958D2753J53665A1710R9361B0139f9073K6240D37225
16070g6985F0481b27906g6860A69291E8576R2855a51G9821B5336a66831B28140
16058d6266b1351H6050Q9047L4634c4690A41212l0309C9701K4192J57734I57J1092
16046A2049J33103J3218a67303C7130L30426h1101m2363A60947J61412a87689
16035A23783A0543J67972j7408b14679B12243I2979q560C9093b5829f516B28357
16023D524J47914J49177j23407j4645l3852P6369K46558A75585P4512n4793q4067
16012A11237j2575L5144L32570H6751M2755d34016f1304H1436D290a78729H3915
$$ plain form
16094 125839 -3031 -101163 -167852 179154 -9381 241199 159971 289448 358537 -120332 205787
16082 458186 210819 146706 144748 42753 196418 11710 111071 20139 -69073 -42833 437225
16070 -76985 60481 -227906 -76860 169291 58576 151431 -151 79821 25336 -166831 228140
16058 -46266 -21351 86050 175097 209731 -34690 141212 110903 39701 63893 221627 957 12049
16046 12049 145152 158370 -167303 37130 367556 -81101 -123464 160947 322359 -187689
16035 123783 10543 178515 161107 -214679 212243 92979 84419 39093 -25829 -6516 228357
16023 4524 152438 301615 178208 163563 129711 206080 452638 175585 250097 195304 111237
16012 111237 98662 133806 466376 86751 129506 -434016 -61304 81436 4290 -178729 83915
16000B30926q5347o3254c1415A3872g9157A55752B592h3873p4960q3016C36166
15988B96346c30201C04147k3420J18081H850M1561K06939c10981B4299f6564b2824
15976A89071K8040j0780P6073F4297k6067K2060J06219a40618F8875J69645B8540
15964A58908K58370A49770D3495a359C59986e268C7589J87375r2631i1067b0650
15952B22296J13504b24583B38988L9506N0485e3279G7680F741L76314A48455K11790
15941C60245A78004l4377a1818G0513J14549F5793c4242B25053r473f2320B51457
15929H4514C7480h3799B78399a06844D0189J81962J13121A55499K33568A93584
15918B40700I395e769A82432K9903a9116q5455B37398I9852M8468C0767f8750
$$ plain form
16000 230926 145579 82325 -31415 13872 -79157 155752 2592 -83873 -158833 -241849 336166
15988 296346 -330201 304147 280727 398808 8850 50411 257350 -310981 24299 -66564 -22824
15976 189071 217111 206331 282404 64297 38230 60290 166509 -140618 68875 238520 28540
15964 158908 417278 149770 43495 -1359 359986 -5268 37589 224964 132333 -91067 -20650
15952 222296 335800 -224583 238988 278494 328979 -53279 77680 6741 383055 148455 360245
15941 360245 178004 143627 -11818 70513 185062 65793 -34242 225053 215580 -62320 251457
15929 84514 37480 -83799 278399 -106844 40189 222151 335272 155499 389067 193584
15918 240700 9395 -5769 182432 212335 -19116 -104571 237398 99852 148320 30767 -68750
15906B05643D7801L6153a65736C72156D6748J89567D5765Q4789J30350F4254K7917
15895I2171O8989K6286a30562B56734J03744Q7403C7337K27892c0578D6845A9346
15883A32226j2015m7827j6066L487J58101M00691b7788G4774J32479q5127L7502
15872A59628B0799a41971N3720D08532j42507a86642C9169K87724l5691j29213
15862A61989m6098a82993G5304K84092j56221G6410J2285D679M40577A63579M8945
15851B12524K56985l2113D3597g6079B19092g2791B95663A47369J90445L3610
15841C71424O8137A5889n876J52040L80486A75904B2175J84915l5864d0372D42826
15829A76804O4743h0829C36914p2569m8806H7810f4543B17435I6931Q3143f5946
$$ plain form
15906 205643 47801 83954 -165736 372156 46748 236315 45765 130554 260904 64254 92171
15895 92171 161160 187446 -130562 256734 360478 447881 37337 265229 -30578 46845 19346
15883 132226 120211 72384 56318 59805 217906 618597 -27788 74774 207253 122126 159628
15872 159628 20799 -141971 -88251 408532 266025 -186642 39169 326893 291202 161989
15862 161989 115891 -182993 75304 359396 203175 76410 88695 4679 445256 163579 212524
15851 212524 469509 437396 43597 -76079 219092 -72791 295663 147369 337814 371424
15841 371424 439561 15889 10013 162053 542539 175904 22175 207090 171226 -40372 442826
15829 176804 241547 -80829 336914 264345 215539 87810 -64543 217435 96931 180074 -65946
15817A39853Q2415P0147P5180E1363k2346e0904G6924Q8290a75404A56278p0562
15806H5716K28495J19673I6878J02186l6189K35902j23259a86286B77017n2124
15796B24893I5273J80091j20012O5822a54157d3214q1907J1021C87593a23012
15785C77893m16j74744e9992C75326N3352a02739A81857D718K204K4891K89231
15774C21044j20310a66349B12184q4785L88846A02976a6815n7672E19732j41187
15764C78545A87256K20025K969A76791O6639p7064a787A87765j7447J97106j66729
15753B00695L91355A49132F7149l593C0736j4490J61076J61419A53115K47076
15743D00191j88636h3263D09658D9580A2360K59953J23586j07937j25696q757
$$ plain form
15817 139853 222268 292415 367595 51363 29017 -50904 76924 165214 -175404 156278 85716
15806 85716 314211 433884 96878 199064 162875 398777 275518 -186286 277017 224893
15796 224893 95273 275364 155352 221174 -154157 -43214 -125121 -114100 387593 -123012
15785 377893 377477 202733 -59992 375326 428678 -102739 181857 4718 6922 31813 321044
15774 321044 200734 -166349 212184 127399 516245 102976 -16815 -74487 519732 378545
15764 378545 187256 407281 410250 176791 243430 166366 -1787 187765 170318 367424 200695
15753 200695 592050 149132 67149 63556 30736 16246 177322 338741 153115 400191
15743 400191 211555 -83263 409658 49580 12360 272313 395899 287962 162266 153509
15733A53509j2377F1489K72892j15144L4321P9703K09745k30844o2387o4547N4111
15722B39339r3194a3336A99509E4244J62730J57348b4685k2214E3584l044N2402
15711A02942C5191P2478g8873B5961J60452j3389m1416R4367c5220A89770e7564
15699A69365M33328k64543k7675j48021K38187I2155J8596J2777J42076J26949
15689C92553A22359M0829a16792B8292M97973D6201J64037B957K42144J60336
15679D05437j92149k1595L2555A11372K03643o1133L3183e9299D54444j96792
15669B57652n5418K4915j8679d168I7526G46L92485r1125K114q592A5079K13499
15657B28578H0685J0242J3304K34504L0951j08364A10716J28145R3834J70026
$$ plain form
15733 153509 141132 61489 334381 219237 253558 333261 543006 312162 249775 185228 239339
15722 239339 146145 -13336 199509 54244 216974 374322 -24685 -46899 53584 50540 102942
15711 102942 35191 107669 -78873 25961 186413 173024 131608 225975 -35220 189770 -57564
15699 169365 602693 338150 310475 162454 400641 92155 110751 123528 265604 392553
15689 392553 122359 163188 -116792 28292 526265 46201 210238 2957 245101 405437
15679 405437 213288 191693 224248 111372 315015 253882 287065 -59299 454444 257652
15669 257652 202234 227149 208470 -4168 97526 746 393231 302106 304220 295628 15079 228578
15657 228578 80685 90927 104231 338735 369686 261322 110716 238861 332695 502721
15647E02721C364L72208A57809J42198E0459o435P4859k4344l8397K308J51653
15636B10103K11428E4781j6085J70853m4043a40676E4053J22154q5D9815N408
15625E5223K04278A25679d4717H8975d2533A33278g8729E13827j91734M5171k2980
15614C44284A18388J67564D4111L14874A49365a57614B01558J68653j11398p9233
15604A79580n6794k0475L699O5275J63968K1562k1282K89572b02013C20178r1139
15593B29039J6345K19493k23449D6559M15610j75628j39982J750b11430C53369
15582b8525B79854H7581c1624B70946L09845B89708k8754p983K43486r3339B290
15570A54639l9704D4791K41457A34774J79236j02968F3985L83938A83143M28151
$$ plain form
15647 502721 3364 375572 157809 300007 50459 44024 118883 94539 56142 58450 210103
15636 210103 421531 54781 38696 209549 165506 -140676 54053 176207 176122 49815 55223
15625 55223 259501 125679 -44717 88975 -42533 133278 -78729 513827 322093 367264 344284
15614 344284 118388 285952 44111 358985 149365 -157614 201558 370211 258813 179580
15604 179580 122786 102311 106010 171285 335253 356815 335533 625105 -202013 320178 229039
15593 229039 245384 464877 241428 46559 462169 286541 146559 148309 -211430 353369
15582 -28525 279854 87581 -31624 270946 580791 289708 260954 252971 496457 403118 2290
15570 154639 114935 44791 286248 134774 314010 211042 63985 447923 183143 611294
15560F11294G2460J97362j0395j20574J24224J71357j2069A07631A7017L95021
15550D12038j29762A31256L11853j47294A30345Q5139J11755H2910J07936J64165
15540C55011n7627K65989j82028m144j57244d4510C28112c7584C16818J06764
15530D23582J62336A99233H3920M32612A60608P4840K63723j71804q6974q5444
15520A54949Q3574K00211F7277M82391J6842A89298J90315D4325N86559A14250
15509C64186A39846R2529J23063n6037F8786K58957k9900A10599K56144j09926
15499B56817J35598A34711Q0195N23919C53536K93736A80214j8087L15632j20142
15489C57617J49924B47165J11836L6034j41440N3523o5704K41528d2758B30450
$$ plain form
15560 611294 72460 269822 259427 138853 263077 434434 422365 107631 17017 412038
15550 412038 282276 131256 443109 295815 130345 215484 327239 82910 190846 355011
15540 355011 297384 563373 381345 377201 219957 -44510 328112 -37584 316818 423582
15530 423582 585918 199233 83920 516532 160608 235448 499171 327367 240393 154949
15520 154949 238523 438734 67277 549668 566510 189298 379613 44325 630884 114250
15509 364186 139846 232375 355438 299401 68786 327743 297843 110599 366743 256817
15499 256817 392415 134711 214906 738825 353536 647272 180214 162127 477759 357617
15489 357617 507541 247165 359001 395035 253595 307118 241414 482942 -42758 230450
15478D53L02047K88971j59295o5650J46813j94593K047J32263G2536K41190D6430
15466D97245H3485J37162E4540J15636K00665o5669K62597e3703F01989B86884
15455E40746o3873k26603r0300M8017J28680j25999R6179F8962M78977P489A97438
15443A75962l323K31984J53761k18679J62133J4868j05174d823F42935k82226
15433C60709R2618p4357R7953o4384l0616j4079j71243r3036j8531K90576A39769
15421C48498K42537A38697a30038B36696n597J29269p4403O8637j23076J56154
15411C87680L9312r3574K11218k01497I2453M93041k41680J93072L3242A51610
15400B18172M89088C52908J47752j83039J42898j50652L20253j48853J57053H5133
$$ plain form
15478 453 302500 591471 432176 366526 513339 318746 320793 453056 72536 313726 46430
15466 497245 83485 220647 54540 170176 370841 305172 567769 -53703 601989 286884
15455 540746 476873 250270 159970 207987 336667 210668 306847 68962 547939 555428 197438
15443 175962 172639 404623 558384 339705 501838 516706 411532 -4823 642935 360709
15433 360709 453327 378970 476923 412539 381923 367844 196601 103565 85034 375610 139769
15421 348498 591035 138697 -130038 236696 231099 360368 285965 354602 231526 387680
15411 387680 426992 333418 544636 343139 92453 585494 343814 536886 570128 151610
15400 218172 707260 352908 500660 317621 460519 309867 630120 481267 638320 85133
15389B78249q9493K11911A94243R6907J10497j10411R3659o8019J19136q7998
15379C48014j64614k6872J60565J30649Q1496k52690K66460J24662k82063A71514
15368A36038M7293L15329B00936K79860C1319K16832L33529j70797A55268l2045
15358A23223L48756j32176N8923R4041q8045J65692D2983N1063K57246n7834o3005
15347B30453D6884N16588o5969J58555B17999c91E90269k28779J31364r8753j71349
15336B22752H5691K86824j08584J08210A72392M29521p0143K902j95677P7895
15326D16890j64521m9920M70658j37825p8424k12368J35855K51834k54471q3847
15316B93861J89210J0032j84502J25155B09596K24956I5230K87226F0116M42657
$$ plain form
15389 278249 188756 400667 194243 291150 401647 291236 384895 316876 436012 348014
15379 348014 183400 156528 317093 447742 529238 276548 543008 667670 385607 171514
15368 136038 183331 498660 200936 480796 31319 248151 581680 410883 155268 123223
15358 123223 471979 339803 398726 492767 404722 570414 42983 94046 351292 293458 230453
15347 230453 46884 563472 497503 656058 217999 -391 590269 361490 492854 394101 222752
15336 222752 85691 372515 263931 372141 172392 601913 531770 534672 338995 416890
15326 416890 252369 202449 673107 535282 456858 244490 380345 632179 377708 293861
15316 293861 483071 493103 308601 433756 209596 434552 95230 382456 60116 502773
15306E02773j42061A03805O35409B01876O5550M10652l33699J36232n177q9899
15296C85535q0894o042L7924L40523k25362A79472Q8430D6600N38227k59743m7564
15285B77520B4230N51498j50929P6644m5578j86011K71802K6681B31859N3518
15275B85377k2714K54486k02852K52810q2011p4347o0316o6867M14187l28769
15265C68984K94987B29733L59246j77963M4175j74938J84046N926M9971K66331
15255G86527B52013K76882B01422J62438J38516B04857L07532A93173K91732K432
15245D87337A32010K06325J11429j2763N0614r559o3461J38581A87453K55761
15235D43214B08148J07556J86869q2637A80751L78473r7930P2927J33313j85734
$$ plain form
15306 502773 360712 103805 739214 201876 267426 678078 344379 480611 475434 385535
15296 385535 304641 298599 336523 677046 451684 179472 267902 46600 584827 325084 277520
15285 277520 24230 575728 424799 501443 455865 269854 541656 568337 231859 285377
15275 285377 262663 517149 314297 567107 485096 410749 350433 283566 697753 368984
15265 368984 663971 229733 588979 411016 455191 280253 464299 470225 520196 786527
15255 786527 252013 528895 201422 363860 502376 204857 512389 193173 484905 487337
15245 487337 132010 338335 449764 437001 487615 478056 414595 553176 187453 443214
15235 443214 208148 315704 502573 419936 180751 559224 461294 534221 667534 481800
15225D81800p3224A32177J60909M2305A25953K10568K44910l1294o1800L02605
15215G90942j77736o3519J06772A86204L78314k9476k3367A98054K30714A78270
15204C87912J99133B48686K10513N1245J45093j66791j86114M34180C45474N61599
15194I07073B03791K31622n3903L23045C21858J79003K49079j64089O7550j99822
15184D53579P0136N182j17321K65042B82137J00072L28179A99307L90662k12915
15174C77054K75507j41029J58788j7545L3582C05180M58862j53899k57507J90585
15164E43221B59301L35623k12640L26626m5102j45628p1654K76119o4996k75121
15154C82528K1644J72327j60293o35K47830R0852k00361L6496k35068R1424J92931
$$ plain form
15225 481800 408576 132177 293086 335391 125953 336521 581431 550137 488337 790942
15215 790942 613206 549687 656459 186204 564518 535042 511675 198054 428768 178270
15204 387912 587045 248686 459199 510444 655537 488746 302632 736812 345474 907073
15194 907073 203791 435413 381510 704555 321858 500861 749940 585851 653401 453579
15184 453579 523715 528897 411576 676618 282137 382209 710388 199307 589969 377054
15174 377054 652561 511532 670320 652775 686357 305180 764042 610143 352636 543221
15164 543221 259301 594924 382284 708910 663808 518180 446526 722645 657649 382528
15154 382528 404172 576499 416206 415571 663401 754253 553892 590388 355320 446744 639675
15143F39675J41234r5275j21429j01616K25929B94495p0642J64885j44908J06593
15133C50423K90139K82810D39349K4361K5438L4069J86827J44618k11934k4444
15123F18284J44486j43215J89348K30111l53967l22373L60594l1294j74356L2756
15113E50374j5574L23197C69613J32797J65466j88665L02763k78532K64730J46168
15103I14340m44316J41931M3111j62866M14845D08343L98386Q9696D06084m5360
15093C60724K46363J03868R4514k04049j23475K00323n2064K02621j32181m5721
15083F50923M3718l22019L90553B82884N18275J82537k87512M0367J27797k82380
15073E81968P2503L5354k73420K68393j7881P9552k7814Q5648k73800M4268k0482
$$ plain form
15143 639675 780909 685634 564205 462589 688518 294495 223853 388738 243830 350423
15133 350423 640562 923372 439349 463710 489148 523217 710044 854662 642728 618284
15123 618284 762770 619555 808903 1039014 685047 362674 723268 691974 517618 550374
15113 550374 534800 857997 369613 502410 667876 479211 781974 503442 768172 914340
15103 914340 470024 611955 655066 492200 907045 408343 806729 896425 406084 360724
15093 360724 607087 710955 805469 601420 477945 678268 626204 828825 696644 650923
15083 650923 694641 372622 763175 282884 801159 983696 696184 736551 864348 581968
15073 581968 654471 689825 416405 684798 666917 746469 718655 804303 530503 574771 554289
15062E54289R2164O8293L4589K984J80132j86731j74579o4489K18932k40495p2859
15051D12230K01968N8030R9340J19188k84517J58279j16968k68941J92800L10758
15041H82167j17726j97030K26926k80011B21926Q76696n28170K33842N8407j49729
15031G12972K48028J3213J7058l77540K45789q7936k61068M37971j02780j54753
15021F90954O6994K15636k14151k26890J02879M73508l24542j86897L31567l64738
15011E64320K77259P8683N5975n9667O0298k79305q4220k56789L75099L3528j23900
15000F41281M2267L66077m7950l67527m2282N85196n30466o6688J31984N275M68387
14989A185554n0193n49830L09424j09184O3561j37039L0636j53226j11770L76254
$$ plain form
15062 554289 646453 714746 749335 752319 932451 745720 571141 506652 725584 485089 412230
15051 412230 614198 672228 771568 890756 606239 764518 647550 378609 571409 882167
15041 882167 764441 567411 794337 514326 221926 1098622 570452 804294 862701 712972
15031 712972 961000 974213 991271 613731 859520 771584 510516 948487 845707 690954
15021 690954 757948 973584 759433 532543 635422 1108930 784388 597491 929058 564320
15011 564320 841579 920262 976237 916570 976868 697563 613343 356554 731653 765181 641281
15000 641281 683548 1049625 1001675 634148 591866 1177062 646596 579908 711892 717167 1185554
14989 1185554 1135361 585531 894955 785771 849332 712293 742929 589703 477933 854187
14979H54187M417j0983O0552j38570j07094j1085j84929N10770k48869q090J15226
14968H35532j03353K69795q1731l58844K44276J7940J8449k53600M48127l67623
14958F68968J97671k0892j2289K05103E08667K77108J25159o2839k30300L82541
14948A000336r1854J31722J43549l31515N3739j41206Q6979m6310N3893J9198
14938H78531L10135k46266m9264m21299N44278j95890j37756J26834N26692k73587
14928A062408j80958j08230J02568j5753L77495j89263j17996K86398o7511k60382
14918H88776K23590j38929j54432k5823P248J0468L17087j26328k24827L40705
14908A117535o7412l03559k5896M69550m9450J12499n59800M32009L8333k39809
$$ plain form
14979 854187 858604 847621 908173 769603 662509 651424 466495 977265 728396 720306 835532
14968 835532 732179 1001974 920243 561399 805675 823615 842064 588464 1036591 668968
14958 668968 866639 845747 833458 1038561 508667 785775 910934 848095 617795 1000336
14948 1000336 908482 1040204 1183753 852238 905977 764771 851750 805440 859333 878531
14938 878531 1188666 942400 893136 471837 1016115 820225 682469 809303 1335995 1062408
14928 1062408 881450 773220 875788 860035 1237530 1048267 930271 1216669 1149158 888776
14918 888776 1112366 973437 819005 793182 800430 810898 1127985 1001657 776830 1117535
14908 1117535 1050123 746564 720668 1190218 1140768 1253267 693467 1125476 1163809 924000
14898I24000J38150k09686N60897n29942J99818k43520C81919O38278K02590l27051
14888H95736K08741j29219J03995j98976L1939R5546k7705J21283m60679M71283
14878A111944p710N7744j23975O3396j30635K3787K39234l55868N68708k69067
14868A177558j9774r074n9338L84429k07485j94082P5813m82333J024373k40678
14858A449409l16915l75031J76815J72421j3465L99294k93334j12250J97477K17480
14848A501901m78625J68173j57140L0560J74596M135J54928l26532J18103n1825
14838A138274L15620k56479k9421K66170L7164l32330K04075j42007j76293K50023
14828A274796J01597l08266K18012K34349j77910M0389Q6785o79064N99202n01701
$$ plain form
14898 924000 1062150 852464 1413361 883419 1083237 839717 381919 1020197 1222787 895736
14888 895736 1104477 975258 1079253 880277 912216 1007762 980057 1101340 640661 1111944
14878 1111944 1104234 1161978 1038003 1101399 970764 994551 1233785 877917 1446625 1177558
14868 1177558 1157784 1148710 1089372 1473801 1266316 1072234 1148047 665714 1690087 1449409
14858 1449409 1132494 757463 934278 1106699 1093234 1492528 1199194 1086944 1284421 1501901
14848 1501901 1023276 1191449 1034309 1064869 1239465 1243600 1398528 1071996 1190099 1138274
14838 1138274 1453894 1197415 1167994 1434164 1471328 1138998 1343073 1201066 1024773 1274796
14828 1274796 1376393 1068127 1286139 1520488 1342578 1382967 1469752 790688 1389890 888189
14818H88189L07139K69446J15041l15654n9703J06253o182L87226m68008r3291
14808A130456L03597J3024k95372L44925K6649m62880L26488K63989m00474M47677
14798A698079j52813l26836L31424k27775M4162N6849l33854L62379J07357m19249
14788A139723K20365J27462N9980J77836k72361j84559N38204o97915L85728j09929
14778A384534L06168k01302K40121k21204J02230k55246K35321j55495J45498
14769A580625j27376O0842j22204N6223o3849L49322l38223K33858k98279L7590
14759A368529O551R4994J34257J2960p8034J01792J40213j47738K8593K40420
14749A902537k99022j38712M30373k96963r1502l8660j25865M73293m6591r1100
$$ plain form
14818 888189 1195328 1464774 1579815 1264161 1204458 1310711 1304529 1691755 1223747 1130456
14808 1130456 1434053 1447077 1151705 1496630 1523279 1060399 1386887 1650876 1250402 1698079
14798 1698079 1545266 1218430 1549854 1322079 1366241 1423090 1089236 1451615 1558972 1139723
14788 1139723 1360088 1487550 1547530 1725366 1453005 1268446 1806650 1108735 1494463 1384534
14778 1384534 1690702 1489400 1729521 1508317 1610547 1355301 1590622 1435127 1580625
14769 1580625 1453249 1514091 1391887 1448110 1384261 1733583 1395360 1629218 1330939 1368529
14759 1368529 1375080 1470074 1604331 1617291 1539257 1641049 1781262 1633524 1662117 1902537
14749 1902537 1603515 1464803 1895176 1598213 1506711 1468051 1342186 1815479 1768888 1677788
14739A677788r3532J40085j09138R2012j30641K17454n2976l07025K42210J35657
14729A811894J09145p5802O7378j40472Q1228J57602j19998k6082k24009Q3262
14719A724146L36041l43378K97925l31995J25624J18095L73726m06503j94047
14710A699634k83012M30130m9941N2214L46702j63101l42747K12717j01861J01144
14700A901879l6642K41211r2922n0133R9928N8459j53962J48733j88010L84002
14690B312543j47000k06839j3232K35473l44553J594O0990N7249N6370J82102
14680B194697k00398J93158k3348K22758M0354j36048j59648L9837M8104J02141
14670B321607j3469k21104j24358K32580O4797k48085J17551K67288m43204L86076
$$ plain form
14739 1677788 1584256 1724341 1615203 1707215 1576574 1794028 1741052 1434027 1676237 1811894
14729 1811894 1921039 1845237 1912615 1772143 1853371 2010973 1890975 1864893 1640884 1724146
14719 1724146 2060187 1716809 2014734 1682739 1808363 1926458 2300184 1893681 1699634
14710 1699634 1416622 1846752 1796811 1849025 2195727 2032626 1689879 1902596 1800735 1901879
14700 1901879 1865237 2106448 2013526 1963393 2063321 2121780 1967818 2116551 1928541 2312543
14690 2312543 2165543 1958704 1945472 2180945 1836392 1837986 1898976 1956225 2012595 2194697
14680 2194697 1994299 2187457 2164109 2386867 2427221 2291173 2131525 2171362 2219466 2321607
14670 2321607 2308138 2087034 1962676 2195256 2260053 2011968 2129519 2396807 1953603 2339679
14660B339679j16262o7301J87405J07587j06028K53742n86805O04075j56467k05606
14650B254019K72548P0842j06091q8059m6612j15235J08905J20711j62422N94121
14640B902727n10812L79481m15778J11034p4164J49254j6566J08313m19828J44723
14630B358384R4270J85236K54170l37351L86161l58695q0290N58120l75485j86837
14620B497683K69762j16745k3991J09410p2705q2683M26959l5526q1317j84608
14610B706239k06442J15437L40774k87567M89640l37547p8757J34651J65642N5561
14600C097631j11168J40513p2067J22255j88138K21876m4977L1693l10942J28519
14590C015195Q8585l88591O04933j45068k14026J77547Q5764j38842J62290J40816
$$ plain form
14660 2339679 2223417 2156116 2343521 2451108 2345080 2598822 2012017 2616092 2459625 2254019
14650 2254019 2526567 2597409 2491318 2403259 2356647 2241412 2350317 2471028 2308606 2902727
14640 2902727 2391915 2771396 2355618 2466652 2392488 2541742 2525176 2633489 2213661 2358384
14630 2358384 2452654 2637890 2892060 2554709 2940870 2582175 2501885 3060005 2684520 2497683
14620 2497683 2767445 2650700 2626709 2736119 2663414 2580731 3007690 2972164 2890847 2706239
14610 2706239 2499797 2615234 2956008 2668441 3158081 2820534 2741777 2876428 3042070 3097631
14600 3097631 2986463 3126976 3054909 3177164 2989026 3210902 3165925 3197618 2886676 3015195
14590 3015195 3103780 2715189 3320122 3175054 2961028 3138575 3224339 3085497 3247787 3388603
14580C388603k73539M8521m0519J73445n8498N3685K43830k32046L73238l03084
14570C373636L64217k19518J33211k94810K84519l05300K75435j7849k4180K44722
14560C814083j05155k43543J65657q9889k7380R9870k34162L30034K43805l77854
14550C575466K44565k32735J23358M3701J18496l7922j94974L83309k08968j57200
14540C657096N34142k30792K02183l01307K6394K26344K1958k30667J19062L24493
14530D348906J35608j98573k9165Q1787K9100k23169J9047M9899j22012K04523
14520D295951r4992K15014J26902J72679m40274k8834O41547o33760J38232L83686
14510D776151M0597J4257l12767N28301l39191M09048m53979N7928K7079J46415
$$ plain form
14580 3388603 3115064 3163585 3123066 3296511 3238013 3291698 3535528 3303482 3676720 3373636
14570 3373636 3737853 3518335 3651546 3356736 3641255 3335955 3611390 3593541 3569361 3814083
14560 3814083 3708928 3465385 3631042 3541153 3513773 3613643 3379481 3709515 3953320 3575466
14550 3575466 3820031 3587296 3710654 3754355 3872851 3834929 3639955 4023264 3814296 3657096
14540 3657096 4191238 3960446 4162629 3861322 3887716 4114060 4136018 3905351 4024413 4348906
14530 4348906 4484514 4285941 4256776 4338563 4367663 4144494 4163541 4213440 4091428 4295951
14520 4295951 4200959 4415973 4542875 4715554 4275280 4246446 4887993 4254233 4392465 4776151
14510 4776151 4816748 4831005 4518238 5046539 4707348 5116396 4662417 4720345 4747424 4893839
14500D893839j61729N13423k48732Q8906J77113N208l0850m4867j928o8758J64196
14489E285821M1923P0747k34088j75338L96278J38102O6179O8225l63964K85007
14479E578892j34580j76835K90323l4943J74066k66539K96688J80743m4211K63646
14469F127250n01787K37878L38922k53348M07209j04650j33277j39790L92756
14460F371163j57708J86444J11821j14429J18220N01793l40376j25429l0297J45601
14450F666803J2413J07658J15594J24168j9942J64873m01912K97411L07262J83181
14440G557509k87829L55K47408m49159M81962M1181O5059j05812M12537l67626
14430G595585J20995N401L85305k98025K18081r586M53529j51665P7140j35553
$$ plain form
14500 4893839 4732110 5245533 4996801 5085707 5262820 5268028 5237178 5192311 5190383 5121625 5285821
14489 5285821 5327744 5398491 5164403 4989065 5385343 5523445 5589624 5657849 5293885 5578892
14479 5578892 5444312 5267477 5557800 5522857 5696923 5430384 5727072 5907815 5863604 6127250
14469 6127250 5625463 5863341 6202263 5948915 6356124 6251474 6118197 5978407 6371163
14460 6371163 6213455 6399899 6511720 6397291 6515511 7017304 6676928 6551499 6521202 6666803
14450 6666803 6679216 6786874 6902468 7026636 7006694 7171567 6769655 7067066 7374328 7557509
14440 7557509 7269680 7270035 7517443 7068284 7550246 7591427 7656486 7550674 7963211 7595585
14430 7595585 7716580 7721981 8107286 7809261 8027342 8017756 8471285 8319620 8396760 8261207
14420H261207K06534l0570m2063L83006J58288j13864K52836j14413L50340l61247
14410H950054J54770j75330L93950J39223K29641m13037P1014O9358M28517l27106
14400I521054K41861N41117m32607L01693L69366l69760J96682L00697K30502
14391A0900605n60711Q40579l72768K34144J47506j30770P8656K46715j89398
14382A1194558P04524j95166K41002l09353J66751L04755P0106j2950K73650N1542
14372A2489419J08927J14522J21604K03289K54281k96479L04207n1193K35783
14363A3484360J03847M23398j82655K57126L44981j30472L49017L39442L4047
14354A5023091K32985P5144o1085O87965l71115K83212K55352J96940Q9762R6624
$$ plain form
14420 8261207 8467741 8437171 8395108 8778114 8936402 8822538 9075374 8960961 9311301 8950054
14410 8950054 9104824 8929494 9323444 9462667 9692308 9279271 9350285 9419643 9848160 9521054
14400 9521054 9762915 10304032 9871425 10173118 10542484 10172724 10369406 10670103 10900605
14391 10900605 10339894 11180473 10807705 11041849 11189355 11058585 11137241 11383956 11194558
14382 11194558 11899082 11703916 11944918 11635565 11802316 12107071 12177177 12164227 12437877 12489419
14372 12489419 12598346 12712868 12834472 13037761 13292042 12995563 13299770 13248577 13484360
14363 13484360 13588207 14011605 13828950 14086076 14431057 14300585 14649602 14989044 15023091
14354 15023091 15256076 15331220 15270135 15958100 15586985 15870197 16125549 16322489 16412251 16508875
14344A6508875M52997j75983J8250K23482J13439N74982K32286k69407N33872
14335A8212793j06511L89074K97083P0038P28733j32177J04645K12748L56442
14326B0132868j52346O76675J94917J1233P41373l55199L16750M18575J0868R31574
14316B2927288K0017J29892L0037O90693L30296Q3516K93360J85781K94283L75317
14306B5360480M24171J93548Q76484J81900J57114P8912O50638M94984L90977
14297B8809208M37250K31234M37855M70630K21132M63882M49592M85311M45770
14288C2451864O33411O86736O8925L05600R30336N86366O60249L78179O40333
14279C7341999M70063K74499P68510O79751O96407R22037N54650M82984P68421
$$ plain form
14344 16508875 16961872 16785889 16804139 17027621 17141060 17716042 17948328 17678921 18212793
14335 18212793 18106282 18495356 18792439 18862477 19591210 19459033 19563678 19776426 20132868
14326 20132868 19980522 20657197 20852114 20863347 21604720 21249521 21566271 21984846 21995714 22927288
14316 22927288 22947305 23077197 23107234 23797927 24128223 24211739 24505099 24690880 24985163 25360480
14306 25360480 25784651 25978199 26854683 27036583 27193697 27272609 27923247 28418231 28809208
14297 28809208 29246458 29477692 29915547 30386177 30607309 31071191 31520783 32006094 32451864
14288 32451864 33085275 33772011 33840936 34146536 35076872 35663238 36323487 36701666 37341999
14279 37341999 37812062 38086561 38855071 39534822 40231229 41153266 41707916 42190900 42959321
14270D2959321O46711N16571J201318P58069K89682J010823P37014P66365Q87821
14261D9773695Q23876J268545M36313J314038J276598P29581Q90287J331544R74345
14252E8818822P36894J389403J470353R64900J651522J157604R64874J580275
14244F8734647J626889J479932J477401J621807J387496J562772J854355J912996
14236H1658295J564324J934421K051699J438355K569137K105024J920043K532220
14228I7773518J894526K785017K116717K867637K661841L023618K585717K844563
14220A18553154K947350L107902L502388K859941L666430L619816L621663L888099
14212A45766743M038898M546943L662723N080732M365597M492799M818014N134639
$$ plain form
14270 42959321 43606032 44122603 45323921 46081990 46371672 47382495 48119509 48885874 49773695
14261 49773695 50597571 51866116 52302429 53616467 54893065 55622646 56512933 57844477 58818822
14252 58818822 59555716 60945119 62415472 63380372 65031894 66189498 67154372 68734647
14244 68734647 70361536 71841468 73318869 74940676 76328172 77890944 79745299 81658295
14236 81658295 83222619 85157040 87208739 88647094 91216231 93321255 95241298 97773518
14228 97773518 99668044 102453061 104569778 107437415 110099256 113122874 115708591 118553154
14220 118553154 121500504 124608406 128110794 130970735 134637165 138256981 141878644 145766743
14212 145766743 149805641 154352584 158015307 163096039 167461636 171954435 176772449 181907088
14204A81907088N328370N324501N653759N762148O272479O122445O752238O501675
14196B29624703O397235P675845P372767P259639P575070P830191Q421430Q474083
14188B90630963Q382864Q621097R169986Q929170R295523R115433R275502R425739
14180C62846277R503771R336398R532730R340707R082194R104648Q884850Q437050
14172D36068625Q358677P206926P698665O470051O306761N175782M943389M196633
14164D86425509L027600K274669J100212j176118j983348j761772k683344k295809
14156D82927599j124018k378913k466069m740659n592387o368644o997688q115955
14148D45143266q120114q719301r135164r111378r415566r499809r724644r201936
$$ plain form
14204 181907088 187235458 192559959 198213718 203975866 210248345 216370790 223123028 229624703
14196 229624703 236021938 243697783 251070550 258330189 265905259 273735450 282156880 290630963
14188 290630963 299013827 307634924 316804910 325734080 335029603 344145036 353420538 362846277
14180 362846277 372350048 381686446 391219176 400559883 409642077 418746725 427631575 436068625
14172 436068625 444427302 451634228 459332893 465802944 472109705 477285487 482228876 486425509
14164 486425509 489453109 491727778 492827990 491651872 489668524 487906752 485223408 482927599
14156 482927599 481803581 479424668 476958599 472217940 466625553 460256909 453259221 445143266
14148 445143266 437023152 428303851 419168687 410057309 400641743 391141934 381417290 372215354
14140C72215354j0012968r168745r431671r662079r321763r065340r130030q857120
14132B97565638q436821q655096p972509p960596p495129p909910p328500o952885
14124B34854192p014375o748242o526995o164083o127351n838510n744455n224476
14116A85465705n670172n024208m809660m782445m763447m153757m615233m014546
14108A47632237l951323l654961l763474l585110l577617l364195l110208k927289
14100A19698060l575347l032126k328502k802496k565182k652530k493023k073931
14092I8174923k588763k240738k122176k059699k072128j745185k019939j928656
14084H1397639j677628j825946j739169j530331j891328j467531j572037j368956
$$ plain form
14140 372215354 362202386 353033641 343601970 333939891 324618128 315552788 306422758 297565638
14132 297565638 289128817 280473721 272501212 264540616 257045487 249135577 241807077 234854192
14124 234854192 227839817 221091575 214564580 208400497 202273146 196434636 190690181 185465705
14116 185465705 179795533 174771325 169961665 165179220 160415773 156262016 151646783 147632237
14108 147632237 143680914 140025953 136262479 132677369 129099752 125735557 122625349 119698060
14100 119698060 116122713 113090587 110762085 107959589 105394407 102741877 100248854 98174923
14092 98174923 95586160 93345422 91223246 89163547 87091419 85346234 83326295 81397639
14084 81397639 79720011 77894065 76154896 74624565 72733237 71265706 69693669 68324713
14076F8324713j271095j564336j106288j461727j296540j084554j038944j488802
14068E8012427j152348j005551j143233m95251j159479j012890j144867p49511
14060E0149297r76915q82635r82089n62293r44072p33542p06032q92592o57256
14051D2811871j015930m74936p74289r16688k97688l42247r30584n59919o90754
14042C6808836n06998k10412j185490l87216k71485m30284p37376r45239R3617
14033C2227953q90955j78077n45614m87949k51774n45596j80186o44696l28059
14024B8175047l47704o72135j3620o66293o52454l56332m9653k51016n03244j13164
14014B4549432m07168l40983m66864l33517m4840j39073m71416l76948j94401
$$ plain form
14076 68324713 67053618 65489282 64382994 62921267 61624727 60540173 59501229 58012427
14068 58012427 56860079 55854528 54711295 54216044 53056565 52043675 50898808 50149297
14060 50149297 49172382 48289747 47307658 46745365 45801293 45067751 44361719 43469127 42811871
14051 42811871 41795941 41321005 40546716 39630028 39332340 38990093 38059509 37499590 36808836
14042 36808836 36301838 36091426 34905936 34518720 34247235 33816951 33079575 32134336 32227953
14033 32227953 31336998 31158921 30613307 30125358 29873584 29327988 29147802 28503106 28175047
14024 28175047 27827343 27155208 27141588 26475295 25822841 25466509 25416856 25165840 24662596 24549432
14014 24549432 24142264 23801281 23334417 23000900 22956060 22816987 22345571 21968623 21774222
14005B1774222l25235r8925o13472Q8397m40476m72307k4869l57548J6462m05774
13995A9140475j57898l03329j80734k48961r7172J90181m96237n37762l7699l8495
13985A7232369j92194n63684j92290N8069l34747P4091j49038j12699m81467p3635
13975A5264775k42285r9751K0987j78010k96322r1j99422j50245k31648j10092
13965A3777896j50926n06104L04786O9181n33356R9344m37045K64646j72758k58279
13955A2457385J88494n42225j07887j421k69357L47126k98085m16954K11450l66332
13945A1202194L5550K7498m47981R0364K26269m94956J6183J62691k45972J6527
13935A0588367j91180j60373l9542j43387N7775J65007m69494k61567J27517Q5635
$$ plain form
14005 21774222 21448987 21350062 20736590 20824987 20384511 19912204 19887335 19529787 19546249 19140475
13995 19140475 18982577 18679248 18498514 18249553 18152381 18342562 17846325 17308563 17270864 17232369
13985 17232369 17040175 16476491 16284201 16342270 16007523 16081614 15932576 15819877 15338410 15264775
13975 15264775 15022490 14922739 14943726 14765716 14469394 14469303 14269881 14119636 13887988 13777896
13965 13777896 13626970 13120866 13425652 13494833 12961477 13060821 12623776 12888422 12715664 12457385
13955 12457385 12645879 12103654 11995767 11994346 11724989 12072115 11774030 11357076 11568526 11202194
13945 11202194 11237744 11265242 10817261 10907625 11133894 10638938 10655121 10817812 10571840 10588367
13935 10588367 10397187 10236814 10197272 10053885 10111660 10276667 9807173 9545606 9673123 9758758
13925I758758l70064l04874K93730J1516l49166o4250k70488L56365M5332m8883
13915I057976k64636k90387J56831n3671r5781j02685k45837K77153n30898M38811
13905H346876l09449p2064j22632j33166O0022m2547K35331l23755m75174J32329
13895G295771K16363l0744r7389k0906j57735j11890K23775m49028o7811K72493
13885G072899J14637n79867N25233l12865L55467n29794j6369K02517q2335o05793
13875F143730L22617N2873k8228o9250K2414o09460O4736P3782O6209j49754J80421
13864F070090o4910j45820N7863l9979j5562M293k64970P2087k42339K94608J53310
13853E878671l89232q4205L28354o21424O4257J69924k41442K78604J10131l38957
$$ plain form
13925 9758758 9388694 9083820 9377550 9389066 9039900 8975650 8705162 9061527 9106859 9057976
13915 9057976 8793340 8502953 8659784 8606113 8510332 8407647 8161810 8438963 7908065 8346876
13905 8346876 8037427 7965363 7842731 7709565 7769587 7727040 7962371 7638616 7163442 7295771
13895 7295771 7512134 7481390 7384001 7363095 7205360 7093470 7317245 6868217 6800406 7072899
13885 7072899 7187536 6607669 7132902 6820037 7175504 6645710 6629341 6831858 6749523 6143730
13875 6143730 6466347 6519220 6490992 6421742 6444156 5834696 5899432 5973214 6039423 5889669 6070090
13864 6070090 6005180 5859360 5917223 5877244 5861682 5865975 5601005 5673092 5430753 5725361 5878671
13853 5878671 5489439 5405234 5733588 5112164 5176421 5346345 5104903 5383507 5493638 5154681
13843E154681K25937K2096k51269K84047l78975k12978M9584N2070K22983k64819
13833D903357Q2833j23591j43038l3697P2780J59008j46246m53043M68739k37730
13823D549372J61749p5157p4523p3824r815j64552M16166k66853J94537l11163
13813D345937L14572o90434J42909K4573J87285J29452l43858J68075l9827k98081
13803C940603K33090j65896L46024j34313J34662k96673j28907k03653N31806
13794D256743m03451K86474l77070L97697O1935m23256l2927j99035m9157L90478
13784C908431N4622k80073n9591O3261L44514m02475m6756J70649n76655K14821
13774C390748M47977n57761J92951o1980J12811o4449k29740j28955L1220J91630
$$ plain form
13843 5154681 5380618 5402714 5151445 5435492 5056517 4843539 4893123 4945193 5168176 4903357
13833 4903357 4986190 4862599 4719561 4685864 4758644 4917652 4771406 4318363 4787102 4549372
13823 4549372 4711121 4635964 4561441 4487617 4477802 4313250 4729416 4462563 4657100 4345937
13813 4345937 4660509 3970075 4112984 4137557 4324842 4454294 4110436 4278511 4238684 3940603
13803 3940603 4173693 4007797 4353821 4219508 4354170 4057497 3928590 3724937 4256743
13794 4256743 3853292 4139766 3762696 4160393 4222328 3799072 3766145 3567110 3517953 3908431
13784 3908431 3963053 3682980 3623389 3686650 4031164 3628689 3581933 3752582 3175927 3390748
13774 3390748 3838725 3280964 3473915 3411935 3524746 3460297 3230557 3101602 3132822 3324452
13764C324452L8875j37869J56097p64R8085r8921m15153K29271K24216k43985
13754C174304j0756k10565J30895j54731J67550j4022j17943l46351N97679l93674
13744B822386L12468k27386q062K16756n35944M35174N6295l2395k02446K63887
13734C100733j33905m16914K86676J8540M6218l0465k08302j88991K12675J54820
13724B841085l31866P82477o36579K0046m2668J7647Q5641J8792j03748j52011
13714B498816j0944J95603J8296k4583j45763m0975K07079l69195P8914L15856
13704B723104L4159k25104p7447L3852j30341J99150M94l10467K11241l01448
13694B157193L74462j06611j62886M9292K59372j58371q5751o8243K74310m08497
$$ plain form
13764 3324452 3363327 3225458 3381555 3380791 3478876 3379955 2964802 3194073 3418289 3174304
13754 3174304 3163548 2952983 3083878 2929147 3096697 3082675 2964732 2618381 3216060 2822386
13744 2822386 3134854 2907468 2899406 3116162 2580218 3015392 3071687 3039292 2836846 3100733
13734 3100733 2966828 2549914 2836590 2855130 2901348 2870883 2662581 2473590 2686265 2841085
13724 2841085 2509219 3291696 2655117 2675163 2632495 2650142 2735783 2754575 2650827 2498816
13714 2498816 2487872 2683475 2701771 2677188 2531425 2490450 2697529 2328334 2407248 2723104
13704 2723104 2757263 2532159 2454712 2488564 2358223 2557373 2557867 2247400 2458641 2157193
13694 2157193 2531655 2425044 2262158 2311450 2570822 2412451 2326700 2258457 2532767 2124270
13684B124270R7485k17172K72097M9318Q1806r8394j75725R5315j63029K7330
13674B093301R985j58209M59791l77533K1478Q5664m7709K83103m28603K11910
13664B153178k1712q9695j57367K38722k36459P0352k14619K77574K2047k42148
13654A799873N4258o4218J11750J44097r5741j26904J49915r3234L33344l67629
13644A845511p9357K43684j74743l3184L18263j3332R0382n4807k19429o8323
13634A854665k87837J33613K04909j7963j99099K53980p6604O4749K6255m45969
13624A510699K71541k17828J25073o559L52962k75109K17543k33422J83767l21802
13614A606865o3181Q7011L32128l35727m12298M77702j75054j63999K96611r1078
$$ plain form
13684 2124270 2221755 2004583 2276680 2325998 2407804 2309410 2133685 2229000 2065971 2093301
13674 2093301 2103286 1945077 2404868 2027335 2048813 2134477 2086768 2369871 1941268 2153178
13664 2153178 2131466 2041771 1884404 2123126 1886667 1957019 1742400 2019974 2042021 1799873
13654 1799873 1854131 1789913 1901663 2045760 1950019 1823115 1973030 1879796 2213140 1845511
13644 1845511 1766154 2009838 1835095 1801911 2120174 2106842 2197224 2142417 1922988 1854665
13634 1854665 1566828 1700441 1905350 1887387 1688288 1942268 1865664 1930413 1956668 1510699
13624 1510699 1782240 1564412 1689485 1682926 2035888 1760779 1978322 1744900 1928667 1606865
13614 1606865 1543684 1630695 1962823 1627096 1214798 1692500 1517446 1353447 1650058 1558980
13604A558980j02314R6886O8059J48352O0997K12392o22242R5102m678K20570
13594A732104j01430k5046n8492m21658L92641o0805j14535L5495K84344P270
13584A669888j97001J40101j89012M2592Q0703J99899n9104j85109l85844M98742
13574A615855j64865K38676o3274l77546N17512j96697q9608j31419J97667j3065
13564A533236l24891J42815j15688j08602K10138m4542o3521J69587L41319m55212
13554A284639j96153L58644l29756N30164k14292j50724M36188l90037j44719
13545A183954P32990o18441K6508P8939r8744J06366j67273J87914l34029L45439
13535A443623m22730M20621J46582l56138J26337J32477j76532j02258J59323
$$ plain form
13604 1558980 1456666 1553552 1621611 1769963 1830960 2043352 1421110 1516212 1511534 1732104
13594 1732104 1630674 1605628 1547136 1125478 1518119 1457314 1342779 1378274 1662618 1669888
13584 1669888 1472887 1612988 1423976 1466568 1547271 1747170 1688066 1502957 1117113 1615855
13574 1615855 1450990 1689666 1626392 1248846 1766358 1569661 1480053 1348634 1546301 1533236
13564 1533236 1208345 1351160 1235472 1126870 1337008 1292466 1228945 1398532 1739851 1284639
13554 1284639 1088486 1447130 1117374 1647538 1433246 1282522 1718710 1328673 1183954
13545 1183954 1916944 1298503 1325011 1403950 1305206 1411572 1244299 1432213 1098184 1443623
13535 1443623 1020893 1441514 1588096 1231958 1358295 1490772 1314240 1211982 1371305
13526A371305j79465R8837j56805K21145l78971L84318j15285L97342n43985O4546
13516A162982K32634m21191J56406j4947L27809m81349R5360J43333k59461K19583
13506A161159Q4336k71256O53266j22210l44372j2255Q811m1202l7928Q3770K13623
13495A375742m80450J02943M8380r2661K51641j01970Q4174j56993N68655l68835
13485A230626l9529k22808J29169k23582M79968n59737K88719k76644L28560K46966
13475A381708p1375J77469l68511j44753K8232K67926m7207l48641J61211O402
13465A042461J7691J57227m64038J73070l31686N24757l37621K63097L425n8541
13455I89842J05872p4266j93969J46876R2858M1192j0343j71237j54660j63170
$$ plain form
13526 1371305 1191840 1290677 1133872 1355017 976046 1360364 1245079 1642421 1098436 1162982
13516 1162982 1395616 974425 1130831 1115884 1443693 962344 1057704 1201037 941576 1161159
13506 1161159 1245495 974239 1627505 1505295 1160923 1148668 1157479 1116277 1078349 1162119 1375742
13495 1375742 895292 998235 1046615 953954 1205595 1103625 1187799 1030806 1599461 1230626
13485 1230626 1191097 968289 1097458 873876 1353844 794107 1082826 806182 1134742 1381708
13475 1381708 1310333 1487802 1119291 974538 1002770 1270696 1223489 874848 1036059 1042461
13465 1042461 1060152 1217379 753341 926411 594725 1119482 781861 1044958 1048383 989842
13455 989842 1095714 1021448 827479 974355 1067213 1108405 1098062 926825 772165 608995
13445F08995J67875L07037j90168j08090L19218j64911l15531L19630l3632R731
13435I20154K17244k74599P8684m07612N30461j96354j4050N2736N6823j76745
13425G86742L00664k30472N2924K72288O7057m74490J58051n3881J46320j91886
13415H33317k05734L69017j56973j47905M27851j82625k3591K54850E51499M75838
13405A027337k54379J34644M1813k794j27697J56730k54371m3410j58191l7301
13395D82381N31410l95164L35560l26458K53797N3384j20350M1364k9548m6112
13385G80264k38725M74182m4952l91639P8685K25070R1843k19678j24635M8633
13375F79048K03787j98102J14162l77154L02428K67340J14689j43914M1634k26372
$$ plain form
13445 608995 776870 1083907 893739 785649 1104867 939956 624425 944055 910423 920154
13435 920154 1137398 862799 941483 533871 1064332 867978 853928 906664 963487 786742
13425 786742 1087406 856934 909858 1182146 1249203 774713 932764 878883 1025203 833317
13415 833317 627583 996600 839627 691722 1119573 936948 913357 1168207 551499 1027337
13405 1027337 772958 907602 949415 946621 818924 975654 721283 677873 519682 482381
13395 482381 1013791 618627 954187 627729 881526 934910 814560 855924 826376 780264
13385 780264 541539 1015721 970769 579130 657815 882885 974728 755050 630415 679048
13375 679048 882835 684733 798895 421741 724169 991509 1106198 962284 1003918 777546
13365G77546j40867p3660L35498m04806N1536K79424j28031L5651r4307B80378
13354F15969M07264k21536k43407N67714j48689p2476k82359L87352k62913j25173
13344F21746k4365J68509C23109L43293K15791l36639j09112J57297J68151l60157
13334D01733O59779j49859j61201j79440J24381L01582D64599J35362J68845C57437
13323D05720K77880q9239J81504K7025k11216M54786D65676M70848q0691k32777
13313F23056k03926Q0964J4416r4188K29617K61271l84735K24258k52200l7271
13303D61262L25851j07250o5839j30948J95034k6628J74114N4406D16319o5386
13293C50933J69305K67185p2671B82176L06588B17819K27490J57561p3354J87329
$$ plain form
13365 777546 636679 563019 898517 493711 545247 824671 696640 732291 637984 280378
13354 615969 1023233 801697 558290 1126004 977315 904839 622480 1009832 746919 621746
13344 621746 597381 765890 323109 666402 882193 545554 436442 593739 761890 401733
13334 401733 1061512 911653 750452 571012 695393 996975 464599 599961 768806 357437
13323 405720 683600 594361 775865 802890 591674 1046460 465676 936524 855833 623056
13313 623056 419130 500094 514510 420322 649939 911210 526475 750733 498533 461262
13303 461262 787113 679863 614024 483076 678110 651482 825596 880002 416319 350933
13293 350933 520238 787423 714752 282176 588764 217819 445309 602870 529516 716845
13283G16845J8512j14767K8630j53273A70648K97014K09128Q4216j80555l0726
13273E49725j64053L75882M7542B68766L19228k83715L31269j13927j2346K55064
13263G64339l09453N3086j5891K25971K88181m60721N6072J29438l49337L73390
13253G55075M8212l49580q6062H3942N60524B65200J73738J09158J75900K1709
13243G45705L403l33944J71146R8790J31261j60950l14734M19706l11434R0948
13233E39897j9355J29571o6859j88057N33478m09897p0414L26386B08036K92806
13223E00842B18901J75978j4761k5972K88868K5456p6272R5256n1501J05768M6039
13212G87760C42272J82208N97L6370P1672p705j23284A76622K09854K93708n7698
$$ plain form
13283 716845 735357 620590 649220 495947 170648 467662 676790 761006 580451 549725
13273 549725 385672 761554 809096 268766 587994 304279 635548 521621 509275 764339
13263 764339 454886 507972 492081 718052 1006233 545512 601584 731022 381685 755075
13253 755075 803287 453707 367645 83942 644466 265200 438938 548096 723996 745705
13243 745705 749108 415164 586310 685100 816361 655411 340677 760383 448949 539897
13233 539897 520542 650113 583254 395197 928675 518778 448364 774750 208036 500842
13223 500842 218901 394879 380118 354146 643014 668470 592198 687454 635953 741721 787760
13212 787760 342272 524480 525077 561447 633119 625414 502130 176622 386476 680184 622486
13201F22486j63484j9630j18976L04639k98647N9126j56011J18859M03078l35994
13191D15446j41017J50404O3729j32607K75749j45048o8904r841J85687j333k39834
13180C52431K00681J49276A80177M36373J22096l05727r1109L48827r6647J8389
13170F12379R704C00029L0267G8293K91268A63727K21829L1054r3683J05005q4992
13159C42940l0609q5727K16612j9381L80689j61373j00907J14383k44738r6015
13149C15874J40108M5582j63647K84315k88248K03384j78945J95598o9740H2323
13138C81715M3427L7759Q4720j11353n3610L49044A75297L13788j54647J71754
13128E06192A73446K58724A15607J03877r460N57622C41641M21J86340B61396
$$ plain form
13201 622486 459002 439372 320396 625035 326388 385514 229503 348362 751440 415446
13191 415446 274429 424833 488562 355955 631704 486656 417752 407911 593598 592265 352431
13180 352431 553112 702388 180177 616550 738646 432919 341810 690637 593990 612379
13170 612379 622083 300029 330296 78293 369561 163727 385556 416610 322927 427932 342940
13159 342940 312331 226604 443216 423835 804524 643151 542244 656627 411889 315874
13149 315874 455982 501564 337917 622232 333984 537368 358423 554021 484281 82323
13138 381715 425142 462901 547621 436268 382658 731702 175297 489085 334438 506192
13128 506192 173446 432170 115607 219484 210024 767646 341641 342062 528402 261396
13117D77698K41327j68163j67230A46669J93494L0377O7509L21253j36337l02087
13107C20878r1319K6620K02137A02259J26761J04764P9756j18043J07749J63112
13097E66358k14223A34731J96958J44709A10888K06217O8700q7418M6327Q4858
13087D29572F0770M90953j34666r494J25838j65599k3187K66727B20073K9005
13077B49078L52725k17450j73568K10166J66924r9014j82527Q3303j21227K038
13067B70448O6527L41835k54859j97300N3376J61548J02302B53205J99375j73185
13057B79395H2413K51493q6071Q8867O619K36209B35264o0012N5547J58284o7057
13046C22026J38511q3466j080D4695J84681J90684k712B06664P5037A20807L02060
$$ plain form
13117 477698 719025 550862 383632 146669 340163 370540 438049 759302 622965 320878
13107 320878 229559 256179 458316 102259 229020 333784 413540 295497 403246 566358
13097 566358 352135 134731 331689 476398 110888 317105 385805 298387 344714 429572
13087 429572 60770 551723 417057 407563 533401 367802 344615 611342 220073 249078
13077 249078 601803 384353 210785 420951 587875 488861 306334 389637 268410 270448
13067 270448 336975 678810 423951 226651 280027 441575 543877 253205 452580 279395
13057 279395 82413 333906 247835 336702 343321 579530 235264 175252 230799 389083 322026
13046 322026 460537 377071 375991 44695 229376 420060 417348 206664 281701 120807 422867
13035D22867J04061k36156b0335C30043n7596A00142K37536A56161K26630m7224
13025C35567K30995o0186j58136a88D06088j13853P7096A58018L18499j86269
13015B90248J30430j01698Q2464j5647L3544r927I3375L96729j39821r5005B6156
13003D86349A59626K39809P5304j58699A38582M9240L8764L6817n3347K90915
12993E00971k09944J63323K2683j02518I7347J3858J46014q012J01018E9622Q9889
12982A49511J68442I3242J65228L7363M80151G8130J8848r186M7387J63156A004
12970F3317M78147G815K76276o6085o7554P8770J85916d0280B60277P8732K76212
12959F15221B28132C8795R4613A4489J40732L5106J49524l1646R0316J47525j54997
$$ plain form
13035 422867 526928 290772 -20335 330043 272447 100142 337678 156161 382791 335567
13025 335567 566562 506376 348240 -188 406088 292235 369331 158018 476517 290248
13015 290248 420678 318980 401444 385797 419341 409414 93375 490104 350283 255278 26156
13003 486349 159626 399435 474739 316040 138582 187822 226586 263403 210056 500971
12993 500971 291027 454350 477033 374515 97347 111205 257219 249207 350225 59622 149511
12982 149511 317953 93242 258470 295833 775984 78130 96978 87792 135179 298335 1004
12970 63317 541464 7815 284091 218006 150452 229222 415138 -40280 260277 339009 615221
12959 615221 228132 38795 133408 14489 155221 190327 339851 308205 398521 546046 391049
12948C91049G0045Q2750L21484A87627j7214a94796I1294N41723B71862K10173
12938D82035H383J99523B5263K41677A14456M64804k27881n157J5656j46196J70690
12927C86372K53990F8620L15608B9365J80759l4841P1382l403J41775q7046N7692
12916C55683A21338J2996O0222R6118o9508R137j11835J19164L0409K33769B41412
12904B91181r3k8145A31434K90926C9056J55517K85037A68325n3388c6321I0338
12892C80845I6040Q6677a2888A39593K02372a53048D82282j66554b34514F8665
12881C34862A56156n6138K83493n0184N5160j00744j12246D2770K56656l2039
12871B67387p3774K84873B5139K14288q4099J03018j19982L84230j58481J09525
$$ plain form
12948 391049 70045 152795 474279 187627 170413 -194796 91294 633017 271862 482035
12938 482035 8383 207906 25263 266940 114456 579260 351379 346222 361878 215682 386372
12927 386372 640362 68620 384228 29365 210124 175283 246665 243262 385037 297991 355683
12916 355683 121338 134334 194556 290674 221166 230303 118468 237632 268041 501810 241412
12904 291181 291088 262943 131434 422360 39056 194573 479610 168325 114937 -36321 90338
12892 380845 96040 182717 -12888 139593 341965 -153048 482282 315728 -234514 68665
12881 334862 156156 100018 383511 333327 388487 287743 175497 42770 299426 267387
12871 267387 193613 478486 25139 239427 155328 258346 138364 522594 364113 473638
12861D73638K5518a40317F8624J5360J66819L52924A33512k8761L454K39728j10764
12850B37169a01157B21750J65006j71674N26619A13426e6116B79165K8417H4889
12839C40574O7690l1091j14641K21080k34565J01401d3221l1546B27658n2994
12829A74664L07146G9519L9192n5069L93297h5653B15294k0393M2007L22591A76594
12817a01480C6663L56929A85949B973a51903A47547C4828e0704C01222A35973
12806A81519k2180J31470J3491A06048M02410e7231D35988J7747r5960L9294a4750
12794B75785r5679q7512B4899J25408E4553a09754C27581J16503l6263j31148
12784B76673q2602J13544q5858J33928K07008k35155A23276K04394j11231E7917
$$ plain form
12861 473638 499156 -140317 68624 83984 250803 603727 133512 104751 108205 347933 237169
12850 237169 -101157 221750 386756 215082 741701 113426 -56116 279165 307582 84889
12839 340574 408264 377173 262532 483612 249047 350448 -43221 -74767 227658 174664
12829 174664 481810 79519 118711 63642 456939 -85653 215294 194901 236908 559499 176594
12817 -101480 36663 393592 185949 2973 -151903 147547 34828 -50704 301222 135973
12806 181519 159339 290809 304300 106048 508458 -57231 435988 453735 357775 397069 -14750
12794 275785 180106 92594 24899 150307 54553 -109754 327581 444084 407821 276673
12784 276673 194071 307615 221757 355685 562693 327538 123276 327670 216439 57917
12773A93825l339K5047j02428l277L30697B10978e6167H7421J47438p7810L92108
12762E49157d1436A11900J25516o4755b1693I7910J08779d4495B17496m0965A8566
12750D562K38830d8422h564j03563d0894C1997J58205l6015J32099G1655b26429
12738B61676C8586J52605M6868J17421p0430p6832c4775B07873C8889O03597a26668
12726g5827D34645A68767J26159k5567D0177a47633L1596B55030j25599J9034
12716A48465L1235J79213j48011D6947K04789K00305j70273Q4008p9639h2366
12705A0175a30704B17654N6295h1930F4529K22299R3454d5084F01360A55026J56691
12694C11717p2306m1042I0425K91278b92772C82184j8257G0097Q1212K48553r5179
$$ plain form
12773 193825 190486 215533 113105 109828 440525 210978 -56167 87421 234859 157049 549157
12762 549157 -41436 111900 237416 172661 -21693 97910 206689 -44495 217496 176531 18566
12750 4562 243392 -48422 -8564 -112127 -40894 31997 190202 154187 286286 71655 -226429
12738 261676 38586 191191 238059 355480 285050 208218 -34775 207873 38889 642486 -126668
12726 -75827 434645 168767 294926 269359 40177 -147633 -116037 255030 129431 148465
12716 148465 179700 358913 210902 46947 251736 452041 281768 365776 286137 -82366
12705 10175 -130704 217654 273949 -81930 64529 286828 380282 -45084 601360 155026 311717
12694 311717 239411 198369 90425 381703 -292772 382184 363927 70097 151309 399862 304683
12683C04683p2487L6351F2513Q6219K25135K63350k33189A54571a17924A76917
12672D39279j73607f1526a9063A03025b34041B8640a100A72432a12214C85686
12661I295N74518A42086J87764j38227R0649L10790p1894j16532b5973A64427
12650B3440L50021L11234j17128J02003B70461K17454k42015D9887J23510B6548
12639I8001K99108r5923A22532J30038b33196D01556A87843L3034j0498C6428
12628B82333d3377A25445L09659j24821f6484C84349I7376A4492M9865J12750
12618A77107n7327R0384P910J89317j37367j16694k5918K58048a9589C40812A65860
12606D03448E9283L26386L2640j26345A01094J08214P5401g9042C75149A28420
$$ plain form
12683 304683 232196 268547 62513 148732 373867 637217 404028 154571 -117924 176917
12672 439279 265672 -61526 -19063 103025 -234041 28640 -1100 172432 -112214 385686
12661 9295 583813 142086 329850 191623 282272 593062 521168 404636 -25973 164427
12650 23440 373461 684695 567567 669570 270461 487915 245900 49887 173397 26548
12639 98001 397109 301186 122532 252570 -233196 401556 187843 220877 210379 36428
12628 282333 -43377 125445 435104 310283 -66484 384349 97376 14492 64357 177107
12618 177107 119780 210164 218074 407391 270024 153330 127412 385460 -19589 340812 165860
12606 403448 59283 385669 418309 291964 101094 209308 284709 -79042 375149 128420
12595C96354a67234j5932D61781a62308C92994a63946f6473l67923C92321A64525
12584f6518A40980a43222F0792J52244n0176a27179B92356n9782Q1801g4686A66320
12572H868M09529d2964H2313j5830M40991I6582L43870r5382A10421L30960p1436
12561C69945d9204E6619b34225A90110J333a82331D34619B03911R8552q49C4640
12549B36161e4295B97252A17052B7151R5635K44856r3592h2179A63339N0301L9182
12538B52822p1355K79027E2507i7154A31154A2235b8373B29468a6355G6264b33473
12526F9962J56084L47857A93144b43534D54681a27537B95763a10925A35533J11863
12516B47396J10132A68564j0588L12893A44471C4165d8751C01832B7907R0107
$$ plain form
12595 396354 -167234 -183166 461781 -162308 392994 -163946 -66473 -434396 392321 164525
12584 -66518 140980 -143222 60792 213036 162860 -127179 292356 232574 314375 -74686 166320
12572 8868 418397 -42964 82313 66483 507474 96582 440452 345070 110421 441381 369945
12561 369945 -49204 56619 -234225 190110 191443 -182331 434619 203911 302463 301614 34640
12549 236161 -54295 297252 117052 27151 122786 367642 274050 -82179 163339 213640 252822
12538 252822 181467 460494 52507 -97154 131154 12235 -28373 229468 -16355 76264 -233473
12526 69962 226046 573903 193144 -243534 454681 -127537 295763 -110925 135533 247396
12516 247396 357528 168564 157976 470869 144471 34165 -48751 301832 27907 118014
12506A18014h0457A75705H2360e6918B66947N0632j38848b72029F9318M2044K71857
12495C83219a00559a00D5717k33j3766a52530d7025A598b2361B92036j17067E3482
12482A22081L50690r1635b38461f876B61847b56275F1388q837K59326A4508J31867
12471A46375N8620B6429J90420i4598k1539A01666Q254J29368n7402J79218b55324
12459A32066J47352o1075P0463a1900F1864L38682a6874B04275l7989L5232q1553
12448A19965Q040d07917B85605a42856A93543K97115a22343C46397N3715A97156
12437A62139F9135M90456A77470J37518H5935A8841L51179A20349b5016B12282
12426F11368A65901L32637A14915J3146K46250A10881n0015J8635j0890c16101
$$ plain form
12506 118014 -80457 175705 82360 -56918 266947 317579 178731 -272029 69318 111362 383219
12495 383219 -100559 -100 45717 45484 31718 -152530 -47025 1598 -22361 292036 174969 53482
12482 122081 472771 381136 -238461 -6876 261847 -256275 61388 52551 311877 14508 146375
12471 146375 204995 26429 216849 -94598 -116137 101666 109920 239288 181886 361104 -255324
12459 132066 279418 218343 288806 -11900 61864 400546 -16874 204275 166286 201518 119965
12448 119965 128005 -407917 285605 -142856 193543 490658 -122343 346397 400112 197156
12437 162139 69135 559591 177470 314988 85935 18841 370020 120349 -25016 212282
12426 611368 165901 498538 114915 128061 374311 110881 60866 79501 68611 -316101
12415a20951D0747g7943c8554A24469K16101q9739E3307J83048j03269J9565a71790
12403D8437b38112F7919J42325A9931e0436I0700m2661J72133B2038e0142q5456
12392a35598F0229d2998C24979I8090a42769C34307p7342A02702D2272B185O1092
12381F3277J85266A1782b43281B97437a88404B08045j988B988N4710J28579n2964
12370A33313a88028j27625A04710P0933a21761B7134P4201b7601m2730C22288
12359A72331a3580A36886a7778A89367F4749J45801C7507J75827m6598P6970A21765
12347E326M903G40J47963n7504K0016e7426B09379h3168C13004E9638Q357l0565
12335C7430h0483A80192a3406B14840o3352a1502B20322C7342c04218B52964j20795
$$ plain form
12415 -120951 40747 -77943 -38554 124469 340570 250831 53307 236355 133086 152651 -171790
12403 48437 -238112 67919 210244 19931 -50436 90700 48039 220172 22038 -50142 -135598
12392 -135598 60229 -42998 324979 98090 -142769 334307 256965 102702 42272 2185 63277
12381 63277 248543 11782 -243281 297437 -188404 208045 206057 2988 57698 186277 133313
12370 133313 -188028 -315653 104710 175643 -121761 27134 101335 -27601 -70331 322288
12359 172331 -13580 136886 -17778 189367 64749 210550 37507 213334 166736 243706 121765
12347 5326 10229 740 148703 91199 111215 -57426 209379 -83168 313004 59638 67995 37430
12335 37430 -80483 180192 -13406 214840 151488 -11502 220322 37342 -304218 252964 132169
12324A32169a2560m3191E5947A836Q2606b17345M6645A67680G760e9836G5081
12312C67210b25595I1802L06637f1438E4492K63035a0921p1290r6280b3259B20028
12300A6796b64004B64892B9222a59909q9762k31254C14652K6362a9304n9305b132
12288B58061c2985D5960K02706c13543O3839B32834h4367A28193L30789j35066
12278C23916g0302I07c14096B02449d186C9954a45204A91588o0812N5709K3412
12267B09897H6981J5645b996j36695F54062A33048M6359e3486A87165d6631A78185
12255c18866D1991J84289b19632A4307J71339J70749A70885K70306a09580E4479
12244f2479F3990a1655B71580j30413R7606o7775C9317J27491b1407j3497I4188
$$ plain form
12324 132169 -12560 -55751 55947 1836 84442 -217345 -170700 167680 7760 -59836 75081
12312 367210 -225595 91802 398439 -61438 54492 317527 -10921 -82211 -178491 -23259 220028
12300 16796 -264004 264892 29222 -159909 -249671 -480925 314652 341014 -19304 -78609 -2132
12288 258061 -32985 45960 248666 -313543 -249704 232834 -84367 128193 458982 323916
12278 323916 -70302 907 -314096 202449 -4186 39954 -145204 191588 130776 186485 209897
12267 209897 86981 102626 -2996 -139691 654062 133048 179407 -53486 187165 -46631 178185
12255 -318866 41991 226280 -219632 14307 185646 356395 170885 441191 -109580 54479
12244 -62479 63990 -11655 271580 141167 238773 170998 39317 166808 -21407 -34904 94188
12232i9177A71463a17164B61447a25737A22060K1257g7304j07755A6086a15959
12221A63585p2904K01871q5234B9819K44048m3768c49617I766c15768h8680M16
12210h8264B87086e0570a2655B00244f4841j75801b5240A07175a77141E3431J07540
12199A60971p3017J76714f4314o2027N749p128C3973J46728a7097l1919J1531
12188c7485I8149e9174H7030k2169a32829N1497A84514J70800b52111E2825f1553
12176a83340j07045a22820c5506n09383F2034J65687i268B76050j34442a74907
12165G5956b44370A5016Q5263i811D2182a13064k6953G7627j7030a91858H2548
12153a71563e4108A45892b392B2612J37691K06955a74726A5135M7828b01815d8001
$$ plain form
12232 -99177 171463 -117164 261447 -125737 122060 143317 -77304 -185059 16086 -115959
12221 163585 90681 292552 207318 29819 273867 230099 -349617 9766 -315768 -88680 -88264
12210 -88264 287086 -50570 -12655 200244 -64841 -240642 -25240 107175 -177141 53431 160971
12199 160971 87954 264668 -64314 -126341 -120592 -127720 33973 180701 -17097 -49016 -37485
12188 -37485 98149 -59174 87030 64861 -132829 -81332 184514 355314 -252111 52825 -61553
12176 -183340 -290385 -122820 -35506 -544889 62034 227721 -9268 276050 141608 -174907
12165 75956 -244370 15016 100279 -9811 42182 -113064 -140017 77627 60597 -191858 82548
12153 -171563 -54108 145892 -2392 22612 160303 367258 -174726 15135 62963 -201815 -48001
12141B8556P9528i061C80786g5485j41657g8359C17136d1589f008A68590k2232
12130A46358l5414K89830a56492d6422l2037B35079j3799F6043B0761a44181J6406
12119a27775H0559f2796A16036n3342R3153o0067r870a06031C38715j20085n4725
12108A63905a5591k37204a9894B21791b7673A54253J92802q0217c5767l36120
12098c71887A45696G2440Q5319p1557i6554B5401O6140J19034C0346b36116C8955
12086C1603J0168I605f0076j89869R9800A48484J12271a99166h4366A71297c2307
12074C62462j64134Q2810A07861a40710q6861i926A91331h5899J6973j99773C8904
12062A36159a10222a8493A92950k3042m524l2733J26200L42081D2567b2032A5480
$$ plain form
12141 28556 108084 -9061 380786 -75485 -217142 -78359 317136 -41589 -6008 168590 146358
12130 146358 110944 400774 -156492 -46422 -78459 235079 221280 66043 20761 -144181 -127775
12119 -127775 80559 -62796 116036 62694 155847 95780 85910 -106031 338715 218630 163905
12108 163905 -15591 -252795 -19894 221791 -27673 154253 347055 266838 -35767 -371887
12098 -371887 145696 72440 157759 86202 -96554 25401 91541 210575 30346 -236116 38955
12086 31603 41771 9605 -60076 -249945 -150145 148484 260755 -199166 -84366 171297 -32307
12074 362462 198328 281138 107861 -140710 -227571 -9926 191331 -85899 -68926 -268699 38904
12062 136159 -110222 -18493 192950 169908 165384 132651 258851 600932 42567 -22032 15480
12050A8089a81643H4029b88129C00850b02832k57482B73659B9048J57125b38040
12039C72176e4812C02286A43382b31011O8841B75309L6999n0636a96440d5383
12028a00076B34268E1172b24427E6230a12616a9976B6414a38326k6613A137d2082
12016B15578I0466i8580B0441J04713c10525N8271f5139C02468J192H9663K9140
12005A18803Q2874K375l6239O228D6379b2972B85973j1700f2056A03031a40232
11993B85732b96716Q429C03724A23180Q8573b22182j94826g1838A68177b56170
11982A2260a00574b1646D8705a14881B66258b3992A52255a51393j4186c095D5464
11970a16622M8608C2524r616K67802c8731a8446I5447b6006j0558E7006J93232
$$ plain form
12050 18089 -181643 84029 -288129 300850 -202832 -460314 273659 29048 186173 -238040
12039 372176 -54812 302286 143382 -231011 -162170 275309 312308 261672 -196440 -45383
12028 -100076 234268 51172 -224427 56230 -112616 -19976 26414 -138326 -164939 1137 -42082
12016 215578 90466 -98580 20441 125154 -310525 -252254 -65139 302468 303660 89663 118803
12005 118803 201677 204052 167813 174041 46379 -22972 285973 274273 -62056 103031 -140232
11993 285732 -296716 -288287 303724 123180 211753 -222182 -417008 -71838 168177 -256170
11982 12260 -100574 -21646 48705 -114881 266258 -23992 152255 -151393 -165579 -3095 45464
11970 -116622 -68014 32524 22908 290710 -38731 -18446 95447 -26006 -36564 57006 250238
11959B50238c3862B68914r6305j2865Q3475k9057J2595a72926K0836l19881b28102
11947a24590D16938D7743a44178A34622k4532i7760L5093j92000K2514D837K60138
11936B64975n7633M5642e4268j78453C23991a49382D01859f8397A67149H3125
11925g6221A7375i9599A77030j1866A2746O3762a47332q528B918M13482A19847
11913a07333A24321b2275k41589d0573B5482J34880j1410M1462b27157B00586
11902a1593n8627A4139Q8974k3217a28001M6298j53571o0512J33663b6885n6416
11891h3301B97275e2452A49740b58297a07177m8061B12046a64250A32885A9846
11880e6047F1278g8906A54083a39653H2007i6163l2721A35891K2867a962j17462
$$ plain form
11959 250238 -33862 268914 172609 159744 243219 214162 226757 -172926 -152090 -471971 -228102
11947 -124590 416938 47743 -144178 134622 110090 -97760 -62667 -254667 -232153 4837 264975
11936 264975 207342 252984 -54268 -232721 323991 -149382 401859 -68397 167149 83125
11925 -76221 17375 -99599 177030 165164 12746 76508 -147332 -155860 2918 416400 119847
11913 -107333 124321 -22275 -263864 -40573 25482 160362 148952 190414 -227157 200586
11902 -11593 -70220 14139 103113 79896 -128001 -81703 -235274 -295786 -162123 -26885 -83301
11891 -83301 297275 -52452 149740 -258297 -107177 -155238 212046 -164250 132885 19846
11880 -56047 61278 -78906 154083 -139653 82007 -96163 -128884 135891 158758 -1962 -119424
11869a19424B2497a44652A26270C5669b1478q3645d5501j99633G1946a5009I8229
11857D2428b27126h7712k04042B28148C0365a18353C61331C4942b42211B14345
11846A37894C6870J60098J4639I6685a61462A9605a32347A82450N6079b30951
11835A42101a62774C67192A27114l6524c44030C01978f5930j73279N6119A63207
11824B32772j6749e8886A50026d3044Q29q623A95041a22096K3972e80F0190c0721
11811b86362a30259A2553J12106a39443A99741b0030C5130K13224B6144a27305
11800c30368k6130E36739c50125B73846a95515O1117f2436o1787G9663a51160
11789i2666j90745D13682C1426K9714P176j3174a08795j27774M7785Q4539j6390
$$ plain form
11869 -119424 22497 -144652 126270 35669 -21478 -105123 -45501 -245134 71946 -15009 98229
11857 42428 -227126 -87712 -291754 228148 30365 -118353 361331 34942 -242211 214345
11846 137894 36870 196968 211607 96685 -161462 19605 -132347 182450 238529 -230951
11835 142101 -162774 367192 127114 90590 -344030 301978 -65930 -239209 -183090 163207
11824 232772 216023 -58886 150026 -43044 -42215 -50838 195041 -122096 -98124 -580 60190 -30721
11811 -286362 -130259 12553 124659 -139443 199741 -20030 35130 248354 26144 -127305
11800 -330368 -356498 536739 -350125 273846 -195515 -134398 -62436 -124223 79663 -151160
11789 -92666 -283411 413682 31426 61140 68316 55142 -108795 -236569 -188784 -104245 -120635
11778a20635j20070j6022a04766G3808K40368C0734K26358r1017n973a53092j69751
11767c22843J55559O548B7006O900J11665h4705k09380a4080D6071J75218H5322
11755A50745l3593A8474M3145d7920l49585A24952P6471a3634C06883a04056I6742
11743B6023L30571i9726A73764o748g9724B7565a07084e1640B8523a51039j3987
11732a65026G1724F27a62209B25407I1082b4509B81604f1007j52330Q3660I4671
11720a82305a9323A51432J27522f5433B70684A03926n1375K67777a41123n3572
11710a94695A26443h3315D93454j88393r713a18014A28461L253h4557L1505A53704
11698C3086K42969g7076r4001A15686a42558G1084f3077k1420A264J63737L2334
$$ plain form
11778 -120635 -240705 -256727 -104766 73808 314176 30734 257092 166075 160102 -153092 -322843
11767 -322843 -167284 -160736 27006 33906 145571 -84705 -294085 -14080 46071 221289 85322
11755 150745 117152 18474 61619 -47920 -397505 124952 201423 -13634 306883 -104056 96742
11743 26023 356594 -99726 173764 167016 -79724 27565 -107084 -51640 28523 -151039 -165026
11732 -165026 71724 627 -162209 225407 91082 -24509 281604 -61007 -213337 -129677 94671
11720 -182305 -19323 151432 278954 -65433 270684 103926 52551 320328 -141123 -194695
11710 -194695 126443 -83315 493454 305061 295348 -118014 128461 131714 -84557 -53052 153704
11698 33086 276055 -77076 -171077 115686 -142558 71084 -63077 -84497 1264 165001 197335
11687A97335l4398b4975j14370a9201j82721B87227I9562d3849A2634J48539M9574
11676B10747E5592c65381C86288c3054j40223q8024c3677j18618F20369a85402
11665b00584B986d6294C11316a27702k9887B22760c02200f8905A19008c49782
11654A80271p9385Q1758E8983L1874c7719C35361j39005C8922L9662a32051B9445
11642A86461p6446a44441d0469B23410c0174B42543a02720A93895b55158R9171
11632a55987E2587a34955H7816a62360A07180e1169k42958A16792a27724e0952
11621b18777P8673j80261F3771M6923c4722q0609j9667C00117j49849J02745c06667
11609A7862J13f8347G5034g4819k5454k1973L5737a0435j95505Q0620C6486a54549
$$ plain form
11687 197335 162937 -24975 -139345 -19201 -201922 287227 99562 -43849 12634 161173 210747
11676 210747 55592 -365381 386288 -33054 -173277 -261301 -33677 -152295 620369 -185402
11665 -200584 2986 -46294 311316 -127702 -157589 222760 -302200 -68905 119008 -349782
11654 180271 100886 182644 58983 90857 -37719 335361 196356 38922 78584 -132051 29445
11642 186461 110015 -144441 -40469 223410 -30174 242543 -102720 193895 -255158 -155987
11632 -155987 52587 -134955 87816 -162360 107180 -51169 -294127 116792 -127724 -50952
11621 -218777 -140104 -320365 63771 110694 -34722 -115331 -134998 300117 150268 253013 -306667
11609 17862 17975 -68347 75034 -74819 -100273 -122246 -86509 -10435 -205940 -125320 36486 -154549
11596a41322M7462H1840d5964j1444k35090m2671a08580F7844g5080n2796j10346
11585b38222A13996B2757f1720G5255C3422c51297A84216P2613a07101l5771F289
11573B44830I1466N2030a58773O8099A21234h6527j39537B38998d2855A48931
11562I0964J95378m4511j02232P6015M5893A13193a21774k44496g8298l1718B81442
11550a82409B5483R3314b15914I4567O6964b9269l36212F5955K31903a95311B14199
11538F9021K69990A46474J19908j20038A8422J06915g5172j65065c5159j27933
11528a63092G8678c36621B21814a69523j59850J59241Q1421c0507G5558J12287
11518A87845J41795b06220K2482A44010B771J59418B9864a81662b4150p989A13741
$$ plain form
11596 -141322 -93860 81840 -45964 -57408 -292498 -335169 -108580 67844 -75080 -127876 -238222
11585 -238222 113996 22757 -61720 75255 33422 -351297 184216 256829 -107101 -142872 6289
11573 244830 91466 143496 -158773 -90674 121234 -86527 -226064 238998 -42855 148931
11562 90964 286342 241831 139599 215614 261507 113193 -121774 -366270 -78298 -110016 281442
11550 -182409 25483 118797 -215914 94567 161531 -29269 -365481 65955 297858 -195311 214199
11538 69021 339011 146474 266382 146344 18422 125337 -75172 -240237 -35159 -163092
11528 -163092 78678 -336621 221814 -169523 -329373 -170132 -88711 -30507 75558 187845
11518 187845 329640 -206220 -183738 144010 2771 162189 29864 -181662 -24150 -32139 113741
11506a52053p8828a1464j14189c7999m9915J9194A27796B3100a34676C4738b9401
11494A52564L58114b95391c478p6968I5336b70762a9149p5097A93673b21586r8346
11483c19932a06171D0118a86854J7351k43149R2307d1113k6612j87418a8514A07263
11471c39837O3282B19724r9673l5533g807A32218a27468j26152j63777A28604
11460F2753b03836A11503b57689H8531J25513c51813A09072a71329M7346O1699
11450f2284K2952G4083b5685E9544L4724a74298O8319A90556m5456D0573J30727
11439A71300b34618J09099G6575K10964A1712a35971B82804i4091B40538C0199
11428G9417a48473e9139a174l14081b2180k07014f6533j55032I2613g1339B01768
$$ plain form
11506 -152053 -230881 -11464 -125653 -37999 -87914 -68720 127796 23100 -134676 34738 -29401
11494 152564 510678 -295391 -3478 -80446 95336 -270762 -19149 -94246 193673 -221586 -319932
11483 -319932 -106171 40118 -186854 -169503 -412652 -320345 -41113 -67725 -255143 -18514 107263
11471 -339837 -276555 219724 120051 84518 -7807 132218 -127468 -253620 -417397 128604
11460 62753 -203836 111503 -257689 88531 214044 -351813 109072 -171329 -123983 -62284
11450 -62284 -39332 74083 -25685 59544 94268 -174298 -105979 190556 145100 40573 171300
11439 171300 -234618 -125519 76575 287539 11712 -135971 282804 -94091 240538 30199
11428 79417 -148473 -59139 -1174 -315255 -22180 -229194 -66533 -221565 92613 -71339 201768
11416b04688B14768a51462G6480P777R7576d8458l1370j68779i3756k47392B05692
11404A62779O6315a28441M7021A33699c9833k03124R1354A33972C490a13552A69395
11392B48488f9672J1779E9337J53484E4518B2673b09590J01805d0941F1378N4989
11381A16367f0610j72496F141a39837E8125b38291k8786A85156I759J65421c1275
11369F331O0933O2987A3457J4023Q8208f0956l41814D8126b19048a08638A07977
11357C46679F1668J82115A9089M7624b71627B51068b4074B48374B6920a22334
11346b51782M873R0354A93985i6877q2877B0689b66036J30547p3579Q1599B7940
11334e0802C2102d9922B23057j06014l2696J26813a29165c1143C8962J73489c3714
$$ plain form
11416 -204688 214768 -151462 76480 84257 181833 -48458 -79828 -248607 -93756 -341148 205692
11404 162779 229094 -128441 -81420 133699 -39833 -242957 -151603 133972 3490 -113552 169395
11392 248488 -69672 -57893 59337 212821 54518 22673 -209590 -107785 -40941 61378 116367
11381 116367 -60610 -233106 6141 -139837 58125 -238291 -267077 185156 9759 175180 -31275
11369 6331 67264 130251 13457 27480 115688 -60956 -402770 48126 -219048 -108638 107977
11357 346679 61668 243783 19089 66713 -271627 251068 -24074 248374 26920 -122334
11346 -251782 -246909 -156555 193985 -96877 -179754 20689 -266036 -135489 -209068 -127469 27940
11334 -50802 32102 -49922 223057 117043 84347 211160 -129165 -31143 38962 212451 -33714
11322G1002A741J25359j0583M3332k6077b25785b5302A53804l7814c2791j27728
11311a60519C52768g4694j54916r5250d5075o5734b3638j16518G6749B7642b08502
11299a46818A53426J14990b92923n240f5298G721J30909a48261A01694L9289K81821
11288D22804a75250O698j10360a23620j4016f6880j21217D0713d23773a42457
11277F1203J5252K74979F7623e601j93677K2402Q7540A27180Q3505A8553K33261
11266B51814a29369m8772N5210N6448j1742A21136D7393b87177f2623D6870J2299
11255E9169d4051j59544c9722A38515M1595a1234q9330B16450a50980E9934a45388
11243a9542C25307G4408K05700g958j97753M0509k61644A44174J91158f1508o6712
$$ plain form
11322 71002 1741 127100 116517 159849 133772 -225785 -25302 153804 115990 -32791 -160519
11311 -160519 352768 -74694 -229610 -324860 -45075 -110809 -23638 -140156 76749 27642 -208502
11299 -146818 153426 268416 -292923 -298163 -65298 7721 138630 -148261 101694 140983 422804
11288 422804 -175250 -168552 -278912 -123620 -137636 -66880 -188097 40713 -423773 -142457
11277 61203 76455 351434 67623 -5601 -199278 -176876 -89336 127180 210685 18553 251814
11266 251814 -129369 -178141 -122931 -66483 -78225 121136 47393 -287177 -62623 46870 59169
11255 59169 -44051 -203595 -39722 138515 180110 -11234 -100564 216450 -150980 59934 -145388
11243 -19542 325307 74408 280108 -7958 -205711 -165202 -426846 144174 335332 -61508 -128220
11232a28220m332j13388B78323a43162o1922k8121a12658E7380c7465B25818a55894
11220f9313F3192b27467i4967B83113a14727n3482p6192F421a6741E9614f579
11208e8972k13229a16374A30238D3222h4415B58053A6760a4255k10832P9898m3159
11197a88348J8459A54544b2406r1097M5948j23979B36470a00377c8885A36868
11186f1113r0732O4233D4173A6322K47884B3526c60309a66474g8401m7558j81001
11175c06960c8139p545A95166l1760E284I96J59472a54718A88642E1618J22731
11164A74349A3536b74718k5582K6996e4266J0258i530b763j95386C7726J29593
11153A67319j5734L15377b05719A44188d331b152A3631K12062n867D3324B0931
$$ plain form
11232 -128220 -132552 -245940 278323 -143162 -205084 -233205 -112658 57380 -37465 225818 -155894
11220 -69313 63192 -227467 -94967 283113 -114727 -168209 -244401 6421 -16741 59614 -6579
11208 -58972 -272201 -116374 130238 43222 -84415 258053 16760 -14255 -225087 -145189 -188348
11197 -188348 -169889 154544 -22406 -113503 -67555 -191534 236470 -100377 -38885 136868
11186 -61113 -151845 -87612 44173 16322 264206 23526 -360309 -166474 -78401 -125959 -306960
11175 -306960 -38139 -45684 195166 163406 5284 996 160468 -154718 188642 51618 174349
11164 174349 13536 -274718 -300300 -273304 -54266 -44008 -9530 -2763 -198149 37726 167319
11153 167319 151585 466962 -205719 144188 -4331 -2152 13631 225693 219826 43324 20931
11141H0135g7924A01927i2961l1352N2088l21584A63988J22871I2967m1939a41979
11129G098c10657i9377B13300h2600C848K07973b32546N7457Q1006m364j08352
11118b06799E0618Q4285a42698g568l72865J02703q3283a17296n1073e8487C06546
11106a47416C49104b87109B20400l3703e20450b08249p4836B359i8044A81808
11095A91102e6880K1195J733l8784j11976A92714n5247d4012n2208B2456K85454
11084C07910J3885G8149a633k81339J5106C8194K37700C6279b18916R6035D9010
11072a40055B2735b2354j43602K7476C0089a04117o1330B2744P2442a42984e9509
11060a90814M2721C78763a03924A8168a6100k97734B60540p9395b6958B54396
$$ plain form
11141 80135 -77924 101927 -92961 -124313 -72225 -393809 163988 286859 92967 51028 -141979
11129 7098 -310657 -99377 213300 -82600 3848 211821 -232546 -175089 -94083 -98447 -206799
11118 -206799 50618 134903 -142698 -7568 -380433 -277730 -361013 -117296 -168369 -58487 306546
11106 -147416 349104 -287109 220400 186697 -520450 -208249 -283085 2359 -98044 181808
11095 191102 -56880 -35685 -33952 -72736 -184712 192714 137467 -44012 -96220 22456 307910
11084 307910 321795 78149 -1633 -282972 -267866 38194 275894 36279 -218916 -122881 49010
11072 -140055 22735 -22354 -165956 -138480 30089 -104117 -165447 22744 95186 -142984 -59509
11060 -190814 -148093 378763 -103924 18168 -16100 -313834 260540 181145 -26958 254396
11049C06235a70502P0212n3235A94254k0723a64655d2085r9849A25978a68344
11038C56668B0928d29489J52346g9682A11055b24699o3184B68268k2250e0598
11027a82748A42791a56708b0584j75921A39933a85910L4025k0769p5356A60703
11016A38203C1346N6229Q3232k6067a05345j12358H9099b16384C02116A21767
11005a35676e4325k56168A33603a39215B1349c07266B3297J59670a0980A94354
10994H2895b0844A22514F337f5799D52868a1791C65102H2317a47783L9574A41713
10982b8659A01115c43163a11812j64274g1167j78700a02994A65442K9752J11716
10972C06910a23957d9287a0322j4371g206l1918B00940d8255D6430a54973A13396
$$ plain form
11049 306235 -170502 -100290 -153525 194254 173531 -164655 -42085 -141934 125978 -168344
11038 356668 20928 -429489 -277143 -79682 111055 -224699 -287883 268268 246018 -50598
11027 -182748 142791 -156708 -20584 -196505 139933 -185910 -151885 -172654 -248010 160703
11016 138203 31346 87575 170807 144740 -105345 -217703 89099 -216384 302116 121767
11005 -135676 -54325 -310493 133603 -139215 21349 -307266 23297 182967 -10980 194354
10994 82895 -20844 122514 6337 -65799 452868 -11791 365102 82317 -147783 -108209 141713
10982 -28659 101115 -343163 -111812 -276086 -71167 -249867 -102994 165442 195194 306910
10972 306910 -123957 -49287 -10322 -24693 -7206 -39124 200940 -48255 46430 -154973 113396
10960b42160A16246b24651A18983c6789l39426O0825i4492l5630k25083A99316
10949c2644n0247m6818q4215A4341K8699a7969C1604h6774b9713o4421j4086j02480
10937b10700A37418D9090f1797I1735c72657c1230l75386B06428c95870E2462
10926c75659a65313K7989f6729j50269R1084A00168A4931Q0199C9941d3022J6685
10915b6337a2182D2977f7671J5288m0625i734k67160J24071M3735m2182D2192
10903A60813j177J87184A36534a20421M4705k3009k84659A23808b78114A25053
10892b07719F168a89547g7695j92556e9181n5470G4885Q1776F5360a4744f58B29675
10879B4704c7967B08332D4458b28662A03240a47046n0647C6535A5236a1827m17114
$$ plain form
10960 -242160 116246 -224651 118983 -36789 -376215 -315390 -94492 -130122 -355205 199316
10949 -32644 -82891 -129709 -213924 14341 43040 -17969 31604 -86774 -29713 -94134 -108220 -210700
10937 -210700 137418 49090 -61797 91735 -372657 -31230 -406616 206428 -395870 52462
10926 -375659 -165313 -137324 -66729 -216998 -125914 100168 14931 95130 39941 -43022 -26337
10915 -26337 -12182 42977 -67671 -52383 -93008 -9734 -276894 -152823 -109088 -151270 42192
10903 160813 159636 346820 136534 -120421 -75716 -98725 -383384 123808 -278114 125053
10892 -207719 6168 -189547 -77695 -270251 -59181 -114651 74885 156661 65360 -14744 -658 229675
10879 24704 -37967 208332 44458 -228662 103240 -147046 -197693 36535 15236 -11827 -428941
10868d28941A35871a83542A36956e8294A5852F160K1861I883P3779d2144j66333
10857b08477A27495b4372k37258F7656P991c25286N5706f4717A6984b12653a04512
10845B8806b35904c5509A4154n983M1340j3039c45913J56714D7152K33957l6640
10834B44469b53272E1473e4140m1597J2881j06218H7487j4923a35576j64920a14851
10822g7485A90462C2456Q7135b79073B45619a01065j62858B22108f0368A08859
10811a60424G6391K80993g3884j8204A12315N8841d6870A06683d8307A04194M6196
10800A50390a76689j20479q830R6339P9203A72760K2511J47382A53410b15253
10789a64069E8836J4775c0382A46135d5141A03709K196M5693F7650J58293C3692
$$ plain form
10868 -428941 135871 -183542 136956 -58294 15852 6160 28021 9883 83662 -42144 -208477
10857 -208477 127495 -24372 -261630 67656 75647 -325286 -269580 -64717 16984 -212653 -104512
10845 28806 -235904 -35509 14154 8171 49511 36472 -345913 -189199 47152 281109 244469
10834 244469 -253272 51473 -54140 -95737 -82856 -189074 87487 72564 -135576 -300496 -114851
10822 -77485 190462 32456 119591 -279073 245619 -101065 -263923 222108 -60368 108859
10811 -160424 76391 357384 -73884 -92088 112315 171156 -46870 106683 -48307 104194 150390
10800 150390 -176689 -297168 -305998 -209659 -130456 172760 195271 342653 153410 -215253
10789 -164069 58836 73611 -30382 146135 -45141 103709 105905 151598 67650 225943 33692
10777a84849N7725K228A22708a51981m50575b1152l7768a2746p5948p2761r760
10766a71215G2644c10837C414a36483c3955l95580a64868j34892B92706A8345
10755A04617b30746k6832C58188G9645i9784C6727P0335a51634j61592A74903
10744A42852b49706F9083d3210A60755d89774a15647F3835a28006k08503i8303
10733A48933a83984H594c2272m3290k8927a7412j57274A57954m6769a17855j72055
10722b89910c1906a048A74018i3720h638A69830i6241f535A78890n3617J7674
10711A42947f7224k1909r6011r954N0045J8039C28871d08565C37410h495r8919
10700a07414D33719h3109m1373q1808q2567R0631A80655R5656I6123d8416o5060
$$ plain form
10777 -184849 -127124 -124896 122708 -151981 -602556 -21152 -58920 -12746 -88694 -161455 -171215
10766 -171215 72644 -310837 3414 -136483 -33955 -429535 -164868 -299760 292706 18345
10755 104617 -230746 -257578 358188 79645 -99784 36727 107062 -151634 -313226 174903
10744 142852 -249706 69083 -43210 160755 -489774 -115647 63835 -128006 -336509 -98303
10733 148933 -183984 8594 -32272 -75562 -104489 -17412 -174686 157954 111185 -117855 -289910
10722 -289910 -31906 -1048 174018 -93720 -8638 169830 -96241 -6535 178890 125273 142947
10711 142947 -67224 -89133 -185144 -195098 -145053 -127014 328871 -408565 337410 -8495 -107414
10700 -107414 433719 -83109 -124482 -206290 -288857 -198226 180655 276311 96123 -48416 -113476
10689a13476B02961I7943N352d6132j50568B84298b32210f0230j07451c7590n3060
10678i0650G9148b1260j00737d1837M724J4960r2058F6335j0481c27065h185k56793
10666b64978c0590A47685d5072l10276h4098n241k24891A54968G1533a09224a2406
10654E8482h827k6206r7436B8997B676J69733d14474c1431B06979b19871j8894
10643b38765C1181e7182A55394p0245J66120A12851J64855a18828k392G8669e1624
10631a16435M3277A08535a18655A96118g6421m3463A02526a50713A27847k053
10621A25794c22889j00865a32652e4588D9629c13841J50961A79181A735L27262
10611C28997J08804c8019I3005a36002O173B76031D3055a63792K9217F4084J9998
$$ plain form
10689 -113476 202961 97943 103295 -46132 -196700 284298 -232210 -60230 -167681 -37590 -90650
10678 -90650 79148 -21260 -121997 -41837 -37113 -22153 -114211 66335 55854 -327065 -8185 -264978
10666 -264978 -30590 147685 -45072 -355348 -84098 -89339 -314230 154968 71533 -109224 -12406
10654 58482 -8827 -35033 -132469 28997 2676 172409 -414474 -31431 206979 -219871 -238765
10643 -238765 31181 -57182 155394 85149 251269 112851 277706 -118828 -121220 78669 -51624
10631 -116435 -73158 108535 -118655 196118 -76421 -119884 102526 -150713 127847 125794
10621 125794 -322889 -423754 -132652 -54588 49629 -313841 -162880 179181 1735 328997
10611 328997 437801 -38019 93005 -136002 -129829 276031 43055 -163792 -134575 64084 84082
10600H4082a82193B0026a86831p0980I4676h9631M0398p102J8064A41980a51168
10588d75546D5761J04080a9745k2279p639J5909m9503C60956d3925A9848c46441
10576a84388r3597c7299A849c79399a18737e3237E3926a72584b6095j56512g2412
10564f8089B4887b02437K9952g3398A69563a58030e2454C41225b22817c8882n5994
10553i4876r2472B74546f3236D03218a6265A97001b7186j47863K6825C0853N3394
10542H4247M50a40044A02590a71496A33697O7992A1415e0288F6127g4739K1449
10531e3290D9271c9237B00193a7072A069L29506A45788a25540c3906B46266b73119
10519a02923P353j73387M0215B4926i6982M8322A33390P4795b65381J20638p117
$$ plain form
10600 84082 -182193 20026 -186831 -257811 94676 -89631 -49233 -56335 -38271 141980 -151168
10588 -475546 45761 149841 -19745 -42024 -49663 -33754 -83257 360956 -43925 19848 -346441
10576 -184388 -277985 -37299 1849 -379399 -118737 -53237 53926 -172584 -26095 -182607 -72412
10564 -68089 24887 -202437 -172485 -73398 169563 -158030 -52454 341225 -222817 -38882 -94876
10553 -94876 -187348 274546 -63236 403218 -16265 197001 -27186 -175049 -148224 30853 84247
10542 84247 84697 -140044 102590 -171496 133697 201689 11415 -50288 66127 -74739 -53290
10531 -53290 49271 -39237 200193 -17072 1069 330575 145788 -125540 -33906 246266 -273119
10519 -102923 -95570 -268957 -228742 24926 -96982 -48660 133390 208185 -265381 -144743 -151860
10508a51860B7774R2232a75525A559a821A31485F4401G076b78588B1967P7401
10497I9368K41446J15951D2094j8035a2802a562A05211d1618B23116i2643E0837
10485B7626b3715B72793Q8654G9738a4672j77622A34082c3145j83190a2872B9450
10473g9119a3157j12812A61356b48540A69935l066b29510P9917j59299J24791
10463a84101h5899A39773b3251A11329a68438q1895R1231j67610J27987c6678
10452A91523a79791H1610H105O0862L94929a40381F5535d36163a12993k5945n8413
10441a97351B0332B41J5831d8205C5899J69618a61135O4444E9515O5014a60253
10429B17198G7215O5963J32801D6770O1811l7269N5136i4799j10789M5278A7239
$$ plain form
10508 -151860 27774 120006 -175525 1559 -1821 131485 64401 7076 -278588 21967 99368
10497 99368 340814 456765 42094 24059 -12802 -1562 105211 -41618 223116 -92643 50837
10485 27626 -23715 272793 361447 79738 -14672 -192294 134082 -33145 -216335 -12872 29450
10473 -79119 -13157 -125969 161356 -248540 169935 166869 -229510 -149593 -308892 -184101
10463 -184101 -85899 139773 -23251 111329 -168438 -250333 -159102 -326712 -198725 -36678
10452 191523 -179791 81610 8105 68967 463896 -140381 65535 -436163 -112993 -138938 -197351
10441 -197351 20332 241 16072 -48205 35899 205517 -161135 -96691 59515 124529 -160253
10429 217198 77215 143178 275979 46770 108581 71312 126448 -94799 -205588 -160310 17239
10417A62236a56432d3400k53502P2669j91655J40333a13727r6400P6469l1980
10407a65638P4890B56459j17371a78582i755m0602j68178i1536d2432c300B400
10395i8609A62641b15750A19907i8893m8023C0867L1156b32147A56973o0106b9869
10383a452o577k27257H410a9320B54646b4503k33243B0100J61656c64108J74798
10372a89310A21741a50985o0064k8283D66416a19696k1520q1563B8314P8410a05072
10360h9089k9653l57j91990I8356b24598I294a59031m969k0655K0742l11048J86757
10348b88204B95945A08393b39969B34755L7380b9953B94099f158q878q2470r0469
10337a87975A47220a92837r2862a3184j98356E72269b74562B24551b0406k83190
$$ plain form
10417 162236 -156432 -43400 -296902 -224233 -415888 -275555 -113727 -210127 -133658 -165638
10407 -165638 -90748 256459 139088 -178582 -9755 -50357 -218535 -91536 -42432 -3300 2400
10395 -98609 162641 -215750 119907 -98893 -146916 30867 62023 -232147 156973 96867 -29869
10383 -1452 -8029 -235286 8410 -19320 254646 -24503 -257746 20100 181756 -364108 -189310
10372 -189310 121741 -150985 -211049 -239332 466416 -119696 -141216 -222779 28314 106724 -105072
10360 -89089 -118742 -119099 -311089 98356 -224598 9294 -159031 -164000 -184655 -163913 -474961 -288204
10348 -288204 295945 108393 -239969 234755 272135 -29953 294099 -6158 -15036 -97506 -187975
10337 -187975 147220 -192837 -285699 -13184 -211540 572269 -274562 224551 -20406 -303596
10327c03596I0293j3018K20489q5014q3378a55333L4643C18065j38886A7075b16934
10315b18023D4959a26128A42441O4395n6005J2538R6483F6935a00113k42969H4646
10303A11205c45234P7296B3038i2694L3797E6723c60229D591i9492E1781L25488
10292C77269c92619B27867I9893J62071c9934a7406j50380j09480R7728d3943
10281E1654K9883b57499g3849L1506l02176B5004K9401a43788B30793b43608n5540
10270b99148P4847B08127A00301H180g911r7186a5106l07382J6751i1874L7964
10259e3910l39379b1902k4199I0643a4335n1371D6869O0621l7154J4963a59453
10247a51163A49272a38348A41589F7295g6861A44636C6149e5745C44571j62974
$$ plain form
10327 -303596 90293 77275 297764 212750 129372 -155333 -120690 318065 179179 17075 -216934
10315 -218023 44959 -126128 142441 206836 150831 163369 259852 66935 -100113 -343082 84646
10303 111205 -345234 -267938 23038 -92694 -58897 56723 -360229 4591 -99492 51781 377269
10292 377269 -392619 227867 99893 261964 -39934 -17406 -167786 -277266 -179538 -43943
10281 51654 81537 -257499 -73849 -42343 -344519 25004 54405 -143788 230793 -243608 -299148
10270 -299148 -224301 208127 100301 8180 -7911 -105097 -15106 -322488 -305737 -91874 -53910
10259 -53910 -393289 -21902 -46101 90643 -14335 -65706 46869 107490 70336 85299 -159453
10247 -151163 149272 -138348 141589 67295 -76861 144636 36149 -55745 344571 181597
10237A81597c223F7192a82457A28461a16642A0636a94910I518b56610b3214B70520
10225b07112A1627l93a94079r2796d8237A53020a86673B45415A2454J00382K0048
10214A32884A5124b54280l9853a35359j9954B11801g7137J8509k5230B19726I1598
10202a73843o5789i9197k79246A46473a08273d4603r2916B85430a06725j12584
10192b19309A29123b56195a24366k25456H7749K29050G7277Q0849c82345g9241
10181A65780Q6185a47662e3143k72340G30g8469D9683A4290P0J06143e00872E6000
10168A32694c31548J56418J7615H2912J4029b65707e4729l581q0344A64064j1942
10157A52122d55073a36626A3451J09010E6458a39598B36382d41995a40071O8938
$$ plain form
10237 181597 -3223 67192 -182457 128461 -116642 10636 -194910 9518 -256610 -23214 270520
10225 -207112 11627 11234 -194079 -286875 -48237 153020 -186673 245415 12454 112836 132884
10214 132884 15124 -254280 -294133 -135359 -155313 211801 -77137 -58628 -83858 219726 91598
10202 -173843 -239632 -99197 -378443 146473 -108273 -44603 -137519 285430 -106725 -219309
10192 -219309 129123 -256195 -124366 -349822 87749 316799 77277 158126 -382345 -79241
10181 165780 251965 -147662 -53143 -325483 730 -78469 49683 14290 14360 120503 -500872 56000
10168 132694 -331548 -175130 -157515 82912 96941 -265707 -54729 -58310 -138654 164064 152122
10157 152122 -455073 -136626 13451 122461 56458 -139598 236382 -441995 -140071 -71133
10147g1133J9465n0053D8584O3616E3349j1508h9764j2559k267E5949J53966b28826
10134C20793a34801D589a04772B62605j08424d14333A5607a44550L6824A14771
10123A25897j1417c43131P8099P6159G4152K68658A56620d51876b6919l4582m63896
10112e25397c9289B2128d7426l2276B56137a05230B7269R9161K51362G5438b41466
10100A24276d162j18134j13189O8413k1638A88586C2511K35242c48371J43418
10090b04953h1760j19815A02778a38805p9507A59703A3355K24480b02831A65726
10079b86383O9391i2583o5316B7011a09137A12961b0072j0447A74617k6732J15719
10068B63604G2898b40318A51076k3906h1656l1445o8449n8930D8463Q6114r688
$$ plain form
10147 -71133 -51668 -101721 48584 112200 53349 41841 -89764 -102323 -104590 55949 209915 -228826
10134 320793 -134801 4589 -104772 262605 154181 -414333 15607 -144550 -107726 114771
10123 125897 114480 -343131 -265032 -188873 74152 342810 156620 -451876 -26919 -61501 -525397
10112 -525397 -39289 22128 -47426 -79702 256137 -105230 27269 126430 377792 75438 -241466
10100 124276 -4162 -122296 -235485 -167072 -188710 188586 32511 267753 -348371 -204953
10090 -204953 -81760 -201575 102778 -138805 -218312 159703 13355 237835 -202831 165726
10079 -286383 -216992 -92583 -157899 27011 -109137 112961 -20072 -30519 174617 147885 263604
10068 263604 72898 -240318 151076 127170 -81656 -113101 -181550 -240480 48463 134577 124889
10057A24889e7524r613I9586c18346a15345A73132d4300D8315B1397c79025B4495
10045a6068kC04360b1507m2689C758a42354J9144M123r6592i3289M59B7830J00862
10032A28692N3515F9068a91420E246d5315o2360m86750b95628I460a15218A71818
10020f9734C6141a08692k02823P3416D1654J47960a26591H2221c69331i4724j60619
10009b55343G4527c18996d2427B86929A30858K27682A5593a92236A42504b7363
9998b64331A32503L2897b20455C23720a33094N8398l09082E0335d26819h9976
9987A45996B1023h8322B7792a60798j54263i3734o6844g3653l77795A03536h2923
9975A37300a05230j16366N9684K1961A74269a45626j2736B80159a17674l4575
$$ plain form
10057 124889 -57524 -67137 99586 -318346 -115345 173132 -44300 48315 21397 -379025 24495
10045 -16068 -16070 304360 -21507 -64196 3758 -142354 -123210 -119087 -215679 -93289 -92830 27830 128692
10032 128692 182207 69068 -191420 5246 -45315 -107675 -594425 -295628 9460 -115218 171818
10020 -69734 36141 -108692 -311515 -238099 41654 189614 -126591 82221 -369331 -94724 -255343
10009 -255343 74527 -318996 -42427 286929 130858 358540 15593 -192236 142504 -27363
9998 -264331 132503 165400 -220455 323720 -133094 -74696 -383778 50335 -426819 -89976
9987 145996 21023 -88322 27792 -160798 -315061 -93734 -160578 -73653 -451448 103536 -82923
9975 137300 -105230 -221596 -161912 -139951 174269 -145626 -158362 280159 -117674 -152249
9965a52249L853J924e6765b0392A50318A803d18135i5282q3926B3338M5449b02912
9952c3653j29682K2718p2625B1468J36832d12009a94051A54480B0397b24506D5681
9940b94551a46661c0291A12179d9436j7074b9645o1550l2516A95808n3137b0378
9928F6558c71839J55925O903A51762K20980F5098A5589b540A65007b37745a08977
9916E9651b14339g2027R824B26767B2231J22470D4930b4763n4431A77162b11339
9904I0824D0143g9799j66880A3300a7013k24081b7872a3468j5404C58050D1109
9892a2182D5466a46590K2070c8836E9898a78044n5483H3596a93919B06058J06763
9881C12821j49462N0257C5087a23313j25107B72898c1619j12924A37154i641B784
$$ plain form
9965 -152249 -148396 -146472 -56765 -20392 150318 1803 -418135 -95282 -179208 23338 68787 -202912
9952 -33653 -163335 -140617 -213242 21468 158300 -412009 -194051 154480 20397 -224506 45681
9940 -294551 -146661 -30291 112179 -49436 -66510 -29645 -91195 -123711 195808 142671 -20378
9928 66558 -371839 -215914 -209011 151762 372742 65098 15589 -2540 165007 -237745 -108977
9916 59651 -214339 -72027 -62203 226767 22231 144701 44930 -24763 -79194 177162 -211339
9904 90824 40143 -79799 -246679 13300 -17013 -241094 -27872 -13468 -28872 358050 41109
9892 -12182 45466 -146590 -124520 -38836 59898 -178044 -233527 83596 -193919 206058 312821
9881 312821 163359 213616 35087 -123313 -248420 272898 -31619 -144543 137154 -9641 2784
9869B42199a72178D1214a25117r690j66294i8738n5668r4867P0294I3075b022
9857a00476b1944l49290e9374j6520B4953b4627q4386j66473j48557i2639j61170
9846b53809M9470A37867n3957a88146F0029c0963A05267J1a3720B87825l8198
9835B49627F3270a67837m8585l63P9785b8048l3391k830k30524A67429a9049D3532
9822a5190j75129C8453J34142o0024a11466K4156D5418c23468B04668b88509A9270
9810b1061A36193E5225e167B0797c7392C05567a32540D4176a35277F3932Q413
9799G2345J20360A1873e34908F9182g756k52796k17195e4102j8705A65507i6296
9787e10979b44671k64635a47312c0835o7937m9336H0836b35863i3051J6555j57690
$$ plain form
9869 242199 -172178 41214 -125117 -134807 -301101 -98738 -154406 -249273 -178979 93075 -2022
9857 -100476 -21944 -371234 -59374 -75894 24953 -24627 -109013 -275486 -424043 -92639 -253809
9846 -253809 -204339 137867 83910 -188146 60029 -30963 105267 105278 -13720 287825 249627
9835 249627 63270 -167837 -216422 -216785 -137000 -28048 -61439 -64269 -294793 167429 -19049 43532
9822 -15190 -190319 38453 172595 112571 -111466 -87310 45418 -323468 204668 -288509 19270
9810 -21061 136193 55225 -5167 20797 -37392 305567 -132540 44176 -135277 63932 72345
9799 72345 192705 11873 -534908 69182 -7756 -260552 -477747 -54102 -72807 165507 -96296
9787 -510979 -244671 -509306 -147312 -30835 -98772 -148108 80836 -235863 -93051 -76496 -234186
9776b34186Q7537E9255a88596Q7112B9413b11342B28741a87233A41771b98036
9765f6118H0854K14097B3994J16113e591F7516J45200k7035C2450a36651B0125
9753a6183B20592a44609a0332A2387b3606B28506b51110j24335h7577j64813P4969
9742a77421j3246i44o1547I0360M2879M4981C1224K58505c48960I8239a5150C20157
9729G2568f7339d165j5080A03314k2200a5923A01115a26918I5240J39668h848
9717D9432R7442D5614a13921M0433k99794i1952q3046n9912A19452b7471j14816
9706a42287j53201E1176M0765K3849L7829b33753I2450h9206k31582g8710J0557
9695f8153k9488j16101o5840h4545D30898b29359B22761a71476A13136a51034
$$ plain form
9776 -234186 -146649 59255 -188596 -101484 29413 -211342 228741 -187233 141771 -298036
9765 -66118 80854 294951 23994 140107 -5591 67516 212716 185681 32450 -136651 20125
9753 -16183 220592 -144609 -10332 12387 -23606 228506 -251110 -375445 -87577 -252390 -177421
9742 -177421 -190667 -944 -62491 90360 133239 178220 31224 289729 -348960 98239 -15150 320157
9729 72568 -67339 -4165 -19245 103314 81114 -15923 101115 -126918 95240 234908 -8848
9717 49432 146874 45614 -113921 -73488 -373282 -91952 -174998 -234910 119452 -27471 -142287
9706 -142287 -295488 51176 91941 115790 153619 -233753 92450 -89206 -320788 -78710 -68153
9695 -68153 -97641 -213742 -279582 -84545 430898 -229359 222761 -171476 113136 -151034
9684a2417r7273B98757g7134l5205j33226k55111A48631a77544c9179k30681F0747
9672a70593j44707J10774k25110a20986D23455A22834d44397E7342a66895G0216
9661A75081b50807I8043a33967a9101B24085b45126D835a10842A51668c41841
9650A46094B7924c57894A63739a98797K0128d1507G7871a83095K3417A20841d2871
9638b87403J10962j24822a17322M6237G5590k7803L3983O0060b84114J35882I3549
9626a01186j089C7604K30034c6173p128m6094q3520h0798r5084j31005g5913I1302
9613i3505o6335I1004J07746a09685A10721a15362A57835a80684F3791c21987
9602a69139E0802k2914J36957b67468n0587f2949I7575a38741j21196B1499b7513
$$ plain form
9684 -12417 -109690 298757 -77134 -112339 -245565 -500676 148631 -177544 -39179 -269860 60747
9672 -170593 -315300 -204526 -429636 -120986 423455 122834 -444397 57342 -166895 70216
9661 175081 -250807 98043 -133967 -19101 224085 -245126 4835 -110842 151668 -341841
9650 146094 27924 -357894 163739 -198797 -178669 -41507 77871 -183095 -159678 120841 -42871
9638 -287403 -176441 -301263 -117322 -71085 75590 47787 81770 141830 -284114 -148232 93549
9626 -101186 -102275 37604 267638 -36173 -43301 -89395 -172915 -80798 -175882 -306887 -75913 91302
9613 -93505 -159840 91004 198750 -109685 110721 -115362 157835 -180684 63791 -321987
9602 -169139 50802 27888 164845 -267468 -318055 -62949 97575 -138741 -259937 21499 -27513
9590B25289A1601n223b61359g2951B23341K4721q3541b43185K5709I4422K5276
9579A19698D9304Q2390N7395r1809c6675j61650A57667G3936L7301b49857A62035
9567a65608n8790a03246j04572H356L62229A42814a25107k21107a55652C98042
9556b9756G6050a92371D386b65273a25130F3394K4549g3707A52852j0673g0607
9544b22042a07109F2249J5610b74175J13710H5539J10685a22643l2099a4950j24331
9533a39281B23349d78371c1153D9951L4384N969i4464l1711G9459a54197A94178
9521g7596A94642b56757j59545C488L0700a15411b2823q1420p0990d8506j52573
9510b01079F4028c7832I4560r496L4467m7706J57969N8787c3914j07058N8053
$$ plain form
9590 225289 11601 6378 -261359 -72951 223341 248062 164521 -243185 -217476 94422 119698
9579 119698 49304 131694 189089 97280 -36675 -198325 157667 73936 111237 -249857 162035
9567 -165608 -224398 -103246 -207818 8356 370585 142814 -125107 -346214 -155652 398042
9556 -29756 76050 -192371 4386 -265273 -125130 63394 87943 -73707 152852 142179 -70607
9544 -222042 -107109 62249 77859 -274175 -160465 85539 196224 -122643 -154742 -14950 -139281
9533 -139281 223349 -478371 -31153 49951 84335 90304 -94464 -126175 79459 -154197 194178
9521 -77596 194642 -256757 -416302 3488 34188 -115411 -22823 -104243 -175233 -48506 -201079
9510 -201079 64028 -37832 94560 85064 119531 71825 229794 288581 -33914 -140972 -82919
9499h2919j23617A94761J21794A03524a60218j61508J17510a2983A36328J1413
9489A47741F5681K85386A00786a2762k7432k97331H0598a66556o4090e3893j96379
9478b50272P8314A84463J63793a16868b0831A40262a15472j48975A15178D7125
9467B2368b9334N923j20849H120b64728c8501j55534A09550f659G9992l2658J07737
9455A55071a536j58992R780B08837e4117B13277a5957j50960H9054h1005b1709
9443b01717A10644N8288a31946A50055J6370a73830l1136F3966P0187C8359a84429
9431C2083b78815B57335h0960j09192g5500j43418J03883d8404m4368B04020a80858
9419b79042J02563j95651a10624a4934l81819C40114a4676m66003J42980G2205
$$ plain form
9499 -82919 -206536 194761 316555 103524 -160218 -321726 -204216 -12983 136328 147741
9489 147741 65681 351067 100786 -12762 -40194 -337525 80598 -166556 -230646 -53893 -250272
9478 -250272 -171958 184463 348256 -116868 -20831 140262 -115472 -264447 115178 47125
9467 22368 -29334 -23411 -144260 8120 -264728 -38501 -194035 109550 -6659 79992 47334 155071
9455 155071 -1536 -160528 -150748 208837 -54117 213277 -15957 -166917 89054 -81005 -21709
9443 -201717 110644 168932 -131946 150055 166425 -173830 -204966 63966 134153 38359 -184429
9431 32083 -278815 257335 -80960 -190152 -75500 -218918 -115035 -48404 -92772 204020 -180858
9419 -279042 -176479 -372130 -110624 -14934 -396753 340114 -14676 -480679 -337699 72205
9408I2367d7825A51890g8948c0776j0366A77161j2657a38802j87616c3438A9343
9396E1674a1059n3482E2535J95669h2617j08399A67208F5021N898b95371G1348
9384d70819B21792h74F3672K6504K80376F9894l4000b57336N0585h059j34083
9373a42142j0780g2866C9164f6419j70805F8619d41016f5533A3278J62162e3550
9361a67582l2413a1329j94724A32893a429A51929j2249b26235M6959C54897h4435
9349A3726K70517B8735a9588o9703H0887b04219A83826j5560a5898H2204a25018
9337c7649B65322e7700A76326B8104i5183B13703b03471c336j86591G0359a524
9325a9320k25695C17020C0978J54213a11443C0832a18206c6281k34734a10628
$$ plain form
9408 92367 -47825 151890 -78948 -30776 -41142 177161 164504 -138802 -326418 -33438 19343
9396 51674 -11059 -64541 52535 248204 -82617 -191016 167208 65021 70919 -295371 71348
9384 -470819 221792 -874 63672 90176 370552 69894 35894 -257336 -206751 -8059 -142142
9373 -142142 -152922 -72866 39164 -66419 -237224 68619 -441016 -65533 13278 175440 -53550
9361 -167582 -199995 -11329 -206053 132893 -1429 151929 139680 -226235 -179276 354897 -84435
9349 13726 284243 28735 -19588 -89291 80887 -204219 183826 168266 -15898 82204 -125018
9337 -37649 265322 -57700 176326 28104 -95183 213703 -203471 -3336 -189927 70359 -1524
9325 -19320 -245015 317020 30978 185191 -111443 30832 -118206 -36281 -271015 -110628
9314A10137a07075j080b9294C8762i5334B04858L8234a21342A58415a06967E255
9302i4016B43948E3308e1892j80369j79034a4712l03194J30063D5350J35695b01736
9290a90388A11701b05568i3607j29758o8229l063g4268B080a57533A16786C7247
9278B66425c30135a34048E0084b13849R8925c4337a5146I4737K07556b60361m0267
9267c00628F0908Q1100K10953A45162c47187B2493J0590K589P637a29416c1308
9255A41631N2179f2873A31866b11377A38793a39573A15970C2904K2536a01579
9244b96385A007b82096P5716J632A55444K8870c12633B58836a75736m9356j33765
9233c58857d9458I8251m8723J7283K00779C7854b2911l5930G7431d0846E9956
$$ plain form
9314 110137 -107075 -108155 -29294 38762 -95334 204858 243092 -121342 158415 -106967 5255
9302 -94016 243948 53308 -51892 -232261 -411295 -14712 -317906 -187843 45350 181045 -201736
9290 -190388 111701 -205568 -93607 -223365 -291594 -294657 -74268 2080 -157533 116786 37247
9278 266425 -330135 -134048 50084 -213849 -114924 -34337 -15146 94737 302293 -260361 -300628
9267 -300628 60908 142008 352961 145162 -347187 22493 33083 35672 43309 -129416 -31308
9255 141631 193810 -62873 131866 -211377 138793 -139573 115970 32904 55440 -101579
9244 -296385 1007 -282096 -206380 -204748 155444 184314 -312633 258836 -175736 -225092 -358857
9233 -358857 -49458 98251 49528 66811 267590 37854 -22911 -58841 77431 -40846 59956
9221D8693K20500a59004I1957F380i4798C15719A12808R0187G5810c56415M9266
9210c07149J24775K9848b7415o7832D7059d381H4586e7442F3334f207D5733b36401
9197a27517B8445b14924p5669f6455j81688E8979j161k7926c6838R384B90166
9185d6195p632A47944E1985J77190H4962a17457o116A43843N4770l55a88322F0721
9172c92999I688c657m33457A81850f9962l910G0640a35918j37048R6622j43233
9161c19577B7950f6406b3621j82084A1976K12692F0330a51553b156j48019B23369
9149A912J14038b66343J05184j50354A88862b64235d073A83012k4297c76201a2852
9137B30235a68289B4611Q3727K92186b8001k43420A22447a04371l3589e6153j5533
$$ plain form
9221 48693 269193 -159004 91957 6380 -94798 315719 112808 202995 75810 -356415 -307149
9210 -307149 -182374 -152526 -27415 -95247 47059 -4381 84586 -57442 63334 -6207 45733 -236401
9197 -127517 28445 -214924 -290593 -66455 -248143 58979 57818 29892 -36838 -27454 290166
9185 -46195 -53827 147944 51985 229175 84962 -117457 -123573 143843 198613 198258 -188322 60721
9172 -392999 9688 -3657 -437114 181850 -69962 -73872 70640 -135918 -272966 -176344 -319577
9161 -319577 27950 -66406 -23621 -205705 11976 224668 60330 -151553 -2156 -150175 223369
9149 1912 115950 -266343 -161159 -311513 188862 -264235 -4073 183012 158715 -376201 -12852
9137 230235 -168289 24611 108338 400524 -28001 -271421 122447 -104371 -137960 -56153 -71686
9126g1686A11661a96030K4394f4458C5642a32870p6285C3252P489a0344C422M9172
9114E2594a60185N3498B55875a65191j77994h2893l50204C4555K48891d5776B2242
9102I8028Q7542e7652m2729J3978n0922q504B28493o4582d2945J6249j55018l8281
9090b19995b4863p905C2193L0650d9760J6212j09582b128r0659k96565A39317
9078A31392B125b1874N85B97095a66281O9795j84427C30342a24311F3593a29040
9066A2821J21605F3158b8065f993j87141B64789A2634b62699C46619I5383a16158
9054b11273G4478L18670b05290n076G8236c32623h2498A80362a69322f3168A38415
9042b70817a3902k23458a09221E956a13893c3956o7861P093H7575i3015b3608
$$ plain form
9126 -71686 111661 -196030 -171636 -64458 35642 -132870 -209155 33252 40741 -10344 3422 52594
9114 52594 -160185 -106687 255875 -165191 -343185 -82893 -433097 34555 283446 -45776 22242
9102 98028 185570 -57652 -100381 -86403 -137325 -145829 228493 163911 -42945 -26696 -181714 -219995
9090 -219995 -24863 -32768 32193 62843 -49760 -33548 -143130 -2128 -92787 -389352 139317
9078 131392 2125 -21874 -21289 297095 -166281 -96486 -280913 330342 -124311 63593 -129040
9066 12821 134426 63158 -28065 -6993 -194134 264789 12634 -262699 346619 95383 -116158
9054 -211273 74478 393148 -205290 -210366 78236 -332623 -82498 180362 -169322 -63168 138415
9042 -270817 -13902 -237360 -109221 5956 -113893 -33956 -101817 -94724 87575 -93015 -23608
9030a09748n2186d376m08700a99491j89141a9484l19652h4924D4284c01062m5384
9019c46446f1883F3042P9167b42171c2990a590A22992C6699N6904a71426f7579
9007a06666D32537i7206j06051R7454B59453f5694D8146M1526K25447c8941l9868
8996g8809j19753O3931A66988c6295k24819A36897J39490h8891q2887c8114k02798
8985b40912e8930B66987F911a41384C26330a59059f8815A13110l8086a6916r2112
8974a09028J5240A40679a29409C20302b49549J4423N5268K6726j66155A39897
8963B23209b08468c8247r9795r6914a04575d6603A44403e0970r2541l9299e6696
8951g7604j26025N9885D21648b32374d5454G8229C945N5272b38048A86944f1896
$$ plain form
9030 -109748 -161934 -4376 -413076 -199491 -388632 -19484 -339136 -84924 44284 -301062 -346446
9019 -346446 -61883 63042 142209 -242171 -32990 -1590 122992 36699 93603 -171426 -67579
9007 -106666 432537 -97206 -203257 -105803 259453 -65694 48146 89672 315119 -38941 -78809
8996 -78809 -198562 -134631 166988 -36295 -261114 136897 276387 -88891 -171778 -38114 -240912
8985 -240912 -58930 266987 6911 -141384 326330 -159059 -68815 113110 75024 -16916 -109028
8974 -109028 -93788 140679 -129409 320302 -249549 -235126 -179858 -153132 -319287 139897
8963 223209 -208468 -38247 -138042 -234956 -104575 -46603 144403 -50970 -143511 -182810 -56696
8951 -77604 -203629 -143744 421648 -232374 -45454 78229 3945 59217 -238048 186944 -61896
8939b12345B2501d1071A37908d2555k15945A89996a88062J0196A36228n5057a14320
8927b92482A5038c9055q7a376k0833F3103a77253O5395A27775C1392d5470I8361
8914B73576o8586F1724d2589j73752N9883C54854A5160b77330b5573A5077h7882
8902a06281p342C721K31347c47247J65823j0265l2129A0889b06270D7900Q3958
8891A31858b27476f2337A91625b78113k9105A93894a06669A0046e6164o4524A47651
8879C96029b67578a26133k05852A10227e1478b705j15725O966j87080a36151H5024
8867h5449B01349d7468B94439a75116q1155B61653d02373C7925a45232O8699A24866
8855b10344h8079G7799c88924J83791A68715e7273A19376f4343j60942H3129a54374
$$ plain form
8939 -212345 22501 -41071 137908 -42555 -258500 189996 -188062 -177866 136228 81171 -114320
8927 -292482 15038 -39055 -39142 -1376 -22209 63103 -177253 -111858 127775 31392 -45470 98361
8914 273576 204990 61724 -42589 -216341 -156458 354854 15160 -277330 -25573 15077 -87882
8902 -106281 -113623 3721 235068 -347247 -181424 -191689 -223818 10889 -206270 47900 131858
8891 131858 -227476 -62337 191625 -278113 -307218 193894 -106669 10046 -56164 -120688 147651
8879 396029 -267578 -126133 -331985 110227 -51478 -2705 -118430 -111464 -298544 -136151 85024
8867 -85449 201349 -47468 294439 -175116 -256271 261653 -402373 37925 -145232 -76533 124866
8855 -210344 -88079 77799 -388924 -205133 168715 -57273 119376 -64343 -225285 83129 -154374
8843a85497A79977h3759j41437C6552a20806j25293B55578C2041J51913M3862
8833B27816A1705J44100r30a35554L6894k32482d7828K0519A30139d4711j99609
8822b44320N4374j30075B06570D6659R952M0082a72931C59464j39889r3906b9906
8810b34280A71909D7504e3035R138H6220d2114B8263d2396j88151h5334A18315
$$ plain form
8843 -185497 179977 -83759 -225196 36552 -120806 -246099 255578 32041 183954 227816
8833 227816 11705 155805 154875 -135554 -98660 -331142 -47828 -27309 130139 -44711 -244320
8822 -244320 -189946 -320021 206570 46659 56611 96693 -172931 359464 219575 125669 -29906
8810 -234280 171909 47504 -53035 -43897 86220 -42114 28263 -42396 -230547 -85334 118315
$$ [...]
##END NTUPLES=NMR SPECTRUM
##END=
