
##TITLE=AC1302_PERAH12114_6535671_KetVU1Pe3j
##JCAMPDX= 6.0         $$ Bruker NMR JCAMP-DX V2.0
##DATA TYPE= NMR SPECTRUM
##DATA CLASS= NTUPLES
##ORIGIN= BRUKER
##OWNER= Administrator
$$ 1.72 TOPSPIN		Version 2.1
$$ 2012-11-29 20:06:36.882 -0500  Administrator@X
$$ Compression mode = diff/dup
##.OBSERVE FREQUENCY= 400.02188249412
##.OBSERVE NUCLEUS= ^1H
##.ACQUISITION MODE= SIMULTANEOUS (DQD)
##.ACQUISITION SCHEME= undefined
##.AVERAGES= 8
##.DIGITISER RES= 22
##SPECTROMETER/DATA SYSTEM= spect
##.PULSE SEQUENCE= zg30
##.SOLVENT NAME= COFFEE_meoh
##.SHIFT REFERENCE= INTERNAL, COFFEE_meoh, 1, 14.98509
##AUDIT TRAIL= $$ (NUMBER, WHEN, WHO, WHERE, PROCESS, VERSION, WHAT)
$$ ##TITLE= Audit trail, TOPSPIN		Version 2.1
$$ ##JCAMPDX= 5.01
$$ ##ORIGIN= Bruker BioSpin GmbH
$$ ##OWNER= Administrator
$$ $$ E:\/data/COFFEE/nmr/AC1302_PERAH12114_6535671_KetVU1Pe3j/30/pdata/1/auditp.txt
$$ ##AUDIT TRAIL=  $$ (NUMBER, WHEN, WHO, WHERE, PROCESS, VERSION, WHAT)
(   1,<2012-11-29 20:06:32.038 -0500>,<Administrator>,<X>,<go>,<TOPSPIN 2.1>,
      <created by zg
	started at 2012-11-29 20:05:25.008 -0500,
	POWCHK enabled, PULCHK disabled,
       configuration hash MD5:
       86 BA 57 50 F2 9D 5C 9B 26 00 A9 28 5F 66 2E 89
       data hash MD5: 64K
       66 B8 AE DE 52 48 AD 4D FB 01 01 29 02 33 FA 26>)
(   2,<2012-11-29 20:06:35.241 -0500>,<Administrator>,<X>,<proc1d>,<TOPSPIN 2.1>,
      <Start of raw data processing
       efp LB = 0 FT_mod = 6 PKNL = 1 PHC0 = 0 PHC1 = 0 SI = 32K 
       data hash MD5: 32K
       A7 E3 F3 D0 AE B7 5E 8B 5C 73 DF 11 96 4C B8 7D>)
(   3,<2012-11-29 20:06:35.710 -0500>,<Administrator>,<X>,<proc1d>,<TOPSPIN 2.1>,
      <pk PHC0 = 97.00928 PHC1 = 0 
       data hash MD5: 32K
       DB 1C 56 CE C0 92 33 7B B0 09 13 2A 4A AB 13 70>)
(   4,<2012-11-29 20:06:35.944 -0500>,<Administrator>,<X>,<proc1d>,<TOPSPIN 2.1>,
      <abs ABSG = 1 
       data hash MD5: 32K
       A2 11 8E 4F AD 26 75 77 E1 50 EC B5 58 9E 54 65>)
(   5,<2012-11-29 20:06:36.085 -0500>,<Administrator>,<X>,<proc1d>,<TOPSPIN 2.1>,
      <abs ABSG = 2 
       data hash MD5: 32K
       6B BA CF 87 27 CD DA 61 31 2E 60 F3 95 66 14 9B>)
(   6,<2012-11-29 20:06:36.241 -0500>,<Administrator>,<X>,<proc1d>,<TOPSPIN 2.1>,
      <abs ABSG = 3 
       data hash MD5: 32K
       A7 F3 DA F9 C6 94 4D 0E D6 13 18 57 D5 04 55 56>)
(   7,<2012-11-29 20:06:36.382 -0500>,<Administrator>,<X>,<proc1d>,<TOPSPIN 2.1>,
      <abs ABSG = 4 
       data hash MD5: 32K
       85 1F E4 E4 5D 92 E7 06 CB ED 68 FF F3 12 62 DA>)
(   8,<2012-11-29 20:06:36.538 -0500>,<Administrator>,<X>,<proc1d>,<TOPSPIN 2.1>,
      <abs ABSG = 5 
       data hash MD5: 32K
       49 6B AA 5F F9 BC 88 14 0A C3 E0 A6 76 39 88 7D>)
$$ ##END=
$$ 
$$ $$ hash MD5
$$ $$ 9F 56 F5 1E 9B 66 00 FB EB 88 49 D5 07 26 88 88
##$RELAX= 
##$RELAX= 
##$RELAX= 
##$RELAX= 
##$RELAX= 
##$RELAX= 
##$RELAX= 
$$ Bruker specific parameters
$$ --------------------------
##$DU= <E:\>
##$EXPNO= 30
##$NAME= <AC1302_PERAH12114_6535671_KetVU1Pe3j>
$$ [...]
150 150 150 150 150 150 150 150
##$TP07= 0
##$TPNAME0= <>
##$TPNAME1= <>
##$TPNAME2= <>
##$TPNAME3= <>
##$TPNAME4= <>
##$TPNAME5= <>
##$TPNAME6= <>
##$TPNAME7= <>
##$TPOAL= (0..7)
0.5 0.5 0.5 0.5 0.5 0.5 0.5 0.5
##$TPOFFS= (0..7)
0 0 0 0 0 0 0 0
##$TUNHIN= 0
##$TUNHOUT= 0
##$TUNXOUT= 0
##$USERA1= <user>
##$USERA2= <user>
##$USERA3= <user>
##$USERA4= <user>
##$USERA5= <user>
##$V9= 5
##$VALIST= <valist>
##$VCLIST= <CCCCCCCCCCCCCCC>
##$VD= 0
##$VDLIST= <DDDDDDDDDDDDDDD>
##$VPLIST= <PPPPPPPPPPPPPPP>
##$VTLIST= <TTTTTTTTTTTTTTT>
##$WBST= 1024
##$WBSW= 4
##$XGAIN= (0..3)
0 0 0 0
##$XL= 0
##$YL= 0
##$YMAX_a= 836743
##$YMIN_a= -766218
##$ZGOPTNS= <>
##$ZL1= 120
##$ZL2= 120
##$ZL3= 120
##$ZL4= 120
##$ABSF1= 14.98509
##$ABSF2= -5.573092
##$ABSG= 5
##$ABSL= 3
##$ALPHA= 0
##$AQORDER= 0
##$ASSFAC= 0
##$ASSFACI= 0
##$ASSFACX= 0
##$ASSWID= 0
##$AUNMP= <proc_prof1d_extract_pilot.lims>
##$AXLEFT= 0
##$AXNAME= <>
##$AXNUC= <1H>
##$AXRIGHT= 0
##$AXTYPE= 0
##$AXUNIT= <>
##$AZFE= 0.1
##$AZFW= 0.1
##$BCFW= 0
##$BC_mod= 0
##$BYTORDP= 0
##$COROFFS= 0
##$CY= 15
##$DATMOD= 1
##$DC= 0
##$DFILT= <>
##$DTYPP= 0
##$F1P= 0
##$F2P= 0
##$FCOR= 0.5
##$FTSIZE= 32768
##$FT_mod= 6
##$GAMMA= 0
##$GB= 0
##$INTBC= 1
##$INTSCL= 1
##$ISEN= 128
##$LB= 0
##$LEV0= 0
##$LPBIN= 0
##$MAXI= 10000
##$MC2= 0
##$MEAN= 0
##$ME_mod= 0
##$MI= 0
##$NCOEF= 0
##$NC_proc= -8
##$NLEV= 6
##$NOISF1= 0
##$NOISF2= 0
##$NSP= 0
##$NTH_PI= 0
##$NZP= 0
##$OFFSET= 14.98509
##$PC= 1
##$PHC0= 97.00928
##$PHC1= 0
##$PH_mod= 1
##$PKNL= yes
##$PPARMOD= 0
##$PPDIAG= 0
##$PPIPTYP= 0
##$PPMPNUM= 2147483647
##$PPRESOL= 1
##$PSCAL= 4
##$PSIGN= 0
##$PYNMP= <proc.py>
##$REVERSE= no
##$SF= 400.02
##$SI= 32768
##$SIGF1= 0
##$SIGF2= 0
##$SINO= 400
##$SIOLD= 32768
##$SPECTYP= <>
##$SREGLST= <1H.CDCl3>
##$SSB= 0
##$STSI= 32768
##$STSR= 0
##$SW_p= 8223.68421052631
##$SYMM= 0
##$S_DEV= 0
##$TDeff= 65536
##$TDoff= 0
##$TI= <>
##$TILT= no
##$TM1= 0
##$TM2= 0
##$TOPLEV= 0
##$USERP1= <user>
##$USERP2= <user>
##$USERP3= <user>
##$USERP4= <user>
##$USERP5= <user>
##$WDW= 1
##$XDIM= 32768
##$YMAX_p= 495670957
##$YMIN_p= -903620
##$CURPLOT= <Network HP LaserJet P1505>
##$CURPRIN= <$Network HP LaserJet P1505>
##$DFORMAT= <normdp>
##$LAYOUT= <+/1D_H.xwp>
##$LFORMAT= <normlp>
##$PFORMAT= <normpl>
##$SURQMSG= 1
$$ End of Bruker specific parameters
$$ ---------------------------------
##NTUPLES= NMR SPECTRUM
##VAR_NAME=  FREQUENCY,     SPECTRUM/REAL,   SPECTRUM/IMAG
##SYMBOL=    X,             R,               I
##VAR_TYPE=  INDEPENDENT,   DEPENDENT,       DEPENDENT
##VAR_FORM=  AFFN,          ASDF,            ASDF
##VAR_DIM=   32768,         32768,           32768
##UNITS=     HZ,            ARBITRARY UNITS, ARBITRARY UNITS
##FACTOR=    0.250966925370066, 1,           1
##FIRST=     8223.43324360094, -194116,      -164446
##LAST=      0,             55878,           -171651
##MIN=       0,             -903620,         0
##MAX=       8223.43324360094, 495670957,    0
$$ Real data points
##PAGE= N=1
##DATA TABLE= (X++(R..R)), XYDATA
$$ [...]
23720 142409 -85953 132603 114321 346789 -148560 160001 -84834 -222964 4885 51242 279639
23709 279639 160984 -16590 -252384 -7228 -131146 -185493 -92345 71488 76721 -46941 319645
23697 -347110 106553 -523795 -198107 21987 245503 -41562 228163 192685 -184098 -137805
23687 -137805 19286 -22458 -128439 65154 113055 143774 -89409 518207 -68692 -43704 -37719
23676 -37719 -157307 -467540 -147198 155410 306354 -23413 28265 826 -222334 -413495 13802
23664 -203024 -136458 -136354 371804 -328586 -269967 160599 -60446 100622 -255199 11064 366923
23653 366923 -180678 -133192 193923 -100885 -177578 140312 -26794 -135292 57340 -264269
23642 -297005 30190 -243740 -107698 -35975 -179888 138276 146959 144505 -65233 -95906 -77776
23631 -77776 -158733 -33096 127222 97380 -114896 74303 -287433 280656 43765 -23947 -139399
23620 -139399 57755 -54081 -178789 99519 -393496 136906 -171595 -135594 215821 219938 112117
23609 112117 -74930 -151136 129773 11103 152930 -347631 65871 318615 22114 49529 33288
23598 33288 -121118 -13838 172908 98679 141194 176559 23728 -70660 -262467 127379 97107
23587 97107 233422 268741 16576 -139153 25664 96866 92502 51176 56345 -178972 -285238
23576 -285238 -324750 -56355 -80954 -38346 91454 -40764 -344656 -24769 133386 -83277 275281
23564 -270347 -346314 72936 182542 -97833 112349 -206110 235869 -99263 -63069 -251357
23554 -251357 -194028 -133760 61364 124226 -383828 -3591 192736 -146541 30485 39042 -123325
23542 61319 196310 2414 96070 40573 -189363 140910 219772 -168206 -150763 -219733 154734
23530 -111756 115505 55114 -258543 66878 150990 -9154 54514 -133020 -81033 3414 214079
23519 214079 -46266 -187791 -172900 128731 -114344 73522 193676 107380 -156593 -62037
23508 -281319 -119521 310263 162729 -53785 -86327 20722 -47346 -77187 -115321 -221261 -483591
23497 -483591 118029 102650 -136585 269602 47797 353018 124180 -1022 -243250 -296356
23487 -296356 -113733 352037 110966 -237165 -314880 -88432 112053 145124 158961 -113203
23476 270921 237563 9515 -98592 55796 -206519 -37120 71582 101395 39623 16578 -222007
23464 15208 67300 298765 53572 -112062 197502 -126335 -30895 70281 53119 -376005 52320
23452 -50331 -94960 -132489 -382268 -14685 -65079 -309521 -165126 -114963 287769 124660 23129
23440 52166 -64186 10304 -193970 78164 -52776 26351 154665 180308 188030 -263136 557312
23428 -220049 -222889 -16695 339305 -134011 -145129 86459 193094 77077 -260731 96512 95627
23417 95627 -49141 252486 -166321 172448 -84884 -21686 199005 -70985 -23736 180467 75564
23405 -177087 161899 -297264 247477 -177601 -129746 58123 -39424 305130 -461661 -320391
23395 -320391 330512 -174045 -25406 -138713 -104031 54745 -49597 124797 -39078 -210060
23385 -210060 37674 -80017 27827 -202825 -63448 364331 -91485 -41730 -68308 -149230 -292843
23374 -292843 5816 -279309 -66330 -56400 -24964 -112618 -71831 -437653 20238 -15239 -285805
23363 -285805 11422 -217675 222775 112241 395585 189830 -120462 -310138 317562 56765
23352 11604 -66811 25519 14363 -186299 34815 241152 223289 -1875 -423411 -104711 133166
23340 62934 -129943 -214829 -26183 206226 -72926 -18521 156607 239876 74775 301418 165251
23329 165251 335005 168732 228082 373217 292984 -188250 192125 -307819 44091 -186950
23318 141809 -442494 -108646 144336 -118745 -360319 -4980 20753 -28019 -165322 208260
23307 125731 60860 -199795 238464 -12464 -223529 -135859 118080 132269 314084 -38300
23296 -210144 -116371 159746 84760 -59805 -77247 191151 78231 -147899 -83452 36590 -40346
23284 93810 -351503 117656 -121762 134361 57086 68839 132465 -119779 -144860 -108193 28559
23272 89299 292137 -292725 254382 -352509 -141321 34546 -186869 -110432 124367 -91190
23261 -90879 -66211 265564 15384 88388 128051 -48578 -105026 19652 171462 157580 31545
23249 -11161 -169536 -31337 -130507 -22225 132791 -119151 -184775 214259 122468 -17995 -379032
23238 -379032 186899 -24840 -11000 129666 -188762 -26229 -202422 103322 -64854 -174407
23228 -174407 -46486 -265454 27151 22930 118004 69259 -411451 -109171 -145399 -164068 -51698
23216 -249350 123233 138688 259469 -36492 -279323 -100490 145358 223908 -160214 34122
23205 -152897 -87075 -232464 -74931 -29005 -126718 85789 -16380 -129058 14643 44897 -176732
23193 -232796 -79458 -95132 -14107 -176107 -292460 235228 -62182 14796 47325 -18647 -82188
23182 -82188 -179560 53635 90380 269379 95371 237278 -218321 -22886 12426 -96606 -62693
23171 -62693 -181743 129053 -32401 72298 198496 207592 151754 -22217 -155122 -170700 -75896
23159 -96554 146371 -296845 -141784 46847 -23315 -301946 -478206 -46248 26022 -3355 -18757
23148 -18757 -155444 -71146 -180692 42060 119611 -12123 186480 -213273 44915 83180 -90601
23136 76148 28250 10484 319865 77490 649485 -130040 158545 1603 -94599 133686 -94010
23124 -308018 140969 -163165 -154191 -37504 60915 -124449 -39992 -317671 -165561 -92067 -90942
23113 -90942 124828 -85809 141206 -115699 121013 118968 221230 -323516 13489 -118649
23102 -142561 -214550 123966 -140710 11722 -47949 -67730 -129248 7372 -40481 194797 166745
23091 166745 474712 -97837 -269620 -59923 -93010 -269719 29885 65681 -59088 -160224 185050
23079 112699 -158375 -384375 161580 -26536 -119271 -235200 370919 -117298 -13597 -143026
23069 -143026 96901 -42846 -282334 -148583 14394 -68603 -92575 -155737 -303662 101310 -131537
23057 124203 71840 75842 6406 -69345 20630 288499 -205906 -6666 -62471 -86771 179108
23045 248796 -27585 -160182 -199133 -147704 45515 -171011 48267 -83259 152641 -131772 134789
23033 100225 -150071 311514 -139960 -195681 -256836 197811 -14212 -287402 -196616 283377
23022 -130813 141046 152513 152338 -67788 -184748 361190 15048 -141862 -261497 116555 -250362
23010 -183657 -168280 50125 -2003 41031 -32008 174494 -90502 -47694 -320441 -141025 64957
22998 37909 276101 -49610 -81216 -206430 229112 -177348 -289813 -72599 413196 -120008
22987 276067 -301764 -13426 -243676 -157600 49277 -93658 -84105 -92251 10135 6961 121763
22976 121763 218203 259090 58486 -10162 -61611 105375 129889 -81280 137546 -171314 -196206
22965 -196206 -30682 -25868 -27310 174999 90931 151875 31802 -161856 -194026 154804 -124206
22953 -384928 -91655 -127090 -51059 -486313 -92875 -128438 117974 948 -253979 208782 51571
22941 -252093 -123513 -299157 -75289 -197728 -225502 -339706 -69844 60054 93236 -59917 -233091
22930 -233091 -235171 -232676 -229914 106804 -82118 -317685 151384 -56717 220662 335651 -154315
22918 115818 -374 -93942 -26239 7484 -52888 -212374 90383 -18329 15478 445652 -106782
22906 282842 -44657 318630 204389 210582 -158038 -115332 -168778 322016 222316 -158582 137941
22894 -104732 -261769 215432 49645 -19440 -139588 114616 -157079 130344 128773 389191
22884 389191 177264 381911 -154921 -243029 151977 148717 -148820 124067 -8186 216838
22873 67371 -102588 -272076 286266 111585 -36864 323256 -127822 -57347 158467 -490538
22862 -166801 225431 -67948 64410 -34587 -136236 4631 -84605 154558 82611 -155596 -137154
22851 -137154 -86614 -240450 39715 -69620 82134 21069 -106371 380568 20921 -101579 59547
22839 119952 -262173 -134079 -115916 121797 89454 113226 42582 195836 65332 60804 -378209
22827 -165622 372503 -44214 -132847 -175575 51571 388012 1496 -104265 -147697 -41898 212804
22815 31659 -195491 -45220 100805 159523 53816 -199298 56988 -31890 -56503 140865 -29603
22803 -210498 -43092 -356441 -256208 11758 -404738 120348 157194 -87416 -81110 -111083 -253329
22792 -253329 -16336 47137 239324 -27193 -49278 118794 -43981 164577 -38238 -28656 -58436
22781 -58436 137664 -225367 128535 -60257 -20563 143627 -143984 120860 -51520 -80946
22771 -80946 -42861 131103 -52853 327909 -157277 -79214 -45805 182657 -101975 29205 -107364
22759 265493 202396 32423 -87022 -107948 -84749 -73581 -177570 462961 -271858 -221968 146175
22747 34181 245005 145138 -417085 -83274 -193999 202202 305566 -132057 -164553 -151505
22737 -151505 31887 6336 5754 -138573 47824 -56591 -136522 258433 252328 -35685 -175772 -15360
22724 57120 -330538 -42500 131495 99573 -28343 -215518 -234777 258002 94969 23099 -101625
22712 -419021 146108 98865 -126191 15145 117205 -109725 -16504 -167123 48962 -326512
22701 135620 -87074 90659 220934 101267 -147712 -61660 -31762 -313421 176680 -23271
22690 542187 5925 126598 103514 -130463 95129 -144977 -21494 -35339 -347837 -193402 161129
22678 69872 -21207 -198997 -214139 107264 -90140 57641 -3526 -138454 87645 271847 -62227
22666 58230 -454276 -113165 130497 -88730 -63365 -466488 143297 126481 -72133 -434092
22656 -434092 -148545 -100713 -142513 315021 -216146 -170303 -40537 -81622 170132 -221341
22645 -36239 104990 -157019 -329599 24844 2412 416638 -226373 -196524 312265 285451 124602
22633 63079 33037 50253 96280 -235845 -7526 -177206 157920 216622 -238325 -288318 -37089
22621 19314 341049 -295357 -319632 -105509 216069 -9078 -246259 -209568 -175595 50327 -94614
22609 -156676 86578 -76818 -36393 102324 90212 -64759 -6422 195014 -139966 47699 129902
22598 129902 30033 -67281 -86797 -32237 -98095 147501 155458 182845 19029 10629 -105833
22586 -215256 112527 -21232 129682 -287262 -121867 -49936 -268852 134858 -63832 17284
22575 -198164 191449 -133855 10826 76508 93852 261615 -67340 195628 -17692 99258 3203
22563 84341 -115250 53333 102114 -12887 -55866 -276203 -314826 252986 94643 -343289 -242430
22552 -242430 -271551 -94363 191889 -248231 -101953 -127598 -105838 204849 50706 -164668
22541 28717 -49217 61398 302048 170075 -323712 -23603 -177421 65473 -513750 142319
22530 -112160 -150925 195792 83804 -291082 -198100 101831 96079 -144142 72593 65369 19112
22518 126775 -109633 -87956 -162354 -270604 -108270 68628 -129294 -114532 -114112 -100853 127219
22506 -19690 11898 336211 -201828 -105003 -61439 125385 47627 -166314 163414 284520
22496 284520 -384257 -154672 -178314 -139550 119090 15200 51970 184707 142387 -142926
22485 -59935 -54783 -177153 -51144 93937 -278939 326941 -367999 -272255 -181104 -24658 -104248
22474 -104248 94172 -13707 -293792 -195840 390235 -7822 -129088 224304 -232537 -322878 -145549
22462 77238 -322159 24690 -90042 -160380 -160294 -133768 80201 57448 393175 -247094 -223524 104833
22449 -83147 164537 11513 -182356 -118607 286598 -127701 290677 104812 -110999 -148569
22439 -148569 110427 363654 120869 -304921 -104800 266996 115368 245888 -141144 446529
22428 294590 -257113 -180512 -86728 66556 -12531 -202905 -63415 381913 -318065 -99061 -248680
22417 -248680 324980 -108065 41171 -23994 -223124 -36378 66830 150256 -227274 -75818 -29461
22405 -403336 159562 -109518 -27240 -482154 117057 69519 116661 21332 -130215 -36292
22394 318185 -189684 -167860 46653 144081 -93244 -210162 362694 -33675 -140027 64604 -26376
22382 -40343 112880 -57234 31605 -80636 27697 153452 -276181 -153038 60667 -166722 -336225
22371 -336225 -60677 -175173 -141252 75988 348939 -378185 100220 53765 -65676 -163174 -76117
22359 -257200 3827 -173316 -125299 -126112 -380608 -176649 46823 18550 -113087 29703 -34378
22347 212344 136650 273131 32806 346524 18276 -55658 36925 -89647 28115 54568 -83268
22335 106730 295637 125158 159742 101780 -40387 267565 -164237 -53572 -47927 -178327 6684
22323 -226384 84926 3972 22151 13454 -140889 -173781 53443 113107 15503 -248067 308419
22311 159453 -52991 -31642 -5569 24264 109437 192153 -162227 52121 203881 52689 -26503
22299 -332227 186898 -263277 -12484 40131 335103 -527803 -252309 235226 12771 125713
22289 125713 -170480 159202 55106 55773 193816 -17679 -176706 -52551 243610 -143594 -71856
22278 -71856 -79641 -293562 64183 160678 -287625 -99335 -95243 -56267 -48164 -86997 -130448 -156065
22266 -156065 -139279 172206 -13828 -51581 60770 -79634 158984 -276067 259014 -97810 29933
22254 -115940 157972 -60089 -406535 192859 -63701 -90946 -397205 -33698 -55863 -77278 -67153
22243 -67153 -80253 -239510 342839 -23557 -135249 76785 -328899 186626 510043 -84580
22232 94843 -134694 290302 -117124 17284 -287446 -188112 -46003 260234 -161222 -19535
22221 112028 144313 185483 -84143 53540 80495 279879 37931 27912 -96354 -127812 114889
22209 -353308 -200772 218959 38887 191321 140350 373944 66393 -98629 -31625 95052 33498
22197 -254361 100804 -396363 -98690 -314011 173666 -204651 -31856 -47635 -151799 105433
22186 -271580 15570 99323 127706 28468 -1152 -310171 81285 -46195 139607 174299 -13090
22174 -304669 144582 13169 -151154 -120139 102769 210548 -81844 -61111 -295621 -60180
22163 -16964 -238138 -281506 25199 -77609 4614 -180329 198846 350893 -323916 -74204 50383
22151 -277831 252828 -75713 314705 -96467 -225682 189596 -223509 -147941 84816 -49521
22140 -158837 197242 -154425 -115994 -254220 183966 -79986 234331 145484 250351 -386873
22129 134712 150900 233845 79905 -152698 217178 -341835 155361 -13872 -205515 -18797
22118 -358002 229278 -309455 -90558 -123190 208320 205195 -127698 289574 -145805 63302
22107 -267352 -320339 -39084 -180806 11553 -45760 152073 -35310 -66024 -62351 -72876 -88397
22096 -88397 -73389 -130097 -398281 -98581 -52795 -135355 10276 129587 235752 -142225 -172238
22085 -172238 169795 -88178 -42331 159332 -225019 212513 439220 -349793 -6194 -11351 232670
22073 -436328 -161260 -41287 75559 -95329 -74237 127469 -141352 -39497 18117 -56441 -270938
22062 -270938 -21046 -293622 -180895 -4892 42334 -68144 67212 4093 61227 -207490 -283932
22051 -283932 -58355 -161442 -173922 42721 35258 296826 -149270 -52238 -181578 -201609 -109568
22040 -109568 -280571 -120612 124830 279770 39692 -222536 144869 -323652 287106 40734
22029 -60324 86221 -136403 -247317 292535 57600 -305479 -14280 85533 363761 -35661 113958
22017 148965 -187864 330595 233995 195610 151523 113828 197352 -27182 34904 -123072 -157004
22006 -157004 176261 -273217 54522 -211043 247646 -244672 115668 206900 -230802 -10852
21995 29982 -69745 76826 -156766 -162460 207790 -232978 -178866 -230030 -202119 -489908 -96613
21983 -61399 -34559 201570 472879 167157 -48339 100848 -2077 199256 -116234 -341079
21973 -341079 8251 -68105 -80503 -138289 -170125 67397 264607 -79934 -129615 -27036 -116579
21962 -116579 -29581 -194992 -107795 -71859 -129230 -28571 85094 -106655 14278 19750 -133943
21950 -140983 -257819 2626 4871 -39434 -15842 29029 89479 87298 -68206 190877 -362172
21938 42894 -126986 -261912 -141563 -691 -11517 26008 -89065 -64282 261741 131659 24902
21926 -143467 -151210 15802 124993 -50092 102668 115228 -176303 -41554 69828 -99477 130358
21914 -270647 -11257 83737 -117201 -263397 -123089 111768 156608 -167024 -121755 -267021
21904 -267021 76754 69949 -195823 13800 155637 276431 -133578 -34513 -318351 10199 -135006
21892 -24160 -430315 61848 33064 90537 -49790 157608 137230 662021 -217240 -21397 44654
21880 195850 108282 -125793 -123443 67851 -41794 -158606 -62135 -134223 11883 -160560 460671
21868 308366 -291586 -145361 34258 -151995 50209 204361 18195 -35520 -136970 -55669
21857 -166541 46325 48589 110722 158444 -416257 158271 228654 -101899 44394 52553 -361729
21845 -7055 -249258 110703 -215032 66791 313183 -195016 -131553 -7170 -132033 3981 -89750
21833 -13123 63808 -149931 -103929 -250536 386822 99858 -42935 47427 -433318 -108375 85737
21821 228293 220757 20150 -134281 -131473 234763 176849 -247113 -127242 58221 -70473 -82368
21810 -82368 -105466 -233898 -369 -256926 -136449 -2735 8505 27401 61138 -47426 -124229 199537
21797 312094 120540 -101485 -109415 -310830 -396357 287665 39332 -51638 115995 -11085 176187
21785 -138505 254830 65104 -157301 -68804 -173469 -79199 -166564 266446 -145398 105004
21774 167363 354401 -111356 98018 -166258 -318243 65756 147377 259790 -369333 -176176
21763 -142611 -273779 45601 168527 -17383 -102456 -110238 34037 -221770 324284 -69157 -188486
21752 -188486 206774 208190 -149362 -14277 -13606 102365 426196 -309680 -347986 -11210 -147783
21741 -147783 65265 290634 18148 -99314 -31001 -231259 152419 110365 -175791 49697 145107
21730 145107 81709 31028 163040 4749 115100 -272773 89288 -29315 -248459 48127 148795
21719 148795 241615 -7941 -44192 -396372 -21576 -175782 -300106 17359 -30301 -104407 -65922
21708 -65922 -153034 -229239 68808 -18226 74785 -106444 -228413 145576 -192995 209752 43969
21696 -278574 31822 -59298 347144 -242903 20581 -294774 -79509 120452 40154 -332459
21685 -124019 -112802 -47371 164771 74415 202453 -254671 31908 134404 -333798 -56168
21674 15704 224860 -246045 -182101 -35619 -49119 83070 -150774 -313378 202352 -84534 47053
21662 -175567 -167538 -124912 127560 -62323 51333 -140021 266355 -218480 -375059 -35088 -117221
21651 -117221 160617 221305 297002 65758 -41738 1872 4996 -192640 -11765 38262 -127602
21639 -97490 -258858 69590 -185699 227796 -242888 151950 -369751 -218143 -74682 -258412
21629 -258412 -146110 -87711 215473 -38471 321195 -57975 135591 40732 121468 -134000
21618 81546 -59689 -126324 -377187 91384 -151992 -83848 -282402 -201337 225972 17823 110973
21607 110973 -151983 -36985 -230175 -214238 68910 -286886 167658 -147013 -24876 -65140
21597 -65140 -168127 181229 -36277 34384 -513996 17933 -227914 35473 -477172 176708
21586 -40580 126102 81310 -27794 -74638 115944 184888 -13510 154899 -203444 262861 -141312
21574 -138768 36767 120470 -321468 150846 231510 -4684 -9994 7297 -132417 -81020 191379
21562 -144476 -271483 114264 231644 292800 -160721 -366021 -108339 3067 -130828 -8509
21551 -269947 -103734 -167999 151586 -95935 -126989 -429214 -16302 115246 251204 -48868
21540 -125543 15282 -79945 -468841 50094 -127504 -312115 -198505 -65272 -14371 56100 72865
21529 72865 228650 -46690 -179579 -118847 -178345 213086 -59516 76057 -265991 293968 -92579
21517 -7946 156839 -88100 260468 196640 -242480 3289 -128756 -24654 -204790 -77285 -82754
21506 -82754 150113 -244875 106583 -263289 72802 -73313 40007 105412 -118497 -152008 -212233
21495 -212233 -72670 14216 -219853 22134 -117706 80152 -65608 138426 -294267 69174 -178582
21483 29679 -138890 -98757 117532 172002 -279670 -8434 134042 -293064 110671 -56211 -12529
21471 -50328 -15222 36856 183284 136011 -194985 -129955 33155 242116 127984 98553 74652
21460 74652 39868 -129200 217230 9695 69737 -8973 -73759 61730 -163115 240199 -49086
21448 216796 -80516 -70016 9945 -13103 17344 294336 -213512 82255 -77402 -17425 -87128
21437 -87128 -201814 14338 2871 -45252 -168043 144605 165092 -20093 -118258 30739 122910
21426 122910 -91000 4192 -55821 226929 -259086 5871 95184 -215932 94526 -99353 -326380
21415 -326380 -393917 -11089 79266 38791 -373322 -194346 167928 91131 119073 33075 40871
21404 40871 74986 95869 -129819 -159402 124083 -245488 -30492 20357 16909 114743 -63149
21392 -188080 105010 -49779 -300066 -88344 -223307 230155 -183095 99512 -335406 -13294
21381 -243824 38417 -195856 -20891 42124 -351458 134813 178838 324673 53774 58115 219261
21370 219261 -14762 154198 -149083 -135201 -147670 -62953 -119569 136748 148708 -109757 -141212
21359 -141212 -136723 -486097 -275722 -29622 -42972 -57273 -44375 -134400 -213053 -50757 -161439
21348 -161439 -55696 39966 -89682 119277 58805 53678 63904 262301 -224104 -276013 -83707
21336 17908 120 -205901 -168569 35417 68086 122320 -196024 -252634 20594 -286311 71584
21324 141508 203902 -78226 427748 -238005 40285 31342 73236 105468 146353 -30304 30813
21312 -174409 -230445 30822 69161 -84051 -200754 -160331 -24500 -191534 -30917 -308242 -139497
21300 85410 -230750 -83301 232167 76052 -241500 -77881 -158010 63967 -353211 -44236 -113760
21289 -113760 11517 -156012 -25041 -265372 7173 -110188 94022 -374901 -91668 -37219 -69850
21278 -69850 215401 -434720 233085 82453 -227977 -450831 -120865 -3774 36229 11873 -46737
21266 296502 -151485 -169513 123830 -98437 112742 -12462 18885 -85594 -214815 -261227 189053
21254 125522 -294094 49282 -338344 -251399 -16202 -102506 197161 -167643 -79216 92264 -231335
21242 -349693 -330994 315162 -206701 158402 131991 -150099 -129525 67214 -67496 -214326
21232 -214326 31120 226657 -2765 -235660 104158 34274 -15459 -117359 29784 -11975 -76533
21221 -76533 73387 -325881 -448948 -256551 -127827 94490 31302 104695 36218 264887 -193137
21209 -23347 127 186956 -55560 -178382 532082 -259000 19338 16888 128834 -263199 -221759
21198 -221759 119777 -446766 62911 -100436 -79458 -331703 -107094 -41250 -208647 -65856
21187 -96320 -90637 -384522 318547 -16114 -59259 -67191 -191821 291804 -268706 -291751 -131679
21175 -281335 32751 -214243 168006 88487 32495 -60877 -12201 65286 172438 134220 49193
21163 3108 125083 -182998 -15232 118954 199249 40610 68739 327823 -83890 304523 -177500
21151 -323415 -5001 85071 -93256 -427504 -84595 -131476 34763 24506 -117810 140370 -137460
21139 -213547 202554 189744 93039 -53160 60869 -51426 -1541 -322104 146780 -17412 -184761
21128 -184761 -198378 85033 54611 -388929 228978 -199784 212976 -62910 -151297 -303260
21118 -303260 268852 35586 -245591 -486015 62444 -23996 -84357 -45255 67044 -262061 -68942
21106 -105746 243719 181329 -150962 58056 151636 -131194 -295679 -222772 -156848 -273630
21096 -273630 157983 -44433 124405 20653 -32339 -168608 83617 -57825 11348 -254193 -21863
21084 -186700 -7421 -5542 -244923 51074 -103601 -127109 148158 116850 26207 38152 -29995
21072 -455 -118086 139868 179559 -20456 -40877 -21413 -30415 -25297 -204845 62689 55055 -31026
21059 189327 -225015 187600 29300 470879 39685 -330247 155947 -65307 -2121 107068
21048 -456462 -83956 164021 -118320 117091 -40946 -113268 -90848 -4209 -35347 -100805 6524
21036 -47030 -57625 -167987 -144778 -96716 -301910 -21067 -282772 35457 185076 -86879 -189667
21025 -189667 -232992 -179290 119348 -68774 -110523 92018 134779 -123452 -111 -243682 -73796
21013 64112 -216115 -198448 269539 -264501 110158 -172371 -88328 95006 -6306 -123596 29505
21001 -16146 -42967 -79552 -192283 -346002 -39344 -34278 -15601 106051 310027 -46027 -26442
20990 -26442 -141411 379858 20813 -231690 -3353 -233860 213633 29178 -85208 212723 -308887
20978 -18950 105604 105909 137550 53384 -127310 145061 -37920 -131059 -199729 249944 102845
20966 -141217 -99479 65436 29011 8249 -16999 -300012 51517 -65673 -236704 -160031 -162026
20955 -162026 71064 -35795 59511 113360 -185795 84742 116026 50982 -21082 -199685 -141256
20944 -141256 141021 -77307 -97794 -101913 -98979 -63235 -262125 103745 -129985 101942 -323025
20932 -53788 8992 139347 -62758 73578 -99171 153328 -38060 251492 -91858 107748 387983
20921 387983 101190 52476 -177345 85551 40502 -168408 152817 262742 71083 488 -140824
20909 30407 156958 -108818 -112944 17959 151647 -171648 -227550 -38884 3453 65767 -48360
20897 -158985 -196734 -197915 288233 -168853 -29234 -286962 -90791 -176310 -10285 -333106 -224338
20886 -224338 470107 -130238 -92067 -50323 123265 -32199 -107991 -104198 -131011 4270 -91682
20874 -21684 118063 67739 58102 42302 163880 -82962 170764 62214 -162160 49932 -40296
20862 -35278 375996 73883 -25103 321858 -6645 33643 -387782 -577599 99262 51266 -515924
20850 -265426 -152372 45316 139475 -38841 -276430 96646 -279789 -57635 65228 79283 -30638
20838 338838 -175400 -58996 3254 -89177 28882 -167336 -156211 16838 10809 -3218 -46241 20028
20825 -174829 -172118 -4623 -21066 -20865 -315893 -19353 -123552 23795 126023 -255029 -95638
20813 -13938 104371 278225 240315 -75817 99553 69954 -91105 -278924 42877 -310924 -60830
20801 129277 -87043 -277509 -376774 73484 147190 -69459 -35232 60105 -155810 84854 86719
20790 86719 -493920 -376994 -354541 104345 -442625 -5653 95625 -255264 -92769 -153643 -31231
20778 -194328 -355175 -207945 19732 -269510 238133 -421544 89002 76304 -107035 -177317
20768 -177317 -104358 -298002 -235101 -111376 6718 41435 51496 -143678 -132815 -129389 7178
20756 -35685 -187 4144 -120076 -161106 -119124 -157374 -290764 28936 -154334 107883 -23226
20744 -167019 69706 -167072 107101 175275 154652 -442014 169172 -38615 82031 -4578 362186
20732 -21144 -321942 -77864 -192850 77166 -150122 83992 -138533 174516 -105075 2412 -209692
20720 121800 265944 -146949 185979 -297837 197655 49637 265414 -75399 -173590 110524
20709 -291889 -188366 29894 66982 -111172 -30516 163045 16256 -41429 -76048 126619 -208475
20697 263516 47069 -122843 -235376 -99284 222217 -50037 326810 -203690 -324870 -145795
20686 29605 -94775 -292889 36466 -122741 228349 -123018 -117117 110878 -110300 -337663
20676 -337663 -172533 -40540 -64261 -26587 -144995 398917 86861 121686 -162659 -351329
20666 -351329 163951 -233292 -371815 -397430 -389956 184370 -404523 -7622 225147 -83796 63748
20654 23934 -331403 -35637 -82409 -305722 64415 -160722 -52529 37825 -64062 -210792 -77334
20642 -164842 -189784 15280 160449 -137173 -67978 -10983 -390427 234424 -46181 118898
20631 10660 59167 -132628 -35207 67220 -144615 66078 -114967 3988 -127342 99004 -24465
20619 -84119 -375066 49046 -40224 289649 -334935 232841 -111079 -104307 -195725 215277 -25465
20607 -211516 37258 -36305 -45817 -100356 -251611 -47685 163143 204930 54256 42084 175693
20596 175693 -103522 -142408 125100 -3187 -189605 348539 98434 -113350 15857 -8671 -10923
20585 -10923 -285472 96928 17217 -3429 221935 339699 -152146 -177903 -16104 -296135 -227773
20574 -227773 -201331 -212885 -53493 9024 -26749 -164384 23143 9679 -543921 -233184 -316250
20563 -316250 -154200 -15828 50829 108185 -186918 67561 -271732 -416707 -355659 -44040 137433
20551 185678 -44791 370772 -33798 -209579 -296304 51002 43581 183571 55852 -208996 -112334
20540 -112334 186660 -286144 -124682 -25733 -46833 -15066 29941 489614 167437 15164
20529 -75154 -377293 -125158 -48382 97259 15339 -13804 412590 -240209 -17134 -203395 -338268
20518 -338268 -140034 48749 -92494 225532 93430 -128944 158598 18276 -152452 332482
20507 -170642 53326 -209818 136918 -181713 93800 3803 -236589 251708 -25644 244333
20496 -190586 -248238 -116383 -76282 34239 -141243 -38325 92010 -41677 -260415 398300 -163655
20484 109547 -236026 -6900 -185912 116376 -455250 -34744 -10385 -168990 -124140 -41565 -148368
20473 -148368 -184328 -64456 130715 168866 -5804 286091 106870 73992 -244135 -254841 -124001
20461 -288886 52772 55291 33458 -58962 109585 259154 162460 10462 -130601 -76323 -145309
20450 -145309 -50323 -207428 -218423 -539678 98717 -223060 -233827 -82360 -225462 163471
20439 33328 16680 230447 -247493 104972 67195 26608 -31915 -22226 -272164 -51631 -260445
20428 -260445 -181304 -92011 76305 -247453 142436 -178331 -34107 -152 126347 77460 -177095
20416 227309 39516 -214518 187671 -207551 -190794 -22996 -80 -213086 -13652 21090 -113227
20404 -28977 -379665 -189154 -255465 -156434 16296 -44424 164955 -34471 -74938 -94927 32075
20392 -24661 6578 126583 -176643 161716 -142724 130831 26962 58065 118345 -148321 109670
20380 -148470 61128 -253476 -190003 196737 84272 -380101 -85920 160513 308875 31736
20369 -72245 -177104 -4980 -107423 21651 -172945 35478 114638 -274148 -47643 28409 -228022
20357 210467 -56069 -70353 -35496 -221406 -112408 264084 66915 123928 -273383 147021
20346 -216105 109747 135779 378066 122634 -239444 63002 -61926 28033 -27700 -222450
20336 -222450 159893 -249393 -16596 143777 -65302 64954 -188667 335717 -193948 -165189
20326 -165189 -14904 -79916 -116193 49325 445 217824 -5252 -84889 28518 -85902 -409372 -219150
20314 -219150 163771 -73757 -138337 -68030 -301264 87620 -14110 241596 27689 -187041 -145040
20303 -145040 -328247 137869 -171739 14301 177860 -151932 -143171 -364351 284012 142859
20293 142859 -269660 -220190 91841 64159 -152701 -7234 -7043 3868 -79741 -328285 -62841 -25558
20280 -117511 -194379 98604 -1693 -28028 -303232 -358598 116697 -102168 -12465 -261392 -328200
20269 -328200 -52110 -9992 296549 -75383 157966 -134478 103898 -262041 -190770 217794
20258 105921 -483240 -399135 43977 -209553 22451 191261 237710 -281253 204372 -22773
20247 15699 106755 -59562 91964 -300892 -59123 -159135 196653 -68585 172642 4569 -160669
20235 -98410 -115375 -12441 239681 -115103 184099 -103628 125946 -127555 226946 -22901
20224 81084 99559 -191417 -298139 118978 -107310 -248139 -193880 168815 -275451 316768
20213 -328016 -375352 278050 -122014 -292883 -84108 264508 -225356 102870 -71276 358068
20202 304189 -330796 313532 -59440 288549 -144966 91891 -87392 33292 -156327 306667
20191 42794 -37077 271120 205 16807 -84489 -293451 119969 1564 -86644 -317139 150801
20179 -153467 -212073 -80158 112682 -436407 -295995 -179834 -371648 38391 188331 107474
20169 107474 -129104 188171 -142098 -178928 -150702 586977 -355886 -141632 31931 -318220
20158 -127314 -585007 -124891 65948 -303078 -9633 -125790 -307909 20470 -1369 199335 111193
20147 111193 -112584 85756 -173933 -99303 -7130 102246 -28189 118064 173649 -16381 15810
20135 -154205 374034 -89816 -426918 -112993 264373 190528 -115494 -254527 -214807 -369961
20125 -369961 37211 185007 -205240 -215332 15882 -32794 16257 150862 -361828 -22091 -79272
20114 -79272 -70931 -139359 46875 -103683 -85993 45241 -24985 128393 -232097 337689 -156619
20102 -271459 -383064 -45672 169888 247714 -125929 -124592 -111540 77891 -296458 -174456 -129857
20091 -129857 102497 -213909 136120 -185899 8986 58134 -183717 350843 -136182 4922
20080 76085 -28304 137376 -94805 229511 78829 -25763 251321 -59637 -165763 208920 36649
20068 -213033 -119016 -122750 423550 -68179 273937 182750 -9822 -157488 -106430 127083 -53139
20056 -29392 175799 -209656 -40797 -37160 205758 164180 91253 157681 37279 57751 -224497
20044 -121788 225891 -188138 84042 -183569 -196367 -163312 -168772 131068 -168005 -103565 -23346
20032 18006 -37010 -116561 143550 256894 -183267 -234146 -7430 -39219 -68533 216383 -236618
20020 -251510 -111544 -285574 -241849 -206317 139246 45857 -99031 79872 184222 -142757
20009 33520 68507 -299750 -240456 -155969 -179077 -144617 58258 171547 41029 -140203 -172299
19998 -172299 177282 -436800 146679 -118620 35151 -196900 -297556 -65357 -111249 -74740
19988 -74740 -60105 -22800 237953 -174896 -123332 -248444 18241 103807 -181581 -420906 -145066
19976 107023 -170765 36746 -191328 -132537 -8309 39392 -50628 -69906 -226053 191212 -142035
19964 -1487 183145 -233550 200982 -163499 -161392 177064 -88927 -17630 -235774 115404 -211310
19952 -24691 50898 126918 311168 79877 -254696 -142794 -86590 -619 -227703 -98723 -221782
19941 -221782 -28421 19585 48268 88688 -539143 -387530 -200385 -356400 187255 -49307
19930 -262259 -178168 -130299 -255713 162170 -179353 -45581 -28080 -143590 -193263 -116362 81387
19918 -47123 180506 -134028 170774 -138498 -231765 -14342 69085 -5814 -111977 -326146 122413
19906 -142600 -125809 -316871 -16685 45333 123277 -82324 301067 -69488 132083 142072 197773
19895 197773 -132262 76148 -27506 314804 270798 -158669 -174643 -257092 11632 -347905 25790
19883 145548 141470 4201 -1064 -143405 -125709 125444 12628 174254 9202 138748 -74173
19871 6437 -90407 -159608 -140029 94737 -212022 -321466 -227107 29372 -343930 17849 2331
19859 -289973 274929 -19605 -61386 292966 98894 -115060 40413 274283 -204950 -94194
19848 71484 9011 -302004 250386 -79060 -196963 -152935 -23514 -127625 278880 255845 144855
19837 144855 11546 -153514 81753 -130776 72616 -100213 -51685 -36539 115078 279946
19827 279946 -177698 -214393 -60030 69814 -271690 396337 -37833 -268210 87671 -82715 124896
19815 -352872 -54618 190408 -134772 -59670 -68777 129999 -198412 26478 -57253 -137063 -87524
19804 -87524 -36110 186903 117466 -103524 148079 -274322 -76314 -37453 -92885 -182768 -266581
19793 -266581 -9306 -244987 977 -151888 117361 -372477 186418 -218021 -108000 -157128 -48037
19781 -326283 -128867 133828 -218571 -120534 284410 -51617 -242184 -490505 43568 203787
19771 203787 -111952 -39852 -81198 -74767 -89353 136309 -201689 -132454 44763 -110923 -231241
19760 -231241 -96993 195110 97230 315223 -69678 -190266 -21261 144422 243864 49624 212072
19749 212072 226521 -472417 -328362 -101684 -184656 -192572 -20511 -24414 76682 -322274 -324972
19738 -324972 184646 391017 33445 -55327 28002 105023 -275870 104211 4903 -39576 -115681
19727 -115681 -191633 -189444 -252126 -254799 -127208 -456970 -32669 -20840 -77427 -151086 -213640
19716 -213640 70538 -324490 -98686 -336592 -54922 -194207 -62379 -198589 -236420 -68267 81877
19704 -22108 -174579 96570 254214 11522 -251681 208339 52189 -111751 -207560 265059
19693 -143328 90498 170202 -448413 33154 141640 55461 11972 -83546 -125161 53827 209951
19682 209951 -167298 287514 322325 51017 157759 136083 -68895 -59645 41581 -255655 72374
19670 98371 137764 -182651 -142282 156477 -135531 1321 150026 -210651 -144009 97251 44425
19658 -309006 -122348 -22730 178505 86453 17736 32951 99872 -56981 -166204 -27833 225085
19646 92018 -475142 185119 -374282 116095 -40468 -200757 -259534 96819 -13963 245884
19635 279887 -100241 120581 176240 -27596 -185500 -302295 145105 -64532 52889 201949
19625 201949 5790 51693 199587 -27838 46917 -155574 -20034 -195324 -169393 -193576 -119423
19614 -119423 -129392 -129653 37974 138324 -210016 -7487 214823 -7498 -259863 2284 34541 -107781
19601 -72707 -85099 -160024 206388 165471 143734 -159248 -400446 -86655 120512 -88618 42058
19589 -96088 -85487 -228599 229299 -194314 235496 -55933 -13404 -249767 88321 -221792
19578 133758 -19394 193756 114667 -11864 -328223 -790 -115159 -318503 124957 133988 63262
19566 -224667 -300692 309008 -255077 73349 111652 -192400 -211549 -240379 -163090 55100 -54500
19554 -191683 -111179 118712 13190 132545 192808 -162911 131079 43510 -142743 -91798
19544 -91798 -99416 153941 47593 85965 47859 -68888 -388980 146997 190442 -25915 25868
19532 -353191 -187898 276840 76384 229446 -67324 -508443 -273305 211318 -1675 -51692
19522 -51692 -221847 53272 243561 66535 406520 -235551 -175638 -93206 -923 -7601 -3649 -124504
19510 -124504 97196 -15217 -330670 257393 -57218 -117672 -70142 -421739 23268 49182 -247632
19498 -30535 43614 10973 -98090 -284416 -251657 -165491 127511 -126443 -39146 37701 -30992
19486 -279133 -161563 -116286 -10579 59340 -142994 62241 -177460 -236983 16457 -132390 -164076
19475 -164076 -15029 -230520 -222544 11683 -171613 42001 47920 -27353 -59485 296916 -35375
19463 261756 -211259 -190143 -127264 46999 -136622 -83155 -76401 -218727 193072 -206752 136747
19451 -197746 83107 -4201 44652 -311840 151465 -159570 -294885 107954 -126256 -43190
19440 -178413 -97664 198844 -24022 -7947 -214173 -81256 181732 -365013 -404645 146361 -257496
19428 -312202 67079 204930 -108887 172316 267568 -128306 -97167 -240492 97244 -305109
19417 -208717 -108011 -241521 49142 232053 -259759 -336574 -16553 142212 40204 164375
19407 164375 -100588 393543 259514 57482 -137042 -325757 228418 -315287 -102387 26290
19396 -182054 11373 -427406 99166 -307128 -264820 104288 113239 -24723 392333 -21417 -133757
19385 -133757 -31312 422933 58067 158564 -208595 -294681 -182962 187975 231615 295871
19375 295871 -232254 -403315 -72489 -212294 -246606 -1964 -97580 86532 -222978 47255 257210
19364 257210 127956 88390 -359574 6786 -175742 -167330 34130 -87750 -145804 157887 -45972
19352 -208084 -217660 275155 12145 54606 -191470 -150963 67476 3544 21816 -60478 327270
19340 15991 124267 -50054 -329851 -180520 -170994 75235 -174255 110731 -288271 -27256 -96915
19329 -96915 -399503 -184011 -81477 -131862 32802 -104896 -251653 28661 384874 -63484 -97645
19318 -97645 151854 -58083 216458 -292222 7249 212814 145678 -190121 149517 -205856
19307 -136611 225138 -66566 -36938 -195445 137550 -244163 -20902 -318799 115715 111616
19297 111616 -487208 -14677 214063 -235568 -222922 75888 -445299 -131216 165982 -10716
19286 285864 322709 -195599 188162 -118844 -364639 160473 117338 -143071 -258871 73765
19275 59511 39909 -209502 -176901 24982 -276195 -69351 264507 350884 288535 -92111 38395
19263 -80069 -335454 226169 -32919 -8934 304963 -28160 -46957 -99237 -100569 355311 -156891
19251 23672 -215636 -204124 43828 54314 -191129 -21376 157081 11190 -197873 -66745 164424
19239 -220318 61584 36254 -360838 -203090 30269 -177652 -29158 -331400 -48908 -249044
19229 -249044 -30267 -19981 -50455 -115522 -163756 319884 -193402 -39961 55562 -146036 -404413
19218 -404413 -84877 179557 204191 -24294 -97530 213566 -156463 -28554 -41871 -109479 -237235
19207 -237235 91148 -198322 203457 -557806 206324 -105555 62791 305686 243641 -78563
19196 -60455 -357947 25614 -29811 188816 -365153 131018 199157 -117347 -138398 -111251 133991
19184 -305898 -30425 -186570 -386988 -384166 38904 98606 1476 -211924 88991 -230198 -298172
19173 -298172 -141212 384346 113715 82292 -231772 5858 130959 -152449 -197136 -146673
19163 -146673 -348497 92155 -106222 -28152 -139759 65470 112834 -175198 150314 153520 -337681
19151 -113742 -242336 143984 18412 -192633 -118545 84077 96005 -9438 7679 -58583 216872
19139 -24856 -54430 127353 -126639 56305 -63889 135946 -89068 -282229 -80224 -181611 56361
19127 -96325 25465 35859 -115415 -128889 -20687 123370 197123 98688 -147532 35087 143325
19116 143325 35379 252185 -6113 -430554 -204504 -328613 -182874 -156703 62816 -13914 -272629
19105 -272629 -63130 -47463 42753 -361055 8215 301285 -23501 -87943 -160275 -288334 8494
19093 18250 120580 253061 15318 112340 -188 -30392 -84792 -68821 45119 -102483 125163
19081 -25502 29631 -100304 274489 417143 223947 151021 -254401 -217715 -59409 -144137 6424
19069 -190639 1291 -127860 86339 -87919 167986 -299915 172505 -200164 -545097 -301770
19059 -301770 90774 -283941 -41809 -15734 222182 268010 -136174 -169444 -394748 -123479
19048 -150601 -85087 38639 -41637 -173926 136359 -8800 -59171 -88233 61960 -276925 -168150
19037 -168150 -90584 -201852 181197 55268 -411810 -165581 266741 -314471 29787 -431226
19026 -180082 -121551 -182377 -21163 -37686 -42049 133000 -155607 -348159 8485 125577 -173022
19014 2089 -124967 235764 51051 -75412 -127590 -45125 58001 54769 32126 -163008 208564
19002 176437 -147610 73307 17497 31009 220293 64263 -143648 -49297 201797 -164421
18991 185725 -349714 -145176 -15811 -137550 -25342 207227 -172173 180640 -242500 -307221
18981 -307221 -270713 -369328 270833 -284790 -429476 -8069 233407 -23017 106220 -150903
18970 -60673 137622 -15715 27077 16002 -6133 -111809 -336018 220710 257912 -262398 59447
18958 357696 9536 2673 -239334 508 -164944 69122 -6422 27604 -411239 -58228 310358 -31009
18945 -201250 -181102 37386 -246058 131611 -144577 78439 -25742 63616 43235 -120633 -306538
18934 -306538 -190657 -28161 68350 -220465 -79101 -52642 22568 -53237 -169831 -25082 321421
18922 -24247 -16024 -202234 -90119 -131611 -181864 65215 -108867 -437496 140235 -205574 -232812
18911 -232812 86336 -307686 -102263 -363853 -79736 -215617 82497 -94946 -13710 -219277
18901 -219277 -169135 -40619 94334 5173 -448692 -91536 -183281 43096 33907 -146771 52806
18889 -97824 -368292 -40450 -444534 177038 -274546 -76836 -189869 -172642 -57597 47485 -78686
18877 216772 -381280 -4424 37867 211023 263011 -124611 -22184 53877 -75160 -124531 275221
18865 73429 -291427 155420 3505 153614 -121163 -220478 61320 9926 -1325 23392 -53903
18853 -219847 -210723 -115628 -141599 -291606 -85897 -161064 138818 -155709 -28512 122756 -95808
18841 120057 210349 120638 119895 -246599 142862 24654 -103227 103605 229870 310782 -188331
18829 -52765 72212 -154919 -47438 42167 26063 687 -36571 -56071 -348914 -150659 201493
18817 -180581 340450 30932 -66796 -159131 -25838 273878 204399 93588 71651 -226448 -123359
18806 -123359 -185545 -103516 -359778 104420 -159087 -236257 119222 -141970 -100613 -99432 -38231
18794 75897 -33297 31846 -298017 73526 -318945 140768 -217664 45131 -45250 -113329 -44522
18782 78488 -55194 -58267 -19178 -159972 173911 133557 -189582 184219 -29039 345321 90922
18770 -297197 256592 -223505 -200746 177648 127655 176840 41359 -71412 148486 112512 -110633
18758 189279 155576 -77356 303419 58960 -356922 -23846 -115526 272417 142128 151657 59233
18746 -94492 -252052 72658 46859 -184406 -81452 103804 -94317 -40402 224459 153132 113918
18735 113918 -174863 -41805 -119705 -284981 195863 -85963 -14086 -43463 -40406 -264295 -245431
18724 -245431 -487269 354478 138968 11953 -168139 -225966 -213264 30481 -193525 129725
18713 -194707 -156491 -903620 15772 -5983 -53578 -89645 -148653 165275 -72740 -364158 -299375
18702 -299375 360074 119059 35935 35788 12743 82891 166546 -53223 -113121 207668 248725
18691 248725 -20349 175662 5077 -88685 -112260 -22925 -43617 -1888 97300 38000 -3348 97521
18678 236569 123875 116952 -126454 -100958 39686 -17208 121197 -399697 121626 -174298
18667 45809 -395833 -367592 12715 -155888 -577536 4984 -77019 186558 -129053 -42743 26668
18655 -89890 -189457 143872 235970 -184316 -216392 -446538 146949 64165 13906 -47393 70106
18643 -58668 -218683 -310496 -2617 73571 -156528 -140343 -50851 27191 -272772 -353832 208700
18631 -56590 -198714 42005 -62107 -119772 -539037 -24503 -355490 -161197 -76313 -117883 249379
18619 -99147 20090 90776 62207 99741 176676 31906 177483 53299 -258169 151079 250188
18608 250188 68142 -360554 -288760 -150784 -114590 -249756 -232648 -88207 -428095 -260843
18598 -260843 -1236 487334 16883 -90067 122706 2889 224605 23610 -96657 -139351 -250383
18587 -250383 58428 146207 -12743 -47898 -7753 -20024 -275482 15794 13362 -41039 59861 -274497
18574 217207 -38886 -64752 286529 -74611 -321360 -88400 -183393 65678 -40727 57803 185428
18563 185428 -215933 161751 -141304 -197451 -286142 -137220 57196 -575562 147056 102531
18553 102531 -31946 140333 -134793 -70703 -276413 -369081 106820 72136 186169 -119553
18542 431794 -378396 61486 -192788 172877 -108142 -157255 -9485 160311 -105013 -173537
18532 -173537 130047 -246472 -109267 -39757 77659 -84985 94889 100752 -277527 -314282 218383
18520 -49156 -145310 -49497 45348 117829 64594 229411 -77998 136801 72861 -125981 -186075
18509 -186075 226901 129103 102586 -76296 -56781 236023 -72646 -308502 353012 -166573
18498 28928 45667 -122904 37229 -58246 -62026 -128152 74035 91753 94079 182324 28039 -8986
18485 60157 19160 -157815 -302921 -12764 -143960 56722 -198208 448605 -13966 -541956
18475 -541956 114285 -340760 146947 -27613 -165993 -226598 36581 88097 21892 -297182
18464 102560 43447 98954 265549 -202341 407190 405895 -50185 -69345 110056 297198 -272420
18452 -95392 119558 136281 -179254 -59655 32362 -245764 52256 -97 -85286 -79173 -221445 451188
18439 46261 -223646 -427285 67526 -37181 -241164 514032 -150600 -326688 65591 -105272
18428 -262072 62589 44740 -149545 -337502 -28233 32097 -438011 -176450 -145988 122035
18417 518239 214061 -231494 255601 -54111 -122424 -95431 -229862 115117 -176190 30823
18406 155745 -71662 -28333 -133025 66974 146635 -42282 29466 -236315 117628 119883 -57061
18394 -256078 -179363 65552 -317513 -224255 -163507 -59594 -93063 -43679 -158753 253265 -300957
18382 -31837 226529 32947 -328907 -46239 -268873 218684 16919 24817 -253690 62585 -407286
18370 -194546 -25428 -136314 -219223 293301 -122839 -23160 -129006 156904 110149 92091
18360 92091 54390 5284 27070 -242209 -43886 -19648 -209694 -1208 -259752 -132828 -329139
18349 -329139 -443065 -66069 113484 282812 -154762 -154268 -21479 -132707 287602 -403100
18338 125994 -168255 -269533 22384 95153 -115973 98087 -39491 -9492 -75763 -79638 -296391
18327 -296391 -189830 -88183 -61334 -27703 128166 323923 58637 -61323 -235099 -145358 72893
18315 65069 -20602 35591 65802 -300031 -147167 -5819 99071 -54890 -91867 -57512 98501
18303 -53726 -48341 -340018 137411 -129914 -98933 274671 -59058 251568 187870 11366 -256850
18291 66463 -9949 141561 -288129 251616 36928 -9658 -7247 33555 130310 400570 -139327
18279 168086 85173 70686 4371 110630 -14392 -225374 -73559 -3826 278496 77314 31673
18267 -135011 -225560 157275 37859 -326940 -66513 -40644 3933 -160812 -140974 -99126 280368
18255 14148 -106251 61922 -147557 183784 -72761 235402 84187 219642 -64411 -190356
18245 -190356 195064 -49846 -167711 -133974 -132665 -283486 -98672 -4435 -38336 -31166 -144265
18234 -144265 -93908 217183 700 -289900 33374 215759 160710 25522 20878 56551 146321
18223 146321 124444 78197 127685 4591 89218 -232697 -89688 -86786 283040 -410506 -68735
18211 -35621 -310046 -210351 -210740 89890 -15507 -189858 -196457 -337836 151994 -111473 -285623
18200 -285623 107137 160661 -119278 113992 -35788 2925 20214 210729 197088 -211620 -156762
18189 -156762 -42792 -409560 16525 128421 94173 65222 -87466 -82584 74147 -112610 -149961
18178 -149961 -36670 276212 -57856 -104692 60819 -260868 -45465 101851 39677 39133 -257118
18166 -205106 -176056 -305483 -18349 97179 -106800 -8314 -79065 139648 63680 47717 67215
18155 67215 -225652 133475 200139 -13798 42802 -200914 -58789 -239803 -230992 -98069 -114421
18144 -114421 34759 -375339 243903 -68913 106618 -136999 -175634 271388 -99816 -208487
18134 -208487 -109459 519939 -199500 -197579 55078 -119247 20713 20785 -35336 -35908 43772 60263
18122 60263 -385945 58283 44390 108166 -370928 -67329 -35261 -457936 39543 24356 -451502
18110 -295455 52130 -64509 -284826 -296029 153963 55486 67149 96332 -118958 -74600 26379
18098 -94399 -170430 3682 -73177 -49372 -265140 1401 -141627 -168206 -294605 -125494 -133367
18087 -133367 -106180 -29622 288740 18761 -85267 -134376 113688 -276705 -172473 -161476 5101
18075 116659 -138226 -334964 12351 31393 -558788 -245302 6547 72972 260634 -90499 -156603
18064 -156603 -99724 -158903 26982 -152805 -92575 64015 156762 62048 -25795 114293 -55305
18052 -88443 23358 -8500 -18385 153822 -76740 -122868 -171517 -109233 12445 236405 -103875
18040 81272 131297 -8206 -24046 35721 -110674 94640 -227164 183649 -131917 -20169 -96480
18029 -96480 -111439 91191 -253879 -41851 -79226 -7910 21649 -280795 178336 109592 -40810
18017 -29163 174114 -82234 86091 -234215 132085 34222 7687 116521 173926 -360397 -416663
18006 -416663 -122859 -264093 144182 -131007 -98568 -167980 -6455 -105392 -72659 104976 -230247
17994 -284946 121933 -306646 -302233 -60318 -361959 -138635 -141912 137697 14448 320743 134087
17982 118485 135687 108611 297505 14228 -161768 -88483 -197988 -151315 269567 20272 240457
17971 240457 -8689 113467 -19845 151476 154774 -125881 -298785 -228092 144424 -98406 272821
17959 352647 150379 -241087 -25973 112196 -207508 -61357 40119 9114 -101672 -134775 -101948
17948 -101948 -80295 228607 -195493 -15591 165519 -77551 397324 -437101 -133314 138540
17937 3504 -340022 -30156 108972 -107391 -97783 -206491 44291 -34495 259061 86976 116532
17926 116532 -42539 -128464 -153346 -113381 -101317 -330693 12591 137035 331186 128337 107726
17915 107726 -11516 186698 -49146 -62392 -313327 233314 91782 -183517 -530190 156068
17904 -61976 -126044 374630 -339205 61491 -112981 -83834 330625 167833 235446 -161285
17893 -275723 84164 176209 -194103 -167869 -137911 -158058 -74910 84642 -431593 -68481 217170
17881 104409 61429 228577 -184198 49029 51543 -16858 37424 -222366 -85286 -283723 157984
17869 -80148 -284911 213401 -188119 167096 -113919 -22285 150837 -11311 -277388 -219482
17859 -219482 58138 -8481 -32439 -107242 -280168 147555 -240292 143914 253845 -84328 -303789
17848 -303789 31871 -145559 283150 38495 -99756 176228 -386248 -175637 20111 12325 -202149
17836 -99899 -150656 140373 412081 136148 -188571 82050 27611 -55376 -249772 57210 -138419
17824 -44920 -206096 136265 -144108 204551 -30903 263568 42613 -31472 -197265 -162157
17814 -162157 32776 17668 -288264 150726 -40376 25990 -16735 -206229 -107092 -36990 6885
17802 176706 -12707 -202327 -32026 -202232 -104690 -253755 33975 178089 130734 -129407
17791 5473 -170030 237329 62606 98344 224573 -93798 -76827 1557 -51521 -395142 165419
17779 -26719 122155 -180148 252247 44864 -117337 -299643 -152562 179361 -2725 17816
17768 124795 -221187 -133267 -162140 -118 -328333 -294430 9738 -301092 152975 -272146 149340
17756 119191 69397 -162486 -237704 -276196 40187 -399336 97619 135778 -76658 227247 -118893
17744 -204198 -16872 -272178 -369042 -36185 267024 292385 -319395 -331117 -388480 -12670 92719
17732 167522 164179 -22535 -157808 3338 1748 112374 -164113 -37323 11300 176812 110409
17721 110409 234963 97632 70533 12454 771755 -19907 36416 -290521 -120860 105413
17710 -180622 119417 181281 152154 -122324 -202599 -279806 73461 170738 149655 189048 -154682
17698 -28451 219635 -422374 89441 247330 97348 -107760 -21207 -24243 -210014 -60771 -294620
17687 -294620 -338671 245284 -255319 162023 66409 15793 268658 -43402 214781 -250061
17676 12336 -28160 -3647 79882 -58821 102118 -131968 235332 70423 8164 215400 64077
17664 -85002 -308420 -299421 46720 -170907 -145275 344215 149473 -206112 -76646 -424024 58484
17652 -24922 124828 -28662 -69382 -70721 148252 -45755 183847 59497 45168 130058 -93091
17640 114466 -103733 -322794 -176969 52600 -287226 -183838 265004 -282845 -148593 -229013
17630 -229013 31388 108726 83528 -367913 -40318 75025 8163 186768 201293 -32206 -73966
17619 -73966 541341 221939 -287028 127489 -93527 143817 123358 105392 -124022 154977
17608 162217 72181 -107624 96120 -215512 20402 -272169 -214097 -251962 -221093 -319055 -207855
17597 -207855 -133518 53752 -256625 2821 195328 208823 11005 -51375 45805 -207337 -125856
17586 -125856 277139 347287 37516 -110017 -148683 -19359 39513 169574 116631 397481 -47976
17574 161136 -168239 -414972 129473 124471 -51671 113029 142681 -249703 -94250 12778 -182383
17562 -181844 -258031 -344549 -358612 -84139 -156529 -232984 86646 -324209 106908 512 16646
17551 16646 -42643 -153404 93110 -59329 54142 -227236 -66620 -197742 -155108 105392 -57768
17539 292121 -53971 -79235 192308 -249710 173592 243007 -184380 9814 155201 -33985 19727
17527 -116657 161684 88271 74629 8257 65298 -34640 51233 -178580 -26374 -5116 48289
17515 -244695 -142792 -410326 23563 276809 -308839 -30140 -42708 196619 -71875 -462097
17505 -462097 -60426 84043 -159517 67881 -293989 -229485 -160169 -691 136395 250096 189792
17494 189792 -64104 -275211 -64700 -126511 144098 111913 201972 -78604 170613 129078 28063
17482 -137077 164535 -2340 -229351 275725 -150662 222992 -48839 131583 -73416 77995
17471 20574 -99732 20078 49506 85894 84367 89716 90844 221722 194365 -178099 231394 -89203
17458 -118233 -121894 209842 209439 41920 94610 332987 -226770 -135566 -283956 169402 -302376
17446 -117374 -259356 -229035 76224 -49904 -173215 184760 -267431 -43913 -311162 99092
17435 1180 -253762 -181001 -157847 12197 -380683 24157 -11265 101332 92146 66105 -138260
17423 -55774 -166290 -12883 124574 118530 -152920 63760 77928 20354 49558 -171388 82056
17411 -143412 119718 -84806 28306 9330 -36501 -5650 56688 -51126 302496 -466402 29739
17399 -10947 37665 -142636 -4968 22489 240294 252029 -164780 -218972 -52704 389156 -165755
17387 59887 -278129 -223762 370263 125852 155437 -138667 4219 -332085 -579279 -164826
17376 -233352 -75082 140589 304253 70056 -205097 -56211 36281 -247019 -62202 42545 -181907
17364 20505 151097 -40928 -43147 184062 -72389 -24350 338913 -7354 153357 66936 69924
17353 69924 70674 -312981 42451 -11833 -109611 90564 73787 -120039 -180247 190129 -172228
17341 -103143 15702 -383764 78547 36492 196415 31301 132140 71117 155285 -78372 -65329
17330 -65329 56486 179797 -270729 -25101 -13998 -177547 -356235 -195162 42333 221384
17320 221384 106612 -22910 -245110 217428 -40432 56969 57066 -145361 -50266 -120645 18504
17308 -29657 -115423 -23506 -68915 90246 169086 -114603 127777 79050 1378 -55127 24739
17296 -128979 91992 -197941 179699 32308 -35743 174571 -156676 33840 -142559 -172119
17286 -172119 110289 -103403 -48771 195070 267469 -142518 -183868 193773 -264551 337637
17275 -106539 -84016 211622 143865 43424 -248508 -114264 -21493 3378 60664 -9943 168327
17263 205501 79274 69162 83877 -23270 -245234 -109055 -115883 57661 -121373 239179 -129549
17251 -24201 -38419 67525 -93196 232478 -154826 -164523 -166486 -15480 103201 -39996 231635
17239 258566 -49442 97080 100320 27589 67169 -102023 135922 -62698 -21891 -239790 -162776
17228 -162776 18750 -184855 -135178 -146141 -35584 152528 -117083 16615 19157 -1400 118396
17216 -77288 251052 -97317 274119 -87373 50077 -253892 159650 4883 399026 -169478 91362
17204 -229062 -177314 -193780 357340 -148662 -323070 122922 329374 -204910 -81895 -115165
17194 -115165 -60492 137192 -85730 161029 -240576 -4474 369625 72844 39752 -209276 207794
17182 69624 196167 140509 210288 -366556 115775 213726 -98778 198310 318110 -19175 12430
17170 -227758 -11704 -51103 -150511 320503 114832 -79739 116887 -51618 176780 -8715 -94011
17159 -94011 31067 -37447 195051 52283 232845 -67907 287362 -22846 142991 -110954 -169458
17148 -169458 78718 92621 -80833 290379 38284 56835 -215243 233467 -229348 -37376 9578
17136 386229 33717 149871 -16125 38785 22789 60784 165886 82411 105372 93165 -36275
17124 -159771 -46473 -6538 -271601 23610 -86129 -18272 -357852 165639 203328 221811 -421492
17112 -128504 72721 199963 1770 158331 -138550 162908 113314 -172996 112519 53351
17101 -152934 -127939 -80923 346243 192556 -188049 164230 -70215 -189700 -53342 -60015 107475
17089 16108 184100 -46721 -106117 44999 103161 116525 125472 -303813 -290154 89427 -315262
17077 -115221 -423022 -184449 -222633 297842 158484 -272568 43102 104851 -23256 -264585
17067 -264585 -223616 -223385 -125310 -108212 21555 192576 95712 -40194 -74778 -111317 128717
17055 -97375 -228908 -216261 4543 112961 -130171 -112377 -198254 38466 26438 -105007 66205
17043 140789 60533 -21989 295487 -89612 -112892 18708 204670 445293 -3334 309134 171687
17032 171687 155726 131542 -173859 276650 -80374 -53574 392379 63569 -236225 -152 -371606
17021 -371606 -16772 -142057 94472 -44152 -149518 -90202 -275344 115728 97558 -52638 350872
17009 57468 205596 50779 29198 203302 55576 -258848 -152385 49848 6932 185848 377589
16998 377589 -225558 79151 322790 371710 299991 10053 -51873 57368 -107917 62766 269218
16987 269218 91211 153546 -255238 40470 9473 105891 -233390 -29297 112795 -515337 26677
16975 190169 -137486 275015 -135290 164571 239751 -16700 14346 -162724 -75019 -53667
16965 -53667 182729 -63136 106696 -222856 -205545 27093 194092 -6881 -129222 -90216 -244428
16954 -244428 214245 13787 30277 -297658 24765 5261 37591 -205492 -79895 -331730 92925
16942 333824 41317 114290 -355 245712 227054 471236 -103857 255260 -1396 48082 15440
16930 -333026 -120445 472440 64686 -244706 80978 -44323 45630 24241 -19962 -115504 21840
16918 -70512 -153386 160901 201373 -20008 -96070 29171 -449955 -206434 253199 -90169 -225733
16907 -225733 210254 -72732 -64964 91224 93272 -54963 -524153 56479 -86502 -186173 -528990
16896 -528990 -123634 19326 -53419 -174518 -119228 -191025 -4783 231322 -107526 34898 136999
16885 136999 7953 -19643 -298293 -88558 38011 72152 35584 69830 57562 22176 -133894
16873 246629 244190 -265750 -171497 -27815 -58629 -90804 -236233 -247360 -264403 -167836 -108241
16862 -108241 3244 -27786 -190217 291592 -49765 -2581 -123189 -312219 -93429 12349 380329
16851 380329 -192485 122096 -79552 87795 -193574 -259981 103834 90655 -117298 -61584
16841 -61584 198464 -109250 -45854 196347 -126079 151312 -70450 36491 -166039 -175288 89308
16829 -247385 71970 23395 -111429 506989 102845 -38566 -154782 -166915 -304679 -304764 -187485
16818 -187485 59814 129281 193594 174609 -204936 130541 -140441 10356 59478 -105370 -110716
16807 -110716 188509 -165510 94128 33894 -57071 515281 -28355 83244 41164 194686 -141523
16795 202534 -180287 231307 -8998 -171925 98165 -128608 149853 97019 162139 102586 -65961
16783 -89565 -248861 18351 -76228 -121027 -4409 209983 -222587 411118 42536 -65493 5514
16771 169931 38831 -138340 136685 185541 76816 181320 410552 23744 174870 -198596
16760 64042 352980 3170 185951 174272 -217801 -182778 -24130 -60804 345653 -396060 -31818
16748 -12304 -109383 244957 -89385 163582 108008 -23013 -241821 59213 -191612 -20892 98735
16736 6936 189856 192121 303592 85663 -40260 93392 -47282 -153739 -297867 -196442 176364
16724 -32745 -163842 158441 86427 -166037 16296 254382 142991 -3923 204797 378035
16714 378035 203793 33592 -333842 -223409 31161 316576 -66997 128288 -907 -259921 -12213
16702 -139889 -395088 65787 -53668 14393 -306352 -43891 177730 103776 -360385 -47620 -197013
16691 -197013 -168648 -20621 -95949 105134 380574 -22431 -249403 262783 -279749 -68755
16680 160478 298941 -20461 234595 295849 18662 -87337 18278 4740 -205684 -355899 36516
16668 55467 33797 13954 64093 -8109 -219555 -44986 -136092 325982 72533 214634 175162
16657 175162 -326317 288550 184420 47798 52196 70490 -174635 103605 -17887 18832 255081
16646 255081 -17719 929 -356137 -178568 -71035 74698 36678 224636 -24892 18463 -239045
16634 48370 151925 -209987 172961 -253651 -10327 115904 455335 -38554 4019 72772 -96011
16622 -148870 148820 462121 -167657 193447 260772 -13358 -92142 182085 -124214 67604
16611 207632 142953 208454 125624 179126 37517 268758 -22559 -33511 215434 -99505 -248198
16600 -248198 110820 149651 -72414 -26513 197465 177392 83003 11130 77613 372145 76274
16588 115159 -27880 -94651 -12464 33463 195029 102723 54610 -154369 15591 143147 -144982
16576 -69223 46439 -95277 184226 -165853 189648 361368 -82387 -43840 -221112 27152 -28648
16564 -136542 -182439 -115746 150075 -128838 146043 -99400 166500 13807 134143 90892
16554 90892 190532 143590 -237374 -17809 232117 78056 -49683 -78741 267896 207632 133694
16543 133694 354223 -263249 -7556 -282522 -398849 -94928 253226 -81537 44698 -64654 338849
16531 -139940 180930 -107476 -197482 -101830 113214 320641 210570 -49096 -33765 -29431 180787
16519 12465 -12133 -21527 135084 8725 81576 85114 53563 -41227 269305 -551614 -171681
16507 -136122 -124260 -199166 462689 232141 13436 -335240 187116 -187791 118558 97509
16497 97509 -317320 -42138 -123676 -162503 -198621 -18749 -146137 -97113 84 -69121 -106495 -46781
16484 213247 -206146 -262207 473900 19739 312907 205937 195462 -30108 -216249 84178
16473 -24743 90165 80494 4758 36411 198092 166385 92781 169002 -146974 178168 205077
16462 205077 -87047 175699 276093 -157124 -163120 160519 367710 79449 -13467 -146144
16452 -146144 -87664 -240037 -124730 51913 -12835 201192 -228041 113136 -1665 102740
16441 208935 270070 -115972 236321 109342 19974 500464 160906 181201 198812 -179901
16430 -148359 48009 7667 193687 102635 197466 69220 -205270 54080 164818 198475 -12191
16418 117705 127058 34560 98233 24320 -105757 -26683 -531313 430251 -368189 170654 114378
16407 114378 -29189 333408 -187478 -89222 -240893 165830 40276 201609 -181391 -207346
16397 -207346 388926 7501 124095 159955 -94045 226655 262669 -47567 -97943 -111502 -6659
16385 193155 554739 19335 90074 27794 294031 30983 -73840 -35115 -59031 145600 105582
16374 105582 138810 191324 11712 165790 255716 28156 139021 -75148 66148 324481 63113
16362 -115890 133197 -90601 -71717 -121958 -64262 156893 55595 -162306 -279556 196299
16351 130663 49511 86801 206546 95893 7832 -26531 -108052 168575 515341 -88451 191849
16339 186848 425133 142418 -286400 -259214 18992 -34784 -93734 260661 -58284 221373
16328 266623 -9574 146846 155591 -57227 -222734 144525 7894 271756 107041 -13380 322777
16316 30269 -17852 -158389 212510 23078 310469 319475 -95257 -127654 48459 111556 -25368
16304 477835 -116149 -131428 199731 -31526 85371 -269405 -73897 -296610 190908 -109106
16293 -44364 317648 -2283 217245 95817 158667 288245 325424 309794 208906 -10114 39249
16281 28958 -13638 -145532 449964 -60776 -8526 -150477 76413 361852 -190571 195422 -88994
16269 186979 -19889 409541 -166118 137581 295929 -164389 110293 103828 -267931 62503
16258 -100437 -111284 -73055 -13594 130185 -139761 197914 -41109 156910 49140 -173155
16247 -125409 -206064 20618 129318 160099 187936 -97780 62434 40934 123094 -3265 -5714 153920
16234 92852 159726 185647 38165 38869 88230 -100471 124161 196204 -44623 82132 12734 108324
16222 108324 -212614 279550 -186531 209199 32500 131873 327755 129426 217189 -201608
16211 153061 1057 176130 288725 -59373 427695 153439 227560 -38409 67090 73692 -69766
16199 67768 63594 267400 333629 194749 -165517 98289 182083 -52327 206695 109432 116672
16188 116672 -49887 23642 2138 276697 72690 60745 296167 174453 5821 -90778 -165704
16177 -165704 45455 83440 291579 140432 265385 186186 153460 -132805 50652 268974
16167 268974 132 75374 166416 -102387 113995 312871 90310 -204698 -230505 275254 119021
16155 352878 211068 192579 211706 220779 -25435 -85483 147518 335075 321524 -186735 247409
16143 154760 65027 -16103 -90066 -14365 177965 -208147 335991 199075 83024 152231 191068
16132 191068 62598 92133 264838 111249 -84230 71309 247555 33908 124726 -109491 17399
16120 42942 32428 585875 274617 281902 237658 242238 520212 -160152 -108294 209622 -77158
16108 164512 443968 353178 -16183 76178 151010 319354 288061 -317877 51919 16029 -76286
16096 60886 40810 201304 84522 16717 -71433 392477 200357 -50271 60906 62205 313005
16085 313005 41641 -21475 61476 386255 450156 143782 411597 96441 20016 319432 129067
16073 511254 135066 -62356 -47371 99251 164506 102914 89107 -79023 68449 -248666 -28894
16061 495370 123777 46644 80067 142298 78323 117587 -188200 -53513 106757 185567 212632
16050 212632 445246 100108 165717 255595 -105288 3677 176078 393247 178607 199929
16040 199929 17620 192178 -60976 187484 234301 237019 229686 256011 -247 -40172 38711 9462
16027 39492 78148 362083 141817 415682 40479 599712 58257 -147904 166014 -119092
16016 20042 -3957 337864 107184 42792 271139 333849 -113715 -126282 -17102 425357 -54374
16004 223285 266351 420037 372409 123037 -40166 472398 49498 360908 96274 -80045 265717
15992 11057 308168 -144449 56773 63892 175431 100666 84922 138526 129264 189660 305401
15981 305401 155003 1029 295927 70417 143718 382696 312804 213044 337397 -180063 -280339
15970 -280339 38638 234798 78553 -15423 80144 270374 352633 431340 117000 158200 405307
15959 405307 410414 307837 204778 -16310 136491 57687 423045 111431 -204325 251613
15948 -214887 -69501 246440 159534 87620 -16973 576143 341939 -306432 49485 19469 74515
15937 74515 371838 137179 -155642 275135 195589 369899 493788 357188 602241 180137
15926 -164357 64301 53161 11502 373412 209631 164288 16186 78559 174990 3381 40371
15915 40371 139300 -96758 71890 282891 165661 74569 112919 -46719 59321 -27381 -41054
15904 -41054 172853 240774 409678 -66593 221356 13345 -12687 244441 325554 -170476 241818
15892 394715 164903 260978 -133808 133929 -14356 11246 292086 236047 -101315 80677
15881 -73123 -56932 -148643 287429 183008 220080 109071 127038 34588 149570 -257646 60562
15869 201520 260099 -110159 -39410 179377 97054 84407 -31171 -216800 335452 169458
15859 169458 121046 24305 419248 306055 245701 330526 279644 -109696 164503 455138
15849 455138 -1894 56464 314242 77895 321559 290332 164396 119177 652568 143377 166059
15838 166059 167590 226948 286978 188772 23169 9478 330039 -244962 155526 543044 210177
15826 -7053 182244 592780 -184525 -124098 193548 77126 205107 155066 30619 150894 30103
15814 277795 355730 -196636 235134 31947 630647 -202585 -21964 315743 -41999 481509
15803 316045 209024 10654 393229 -26846 422052 157940 -249125 259111 138675 180477
15793 180477 424439 20460 366962 143528 255977 259389 -18971 -139315 488937 272160
15783 272160 225105 93241 172330 192332 223682 283228 220276 54193 517704 98462 154209
15772 154209 -166337 384120 -120525 116271 355920 -167507 212520 -65450 214938 6322
15761 481356 -7430 337231 258005 250167 241691 -15163 -149583 304540 186665 290924 -4985
15749 -26935 -124421 342009 57132 284500 54770 639302 -60093 188257 212471 239157 40700
15737 315763 214901 -86515 411188 181629 396577 453707 2654 52300 506146 199346
15726 375759 13143 564035 -27753 294948 120494 120614 317150 307895 208725 -90621 167974
15714 214126 364470 -537 -29206 527986 236476 395857 75453 -79347 -69884 122390 137121
15703 137121 611908 315682 399834 230227 525826 252476 188881 239592 238824 228972 120961
15692 120961 273423 90933 -2653 -56769 -117845 29439 13919 201120 328648 310943 238155
15681 238155 -197071 232318 111598 4026 344960 460661 349018 123158 306949 84428
15670 498047 458705 250358 268671 81520 402765 79693 132065 106478 421648 481855 70035
15658 167671 903310 290812 164559 20878 417593 145556 59961 398643 190293 195308
15648 195308 302918 111596 270714 62227 323120 218762 271561 257430 515167 -37385
15637 82508 173498 396325 183197 204499 104695 356890 80517 -267441 344384 152528
15626 -5767 7866 221141 72441 98520 114294 451021 205591 292861 552127 88750 234669
15615 234669 368194 306978 387061 83772 -38106 323489 68904 336005 -328978 455316
15604 225174 247009 463622 73964 119544 16553 -249905 246882 308849 219298 -104436 -91741
15593 -91741 551906 448470 -234698 566523 336670 492633 91436 213557 607412 119303
15582 137125 362025 290586 367386 314598 124029 131940 -67177 452779 253261 139825 187743
15571 187743 143667 582382 310900 195252 298537 197601 227412 398948 122344 56667
15560 251622 79196 20648 333780 534561 142282 208995 83362 95651 301390 315997 188589
15549 188589 176224 411020 402894 66592 619562 327721 284717 155490 545854 339459
15539 339459 239527 332690 135010 337054 131489 214956 117322 3154 197943 272905 213292
15528 213292 427525 330018 316685 283841 141674 -71726 185634 452945 299392 16697
15517 131561 237329 168161 601825 313331 497915 610529 371753 458418 247960 559245
15507 559245 320173 286879 235287 439609 245555 1477 317671 361559 381331 258804 188766
15496 188766 501378 305350 285050 420713 27971 189933 151759 272430 210460 547606
15486 547606 487952 320068 198480 -85733 172059 583889 47599 518876 234647 205818
15476 205818 418099 516012 463955 627150 410857 256187 82126 393778 504833 272182
15466 272182 385947 556848 449057 159542 -64938 633507 336433 333507 119208 520404
15456 520404 83841 224091 528302 239962 267704 251217 605033 522269 401550 209935
15446 209935 -5938 373951 301755 257212 193912 197081 435871 196215 437009 577867 89818
15434 -34460 337235 -40093 454886 563319 277939 195485 269834 337357 133868 450661
15424 450661 578455 442962 55185 -249732 648110 103622 261481 453163 256378 76219
15413 199948 581494 334321 220162 347029 322245 127485 328364 129898 235725 -28693
15402 669525 386340 702859 404698 219320 297985 143051 708818 379363 417187 216987
15392 216987 210023 321070 440842 560103 361806 380106 444695 334134 406279 195336
15381 417142 343696 293536 84433 409365 203036 -15487 587988 737631 451796 416048
15371 416048 572389 457867 628075 74418 535509 78086 220143 153743 505058 675865
15361 675865 151182 100442 467951 304082 449722 319560 443241 202950 -10819 357188
15350 404079 455136 429127 428981 561169 426692 535264 461478 325154 436105 433841 306759
15339 306759 366245 513117 415785 361881 101507 480409 767866 396093 19596 326543
15329 326543 632169 629053 248059 202786 274031 518459 468386 303114 469463 336214
15319 336214 509912 421805 164961 290358 459591 727461 508717 582664 234630 230509
15309 230509 213524 574775 462883 658916 456413 373635 795504 391702 591833 475623
15299 475623 391361 181874 627726 315525 51264 452801 289334 775931 415821 504740
15289 504740 348203 399246 707932 307618 397547 333936 568647 130869 581801 136455
15278 408174 263230 349435 533834 365801 363592 658935 374959 637088 528079 240525
15267 457875 181141 681876 712555 231527 432460 294506 281733 506734 327500 330509
15257 330509 304998 429291 576145 380099 289804 518328 533229 428755 199782 420080
15247 420080 684245 245799 20388 535120 702693 451524 267756 379760 533398 500735
15237 500735 69888 670252 569447 617933 241883 412977 637963 489997 387604 672251
15227 672251 836840 341690 548133 257206 871757 493772 306927 528170 606844 545469
15217 545469 399048 366921 394958 592389 556991 485973 615207 576137 501845 462665 477097
15206 477097 619305 631665 422066 311449 606252 -5780 444156 765973 476327 714781
15196 714781 369458 732503 418745 488372 631291 648251 220588 487029 328851 678601
15186 678601 599367 584597 748205 993341 443593 462613 456130 706880 516711 543330 612191
15175 612191 418549 412896 324188 529049 669924 751770 617508 869221 294014 421247
15165 421247 370366 557162 416289 750076 625015 373409 365878 469981 439416 467919
15155 467919 353456 594081 487606 267980 150843 516438 385842 365770 575729 456765
15145 456765 592646 474052 571005 415509 672220 605680 517030 513378 689902 410338
15135 410338 695895 653959 809071 518989 582539 486371 400326 659644 351583 374978
15125 374978 345308 635004 697061 832247 525031 670754 818912 720726 745617 750628 695632
15114 695632 588397 464658 864666 204350 589523 701206 770600 503597 812346 709960
15104 709960 396721 352079 755168 309103 454227 671835 371775 710550 596225 406870
15094 406870 269636 571565 482826 430516 659429 701972 718612 734329 641202 951844 440309
15082 743947 703069 749599 634603 750424 472569 739930 546541 654457 911832 798856
15072 798856 449104 983130 768214 694802 567835 783771 743182 974130 598208 435164
15062 435164 550434 663862 805944 684773 678928 735825 278227 991242 719471 766655
15052 766655 730246 681888 706922 533891 1079402 465647 890607 757141 713323 709892 828728
15041 828728 868383 1011549 687306 454965 596415 966460 871370 952170 756628 590810
15031 590810 423495 850183 670560 583948 443089 585146 633051 685740 872584 1004743
15021 1004743 531451 816467 729968 1036483 388493 976133 733462 616628 689123 788566
15011 788566 1113676 1032361 761902 646164 829169 973503 887743 781650 483544 847203
15001 847203 1120977 754939 947485 519099 1033536 911389 931756 643242 856878 883463
14991 883463 666523 718375 759453 1033882 611828 883914 1014276 791697 832498 986271
14981 986271 1084073 874445 954382 984390 856056 703676 787305 800773 882875 897965 657001
14970 657001 834431 693806 1087027 1222513 879042 933874 906425 936397 881227 720616
14960 720616 1132236 896597 909858 1021400 1452735 780306 574322 722216 925944 917665
14950 917665 964185 1075248 563949 963832 833203 720321 942457 930117 1084445 838657
14940 838657 956713 1223873 823886 1219201 1122007 1018931 1163210 1076994 1085075 840500
14930 840500 890945 771906 990338 928155 1118023 936249 832682 710216 960326 852925
14920 852925 982570 873151 1239358 807258 936841 1106371 1202887 963538 781418 1098508
14910 1098508 657392 1170525 818126 901608 1216469 857525 781578 1051307 1245097 1257832
14900 1257832 1046104 1003918 898186 1406989 1065147 1238029 919441 845719 804428 875537
14890 875537 1379169 982064 1184665 938308 1544797 862136 758053 1052695 1105678 984061
14880 984061 1248763 1093514 852616 772271 961696 1236898 1079210 1122735 1134883 1046000
14870 1046000 1334298 1222715 1202658 1354565 1139508 735503 761710 1066174 830296 1179091
14860 1179091 1302291 1318006 995108 1155446 1284379 1382578 760425 934060 1416918 1005655
14850 1005655 1297257 1217099 1215870 1299033 1105714 1332899 1046838 1398718 1084162 1031626
14840 1031626 1365270 1317604 1045427 1140412 1565759 973167 1243806 1486744 1286058 986529
14830 986529 1229964 1248009 1383946 1719454 1500570 1500345 1215201 1135779 1363681 1348923 1371228
14819 1371228 1046806 878186 1612473 1448217 1117514 1359357 1212024 1533035 1305561
14810 1305561 1546159 1127480 1425640 1075636 1318424 1539936 1468055 1283055 1443491 1435859
14800 1435859 1526977 1523367 1603484 1492441 1189190 1508475 1100311 1442898 1632331 1578337
14790 1578337 1222060 1866280 1569649 1408598 1164571 1185169 1501046 1790624 1707631 1603537
14780 1603537 1672210 1319685 1386158 1899388 1487816 1624274 1407858 1570381 1867400 1266578
14770 1266578 1575525 1486268 1811776 1650889 1548001 1680441 1669324 1843302 1481236 1926660
14760 1926660 1509236 1654510 1554073 1546082 1259325 1553422 1843654 1795729 1591979 1473514
14750 1473514 1610423 1779487 1601981 1886847 1814284 1670725 1437567 1730207 1733495 1854354
14740 1854354 2184604 1782087 1938179 2056961 1655725 1791896 2143239 1507856 1741877
14731 1741877 1959098 1946778 1679187 1499464 1786280 2007388 1604280 1833097 1547421 1903155
14721 1903155 1790025 1565735 1996639 1802198 1937379 1613516 1885275 1927747 1750010 1560777
14711 1560777 2003028 1893542 1982859 1844867 2197260 1924136 1716851 2159664 1669355 1969358
14701 1969358 2210879 2284318 1651656 1953481 1772701 1940299 1944321 1865060 1991595 2065827
14691 2065827 1838913 2039216 2099199 1906269 1670608 1928423 2133490 1715848 2192268 2080459
14681 2080459 2141657 1646374 2359809 2210897 2382605 2053461 2266766 1927186 2366916 2520770
14671 2520770 1979289 2256894 2138959 2314008 1855218 2361961 2256753 2156514 1976524
14662 1976524 2335044 2224990 1965033 2610658 2453088 2563754 2441584 2472892 2328746 2319462
14652 2319462 2671878 2746843 2055799 2468735 2327512 2578840 2566406 2319396 2489475 2776526
14642 2776526 2150544 2581848 2352840 2386947 2736756 2532404 2601334 2443751 2790205 2547746
14632 2547746 2397453 2551701 2467786 2520624 2808700 2719035 2649758 2726504 2827348 2652435
14622 2652435 2963120 2746839 2715634 2696466 2655271 2921418 2736293 2697780 2795295 2775807
14612 2775807 2806044 2833318 2860410 2644585 3027195 2802890 2766482 3349911 2848847 2979246
14602 2979246 3254422 2878982 2904592 2983541 3069545 3017551 3413264 3169319 3031794 3037827
14592 3037827 3156760 3106101 2995862 3063183 3181875 3434036 3061161 3246724 3215813 3037135
14582 3037135 3182670 3047076 3391585 3297070 2973762 3340376 3320768 3454398 3108993 3387994
14572 3387994 3640595 3327548 3624455 3562608 3514301 3199443 3350870 3197220 3519525 3574632
14562 3574632 3681183 3719350 3356130 3846349 3323541 3386727 3186940 3595405 3873377 3661823
14552 3661823 3925219 3518558 3930958 3497276 3835705 3667124 3798116 3890056 3933488 3799450
14542 3799450 4133481 3906269 4446593 3902981 4284334 3840393 4557459 3759955 4224635
14533 4224635 4300453 4058083 4335317 3959754 4504958 4335522 4264675 4679134 4383871 4597511
14523 4597511 4551269 4482813 4564264 4598871 4583749 4621034 4521149 4650181 4559993 4507080 4457713
14512 4457713 4633147 4361934 4639829 4808298 4604522 4770309 4974779 4736814 4711733 4817334
14502 4817334 5001849 4833043 5032012 4796556 5024555 4970093 5550482 5126429 5289551 5295420
14492 5295420 5248835 5291097 4977529 5186880 5379922 5347156 5249424 5593251 5560494 5245393
14482 5245393 5766718 5525418 5897942 5817829 5807574 5725690 5748092 5926517 5735836 5855778
14472 5855778 6005698 5947044 6176682 6112686 6291395 6100125 5946816 6067740 6378135 6197825
14462 6197825 6106476 6245811 6296467 6375205 6365221 6577842 6275109 6574030 6795776 6829287
14452 6829287 6431959 6666998 7011868 6786085 7042326 7031674 7149431 7147481 7307205 7100871
14442 7100871 7115702 7460020 7005309 7373075 7717496 7980451 7683484 7426886 7580422 7646069
14432 7646069 7725206 7747571 7790974 7950874 7953509 8292761 8095130 8317854 8109795 8300930
14422 8300930 8250124 8492204 8670855 8768165 8541203 8669583 8916409 8940622 8798801 9353951
14412 9353951 8787121 9061703 9338524 9232297 9289669 8973380 9403258 9583236 9828028 9742877
14402 9742877 9726252 9887244 9741146 10031631 10010046 10034404 10286158 10094791 10517136 10664608
14392 10664608 10300253 10984750 10764630 10874716 10676335 11143648 11199521 11496493 11670315
14383 11670315 11526188 11714355 12199000 11913990 11592431 12006186 12266279 12402236 12278688
14374 12278688 12437342 12726463 12488186 12482828 12949855 12919379 13261107 13329449 13280263 13851148
14364 13851148 13564078 13789764 14006508 14111316 14441246 14615474 14820038 14362366 14867742
14355 14867742 15088018 14992827 15334252 15096003 15356716 15633676 15610783 16103954 16163299 16430370
14345 16430370 16650314 16556906 16928977 16748285 17207862 17743319 17557731 17770059 18118474
14336 18118474 18145061 18313618 18434467 18386229 18614666 19209028 19324994 19475605 19916331 19962398
14326 19962398 20539779 20515802 20780004 20859604 21279283 21290250 21720883 22404718 22308472 22607535
14316 22607535 22509733 23464803 23414620 23440815 23762430 24042279 24479046 24709816 25147135 25491415
14306 25491415 25767690 26115072 26457664 26984368 27336578 27635812 27940904 28411850 28912815
14297 28912815 28792102 29758258 29819637 30412077 30574719 30927963 31618297 32431488 32589161
14288 32589161 33085002 33277211 33714034 34340595 35018746 35817774 35857882 36926475 37441432
14279 37441432 37950065 38304873 38592546 39777725 40446845 41142241 41372066 42525060 42940064
14270 42940064 43571547 44653622 44974372 45927146 46988978 47564837 48523378 49242958 50124366
14261 50124366 51065182 51501518 52756292 53759894 54661003 55683908 56713005 57992361
14253 57992361 59361616 60016787 61168338 62580287 63780940 65003016 66166324 68014836
14245 68014836 68830947 70392862 71985761 73524216 75125806 76652636 78357291 79745714
14237 79745714 81518054 83525844 85737236 87569665 89403134 91162361 93617456 95717890
14229 95717890 97863076 100400969 102687993 105048137 107662258 110312311 113232180 116173493
14221 116173493 118738641 121850178 125157042 128169710 131469071 134909927 138501500 142181608
14213 142181608 146072650 150185679 154572531 158664372 163158284 167588793 172415813 177018087
14205 177018087 182478639 187757399 193037030 198684822 204337215 210487748 216738028 223398404
14197 223398404 229604121 236568460 243689393 250915058 258468296 266114664 274322998 282136284
14189 282136284 290531331 299076802 307553410 316683070 325580233 335041615 343975731 353489355
14181 353489355 362877672 372204221 381838491 391141341 400705286 410055932 418903290 427524766
14173 427524766 436385912 444801981 452359180 460006921 466864517 473032921 478845228 483650671
14165 483650671 487872387 491721923 494117896 495670957 495627684 493870515 491259030 489028890
14157 489028890 484635150 483671801 480849515 478429079 474169993 469300993 463610078 456627429
14149 456627429 448909648 440745271 431974986 422967281 414001889 404557090 394903668 385068738
14141 385068738 375584833 365863471 356256677 346641327 337147384 327700412 318489236 309615661
14133 309615661 300606253 291877125 283710352 275207260 267187750 259250827 251554451 244106910
14125 244106910 236874540 229832117 222886087 216404083 210317197 204052349 197908133 192551659
14117 192551659 186896802 181609156 176288825 171288400 166545481 161762584 157214645 152997239
14109 152997239 148879985 145015419 141019752 137129134 133745983 129999251 126738072 123473507
14101 123473507 120406163 117377372 114529376 111372782 108765441 106087439 103449825 101107077
14093 101107077 98404338 96145954 93999932 91667679 89536744 87442615 85916860 84078643
14085 84078643 81964603 79987045 78244365 76300881 74953346 73102708 71717145 70277078
14077 70277078 69160322 67466387 65897516 64874793 63378827 61924673 60892170 59737035
14069 59737035 58516372 57551041 56399208 55384404 54150149 53610710 52293798 51155496
14061 51155496 50407855 49248183 48418550 47758194 46974959 46086446 45656705 44526053 43610365
14052 43610365 43018727 42218626 41693069 40761453 40215509 39622874 38803271 37828112 37823695 37017868
14042 37017868 36640760 36035698 35354832 34934817 34287903 33799390 32862016 32853524 32425172 31921123
14032 31921123 31145689 30901191 30452542 29736421 29801860 29335081 28569717 28455986 27599289
14023 27599289 27307643 27259182 27040595 26491393 26234285 25317010 25295572 24845521 24253925 24329346
14013 24329346 24289324 23920538 23452570 23064873 22822286 22692585 21822253 22134663 21625005
14004 21625005 21136259 20926112 20930058 20559197 20429439 20102898 19842434 19796804 19429216 19181388
13994 19181388 18768568 18724530 18089690 18353421 17722891 17866373 17394138 17782152 17231728
13985 17231728 16755718 16789060 16586526 16561730 15865657 16254493 15857132 15874591 15703889 15898610
13975 15898610 15248394 15099718 14837479 14785812 14647081 14333349 14465941 14368712 13895641 14180656
13965 14180656 13652305 13854912 13656294 13582574 13291581 12802223 12907852 12721517 12759435 12744217
13955 12744217 12248823 12584418 12011063 12011461 12223103 11995082 11682768 11734004 11857169 11419813
13945 11419813 11454417 11289323 10977222 10752135 10991548 10738687 10676905 10840589 10594405 10465758
13935 10465758 10220524 10304978 10262983 10101696 9669067 9986272 9940663 9840241 9671988 9603380
13925 9603380 9351672 9279030 9396500 9324869 9152609 8847290 9237752 9015616 9180663 8878047
13915 8878047 8616805 8530912 8684597 8244689 8507704 8297766 8582747 8345493 8015589 8203667
13905 8203667 7898415 8123214 7882515 7753539 7783812 7880975 7734900 7723450 7552110 7167144
13895 7167144 7507521 7368478 7309908 7517523 7202114 7559314 7242040 7389899 7229013 6900318
13885 6900318 6985523 6794666 6554439 6741381 6666951 6482114 6650466 6367059 6741450 6485649
13875 6485649 6188529 6479845 6182863 6325581 6108434 6462938 6436591 6106931 5924491 6006120
13865 6006120 6115035 6009286 6070016 5655586 5937719 5702658 5686582 5853666 5303853 5822890
13855 5822890 5344930 5507314 5624863 5335167 5384956 5308522 5172599 5350664 5363616 5202361
13845 5202361 5369465 5293105 5078241 4980472 5150904 5048771 5142612 5059600 5090535 5129662
13835 5129662 5038681 4921719 4889069 4697682 4840425 4825655 4838682 4910465 4650602 4750535
13825 4750535 4554349 4556870 4470088 4814147 4626633 4949552 4568530 4556741 4438641 4415147
13815 4415147 4302623 4357003 4329658 4067924 4464520 4354289 4339632 4220346 4592617 3946866
13805 3946866 4312434 4167586 4110370 3797400 4170200 3596744 3984681 3896695 4036786 4043429
13795 4043429 3924149 4006719 3875803 4078567 3885673 3662949 3743896 3948109 3553748 3692686
13785 3692686 3588912 3862138 3717677 3607514 4009929 4049645 3831022 3344176 3799214 3589621
13775 3589621 3763526 3515492 3479848 3398281 3716868 3363465 3318215 3614410 3366978 3285803
13765 3285803 3367713 3498081 3357682 3180401 3509406 3351872 3855633 3148191 3277471 2896721
13755 2896721 3241096 3210882 2669686 3234305 3091764 3068040 3174960 3147022 3263978 2971695
13745 2971695 2941383 3164248 3046860 2995189 3245309 3432211 2925105 2928473 3008227 3044805
13735 3044805 2890857 2736443 2987415 2831339 2561425 3133874 2996569 2679896 2645664 2395726
13725 2395726 2919256 2533493 2595108 2742392 2511902 2605572 2872652 2621776 2642506 2563376
13715 2563376 2543041 2592527 2687946 2293157 2850835 2560869 2376439 2524115 2463105 2413943
13705 2413943 2231570 2696572 2466366 2555126 2452210 2113104 2334220 2572907 2346222 2088875
13695 2088875 2213763 2534459 2183175 2253496 2444231 2327612 2394642 2410966 2025966 1924841
13685 1924841 2359703 2419398 2542446 2459147 2283037 1910336 2149741 2438282 1987393 2186460
13675 2186460 2104485 2177644 2077039 2050399 2506560 2048942 1992583 1933004 2263585 2253858 2307915
13664 2307915 2354630 2319007 2265278 2012224 1978442 1600763 2070086 2057456 1942006 1976592
13654 1976592 2282140 2062456 1881941 1879778 1826241 2034989 2008545 1658359 1680227 1892459
13644 1892459 2186563 2093727 2123364 2017096 1982771 1800605 2030178 1912320 1677049 1680162
13634 1680162 1836358 1662884 1877011 1670721 2006747 1973398 1739739 1949592 1832288 1752784
13624 1752784 1778528 1866100 1492646 1747951 1959525 1470703 2170669 1851409 1584732 1747590
13614 1747590 1816471 1487707 1790087 1752434 1590648 1459368 1931747 1841160 1741037 1597047
13604 1597047 1530394 1396786 1641301 1641267 1690558 1304317 1429512 1338820 1651687 1561436 1576545
13593 1576545 1281140 1336589 1532348 1452655 1630344 1312824 1642341 1539685 1589490 1623034
13583 1623034 1677063 1516376 1548416 1327365 1419727 1490094 1261401 1594232 1691484 1218603
13573 1218603 1401227 1307839 1337975 1521869 1342649 1354276 1251164 1517995 1490922 1767248
13563 1767248 1225639 1642275 1728823 1407158 1433437 867346 1692259 1251222 795701 1387215
13553 1387215 1393798 1556979 1650843 1547601 1279475 1719756 1384723 1112578 1661615 1479841
13543 1479841 1668543 1297380 1401329 1030183 1258722 1411731 1028430 1502105 1082900
13534 1082900 1343976 1202543 1209329 1375219 1321142 1396489 1176419 1140092 1287034 1035442
13524 1035442 919966 1313820 1206317 1077239 774493 1492660 1222577 1516901 868446
13515 868446 973046 1629862 1165701 856918 1156393 1254739 1082301 760124 973752 1104026
13505 1104026 1249599 1602312 898505 883726 916754 1110219 811510 929372 1019099 1279414
13495 1279414 1024996 1435474 1037558 983488 942200 988635 683376 1155762 1448687 1007291
13485 1007291 1137728 1065557 968281 978705 798704 1335792 928281 1072698 915859 834042
13475 834042 1215410 761260 1165303 1114473 706687 621834 1239228 1204203 1108189 1059068
13465 1059068 1277539 952941 884832 1084630 732066 919023 1174686 840205 949741 981557
13455 981557 875968 960510 1104184 779637 1168264 1074263 854764 825168 752571 1131940
13445 1131940 1014526 1349737 957909 1053279 1020628 952256 1216939 1118173 838384 801357
13435 801357 883152 899022 966407 596826 735806 950559 992627 977097 1046980 1125707 1157757
13424 1157757 747207 1007584 906542 552312 923818 708538 688297 935610 930435 786431
13414 786431 887448 706178 712162 755610 1060050 892284 702673 1084604 663822 882474
13404 882474 899487 996313 956573 902682 877996 899315 580245 638389 912059 851179 796035
13393 796035 1120853 736451 692217 557593 775357 971339 798747 658255 787909 983333
13383 983333 878407 1082044 848774 738798 781643 602579 447599 589935 608196 926898
13373 926898 916768 863965 786168 999191 1034431 730104 794115 585122 728293 612959
13363 612959 761616 538586 660557 584159 564300 701489 671236 830836 691655 795475
13353 795475 638615 976086 863782 861272 1190392 737205 835735 537110 475381 669953
13343 669953 835020 478833 1031717 420693 754952 811877 756894 432318 654186 538835
13333 538835 471531 315593 785937 716764 680390 720971 714881 470113 687139 786524 790427
13322 790427 566348 839522 733514 668506 598513 482135 727726 561497 654075 699095
13312 699095 736560 398188 752761 799447 716171 754807 661327 725719 651177 754047 952740
13301 952740 811087 442569 566966 937599 527180 454317 567278 374444 1045872 934813
13291 934813 442798 604459 674505 626989 721061 566125 524478 540456 450028 526606 609518
13280 609518 222067 407963 620216 428400 485160 271397 379760 614528 430065 966955
13270 966955 533646 748173 755577 786701 839928 493585 1062273 471131 837258 612745
13260 612745 506796 678149 544226 387630 296944 474205 455396 817545 758428 523400
13250 523400 396617 551528 484169 1003735 382094 710737 544449 394088 445268 1042061
13240 1042061 430393 448765 691570 698793 673127 343308 205082 646326 389083 502422
13230 502422 700525 253534 558461 445475 167917 439737 486124 244437 380398 792391
13220 792391 237263 437460 346770 331291 590328 515666 248505 324290 480696 643715
13210 643715 655462 549758 514205 232082 382539 544255 231963 389189 237207 516591
13200 516591 656932 486034 558507 672636 167028 514133 472434 485944 425191 581198
13190 581198 358838 480999 451200 340298 245764 565560 460569 304673 513702 379867
13180 379867 368332 433890 689887 570193 559679 295080 474403 476880 339624 442444
13170 442444 525478 524936 597113 167896 604628 660573 490257 830708 716095 463960 137658
13158 455023 616874 713658 302293 466574 185623 737924 333474 577867 221593 179812
13148 179812 409574 5072 549129 273555 472878 -83719 208394 380517 547936 440630
13138 440630 593416 272974 346545 208293 -186247 556895 543080 209678 286745 411361
13128 411361 602144 460323 200539 546373 549564 421967 607423 235554 318255 450373
13118 450373 412061 440258 334960 306098 161201 252041 319569 319780 329988 547237 165453
13106 324440 519953 649598 207322 499079 516701 250692 413891 400511 557066 382546
13096 382546 383590 229576 96866 411912 458682 428404 573355 204979 613570 622686 256353
13084 91577 382810 523799 367076 470900 212201 392957 240635 580931 190890 495686
13074 495686 453712 407351 388633 563362 435930 195193 446253 267673 512553 384094
13064 384094 408659 359732 110818 55762 547915 85470 453539 375741 467425 479460 10106
13052 346528 128626 181127 286859 524585 548945 241865 442349 84313 135630 448458
13042 448458 790599 72258 566632 446208 624885 466740 238745 433400 526938 190767
13031 265752 545516 347789 234560 373900 355166 116717 274525 393958 529009 100050
13020 225833 426973 469473 464101 720999 552023 383395 342239 376431 338075 607426 239256
13008 369516 407685 641523 609393 328573 279985 321583 482290 81816 281349 484196
12998 484196 107496 483637 433734 316526 219758 150535 320741 152840 111754 390006
12988 390006 557852 421361 209558 212324 26794 362071 193447 452762 251905 264456
12978 264456 367488 402013 217251 631665 257386 136406 173466 360159 213923 384878
12968 384878 243385 -3940 -114964 506631 122870 254603 192182 409504 208541 20931
12957 211097 465404 -143157 369585 125918 238157 193225 171474 118959 75707 -44027
12946 198773 238392 307064 459057 -71542 146416 -3596 166268 390604 341229 386778 178916
12934 116348 444239 304303 140354 386578 297095 98839 263158 236307 152915 457981
12924 457981 247799 505125 462869 290828 316525 233291 228360 57147 66141 279277 274803
12913 274803 215016 67427 400523 54092 278036 288997 227584 321912 113143 244726 74216
12901 385850 384293 185624 322668 471978 182435 266871 387953 117955 200494 314371
12891 314371 132881 326140 326656 284339 80920 482787 198775 177780 388397 -52047 -64991
12880 -64991 -236362 127234 160039 -133707 472102 65888 197080 3109 422694 372573 568700
12869 568700 290795 25878 11766 173899 -50086 196652 -23280 147425 150895 395140 207104
12858 207104 317317 309429 315920 207680 175029 117690 353415 407359 129895 266321 253317
12847 253317 108045 136209 -90389 213990 47830 431820 174683 303712 273460 481323
12837 481323 214346 145048 289221 98502 -78653 461267 29849 -42984 309347 227839 263915
12826 263915 179390 300330 324764 87154 351418 403471 -5136 418672 53989 418580 209901
12815 209901 295980 -21527 22679 160962 176010 655808 183944 156837 253814 173188 225941
12804 225941 23561 467919 137862 449851 68401 271635 257480 65515 116839 204512 275590
12793 275590 257728 335653 271387 470793 184563 468704 224181 267200 131072 153273
12783 153273 113639 -22086 276892 29235 233582 120998 209331 10090 226115 61036 79593
12772 79593 -147911 216764 255393 315082 146999 -158710 158288 340545 545429 204431
12761 610860 535376 -73173 291247 119487 203724 125388 -106691 -58332 713889 50711 226178
12750 226178 173679 104521 130107 219894 330564 217614 281044 394718 389744 -16715 -51808
12739 -51808 31158 95565 -1230 512467 104250 130129 457145 173414 158941 200921 -56495
12727 409586 242227 70146 301341 89253 341826 365908 169247 525717 225365 -44828
12716 121511 -36986 22214 90425 128607 -57589 -36750 270320 221963 157033 136603 235709
12705 235709 337538 90966 235721 227873 110734 -1646 -100288 299048 243742 173184 347230
12694 347230 146350 -130144 126115 109702 394191 -63172 46973 -219670 -66114 172971
12683 153241 116179 141174 553553 64468 186666 72571 432066 312003 209336 26864
12672 310451 77665 166054 216111 388686 62616 378996 8773 111952 -58234 305677 121432
12660 230142 136224 -24278 200676 324780 354211 382428 673938 278500 383234 560736
12650 560736 523615 611001 493663 382429 481258 342849 431714 74926 532368 211962
12639 508068 234157 536408 373479 73678 189949 372915 224328 -135722 34856 174633
12629 174633 470966 384021 655753 -48856 -98603 -61879 -120706 184261 111382 275864 8320
12617 208949 45338 -259421 260528 53372 189452 -132581 -105090 122790 214215 230268
12607 230268 467008 406552 87608 194200 -45915 203180 292392 331260 148122 167210 -99762
12595 36357 451252 102363 139724 -316860 380991 439039 82559 110217 633164 -118253
12584 73137 261910 -147430 380783 139477 -53055 301693 -275803 84133 104192 355221
12574 355221 32413 124258 164179 307020 189174 -49115 -190199 120207 203439 -2973 -125040
12563 -125040 84060 -66575 36442 205087 293708 217606 21575 412341 320187 -256181 75512
12551 -751 95621 406094 -199477 -168526 320911 239941 -28965 188513 109050 -185651 191010
12539 53147 -82008 233803 105400 32568 -28463 74008 -128997 67701 -23087 157993 290853
12528 290853 2955 -98694 57400 1028 182245 89534 119497 -70651 147796 94597 133631
12517 133631 -59153 124251 -1434 87910 363763 57156 238539 -99389 168865 209844 80955
12505 122002 163690 34962 380 250722 -64367 68344 151706 201738 -58717 46623 321915
12494 321915 50445 30258 182965 -153582 166639 -305310 552141 -215386 68831 226015
12484 226015 -233600 -16446 155960 265255 -353578 214649 -29726 392082 -144220 83467
12473 217338 486153 228615 -120599 43209 12221 -190284 54159 191360 237557 63473
12462 -102762 -340710 37269 -14532 -46955 -56219 296589 -137449 -37768 329843 -150561 71125
12450 66272 359284 171181 246864 -235138 269388 -16707 147180 17791 137295 -172745
12439 -121555 96597 -51990 61904 262781 369412 30622 93796 233360 182742 -242404 267200
12427 181934 354320 552996 263863 349538 123942 133449 270111 358630 98563 7404 290050
12416 290050 -41808 315908 -133971 114048 193390 346315 37589 224111 596552 -125064
12405 28887 33228 144913 106670 304047 98591 341313 141047 54864 46620 -137239 198087
12393 -6831 113196 231197 -282093 198815 -44038 155547 299822 -199546 73726 329103
12383 329103 59135 -274135 313433 -36796 -253438 -44228 -28296 383228 420127 94503 -126988
12371 76797 -46119 -184009 -77415 135268 76211 63466 133478 172604 -70727 235061 194017
12360 194017 -140739 -124798 -3549 52814 -53239 113180 -67203 -111638 636 344130 94081
12348 134855 73865 244266 403994 -83824 146956 -26025 217096 -292536 60137 93650
12338 93650 230414 226776 40883 -76088 405973 127927 122273 -147884 293398 69896 -38333
12326 342729 279163 -315537 156973 45767 141424 118448 104218 -29278 -9587 200451 151014
12315 151014 372832 -120934 65750 51588 144377 82910 -13092 37607 207887 204285 134976
12304 134976 87500 87768 -256901 112915 147119 -170125 40695 229286 238785 -25631 243398
12292 205271 -1182 217371 258186 90122 -132591 22406 40938 -22833 312093 -124774 -84778
12281 -84778 98745 -8048 268219 87493 75097 -201629 97586 82369 239134 71664 -29270
12269 -31296 -13083 -56454 590364 34710 -86916 105663 197276 6515 -30938 270289 180696
12258 180696 161034 -80476 81140 180227 98123 180495 -132016 -10775 -173001 102021 -48635
12246 -29491 196818 379975 -70300 -70985 5654 288926 196197 -132522 108477 53873 359426
12235 359426 -332416 -73733 189657 -2830 33537 92758 51700 31906 -73474 -51179 119433
12223 220244 -77080 108069 -25837 19314 248160 128772 -25508 -4951 -32913 -289249 130587
12211 -325682 253438 85285 60087 -28534 48943 123473 42865 77805 -203415 83255 -12092
12199 -135361 232662 -75917 -225046 69760 463669 280673 -33993 -61039 -135230 -189355 93973
12187 196432 100593 -43580 -32428 185902 -55985 -344337 211334 -7059 -11187 -117544 -50048
12175 158215 27630 155784 -99130 321160 108685 -40204 -28632 -7340 111241 1839 -19089
12163 -29951 75747 167609 99550 14190 -108166 230378 368050 -23348 -164593 -330274 -25239
12151 795 -73557 133725 -88761 194654 -172930 35174 261885 -363140 -77022 161655 -79021
12139 358124 3135 93065 138950 -60235 -213714 335732 -26077 -140426 -44818 396350 -193085
12127 -217602 153056 -354364 112197 189513 489400 105510 19474 151964 233933 31181
12116 21882 -82762 -83323 145373 433423 259566 226041 -28447 174840 59313 9570 -56673
12104 284902 -33328 -39257 510345 120633 17896 485947 165127 -191890 92509 -216699
12093 92491 125086 -152372 184280 231296 -92643 209644 537338 368580 -167191 6356 -85030
12081 49874 104886 -197605 -66201 -45432 -100708 -324436 163314 -176861 202130 -68166 71019
12069 -238143 141972 134222 110221 251103 -86349 62903 181937 -100891 -384850 159003
12058 -126793 548710 177875 127603 74032 186194 81009 135502 -237065 165487 10937
12047 104052 248406 389405 -43615 132085 190223 398086 -216231 221891 289373 239149
12037 239149 -102327 -183772 -372786 -20365 209247 143962 228698 -352921 -140512 206084
12026 -305992 -147763 77432 -129779 -80872 -145609 -34482 -120343 -115157 -375658 72012 -41284
12014 -239748 -31750 102076 211189 269745 6862 -280829 92885 83244 178674 229870 -284344
12002 -22071 -52785 -46002 -17469 46054 170462 -60404 174335 -72010 268895 182891 -69411
11990 105856 -168684 34018 -202612 -151637 -302575 -313220 140852 35894 196839 -94389
11979 -80946 55044 -315507 153730 -139729 237005 -55787 94724 -305610 -182040 -2748 -56651
11968 -56651 91399 152056 204147 -187407 72070 234430 213410 86921 -216783 253 63166
11957 63166 -102115 -82554 25228 -12841 236564 -45577 155161 -351103 -52166 97299 242906
11946 242906 -287095 326150 278808 135403 -99195 122706 146674 375934 -187613 74031
11935 371368 128342 178210 190659 -6133 -180195 -141164 39844 272205 -94959 71255 135451
11924 135451 -81063 15076 -430850 27774 -74642 164043 36547 -38086 -100680 -106926 224807
11912 -277574 131692 47719 22920 -8178 -161679 -101211 44194 -8342 -197501 -164791 309969
11900 -218137 36442 194620 -7921 -193255 64576 -291235 -279736 61792 208926 -183420 239582
11888 169411 -187793 -97962 -109573 175939 207201 184659 -411743 -275528 14663 -30740 119772
11876 230883 32609 -147097 -135984 275526 124522 178023 -95342 -156501 143480 115717 74685
11865 74685 -102587 135232 217746 233942 -57500 -125088 -222366 508939 105905 216576 300359
11854 300359 137458 48065 411019 177637 -62279 353028 -300294 189776 92432 227529
11844 227529 -60771 159145 -40056 348500 179032 -316666 -40754 -214210 95000 32975
11833 225490 -90944 -196829 64095 -143232 -123834 -83563 -151550 75559 2232 59556 -159083
11821 19598 10193 -34803 -102548 78302 39140 -169080 64299 48602 22771 5915 2262 152238
11809 152238 -24128 42619 -92374 175228 -319601 -11645 -86861 932 233576 -167061 -17310
11797 -23142 30581 -216267 -109730 -34074 134724 -47825 4396 254508 -165490 -217735 97537
11785 42995 66634 97692 6838 -151462 -89334 -84427 -94980 -241131 170153 18400 -172106
11773 325774 246824 -139571 -135581 -131307 -261959 162921 -131328 79171 -216766 -97423 -226947
11762 -226947 104645 -17059 127265 104969 226225 295926 -68670 211293 -80923 18829 -262087
11750 -143050 58341 -175192 269915 -88623 3720 59111 110804 33959 -195633 -101103 -191906
11739 -191906 -65501 -27178 310163 -347396 142994 -344097 173955 -110271 -137764 88393
11728 28112 -25145 -346938 -82093 -296871 -592548 -795 177361 13530 -196276 164636 -117602
11716 -253883 63525 -252492 -105669 206809 -404329 142739 -118189 185768 -80361 86258
11705 -48697 -122326 -209446 273512 -34679 -167605 60790 44012 17313 -60236 309098 -155459
11693 175411 -128380 -19792 -171697 -364554 131357 61255 -6846 211661 177560 170098 27328
11681 -390335 68208 -118933 16368 97474 166506 14277 106308 -139005 322303 52330 24544
11669 301194 -116775 126577 959 91085 112928 -197801 -94478 -144890 101344 406958 -126447
11657 -70943 -379981 -53958 -32424 -211806 40054 -174230 -21090 -12266 60332 58713 -166027
11645 -354644 130406 287735 32991 84591 26853 27908 146359 -55696 -183065 -32875 235172
11633 125026 170589 -48521 53085 14258 -117466 11983 -23971 -43279 132379 94302 -48640
11621 54922 -58501 200264 -129157 -173521 -123397 -181296 6752 -55806 10195 -107805 -51862
11609 63265 -74286 60382 97951 -307302 -11858 252899 255881 14869 -236229 -41614 63327
11597 65902 1780 115849 9424 -36490 17194 84060 -16364 -89572 -199137 -110047 -96083 -331492
11585 -331492 -131523 38298 103520 -145437 288610 133983 45119 -4617 -161924 139630
11574 271621 14195 548775 16899 -120815 113648 8409 -83468 224103 -100265 -158324 -16393
11562 -20092 -292 -149920 -37711 79124 -13622 114610 40577 80676 -336427 101468 -88642
11550 -281528 85055 102069 21799 -15265 -50836 208363 -52039 -12885 -70365 57555 -75417
11538 89734 -91106 8848 -223522 -135061 -267170 -23079 106757 -461591 384533 317932 158160
11526 56398 -112714 137667 -141008 68577 106666 -229379 20846 72014 -258255 -372838
11516 -372838 -22403 -157463 100587 83795 210730 167786 -107136 69638 -413471 112596
11505 -133812 -277214 -207784 12403 -172374 -246666 226567 3987 171674 -36712 203264 -138215
11493 115022 63406 77514 45009 57201 -132988 31049 -142502 -62045 -113809 222518 -426222
11481 199819 81053 -59639 -144418 -171497 -230664 -280148 -59739 249667 -231647 168275 88097
11470 88097 65519 20522 185180 -1195 -348688 -229875 -350088 -375915 -148563 58293 -42950
11458 -216395 -144031 807 -180293 362879 -75122 -71752 -35211 -40093 -114292 215982 21193 -48612
11445 220654 -266754 301736 -74542 -146135 -192442 166979 -35663 -163141 80879 -116414
11434 -232835 -72972 -38538 -127750 -146058 -289308 -115535 -360673 242420 86280 85723 -125910
11422 -56645 -12864 -68085 -6182 84432 124913 -118151 244883 231433 -249317 -32501 -54009
11411 -54009 -309379 130567 -87027 -98120 106292 -392212 202768 -114652 22483 -339844
11400 -24561 57992 -105443 136422 175652 -185551 -147706 148850 270639 29368 122897 86536
11389 86536 -25554 160563 334606 -318478 509078 -30335 -275261 94210 -374117 -352546
11379 -352546 -8744 -17627 141446 -12576 32509 -104919 185700 -2073 -149636 -28344 -68780
11368 -68780 -104923 418 -76106 127578 229132 -118176 -136125 -2667 63555 -127258 -245168
11357 -245168 32722 -171223 41168 -99646 77288 225552 433064 117299 83656 -94100 165859
11345 -2682 188214 55552 -385610 200479 191142 38210 -452875 -207628 52759 -269617 -82477
11333 -109636 67173 -47637 -460011 22616 143867 -51051 -38094 -27358 -275984 7074 172952
11322 172952 -175910 103577 978 -184713 37083 -231139 46877 -148715 19557 -381273 -80695
11310 -78557 325202 -23663 -35517 -186932 193113 -41626 -142190 -6486 86302 7872 -370757
11298 -2061 -65792 104677 38453 -249350 -28810 201533 -161504 -11821 -244819 223008 93905
11286 -196516 -153859 -201459 -265008 148898 289894 -112314 -9608 -48986 -79005 -38130 -215381
11275 -215381 4376 143117 242123 66262 199050 141789 -94149 137134 132160 133948 -404407
11263 -346268 84378 80679 -202514 149200 -120128 -40378 -114092 230326 -144601 -57046 23067
11251 -353189 -70678 -298543 -26747 -193016 -227100 -37662 -46179 -114169 213741 134830 16243
11239 -188584 81068 54619 -85350 -15269 108435 200083 149736 252348 23909 248190 132488
11228 132488 -33526 -22615 324683 -13111 -182425 22254 135240 -89729 -181916 249982 -206706
11216 -236788 -82833 47977 -561 84095 -78017 70052 193885 -207049 15171 52990 -52833
11204 38628 127981 -187360 102807 -182988 47667 -259368 -91583 259728 -27608 -138441
11194 -138441 -210124 -217953 -182333 61532 -273939 45645 -161943 -753 -120948 -87171 -139986
11183 -139986 30413 -60524 -11215 -14230 -31184 -154651 399408 185904 18881 -57897 380460
11171 -44661 -35146 -389825 -138294 -463555 -30013 165370 -4645 358819 14004 60840 -147650
11159 53562 191637 -392611 -73162 26039 303451 34007 -15795 -137758 -124632 -268242 -207548
11148 -207548 -74217 14370 -161044 75835 -610306 -142836 237406 -220133 45913 354403
11138 354403 -134467 -475113 -230262 -12662 -192877 -205444 -78156 -63832 190384 52400
11127 56653 -244544 -239412 6198 275922 26412 -157034 169466 -49326 56671 -260071 140611
11115 130984 -48012 -222858 187283 -237778 157680 28528 -75949 -151507 13109 -108455
11104 -221319 -87503 -462299 25264 62343 127197 -50364 -48129 -81944 112976 30055 -332808
11092 89519 -45824 -86590 131796 270573 -37954 443361 -55878 77638 307964 28105 202560
11081 202560 96167 178828 101743 63033 -107057 -160712 175914 222087 -11491 -42092 -142486
11070 -142486 -313498 181023 85102 -130683 -155340 -81968 -150610 -301416 -6678 -264905 210456
11058 166779 38962 -263874 -37089 130658 -262478 309340 -363643 208850 -72578 -384419
11048 -384419 17846 64805 -105591 -222277 -187739 7072 -256082 -102780 -240160 -371633
11038 -371633 -113513 -124489 -62631 -73209 -274648 120723 12703 60728 -72326 -195792 -31726
11026 -6691 192065 232750 -104052 -99372 -182687 207333 -32175 -98673 -269420 -213591 436148
11014 -315826 -255091 173762 -421948 62947 -30603 -377480 -230663 -403617 90389 -124107
11003 394140 101308 211531 197620 -2238 -214363 320411 2063 -131669 -98923 44289 -38635
10991 50551 -170851 -74053 2916 -116669 155166 -52294 -173085 -32806 -326037 82512 24069
10979 213437 13119 -84728 -287290 -56470 192241 -39156 -386670 270562 197312 -438330
10968 233095 -1827 145909 -16383 36588 -157916 -100500 -17557 260285 -132833 319188 -72746
10956 309759 -111332 163894 103499 53547 -374881 115928 76850 169037 -373599 -226251
10946 -226251 250332 60684 -176290 -177392 -88328 529776 70567 212196 -154725 -243674 -61812
10934 -16768 -227445 55446 -164914 129041 35883 -23367 -102752 -69134 -172897 230942 -297797
10922 102722 -209804 296077 -37798 154995 -135182 -205379 21487 -137274 140100 -52177
10911 -116696 25634 51761 70131 -40050 173590 224421 -102613 231391 -250116 9520 -65968
10899 -185539 338 111569 -308484 -24322 -130932 -107648 224727 150290 99005 117306 167647
10888 167647 111266 161379 59907 81849 -407500 -254726 -70659 -353748 -104335 -63691 -55208
10877 -55208 -533767 188713 -186250 -173556 -47261 95665 206138 24284 -81974 -33186 337649
10865 62909 -277981 -72630 -262693 -53074 -142274 -73980 45061 471156 -99698 -60863 108401
10853 -28838 9040 -161473 355628 -38056 81662 -287780 -312927 1980 -93095 -11970 188257
10841 92971 -50139 2686 -151918 -59580 -363834 203338 -88285 -190032 5712 -148813 -86746
10830 -86746 227264 -124044 -24062 -488400 180720 180051 -143922 -231310 48604 -352386 30067
10818 -26929 187349 -145738 -110907 -51386 31257 -106734 -57941 -157827 -287815 -376851 -113285
10806 -289756 137001 36338 -18053 -139222 29236 33732 -231244 82222 273685 -216251 -180743
10795 -180743 -186287 141856 -107110 -32359 -362140 151819 -247739 -98201 75051 -201684
10784 69198 79057 -191874 -19214 -46838 -151058 -228090 -256861 -97488 -1782 205212 -147455
10772 -53094 -314862 -163277 258169 -247863 -173714 117970 63436 -65414 -165404 -170428 -71082
10760 -110770 -203740 -36201 96754 -101251 -520623 -11926 100594 -241539 -164380 263461
10749 68131 -230526 -27379 76077 -148604 147931 -38501 171274 -215223 -228255 -300029 -132864
10737 54272 98031 -133574 -460298 -50890 -58212 1380 99188 137662 -95947 331710 8461 -134716
10724 482256 -126632 251467 -203903 -267291 205533 -111831 43681 119317 55127 -98719
10713 92835 161837 59285 -84561 -182533 -196539 51700 -94109 -44616 6690 12663 79466 -123303
10700 334640 -142786 85905 -100176 372033 117030 -13214 -21549 -143919 82622 193623
10690 193623 27105 225776 -122242 -49775 55624 205221 -175909 93146 26128 -6059 -210343
10679 -210343 -55945 -18463 331275 -73410 -125218 -182866 14504 43661 -33586 206537 -57454
10667 -227903 4500 43188 -180560 -358974 -185281 69227 119548 138112 186418 130776 15043
10655 45054 -81883 -97418 -308136 -212391 165425 -174662 63455 -268004 113887 227220
10645 227220 -38379 654 -198243 -94552 -150159 72686 -163299 -111088 -205591 -245013 -32372
10633 72658 63436 192157 -233250 154803 -20330 5721 -197000 -205038 146398 -389058 -219313
10622 -219313 -39939 -54315 -61169 -198915 -31290 -125143 -103805 -223934 71114 -40813 -58076
10611 -58076 -282625 -352681 246825 130425 -135633 172977 -143403 -12329 41481 -149909
10600 -292756 321294 -310817 86482 -411092 -97742 267632 -22870 -177780 -203203 -110059
10590 -110059 214803 19907 106543 140580 -131796 -24649 5784 -247656 -90419 -96497 52049
10578 -96218 46346 -134485 -324465 -76512 234620 46943 -422186 -303575 48061 -254055
10567 -124937 -61120 -93854 -238539 28174 203735 161308 -418966 -223722 -12905 -21969 205959
10555 -360289 -173911 -190236 273335 -190254 229992 95009 -4969 -304700 -214508 36265 -20125
10543 307497 70392 -152933 -76024 -1611 -5533 -12143 -125833 67003 -454072 -138792 162108
10531 -166101 -71513 -141821 -363998 299503 19242 -119761 -32058 -262844 33812 -191859
10520 -66565 -140396 -168141 47047 -45023 150326 43308 94809 236779 35510 46210 -199924
10508 189333 129531 140549 -157596 -218448 -18633 -9931 114903 -155085 128938 95362 -240507
10496 147566 -135903 -85615 -150161 -277280 -103795 -63705 210039 136043 -22459 -103732 -246191
10485 -246191 92557 203367 -281790 -16091 78437 -109697 -119043 -104692 -386452 285872 170676
10474 170676 -21900 -18363 187900 -163997 56485 -289030 -114475 50413 -137313 -53202 -65588
10463 -65588 260396 -161071 154042 303232 13841 -115687 -78054 -201686 -144245 -13957
10452 -223000 217687 199309 30859 56599 198143 -268080 173942 145235 -133148 -143215
10442 -143215 -299389 -124381 -284040 -272594 191272 110820 333727 -3996 -114104 250851
10431 -11672 -8317 -179961 195577 -441144 -139129 198761 -280966 140646 154839 -99206
10420 -97103 8824 177918 -64385 -277578 -401185 -109229 55540 -54945 -85526 206970 159857
10409 159857 -198751 -88255 -222790 -19466 64633 -24040 -159902 -267847 -246509 80923 270129
10398 270129 68746 -50830 91512 30353 -1684 113802 -79156 -534068 -150354 45497 -72816
10386 19036 64807 199826 -280295 -46211 -307532 78274 187249 79791 205486 -68178 -148459
10375 -148459 132683 -222504 361331 -323828 -137083 -133286 -109366 284082 106932 -288386
10364 -69500 -79343 -62612 26265 -214087 -380033 46421 93523 294697 99265 231905 102373
10352 -430495 -123367 68392 -16386 128528 -108752 -109287 189419 -305862 -77714 211187 -125597
10340 100191 -72168 396729 -110457 -66551 -20323 -54401 -34197 -59170 -13531 81690 -78251
10328 -97679 -23797 -442760 -34673 113528 -289691 94381 207922 107033 27575 285323
10318 285323 -35749 56410 -239217 60284 256902 -4183 -15894 -163797 -111230 -195348 8639
10306 81549 -160857 147185 177305 184918 -250741 -116774 -1288 31447 404598 108314 -303668
10294 159792 70446 -284089 -345275 136041 -406600 -18188 123909 -320642 -86150 -399920
10284 -399920 -159819 -49576 -141338 34260 1931 96331 -270208 126190 -238352 -74365 166190
10272 156269 89734 -41564 -234255 -147133 15368 4925 -67317 209926 -302357 -21856 -188008
10261 -188008 18786 127762 -42971 -193080 359696 -306835 -296716 -207229 -138435 35496 321396
10250 321396 106948 28844 -425014 -134137 -223698 -348097 151351 -259473 -169557 -374511
10240 -374511 -308774 -92183 -451721 -252198 115205 -106853 48565 26282 225905 -168253
10229 164487 65578 348431 -155947 -287077 159827 -44883 -82513 75353 107849 -60046 -343621
10218 -343621 150577 18685 294670 -258774 16863 -48766 273057 253702 -62806 21480 -145395
10206 -115858 -61182 -258265 68349 36737 311010 170531 -127709 -214723 82606 98968 146053
10195 146053 309690 -414432 -93624 165695 -113409 -106475 72426 161609 247329 -344350 189238
10183 -176549 -40614 -439353 72800 51487 -68156 -153934 -178300 -24319 -123489 -343194 -82096
10171 -135028 -69422 292533 -57191 141283 -87524 -4946 -79195 71399 98764 -259779 -194285
10160 -194285 -137112 -69207 6333 -118625 20457 -276470 94223 -201695 -10522 -106169 -110762
10149 -110762 11954 -215285 -285156 13597 -156091 -300584 119212 -23602 -144643 -20036
10138 -56332 103340 34649 189418 1996 85092 -154903 198365 155143 -45273 -173890 232691
10126 101046 -193904 50141 -326524 57940 -340173 -60125 57643 -12862 -365409 -264071
10116 -264071 217164 -287584 -81355 -13131 29898 -237780 -118673 126021 182950 -90031
10105 -2622 -41460 -31102 -406053 -43253 -199948 5732 133163 -35803 -226031 -179971 -168025
10094 -168025 143500 23580 150350 23592 -10784 140084 315475 34715 63089 18397 -338956
10082 -192364 12907 125199 -55031 21145 -214162 248568 71329 5897 159724 -64697 152371
10070 -156090 -58874 -64897 1600 205299 250098 -382110 258967 205262 133858 -214186 -140411
10059 -140411 -228034 72979 -384461 -53570 -250673 62793 -255014 -201174 -265032 -394084 -271366
10048 -271366 259346 -272388 159203 -295682 -3415 96953 -54987 61042 -92751 96678 42244
10036 320294 151179 173652 -202318 -128779 -264711 -125015 294967 220912 23642 21394 250853
10025 250853 136116 296181 -433293 -105401 -364127 -233546 48204 -506527 21131 -96492
10014 -10452 143034 -48309 -155033 -163188 -181059 -280482 -86774 -197497 48452 -10770 104773
10002 -49616 -140694 80455 54904 -43256 -202922 -234596 -158690 -197089 -138066 10429 -175484
9990 -298672 -148113 163190 -99070 176736 -247618 157359 -231374 -102597 -221849 -28609
9979 -316202 -123576 -36603 -6804 -80267 187136 -147152 -90084 203977 -137485 -5974 -215833
9968 -215833 211928 182685 -47418 -3421 113600 195961 -254499 -77810 -166679 236869 -73797
9956 109395 27744 -116094 -36396 -121810 -13085 217092 468014 -271810 412187 344838 36703
9944 -146712 112123 2967 70530 180029 -166125 -135784 97105 -115817 -220744 -60011 -230586
9933 -230586 -56984 228824 -145080 -198718 28714 -67118 -211925 -285760 -169761 -118555 156868
9921 1927 56947 -316597 162250 29706 301473 -390435 -95059 -157257 122278 152750 19200
9909 54047 -46674 58110 -87418 91583 -4673 -59151 -53887 -83740 39558 -139547 -243841 -208855
9897 -208855 119146 -127040 -315110 78590 177213 41956 109922 80121 -164554 45453 -113909
9885 -26719 -76620 -73639 76904 32872 -140829 -44016 -56038 -304023 75093 285616 -162501
9873 196116 -60494 -250431 135781 393149 -40366 239654 -124098 -88795 -327167 106096
9862 -400778 237148 -155304 -143004 -83419 159426 -220252 542 111559 70408 -158312 -201259
9851 -201259 -215598 -268607 81099 20471 76679 -138771 -213114 -269914 -20017 -356271 -142607
9839 -176067 -238055 -46844 -203156 -172263 89399 119399 -101991 157498 88071 -327059 71947
9827 24791 24875 -40707 -102488 -384349 -79810 153160 -79488 -25660 -162923 69061 259450 -238660
9814 -226310 204621 151887 -80786 -69338 -1223 -231799 -130741 -56775 -32115 58999 -274021
9802 -64430 -116350 -27522 404335 -239096 49294 -114670 -127992 63661 -230787 -121960 -24973
9790 119204 -132934 -43079 185676 120807 68904 37315 -11400 -167318 86610 99627 -130096
9778 40511 -139193 -251767 -98033 -331680 -8365 -61797 116912 146228 -162430 311726 89860
9766 -389530 118962 -116645 255800 33523 129167 45544 -160993 -158727 158111 33127 85580
9755 85580 -56151 -30835 -136573 -348180 224613 52013 -48371 -366247 43102 -506621 -79208
9743 -34369 -83666 -125086 -295784 -171319 -101902 -533026 -297202 -111206 139508 -134072
9732 44580 56024 239283 229914 -190044 306378 10526 -283192 213985 -272845 122496 -68589
9720 -55835 -118967 -141179 28358 -98740 95400 18579 178041 20026 56947 -65703 -131118 -109469
9708 -109469 -289435 155338 -123823 25389 111337 -1467 -26449 -157794 -62281 53532 -348614
9696 74897 -68873 -250826 -169793 -368084 -113964 -156814 90715 -46747 -184555 178600 -16214
9684 -125143 180333 -21247 -180293 157649 3426 90471 112081 -332003 90683 -16814 -134307
9673 -134307 -348074 -178937 -125099 102071 -37438 85906 -383285 -115536 -299638 391432
9662 224797 -14598 122262 17811 -80002 -295146 -70327 -11616 -75441 41101 -337850 -185703
9651 -185703 -65149 -25484 60259 -122804 -120973 -207117 -7581 39036 180659 -90962 -103679 -153932
9639 -153932 -238825 -377169 165027 -76205 -126866 266964 -71353 -197996 117121 -97540 -358373
9628 -358373 91284 -15072 -170081 1551 3624 220069 -138260 -208887 -344190 280074 -118873
9616 -57822 251644 -78366 -87459 173914 -73980 -260852 238664 -174775 -72610 -57731 113208
9604 112756 -31376 53658 -32357 -434979 158013 346838 -193651 139937 50472 31943 -135695
9592 -144475 -28689 -46964 -224022 908 -145892 -95622 -222949 92270 -297513 121282 -64503
9580 -94841 145632 69665 -174403 -143073 54785 80942 239655 -53838 94691 -312040 -82939
9568 -196878 64763 190225 -104762 151322 -21337 130248 64943 114348 153551 -40982 -113724
9557 -113724 292904 132011 -131839 -128831 105565 -104888 -110263 29954 -79968 -57157 -143897
9546 -143897 -106607 21986 -189262 -134180 60503 -38569 138795 -92855 -132836 180936 216194
9535 216194 -191794 -197322 27969 77833 216597 20384 209957 -34032 28695 -171690 146690
9523 -169625 -33238 -75045 -117289 258047 -38324 -241467 -458628 201062 -153411 -110062 -150828
9512 -150828 -8989 -7990 153723 -177214 40197 138930 -120371 361935 117886 135830 264823
9501 264823 293924 -322089 -52159 -81651 42489 64340 18912 43873 -145161 76528 67174
9490 67174 -106473 91156 -41371 36723 -168211 143046 -23472 -202622 70118 142221 -101895
9478 104192 278621 110519 56201 108356 51993 34821 27108 -88974 -308255 -177987 131126
9466 -110153 53600 124567 77509 1961 -139759 -138851 -75990 48319 -31560 33655 204503 -248309
9453 139374 -336611 48819 -157580 -31138 -183411 -283788 -59483 -131484 187413 120705 -124394
9441 -165510 10878 96236 -202113 -322294 -395245 -134438 -13901 -203023 -238984 -135269 -19752
9429 -206968 117931 -112797 33714 -175254 -169028 409735 51639 367062 93864 -103783 -364891
9418 -364891 23784 -96846 -107175 -155421 76808 -163007 60142 -34745 22968 -165749 -134984
9407 -134984 -305705 29981 -303702 -175468 -385448 -259616 -265880 35611 -128733 -125253 -215317
9396 -215317 -140663 -182678 -211674 -109756 14608 -34852 -235087 71439 -110972 112433 -438596
9384 -41719 -350524 -257285 25495 -197019 -126924 -257415 -179768 73334 -110078 -25759 72403
9372 175511 -88082 172764 -275881 113717 -225212 182604 55973 192709 20818 -116064
9361 324398 -150714 -308613 -69337 20432 313026 -135188 133610 -27129 -341006 75201
9350 -222723 207757 -119785 106007 -80761 -50804 -2079 -14530 -23737 10802 -119696 100650
9338 92731 114042 -127448 -61635 -277725 116705 -60592 -92023 -72428 30824 -92056 341577
9326 -3541 12277 -215477 383 126794 332722 364662 -147361 -109137 201449 62625 12274
9314 24321 303094 32263 -87983 274919 -140360 -91464 5291 -159667 -64254 -120995 108121
9302 -26469 75506 -203357 -368857 86882 -285687 -40519 -132239 -258647 -245832 292936 130211
9290 101193 66270 -37651 -51747 -420599 -127373 -6521 173543 -66276 -293841 -114578 229567
9278 68194 -177198 1321 -232271 106071 180025 -324341 227939 -157470 -269243 -60902 -185877
9267 -185877 290800 -80357 -8562 21278 179084 298510 -203618 132792 95685 -86315 18536
9255 -45112 -35176 -370414 -450281 -11165 -204967 -68845 2252 136923 -75872 70206 -97796 234404
9242 39175 419345 97597 -45990 -44600 -601583 -145487 322774 -410389 59607 -302529 -186417
9231 -186417 242814 84652 -5078 226140 74538 53147 314878 -141212 19510 72408 -146655
9219 242503 -5451 -340881 -433356 -216023 156238 210874 -229275 -392123 69662 36035 10813
9207 24217 134371 -66533 -18659 -190003 33251 -150045 48794 107430 -129244 -42414 -151171
9196 -151171 -252732 -234251 -44832 -259365 226558 -149892 -116276 41428 83656 -148879 88311
9184 -316031 -39552 216125 -133504 -333405 -126195 -491680 -120688 -104068 83392 -117520
9173 -109895 -68172 -60409 41455 57792 -254803 -397988 176457 166448 116757 -218491 -88295
9161 -244824 170384 43709 -325348 413698 -276785 -88832 -327385 -151147 -240108 -155419
9151 -155419 -29297 -310577 -67811 -173871 -134670 390290 132603 -190760 -279382 -89515 -264471
9140 -264471 -342296 32008 377380 -163172 341485 -87331 -62992 412349 -138310 -41957 -93674
9129 -93674 -25919 193208 -192964 289929 -74774 -365560 -102027 66163 -231356 89097 -36959
9117 297194 166133 177045 343615 -19456 37413 275688 292035 -231104 -191301 -118969 -240169
9106 -240169 100087 169447 -116444 -86194 -90598 -22361 -432306 -116977 2173 16277 -199388
9094 -64897 101398 -173885 27618 -84198 -31127 -64992 -40075 281750 127799 -59021 83190
9082 -191632 355233 -60448 -342071 54838 159940 134546 -208 25382 152322 -155660 -388757
9071 -388757 -221987 -63555 -88062 2150 4475 -186107 74032 168623 323915 -96316 4261 -15285
9058 217221 -230734 -307804 -86980 -11031 71430 -2740 -409252 -148012 462911 -261041 -4746
9046 -31677 -256091 184595 -168563 73241 -21411 92583 -195072 122559 160 -274722 -241708
9035 -241708 58199 -234037 -36788 -6928 -242770 -28841 249029 254210 -249696 7800 96293
9024 96293 24971 122512 -150578 -170363 51238 34402 -56137 295914 38216 -35795 239027
9012 26848 -167026 95092 -262974 -71544 226786 207742 109280 -147839 -326184 -38201 -7765
9000 61550 26909 132943 -82964 -80903 152011 168734 -284223 -164154 67384 265025 -293303
8988 42701 -7742 -48536 -39166 -57478 1558 73867 -188935 -14097 -26856 100313 -427765 11877
8975 -64656 -29828 372483 -8277 -41292 -143144 11266 5440 -113899 123466 172644 -62166
8963 -58028 -49758 147449 -123765 -106227 -103047 105107 210321 94228 -29753 -245050 -11068
8951 -77013 199375 169868 -241408 -73138 45784 -73905 -182500 -572129 -44639 -213190 40313
8939 -203287 -200992 106797 9402 -165110 -99699 -118863 192375 -120002 -54018 -28582 40263
8927 -82160 53271 -89853 -387897 -398758 -159490 183530 -104245 -72 -102950 -65900 43734
8915 -45885 26020 -370320 22157 -244526 122687 92423 30387 272845 -171560 -19529 -241087
8904 -241087 29064 155716 224726 144763 -249710 -28273 34264 -211866 70079 -38226 -14912
8892 -618913 -213078 -51712 126478 -2942 -96866 40627 11407 -104779 139978 -19354 246277
8880 -367342 -26820 -95811 -228696 -1994 -403739 -174991 -163758 -292220 -16217 -81778 76612
8868 -205086 -46615 -97063 97552 67563 -43714 -244227 -41629 300958 -37927 -125714 -238827
8857 -238827 115088 97952 -383091 -197357 -6409 66537 12219 117051 122811 335977 149920
8845 -141332 -249602 -58826 477125 83639 94473 260120 334658 185059 -98727 -113959 -52351
8833 75768 -193025 -105473 -288807 59354 -222940 -80760 21327 348835 26781 278733 -130917
8821 -243424 -256580 186088 -77921 -437082 -33534 -28945 -56901 332779 -126358 -613 352901
8809 2848 97527 -47131 66528 -102242 31776 -64548 -164182 -166870 104586 -238598 349424
8797 -179592 39192 -345850 259173 -21019 50308 248120 -75211 125174 108426 -18239 92496
8785 91451 -47718 145956 -66371 74904 -216251 -103122 226008 -304991 130802 53310 -39128
8773 105892 -170450 150774 -84762 -404777 -242384 -74151 -159638 136849 50383 -66642 -15490
8761 -87442 210865 -197886 -329616 -214948 16987 265071 -214958 -207310 -41686 69567 94460
8750 94460 79961 -136069 128115 80456 -208172 135694 -68509 -94088 -645 -74305 29809
8738 -323350 -213287 -10545 131304 -346555 -201731 263952 -41504 -40986 174603 -42451 -142192
8727 -142192 101936 77058 29898 -138097 242997 -198641 110140 48136 -53558 109042
8716 -122926 -95181 102437 -73422 -309939 180477 234562 18836 -278517 56790 388810 -28274
8704 -193257 -111683 -162224 -23509 213514 -203822 -41252 -83988 -139852 210819 -61568 -7252
8692 52281 -293017 -191396 73305 177482 -256391 -92448 145475 155000 28179 -32758 -52955
8681 -52955 -186372 78028 6723 -161685 -288394 8211 219628 -273567 -192159 60455 -128102
8669 -245068 -58204 64884 -27701 51610 -141062 -53789 112666 83979 -333741 -116754 -64104
8658 -64104 -366819 -97722 -100909 -47580 -183670 209043 32760 -33384 -46058 -120645 60075
8646 -103349 141646 -3245 -38884 -58159 -83036 -66137 -45103 -9566 -110731 -139179 -103633 -64212
8634 -64212 -523301 156154 -179950 -195173 -234729 211664 -172841 -106172 -178401 -175579 -8710
8622 -73846 293971 -37638 -108533 -124680 -51420 185189 -282155 -625619 -40054 -383425 79707
8610 -346560 -45071 163645 -38434 -79947 -82481 75373 92497 -368537 -20207 -163771 -54809
8598 -79344 55061 -282870 64689 -410957 -112811 -302317 -243265 -81387 98901 -496057 276754
8586 77988 -76757 -66734 -125021 -211267 136270 238709 -325110 -165676 230680 54587 258207
8575 258207 256368 249802 -99141 -168859 315129 174857 -69147 -273598 30332 -78625 271899
8563 -210433 98189 193626 -195507 -15531 97247 141232 -306788 -223554 80353 2555 -114329
8551 179487 -57708 -384770 -56882 127468 -14007 -61936 299479 99968 -37685 -190063 244662
8539 130572 42155 -48643 20550 144462 -15939 67263 -196834 244070 -372723 -371509 -105722
8527 -218167 -421298 -45510 -118316 98297 -159418 -113612 97256 42122 -70468 309495 133239
8515 -40386 -259099 -247697 -74466 216267 162178 -147254 100680 54473 -36629 -169968 -14950
8503 -98520 48337 -178248 -449265 -172601 -34903 93573 -208802 -8055 79392 -100130 210253
8491 11450 -39088 6449 -285446 5881 -430378 -228694 -279474 -383913 -61037 -39201 -40030 21941
8478 18253 -487664 -117890 217839 -145474 -331317 -257293 186495 -164795 -212574 -13354
8467 -207859 74248 -147615 -131296 345484 -223333 -56687 -38194 -247101 3409 289693 3925
8455 -141043 -96262 -48077 146489 -230737 300954 153716 -51631 181727 -246323 75911
8444 -16100 -129810 -73997 -287093 -42698 -277408 109354 58275 -25256 -67050 -287308 -1865
8432 77881 -76304 320167 -272239 -357760 -281499 18846 -251656 289293 -32948 -300971 8010
8420 111483 -19939 84323 -163311 236051 37246 133308 -70909 -121019 42446 199100 32987
8408 -109236 -144224 -259184 -75360 -88565 132872 141439 -92316 66413 -148227 -251179 -203976
8397 -203976 90510 62066 -30070 -330841 225108 -247883 181529 219343 69401 133518 15043
8385 26320 142884 -39990 -381513 -341037 406957 -259096 112830 -93953 -68741 279990 -134508
8373 27967 -178081 -264194 -356006 -160521 110362 35382 -52663 -100276 -9335 -250730 -157182
8362 -157182 -203281 -35230 120306 -85274 197631 -294561 419430 188875 -89093 -64878 63240
8350 -157826 -211342 -48704 -93907 302659 -93073 260021 55398 -68880 183582 -163607 -46314
8338 13151 123528 -105380 -524759 -134720 -250219 21486 -172239 -210853 -311946 -5622 -50150
8327 -50150 113209 78984 -109087 -249697 105931 183735 -159932 187943 13344 -178347
8316 -228814 -188050 17674 206765 -98855 141752 -176237 25067 -8406 -148154 110455 50368
8304 -88428 -99216 142106 12409 -63842 -71810 72417 42029 49342 -368535 98341 227012 -45445
8291 338339 -21936 -26703 -12433 -41777 12230 136435 -23448 156167 240477 54164 -56225
8279 -261731 4021 36543 -3220 -52473 74867 -353826 13113 116693 -35994 71990 -210306
8267 68272 -159738 -25245 31769 -281244 226741 267611 -204160 -261298 105960 48419 -448840
8255 102558 9063 32859 -154004 -111715 -191096 -259225 -149689 -181994 -281683 45944 23641
8244 23641 -9127 136634 -43061 363860 -378855 -21566 -250633 107487 -245548 -83614 -343518
8233 -343518 239258 -25502 -1230 -193272 -140780 -140573 -117390 141074 20818 -171593 47191
8221 90704 -27993 -179061 121035 -121048 -150421 -412573 123236 -86141 -20373 -33461 -31370
8210 -31370 183752 -268875 215578 -111968 -61296 -16571 195059 -41919 91447 -118896 341515
8198 241885 -105203 125748 -184909 -41483 -30208 174751 -83234 127062 -231731 84567
8187 -101275 60032 -201983 13767 223725 78994 -271444 42181 -41568 120883 -149585 41977
8175 17525 -247302 28077 331464 -291658 -213805 93332 43527 -196149 -471818 22233 53456
8164 53456 58802 39097 132470 260539 200782 70466 24899 -104374 -167371 -170606 -126312 -55851
8151 -5904 -429941 -237986 381260 -349638 62116 -254287 67167 206189 -177855 93487 -139826
8139 -87520 -209241 -375882 -393194 -75965 -538110 101911 125829 117215 173302 183318 -59582
8127 97341 28882 -165325 -296537 80336 477259 87047 103757 34757 266619 -52326 256602
8115 -3558 -55449 -291432 -46076 -151710 -439075 2068 -228824 -278485 4597 -47990 -257805
8104 -257805 -196461 231976 -203554 109042 -14408 -108362 -300507 -12085 -44960 -171184 -7892
8092 238500 -234644 53570 284556 -27900 117273 263893 -34683 100345 -30241 64619 119552
8081 119552 -487494 42775 -226882 -101548 -12472 -94350 -120830 -124092 -15004 -375943 -154074
8069 111384 -221192 181636 -412361 -382522 -231014 102954 86297 -128863 -41750 -457082
8059 -457082 -254753 -188918 -123201 236475 22692 -38964 -94921 14124 -35593 36382 89989
8048 89989 20548 -452142 -278338 -34617 -36834 56047 -163616 176473 320031 33855 123211
8037 123211 -236116 -274480 -243960 -221741 87342 107254 67962 186962 -49236 -71779 153838
8025 64280 -18328 -31610 19198 -210303 -122629 -31803 153610 209718 101164 -144682 -209780
8014 -209780 12653 76053 -391111 -70408 257872 -160044 -50598 -116823 -10575 394985 -49311
8002 -216721 16418 48718 -218051 -42939 -196390 -142687 71729 246889 172826 -14911 58794
7990 62328 69255 101918 42765 236151 -369713 -322593 -107501 34806 -308538 129581 -125720
7978 -182936 192289 -114927 -56708 11924 16575 -99004 -81403 -90154 231012 -73741 79035
7966 27979 -22278 384262 55214 -130776 -194210 42957 -142679 58198 -218806 -189942 -231396
7955 -231396 43052 25049 -24049 -95597 -30496 -69864 175406 -10777 -138334 376379 90820
7943 -166922 -344712 42772 -198292 -59117 41311 -299266 -209827 124951 -11899 -228944 197929
7931 96039 -71181 61194 167410 -263955 123706 -223288 380456 -262785 -279218 -354992 -244041
7920 -244041 132786 -96584 -159082 59432 -148895 254781 -140199 -123094 184612 -23192 210974
7908 197908 193945 23079 -30649 331492 -77287 247308 -62568 -105405 14889 -399552 -252765
7897 -252765 -56796 178490 144984 80318 204667 -182454 315715 269828 87192 -285636 -155936
7886 -155936 -63640 -209149 221261 -47074 -24063 -167203 150449 137766 299213 285833 112368
7874 -143107 -248497 -43573 -287393 -73011 68982 61664 -58236 -205190 -156562 -166888 -40875
7862 40951 -250755 -352775 19805 15244 -150896 416155 131014 -239145 -348451 320319
7851 5169 -48024 129918 124809 289217 75348 -63050 -96536 -297377 56821 202370 -15388
7839 -50206 164594 166987 -310551 -65838 -313452 -196235 -92285 -17236 -55657 -151266 -294776
7828 -294776 -34086 -84043 256528 61559 15574 -149165 311555 141689 -142198 -190242 -119157
7817 -119157 -238053 127137 37117 41986 83948 126484 -219779 -78527 -324074 -114580 279729
7805 -221446 -139467 -45457 97819 62413 -21614 2114 -231250 168744 201157 -119280 -14999
7793 -110587 21706 -6500 -384771 -132351 -273302 153091 -394436 104708 -5484 -65949 140992
7781 -71625 171744 294151 -49871 -105263 26467 -96940 -142470 -176314 196342 -190169 103242
7769 182980 157006 -229878 102819 -61028 157692 133408 204774 -277305 -305972 -154123 -226915
7758 -226915 -349192 -100001 -179287 118930 -2894 -227834 189996 -49398 289233 -157977
7747 -112696 -15165 -21246 -29914 -75452 229350 -220055 199101 -236525 -134910 -278697 -45162
7735 -47147 -369453 -150385 58829 160829 -122534 2424 95095 -103285 -19546 83255 -223182
7723 123802 42210 -155380 -10699 59722 -52415 263418 31559 243909 50995 130758 69279
7712 69279 -222322 -292322 -127052 75679 217082 2931 242001 260082 -337924 163040 26907
7700 -281925 226657 106307 350604 -7067 -282470 -388450 28978 34906 153589 -255862 -20812
7688 -37129 -408020 122989 -14291 -162667 216398 -161953 102412 156239 -67730 -25404 47964
7676 -151869 158921 -15797 -11405 -158229 147887 -196107 -1020 50998 4198 48728 80578
7665 80578 72052 173774 48413 -172439 -132221 -74908 -266866 -178386 109401 219171 -54446
7653 -71576 -349948 -125130 14475 152440 120399 -68183 115298 -153322 182361 -198272
7642 122735 284483 -277137 109990 66973 -169459 63219 -169956 -253697 -242607 -327921 -275845
7631 -275845 -29520 289742 -164283 7198 -263244 -302087 -18012 97471 -23193 -48318 -84739
7620 -84739 -170744 313798 170833 46684 139133 168768 311935 -46556 -55767 91855 -195718
7608 -97265 -108165 -188573 54227 85126 280437 338278 100206 100048 -30044 -19215 -264976 54577
7595 5588 -210774 123651 263621 -136102 58146 182772 179249 -129710 -219323 -257156 224391
7583 -71762 -339464 120243 -12508 -97781 -89508 90012 -441353 50982 115098 -98471 -23354
7571 326780 64818 -82741 -91885 -133139 68182 -115798 -191950 -50163 -198185 1174 60048 -190671
7558 -240136 -93613 -153745 229774 -13624 -186104 161710 314026 -1298 -122911 -18850 269212
7546 -169249 27920 -8335 152584 -47292 -58268 83828 -308105 -233977 456357 90687 112289
7535 112289 -51504 54799 -3140 -171087 -71409 -176183 66177 -255454 -247049 -230695 -208924
7524 -208924 30876 140718 119080 -119681 110805 -31738 288793 78307 443270 -324787
7513 -20896 -68120 -126063 -208409 48224 -208053 -183880 -47916 138835 -238301 -162293 205248
7501 194606 -11900 -269336 95022 -140486 -274019 -3099 169279 -168833 -33159 264240 -63075
7489 -180891 17875 262229 -51023 -141140 -167967 339195 -306901 -41109 123209 42817 -869
7477 57770 60770 285412 198068 -130344 -102398 41369 -31486 -56370 -118444 -255161 96751
7465 299991 -62031 95860 -383824 297142 214242 185777 -94160 90289 -178506 -426672 123876
7453 -124780 -278287 -9607 81633 -25903 -330533 -127332 -34079 117356 218740 125855 -165045
7441 -27024 -112277 -88186 84316 48433 -125100 176269 -275545 -90038 -106938 77667 -533928
7429 95335 -56581 127006 -125447 -276459 124092 -190980 -452641 164802 -227792 -200736
7419 -200736 -326474 -7289 -205976 -75286 251203 80029 374747 121025 -35601 27289 142614
7408 142614 169267 36021 -128148 60222 -86211 -64064 -51286 -229361 -197157 -39693 -187361
7397 -187361 39776 -56392 135275 -18150 -21642 -190069 -38150 344862 130495 225948 240138
7386 240138 72495 -231615 272637 21052 -121234 -165692 64505 268014 -95481 -203712 -145644
7375 -145644 89746 292812 223232 -75132 -148206 118187 -81582 -220319 45338 -190868 -308638
7364 -308638 71980 350929 276955 -85615 166191 124024 -101185 329656 -304667 -67295 -272188
7353 -272188 65547 153069 -22558 247004 -103337 -86948 -220479 -49618 -228509 -182587 17689
7341 -68668 94704 -43411 -150747 -6383 -21980 66984 33762 -57915 -157486 -316987 14427 80618
7329 80618 55997 159145 362265 -251407 18070 -195391 180392 -181797 -195041 218649
7318 165258 -235746 314742 301993 49566 144894 57720 197923 -216183 -397790 130677
7307 -186016 -241927 32347 -75175 -167174 -87084 -102894 100427 7185 -89902 20751 211680
7296 211680 -298429 -82703 -162107 104017 -215392 -218272 -99200 -198962 -138328 -143416 -98842
7285 -98842 -158925 -92126 -3168 -26542 -41671 -180722 152756 -185646 -98919 252059 -246300
7273 70422 -78629 -70415 -189640 366935 51532 -102884 -476812 -130418 389689 14588 -119487
7261 -32888 -55423 -254637 -16496 -140099 282597 8789 -30169 66042 -3143 -333846 29802
7249 -38676 464867 -322326 236123 163830 270537 -208815 49691 38094 126689 -245206 148860
7237 230750 218225 273715 -91855 -143249 -101137 -57845 75480 -155234 -382070 -394935 80195
7225 261758 -177134 16161 65149 -137218 -78393 266036 112496 -119095 72469 57681 -159277
7213 218098 -128301 34760 -41544 -165600 71050 -108694 -91956 -342188 -113592 300721
7202 82323 102153 12704 -208167 118994 -10915 -43642 243270 7155 -52736 -103460 99165
7190 -64850 214099 59075 -163397 -116504 -274722 -228443 2011 -139793 -28536 -350331 57352
7178 -224897 -117415 69442 80633 -266959 129736 616697 -222259 -174156 224583 -340887
7167 262776 -415970 -118559 -249972 -4361 269136 -16422 66240 -283109 -112639 64479 -108215
7155 -15058 22758 168490 -196403 -146605 -540 87640 -106976 79319 138919 38971 -194747
7143 69199 -71863 -75235 -45028 312813 -152177 21732 -36004 -118631 -217512 -17820 -377078
7132 -377078 -164960 -73402 -263257 -88482 69914 -152067 71154 81043 107375 27821 92146
7121 92146 164775 -222505 93906 186097 141704 226136 -187565 -335906 132770 302085 -75921
7109 -7746 34138 42129 230463 103872 -72694 -173206 89852 -131219 -208822 -135186 -115059
7098 -115059 273484 -17301 -1942 13584 -10125 -451575 14893 -85471 113513 -35205 399866
7086 149278 -215445 -165642 131754 -85201 66552 -259200 -273441 185619 20386 -226828 -247564
7075 -247564 91651 33443 -150885 -183471 -157921 -105418 -109300 41222 -14588 -210204 -1678 72842
7062 -195760 -158880 -110002 -16378 -137525 -77440 -27767 -279932 35193 -277460 -167321 316549
7050 -12288 -27443 45901 -41895 169411 -77305 139981 -101326 -133178 -32399 -59925 114990
7038 2223 102562 -137673 382323 97544 111144 -20431 -231312 -97565 -26981 -419861 -61350
7026 -48027 203324 164395 -78310 -230054 -135503 -128457 -46351 99247 10412 -85342 -136212 -166034
7014 -166034 -230036 129565 119371 -74598 -219504 55284 143726 -149159 78779 18391 -44190
7002 -99576 84634 82831 207056 -36958 122543 200487 146564 -280590 33256 2032 29233 223044
6990 223044 -248066 -238776 281545 -80307 3492 -95708 -73234 199695 -128562 -128444 168078
6978 -170455 -375857 81702 183039 83755 336721 -56097 -39471 122353 232481 200608 -220097
6966 -119693 20539 132335 147119 -178334 181716 157293 298797 -217039 -397234 -132519
6955 -282574 -156896 -126504 108783 -102194 -104666 272217 53935 47729 126152 90171 109756
6944 109756 -56332 -266186 51393 -82877 189487 86277 83610 -220019 48171 -232403 -32232
6932 -302776 -264461 26575 -226053 -73903 31768 -106243 -9424 -221703 -143790 107318 -3389
6920 -107732 -342766 10368 171449 350817 -101515 -248230 -105380 96622 -145150 -219933
6910 -219933 -33111 341444 -179448 -268849 -102775 -232918 52293 125303 -196249 16405 -271827
6898 -238544 -88513 -37663 40539 256405 -114202 -83491 108707 -136039 -128772 -102626 -89921
6887 -89921 100392 189493 -242848 1138 124241 79820 -28772 -25913 -219421 -249348 -75478
6875 162314 -66701 -43130 382221 -164947 -256698 -63843 -9863 12325 -6772 -219747 -207849
6864 -207849 -62279 -194005 170695 174733 320005 -214143 -133449 -21916 165822 220769 -87824
6852 -20174 -161366 124847 -14786 -148184 -212327 167906 -167543 25663 -105677 -255537
6842 -255537 49653 -119800 -174048 -86348 196543 140371 -79518 177926 -281560 209152 171115
6831 171115 -143484 -155389 172228 -100667 -182513 -10464 126703 -1732 110499 31127 -107657
6819 28962 -24854 -3422 -107853 96385 30822 129633 -62562 -81116 -5310 174576 -98051 32875
6806 27438 -62240 148461 -13842 -82361 -359522 255791 -188397 -393626 -8769 153232 -59400
6794 -155077 -132445 -72601 -392102 143542 -59130 -115432 70236 -278894 -145404 -8987 -38700
6783 -38700 246884 101382 25113 -109240 -87348 -68850 -224934 108662 -31653 -148278 -65563
6771 403474 -49232 -224889 -100271 -21516 -106522 -17506 -179983 21131 -118176 -102337 86852
6759 35767 -215782 111180 5328 -145974 148166 -29263 -118948 -5947 119640 7688 25457
6748 25457 28958 -90338 -12003 -60736 -526028 -74148 -46648 -179222 116655 197795 65372
6736 -255058 211855 115682 -66268 -31531 41448 179933 305833 -278273 63619 19521 47783
6725 47783 51541 -58053 196997 73189 -248753 7761 132003 9090 -142004 -33943 13278 33043
6713 33043 22710 103889 -100752 24304 78505 30130 -69810 82085 123709 186799 -259009
6701 535179 -38721 120627 -162324 -179941 158974 104388 23951 -20410 -72771 83912 -205070
6689 -97369 4481 38517 -43678 127767 148354 -248871 -287187 164472 -209249 -134639 199752
6677 -95777 -37983 -61653 168867 -163821 85350 118086 107436 97824 -194974 -114564 195028
6665 -35 -73974 366225 3647 -10005 -91362 119970 96401 -246419 37248 -218356 -164863 -14387
6652 8210 168266 331789 89830 45975 10021 39887 85201 140139 -48226 -222527 -232801
6641 -232801 235144 130220 23438 -436086 194742 -130925 221711 -89477 -102366 -215014
6631 -215014 -85961 -207766 81264 125296 94218 -9522 -11791 2298 357050 25757 118693 -95022
6618 114076 4762 -253911 -234599 -145370 -30080 -233593 -191628 -150397 211636 -593162 -287289
6606 34650 -119708 -238998 -82921 148530 -55966 -9512 -10996 -47060 -146007 88078 -174272
6594 -109746 -121092 122883 -82510 339630 186641 90563 -290254 490666 -64808 99620 -393842
6582 -110319 116674 -107249 68175 -251269 137071 201641 120573 -66059 -68622 153749 446913
6571 446913 528282 47597 143346 43171 41270 -46853 -146045 -95767 -76190 -119991 41581 -57433
6558 -226266 -54245 -148783 -8721 280024 266812 256195 -31599 32692 -80768 181932 219648
6547 219648 -29591 95595 104828 -140281 -215108 -91743 -225126 -340592 22305 -111801 70414
6535 57185 -157283 -244646 -308764 -48095 -157024 -115398 81061 -23667 242103 311174 -26662
6523 -212234 26452 -366005 23990 -295990 -127400 -121462 -167741 326920 34688 -54841 -97955
6512 -97955 -122430 -108848 -18573 59337 106042 243104 4603 -42031 212649 -108972 -23331
6500 99503 225830 -40046 -104483 105911 -235128 29068 -1769 -20004 -70841 131096 -236635
6488 -79432 83016 157906 174665 81621 -86938 93815 -2600 116356 113812 192181 -85008 242297
6475 -405965 -7477 -454081 -210776 -301633 -120615 128161 -18755 265858 200309 -92142 28849
6463 282211 -29085 286545 59147 244742 109883 224319 8235 -252530 241034 -726 -25870
6452 -25870 65397 -198122 -120690 -11253 -18536 -131113 -10670 282613 -110481 27675 9058
6440 138368 -20334 -212551 -90240 -228992 -74229 -271985 -181080 -67505 368194 -76955 -167211
6429 -167211 103087 99266 -55054 -104727 -14248 49086 169205 100151 51124 17426 -30853
6417 -59200 141122 -106623 217183 124231 -296206 -62908 -211444 -98676 -146420 -62698 121563
6405 66080 206953 266802 159731 -30149 -280144 -76452 -25353 -192124 128494 -406389 -22850
6393 -7051 67787 -35244 -194143 110836 -226020 160693 -337000 -72916 -76427 -1906 -149962
6382 -149962 -3602 16995 14289 170357 85510 -188981 16192 338216 -266309 -335626 -182622
6371 -182622 134487 -325601 -162574 -99518 -45516 7652 4418 -223993 96494 71392 -120179
6359 -7855 -165956 -184338 -34950 307809 -42540 295006 69960 -165244 58604 372557 -264133
6347 235283 91923 -63001 -92147 92224 -72027 53294 -99051 -2847 -44646 -246197 -96830 -20427
6334 118164 28280 19247 71474 -10199 3759 21096 61768 85878 -109421 -61110 -102876 90436
6321 6966 233543 -141525 122982 -135113 -250690 -197627 88786 42060 -105274 -8961 107321
6309 40742 -178757 -41777 125219 20528 -7156 -92053 269911 201761 -142349 -180210 -325082
6298 -325082 -193959 61720 -218443 60465 -18963 -72157 -226222 -102138 -16916 1043 -72459
6286 -41957 -28518 -139998 279697 168628 226137 197460 21596 143575 109429 -208548 50788
6274 510260 -182304 243282 -68941 -203500 -199554 -106603 -109834 231572 90443 -211284 -266089
6263 -266089 52260 146884 25391 -567 156659 -9241 8336 -95211 54220 70028 -328939 91374
6250 -48422 109422 -210276 -15457 153353 2987 -113482 45090 37676 -49142 63090 -285669
6238 -84499 113381 -73800 -99148 217430 -195292 -171938 -9491 -48648 -5137 -237490 -100697
6226 -395635 -22047 201073 -198661 103919 55172 20028 90237 214125 55637 -174230 25429
6214 43744 -18762 75304 64371 144177 27607 -42826 -135215 38597 30501 283341 103045 -8651
6201 -137582 337222 -233336 129207 217618 121053 -106259 176929 -30641 391319 -88095
6190 -86908 98904 -2615 180684 211356 -176859 -10536 150406 -134966 -79280 146740 -439932
6178 -54998 -160186 -57058 -343434 -98351 181923 -460058 -89258 121390 -219756 -146720 -279565
6167 -279565 213940 147466 175343 143643 -81769 153307 -144535 -27805 -236685 176917 158176
6156 158176 20708 -5508 45451 -51642 342837 206992 -256503 -88296 -203721 30347 75344
6145 75344 67322 -63204 171330 55623 -38833 277477 -123764 35957 319896 138118 -88605
6133 -143977 -158687 -105699 -293574 25180 -18026 126463 83675 225509 -24911 -99908 289210
6121 -107552 85524 157847 -203571 99307 20660 237907 80710 33416 58217 -256831 210682
6109 -24055 -144778 -241217 -313447 -11310 41221 -142447 237913 -162079 282104 141334 -406113
6097 213140 -75298 -75539 141755 -65007 -240821 354887 -179426 -47744 -24922 16662 353713
6086 353713 160568 -74329 -78213 -35545 -87031 -65351 -79395 129630 -72952 112127 -460195
6074 117776 -144920 -7559 235763 -161048 252368 8554 -59548 -92783 14508 504020 54047
6062 176280 123339 -264707 257755 -36197 62406 438558 -80697 214161 -129244 22882 47123
6051 47123 207568 -100736 -246508 408651 22803 34782 -14029 59632 131347 89141 -54447
6039 7292 -267021 249314 -31648 -11715 -122221 41441 -2592 -719 169422 126046 -53054 32119
6026 -232624 -29991 109541 -127860 -62235 80120 219386 280486 -117095 -7486 -144172 319332
6014 -86385 -375688 143130 -90115 109381 1676 -122539 115981 -35293 106888 -277776 -74916
6002 -167750 -48531 -43457 204233 66429 -162168 109246 685 299088 -129942 -77677 111470
5990 -77071 88023 -142938 -127187 -277820 179293 -267251 -84151 37118 158210 28289 68271
5979 68271 145024 -204388 -231260 -126409 53335 -167941 -64239 230477 -6988 46573 226457
5968 226457 -14079 -32512 -53668 -72530 -153706 -122758 156887 202420 -183288 109117 -160335
5956 -213008 -235164 -243852 -219357 -289577 120414 -15223 -199930 270016 -266879 -85755 221359
5944 298851 -95460 19819 295561 8693 -111928 -147107 64105 36779 81743 52874 142788
5933 142788 -85313 -78676 -204363 -281280 -401344 -348130 1299 -302537 -275343 11787 -8641 -277288
5921 -277288 83136 -142368 -137008 -50403 80048 254132 12279 -286875 -598 370803 187479
5910 187479 264089 36932 43787 -13414 -124027 39020 21459 104332 14550 -264973 -75120
5898 354210 50946 -127352 -8111 29641 340652 31909 16063 -156281 307589 -96603 163232
5886 233864 -198519 -403295 171417 -1594 253375 136202 9560 70014 -164063 -51081 77779
5874 -29334 792 -59602 -203407 57076 103063 -12561 68662 189730 248839 160289 21043 -201037
5861 -166138 317697 28426 -54822 -170893 -59617 23633 -260899 232171 17845 -131412 -32353
5849 -67036 6014 -233855 -249235 88343 -182126 -368324 -50332 3600 -206201 68146 -20287
5837 -391561 238053 -175072 -524533 -115587 73799 37819 43150 68600 -29735 211442 -183799
5825 127816 84667 171550 25377 137894 -248252 86819 -21384 54217 -332420 222130 166247
5814 166247 102592 156081 -30251 -186065 -18907 94782 -115772 70583 -45778 97697 -419670
5802 -89179 -258979 -132792 322520 99822 -169995 155347 257069 -108392 -496025 -381940
5792 -381940 176495 -111397 313147 -58686 391224 -91248 -129072 -118063 19240 270665 -158317
5780 142312 105489 -41763 173280 -155440 202348 131451 401274 78711 -57963 -338812 257099
5768 -131656 -63959 -1769 33393 175377 49154 -102130 -5154 -219549 -12259 -15206 209567
5756 207419 127748 168753 296372 -162012 -163406 -35130 -229129 120725 141469 226606 140825
5745 140825 -98398 -4665 -84595 3033 -103899 -2722 -31261 245869 -239788 39620 -187622
5733 234384 -141586 12834 7150 -66756 -103398 -80298 -139788 -68122 26818 170125 185783
5722 185783 -146135 -185424 -118097 249888 9632 -220337 141907 57962 232630 533057 -114409
5710 328416 -69568 68096 291128 105337 -178659 63270 52634 117296 -473662 53508 109631
5699 109631 -100050 -247389 -349754 -124736 -111532 -169696 -296293 111162 -314801 224461
5688 -62298 69524 146031 84550 -76513 -397416 52414 67644 -156295 227774 93968 4461
5676 122103 -45246 68928 88507 -134595 276637 -87675 -148222 -209368 33299 -192522 -288506
5665 -288506 -157462 -75070 72167 32647 -51920 -112411 27769 -556143 77342 -120518 338
5653 17509 -37856 315187 36086 216992 89768 101097 66572 -313510 -28539 -74711 -129912
5642 -129912 -116926 141260 40420 185418 -156760 -112357 -164945 -97593 347137 228022 203235
5631 203235 -88828 120754 -153567 -124870 -112051 -169617 75698 191081 -156010 91497 -142804
5619 -127940 238967 -78332 32 116017 77463 -28349 -244248 -161928 -183351 -164021 -41658 107007
5606 -233564 -103127 -167728 -122325 -72529 68585 -93655 -475122 -84786 -45363 358340 98195
5594 -372651 -64324 220881 37498 -24169 -104129 482159 160160 27520 17148 -80398 -200868
5583 -200868 16376 -74659 -163228 239179 441261 241790 243538 52165 49445 -226236 -174817
5572 -174817 181767 -489090 -204287 -69127 200401 308906 245139 -200970 -196849 -121592 -154123
5561 -154123 -154158 63802 206358 -25370 23794 -104008 2767 -413536 234078 229090 -271512 88083
5548 14812 -78909 51988 -103082 146799 -98314 430101 37146 -115742 42979 -97946 -36753
5536 48298 194972 108715 118335 -288386 183466 -94405 18021 -171967 104989 5059 58984
5525 58984 -177245 -70 124321 108021 -124691 174097 -149215 46422 -142626 -140507 304991
5513 136499 18410 180241 -182048 -83902 -382721 158886 175154 53800 163192 18642 -115934
5501 286692 6488 -246861 432476 -40401 -54499 233051 -47743 -223907 94012 257752 -28524
5489 -348820 -114190 -10550 -114889 94310 -274438 239498 -20254 52683 600974 -34175 -95985
5478 -95985 -423393 -133826 -299184 136623 75511 195723 -228649 -49314 -54760 292874 -388958
5466 52158 127891 -177339 228357 -62725 150381 103169 -294295 159127 -23959 -195316 -117716
5455 -117716 73702 -77695 278344 113874 -99787 282550 -83305 86182 -88700 196895 -22395
5443 -58706 121836 -234431 -258289 346037 97092 67014 -57178 275939 -275002 -155497 -287747
5432 -287747 79313 257020 141793 -179896 203518 -228171 -290315 205551 -232028 -94931
5421 11992 295111 136142 104702 -183792 -315046 -415759 -53614 -184741 57966 259581
5411 259581 -267857 -83239 350386 -8167 -39070 29376 -58445 52822 372399 37178 97969
5400 97969 -121763 36796 -277080 1525 69117 -104895 125255 -378490 -26926 -117525 71325
5388 90466 135043 258116 540849 34691 -57585 222340 339223 -22000 398688 72818 90301
5377 90301 82375 35058 -345529 189954 -163937 -2376 135467 281304 299083 23296 174465
5366 174465 175429 -6760 -101282 117484 3984 -55777 -120584 -126522 -237943 -20999 -74271 65036
5353 240078 80755 51050 -82591 23815 122072 65960 -65320 -175857 -189633 -69613 56338
5341 187591 99363 19663 107628 175377 -171322 -92306 35090 374431 -174983 227394 269966
5330 269966 -36264 46698 66831 -12793 -6261 95748 -66583 9449 126229 -215762 -141936 -188679
5318 -188679 -215477 41426 106111 -6905 -43823 -105512 -156324 -93734 -67059 -140432 -10675 -281972
5306 -281972 -72281 191190 -141987 170450 41696 -14225 -17577 -47029 -44673 209222 127530
5295 127530 173259 66559 249159 -269472 121424 69311 -240704 -40962 -231830 -400425
5285 -400425 315752 -281594 100109 -33453 72651 -2189 -217836 -82050 131779 -241241 -188139
5274 -188139 102438 -10621 -143562 -24017 108237 -218967 -58131 6215 199480 25861 -165911
5262 50885 163762 5584 -2774 -56274 -223121 111920 221750 -101928 472020 -369095 351480
5250 -179162 -214213 304918 94576 280222 90004 -131009 -261756 32827 10545 -105959 -224632
5239 -224632 90711 -151813 -96025 107099 168872 -219149 60957 -112911 -306095 -41518 -136648
5228 -136648 69162 214817 -325052 89912 12160 51340 95618 76845 150092 -52637 -44688
5217 -44688 -198367 -110438 137893 368400 -300429 124474 252072 -201009 -31134 349953
5206 -443735 116028 -3961 -65590 -35801 84681 197168 89196 186144 -14524 -217295 43615
5194 113217 289163 67013 72846 81603 -379209 -198010 -33296 239716 35971 -85773 -92456
5183 -92456 -54618 -185226 297917 -183450 -127927 143608 -112980 -66262 -199034 -187494 149146
5171 165433 -35498 150405 -155157 -30891 -14466 335713 -12300 27114 -285628 -26712 48236
5159 -220827 -168738 -201710 123146 45222 -22198 -96589 -51789 -377959 251415 383927 -94306
5147 -39684 98372 58683 -59796 281401 171563 180988 -22672 103310 53229 -8588 135827
5135 -21248 325462 216124 126849 124704 -170520 -44062 60251 -192253 -88448 176933 314329
5124 314329 -7521 110301 -57399 254110 61133 64987 135170 161287 -279804 -268837 175565
5112 119146 160195 180267 -74484 60631 -13516 172492 -106972 -8256 -212151 -224986 -263964
5101 -263964 -30245 257700 346365 301528 4606 173578 101762 -13384 82725 -360134 -25031
5089 231403 -135215 45304 -312359 -106343 -44159 -5903 196360 18227 -8752 -101769 215061
5077 -56719 215454 -114516 -454318 132119 87321 204645 162085 98449 -346227 44176 219105
5066 219105 211443 8632 284512 -7601 182839 267905 -160578 285244 -211497 199940 -305557
5054 140137 -186617 -231271 79969 -28755 100847 -131771 122749 20506 102825 -99577 269867
5042 3004 -8482 -180574 168277 304847 116902 -476304 -165634 -566589 -89513 145737 -220323
5030 151701 -142448 109879 -51111 167228 174467 -211407 124794 -165758 71437 115876 213385
5019 213385 -208236 46611 -25790 160279 -173247 99627 34031 54801 188722 -253567 -10169
5007 251731 -21019 -21681 -59643 192405 -21295 -483070 6142 -52237 304148 -84449 80048 225496
4995 225496 80175 97543 -145018 -282460 -21313 -150006 -282945 -90142 -25116 -246015 236498
4983 -156305 76287 59458 204080 -122177 58174 118517 -55157 -60152 15881 -49321 -105081
4972 -105081 12015 -271066 -91314 -113625 96947 -44886 17586 49402 76539 -49434 -34050
4961 -34050 -26818 -28552 -313120 14428 -193400 291817 -44 25132 -95226 110966 -159914 -35583
4948 -58835 399095 188718 -61350 115306 -226509 33336 151161 -209510 84295 116721 -87113
4936 102459 306341 -189375 -120662 352941 -77691 -95063 -117886 94257 -350357 -179795 -72415
4924 280351 49562 -178552 -184088 283255 51115 -163805 104620 110094 7959 253201 102708
4912 99533 -275339 75932 169226 421321 -116519 24455 -113807 -6513 -189138 118790 139896
4901 139896 -284572 -127064 55788 -234256 110588 60375 280985 235394 209726 -65348 152744
4889 49568 292903 -351121 62092 -47934 75647 -167736 -66703 355610 -63598 346738 -24308
4877 35603 207228 182202 25330 -59107 89904 22561 -20360 278846 -85471 -100350 -200156
4866 -200156 -179475 4834 -49433 -104518 228505 74973 243277 191898 47672 118523 -135739
4854 232419 110007 122013 134309 -41148 -267032 55801 -35353 7994 129615 71807 -186043
4842 -14539 -182101 -46101 203926 -188025 -75532 -9320 41376 318658 111138 221879 -74270
4830 98830 -130401 -39031 -63054 253712 15880 151589 -95569 -355076 -60077 -46978 -87080
4819 -87080 -235633 155622 6952 20049 -81741 -264370 -17541 128425 329119 68578 125980
4808 125980 123896 164288 135118 103003 -305455 -132951 -13200 54410 197310 -338934 137234
4796 115490 49111 -248774 144610 137608 343826 -280090 480349 24912 -222199 233729
4785 -136591 -114039 88568 -102411 -49368 -50225 -169280 -413431 -203003 39261 103440 79691
4774 79691 -29169 -318445 241050 -121572 -48023 -13887 -106372 172153 181733 140267 -44444
4762 82600 -179430 7681 -78033 -88827 -77143 225692 93355 146128 17769 -137939 -42771
4750 -19409 22769 -173879 70069 -207903 121605 -148778 -127019 -114758 -3009 -83723 26695
4738 23236 112700 -303511 33891 -186644 137150 -67677 -419086 -5765 18092 34613 -273277
4726 183021 -143858 -183168 59009 51823 35306 131195 196628 192747 131653 107908 -125025 -171322
4714 -171322 96957 36889 42336 -197205 -149210 -162964 -108878 167168 -14821 -46348 315803
4702 82189 -194570 82165 -211139 -60278 37973 181094 -88575 282883 -43513 -22349 15002
4690 -149372 220221 12049 26550 96009 -167773 271707 -191117 293882 -106293 190019
4679 164149 -12732 -68373 293700 -207147 -113379 219087 71237 -189857 30692 -52938 -93097
4668 -93097 -176042 357536 366999 -11810 99747 -321172 -167846 -89111 34233 -36773 -165809
4657 -165809 -155152 73637 -101167 241530 155908 -448187 198902 285625 -80667 -160198 207296
4645 197028 -109640 79131 -4098 231420 321827 -121425 21035 -144450 -455772 -13710 112321
4633 92972 -137887 -189653 -301050 51982 -18067 -177133 -59277 160644 77594 -137229 204078
4621 377264 341910 -307960 244896 -272918 -151657 -292268 129595 -50036 -91928 -87485 132403
4609 -7165 334997 50610 110715 -60868 240231 -63429 -56913 100240 229471 217636 -52470
4597 -16034 -46299 209078 348881 -72199 315032 -4292 453170 -211365 392040 71483 -212388
4585 -366978 229137 66021 210972 6029 -160162 -97851 -241434 -270799 211982 180662 15856
4573 316564 22685 -137271 -98482 -128949 237219 -459291 -169941 106380 -160939 152248
4562 -340690 -126279 142903 115184 -100469 -5097 -309624 74771 75261 52220 237095 91020
4550 227691 -47966 -231974 -12986 52988 340657 -9834 83762 -3396 190508 -17233 -199627
4539 -199627 -73518 94503 218227 121024 53662 -78355 49452 39270 -89016 -63970 102858
4527 172736 -155263 -76252 -239685 224572 210858 -88218 235813 -7880 -69674 -36050 72675
4515 -159428 -310873 -7497 -170832 277026 147327 24856 -142510 -33507 -170260 -46098 261238
4503 -79889 106061 248004 208921 108983 -108446 -7553 -226146 -165628 -133608 -31005 138311
4491 35587 -30771 -168285 -402757 61747 -74601 -287963 -154745 107819 -54308 -242839 111766
4479 -104272 -5637 282123 -245509 54258 -182455 -5192 -254936 154253 102752 -103548 -125110
4468 -125110 39646 333859 -36035 -10452 94220 260588 -133939 -185942 215758 -13681 -260257
4457 -260257 66493 205631 -235780 93556 -63839 19262 -73112 -83832 54793 -164230 288084
4445 240746 -336495 364239 119933 237803 19090 102596 64499 51547 159201 7069 -6424
4433 -220317 -99500 44373 -67142 -73092 238451 133231 -130976 508446 176728 -226584 141640
4421 -254976 148288 95537 -436034 178558 71131 319215 43608 -118361 304719 9216 200342
4410 200342 66183 -73949 215259 -107114 120434 257824 -176679 52307 -69033 -368372
$$ [...]
##END NTUPLES=NMR SPECTRUM
##END=
