
##TITLE=AC1302_PERAH12114_6535671_KetVU1Pe3j
##JCAMPDX= 6.0         $$ Bruker NMR JCAMP-DX V2.0
##DATA TYPE= NMR SPECTRUM
##DATA CLASS= NTUPLES
##ORIGIN= BRUKER
##OWNER= Administrator
$$ 1.72 TOPSPIN		Version 2.1
$$ 2012-12-11 19:42:59.186 -0500  Administrator@X
$$ Compression mode = diff/dup
##.OBSERVE FREQUENCY= 400.02188249412
##.OBSERVE NUCLEUS= ^1H
##.ACQUISITION MODE= SIMULTANEOUS (DQD)
##.ACQUISITION SCHEME= undefined
##.AVERAGES= 8
##.DIGITISER RES= 22
##SPECTROMETER/DATA SYSTEM= spect
##.PULSE SEQUENCE= zg30
##.SOLVENT NAME= COFFEE_meoh
##.SHIFT REFERENCE= INTERNAL, COFFEE_meoh, 1, 14.98509
##AUDIT TRAIL= $$ (NUMBER, WHEN, WHO, WHERE, PROCESS, VERSION, WHAT)
$$ ##TITLE= Audit trail, TOPSPIN		Version 2.1
$$ ##JCAMPDX= 5.01
$$ ##ORIGIN= Bruker BioSpin GmbH
$$ ##OWNER= Administrator
$$ $$ E:\/data/COFFEE/nmr/AC1302_PERAH12114_6535671_KetVU1Pe3j/50/pdata/1/auditp.txt
$$ ##AUDIT TRAIL=  $$ (NUMBER, WHEN, WHO, WHERE, PROCESS, VERSION, WHAT)
(   1,<2012-12-11 19:42:50.576 -0500>,<Administrator>,<X>,<go>,<TOPSPIN 2.1>,
      <created by zg
	started at 2012-12-11 19:41:44.404 -0500,
	POWCHK enabled, PULCHK disabled,
       configuration hash MD5:
       86 BA 57 50 F2 9D 5C 9B 26 00 A9 28 5F 66 2E 89
       data hash MD5: 64K
       8B 79 31 47 93 3D EE 09 53 5C 1F CA 51 D0 B9 65>)
(   2,<2012-12-11 19:42:53.764 -0500>,<Administrator>,<X>,<proc1d>,<TOPSPIN 2.1>,
      <Start of raw data processing
       efp LB = 0 FT_mod = 6 PKNL = 1 PHC0 = 0 PHC1 = 0 SI = 32K 
       data hash MD5: 32K
       BB 55 74 D5 F7 D8 41 0B CB 2E 83 37 D8 07 59 C5>)
(   3,<2012-12-11 19:42:54.279 -0500>,<Administrator>,<X>,<proc1d>,<TOPSPIN 2.1>,
      <pk PHC0 = 95.48218 PHC1 = 0 
       data hash MD5: 32K
       D2 EA 4F 91 8B 0B E9 00 B4 B0 16 6E A8 02 8A 39>)
(   4,<2012-12-11 19:42:54.545 -0500>,<Administrator>,<X>,<proc1d>,<TOPSPIN 2.1>,
      <abs ABSG = 1 
       data hash MD5: 32K
       52 5E A6 58 5D E3 74 0A 63 FC 0D F1 C1 0F B4 25>)
(   5,<2012-12-11 19:42:54.701 -0500>,<Administrator>,<X>,<proc1d>,<TOPSPIN 2.1>,
      <abs ABSG = 2 
       data hash MD5: 32K
       B1 B7 14 5E 73 B1 9D E1 23 4F E1 88 5B 23 71 F5>)
(   6,<2012-12-11 19:42:54.873 -0500>,<Administrator>,<X>,<proc1d>,<TOPSPIN 2.1>,
      <abs ABSG = 3 
       data hash MD5: 32K
       BC CB 99 00 B4 EE 3C E4 42 24 1C EA DE A0 1D E2>)
(   7,<2012-12-11 19:42:55.045 -0500>,<Administrator>,<X>,<proc1d>,<TOPSPIN 2.1>,
      <abs ABSG = 4 
       data hash MD5: 32K
       C8 53 4C D6 53 4D 36 57 5F 5D EF 00 A9 F4 D8 99>)
(   8,<2012-12-11 19:42:55.217 -0500>,<Administrator>,<X>,<proc1d>,<TOPSPIN 2.1>,
      <abs ABSG = 5 
       data hash MD5: 32K
       C1 85 72 D1 1A FE 36 C9 90 E0 ED B9 C5 84 2B E3>)
$$ ##END=
$$ 
$$ $$ hash MD5
$$ $$ 5A 27 AA AC B3 03 A7 8A 9B 5A 68 27 8B BC C0 62
##$RELAX= 
##$RELAX= 
##$RELAX= 
##$RELAX= 
##$RELAX= 
##$RELAX= 
##$RELAX= 
##$RELAX= 
$$ Bruker specific parameters
$$ --------------------------
##$DU= <E:\>
##$EXPNO= 50
$$ [...]
##$TP= (0..7)
150 150 150 150 150 150 150 150
##$TP07= 0
##$TPNAME0= <>
##$TPNAME1= <>
##$TPNAME2= <>
##$TPNAME3= <>
##$TPNAME4= <>
##$TPNAME5= <>
##$TPNAME6= <>
##$TPNAME7= <>
##$TPOAL= (0..7)
0.5 0.5 0.5 0.5 0.5 0.5 0.5 0.5
##$TPOFFS= (0..7)
0 0 0 0 0 0 0 0
##$TUNHIN= 0
##$TUNHOUT= 0
##$TUNXOUT= 0
##$USERA1= <user>
##$USERA2= <user>
##$USERA3= <user>
##$USERA4= <user>
##$USERA5= <user>
##$V9= 5
##$VALIST= <valist>
##$VCLIST= <CCCCCCCCCCCCCCC>
##$VD= 0
##$VDLIST= <DDDDDDDDDDDDDDD>
##$VPLIST= <PPPPPPPPPPPPPPP>
##$VTLIST= <TTTTTTTTTTTTTTT>
##$WBST= 2048
##$WBSW= 25
##$XGAIN= (0..3)
0 0 0 0
##$XL= 0
##$YL= 0
##$YMAX_a= 632955
##$YMIN_a= -537838
##$ZGOPTNS= <>
##$ZL1= 120
##$ZL2= 120
##$ZL3= 120
##$ZL4= 120
##$ABSF1= 14.98509
##$ABSF2= -5.573092
##$ABSG= 5
##$ABSL= 3
##$ALPHA= 0
##$AQORDER= 0
##$ASSFAC= 0
##$ASSFACI= 0
##$ASSFACX= 0
##$ASSWID= 0
##$AUNMP= <proc_prof1d_extract_pilot.lims>
##$AXLEFT= 0
##$AXNAME= <>
##$AXNUC= <1H>
##$AXRIGHT= 0
##$AXTYPE= 0
##$AXUNIT= <>
##$AZFE= 0.1
##$AZFW= 0.1
##$BCFW= 0
##$BC_mod= 0
##$BYTORDP= 0
##$COROFFS= 0
##$CY= 15
##$DATMOD= 1
##$DC= 0
##$DFILT= <>
##$DTYPP= 0
##$F1P= 0
##$F2P= 0
##$FCOR= 0.5
##$FTSIZE= 32768
##$FT_mod= 6
##$GAMMA= 0
##$GB= 0
##$INTBC= 1
##$INTSCL= 1
##$ISEN= 128
##$LB= 0
##$LEV0= 0
##$LPBIN= 0
##$MAXI= 10000
##$MC2= 0
##$MEAN= 0
##$ME_mod= 0
##$MI= 0
##$NCOEF= 0
##$NC_proc= -8
##$NLEV= 6
##$NOISF1= 0
##$NOISF2= 0
##$NSP= 0
##$NTH_PI= 0
##$NZP= 0
##$OFFSET= 14.98509
##$PC= 1
##$PHC0= 95.48218
##$PHC1= 0
##$PH_mod= 1
##$PKNL= yes
##$PPARMOD= 0
##$PPDIAG= 0
##$PPIPTYP= 0
##$PPMPNUM= 2147483647
##$PPRESOL= 1
##$PSCAL= 4
##$PSIGN= 0
##$PYNMP= <proc.py>
##$REVERSE= no
##$SF= 400.02
##$SI= 32768
##$SIGF1= 0
##$SIGF2= 0
##$SINO= 400
##$SIOLD= 32768
##$SPECTYP= <>
##$SREGLST= <1H.CDCl3>
##$SSB= 0
##$STSI= 32768
##$STSR= 0
##$SW_p= 8223.68421052631
##$SYMM= 0
##$S_DEV= 0
##$TDeff= 65536
##$TDoff= 0
##$TI= <>
##$TILT= no
##$TM1= 0
##$TM2= 0
##$TOPLEV= 0
##$USERP1= <user>
##$USERP2= <user>
##$USERP3= <user>
##$USERP4= <user>
##$USERP5= <user>
##$WDW= 1
##$XDIM= 32768
##$YMAX_p= 480399253
##$YMIN_p= -703201
##$CURPLOT= <Network HP LaserJet P1505>
##$CURPRIN= <$Network HP LaserJet P1505>
##$DFORMAT= <normdp>
##$LAYOUT= <+/1D_H.xwp>
##$LFORMAT= <normlp>
##$PFORMAT= <normpl>
##$SURQMSG= 1
$$ End of Bruker specific parameters
$$ ---------------------------------
##NTUPLES= NMR SPECTRUM
##VAR_NAME=  FREQUENCY,     SPECTRUM/REAL,   SPECTRUM/IMAG
##SYMBOL=    X,             R,               I
##VAR_TYPE=  INDEPENDENT,   DEPENDENT,       DEPENDENT
##VAR_FORM=  AFFN,          ASDF,            ASDF
##VAR_DIM=   32768,         32768,           32768
##UNITS=     HZ,            ARBITRARY UNITS, ARBITRARY UNITS
##FACTOR=    0.250966925370066, 1,           1
##FIRST=     8223.43324360094, 71503,        21545
##LAST=      0,             -14468,          23489
##MIN=       0,             -703201,         0
##MAX=       8223.43324360094, 480399253,    0
$$ Real data points
##PAGE= N=1
##DATA TABLE= (X++(R..R)), XYDATA
$$ [...]
23827 -228930 36982 49785 -474661 -127850 -27927 -27568 -235337 83936 37477 -169958 27943
23815 -121601 -130335 34891 291976 -66088 201466 -286722 152420 -379318 -19729 255633
23804 10700 47647 23283 326907 120852 -279733 -129298 -206371 19166 6261 170971 55483
23792 -90101 111275 194422 80327 -242515 -77722 298157 322554 74391 -259201 378767 -21068
23780 -143814 -15750 -20112 -144931 77258 -300786 -309701 -3193 187476 -6232 106753 210615
23769 210615 43686 27976 138569 -155653 161599 -239868 137037 2602 473677 -48294
23758 -39967 -5921 264332 -241513 237521 -95689 -8330 -73267 218464 -15197 38785 -191046
23746 -355753 -144629 -114267 333587 -15539 142781 -355596 23656 -26459 96208 -165102
23735 56970 -78862 31574 189719 161050 23985 27469 341790 137156 -64805 257218 100399
23723 115531 -107592 172852 278777 96756 -151744 -22013 -57201 -61628 124119 121481 91200
23712 91200 194766 141458 -294354 -48250 176925 47082 -133750 214014 -50794 178518
23701 -93315 42241 309017 -188279 -157483 229021 -219093 152386 125598 82626 -242769
23690 29936 76025 -56328 433222 12613 -330689 -201025 -70641 -173700 -203718 -74658 -321455
23679 -321455 -363747 298256 41338 237209 -26882 -40196 -15017 -49263 -417781 -133995 -157419
23668 -157419 218532 -103375 -174074 -29527 112397 173202 -10833 -210879 -226990 217843
23657 191608 370624 198977 -361387 105352 133051 -101624 89386 -70012 -2928 -189605
23647 -189605 12348 -133867 -274772 38840 118702 -220589 -118030 -41145 113238 376427
23637 376427 -60033 210101 -197108 -102946 -317649 -158989 151754 -166240 -13419 12963
23626 -92123 7081 -44283 157185 -26548 216494 41431 -498186 232786 -216716 -208783 -184762
23615 -184762 -106673 286628 152785 86277 170906 -46508 -156519 -273333 170695 -139949
23604 -66783 -90157 144021 -24408 219118 -258282 -258944 44368 128188 -114780 -146827 57529
23592 -281068 -105045 -128404 -14778 -30942 304009 -164525 96251 54589 270161 84237 -54470
23580 10434 236454 82233 229789 388995 147720 224433 307971 -415638 -310947 -196995
23570 -196995 56758 -549794 -137788 -109661 -127025 165619 145935 -121286 -61614 21934 -93497
23558 69611 -99843 -78418 -65727 -71588 -138018 -150173 -108393 54667 150762 346075 35483 -41745
23545 37829 43344 -97664 -253982 146400 -11785 -287806 -268571 -54157 -209459 -198651 -357350
23534 -357350 -137026 60299 230615 99269 -6078 -304253 -403045 -39350 85661 -117755 -404392
23523 -404392 -249372 -67125 -318704 -32668 239815 31240 -68736 -526785 -270132 -202527
23513 -202527 217607 -184151 261006 -107240 120258 -135550 103967 -171366 1264 -284537
23502 5330 -401716 -111034 31950 317132 -234023 268384 3507 34590 92588 120917 -270944
23490 85696 -248728 -347770 30609 -566 -32597 -230977 301289 -45277 56767 -324827 100833
23478 363344 -296782 -366183 -126347 -145876 -168969 -58297 -68185 -236980 25959 -351876 72855
23466 -72021 190178 -361656 -25041 13253 71567 159379 -237125 23362 117898 -150899 36586
23454 -98908 446748 -54373 -40024 110145 30926 -101460 58911 -21894 135908 -239809 133033
23442 -245408 -6389 59613 302017 -318196 -127434 152375 -36346 -82478 -74551 -105923 109780
23430 -105714 -188272 81668 -18370 -4661 -41840 2004 -13283 87013 -106742 40985 -50710 30315
23417 55080 -18745 -68925 -59208 395864 -187897 -87109 253799 -230922 104532 81949 -17280
23405 171931 268962 33350 50706 103137 380992 -122443 -19310 209854 -2271 -11323 -245949
23394 -245949 148755 121232 45105 -9830 -43650 -27607 -414230 2454 221377 57284 -139729
23382 -101673 297115 -127323 147842 190664 -260241 203145 -158779 131725 35897 -97028
23371 -497154 231456 -106325 -18767 82833 -248394 -459180 -379938 -222921 144379 269631
23361 269631 -197161 -22175 9959 -2601 -46019 -42570 309086 43713 -250536 365945 -210961
23349 -15080 -25746 143740 -118510 39777 -49803 -235629 77376 533697 -197265 -143866 -240119
23338 -240119 -93826 55310 -93760 183434 -135908 84938 -65944 113870 2011 -308440 -222899
23327 -222899 77190 254317 122191 -433162 55230 190105 -111418 -277541 149595 -278489
23316 130147 -50519 -140601 163726 15866 -311837 -106721 83949 23888 296366 152043
23306 152043 -51409 21789 -433651 89556 -1563 -183452 -56726 167349 -113410 165059 223289
23295 223289 13511 -38084 252751 -13838 298494 -2340 164378 113232 163154 -288798 -87886
23283 -48134 -12805 10654 -313606 -416473 243027 -513751 15363 -162250 -242960 -41613 101776
23271 -60822 381191 -309093 -126919 -40798 405468 -289292 118534 -31882 332322 35811
23260 213760 71429 -64851 -47141 -226980 10655 96412 -69980 189260 -223237 -43383 59874
23248 81440 -232026 112649 74598 -533281 309291 -15981 237807 58461 -5152 -57219 36750
23236 21982 -139189 305996 68048 184832 31169 -207823 -143373 -142983 -345463 -114653 71273
23224 103264 189798 257033 -16947 22680 -143389 -133038 237927 -29435 53679 5354 52810
23213 52810 -70712 45698 -154050 73600 278341 33267 -256283 -48290 -194788 55633 -166738
23201 6348 -194582 21001 147284 214092 127264 120910 2636 154737 81238 -45031 -33174 -220
23188 -262714 -207302 51811 12548 -45006 93446 -47257 101895 -258204 -209797 111867 16334
23176 -16613 -11437 -177996 -51264 149880 113369 232721 -403786 60799 52909 75234 123579
23165 123579 -49364 -26017 9593 -55293 -148406 -187823 -89418 -277002 -381856 206875 -322485
23153 -143526 224592 43846 32139 -90968 141696 -364762 -223918 -252356 -425610 -24733
23142 -68113 -30732 -89592 -1808 -109248 -145739 -132985 -302308 59366 335559 -24255 -29186
23131 -29186 -67828 -170778 -71906 -361422 160978 -137557 -19678 -81035 -374044 60004 177153
23120 177153 -223452 -129275 248333 -12467 -111404 -281095 66710 34244 146309 186064 196461
23109 196461 213026 85971 -329291 -29957 -15166 -232840 -13665 -303265 -112506 -113920 -30324
23097 -193936 -184158 -94343 210513 47485 271318 -204039 341112 -70545 51483 -90464 -43564
23085 19153 56077 16198 -130221 -175884 -173377 20808 -53550 82100 -3016 69157 165221 -250710
23072 -159388 -57618 112466 -225174 -214662 -233683 97900 -68986 -81423 130046 -11138 -19293
23061 -19293 162407 -58648 -56227 -176277 159165 189891 -3033 -37478 47800 -629700 67177
23049 67077 40100 256340 -128132 156147 -66077 422822 -49399 -112160 35064 111260 133866
23038 133866 49363 -61741 -149515 74264 -228380 -51840 -272530 26540 38693 74620 101777
23027 101777 -207568 -71972 -53227 70131 -182099 144032 -489701 -116508 -199305 -296375
23017 -296375 -571853 -23990 -193200 100524 48984 -158243 53526 52832 -146550 227449 159519
23006 159519 -249263 62684 -99510 -119667 133803 -18693 -123423 -77016 -291314 147112
22995 175202 -236640 34509 -123652 -145026 -108851 29930 -54232 -27194 57484 -92043 -226895
22984 -226895 -94638 181000 -344797 -52237 191924 -134581 159050 47350 69683 -220672
22973 164604 -168207 10870 149821 74608 62446 142072 -46909 13210 229238 -160620 33724
22961 -100601 234385 -142595 18882 -240651 -87906 70179 -155167 -287349 -94617 166294
22950 -40728 217582 -167745 -68356 -45529 -118864 169048 463033 -29681 77289 -364090 21565
22938 -73331 -161690 -80251 70978 142026 138568 -211165 -22890 58240 178488 -109704 86809
22926 -58941 10286 40928 -129677 46881 102820 248825 -283214 233952 -70423 -130234 -81149
22915 -81149 45960 96357 166806 160948 328022 -132083 -17331 -7194 -19279 181504 -297134
22903 -443210 14138 108248 -291770 -217923 -65917 95062 -228442 -240476 168911 75200 -223398
22891 -202652 -50682 81424 141692 126561 -40360 9783 -24641 -194066 -239279 231802 18770
22879 -12087 -85796 67256 -28086 2465 41506 -100959 185983 35961 -244184 339467 -185471
22867 337590 -211728 -176125 -103869 -272053 135467 -176170 -219151 -167084 35393 8585 -14946
22855 386559 192597 -227007 34051 21365 218231 60913 -367894 245246 182695 -232510
22844 18108 -93118 68244 60410 187748 -56107 -224954 2319 209942 181919 287812 291471
22833 291471 -138221 -117373 43618 146550 -52349 -262773 -56870 558561 -430938 -276708
22823 -276708 147998 25128 185484 -112541 -190165 -301632 38218 -124049 -25947 191688
22812 -158021 105739 -206663 -123097 298028 -132735 -59873 -242635 -57326 -291493 998 -543152
22800 -303706 -64671 80874 60794 221302 -167541 -343853 -91714 -13335 54673 105171 -19687
22788 188606 -279553 -58994 -28491 -144314 -359494 123393 226957 -211688 14919 67216
22778 67216 77309 -75726 15563 -161818 296183 218179 -58027 -263197 -70163 -85137 118975
22766 192076 -116820 -190058 178839 8184 -278514 642270 50569 21651 195254 -80949 -21522
22754 -355528 41243 28398 -244504 26736 153289 -70144 -497910 306275 -240918 124792
22743 152081 -368955 67562 313746 -512926 -27680 325491 -74205 -160583 -132368 30783 215771
22732 215771 -250803 190209 -127496 192814 80815 -348646 -87466 -240938 -238391 10382
22721 -211695 -368646 -14898 -110779 -20694 335208 270884 -71434 35284 180975 70187 -340573
22709 -98700 128120 -275879 -109374 -154632 246238 -36597 -33699 -26857 -124020 -125303 -62132
22697 -35120 -175357 -258044 -102607 226348 -152159 -187308 180061 165267 -310732 -17835
22686 63846 252949 -218802 -33786 406516 183060 275590 16964 427161 210348 -44423
22675 129609 -173916 -64354 -22387 281432 72113 -122708 4580 -267796 246660 -26732 35381
22663 175325 -327651 196661 -47456 -86222 325298 -422046 -212312 94822 -440154 -80524
22652 -134312 20886 -23561 -109775 69490 331192 159516 -90235 -381430 131293 -101312
22641 54886 18316 -90804 -93247 -31222 52530 -47050 -213024 -57255 -75114 -233552 -35083
22629 -324507 -49037 -76368 -191289 -9718 -368669 186258 142997 21632 53610 170343 186122
22618 186122 -84425 212459 -228580 -212813 231697 -19250 37647 -41050 -36999 -364528 -369142
22607 -369142 46812 -49917 -34794 133224 -45426 12774 -51885 200156 -422191 -129461 -43342
22595 -138392 27092 -45647 -275033 -30020 75578 29191 -299829 94319 -76991 -134644 275094
22583 -231910 17429 -321965 67348 -87843 221495 64264 127044 -109050 89486 30655 -51890
22571 -192613 -66837 78605 -273048 6099 -93163 -16187 218411 89815 -412834 -189341 26223
22559 228022 -274156 250484 -84487 -134975 -147014 183752 42812 34000 -215548 -187508 -353283
22548 -353283 -119268 -56096 -55673 53250 -81969 -143944 65383 -287345 -216510 -110597 -41396
22536 154576 99699 -153274 -258565 -105941 3279 -246093 -42065 -354564 -131432 182688
22525 329426 342417 40621 -168423 -514338 -149708 -21148 50549 -131873 247609 -182943
22514 241925 49394 -143152 -206212 -146680 111097 50843 92480 -138704 -71782 -80931 -25468
22502 -84085 -219644 -157863 -175000 5707 -59266 -209956 96782 -207137 -368515 174515 -391187
22490 161000 291511 -80269 -255019 253101 -177780 -11761 -153802 199645 388764 133291
22479 -174202 -169401 145235 106182 26060 126784 104646 92521 -144222 -283363 -26012 130428
22467 183160 -145931 -524060 -160519 146555 117599 -492638 36806 -33996 -95306 -232774
22457 -232774 -118179 -310301 347199 -49986 257826 -4408 93425 117721 -195048 -54673 -298720
22446 -298720 -512202 -47442 -168013 -2805 -200372 -160613 398411 268250 -108197 195655
22435 -63876 210082 245501 59798 94316 377168 -16271 -337846 -290790 -262837 286166 235409
22424 235409 -219994 233695 148986 -109226 186056 24944 131491 -38339 184920 -64255
22413 127324 -208751 -133940 -137083 -134070 -133260 283737 134739 201349 -150867 57013 158777
22402 158777 -277788 29878 112959 104489 -69121 95961 -71864 312513 -80406 -45297 -29971
22391 -29971 70729 141512 -264444 110433 77598 -190788 -138330 -30978 -604920 -259821 -136966
22380 -136966 -27432 27096 241292 -376499 -323028 116733 242056 -173885 -2454 244592
22369 -326193 -48899 -128358 -330043 -48938 -67589 -126954 -189575 7224 -9531 -142083 -43191
22357 -93851 6442 -236146 -182721 -40290 161327 -162491 -21728 147493 -204468 -147345 -289461
22346 -289461 330368 -135084 2856 160339 -210425 -181761 22346 -21375 24390 -130394 -109011
22335 -109011 83993 -210028 46518 -345831 -219037 -5016 -67150 -197069 -50254 -90610 -114219
22324 -114219 59000 -272359 -68907 214655 44776 117372 -14801 -325953 21325 13318 230201
22313 230201 -309257 -214287 54871 -195009 -3679 -106980 -157642 26159 -270144 -36447 -339175
22302 -339175 53893 4046 -196311 46411 -60032 243644 164791 132993 -170781 -31533 -37556
22291 -37556 -125606 -402343 174634 218416 83031 -324667 -319206 -153764 203268 -156424 -140991
22280 -140991 51655 -254043 -82005 89874 -239917 211721 25296 137547 230311 -165809
22269 124979 92755 -82611 -164616 76976 50915 171107 -79297 -212993 122206 -186574 -148344
22258 -148344 -65836 -64470 -163364 -134558 -46742 -202704 130852 665 86607 59849 -460328
22246 161068 91297 8060 -204875 -70249 -278375 -68858 14795 -321201 -5620 89557 166677
22235 166677 -247267 -30570 130048 -253019 81820 -41200 -98034 -176870 -149391 -4669 197341
22223 142828 -92888 162017 235344 225183 -101686 -83371 -212410 -246610 -408083 19468 15220
22212 15220 260201 -246452 -326671 -56536 -272484 48084 -289442 -229943 -19743 205535 -30293
22200 -336578 -108547 41473 -27907 78503 93926 -92929 -76446 -143644 162229 -303969 31201
22188 80346 19116 -119324 173733 -68772 134874 -346416 -298585 -113730 167551 205566
22178 205566 -12266 -45331 275232 -408139 -158271 174821 437 90713 -34204 -63546 -31817
22167 -31817 135258 355396 27147 -114432 -334276 23430 192160 -103716 180681 154725
22157 154725 -65881 -118738 -57645 -109614 -132595 -144663 198896 71645 -43913 -35403 -105229
22146 -105229 -72318 -19181 -221599 -204513 -343472 230143 -152971 -61837 -122107 -195388 167354
22134 78139 -195187 -84957 -133162 -66774 120963 -221724 88286 -165070 -50865 105625 -101169
22122 -202065 -230890 101515 138958 -246 99130 -32202 -66200 115555 -210958 294193 97302
22110 -293167 -18316 -315633 -69918 -156855 212371 26311 -392469 -402084 -312241 6225 123778
22099 123778 163501 136560 -203971 196388 -90755 -158517 -344324 -235300 -162832 -83938 -160348
22088 -160348 14172 -80750 194322 116097 1807 141690 62803 -260868 -190175 -116456 -52339
22076 -41851 -270155 -177259 42575 -130131 -32126 160108 -259836 135721 241221 -123253
22065 -210784 -71435 -360672 121696 -52897 -109635 111542 254285 -267917 -341226 -292323
22055 -292323 116278 19639 -181068 157476 22018 257902 122576 107904 64671 -282141
22044 1629 -195612 -102102 62258 10577 231932 441574 -75947 -52876 -120680 -20844 169481
22032 -77639 -257822 -155594 67660 27517 51839 -64781 367683 89590 126029 -122567 -236733
22021 -236733 36487 261 243065 184539 -49528 -211959 -75029 -343511 231217 -78150 -1431
22009 229698 245419 45440 -176162 -73020 -38408 -55376 139061 235728 33774 20920 -122016
21997 -303222 -11152 -85622 44746 30717 74120 -22650 207743 -5220 84811 -7499 92857 -64631
21984 288096 -111362 181548 14465 1702 -70066 -221140 -154363 -78289 -297520 379 -98752
21972 -552405 -132295 -168477 2787 -362772 99702 39115 -70553 114986 134150 -39993 -210744
21961 -210744 -276928 7722 -97032 -138870 66370 18197 -158725 -47011 246728 2408 -19656
21949 -17202 51946 -83353 30350 -29387 -58987 123415 -232374 173112 -282215 -266592 -104180
21937 74652 337800 -173508 -95325 -134882 -44887 69792 -27251 37338 82785 859 197402
21926 197402 -209523 -102910 87852 -184942 40437 244971 -299241 -116829 -124873 -51065
21915 66308 -109124 -95111 196008 -316103 -408086 15595 -214838 -48421 173563 -37903 -136715
21904 -136715 106169 -32037 26228 -72022 102324 -106074 -26152 178669 165748 -89059 160869
21892 -29637 -43359 34396 259257 -91150 188702 -34849 -8228 -77170 352103 -158753 -304921
21881 -304921 106675 -274255 188681 377924 81239 -44476 -65720 -68655 -20918 -279339 184272
21869 -214090 -50533 -161287 -76884 -333943 -225242 337795 78293 132134 -9523 -34496 -3880
21857 19552 -308662 177007 -157659 -152997 -317095 -50813 -82646 -203429 25379 -74049 29911
21845 -117819 -203857 58885 -22471 -8237 151561 -81972 -294010 -289499 107904 112963 188305
21834 188305 274483 -48136 -76864 23253 270634 -292449 4874 243874 -253470 254651 173418
21823 173418 -218995 -255975 29067 -173265 -175571 208650 262654 148895 100772 -54666 -240104
21812 -240104 -171482 -330700 -69259 -118021 -106368 55371 -413591 -375822 -207732 85052 597114
21801 597114 -209836 242980 186947 -152253 42032 60625 13431 33482 125017 -18089 55641
21789 146593 28259 -88421 -112744 -105727 148881 -424468 35001 285790 -43792 -44720 -225645
21778 -225645 83036 -401658 307947 407711 87185 301769 -193086 68143 -163111 353864
21767 45341 -183630 117548 64143 -370527 -76007 -136225 -351893 -103474 -102586 357139 9571
21755 78268 -166396 68397 -268075 -52498 81213 80872 -154293 -197942 -119879 -446055 -171450
21743 -106221 -2448 -18381 258383 -63950 110666 -66783 -44732 -282974 -112189 -170674 -42443
21731 -415251 -50772 -251943 159133 -162190 -141935 -84583 -30135 264860 -165287 -78254
21720 85883 207469 58919 -120802 -85743 177700 289440 -127661 248462 -13940 -159329
21710 -159329 -19495 141928 35169 26713 21560 -196623 -73143 -47161 -264442 -63941 180552
21698 -336941 -238210 65896 -185864 -89577 -303065 205852 -158383 83972 168921 -38497 -108981
21687 -108981 -431894 -165662 283064 191900 -99752 -194552 -198994 -258801 331509 78142 -114234
21675 -89766 -113802 47785 -35816 -473381 98849 153298 -226859 234058 -7095 -165494 17922
21663 55207 -62323 -410443 -107188 270706 -308403 -277998 -347588 -243274 158936 28247
21652 -283809 346456 -232380 81154 -309309 79812 -81439 57948 138938 131909 266762 -61717
21640 3257 -304557 -139338 -106441 235756 -200736 -163560 -177849 -65041 -35219 -185611 69678
21628 -126276 -252738 80633 127821 -346768 -94153 33304 -245100 99180 -292468 -80443 164437
21616 252906 175256 -135285 67981 -190777 -178763 -71309 -264850 312625 52311 -20991 69731
21604 153491 54258 -365771 -231149 -171934 -283025 -361053 98184 -18275 234906 405259
21594 405259 -37008 -255396 -300103 20067 -22515 153392 124775 -71562 -76407 23763 8267
21582 -131429 -179493 -279390 -72999 -37028 261622 236753 252657 -34329 86312 -40548 440104
21570 15179 -337222 -49796 24572 337488 257282 149478 -215692 296145 124455 -109446
21559 -192605 -140796 -260366 98169 -81985 151211 70970 -44947 -55400 115189 -17773 -23382
21548 -23382 -73828 -296207 201820 -90396 85733 -137967 -152190 -160864 304670 -248896 117940
21536 81558 -91827 128719 -577029 134718 60217 -259858 -294161 -97062 -70377 -303943 124496
21524 -88647 50203 238509 -114701 440041 -199059 -109232 -102938 -217888 55774 -34520 -98532
21513 -98532 -105976 -189195 -54516 76010 95914 -191191 -330816 -95085 279745 95748 -94494
21501 -73130 -184766 -334354 -207217 -26222 245164 -69874 178265 -78630 -88517 2782 -73740
21489 -81913 -279523 478336 95211 -48197 30006 -198382 2542 -56948 64195 -50242 -120851
21478 -120851 -175597 -102925 78238 -6612 -162443 -605967 -204697 -80163 -208811 81820 -132930
21466 -283125 -272276 -191140 -127663 -215984 -409536 17293 -95542 51205 337843 -52964 -88153
21455 -88153 126484 160287 -11729 -218307 12365 -138469 13766 -212195 -118695 -212175 -134857
21444 -134857 520589 25992 -96493 145392 17876 185000 192218 -68910 -58891 316545 -91771
21432 -40227 183556 -197496 -25515 -94845 297910 -337211 -44689 1994 -151819 -326948 240244
21420 230514 -95362 63293 -241636 -25069 19644 -541590 175862 -67205 -126971 19647 -61609
21408 94862 31449 276145 -62504 131987 -185845 94423 80645 -151567 -263698 425917
21397 -28630 -135711 -52013 -276143 96405 -119064 -137128 -210769 -19773 -54454 7193 -11903
21385 41616 -204903 -251050 123611 -194801 25926 177734 -51933 169271 8916 -201410 6469
21373 109830 -249421 -351920 68763 -114083 244822 53758 -393580 -209142 189231 -98200
21362 -92145 -350682 154405 141782 -35977 101853 -181979 176186 -91039 -35476 -188864
21352 -188864 79397 -80438 -7101 -199630 44331 -80262 126832 -350640 161043 -21929 9697
21340 136112 -44122 380598 79912 -119478 182055 -169828 19823 105043 20109 84357 -5942
21328 -171335 -51138 -329574 -98843 -275024 -91426 159395 -193976 65556 19803 169402
21318 169402 -24581 335590 -136488 51319 72089 -119390 107534 -50484 -107230 -152296 30886
21306 -333934 147350 -133528 256051 1 92734 -187153 -39894 -47161 77663 -26844 122606
21294 -114172 -47945 -127359 -173292 -105511 -170241 -91213 -183131 1743 365992 -265800 -65110
21282 -204323 104229 -67348 -59058 -89767 -90341 -153334 106528 -143510 -412879 -60357 238590
21270 -282068 -288457 -192322 -16805 -434846 -60166 16030 108128 24242 -109460 225870 92099
21258 -119222 -230364 -29747 -303035 32569 -106665 -50428 -273683 -159939 -7397 -29583 -234147
21247 -234147 -147909 -30473 -191252 157427 -241401 15798 -68053 -81124 89493 -84907 -244607
21236 -244607 26963 40803 43187 -89565 -261067 20155 14118 190694 467935 263334 -16814
21224 -94158 97274 -275033 -112690 -349524 147140 34518 38941 2716 -296269 68302 -191627
21212 -163934 -5978 -19698 -68959 -10501 -152571 -191345 20641 8168 -122521 -161852 223577
21200 -127535 90340 -162154 60500 -68000 -39086 -263085 -108252 24650 38142 -324048 -109299
21188 -35859 215453 -142474 -52078 -106499 101514 -51515 -179723 433225 -113408 -244032
21178 -244032 72963 305400 -239158 -359590 227989 121568 57529 187858 -140602 81407
21167 112263 -225498 -373234 -57253 -156535 -101654 276345 -282744 -242549 -215992 80744 -38612
21155 142593 -95759 -59125 -64267 -199272 -27433 26090 -244508 214312 -126768 -120911 170238
21143 -119333 -98590 -48948 -192415 41115 34842 -239448 235201 -77735 -208042 116228 252111
21132 252111 -199536 14101 -88106 79082 34345 40695 57849 -30269 64740 187399 50085
21120 -43318 -127480 -379254 -64975 -342990 3033 -62871 159273 90302 -8328 -64828 -125011
21109 -125011 -541574 -192301 -64744 -15825 200203 -205536 -292017 -57822 -108626 -156590 272000
21097 -95327 -37725 -247288 -43664 -34358 132448 28775 -275062 -28864 -210822 395730 2780
21085 146883 -251497 -102344 23910 -289358 -223510 -1026 278254 183226 -221075 -273223 389739
21073 -38934 318976 -89046 71939 -221255 25581 41073 147390 -246911 43761 -166326 -95500
21062 -95500 -64923 -8326 -294673 114753 64352 -95933 -91441 104580 -50978 388635 113002
21050 -166623 15868 -91401 -239355 -76881 -61657 134016 -115991 132327 -164283 -330444
21040 -330444 -62916 -19421 330525 -214904 -219683 -206959 -61584 -351128 -162870 -67141 130563
21028 -291695 27726 -277965 11808 38125 239195 -170328 54619 -158699 92575 103 -481090
21016 -518658 8314 184904 -74919 191782 -91502 301623 230370 -142580 -56752 51158 -158524
21004 207207 -344624 -243954 292320 -101955 -47613 -322671 33236 71560 -320640 -127073
20993 -75316 13853 36097 126579 224670 -358567 -29841 -92482 69011 -455876 -302353 -48115
20981 -7933 -122066 2626 91653 219703 77098 -63291 160745 -70693 -259185 98223 -433877
20969 -92857 -212963 320169 -99252 155636 45003 -423996 326435 222640 -251620 -56887
20958 -193763 -105488 -10144 -208564 -246667 26470 -189403 -132023 73708 -139201 -246411 -83047
20946 -9696 40380 33527 -130196 -55513 -115034 22348 -179583 -120869 272202 292957 -328390
20934 15277 -232677 43278 11351 63335 -50526 -124477 -114519 -113601 17724 -152227 177402 -30350
20921 -135261 -51326 -90787 -236787 199570 305050 -119302 64003 -116247 -592 -54058 -163806
20910 -163806 281223 -331626 -326136 567 35956 323269 -330538 -188406 -224868 2714 -59154
20898 -357406 -51257 38875 -106919 -88071 -365277 38057 115576 -67272 329430 124654 135338
20887 135338 -107543 -291146 124408 35263 -272604 -101690 -489568 -32248 -46325 109979
20876 2024 85163 65429 11621 -394929 -26489 -87472 -80684 326798 -149942 -358150 -129669
20864 -13130 -79979 192787 109350 22239 113126 27027 66436 160160 -9891 29587 -83214 2812
20851 -110285 355392 -183739 -311022 -373003 -147198 -46900 92231 42174 270384 -56601
20840 -190620 482269 -97969 45386 -10346 -201716 -58445 26416 116950 -7299 -197955 -329145
20829 -329145 -247326 -118538 -74164 -477419 -231272 81001 224675 -216343 170488 -136545
20818 -259059 -152620 -69938 82297 119384 -1374 -199779 -117159 -1741 172738 44087 140460
20807 140460 -448105 60788 -163490 -163142 -91087 -174130 -240318 -28754 -18118 -499392 -449499
20796 -449499 48491 8840 -21147 -56927 -78309 42556 -147818 90276 -13548 87838 16839
20784 -149485 238917 91701 -93149 126276 128267 100093 -46966 138185 126248 292356 149341
20773 149341 14973 -70940 179732 -153308 156488 -3543 96248 299378 121677 -162649
20762 -193381 -522422 159766 -295172 -231506 62948 160787 -81143 -91910 -291501 269600
20751 -313551 -475466 -268831 140640 -33907 -388029 -1428 -334924 -346511 -121938 -38415
20740 -402474 -114562 92661 20333 -56392 -162689 220996 -40569 -197285 236378 -197951
20729 -70413 -50883 -256718 53281 209435 -235316 297679 58948 1206 -110581 -101897 -36480
20717 -103677 95794 -547492 15801 -37365 -89519 342742 128312 -108830 -369725 28707
20706 -298164 16089 -188359 -254468 -107966 -389004 -137693 -174612 66144 135254 -77103 -289509
20695 -289509 -89387 -165464 143000 145385 80293 -46116 -115370 -127179 -187235 189143 -22576
20683 -334955 -89881 269478 -206850 239052 124723 10198 -442574 -1052 -468165 -87550
20672 4847 -470780 56339 -69535 -19308 7748 -128594 -149947 -28830 231526 75330 150180
20661 150180 33569 20217 133626 -35071 -277096 99608 246520 221012 85313 169331 -85158
20649 102241 -196433 93664 -283454 360209 74749 -210271 66764 -7271 -139639 106370
20638 125437 90469 -155907 65866 -46040 -39362 89417 161622 39460 47194 -108072 -79011
20627 -79011 -331888 588936 -265057 7335 -19503 -219354 83881 -16749 38959 50619 -46173
20615 -56309 -364636 -236261 270797 -241977 -423492 313881 98918 -327062 -39 -106828 51151
20603 -44577 65987 25492 -113581 321388 316216 -276345 -179884 235411 -384808 109302 -118268
20591 12684 175337 -163365 67132 -109166 -162180 199876 -100985 -85102 65973 -400365
20580 -403027 -38688 -186850 -42985 -263925 43258 -80384 -324706 -128787 130872 -351831
20569 99 -246023 15988 -26967 -58651 -225693 -542243 -85123 -190583 -50598 36187 -274489
20557 -286155 -304533 -176452 -84764 -77677 179818 -20789 -74928 193250 -474882 -57474 63352
20545 -153785 -13442 166039 18977 17649 -180350 -55625 35196 55482 -12610 -142665 224800
20533 -163781 -141017 -157839 -77994 -251046 -54346 -225376 -13871 -99538 286490 95406 411994
20522 411994 -170010 -196882 -24706 302846 -171979 -196399 -323088 288899 -13591 -393271
20512 -393271 -85663 307549 -237796 29946 -107146 -288653 -8113 -226819 -459871 -103974
20501 125119 -192249 -169233 -171732 -224365 14376 63786 -49264 27336 63461 137955 -64943
20489 -152153 53693 -97261 26063 -215384 39186 -107192 147565 41553 -40360 -114631 13946
20477 122030 141342 -59810 -95521 -121609 -82177 108204 55319 49928 16384 -76330 -34770
20465 69584 67620 193822 316655 -59276 47323 -25885 -82088 305424 -75759 -165216 -65597
20453 -226271 171289 177434 142457 -552797 -368201 -56165 114237 227645 -87540 61570 115658
20442 115658 -240453 133990 -275139 -221060 -575648 -79088 -35492 -300965 -116170 -397038
20432 -397038 -47877 69061 -1331 -380332 82035 241454 -21948 -173073 263946 -27590 -107883
20421 -107883 127046 -181167 -110749 -96899 -258501 -76590 16828 138837 34502 -138447
20410 -197369 -119439 -69599 -32862 -101946 223750 -169701 193503 -120115 -321126 -62364
20399 -11449 -73641 -89108 109653 -55568 -160467 104788 57776 -309310 114029 -235503
20388 -144263 96138 -39595 -197630 -408823 -115567 44924 19269 69743 -177854 32953 -51210
20376 -144905 42450 -802 -137085 78391 -86094 111576 -498603 155390 12702 -326447 163837
20364 119726 197657 238585 -70013 -261549 53002 -44089 -94858 -315205 35013 -31489 54242
20352 326296 -78376 6492 -6961 175068 -72815 -26127 -63810 36083 -173869 50383 -134265
20340 -30225 93658 -93942 -71583 120725 121063 -29495 17761 271597 -277965 190172 -148634
20328 -63155 23151 -166076 -70078 -322425 21984 135422 -165300 -240968 -34563 -18218 132958
20316 -327538 179421 84357 -105882 -96328 200874 -45782 152659 -515090 -32604 -291041
20306 -291041 -195761 80772 118314 -73727 146800 175919 -287343 70387 -84961 10821 17933
20295 17933 -33046 86370 -131577 -261753 -124129 150837 249716 -375520 -324453 5125 -97829
20283 -24475 123174 -256140 -302000 225951 -145715 300373 -168099 -94130 -119694 -41279
20272 -57787 -45923 264448 -65497 -322418 -74491 -105365 -376468 -26586 -226529 14855 13925
20261 13925 207 -323861 126347 -114971 9452 -37715 -107084 -83499 -377374 -534346 27549
20249 193433 72965 -187019 -87807 -291386 15054 -27882 202698 -182691 -229391 -373671
20239 -373671 -290337 -184170 -108559 -163139 -179213 -96678 -8096 72155 246410 -59921 198697
20227 -207680 -12056 -71793 282590 1943 -302958 -235188 -102782 -102830 117882 -41956 5149 224640
20215 224640 -134085 -177326 96917 -36613 -252063 -393307 56689 133275 -149206 3458 -291566
20203 -121216 -282757 -134930 -77173 -103923 174842 -49531 -48590 368691 -27311 -54392 239641
20191 11036 -101417 50814 25272 215078 -222974 -131579 -140914 181124 -205644 90177 -235175
20179 -52576 -84679 156094 -95659 -23694 103535 -2445 -40833 35483 -140631 169967 386383
20168 386383 83740 198506 -100181 -171074 374163 -144188 65611 354598 -276967 -146794
20158 -146794 283927 29396 -80079 119133 -96240 -38589 8789 -321934 -5859 -123799 65113
20146 23902 78797 -194399 44297 220908 -377905 -87044 -351155 -193296 -80102 -95317 310086
20134 9815 -289899 -189363 -11348 -46745 -23979 -96986 2694 -215919 384411 -42706 -297595
20123 -297595 216928 32923 -295507 264958 -327764 -126456 42205 254625 -3183 -164596
20113 -164596 113243 -85556 134992 86592 -171957 98715 -350200 -303759 38208 -215024
20102 255869 -10745 -73742 63572 -98780 -276158 -88663 114640 25400 -249334 10316 -161367
20090 -129722 -288939 -282738 -18147 -114587 -135163 205332 -9950 -145936 -201686 -205799 38233
20078 -174700 -281035 -25102 -351358 60513 62362 173824 239921 301204 -130512 -279788 -140762
20067 -140762 -90025 206583 67142 11188 -54834 -323383 135163 -92384 98875 124421 293313
20056 293313 64048 -412994 -210715 60437 79043 -63137 81878 135685 -72044 51015 97536
20045 97536 129297 58943 200154 107586 155676 -34247 -203500 158749 24180 -103813 63762
20033 -31061 228111 -175381 281831 217133 244668 -67382 -38237 -80530 18916 -399054 28780
20021 -410622 -50898 -53678 -127949 -58974 45414 279789 -184236 -29984 -158085 -136537 179064
20009 60083 -271771 328202 15895 -70977 -39883 210348 83338 125623 73083 -268691 -86312
19997 -225737 -26815 -51172 -214735 -46841 35349 -161771 -51001 30433 -97977 -136631 26894
19985 -214926 -146979 -309087 86500 -254478 -54860 222774 48234 -50392 -108073 223905 -59196
19973 -150594 -237442 -46223 -26744 17270 28114 -386832 367666 228515 -170231 116861
19962 214584 -46156 70374 -285834 -21475 -70380 -167836 -248488 357633 306752 363676 55491
19950 205477 183417 2356 -61121 -274674 -265692 95119 -165334 -35791 -245338 -131036 212357
19938 84307 -85151 -283752 -65117 177116 -211145 107354 -80484 -99093 156325 -451196
19927 -6011 -344723 -217576 -90821 -11465 -391142 69822 -261846 444762 42282 109631 4426
19915 -463171 -21551 15706 -116429 21537 239238 -21009 -238477 -20976 -288512 -35251 -68668
19904 -68668 -68857 -69221 -132148 -74138 -157934 334556 -20949 -270276 -331366 -196580 124848 -53291
19891 -342186 -361892 63496 -23571 239510 205250 84997 -83120 70218 -222254 -85347 -57948
19880 -57948 -38551 -123705 -239891 198879 -301676 22506 -225158 -189020 167377 -323036
19869 -125896 205356 -105048 -128590 137339 -89818 66809 -140254 111372 -31049 14091
19858 163679 -174958 -200842 -96084 -27181 -96685 -91610 85719 -342185 -437537 -125195 48469
19846 -66871 -207622 -216129 117930 37675 -82384 331622 156132 45325 -398753 -141710 -319824
19835 -319824 -80531 -66366 -103131 -264810 91120 152417 -239881 -24803 -168093 119556 -319339
19823 24470 -229668 -102691 -127799 -127913 -287005 3485 -239950 -86050 -91998 29968 -255777
19811 -146169 -112036 6682 -100216 323344 -174767 -155265 -280500 -570109 214650 -140084
19800 -107985 -107782 -48755 13447 47688 173816 -8271 -250998 -11929 -286583 -370277 78026
19788 -388770 139416 -6257 -6202 4407 108240 -143360 147518 246071 -144659 14760 -322943
19776 -82739 28771 220087 202076 -208990 -204218 112213 32011 -195098 -124933 -351111 -224438
19765 -224438 104576 308791 15299 186201 -328822 -26133 -184173 273803 91915 33105
19754 -75916 -234624 -262996 -320471 -68770 882 -377424 -358997 -271194 -109029 -64191 -42111
19743 -42111 -162939 -398275 -222339 -72436 163531 133933 103326 -148301 179576 -206031
19732 -259311 62156 100333 -58646 6344 -10171 85092 -590 -68169 -241865 296802 394929 12717
19719 164023 -96186 51133 -293964 -100547 105485 -288132 457592 -94653 58236 -181012
19708 -107318 6554 -107946 63179 -200258 -53337 -126486 175107 -64527 213751 -124055 -35416
19696 60768 -131147 -177267 -41692 97638 -284161 -216972 -180420 709 -256334 19628 -367242
19684 -106243 178201 -381415 94709 -121169 107981 5522 -86163 -202136 4526 113218 -13991
19672 11229 -103535 -139928 -100646 -143821 -439359 240519 -142857 -88122 -126589 -162276 -312546
19661 -312546 111610 -80601 23419 102343 -807 -66755 -109241 11767 91649 346529 160333
19649 -350753 -157502 160311 -36259 -164643 -305527 -194339 -97639 -79174 -181975 172493
19638 -178043 -82535 -203911 321078 187050 -270997 78189 -152497 -21694 -187780 -39578
19627 -211746 1931 -220971 10865 -127173 -74384 -115116 -168608 252188 12722 -74534 217200
19615 47663 -59147 411317 -329971 -153494 -80719 95773 89177 123646 -49405 -214602 124282
19603 239540 -184235 -182081 59485 -185554 -70492 -316152 -107608 80160 -165856 136732
19592 -122643 136764 18117 -179539 232901 17545 241519 -83049 -492371 -47790 64056
19581 194388 -96713 -234391 57337 63105 314 149460 113627 -27618 114227 -204873 83177
19569 -100655 140642 228281 -138045 -138823 208875 -251587 45001 36315 -613903 -142410 157262
19557 29241 88797 -97913 -271683 -77765 -242683 -46858 62142 5762 84822 -359576 -138845
19545 -133408 -38309 156035 -162722 102117 -18568 -80389 -248364 -45447 -72313 -15812 283928
19533 72710 14938 -808 3124 -287678 -130283 186994 -264684 -69864 515 -232564 77344 167288
19521 167288 -60728 -211086 -264079 62947 -59217 43786 16182 -259318 174491 -129710 102437
19509 -262236 -197607 -73553 20366 -291993 66609 -1555 -149272 -127578 118901 -31492 65726
19497 6309 -88848 382640 75990 -22869 62610 -318992 90658 22690 -363180 -149810 76347
19485 -246917 -124827 -146301 -274005 -175426 178323 -295929 125071 112290 68378 -5619 -99405
19474 -99405 -224561 -138875 137595 82124 -256124 219513 -520727 -135161 -232873 29009
19463 -25137 35176 -330083 202245 66497 62427 -136737 -245333 -317496 -100947 -6460 28951
19451 23411 -252357 -82205 -165909 -129600 186479 -163001 -28574 -95728 145695 -306210 80774
19439 -220396 -180070 48836 -18536 -256761 160867 -59686 -167745 194953 141552 171227 -22247
19427 -339004 -145403 250617 -33807 137470 160775 -106508 -97968 153108 -255832 -38360
19416 -49505 102858 -147438 -81849 -175929 -3581 11290 -117357 -26183 232503 -73680 -237135
19405 -237135 461421 -124088 -394626 -3604 -462457 -43223 -311208 161086 185335 -125146
19394 -301183 -174010 1150 -115901 -217925 -13883 -4937 51535 -98662 -250159 251143 -269807
19382 -2574 -383130 -332579 -169865 -270587 177156 -351784 -73270 -150699 -148993 -4029 260996
19370 122644 -20219 -91147 -103425 -92510 31969 -247384 41438 148986 119866 217855 195754
19359 195754 -24142 -127772 -189761 -85537 -103284 90813 -176661 168679 -381854 -305169 -59796
19347 -40927 -37974 80018 -240545 202365 -354291 205723 -276503 163488 124909 -25978 -57195
19336 -57195 249313 221224 99304 75627 155580 -126413 14782 -394280 -245687 -189328 23737
19324 -90155 100924 -147867 27063 48130 -20715 -48490 137945 425482 -180799 -231194 -139056
19313 -139056 -252849 -280922 -48789 11404 -103163 -270133 -182659 -207160 -13127 375729 45235
19301 -325481 -382614 204904 -29953 -228216 98038 -297879 -120840 -154221 -326870 32148
19290 51941 -286622 -294445 -49761 -131369 321592 142927 -197626 179379 -170179 15364 -113821
19278 -181498 -511726 -109714 -4762 -70235 -56635 346372 -27751 215930 -363650 -55584 -102236
19267 -102236 8387 -78850 -85191 108719 7696 -460389 -127707 13528 -261633 205058 -6447
19255 106644 -131619 -167549 65559 -81943 -37130 -15357 -311921 -227964 -58936 -187511 6341
19243 -165410 -211522 151692 -42302 72943 -44446 31398 177964 12976 94314 138500 -329548
19231 -78078 -246971 -204226 -129808 316727 -109558 -48295 50171 -164411 -371787 -184070
19220 24343 -140499 27450 177923 -91085 -126536 -72079 298343 -18328 -50319 54204 -117814
19208 163839 229907 160485 -298355 152822 -478473 -138407 112700 -113319 -280333 361456
19197 -350291 -174377 -297223 67433 -288903 -70471 -120388 85748 -209289 -371916 150968
19186 -256983 -39153 -196157 -161208 -146089 -52785 -310455 -173518 99 35634 104881 -5829 327981
19173 -57186 -266467 -4083 -161572 -81028 35123 -3205 -62736 95157 -18385 -504992 -167427
19161 154915 225194 -113575 -205468 -444148 -226643 -80879 -128186 45922 237277 213568 -131921
19149 -188576 -178400 -139484 29761 -32230 181492 -49648 -72768 -384478 -185555 84256 183527
19138 183527 165892 440955 -133132 39110 -229636 -76706 79993 -86335 252140 -127241
19127 -140964 -58255 38524 -43922 -107644 134737 118016 -44142 26358 19993 -186291 -150461
19116 -150461 -99753 68226 98506 -341117 205158 -5369 227734 250317 112523 100693 -147202
19104 48210 -23888 -297234 71143 261488 63137 184012 -66421 -83416 21765 111414 -101496
19092 -430105 -181969 -350922 -82435 -84711 -35824 -128319 -89811 -217851 187624 -134926 -217415
19081 -217415 138708 51578 -11852 -171031 -262217 164425 -243418 -192233 48918 -12670 -213973
19070 -213973 -115860 -88930 -475214 -182534 265387 -244162 52823 -9024 -316692 70266 165241
19059 165241 -203771 -363934 -246405 32383 -87388 72274 97814 90324 -347954 -336177 -59964
19047 -146772 -56178 -213512 -360877 -2578 121586 -263573 125251 -238731 155799 139563
19037 139563 268471 -223864 -29415 53317 384640 137095 300003 255476 -111366 204191
19026 367698 -197761 18124 293548 181076 423594 40302 97523 -151278 -9993 -194836
19016 -194836 -64586 -180479 74859 255182 -198911 319972 -73822 -3439 169544 -90822 100759
19004 -105711 -199092 -220627 -114832 223516 -277144 118824 -10518 -73241 113132 -338227
18993 -211227 109805 -251347 -227742 -177118 115978 256199 -171644 -86210 84376 301468
18983 301468 -236700 126456 -302270 -227941 -24301 -283508 -337024 -149259 -31632 -73536
18973 -73536 131138 92655 -86127 67731 105383 75298 -89485 66839 -10620 -15324 2076 -54346
18960 103634 -120947 50538 -16402 -101444 -208644 -207398 -68803 -63072 -103029 -274938 -94012
18948 -120626 174782 -251962 -318401 -128321 -113483 55258 -170326 276420 115961 -337244
18937 -103840 284492 -176658 47198 8023 -66297 -184150 32105 -25603 -51775 184827 93705
18926 93705 -323333 234748 22194 -198944 -62358 22975 -202383 12026 33346 60323 -207375
18914 167423 -16235 -295280 207437 -340476 -119626 54972 -233405 88271 -235053 -70429
18903 199494 -198498 69758 -120076 -179257 -123129 -66773 100947 -205560 259277 -57969
18892 -375564 -29869 270352 233115 -52132 -266709 -84226 196554 -312584 -207298 -357656
18882 -357656 -129300 -209470 171673 -10189 -235800 11463 5843 206446 -315420 223488
18871 95140 112843 -330295 113471 -78861 -39566 101751 -334932 -166827 -273144 -26749
18860 195601 -179363 -2178 157593 -24622 -20413 206527 317693 174137 -86481 80068 352695
18849 352695 -107531 -164949 276661 18968 -43560 37864 -40418 -174801 -129901 -279997 74411
18837 42840 -271341 -396741 49062 -169497 80743 -158675 -7650 -67775 -232789 98545 -400128
18825 146038 -199606 -176514 54693 28748 86993 137614 25758 240335 179925 -34365 -308140
18814 -308140 -97750 -233344 510929 404426 -158902 171619 -64715 338286 -70558 -273648
18804 -273648 -121256 -72962 42865 -303306 80630 -133758 127626 175093 -27316 -17785 -121252
18793 -121252 -378834 -42069 -409063 -53676 -229849 -203853 -173234 188367 -42051 115167
18782 -49691 -197965 207728 40072 -291752 -34509 209452 350889 -30658 -94328 98813 -112004
18770 147330 49601 6496 -157468 28028 177551 99581 -18896 -297768 116178 -358995 -296673
18759 -296673 -155198 -212232 -25560 -19577 109682 111446 246314 167936 -254567 -342379 -72133
18747 -383753 55977 32979 230909 -192896 53437 -79346 -126011 324069 40904 -154719 -128987
18736 -128987 -74578 -53912 -265707 136579 2553 -132773 -465261 -262616 167378 88825
18726 88825 196388 -38070 -155986 -57340 -84235 -152811 -78542 -161967 -28257 119330 -55175
18714 -17587 -395383 83162 128075 -292144 -97443 46001 55567 50169 176612 56174 84420
18703 84420 -176507 -284751 -19208 119808 24837 -212438 -301030 -204134 -47339 -193102 254025
18691 -181228 13071 -73292 6736 -11388 -428100 -120541 -212215 -12925 55219 65860 95191
18680 95191 -155450 -122513 133575 -470645 258238 62047 76925 -236271 -279174 188859
18669 33539 -276364 -105055 -19367 211958 -332844 7476 -370258 11967 158516 107559 -20468
18657 -70192 -56926 -176435 -394543 34647 114715 152318 -339264 -231436 118546 -156041
18646 -308957 157769 -25042 114642 13807 117349 -137107 -48201 225212 -6399 -140423
18636 -140423 83482 -2588 -159943 -190412 28925 -162245 239510 -18635 -97442 -125402 -266852
18625 -266852 63175 -41162 29269 52709 134692 -398901 90530 -290914 170608 267930 -17204
18613 -196590 -15627 12808 30683 -121369 318517 -141843 334572 399037 41905 -104924
18602 -162797 66517 198029 241304 99529 9501 -76945 -127804 164108 -94202 32347 -55015
18590 -265231 -66603 55042 60020 -164140 -15949 -51494 273035 159595 221437 118155 106573
18579 106573 -143352 -299644 -188911 -339055 -268156 -203131 134140 -222984 -291984 -195093
18569 -195093 -60774 -128578 251487 117881 19411 -115310 -139284 128186 1653 124733 3897
18557 -208297 -64891 -128209 -215486 -340330 -197321 -114055 -146587 178928 -195304 -37347 -196705
18546 -196705 -166679 248968 71822 91444 -330874 38916 -137845 -1843 -139290 35545 130545
18535 130545 -317740 -124307 276999 54891 176339 24880 -13389 -118330 -339566 209808
18524 138646 -150899 -268334 -140477 -279727 100743 -27304 42696 -222236 -215560 -344403
18514 -344403 67523 -55572 -157992 -111299 -178864 209733 5541 272670 -44433 194628 15084
18502 -69918 -214441 -240614 -398876 -173020 -384246 -163281 -199795 17510 -148272 -19982
18491 15108 -96123 -103642 431787 -93457 259485 -157062 -151429 154074 -6881 -155719 -252967
18480 -252967 -61014 -367949 -48267 -174787 146743 -100498 -172034 114804 74290 321752
18470 321752 -49189 -128283 102197 -102853 -408785 51874 -109317 73025 216844 158822
18460 158822 -138138 165772 358317 -164991 9790 376281 377950 -31206 -60766 13872 -235201
18448 -34125 202599 -44994 149935 117255 -302076 -101070 -315952 -344548 29777 164981
18438 164981 263694 124367 -42429 -293021 1457 173170 -108401 133196 -232435 -144040
18428 -144040 -410945 189183 -223285 244988 234412 -265886 -86347 64147 -169037 104891
18417 83607 125834 -11014 366540 -104712 149483 -128326 -294437 66743 208479 -1424 379022
18405 -38492 -56617 107757 -311741 -51952 -74868 -111297 199658 -84002 -174833 82028 218497
18394 218497 392816 6106 -108861 163485 103163 253403 32633 177204 22859 164993
18384 164993 163375 434294 -268684 38493 -136038 -159588 -5446 -111781 89716 165788 -161867
18372 -184459 29728 79779 -40013 169082 3995 -107561 257933 129687 10629 -23842 -197260
18361 -197260 31535 -83604 447259 -196149 -153891 119700 69466 -400063 -220194 -269364
18351 -269364 -54026 -95367 -134109 -118920 -122437 209286 -75623 -117957 -97649 200343 -43805
18339 -153323 280031 -135 30894 -362127 -69884 -162818 -193837 -88257 -211373 -137875 140627
18327 204485 292301 -187299 -1407 -19195 -229307 29872 71067 -175720 5821 -295074 174814
18315 -2615 -137754 14387 -171345 -73615 6184 -272493 50064 -89467 -115340 109993 70501
18304 70501 -253211 -65949 -173691 -106069 66966 75762 -69989 -473144 -97509 -15061 -220213
18293 -220213 -295464 18140 166641 -112317 334728 -118558 37090 -216895 454860 -71890
18282 -143259 259561 145535 208181 21919 266768 -203345 732 215737 -338168 -328076 58460
18270 -97456 -150798 -319254 70727 -68195 182094 -160414 116158 -18075 17346 93607 -66733
18258 32414 -225302 -51616 168437 60739 -172993 -11363 -71106 -66320 165016 79314 20922
18246 -370692 -215065 315171 202946 27412 31203 83807 -317531 158337 53125 -151600
18235 -138455 -108894 -56663 -311160 237941 81232 -199326 149547 -114327 -354289 195097
18224 -3375 -148364 299568 -12898 -133088 -55631 4929 82068 223441 -175649 53274 162007
18213 162007 -33475 10118 151515 -134253 -678584 290079 109986 -117632 -58115 -343013
18203 -343013 -1645 130355 -85708 -152188 87600 -43033 127656 406661 29550 152381 82228
18192 82228 23622 -11010 -380004 -21218 -114597 -633176 246217 133654 48297 -34195 4463
18180 -172376 192568 -168971 323753 -86105 310486 -85902 -47368 -61765 -35137 -328505
18170 -328505 -189274 -100969 -242154 -95346 -160005 -147337 -61688 -392951 154885 41272 -49310
18158 81789 -154908 -209498 420724 -45684 -17099 -241714 -58440 27535 -56938 80671 -16015
18146 -150872 -388984 -88551 86165 -388683 199976 7635 52511 -159790 101624 -303977
18135 -251740 -149456 333986 -74337 88455 -20517 15107 268171 123277 307968 -188077
18124 -38093 -171581 187540 -154231 15830 -88310 -5945 -56114 59353 147041 435862 -60274
18112 -15847 48330 63207 290451 -82725 -45976 93982 -96809 -21405 59734 371542 -227644
18100 235788 -70040 111001 -50243 -226485 -126887 -222808 -48967 120971 102300 28838 90886
18089 90886 280862 116969 37124 -296435 125510 251119 124444 -225482 -138578 -221641
18079 -221641 95440 136492 -238060 -9907 185786 -217630 85124 108482 159486 12268 -185409
18067 184930 64665 -291605 -132701 -17149 -104712 118427 -171811 70313 -98589 30602 89448
18056 89448 98145 -97438 -139282 52157 -82627 -36579 211420 -291859 -90232 -39479 -197021
18045 -197021 -71980 117799 -241262 418287 -148837 264567 -177633 231477 3867 52278
18035 52278 -86495 -22485 -483 -196019 149896 -189997 -188423 109572 176266 -252735 240739
18023 -25136 -20422 27006 63566 147636 148318 -139989 -297282 -8605 -137781 304303 114541
18011 -213987 -87408 306126 174151 140364 -241828 -255859 237866 -239711 -21204 -194613
18001 -194613 -115407 117006 -315067 486871 -223773 -249343 29249 -188139 -20623 -309444
17991 -309444 -8198 143357 13111 -388889 313546 -274154 -209386 173221 -167308 -198692
17981 -198692 245422 66837 -19012 135193 -50352 168902 -240881 38225 85293 355568
17971 355568 146989 41358 -269440 -177526 171109 -189871 43234 35509 -50963 -130192 -115594
17960 -115594 104288 -102123 40507 -12912 1344 -399363 48283 -297406 -75293 -34494 81679
17948 369538 -273263 -32565 -34628 -12031 -130135 -99465 -2123 -11928 272007 -56109 73501
17936 72259 360402 -152146 -45329 110317 83519 -128844 206536 -134541 70045 132878
17926 132878 -95785 -196367 33603 92857 -101908 81958 69379 -2733 -94450 -243183 65299
17914 11867 156364 13801 -88448 -258532 161510 -356470 -6405 134499 247486 -249205
17903 21205 185603 98811 57874 70843 49905 25148 26220 231830 -31165 -134922 115268
17891 430152 -200574 -163604 -103650 31455 79932 -154399 147996 124870 53386 367398 229080
17880 229080 -119526 -274189 -213477 -370972 31875 -164020 103290 -179999 218789 -48062
17869 105245 106408 249862 -65985 -28656 -101787 -196615 273295 1887 301986 -166389 -160337
17858 -160337 -215326 -92490 -123737 148156 -340385 -384584 -130919 -438223 -318119 -31514
17847 304552 -61847 -423931 -229093 16109 24193 65990 -3862 -270591 30097 180174 264915
17836 264915 34778 43648 -75728 184391 -106403 330698 134719 -162625 -25469 -44215 -115958
17825 -115958 127580 -199008 -75742 -156659 65855 59338 -66530 17323 112406 62946 318987
17814 318987 15794 -143172 267751 288644 -2367 53667 51640 205286 125425 57777 -157242
17802 -224217 12564 -52318 70045 -170740 208030 -238499 124685 -200638 310458 -32244
17791 -131728 27043 49622 -11512 -208096 -83166 169130 -55199 -57297 22797 23925 59196
17780 59196 -66883 -51039 -329998 -65102 91646 246703 227671 188095 -219559 67854 399708
17769 399708 11166 -163419 159662 218254 119118 -175574 249348 162739 -198839 -230192
17759 -230192 -39417 90691 -101669 -323732 -157873 -213287 140495 35211 436303 -63022
17748 -68816 196530 201301 53495 -192791 261146 -319299 69664 225424 10277 -292442 116614
17736 506191 -418565 318010 150794 5952 -4398 -497895 -147509 -83613 -94722 21044 -152407
17724 276716 138322 34336 -163243 392186 158294 6395 92482 336292 176834 -139445
17713 88964 -82288 187398 27598 -71635 97036 93964 -140623 -27174 -28842 166376 32456
17701 55730 -300247 56492 -43870 -69006 31755 -49891 -80238 -40718 -50079 -33509 103332
17689 -280119 183890 85715 -1438 -168534 199241 -211586 -158397 -6959 34918 141566 205434
17678 205434 -258331 192907 -340114 -282999 -292872 180186 58022 109885 83149 -206466 119445
17666 49876 211983 -199932 -115503 115502 142104 -25797 -18164 64993 427036 -378787 33186
17654 224473 303404 -5713 79529 -96772 95225 146612 -28436 254369 235892 166645 -191118
17642 -56395 180236 -165493 48193 9611 -191215 206858 246680 -29633 -22766 -161605 50480
17630 43752 -153329 132119 131244 -208959 16900 190446 378645 260969 -171810 36383 122850
17619 122850 184382 -493433 119619 -335014 421435 19860 -188322 -59724 30503 141555
17609 141555 -104508 -450333 -501132 122258 -176814 -143146 59117 217759 -322727 264211
17598 348150 106630 -11501 -61427 60645 209060 196421 254427 -90581 -144975 -63872 -83154
17587 -83154 291373 154912 -245559 328435 296800 320634 295711 152152 130673 170611 64978
17575 149118 61791 -66257 163131 283976 311281 140789 -204104 -246262 -2837 -170913 7110
17563 15895 58322 -109427 163943 -43585 -15669 -241638 1802 316984 350268 -135377 529176
17551 -237894 37171 91711 -64892 230005 177569 180299 -47517 -1283 238717 -44369 287852
17539 -8939 201752 -164717 -191019 168852 49506 44166 73558 102729 360599 360292 25973 105791
17527 105791 116658 447689 -34866 -166517 224510 121125 141692 230468 170676 107034 414293
17516 414293 172702 189099 142874 351960 150760 -2773 70826 47175 -4401 185222 228726
17505 228726 409306 425712 88388 -23565 59008 -266154 151213 191880 -210759 212803
17494 -19303 372635 107275 110276 60039 -35025 128281 -5139 -61801 245723 114247 14247
17482 69050 -74041 144321 -236316 380731 371700 -115889 272484 -42681 111215 188390 230623
17471 230623 45872 155711 281352 109917 2884 263404 52151 -190415 342629 -153628
17460 352838 218673 16449 278490 -48682 -20912 -9573 4186 85162 -125496 445867 462077
17449 462077 82722 357089 7388 468284 21514 233180 121965 126807 440647 451639 -3069
17437 196752 372653 144008 207655 267040 487482 265418 208550 272638 525171 406655
17427 406655 494520 -178867 119075 329939 466853 34959 256907 -114232 13920 304421
17417 304421 148528 270066 524914 213532 -8530 145240 37098 264259 111565 25840
17406 89155 188715 -46464 20430 -33012 524249 10879 -242993 421054 46385 283065 80900
17394 201283 168547 222131 106513 198943 -29519 -63961 31793 -156102 168296 -52199 363738
17382 163056 66707 161492 144254 365557 267019 203308 220679 301773 44745 246167 66209
17370 295539 238020 57153 -50199 -102529 -67908 111952 -110772 -149426 -100822 67577 -101829
17358 2905 269648 138111 217962 -57887 251771 430790 248556 146267 233799 537829
17348 537829 254343 328473 292220 50178 221583 280246 272811 78547 173900 119405 334185
17337 334185 283817 -73683 327157 -297315 497475 51619 372370 197221 -159912 432148
17326 122937 429315 -142259 376975 253188 254166 100530 4167 177959 76203 101289 -137555
17314 206228 -69212 70703 -134202 65421 65428 170563 198794 -102308 -1309 212097 362708
17303 362708 157566 415126 153645 478292 324390 411290 40208 -37873 280610 245781
17293 245781 407469 62061 311316 367915 120810 -3371 -147633 236392 291813 208586 301964
17282 301964 -211177 248770 -223949 183764 -156819 288079 362350 51432 183866 217145
17272 217145 381485 -35264 76216 133290 400138 277528 261867 458657 108253 111882 -70114
17260 81264 216201 22486 170469 177258 178521 5202 153718 191390 1522 176045 138897 161184
17248 161184 112298 467340 222030 541356 17824 22251 415363 192219 591664 34824
17237 -53377 442675 -1688 -69706 186767 177305 356687 64534 257238 118090 -96076 -5655
17225 191754 241014 409357 554112 176314 240650 177620 258896 79356 594715 129670
17214 418924 30648 171799 486463 209160 431555 282324 122533 130036 329713 220777
17204 220777 391864 309054 268565 320957 538278 518314 374124 120583 68214 356597
17194 356597 320375 388467 254429 283302 226326 141376 -13352 230744 99806 79763 221519
17183 221519 363555 47193 438479 498536 477719 168489 455915 550270 66101 248008
17173 248008 99640 313760 -3148 343257 -20799 63398 164536 202444 186992 515787 594741
17162 594741 37341 553773 249372 63313 -84429 199272 642206 358525 606730 36534
17151 118428 -31525 141715 266597 166670 368979 211777 211053 9361 469523 715913 154850
17139 154366 449855 378632 171485 230231 288076 349125 244050 217681 121648 428705 195884
17127 90935 695362 329926 278717 352697 369088 202212 636562 369907 356514 274926 299232
17116 299232 150244 501729 239424 430023 449729 625204 545569 523433 581732 576565 384900
17105 384900 243093 159721 535938 804633 372740 -73289 519586 414626 371399 616489
17095 616489 161428 468671 442534 500272 234777 443604 362758 487006 417964 445786
17085 445786 604253 689951 155715 608367 335704 290357 381384 266998 689770 524746
17075 524746 844099 667821 417217 590462 182927 357827 533803 478172 578194 100215
17064 768882 396875 518406 503491 234995 571750 762013 585816 695895 753484 366090
17053 378920 364463 500932 639397 515659 647806 552469 350644 318071 349139 440619
17043 440619 540151 623564 397740 842760 730427 532003 760403 662530 469711 481484
17033 481484 515601 668247 547006 685947 599549 813945 560597 725489 755930 454599
17023 454599 937052 630248 559453 715906 788050 698054 728406 823901 876403 712268 634309
17012 634309 484228 613874 825144 436088 686650 704907 597974 586980 916128 790975
17002 790975 736758 1047942 848298 926349 841800 996480 785274 567852 829811 1067679
16992 1067679 960278 1050611 1072974 721899 603610 830810 1060740 914118 1223901 840166
16982 840166 763116 618814 1181496 763878 1004561 780641 1011186 1053977 925597 1032120
16972 1032120 668960 884764 813517 838069 786460 874426 774048 813900 1483919 1247243
16962 1247243 960984 1072407 1199296 910797 1082387 1187149 934856 1183471 1198365 1288984
16952 1288984 1029277 696092 1070358 966352 1304689 863545 1317294 1199222 1161077 1013702
16942 1013702 1498209 1004187 1320308 1379242 1247578 1210011 1112781 1198000 1489427 1345232
16932 1345232 883390 1295663 1198289 1125112 1462665 986202 1224291 1465027 1215132 1547421
16922 1547421 1711022 946874 1600115 1515194 1633319 1578997 1393953 1925441 1492853 1888190
16912 1888190 1502193 1409389 1788496 1440110 1695698 1625426 1612744 1627121 1867078 1603837
16902 1603837 2042467 1947092 1800606 1601830 1878191 1784760 1877665 1843376 1784830 1886206
16892 1886206 1793192 1976611 1981929 2154871 1843423 2217068 2352108 1759539 2109584 2393142
16882 2393142 1989910 2496229 2469330 2393184 1931355 2563178 2161891 2524500 2580543 2406479
16872 2406479 2383783 2490118 2689757 2534787 2830964 2499719 2898567 2418538 2699035 2917012
16862 2917012 2762201 2908545 2824607 3104840 3302276 2713088 3018584 2869603 2947207 3120964
16852 3120964 3584353 2950106 2924298 3453418 3249313 3670833 3605737 3491362 3675277 3850178
16842 3850178 4052701 3892891 4006251 3594016 4374249 4053349 4337138 4353475 4032351 4438242
16832 4438242 4482385 4468536 4590574 4880829 4549637 5132963 5119419 4984271 4944703 5174216
16822 5174216 5214890 5519298 5900401 5867399 5914482 5854489 5966617 6071075 6220367 6482756
16812 6482756 6540158 6524522 6672776 6887398 6965129 7128181 7425007 7553080 7690624 7748897
16802 7748897 7359052 8020779 8438171 8645611 8827909 8761516 9199952 9188995 9812755 10092791
16792 10092791 9955031 10509101 10399690 10870963 11039237 11641525 11924020 11920396 12332341 12829093
16782 12829093 13153226 13567703 13903093 14302293 14642383 14899027 15450801 15914670 16604255
16773 16604255 17208714 17420279 18493420 18919625 19798383 20146555 21053372 21559660 22615689
16764 22615689 23129105 24198762 24944557 25774759 26972958 27945191 29236708 30285410 31596788
16755 31596788 32971513 34352286 36225935 37329430 38872869 40830725 42515479 44817792
16747 44817792 46678191 49335161 51419903 53979541 56735045 59778078 63093198 66551762
16739 66551762 69759038 73408497 77310014 81889255 86382067 91270367 96213512 101356109
16731 101356109 107235861 112437234 118459305 124476710 130429271 136478033 142557860 148205615
16723 148205615 153753000 159118104 163242798 167494137 170605985 172802382 174342191 174851472
16715 174851472 174327171 172392691 170113897 166831093 162959762 158400435 153466214 147588607
16707 147588607 141708403 135866593 129764675 123799223 117477655 111437832 105720689 100269408
16699 100269408 94864059 90154637 85625590 80893741 76164726 72158278 68717105 64951939
16691 64951939 61573793 58649298 55429635 52782976 49909749 47458758 45103932 43402403
16683 43402403 41260046 39320995 37581910 35717853 34802558 32627298 31300514 30368281
16675 30368281 28988004 28049926 26756638 25780628 24835538 23352868 22876590 22091930 21127937
16666 21127937 20248019 19596256 18848298 18538237 17736088 17176232 16536465 16143723 15739352
16657 15739352 15086029 14722216 14392451 13655522 13525787 12892414 12852673 12117418 11639448
16648 11639448 11673740 11167461 10847730 10394733 10617625 10170039 9860878 9204752 9377050
16639 9377050 9115537 9135626 8506694 7840693 8231031 7975331 8143623 7992070 7499619 7337721
16629 7337721 7344075 7041184 7063125 6704979 6242640 6600089 6336138 6011048 6065829 5366449
16619 5366449 5822801 5590521 5515143 5582018 5603781 5360693 5344710 4860454 5006342 4787537
16609 4787537 4817331 4622775 4548143 4570957 4471886 4346208 4136838 4191583 4256033 4136404
16599 4136404 4156770 3849305 3907809 3717673 3556141 3610305 3547610 3595994 3909880 3547233
16589 3547233 3439892 3338397 3467117 2948919 3000529 3103259 2935384 3084626 2746852 3043441
16579 3043441 3084607 2662019 2953308 2731473 2482672 2727005 2793615 2786427 2696361 2430435
16569 2430435 2522857 2513006 2631238 2304260 2544643 2419869 2323150 2093573 2547185 2138933
16559 2138933 2759076 1940664 2389145 2161247 2253605 2130088 1974944 1807643 1858245 2245722
16549 2245722 2138993 1659013 2113967 1829942 1925627 1736965 1842904 1538110 1833214 1639669
16539 1639669 1873566 1859998 1489897 1869034 1731283 1444552 1334030 1456664 1409434 1646933
16529 1646933 1418011 1455918 929362 1407216 1478596 1499439 1209120 1282593 1505019 1415837
16519 1415837 1479042 985828 1309736 1036455 1242311 911511 1415621 1254732 1106974 1103760
16509 1103760 1266044 1540929 1377613 1340636 1187786 1274989 967630 969051 743009 872224
16499 872224 1179972 1155988 1143704 867668 1251297 946942 874603 788345 566635 950126
16489 950126 1026843 1289192 1249355 1093041 637220 917991 649470 743832 899092 774214
16479 774214 711871 976782 1119570 914067 982913 581738 853829 1109363 919951 1164061
16469 1164061 848488 779196 835784 920667 520991 626452 1010984 734258 529985 557595
16459 557595 683959 913808 874765 712881 650262 740893 908782 705029 779680 678975
16449 678975 639298 596141 818803 358304 769673 960067 1021521 560894 652476 860879
16439 860879 394002 457523 565659 484559 546639 543699 1048379 606096 743431 430684
16429 430684 276859 588784 562484 405764 805129 680984 415183 365863 316084 236515
16419 236515 475256 385496 365170 527313 770592 646384 342733 333559 800151 394519
16408 578310 266146 189966 102623 395244 156481 835195 714215 551909 311625 497698
16398 497698 306610 297970 287386 336967 211634 644952 642622 270244 282027 78168 417662
16387 417662 632855 191186 217619 6856 701357 431342 519504 263258 174797 395146
16377 395146 501061 506540 320342 403838 601623 407839 401266 -16424 529132 283534 553550
16366 553550 428808 268270 21015 456293 363981 721889 473075 629486 330251 184901
16356 184901 393314 409444 241755 100530 432169 170147 155996 290144 458459 378761
16346 378761 156362 108244 -21768 254390 665847 334221 370722 64563 141993 447132
16336 447132 262928 38036 246316 242410 512430 144433 615827 292339 587962 159746
16325 186099 43192 329293 449245 91031 307403 -42533 49566 410177 218487 170608
16315 170608 357444 296280 396075 444408 60586 343720 -30562 333544 728904 124392
16304 -27486 187778 137498 419352 528292 -127358 492804 507687 -71372 -243083 65174
16293 131503 10175 -125642 222952 577767 219014 -41683 30268 26271 329686 285025 145245
16282 145245 202557 38223 90536 296150 -111055 344150 231805 202430 450079 135876
16271 188249 310575 143156 -20530 -139893 599187 360833 113303 -62971 238206 -52057
16260 298957 392797 16257 142275 70351 343986 278243 327112 40541 160748 194158 68102
16248 292283 364342 371880 -140384 139160 487222 53947 154693 -111667 494447 195776
16237 366051 -130430 195172 313683 214743 527862 201090 192630 21430 -28467 208991
16226 79425 99581 303340 233576 -148944 170097 56918 -62871 77412 5807 204491 289484
16215 289484 -59120 79869 -177143 168524 -131955 309708 22778 291149 101003 405234
16205 405234 23132 587469 -22855 -49263 73382 -38209 -50973 -57598 -153851 191649 242351
16194 242351 130805 387400 222990 220655 -191859 -83746 17218 -162504 270965 374374
16184 374374 12601 286900 169001 -426270 364734 119174 -220268 361429 137413 331169
16174 331169 229324 138945 -38710 -1924 5865 106016 -9653 129622 472285 155858 -119839
16162 328200 33229 -456621 -168552 -75014 216171 114349 -261838 240109 23507 -806 400700
16150 -2555 133213 12685 -61683 -34110 -150334 160674 145414 -158220 108085 -110419 -27097
16138 213292 55073 -99228 55700 215988 -87546 91350 321527 314979 346745 -56828 -426756
16127 -426756 -171386 -135827 141484 5566 479874 207547 -143635 82013 -166532 -21384
16116 -46644 276714 51169 -117812 -120857 155472 52885 -35879 -153458 197421 120291 -74381
16104 83927 -42960 450430 307385 79852 26545 63580 -177711 13086 92075 78203 378553
16093 378553 -210848 62235 -89859 -195026 -486168 -275963 94568 -48124 -108625 57178 69433
16082 69433 3471 206350 -91750 -4108 91283 303760 -237910 122695 51107 78051 -208978
16070 154692 27803 132001 -320757 -293312 217034 7579 81070 104922 415294 190669 259949
16059 259949 269640 -102542 78134 -237026 162092 -89482 297049 -88424 -227563 -178300 -5180
16047 120015 67573 5729 52129 -56679 -91236 255942 99627 23041 15587 173361 -104303
16035 103251 410007 122766 106542 140565 -123938 284822 -97780 111803 64928 -154276
16024 57154 -152594 -52902 -332598 267291 -185874 -198028 70313 -41563 213406 369865
16014 369865 -221860 -166715 52574 -126834 -47748 226585 118292 -374849 -5567 258558
16003 292443 297001 195774 296041 33800 -148958 -10046 -275634 -442787 98095 -14575 -101175
15992 -101175 -90047 -30248 -230909 86625 317642 127584 152512 63087 88242 14892 100147
15981 100147 392649 603184 14364 7766 181446 259258 148220 -151604 259706 178669
15971 178669 98426 -344152 -105595 43897 116950 110004 -140479 -128291 71924 70273 -73962
15959 -70417 -34693 -21474 254800 154263 -163849 -76379 -1110 -67053 349256 -73341 -51261
15948 -51261 40280 -88656 28542 132705 246308 -66256 27892 64920 85485 -6579 -197050
15937 -197050 183242 162803 -316260 146407 -378292 -236040 139409 -208608 -59160 -163149
15927 -163149 124544 -113071 -92923 -4369 -103413 -331270 808 -302568 121472 198779 -18222
15915 165457 -97225 -172747 -90275 328 56999 140721 -191549 30530 184653 -152486 -169525
15904 -169525 216293 -77885 -323838 -146534 -184689 -127291 166114 12650 -83737 -106135 -244298
15893 -244298 132944 -101789 -69462 -47675 -23029 189949 155972 54360 301180 -178864
15882 -80182 -189865 877 -174056 -75187 -127289 -128114 -94270 -87811 341253 -226335 160148 -407710
15869 181599 127329 -13074 343424 136602 156120 231722 122299 -19426 -68306 -66410 31179
15857 -301916 114756 -348619 -201356 68035 199981 37791 38516 -7640 -372474 402073 -195608
15845 237205 -156568 63222 -9162 -133310 -144699 5412 -385228 58316 -313839 -342754 -51063
15833 63248 5623 -421632 167912 -52796 -209985 -1606 -225352 -193925 237892 -225045 16482
15821 300840 7788 9202 -241857 -265166 208076 -54511 -36499 -263472 -299222 -95170 -105146
15810 -105146 -107483 -148438 134259 -52699 -201979 13252 -233784 77881 435630 -212486 -2993
15798 -409647 148977 -118673 -91011 122120 -86597 202436 133711 -97104 -37257 247077
15787 -74779 -50014 78280 36554 165178 -84756 169412 -293118 88042 -239975 -68666 110197
15775 78155 4557 424411 140951 23187 159773 12540 -233732 -291921 178629 213675 92829
15763 -96226 -2067 228428 156795 -43903 -81148 280964 126223 -125522 -113040 -195712 -26294
15751 -80962 -199603 63548 -7080 -295705 -24208 -7485 -28022 324797 -89864 -77639 165749
15739 -552329 9967 211634 297660 58639 160154 -65193 119103 94260 101648 -35677 -44999
15728 -44999 -63467 67782 115286 163571 -6604 -315273 -261527 -164136 -215419 -232681 -217929 -308691
15716 -308691 39060 98710 -101322 -76100 -279501 96446 -85598 83559 38963 47746 38162
15705 38162 42882 251628 21460 52335 -122867 6787 -121158 -141092 285261 -138748 61111
15693 75652 -186361 -9928 355486 143828 -50431 36119 -132659 25249 54839 138915 101701
15682 101701 41399 -160362 -43202 -87503 -93322 250710 -171879 -72765 -286958 144687 238901
15671 238901 159988 194907 123519 -363814 250870 141692 -32643 128651 -75135 212760
15660 50988 -328994 -527432 12361 -291935 -47167 -578798 -369492 4079 165549 69565 80283
15649 80283 31877 89183 70354 -84340 -49413 343649 -17179 -407311 -24862 6279 330094
15638 330094 -177120 -325212 279871 -100530 41115 96094 415423 76665 51582 -92621
15627 48380 409920 -162605 214360 128084 41642 -2333 227713 135973 -111139 179901 136114
15616 136114 -444715 -141616 -92024 -74503 317892 33799 -35206 38159 -126265 175291
15605 96111 -11620 -101995 -154022 -283297 -78401 -456397 -55729 -439153 -352870 -215127 141800
15593 -283140 79259 -156 -43985 -332745 -188425 220208 426219 147562 114745 -127290 343876
15581 59831 135427 -231491 -39865 -273918 -270302 -419948 -74349 -86406 -256043 -176491 -144849
15570 -144849 -222793 90434 115033 118662 190464 -177471 162083 -113579 362372 140863 -228060
15558 -111524 -124464 58024 139954 -179518 -8076 202543 -113967 36782 -134789 4011 55478
15547 55478 45591 233175 154495 -142157 135070 113726 -287480 10869 -196048 76940 -446503
15535 -73336 130967 -100310 -9155 -151315 -78097 131478 163986 -111419 161563 -391939
15524 -59631 -40589 66959 175817 223174 -71457 193526 71179 -35730 215620 62877 -173472
15512 50592 29191 -45785 -103099 -79743 -114222 235897 286687 240382 7269 296568 -144756
15500 75967 -109821 -132412 -154061 -161632 -23219 247805 208556 85604 159579 18418 118579
15489 118579 52249 -58441 20020 -134874 -159660 -57851 64347 -85690 -91149 116732 70519
15478 70519 178400 88470 -173563 -238171 23394 -138005 153829 -170751 154457 -58269
15467 96254 -2939 -215443 28044 546086 153773 -172672 214897 -58988 325158 396441 -72902
15455 -287748 90578 -43069 53948 590 108456 -89703 264872 119164 -41691 84958 -101917
15443 -56045 103025 -44410 65650 -105980 -132083 52354 -51746 91620 509184 -44055 141683
15431 56036 225738 1687 -154607 -52362 55427 -43012 23883 198620 -339056 -104942 177749
15419 -101616 109012 -76489 -90505 83810 -134503 75012 -356548 254428 4462 205858 -484301
15407 -58950 -256096 -294991 185974 92820 -48104 -102307 -112004 -41376 -224009 -167685 89722
15395 314031 164905 -89131 -327039 -181599 105738 90147 129797 127369 442609 -374148
15384 74159 -127876 108385 -197522 154641 52183 35995 -59682 16342 -133926 -384825
15374 -384825 -80587 92351 14673 -69530 -100248 28629 -91265 22937 461814 65611 241566
15363 241566 226665 91552 76781 1984 1982 -170288 368921 -381736 -136563 -123497 -92832 198126
15350 -126219 -429547 -172654 125248 139639 -72132 -114142 -291697 346059 142446 124342
15340 124342 71121 127271 103971 119598 89126 12045 -170959 23685 29699 323010 -11177
15328 47241 51145 -110054 -18508 180327 -137662 196114 27893 -101735 170700 71808 213980
15317 213980 150360 -186723 -5299 317088 -29001 -80260 -20537 228770 -53245 -95421 46281
15305 192796 151129 81105 360275 217586 932 225294 33458 309029 314631 48510 168220
15294 168220 66198 54604 34017 222092 389368 220223 244323 155073 41277 70355 -22911
15282 -91342 -10384 -191459 99473 120326 -135504 -223161 104079 146882 -234597 324181 234281
15271 234281 -93346 -91654 41972 -29768 150959 495750 345262 331231 77293 24522 -484991
15259 305437 120444 -161893 425595 -159042 -95455 247836 -209043 247432 9188 452073
15249 452073 804941 1500369 740735 1511176 1088278 673641 653971 -62068 76675 436500
15239 436500 107313 -96712 -83127 -206046 220669 -176171 119242 -238850 197874 267254
15229 267254 81056 -151849 103061 32336 245958 -273519 -101349 40105 214496 20353
15218 -159985 76429 126914 115857 -85242 136338 216788 -55225 303207 -306370 368178 76164
15206 347364 15064 191834 7571 90894 -76154 -70153 -174870 267693 -77450 273868 53984
15194 204475 69236 41865 -41065 -116535 8316 44450 185392 -199200 195805 -151098 -54695
15182 14086 283245 -123383 -163920 193795 -211391 183242 -42560 55359 297105 -196597
15171 266339 207853 283951 -65330 30719 39192 170516 -119276 280983 161571 -68346 30750
15159 36200 -111800 95639 -186595 292462 343976 -153712 -147171 100398 256054 -139539
15148 216657 550650 244697 -208984 123403 -62128 116275 107688 -76731 249374 309658
15138 309658 44132 31873 16299 111479 31822 206188 154758 295056 -145514 251663 143801
15127 143801 464260 122378 292689 -49909 16634 17432 258558 154232 109564 32699 -18778
15115 220762 247651 479696 -31287 -197303 -82418 104844 144290 106852 175241 454296 21919
15103 151273 231548 -325503 164745 29948 172817 129565 181603 88503 60017 199058 163358
15092 163358 46657 262749 114744 -34435 196215 171570 98905 129817 268476 -51922 325013
15080 -105577 194863 141418 -194826 310993 133845 160120 314849 26042 56870 -39024
15069 -63395 142314 -102632 -232525 -197044 76957 233519 265759 137134 -351439 196335
15058 -21435 -1140 387231 210127 86466 -113945 420379 158859 152984 241591 31952 245022
15047 245022 -141470 85473 308865 88188 200574 -76662 316987 101440 16101 91445
15037 91445 22333 294263 136503 449952 321939 -125319 76961 53924 21649 23954 418580
15026 418580 600858 91460 536141 13658 374614 19055 40401 130453 343804 277918 45082
15014 221375 139798 119341 199124 -111198 154522 494910 201863 230485 -185309 566474
15003 390589 213837 195512 173237 49665 293281 301418 434500 -132178 3133 60438 328491
14992 328491 349906 157645 -179767 490293 287290 133342 241414 172160 225542 364619
14982 364619 -216044 78744 405773 29076 261862 321468 223367 477158 148701 236091
14972 236091 416335 56097 200032 29893 201129 447026 463617 305418 242846 247634 180597
14961 180597 -39082 138639 278441 307888 33223 226436 317819 91505 246973 407701
14951 407701 99143 -64773 189084 62987 346395 218942 100240 -23013 149151 202527
14941 202527 423140 167238 172308 83499 -78865 40174 376507 252177 228227 341452 109242
14929 105964 344725 -4598 166794 134084 287364 349668 493508 12131 373721 397785 210224
14918 210224 394390 308430 95745 -15029 465837 340635 400085 421426 203090 379231
14908 379231 446587 379352 61312 159277 180641 88625 326689 97497 42944 132758 450401
14897 450401 -93063 290007 445534 413267 304475 466874 431045 466101 132904 382936
14887 382936 550014 311792 132449 353188 446370 207743 472779 427280 440123 292321
14877 292321 264115 243034 230638 321752 163983 347830 7033 527868 810628 478859 302500
14866 302500 112849 119648 381885 541449 562495 396034 392819 352790 644473 213800 405748
14855 405748 56897 468621 426456 460511 222600 398530 373917 190940 504210 542033
14845 542033 525096 597518 730441 702704 546147 451981 317373 438116 503640 808715
14835 808715 126883 239080 340435 361534 403029 587285 414784 710371 309428 201520
14825 201520 334687 419033 204588 519189 378637 720528 232268 695981 385064 434219
14815 434219 36679 437471 597794 400942 575149 463260 446510 500160 625700 263430
14804 382030 727577 660994 703447 300933 484993 532327 508006 359091 917006 329168
14793 598855 551675 580194 626269 345157 849589 633711 553367 518850 592470 446424 557181
14782 557181 355347 379530 415777 679860 811828 906008 806854 750082 155547 439881
14772 439881 461218 512005 664651 413085 750030 652542 764087 467868 191070 494756
14762 494756 612176 472604 450473 671414 646529 611397 457880 504007 342530 690316
14752 690316 671297 566699 549175 425915 922566 685180 248244 599392 725157 740671
14742 740671 560666 829563 867095 669717 853649 673959 659476 657062 662240 246661 1003920
14731 1003920 940598 982851 559838 801158 573621 670240 594262 500313 1038201 944199
14721 944199 564457 638527 556500 699829 501927 697552 1005142 941387 731058 874219
14711 874219 826159 736959 501031 760516 712531 1086442 756523 1028955 741032 1145952
14701 1145952 731969 648192 1006926 742764 981876 1230002 904396 913514 720141 553083
14691 553083 688841 992366 884670 707488 735027 964972 736966 1159940 1056341 907821
14681 907821 1013302 788247 1268953 742104 1376433 805996 1174032 931869 1010131 743232
14671 743232 859809 716118 1254365 1206535 1155817 1034186 1204329 891948 946248 953949
14661 953949 866963 988038 1138210 1234567 1117781 1205950 952815 1364039 1064724 1168302
14651 1168302 1156732 684398 1077561 872769 1328263 1417460 1243784 938854 769617 1240226
14641 1240226 1444194 1165562 973177 1011967 1369535 1314040 1148833 1419593 1320590 1207303
14631 1207303 1495776 887689 1062096 1518879 1438471 932163 1617329 1403058 1540422 1428686
14621 1428686 1568050 1428409 1660143 1580704 1444836 1430573 1493924 1379627 1234625 1625152
14611 1625152 1699458 1300683 1637522 1373020 1577075 1480317 1694971 1277554 1325940 1207039
14601 1207039 1472075 1610121 1599629 1734908 1589794 1685801 1477722 1729688 1578236 1688857
14591 1688857 1461073 1842804 1832948 1701034 1728510 1668875 1454023 2226470 1989839 1668060
14581 1668060 1939385 2012325 1756413 1963598 1827665 1970138 1782016 2013895 2196436 2022720
14571 2022720 2037701 1928727 2080758 2335181 1932590 2263227 2184981 2009308 2569431 2424389
14561 2424389 2563498 2553381 2350187 2658659 2986049 3005878 2924025 3185298 3417537 3757120
14551 3757120 3685694 5134423 6836494 10922279 19300536 37576429 47298191 23684375
14543 23684375 9839770 4414547 2953477 2610982 2577398 1832908 1875830 1939179 1841182
14534 1841182 2068475 2025801 1780248 2017077 2319379 1951486 2006094 2144064 2117745 2305786
14524 2305786 1977670 2486568 2527271 2476110 2511787 2549538 2494316 2101789 2424447 2555522
14514 2555522 2216059 2870011 2598813 2891338 2766707 2575602 2952499 2817304 2935018
14505 2935018 2811971 3222154 3109781 2880370 2836167 2973940 3437945 2655643 2827481 3123702
14495 3123702 3321535 3108740 3289582 3232124 3007630 3205635 3542978 3435540 3295727 3089634
14485 3089634 3424212 3565630 4015443 3582478 3480148 3539525 3483120 4079563 3890637 3644437
14475 3644437 3903069 3832473 3578781 3872230 4179693 3943109 3876297 4032433 4061828 4459674
14465 4459674 4176665 4715682 4513998 4607139 4851364 4760327 4769251 4803202 4508309 4778184
14455 4778184 4888137 5062651 4898966 4686798 5130613 5124846 4909779 4989894 5193755 5051255
14445 5051255 5813874 5284075 5438792 5967611 5454055 5740567 5712635 6072836 6125278 5929344
14435 5929344 6057911 6304972 6315446 6406726 6189561 6480953 6381727 6661665 7025983 7245709
14425 7245709 6486830 7245481 7188898 7022831 7422841 7544166 7500315 7428367 7729269 7732773
14415 7732773 7561676 7798583 8092679 8533849 8332963 8389949 8673388 8633660 9099155 9061036
14405 9061036 9357297 9573890 9480985 9509744 9612760 9852826 9899435 10249420 10352124 10348200
14395 10348200 10671800 10771018 11106095 11219135 11463329 11595103 11936143 12209076 12165550 12521969
14385 12521969 12690049 12543470 13372231 13350032 13847005 13724750 13913624 14503406 14602434 14871126
14375 14871126 15382126 15663925 15929969 16262487 16536380 16896688 17237731 17674117 18058140
14366 18058140 18430393 18474765 19301962 19508660 20011998 20073538 20853212 21070770 21799438 21934778
14356 21934778 22415270 23348405 23970060 24325620 25073302 25429184 26625621 26843597 27291820
14347 27291820 28133272 28887665 29513908 30389307 31400803 32302682 32817054 34194102 34627138
14338 34627138 35474333 36886113 37384222 38699202 40014295 40995201 42417302 43624037
14330 43624037 45197348 46337776 47911998 49403081 51211056 52713607 54397332 56413366
14322 56413366 58505814 60469831 62488631 65093410 67456587 69928351 72693483 75532060
14314 75532060 78555357 81749439 85247934 88436860 92282683 96254544 100024337 104830800
14306 104830800 109368156 114589131 119906344 125450382 131341011 137582552 144478398 151474466
14298 151474466 159244658 167601387 176448526 185431209 195335034 206061716 216597343 228517071
14290 228517071 240973757 254507210 267981678 282398427 297651837 313529537 329592769
14283 329592769 345993643 362816500 379584709 396390008 412504957 428033728 442216008
14276 442216008 455415021 466425028 475020386 480228094 480399253 478166474 475656842 473199378
14268 473199378 468748177 463168170 454894983 443674515 430108561 415942222 401373140
14261 401373140 384910794 367800250 350980600 333938342 316965240 301103202 286378521
14254 286378521 271646969 257305238 243598552 230680158 219017864 207579933 196771514
14247 196771514 186564145 177268265 168196003 159828959 152334153 144981983 137814646 131226874
14239 131226874 125377464 119643768 114073389 109310648 104409095 99691576 95502702 91898230
14231 91898230 88278836 84997981 81325676 78073660 74902816 72000353 69258853 66295123
14223 66295123 64417894 61996582 59897822 58005812 56017365 54005417 52229298 50257045
14215 50257045 48930704 47274043 46218248 44485365 43126771 41850801 40485052 39544242
14207 39544242 39075083 37943526 36186859 35377211 33927424 33190803 32681296 32025348 31088157
14198 31088157 30292121 29281371 28300907 27990002 27144830 26493772 25652842 25020033 24743419
14189 24743419 23803938 23320161 22988878 22523571 21788839 21130445 20987571 20310471 19748962
14180 19748962 19575976 18738887 18653127 18425910 18174388 17592199 17146491 16812605 16553688
14171 16553688 16490926 16008714 15920632 15476822 14866877 14652175 14736857 14275826 14002213 13784627
14161 13784627 13403897 13046413 13123431 12795006 12692709 12138886 12362547 11790027 11545937
14152 11545937 11785265 11313453 11552497 10727153 11065153 10595043 10565569 10590208 10422499 10029860
14142 10029860 9781553 9894881 9806374 9537672 9628145 9518516 8940717 8997286 8643722 8599917
14132 8599917 8539935 8428593 8658502 8050344 7942583 7831492 7888922 7716307 7559022 7385754
14122 7385754 7607885 7357387 7034456 7053001 7251255 7049741 6905003 6571334 6532369 6521804
14112 6521804 6541421 6226508 6515709 6004680 6010442 6104847 5954042 5888678 5941562 5952115 5428268
14101 5428268 5625650 5973874 5411374 5571541 5024122 5186722 5267196 4867695 5111302 4960469
14091 4960469 5030977 4950990 4664149 4977788 4791759 4688647 5013198 4771775 4755670 4565255
14081 4565255 4761007 4387559 4178540 4387702 4520373 4517330 4420004 4351294 4091095 4041013
14071 4041013 4119783 3591396 4395390 4005413 3839805 3894070 3662324 3555099 3853791 3803075
14061 3803075 3790062 3662150 3785272 3784757 3632956 3722326 3616545 3445761 3436560 3381162 3324211
14050 3324211 3322737 3303932 3177265 3116543 3018401 3189712 2843844 3200996 2787224 3061134
14040 3061134 3135639 3192484 2794645 3256129 2760006 2834095 2689913 2812855 2829917 2768144
14030 2768144 2936556 2835855 2542741 2654111 2476351 2445758 2566439 2462909 2351020 2457981
14020 2457981 2555734 2356869 2504320 2343260 2214409 2405437 2433305 2266665 2154574 2290999
14010 2290999 2086337 2283386 2222468 1959823 1971525 2221908 2038121 1985598 1949074 1797064
14000 1797064 2163510 2112324 1969813 1911366 2044904 1819288 1567803 1463944 1784398 1918526
13990 1918526 2259329 2922077 5502793 11938049 28323977 45522928 29053448 14524732
13981 8355118 5767027 4906679 4148233 3353611 3105818 3192749 2577256 2527828 2357361 2496822
13971 2496822 2173754 2433114 2590911 2174608 1910596 2352306 2176194 2197543 1948356 1871292
13961 1871292 2058278 1914590 1961538 1799699 1576738 1878890 1941512 1776680 1752420 1859471
13951 1859471 1655006 2011547 1817003 1769339 1785514 1635273 1551514 1652544 1982735 1566644
13941 1566644 1667259 1546914 1555609 1885879 1319934 1364981 1951385 1382847 1566147 1729985
13931 1729985 1440126 1842343 1646841 1405369 1214472 1414765 1360553 1313016 1533619 1502447
13921 1502447 1442212 1396970 1178497 1224868 1215757 1535130 918191 1347262 1413402 1392093 1425837
13910 1425837 1412705 1356242 1354672 1245510 1299303 1057292 1335105 1483333 1422771 1429225 1047862
13899 1047862 1103006 1140665 1193034 978299 984107 1227120 1071838 1309783 1011812 1100635
13889 1100635 1401699 916993 1129872 1249640 1225399 1058177 838092 1060635 1190189 917833
13879 917833 1062227 862516 1074013 1295329 1112823 978511 937630 1108182 865528 1194900
13869 1194900 1030423 1255470 953526 765955 819588 692177 1237762 1272393 629204 857266
13859 857266 941372 1210030 889430 792794 1135037 694656 1261421 1004292 743668 476770
13849 476770 1009265 965748 921645 573405 1021847 1246479 885959 1010383 710794 761301
13839 761301 931847 874367 1010383 687861 740329 567000 861167 862139 692160 998357
13829 998357 891560 609904 657811 800554 615239 733112 975018 824895 774531 745160
13819 745160 963250 697344 1023239 607780 393517 942249 936117 838070 777414 675266
13809 675266 634310 859503 962331 587281 705122 486553 744844 370697 605729 568634
13799 568634 823111 652820 701080 1099193 664351 1004319 949252 523393 463167 778836
13789 778836 777647 626543 825401 716731 561928 409071 522938 869363 350482 869844
13779 869844 815074 651152 524046 337298 817605 857318 321988 681270 558646 691605
13769 691605 766545 703844 647542 824067 678123 671153 713757 496296 746971 561139 647399
13758 647399 891495 290802 337607 523738 784580 450160 628117 405475 856896 492980
13748 492980 372690 391796 552465 507318 501994 154756 466935 584878 633390 367299
13738 367299 457514 387755 386421 704502 526609 210480 425887 576958 293529 661885
13728 661885 481782 420379 541279 376765 695511 797120 698941 783763 651203 775409
13718 775409 498371 383294 644893 476766 497826 271774 611619 465274 378371 364537
13708 364537 328800 382442 910188 752061 329529 609079 234810 534972 276899 266513
13698 266513 684459 237054 260055 266260 590263 673367 742662 454034 716743 606764
13688 606764 480046 672289 506420 472046 257515 740831 389993 521157 470837 561976
13678 561976 522938 372153 272488 707549 261666 394872 440404 343727 546597 547618 437955
13667 437955 445893 636657 569130 262361 417507 1372 666602 635637 449999 398233 359271
13656 359271 326854 802833 211589 400784 45822 719277 583902 48739 235468 796768
13646 796768 598549 532557 684502 107553 96167 241101 297008 69637 587669 753991
13636 753991 927608 512823 428867 612206 312659 744947 97196 202528 637802 287858
13625 516624 254544 484447 437101 428434 603058 248457 598504 94546 338199 305595
13615 305595 840 312966 297823 272033 445300 -66824 679379 574183 466164 289122 324579
13604 324579 166585 463900 481621 30607 299529 453953 194153 311824 239984 315686
13594 315686 191536 30287 336427 315862 72453 301658 160796 97041 250415 274440
13584 274440 357394 209298 544454 326731 432872 195850 220387 328221 305339 262499
13574 262499 207002 372906 239845 419339 253215 315084 253508 226188 199678 311086
13564 311086 218778 398821 -1072 308594 31223 43120 259660 494294 253964 -107775
13553 -15846 123338 370991 54194 204509 146877 175173 580588 260378 169299 -1217 193073
13541 150581 442617 309935 189252 247263 163734 251398 319122 441749 241553 210426
13531 210426 29533 60977 222911 387238 277164 88256 66451 268889 386973 50133
13520 -43406 333295 393088 387462 620891 150579 84250 146947 212526 47655 389129 76698
13508 82694 -73865 -269980 115290 315733 6514 260681 -23713 -7469 568117 118614 412486
13497 412486 -55170 478640 177979 307785 351100 355832 464813 281228 152307 535279
13487 535279 252236 210423 144525 -32482 130748 166819 -53753 -100425 272179 282865 510855
13476 510855 117080 73490 303359 255379 401660 232534 8968 86433 58724 -35702 333708
13464 480287 510484 268524 63260 420482 229889 23581 354782 -36943 241218 133074
13454 133074 -49633 -120561 106754 268600 174086 321794 199663 61334 214877 -118564
13443 353862 -142808 -4898 78691 512560 6088 172207 -163794 146770 449523 288776
13433 288776 591650 209179 500148 364341 -148827 212507 492709 -2716 147309 364049
13423 364049 -95298 -110488 -68251 37332 -55579 582807 127577 -29993 94151 58469 213783
13412 213783 80422 102976 281418 203388 -97271 488237 81044 275333 13876 196641 276246
13401 276246 197831 372713 -52532 -13249 -310380 250024 182982 109937 261981 324274 390019
13390 390019 678825 -34583 -146350 113985 437860 58304 47601 -280875 -171164 419610
13379 161254 306169 -25575 124438 -43121 269903 276252 119853 505392 174700 203943
13369 203943 392351 212329 522296 495442 347021 67180 17880 429507 239366 35344
13358 135806 2081 335386 -133972 328725 211510 424726 153717 499426 186789 76105
13347 64008 68432 140341 69373 428919 14156 387207 210897 163247 430944 248310 204972
13336 204972 225490 -35721 156963 47387 288487 107218 265368 69253 -51999 239280
13325 -4676 55256 453602 263755 63974 328007 301907 52263 412148 160226 201545 401833
13314 401833 88990 264669 297915 124226 350390 342776 939 80242 -55855 -273439 15888
13302 407324 27683 191948 70611 23507 54403 143843 -259046 71888 159595 96408 -18471
13290 188136 -162893 319351 303582 -178707 -150435 90914 477056 -134701 252944 364554
13280 364554 -328920 223806 -88185 323288 63354 81270 454235 -60874 -241404 161802
13269 58883 78768 -111336 -119056 279975 -57431 -20815 3807 247736 391536 442854 -125011
13257 108865 79594 -10530 171871 -206259 1969 209922 202407 -68903 250660 83908 193463
13246 193463 135262 168299 -59637 -188666 153804 -195877 64474 287737 -40079 -112005 383665
13234 -21255 83228 -291485 316225 333976 -13588 -188054 279515 52918 -248562 -79169 175215
13222 -176293 -171147 90501 4296 13758 317849 -353935 -9977 -93231 415510 -83851 207286
13210 125359 -161197 152360 293546 204425 -57578 246694 17135 129387 96014 2723 217264
13199 217264 620594 -130481 381138 198355 164025 16057 239493 9395 400759 131245
13188 -14336 -115353 -118409 -109179 -44766 63510 277212 96059 -457069 54247 -338590 80417
13176 327568 282237 213400 205404 37212 106951 185753 493582 -163137 504553 219840 -125965
13164 -234901 -354312 36149 -368545 -53449 144520 -88555 49337 -63738 241250 253096 97779
13152 -19421 15459 -124232 158986 145941 169591 285636 -190548 254568 50387 -154572
13141 -76300 79998 40659 161968 445314 34432 -70676 -50297 -100291 158088 230612 123342
13130 123342 67819 -118677 324238 113576 -11724 114334 194396 -24532 185526 -249508
13119 8197 -89342 114915 199415 280616 -106211 53507 -4454 -122821 92751 17957 277015
13108 277015 142648 77111 -21418 181957 11151 -76745 -153736 307603 98386 -6719 -147472
13097 -147472 60004 89598 -75954 -178302 47657 -26079 19821 223194 -109625 331064 418835
13086 418835 -67962 296378 -10207 358949 79576 -90898 216658 -33985 60553 362790 -280524
13074 -97023 -11373 -147574 217034 83583 -182605 44604 60521 119020 145332 404192 -101110
13062 -102711 155166 250625 89912 -70960 404763 210038 154168 170176 223423 -268062 1618
13050 -27439 291040 126964 48832 240093 390562 151559 98283 61257 111610 23786 29678
13039 29678 241497 105759 -109727 -207447 -16244 221287 206376 -177655 -21422 379805
13028 -131393 74593 -10370 -326077 -84333 -6983 45153 22458 328018 -25094 242644 -141842
13016 268543 473982 108965 37779 82755 -64306 -55075 -15849 -250615 60208 30680 -13817
13004 154252 162453 12161 480062 -49144 208195 -114124 -32120 -161367 -228356 -64064 122386
12992 -132881 71839 2461 -128279 -43080 76255 134332 118354 190882 122043 84387 255644
12981 255644 -226380 209281 199669 116013 76185 -21419 -433834 -64194 239615 329520 -134961
12969 21070 184774 170620 142381 -62450 -328425 149509 320829 -167903 205212 -139054
12958 -454878 134244 -276801 -40772 -62828 -262028 167173 -388933 69261 -13629 111284
12947 138635 -40731 328492 492556 400496 -30872 338278 295699 -11864 7739 -21044 157548
12935 -131394 -156719 -69394 -75810 -296326 193926 137021 48256 -78980 140453 -140174 -2967
12923 -146762 5238 -49351 55170 155169 186451 389310 8652 -121268 165673 -297120 68219
12911 -83963 -97500 146672 132562 -481907 -63040 38155 -186594 134747 167811 161376 -222092
12899 198182 -200026 -263837 118692 -420719 82365 -9004 -252381 -25741 -64353 202790 27871
12887 199468 243231 304010 -147079 104545 -9364 225042 -284194 22366 -79742 -252130 210242
12875 255131 -25316 -20045 -61124 2054 41814 144751 41138 73653 95526 -141166 -11619
12863 -107929 -265429 -58384 106267 74025 142101 145882 -240176 45727 87076 180940 -28110
12851 240426 160990 116511 139051 34571 422440 138944 148477 409206 165821 -81857 202499
12839 -228323 -142494 -2932 -34992 35496 -215676 -325677 49833 46978 -183553 245043 75962
12827 -22405 -223635 355881 -180489 168853 17832 -109874 313338 -106543 5831 169050
12817 169050 62117 57921 14589 450985 62601 226662 137732 -83055 -156834 -506861 -35823
12805 219996 -228214 -98249 -11091 10082 -35940 -107147 47952 240484 -150065 200194 -67831
12793 -401107 -7887 -260548 34493 280555 -106099 -396 58797 12311 -246241 16728 79891
12782 79891 -330237 -372479 7827 44435 397449 61518 125372 4757 306469 133390 203123
12771 203123 170797 33566 -142806 -102006 148673 43180 -216752 -205238 -22636 -6842 277887
12759 68048 -149792 -64349 -100575 145031 -247128 -85253 105806 -369891 29140 290375
12749 290375 -175755 407105 -113900 256125 -25247 -150911 -289515 -285979 210064 280514
12739 280514 -55513 82846 54891 -134849 -19652 186018 -385135 180475 -78957 48218 -187
12727 241934 -258736 105584 65048 -111781 9134 147896 102721 331102 -65390 -316714
12717 -316714 159909 -11536 253035 -190813 128590 112241 113425 36286 79966 -11789 201692
12705 236266 -100030 363033 385124 410508 235933 295364 -35250 117021 173746 -120889
12694 -95829 -185327 132440 203953 139056 262815 60238 457563 11434 -162462 -305361 -109939
12682 273045 -49050 230613 279715 -300050 -130024 -124773 171934 -197800 190834 122583
12672 122583 -322882 115145 -206536 -39710 35856 30760 276405 147236 -106780 29967
12661 -10696 104397 123002 -9329 201359 187463 503051 -94457 263469 -254806 213828 276943
12650 276943 90068 150380 201095 70231 -130845 -187130 -200611 94945 -218837 -184553 175005
12638 236849 -155930 -13615 71450 229547 629 -138709 7492 251559 19921 294631 -47329
12626 298005 123221 136456 287677 128241 -106584 126502 268517 -145527 193377 66389
12615 371703 113098 -118933 124156 12435 170595 95460 202661 -54555 -85616 227097
12604 -31155 131689 18118 -231910 -147551 -77862 262469 -153971 -105201 -49237 -22379 -18916
12593 -18916 15133 62820 175471 -27103 197227 28478 367429 207757 -83007 269546 -6197
12581 -32020 -433611 -79234 -174721 140915 531959 -148567 197898 -58148 -144698 78888 143063
12570 143063 5214 34210 -193439 120476 124148 -32331 30645 -67406 147252 23861 86420
12559 86420 -227852 -256264 269251 19529 301281 115155 -259569 -84675 160505 -63144
12548 -106074 194219 -55711 -207195 71981 -40070 -238987 -200767 337319 -327875 51492
12537 20915 -247988 -34678 -11191 418779 128805 -19248 74836 -124547 51048 21318 -50758
12525 332798 426756 200689 -49923 145033 -175633 -132769 -231574 18625 192936 -69977 -258843
12514 -258843 257419 -259293 181755 429286 -69065 -166579 71955 -77232 333112 -264385
12503 143389 32518 159592 311763 40487 104887 57960 33369 151893 292420 -249346
12492 -6481 -30877 -210130 -12563 -19083 -183551 163211 99083 261070 5479 -78872 -253270
12481 -253270 152172 74452 -32262 -100880 -104282 -91800 258713 265939 59454 -98427 26543
12469 9364 -177085 -224782 -92883 71112 -364705 -15751 27073 11281 30737 -114507 68521
12457 193271 -360102 -435321 -78684 -295709 53431 -420038 -120500 129120 -38522 -82146
12447 -82146 83266 7558 -77009 168783 -17201 9715 -28250 -76290 70343 -231728 -24268 -44315
12435 -44315 -143817 -35967 64876 -161362 77809 -259460 36325 -51255 -7380 -50897 208554
12423 142380 -96537 -94012 -212186 174737 215351 -80719 -134458 -64095 -50796 -21323 20512
12411 -193074 -18828 167534 -65867 -31181 47426 -93005 141218 -65682 144944 5539 -444637
12399 -323701 -135567 -271437 239360 -206781 -151191 -82585 -88918 56996 -230609 -171639 -83118
12387 -74850 139945 84430 156566 185035 -195359 -70398 341246 -376094 -30242 6215 106508
12376 106508 -159057 -106522 141563 -152795 74343 -89591 37994 -380263 160472 -72811
12365 -88380 -336868 -32747 -455904 282402 -66979 -257353 -72216 -113929 -77379 124742 -49454
12353 -357763 -62663 -72849 297651 486068 257674 64264 281805 174408 -303904 -168341
12343 -168341 -15908 106482 5985 33 -282343 -75161 57121 -150408 -29504 60616 125106 -130428
12330 325523 8711 227470 214461 -46602 26216 140320 -200613 -222270 75784 70536 -47446
12318 100196 -68768 34279 -29817 -7203 -217146 -20289 -187032 127506 -21924 -326899 -123467
12306 -60375 95574 35596 95982 3037 -4372 -192458 176559 352543 -168324 187838 -204619
12294 130659 124997 -144555 19734 -32559 116402 -257641 141279 218755 30141 -49997 207621
12282 85399 9165 85882 -36910 18093 -176392 88266 -89090 169531 232888 -214595 -35115
12270 187641 210608 -5103 67820 -17521 -293536 -188647 936 132669 -34200 212432 -208084
12258 207029 -73340 153701 61892 51199 -81531 -42537 -10128 10940 102853 -96221 -271568
12247 -271568 157201 493196 -11724 -450843 436253 -310963 142709 5398 -211675 -104730
12236 250095 57394 -375376 -83575 156937 191645 260017 191548 208503 454174 369578 257701
12225 257701 -93041 331172 399229 124077 -257583 -59448 90769 82966 418437 226191 59649
12213 216251 333802 85768 -175477 107830 17170 -103961 -48423 251431 125916 331070
12203 331070 -124983 162084 117377 -45874 362336 41107 134151 74063 128934 391971 -77607
12191 79675 300699 241861 -333131 375975 68248 257863 26728 276934 158941 76342
12180 182723 -104210 169181 79486 218600 154200 -29914 49614 163879 -21214 -46594 -115291
12169 -115291 -81431 -39751 4265 -181703 99666 363850 77961 302073 50875 329273 212398
12158 212398 35304 259253 -128507 308345 -87911 38366 -203260 78428 -447761 -34458
12147 34773 103597 73433 -202241 7471 590 -168851 140592 -96937 148062 -13092 78301
12135 72320 24805 3382 -197985 124633 81456 287574 -50910 177187 -252556 38559 164919
12124 164919 46574 11543 -428597 -69394 -16708 155493 76944 -355353 -130374 -306300
12114 -306300 -25530 -102260 -204237 135168 148855 155126 -44670 -320476 -190238 182320 -126450
12102 123482 6195 -137420 950 110218 203026 -139187 -88173 -179650 62729 -236590 369062
12090 -288936 -35999 655 69533 481548 -194487 156994 156710 -59189 125381 128542 131031 -8133
12077 60566 132363 939258 1697320 907542 31766 256466 -151013 201778 339373 -338265
12066 314986 -14943 97336 -63451 -179902 192009 48631 125818 223939 186596 24752 116068
12055 116068 168311 89748 313760 -338455 19938 1035 -10023 -36779 -168259 -165348 -101221
12044 -101221 54744 64210 -40430 85470 439005 147195 68029 216148 -108965 -271019 -109184
12032 -319218 -69603 154186 -104733 -138835 -40980 -163486 -276522 7091 90547 -50146 -314505
12021 -314505 -81784 -87320 276087 -78944 62639 58874 -251445 -3669 -48451 -91281 108450
12009 9578 -55176 -121721 -108084 -179730 -186964 53786 -360889 -7490 203051 -209507 -224069 170832
11996 -179416 26570 200060 -249818 -24500 56560 -239915 276171 -33039 -137362 19494
11985 -129497 -191343 -154031 -450152 -165594 -472028 -151776 438805 24641 -101625 127083
11974 295006 19370 -18461 60984 -45311 -72202 140391 -93150 104679 7880 -19700 -145888
11963 -145888 191618 100944 -22497 79904 -38275 64700 -338314 -296996 -115159 -264717 -118865
11951 -124862 -44715 132189 -86708 190206 -350572 -254635 122223 30351 -275205 -211481
11941 -211481 -317865 28130 110282 74345 32055 -144185 -11172 220386 -52004 69293 -40768
11929 4742 255079 28020 351867 -174899 87753 54585 -155797 96979 -63945 -146405 143398
11917 -386140 -71454 -52255 -206774 295567 64505 88348 -97946 -58121 -244480 -90223 113717
11905 -135266 -321539 -213547 155093 -96252 73544 259598 -2982 -193463 146928 -87639
11894 89239 337755 -309082 -418358 -387006 106754 -51823 115208 -265093 -159933 202840
11883 124156 -310862 219215 294820 -144509 194810 11627 -255313 158854 -16863 6502
11872 508963 -144992 -347695 66823 116295 -80378 -218136 -143053 275349 -32412 -285718
11862 -285718 -75372 -133561 -172363 -201760 -213388 -133581 -61091 -229812 -241384 69372 242500
11851 242500 216191 -95314 -180799 163464 34633 228979 109617 -78092 45897 -390814 -291818
11840 -291818 -187528 225874 -77741 -289855 -178397 -305682 -170892 -142478 -115503 52283
11829 -95894 -260224 339726 15201 52466 -307888 -396214 -302797 65090 -111913 118237 109050
11818 109050 180580 25206 -97175 69711 -157395 -50124 9079 -202921 67908 45319 88240
11807 88240 43971 173388 -69061 -243811 83306 57604 5098 -240215 -305078 -253499 -59883
11795 -5847 198350 -130540 250093 -150306 -43719 -26220 78329 -205724 -332951 -34451 23027
11783 -46100 -153423 116934 95967 144156 138668 304960 -89455 -130202 148311 195760 161181
11772 161181 48026 90521 -19346 -9471 -137796 76084 -100041 -16441 270719 -135671 20635
11760 -64362 235960 177856 34074 -279710 109666 160773 206430 -205215 -52303 -111089 58808
11748 -122758 -69933 73112 342740 -25288 12706 -164723 -73741 89252 -120181 -91328 68349
11736 51721 138571 -41815 -252978 31283 108067 -90653 -116552 -50446 68857 145528 286666
11725 286666 91732 -157479 -225765 145778 1721 -289461 -70856 173348 -103971 35342 -350779
11713 -42056 221477 230937 241143 145025 61999 74895 140563 -274672 -60302 321247 -19606
11701 13823 -16333 26874 138029 -48277 -352572 -155701 -3909 340561 -298211 -80038 33904
11689 -33070 -2367 81705 -88294 -53799 -9030 5705 -149280 8311 -149562 -157922 366020 269546
11677 269546 63109 49357 -102459 -421838 -100989 43865 -18180 -32738 18076 -53499 -31351
11666 -31351 59571 -133586 -144706 99590 51561 57282 -38668 -25877 49324 -94075 -160469 -19090
11653 -126462 31454 171425 256600 -111873 280428 93899 -71398 -49213 -60931 207808 -206635
11641 3575 -103926 109074 404552 97974 -154580 54451 -45931 63797 -157850 229686 174463
11630 174463 392046 124907 91845 -339197 249258 37349 29801 22124 190951 -50258 -28564
11619 -28564 -144733 -40524 -69474 -53359 96754 20516 -140414 -179982 261189 10965 185697
11608 185697 151027 -100388 129125 -19687 98716 344849 265817 126312 196806 -87334 52889
11596 -103081 -33488 218267 -777 174119 335287 -167382 108252 291435 305537 -8815 151976
11584 126814 153192 280138 373052 70199 31693 -318339 -46119 -256193 20124 172758 140812
11573 140812 415108 197274 397093 -106928 92928 54586 -201434 106263 146057 190068
11563 190068 38632 195966 232692 417920 -738 80196 -68939 -182021 146887 -68839 -107657
11552 -107657 299571 -301284 -165915 -132712 35212 3292 237768 370820 -64796 61690 -12745
11540 99860 143099 -132053 -227889 395681 66991 230385 -241965 427720 -88922 155874
11529 207521 204948 60017 27656 -1479 7929 528 6758 -227171 -219744 -188627 177709 251996
11517 251996 -31921 -75385 313941 -219340 -327717 230356 203237 140141 171785 -147324
11506 346116 256195 112729 108470 293960 334871 96864 30078 397814 63277 385854 525891
11495 525891 -219961 326216 168173 122154 565531 -30674 84957 427778 -49204 21563
11484 -132840 295293 -79757 240226 -390852 198756 82003 -106820 151530 -340037 359213
11473 -270331 212541 41422 320410 212148 241772 241458 168024 -3498 -11968 18956 141385
11462 141385 200391 -228918 333371 412182 -113220 204370 24046 176697 -219292 236430
11451 -112637 3802 91135 -97737 -125158 122321 137231 232744 -62090 186725 -51126 447873
11439 -55801 180492 -19539 49852 251631 -74622 -44147 118033 -116978 258125 -45025 -211191
11428 -211191 229916 -263944 167661 -162830 247585 -325101 74004 -98815 -129439 52219
11417 310469 -61711 -203874 -257448 -27244 -205566 25142 370 -139003 -223526 134124 -210064
11405 57898 294782 31997 -235232 -41392 -112644 29793 41397 124415 -222814 7043 -7788
11393 19893 131907 -215873 -147130 87595 -124877 66992 160309 279040 -264651 -76589 26535
11381 -246184 277553 284372 23122 -5143 -38878 -60748 320438 -88571 -8211 -69256 238270
11369 -67079 -423473 -300257 -106432 286476 -208169 -228296 -86543 -203342 43726 -43314
11358 -268027 -266838 17806 172987 -93620 132637 -197999 -281817 -137889 150654 -7536 11301
11346 4162 -89231 154292 -248483 275078 176954 -489059 -84235 91187 36644 -41821 172240
11334 16061 175294 -14882 238845 140462 -367852 102753 -84171 128196 -155352 -25932
11323 45971 -21990 -105991 106086 -198 15484 -47686 110765 -79574 -83348 -312509 -48756 -367720
11311 -367720 -120320 182464 60894 94528 -73035 -48145 -190688 64495 279707 -24499 51020
11299 -114643 64958 -3955 -214461 -206722 48508 -35151 -71924 42174 -194555 32726 -16069
11287 -24673 -136799 54587 -37233 -58033 171769 -300171 -222757 -264093 -127975 100321 -39697
11275 164997 -84530 315612 131573 -19293 -501024 -155827 -27203 9741 -23502 -167809 -147344
11264 -147344 110265 -88762 -153633 273118 -181312 -39406 229340 -192340 131639 -142927
11253 -197299 -234043 -227932 35114 -9833 82810 -398712 115494 22835 15464 -370830 269734
11241 -124335 170836 150648 -93364 -117186 173727 -22015 -141787 289908 -189809 -301973
11231 -301973 274891 110423 207878 -317666 121680 -87112 -101998 27432 260808 -277682
11220 -235729 -354646 61831 285958 78297 -349600 -80614 -35261 -148579 158775 86555
11210 86555 -142629 145121 86313 180098 -23369 53671 -37356 50081 176189 -95101 -90861
11199 -90861 293267 -82190 82370 -135265 -44052 257015 -106259 -343895 -277885 128105
11188 222562 229237 117122 66518 -125039 43005 -205683 -40803 -192806 40888 71284 -9089
11176 -67007 -112685 -97461 -244010 -237075 140210 159113 -73289 -39608 -7860 213612 157565
11165 157565 -126438 -52361 -347683 -155902 -346774 -98997 353503 13950 -52734 108758
11154 -178760 146389 143816 -8892 -541 83383 -52941 31863 -126556 -5707 -379401 -62609 120061
11141 -250479 30390 117898 -167 -276959 76401 -51425 129090 226984 132561 270806 -280779
11129 132554 486433 -312022 -90997 -48941 240059 231632 268964 -275238 -221752 23352 79568
11118 79568 34915 62250 -105221 25912 -190667 184244 -11680 35149 219693 -14072 -65420
11107 -65420 312782 243512 212792 -253491 142548 -13159 134847 15324 -205270 -7528 219985
11095 421666 328717 458260 362453 -74189 119168 189800 195539 193912 -60689 -12934 17514
11083 -136468 223866 461682 359377 541087 439644 6112 284013 113617 -152749 82339
11072 -191853 71347 349941 325377 644222 459154 532553 127496 357467 396100 351344
11062 351344 155766 378349 359350 176968 469504 820357 557916 114201 672195 375944
11052 375944 395737 345106 640257 831218 541128 499848 811970 892280 714807 514010
11042 514010 859391 314818 759027 756010 466653 626053 442259 304319 564452 918790
11032 918790 387456 444825 713079 591339 439778 899242 608860 933278 768210 468196
11022 468196 848893 506169 427576 462679 605051 864682 688231 836595 495918 402773
11012 402773 570200 495451 452638 717333 501896 474114 491945 478055 714015 790574 206273
11000 271851 537425 671786 633530 671872 375344 301087 632849 667886 492370 691780
10990 691780 627360 801605 951041 571627 1075199 679987 1031495 1036063 1263905 862595
10980 862595 1117919 1307590 1174879 1244104 1402580 1873712 2328263 2645896 2537923 2683673
10970 2683673 2567302 2647499 2494255 2357519 2144049 1984561 1894217 1753947 1788134 1715721
10960 1715721 1467030 1605277 1504892 1741947 1859726 1626455 1597296 1037426 1305644 1392967
10950 1392967 780760 821827 593345 189362 635626 294735 212101 184826 374423 299185
10940 299185 73513 253937 108557 158733 -18211 -190351 61748 -198358 303604 -82013
10929 -82956 148193 -886 44530 -81289 -183693 -44701 64453 249853 37416 205460 -63897
10917 -54435 245338 251571 211239 262456 -372931 237200 -157348 -134227 5313 -47987 267747
10905 100159 -66409 -242990 201780 158127 187696 -199952 -66328 40002 -191976 114697
10894 -33117 -244078 88631 -28680 -36877 78311 107953 -281332 -75841 -138725 -97709 -52961
10883 -52961 -288654 -323114 388547 51762 86454 128917 -72005 -118071 -128385 -376259 -106810
10871 25075 44502 9576 -264112 40318 -186234 -13172 -61974 -100164 6433 259090 154132
10860 154132 -53822 -339627 64427 -414408 -423226 -205632 -75544 118656 167937 -83281 -241364
10849 -241364 -163990 -117556 -39434 -310467 158435 -40180 -79290 159768 -392627 146117
10838 -145416 48921 271601 49948 -245989 22344 -343612 -259512 -127687 -202864 -166471 -56323
10826 47129 -72853 93665 -93207 91695 -226473 -194788 -217556 -38937 -2563 -43393 -209041
10815 -209041 -78893 -163316 -125666 10369 -77231 327085 -25508 -5833 -270305 -61269 -225618
10804 -225618 139218 10171 174174 -478508 -95310 244613 -282337 -240452 -3841 304096
10793 74244 268852 135716 206762 -44682 202590 176824 86129 145563 84506 -331488 64875
10781 150897 51859 10104 -117796 -393753 -68054 -248878 -172717 -39586 57753 241359 -94786
10769 -59744 438637 154699 41265 -332101 -524094 -69124 54411 29648 -214117 -259923 42623
10757 132788 284976 43353 -155436 80036 252415 -52161 -226662 -149467 21907 84387 149546
10746 149546 194788 89992 -287304 40598 -284649 -200103 44082 363922 -231121 228520
10735 -6251 -36700 -94359 131412 12670 -502364 27886 -137296 -12858 127462 -281009 -376314
10724 -376314 -215708 229122 -105371 -62017 -310139 -141075 -149663 47316 -81775 -355246
10714 -355246 -66600 -66909 288870 -93951 12514 -44141 22015 -322202 -257598 15865 103685
10703 103685 -25160 -24661 -182403 -189189 -119326 283851 285128 -37971 61493 -216163 -292865 -62542
10690 168043 -16293 -511601 311363 148115 9527 66355 -40982 259131 -7872 208781 -20331
10678 -78157 -393661 88124 -86353 253559 -186123 -58092 60007 -262064 138002 217049 -194017
10666 54365 -273381 -21074 -119730 57089 -408568 295067 70178 -306225 -208 150438 -226484
10654 -192515 -11177 -294107 -346293 -229235 -98238 -346991 189041 84444 -251327 -19768
10643 59694 -399732 -103998 206862 128728 -16762 55911 31476 70568 -135390 152110 172580
10632 172580 159695 -56890 -17294 161518 -245904 -67143 -250621 -53782 -15021 -140858 238382
10620 -215850 48572 -291215 -27420 127407 82336 27490 376006 396762 117072 -39897 -372207
10609 -372207 6319 -132437 233092 -264052 -378143 222203 69679 128341 151203 -282901
10598 -288097 17876 -245038 -30661 111156 -243968 75816 111176 92600 -244920 -650758
10588 -650758 -259889 -64121 -42563 -134070 -33572 -223272 -36304 -269638 -136949 -132230 -288762
10577 -288762 236201 -320432 -10096 295125 -56107 -238441 -234069 39035 -11429 -290822 -303225
10566 -303225 -105216 -65491 2634 -302801 -58079 103396 132372 53323 -97600 -83318 316604
10554 104698 -147730 -231458 298836 -434521 -20717 17635 111326 236776 -21439 189774
10543 378166 -312644 192610 -77299 -300095 29904 -100520 131994 188450 -49899 -28558
10533 -28558 48309 187943 357071 125302 8650 26327 25871 102369 22176 16821 217117 -59047
10520 95820 145091 194089 68115 -289427 -118529 120391 53533 -92995 -112076 -37939 -78254
10509 -78254 147682 -408223 -27224 -277680 -342421 199984 133890 67972 -479661 97248 -125482
10497 -231269 -149015 -321063 14908 144364 -67194 -355270 83158 -432977 -911 169180 -168412
10485 64928 351860 113265 227653 367217 347700 484876 591659 19694 221931 306057
10475 306057 -102102 296438 9837 356656 -313403 -113423 -342323 -439423 -3685 197579
10464 -268313 1796 67560 -129162 -274889 -405747 181413 155067 97806 329028 -402644
10453 -178689 345013 241781 74550 10689 278463 -122217 231465 -325386 -97121 -90273
10443 -90273 328007 180710 -226927 201735 -175481 -338211 20038 -87491 -219555 348716
10432 -128832 -44800 -104595 -8206 -75061 -18074 -182184 218124 -267104 -249737 153818 -350730
10420 278738 162319 137318 169852 37108 -216373 -55283 66486 50758 2646 -61375 -83598
10409 -83598 17922 209984 179981 -201047 -104947 3951 272370 -27213 118658 192327 -35597
10397 -195163 75208 64891 255677 7778 10755 69040 9285 -8678 88102 -227401 -24259 -105078
10385 -105078 -117266 -99791 -66943 100098 -41611 230868 132087 -70111 420442 -153713 336407
10373 149581 16652 183386 349019 94671 162877 216468 334998 192534 386613 321922
10363 321922 372483 93960 -17448 146562 178283 311788 293254 179730 292063 422436
10353 422436 365593 204575 182881 511666 297266 55225 55916 269544 309940 227595 -5141
10341 203055 387621 63186 150455 341120 121459 145520 197936 296825 424044 73204 -158326
10329 167988 -67852 -305651 -17665 25600 -157213 -99815 127359 240452 399387 27791
10318 107759 263842 -155871 68078 24154 304516 -14178 109013 59239 76437 175475 99126
10307 99126 -226594 24095 264237 7943 231020 -25814 -235801 -242909 303328 78753 -121449
10295 61909 172966 -136388 -130452 224032 14708 -134348 -185930 -30754 97275 245439 -223758
10283 -197671 -30634 132359 -329307 159020 -88345 -1613 99554 167781 -50690 29383 57096
10272 57096 40505 79236 -307117 -316043 -225766 280935 -454289 173616 135952 -20024 17512
10260 417979 58132 12895 275141 222131 403231 66121 197770 -10617 -276442 -89455 -43318
10248 -11480 200749 3532 -34084 -125071 -110231 -122766 316480 -354224 -87374 22622 -21078
10236 -267382 35195 -250205 81849 89958 1555 160183 102811 126774 -162960 -1644 -11572 -5383
10223 -144486 -243174 -44747 -508598 -164526 101711 -167021 99745 -93691 -81905 -126500 -59101
10211 14758 113842 -24563 -197236 -171927 87428 -59156 60311 4258 -368777 -4225 75186 -426309
10198 -44333 -251812 -150488 28785 168937 -150539 45767 -289961 -112546 -209340 -498147
10188 -498147 -74470 240794 -121039 -96784 -160397 147925 17074 -51209 -116755 -250319 -246893
10177 -246893 21462 -106416 230555 -173220 -163541 61689 -7551 -239680 -25433 9608 -27695
10165 18523 -211156 -193193 90635 -121680 73219 2528 263407 -87250 217653 -60122 -86948
10154 -86948 246434 -214096 -29392 5763 243798 98573 52112 136798 -123305 -119053 -132476
10143 -132476 -219133 37197 -131216 -261346 -236918 253000 -158311 271920 80818 -18766
10132 -118508 -173425 -93630 -108219 -23820 -233193 -112640 -17705 -359911 -13803 119191 -72654
10120 -118276 -20665 -348591 -261359 137566 -130573 -145730 52348 18857 -34035 115154 -238201
10108 196950 -127515 61888 98571 -56662 -22614 -442374 -130560 -258151 -365244 51356
10097 -239354 -116011 -368545 204403 -296642 -136985 -317551 200130 6304 8031 -189341
10086 -67905 -24955 -79256 91746 -244441 -463744 -222428 64173 -172565 54088 73677 -116895
10074 87218 -286213 -238081 -388172 -28796 -32565 11454 -216629 -67708 189373 -23634 -45181
10063 -45181 4749 -12142 -64697 141051 248868 4043 -72591 14028 -93908 31854 -63385 -234615
10051 -234615 -25237 -81781 -249926 -181054 -42816 -231280 -84637 -385876 33127 -165736 -41812
10039 -193768 -94306 -59166 6861 156175 15361 169069 70665 209218 11245 -164115 82289
10027 -180322 5998 218729 87651 -119122 58887 -156620 -141575 233693 -164594 44537 -181079
10015 -225711 -69866 197555 -157730 -50503 -125620 71266 7130 -191040 217585 130176 23042
10003 255965 -72333 130790 -101721 -286061 -175576 -151532 -352111 -225552 -214264 -69687
9992 -224437 -108789 -43227 -48867 37451 -254754 211807 136435 17514 -87847 255398 -125871
9980 -147944 112800 53818 162783 -144395 -458229 -123486 -315214 -58273 -224552 -56589
9969 169134 174311 54390 -550172 155052 -144123 37140 -188517 -330694 57803 -50003 -159065
9958 -159065 -54360 137904 37416 11205 364107 -74547 -191419 -119792 -139428 -334784 -278985
9947 -278985 46862 389743 -128684 -306439 -97653 101091 -192214 31868 98223 73372 -160870
9935 -30815 218607 -122446 -49194 -210000 390465 -8277 -153517 -266969 32209 101459 204520
9924 204520 -258337 296346 30991 -127472 181014 116418 59481 42380 -190683 83101 -81395
9912 56146 -438710 30043 146144 253178 -36682 106978 160437 -56024 -154669 47706 145135
9901 145135 -131429 -49683 -131617 -109008 -151227 -75215 307605 -48473 -39889 179551 256694
9890 256694 -333899 73044 113002 -222584 -364794 -79596 -14056 24436 -350394 391817 -312551
9878 282339 -181211 -567177 4677 -348325 -189487 -296597 -117877 -190050 127987 131213 75438
9867 75438 -47941 -7190 -265776 62825 -400846 21954 -341617 54890 258193 100065 17027
9855 -252421 -69325 -83693 -95751 -179943 -70743 -26872 77936 -54820 41208 -282527 -243029
9844 -243029 -187007 -178962 -202817 113535 250677 -147470 251245 -106190 -67729 -6565 -214218
9833 -214218 -331007 -502887 24831 169156 145776 -23102 -267791 -15077 -230480 25196 -255639
9821 95276 -112596 107572 104570 -104231 296057 -7981 32316 -154488 273980 288674 285668
9810 285668 84897 -283610 -182354 -191798 -1648 -120746 -360633 82126 -147428 -2636 -94521
9799 -94521 48808 -12960 70707 -4378 -187729 270180 157188 96051 -26888 -69878 313170
9787 -84416 -30084 29828 -25167 -185765 191156 -375535 -189036 1149 191740 -24182 357630
9775 -142619 436039 11387 -55136 -408166 -66605 231308 -237908 81492 17784 -57748 -85899
9764 -85899 19325 13062 -239051 -31373 -164614 -145264 108217 -187672 57196 -51949 -363550
9753 -363550 -67208 250998 20508 -441170 -162536 -146086 10986 14623 261512 -44239 -292872
9742 -292872 -108115 -63148 -53617 42100 -6686 15105 -149591 -317218 -190521 -30735 -208350
9731 -208350 -78979 43467 -116719 122982 -166970 -408568 354060 101365 27535 -72921
9720 -180682 -281739 -93547 -329481 18470 -137852 -166194 176444 -140720 -159182 66432 -347365
9708 -350866 216092 -41628 -138696 201925 130686 -42606 -259513 119389 143591 -66790 4934
9696 -20941 58190 -77155 -85371 -94267 -97992 -150699 -24197 17273 55124 23528 167810 -88644
9683 39585 -70063 41948 -68322 -100611 -27923 -443949 -133895 -342768 191130 183478 343297
9672 343297 -216981 115093 -173550 -10261 -56153 -255536 -11195 44075 -160268 8683 -128272
9660 43719 -115120 -23369 -328466 -33528 -485142 -37963 -249969 -252456 -180798 -162555 148874
9648 -151511 97707 66245 -66114 -102493 -266269 -50868 -49240 -10048 -379574 -125199 -130203
9637 -130203 -278784 87358 -39013 166919 13623 -184856 -34430 72678 32807 -332492 -160928
9625 -106877 -236602 -42041 -23275 69787 -13442 -93853 -106814 -224293 -258165 78917 26598
9613 53433 416529 -390453 -191094 181828 -131344 2822 66456 -42323 -41678 336162 -115813
9601 -78364 -222607 84796 64853 -527720 4898 -190472 -317173 -156783 25025 -193980 -27435
9589 58515 -120456 11020 38833 -53076 56708 363083 161729 59820 -74492 -250902 185380
9577 -439318 120752 -229548 -40260 -193969 -240097 144168 -40750 92142 -574532 -63927 -41247
9566 -41247 -222824 -359474 -346575 122155 45353 -94106 -50253 144015 -43317 -66166 181041
9554 73640 -274552 -204449 -107041 -21527 114756 140750 38875 -191828 220182 -241792 92725
9542 139044 -11679 -2177 205498 7049 -298813 95172 -273214 -322502 114197 83364 19744
9530 -201187 -200360 -117750 -22044 -126267 -312316 -20695 -37256 -2197 -375406 -1236 -110644 80978
9517 -234506 -335449 -300990 -103792 -212794 -95413 -115163 -8970 240659 -243353 238900 -174920
9505 -230013 -6249 79321 -295062 -177564 18357 -71063 -67904 -60383 -427355 -11538 187555
9493 -244784 -374302 -408634 17129 21825 -229297 31880 -295856 167424 6767 -86772 74731
9481 190589 120119 47332 -110973 -56659 -118103 286811 -31491 94612 -340943 244587 -254565
9469 -234192 -412929 -57039 -158536 162386 -258545 -118721 -87331 -227837 -14325 -115910
9459 -115910 -50513 114954 -199682 -25514 -226883 -272196 -58259 -154589 -189528 -28578 -125162
9448 -125162 34899 -68903 -70973 -238322 -134549 -25317 -177996 239716 292992 -485999 -111750
9436 32654 -151438 31124 82494 211637 53081 86251 96094 187703 -197650 76 -94634 242880
9423 -141446 -138195 -403813 -130195 -246381 -122990 306230 66289 -158645 -205658 -88109 40645
9411 49330 -94083 2937 -305124 -20661 -347527 -42058 293856 -464120 -155756 -374058 -94263
9399 -102198 33575 361573 -164379 79552 535192 -351205 -207512 106868 205568 -20384
9388 -15612 -96742 -242814 70313 -2775 5842 7130 -117018 -49042 -324427 37234 -3441 -231295
9376 -231295 -249350 -369657 -49363 288926 -270687 348672 -57897 -27045 -103469 -313505 -277093
9365 -277093 -220697 52984 -94663 15453 -5662 87375 -32785 -212091 10478 -64248 48242 68473
9353 68473 -382 181632 -312422 235760 2073 -127653 46925 34320 106791 121994 -287899
9341 240020 -70880 87288 34240 38237 187830 -370164 -181333 89699 91076 -256770 -78638
9329 109086 160128 -22614 -173914 50453 -361356 -297964 131544 -270328 46553 -166206 -97361
9318 -97361 -339165 112735 247504 167721 -331167 -381263 63853 16840 -121014 11194 96831
9307 96831 159123 -115526 83848 138694 75160 -379916 -321706 -135591 -156562 -50003 106336
9295 -44366 57527 352855 -69446 -92358 -53189 153568 -165703 88423 -116854 -5071 146064
9283 -61612 -195080 -108229 -231804 84261 180500 -86231 -211927 -282173 26496 -148846 -233562
9272 -233562 -190037 -82581 208888 439093 19661 82367 -52715 -119872 149654 -225695 59746
9260 -389049 -55138 -269853 -93945 93536 370733 -80384 72628 -140400 -136290 263261 -8736
9248 182652 -100280 -39065 100137 -83008 163280 -149967 79510 -273064 188331 245885
9238 245885 -195422 99246 -6760 -308483 -68849 -196257 1479 -155678 -98558 -199439 -246923
9227 -246923 -308041 -269558 64543 -42545 -240912 86919 282180 -192332 57983 -250081 -123085
9215 -225292 -229696 15111 -124728 -122854 19271 -41685 -35835 -300164 -181231 -205608 -416317
9204 -416317 -129694 -11182 -100298 63511 -254647 -392402 -159032 -124333 -275091 247774
9193 -169546 -178429 -50634 -71496 286069 -259481 -164348 -246935 -159127 59754 41281 -100840
9181 -226516 -96635 78011 -432714 -29599 -79335 27477 -149557 -111368 -106661 -279124 -215311
9170 -215311 -142114 -208029 35772 -30883 302224 27390 21850 100136 38669 -240316 -534182
9159 -534182 -360149 -323412 -160062 -165256 -27822 213036 119016 -163215 -236349 -346683 -157629
9147 35604 62318 105705 114881 -171938 -173578 141707 -129263 18775 -603724 374355 -32029
9135 -238809 -117165 217569 46406 125069 -126492 -42006 -262601 -183281 -232033 -199072 11890
9123 -222646 69922 -62432 211500 167432 -208865 234618 -23312 -166386 -187089 5594 -106030
9111 -63218 177819 -73564 -276448 -88560 -61446 -136197 -39432 -288721 6382 -214328 -324697
9100 -324697 122373 -382895 364084 -261855 -297198 -22054 152115 157508 -283084 -126905
9089 -71404 -390679 -55058 224036 -127025 -81992 170490 -263398 -152429 -431995 53105
9078 -105664 -175045 48320 -78349 -141986 -7665 -233603 -131337 -28452 -55495 127519 -28087
9066 -108885 -134920 -427056 -117200 -252350 157253 -83774 124041 -68087 -192324 1789 -10736
9054 10923 118880 -150537 -172762 207827 -215217 -132020 -60152 -63066 -59373 -200541 -352222
9043 -352222 193340 53001 -89989 20925 -183334 238171 139194 302072 65214 51224 154711
9032 154711 -273005 -519897 185321 -147478 200156 -182336 -213232 71703 -157383 127072
9021 273103 -189918 -1198 19034 -133533 182886 -79054 -140730 207625 -67623 167708 -155856
9009 -6062 -61237 -164744 -100400 -196566 49497 106359 -242619 15770 -132399 340081 23112
8997 -187666 -357736 -262816 96951 -84825 -13572 -130664 -38073 77758 -347213 -17900 -217542
8986 -217542 -230618 -143828 -209533 230447 -210868 -54294 -180651 -346817 150829 176755 171095
8975 171095 -225081 -315506 -275363 -227393 -211868 -53143 296445 223032 -329856 154816 15913
8963 -74374 -259392 -259629 -261319 -240825 -167162 116368 206565 -458852 61705 55250 -200575 160695
8950 -195644 -174953 -231524 -258845 -172802 167816 -212790 -211526 165811 75639 -274652 46666
8938 49189 274935 -213492 -103300 -32629 83013 -127415 32544 97591 -54378 -46316 -273788
8927 -273788 -185286 -103620 284221 545411 1299385 4745666 9337785 2758850 1140004
8917 255846 427302 394857 -122274 150949 255890 -326122 60773 -358869 -21462 275061
8906 226453 -20988 -173030 20229 80661 -244816 111007 8502 -118970 -29117 -174946 -11327
8894 -61678 103877 -249640 127650 -203738 -322022 -287739 -36755 -230089 -146528 80685 -275996
8882 -184145 123397 -179518 -96173 -297688 -138032 -15572 -53056 64505 2354 -246908 -30547
8870 30862 -485846 245630 -100535 -91502 117478 -68051 148615 297108 -70846 -22769 -39669
8859 -39669 377260 121185 110188 -236697 -40003 118036 -34486 -91968 170268 -168977 228557
8847 -128653 -144447 72498 -116761 -97168 49648 -112972 -25822 -209120 -191653 -11761 292849
8835 -31133 82988 -124898 -92188 25674 172495 -205192 103901 24870 -428910 100712 -12320
8823 151705 58094 -218788 4867 -166111 43343 102467 -60222 -205210 -46352 31390 189350
8812 189350 -234953 -17215 -61799 -49990 -88243 247668 -153352 -121148 -40286 -282060 -180550
8801 -180550 -18489 -78599 -107913 146558 -293376 68589 -36007 -111080 -180892 -19157 -84341
8790 -84341 11440 -24206 -125942 -230038 -157158 -186938 -154323 -346595 -385504 122242 -188529
8778 98427 88688 377293 36022 -92908 70983 175139 -137380 17769 22169 261289 -71538
8766 -125520 296426 102735 212706 -66160 153005 -398851 -151970 -244691 -29821 -251239
8756 -251239 -287670 -118771 -318925 -159292 351991 19058 -168386 95230 142039 -77453 -611865
8745 -611865 4641 106642 -2007 30284 -83068 50293 43677 -39574 94739 132700 -64864 163768
8732 -311477 -115098 108227 -276853 -126770 -2062 101306 410959 174799 -42890 -21588
8722 -21588 36352 -131597 -207859 -71991 -95861 -168747 -163556 42807 -45078 -17578 284980 85491
8709 -278130 170269 -177689 -163445 -217659 315686 68831 89596 22780 -105373 -60212 -163343
8698 -163343 55274 -190446 -220534 -1700 181291 -71492 -15429 97050 -45753 156574 -15804
8686 -7419 191611 -60020 -22710 88892 176374 151001 -703201 -179846 79977 -280807 -699646
8675 -699646 584208 143628 -5191 -398721 -294864 -232122 -258523 79564 4442 -294965 -706
8663 -201333 163920 58107 -246923 107130 -187614 46253 82471 90634 170724 -28881 -57847
8652 -57847 -304873 -4740 -301754 -12357 -95839 240925 -49283 -283614 -57809 179362 -106112
8640 51844 178341 142040 -24344 253712 -45324 -71726 147808 196196 -36952 281154 -135667
8628 -284210 72565 -289 -42710 -103277 -242282 181864 11006 210481 -70104 -251227 -142845
8617 -142845 114770 137224 212534 -395200 -267770 -53826 123238 -43355 -200353 -326408
8607 -326408 -228280 180894 -229380 -374627 3988 -277900 93011 -87276 -216977 -73088 -276666
8596 -276666 78370 -126548 -147409 305703 -133011 118002 -16315 247231 -198415 316733
8585 72788 63667 164333 -38691 7765 96998 140121 -76407 119326 -121380 -234911 -129866
8574 -129866 56171 -212409 42328 -95555 -200990 1420 -228272 -147941 -30131 379549 109959
8562 -187281 -253865 71394 -38107 -145314 -438747 -101724 -201271 71486 24264 71846 31343
8550 -415639 267157 -2487 -1336 89551 -186940 -404586 299581 -47271 3666 -31942 -56281
8539 -56281 -272054 -57208 -8858 -374662 -105793 224923 76863 23571 -8684 108640 -313888
8527 -113379 327325 -149335 -209312 -418003 194460 -15862 -362584 -355942 113495 158065 -43256
8515 61726 -27297 -61786 -146197 -50776 50905 19035 -98427 -117456 -247544 -218261 -164621 -91065
8503 -91065 257543 -48771 236687 197241 -99796 -36943 -110886 -7399 -35522 -350316 -24395
8491 -366028 235225 -133975 -474121 47672 -103127 -239382 65821 -89925 -21717 -135656
8481 -135656 -338301 154910 215824 -100627 -115409 12788 -65605 -387576 280133 168065
8471 168065 -75905 -239381 111673 -171154 9282 107925 -44471 150892 -345644 38755 152923
8460 152923 122026 309451 -155474 -470499 -149616 -73531 -79352 -265308 -26489 -140427 102026
8448 119543 -188412 382697 -112941 -76611 263030 12625 -332043 -276526 -315142 160466
8437 -180265 -148614 -235565 284905 265526 -175923 33136 -102556 -167806 92772 -62333 91865
8425 -121006 17035 531211 151411 -107579 9201 412207 -10483 -263057 -112353 162029
8414 -99377 117591 -135262 33674 126525 436092 -65023 -101311 -310520 126735 106369 -76652
8402 54357 -225966 -15801 221740 -59761 -227162 -193922 -425892 -199783 -243090 -69760 -439380
8391 -439380 -18851 -494837 39871 50517 -193736 -71322 -38725 -285926 72012 443667 44750
8379 161559 211781 -64508 1679 -185894 -104503 -105991 -222028 59469 -48131 28365 -204441
8367 -43579 -29103 199292 160515 95556 -344481 -27066 47058 -263678 197384 -291968 -127695
8355 -55633 -88893 17308 -236174 207035 117807 -248066 100470 -75169 35938 39074 12266
8343 166859 -11291 -148033 -193391 -141265 -69326 -261065 -42431 -2325 114124 27208 -26249
8331 138206 -377012 -118791 -172028 -38250 -155440 -53727 -114817 -28035 -141991 143874 -258848
8319 290630 8285 -384781 -164144 141939 -236751 -156332 -209890 63289 75379 155428 -10375
8307 -203766 22610 -26501 263602 -163151 59765 -18398 132892 92129 22248 157212 371648
8296 371648 39878 30226 21291 -192286 -203008 -123613 262475 -64879 -74453 317730 -290464
8284 -243358 249807 95204 -17194 -346959 50943 55974 -150081 -77710 -343146 -200830 207325
8272 139567 37514 -395487 -152749 481112 -91934 -23983 58538 185654 -61495 -193698 -498282
8261 -498282 -91896 -191141 122298 141609 349247 51487 -122791 205296 -295019 126475
8250 134808 -186600 200462 -53468 -52998 -63036 -100565 -47431 215985 237678 154646 179472
8239 179472 -263502 -233254 63506 19574 -178798 112346 -89942 -238252 42559 -170777 -428090
8228 -428090 -66276 -70469 145646 -201006 -109272 183082 -90028 219741 -27178 -137459 -9630
8216 -481767 -65600 79775 -75821 253110 -40218 -95801 -104359 -28080 84815 -28539 19075 32989
8204 32989 132738 126331 37423 -215291 -42526 -69315 -360818 142407 185368 -105529 -89750
8193 -89750 -175258 -187212 -225917 -189619 -94736 75594 49246 90732 -122320 -111295 63798 120540
8181 120540 -222307 -357785 -161096 54380 -76168 -95342 -156063 -433532 -36156 -143032 -14987
8169 -103570 -88931 -452363 -131287 -79426 -136842 -45027 -182672 -25539 -242975 -97980 71321
8157 -32152 -35339 -138531 -68897 332091 -38354 130792 216932 -158196 8278 -13277 -416 -161158
8145 -161158 -97103 24369 146954 -51463 -239875 -197703 84930 -47779 -28031 146947 99996
8134 99996 -66724 -261914 76072 -132094 -174974 -377087 -74195 181391 -11770 307039 -186328
8122 -272388 -114047 -74489 -183749 468751 -60949 231910 159201 -322098 61184 -142745
8111 -257566 49647 -98889 -416880 -62477 79979 -136650 188998 -250336 -82107 353759 -16189
8099 337268 -138086 64274 -294036 -75180 6434 -6300 -335612 165448 -119684 -122938 -118723
8088 -118723 -225225 164372 -138227 101845 -41105 -196715 -97889 32805 33045 -176760 391613
8076 -262905 -142502 102217 -79303 161884 -340757 -27749 -44533 -150220 46972 -79010 15286
8064 97563 -356078 -150599 497972 40260 -72927 15299 60869 -168943 74793 -118254 -7893
8052 -170951 -101140 -108371 -134278 -433006 -130701 -203181 -72908 -126553 -111203 -137900 -315340
8041 -315340 -60717 -111022 96642 236993 -95973 -302329 -28721 -204403 -103845 -260619 -186631
8030 -186631 92785 31992 -9853 226287 22501 -40848 -248030 -189908 -200885 172059 127776
8019 127776 -143058 -117462 -260546 -220013 -401322 -43574 -201216 -294237 23280 143674 33557
8007 84820 54795 -137233 -16088 -30988 159743 -112376 -248869 -181271 -377713 -11027 33775
7995 -60992 -154079 49952 -66604 33645 166856 138774 78241 -370051 -13204 -12615 -168581 -99403
7983 -99403 194499 -186533 -162845 292981 108851 -2040 107166 -21069 -80489 -128527 -41723
7971 181095 7606 -18165 -9227 -284358 85084 -201904 382410 -159607 60514 -232068 -204639
7960 -204639 -283555 144569 -149662 -104800 56360 -219014 69025 252332 -131816 -95756 -186971
7949 -186971 -115954 -240187 -204128 47507 51128 205155 -109301 -49359 -118287 50379 28350
7938 28350 -348619 24336 171716 -63895 68434 -113471 -123319 -75944 85900 -163586 77452
7926 686 -282187 219033 -91469 24429 327226 155515 92306 321207 226091 13465 -387873
7914 -280067 -25980 -156228 -47707 453763 -336790 -117770 124613 -313996 -18456 49888
7903 3678 39646 76180 44405 151408 -230122 170475 63170 28649 -152660 268634 -112116
7891 104395 4617 -240983 278577 -311255 -25025 125052 -21715 93861 278363 -18753 272761
7879 449952 -104787 -284353 -104467 -75378 208312 -39740 -371367 151848 48165 -71033
7868 -641 50604 -385699 -328126 -106042 -116007 -213981 103429 -322646 -53055 79033 -232067
7856 -75834 62975 21349 -1101 43011 78043 -7514 -26510 165423 29854 600857 -108906 150032
7843 -170036 67631 207173 -64238 -27488 173481 -157804 18787 -59064 -119423 -412993 84314
7831 -74454 -189607 59000 208092 51577 11254 -66591 -202951 78129 -108315 -181106 -377128
7820 -377128 50703 -34591 -258924 82129 -257893 -300113 53799 196247 -219776 -178589 -186313
7809 -186313 -54221 155664 33379 75276 10660 -87693 -305805 -110604 163617 103585 -18071
7797 125219 182506 -288969 106882 48547 110035 253874 -74479 72428 -136757 17618 -71647
7785 -130156 101451 -317929 180924 -53197 -100996 95029 121077 -326595 -263338 204569 160726
7774 160726 212049 -115542 68760 -260601 68504 179963 -63027 154321 -386436 -542002
7764 -542002 117439 -141584 -125554 -138968 177121 -20963 54823 -135732 -441855 170854
7753 -208451 48925 -27709 -159294 143894 -6923 178950 -35948 -221450 -18779 54807 89338
7742 89338 53624 -408002 -245175 -80965 -519603 -18475 281085 199464 74194 69200 77522
7731 77522 -94586 62948 4929 148924 -335369 -162981 -36835 290831 40797 -16124 -55236
7720 -55236 174912 -211883 292117 9890 -135799 -90178 -107606 25116 32590 -295932 -152648
7709 -152648 -58367 -34954 89674 59000 -189754 -92487 259693 205033 -381391 150288 115557
7698 115557 139752 140493 -288563 113040 -243960 -73639 7075 144131 -280964 11894 147885
7687 147885 38926 -3884 -83078 319985 -33623 -450965 121327 -65394 -19787 48534 69120
7676 69120 -63231 300807 -101640 171982 276387 -266053 -51848 298628 -53784 -65505 344065
7664 -205984 71888 -28220 144396 15136 -297306 -532145 -5039 -163163 118042 377350 23301
7652 149262 112732 -119159 -32827 -251227 53782 -6448 -186980 -119228 173928 -261252 -17183
7640 58477 -35031 177115 -40250 -25464 82384 -295166 68297 35276 40786 -86616 108753
7628 208086 -156416 12441 -187676 301112 -48247 278393 195441 -86572 -10428 -171130 18653
7616 -302503 -274986 340401 -84988 92241 -79292 -50050 -289928 -157507 -19336 184839 -333451
7604 -194350 -103636 341828 -213197 152154 -177086 19267 418097 147677 -77631 174533
7593 113628 -228171 398385 -166654 -35964 -154582 57752 -72025 116579 -282467 -105265
7582 -46820 -533785 211991 -9631 19409 104898 6610 -11831 17373 -106884 22333 -319667
7570 105526 94522 90256 65558 -283292 -88583 -193177 -105978 -97333 -220916 6160 -67637 110155
7557 -293889 -72225 -32061 60082 -109643 230830 44388 243951 -101843 -399487 -165470
7546 -139019 208669 83236 -82465 113568 239468 -42791 64750 98982 -19929 129018 25854
7534 57709 -418144 -74615 -411011 -363803 -283810 -125507 213933 234807 -303642 121352 125089
7523 125089 -57659 -194252 191160 -333035 190181 -109361 -148669 -76312 -15533 114789
7512 -498378 7140 86225 -197339 64755 44096 20751 -233099 -17118 -46562 100738 -139842
7500 117903 33716 -343733 -227915 -212639 -137532 -331052 -14968 -221558 -36489 -5633 10932
7488 41858 -191430 314727 -505072 228140 -124908 27349 147056 50346 -2031 -139771 -437456
7477 -437456 -287495 -11997 419331 89302 53149 83460 95277 -29000 100874 -395861 33074
7465 -60138 129109 -318774 -85098 -146606 85333 -192124 217733 -167283 87287 -9693 77323
7453 154654 -12671 -195887 250814 269419 35952 242787 -205560 101115 -276593 -185922
7443 -185922 14971 24417 -236426 -38173 -185657 62250 -65098 -17785 -13142 132693 -230748
7431 67553 3750 -302259 -99457 -6218 -61171 -174662 -267575 195158 -156341 -108648 -87835
7420 -87835 -18891 77299 396644 127615 -431726 -141584 26515 -44081 89677 -308030 31869
7408 112316 204895 90557 53621 -37092 -60118 -269295 -359192 -197179 -83559 251793 22999
7396 -159096 357742 -73796 1764 102493 -56410 46151 -41331 -217545 136127 38101 -29742
7384 -139175 -50251 -97746 -71939 -59136 153544 -5929 -67607 7470 -12966 -340261 -875 -98734
7372 -98734 -31503 243197 177345 123911 -42925 -233444 -434034 29055 35800 205436 41633
7360 31657 -1923 -170105 -227454 151320 122344 165155 121272 -135778 -48294 28183 -207869
7348 -106013 47286 -349381 -46520 -207466 -81471 14185 -60466 -3264 -38859 -241522 178437
7336 -235713 89031 77070 -81998 39717 -305941 162565 -325453 271072 179763 -134029 -270953
7325 -270953 150171 126244 63287 43697 62993 -193113 230857 63179 58553 250462 -407365
7313 227837 19355 -319780 -251173 -123513 163446 -46505 -159902 146690 192031 -55321 102569
7301 -128016 -138437 25961 19251 -226253 49762 1901 -197423 -62495 -105507 25669 -183177
7289 92248 -76841 -65697 42194 177673 245413 -211149 108158 -235720 54971 -6256 114592
7277 -184019 -142928 -41558 -78968 -225300 22035 -139153 275822 26481 149359 -73134 1108
7265 -125641 -230573 11055 191530 200703 138817 -53549 308971 47014 -167541 122227 -19051
7253 -384233 -430844 5525 -22826 -82960 -49412 95553 -132288 -98481 -351138 -6413 107242
7241 24392 -225847 -230461 -73134 -197266 86950 -15583 33116 -212734 -188881 94545 -207012
7229 -174021 -129145 85235 181671 -76390 142369 70525 -198513 -185633 25013 -242779 189187
7217 114631 -314392 140885 -180805 -40882 -371990 -157194 -206113 -27568 289396 186678
7207 186678 -180444 -30924 -75196 -165421 -100447 3485 125720 -149610 -54347 6234 -38929
7195 45668 -322106 87946 42768 -180798 39204 78623 352262 131205 -165297 -212037 -98336
7183 24905 -184231 112736 96728 63661 -179626 -351201 86789 -224627 413193 81019 247678
7172 247678 -234778 -16819 99330 -154837 -88539 346119 138825 -10855 23165 92125 395743
7161 395743 20838 151397 -160518 91107 -283450 -69572 -219622 -194571 325278 -198526
7150 -192121 -35463 -218157 70473 21183 76471 41880 -90142 -212242 -198301 99182 149240
7139 149240 -26233 189780 161687 119226 -63987 -126607 11131 -49519 67260 173000 -51077
7127 -114971 -166065 366769 -164643 258053 -257121 -273697 -15925 565630 176402 -5446 -147917
7116 -147917 -82908 -124319 -103992 -95847 27271 76549 7131 132520 355551 -227960 12453
7104 196159 46286 136007 37491 117433 158190 -104845 -40291 134974 -334877 -3959 171372
7092 -251007 10591 89243 199606 -153445 212301 94651 -158606 -98135 -373076 313313
7081 104467 -11466 -285381 -5256 138869 78344 -342655 302598 482912 -82568 -83714 -56985
7070 -56985 -164214 -210943 -154654 -263506 125521 -32491 133783 -104662 -1515 145799 11625
7058 205350 25834 300617 99925 -370068 -81526 -7875 100047 -217510 -143714 -110916 240884
7046 56290 35841 63138 -437483 -224422 -85967 -124426 30404 75623 80625 162148 -264072
7034 -146747 -75136 -302994 199767 257278 222925 36398 -95846 -120587 227163 -193484 2918
7022 -85550 -213521 -60828 -25147 172816 -306022 4824 -59105 -358290 83341 140287 17583
7010 -282764 25271 119633 -594 6934 -66693 -39636 -166110 -124819 -58862 -71430 44787 1439
6997 181085 -66565 230369 -416357 30268 -110607 -28663 159910 -17092 -135107 -42824 -67948
6986 -67948 253791 22739 -55215 -139806 130169 -397666 -199199 -7686 102914 56526 117576
6975 117576 -236586 -31934 -121231 46899 -17620 -50405 -297677 285625 -214564 -289967 314559
6963 -495005 96228 225322 -44394 -189659 -63564 -540 26750 -159477 -80698 -202404 -96130
6951 191117 -19822 -52176 20448 -82188 81829 219099 -40949 -370428 -198035 -14239 -39528
6940 -39528 73027 5799 -8529 -223431 -37312 191493 371909 -189729 -94595 -120889 -351144
6929 -351144 19750 328589 -13856 52112 -252351 -84774 -53522 276156 -141059 15999 -261890
6917 -92211 71801 92726 -160766 -310675 -129325 143875 -243498 294566 -126805 -32235
6906 232948 -252146 -105481 118978 13682 55431 -27122 1870 8888 -178377 109653 198749
6895 198749 170098 80654 -270800 113648 -413874 -60335 -118468 -201519 -11946 -7500 139281
6883 161906 44252 -18229 347640 78877 102114 -46389 127164 -161329 184536 -37574 -66866
6872 -66866 197926 21792 185132 -113212 121095 -242829 -92151 100855 76536 -9411 -23283
6861 -23283 293087 271467 5591 -4840 -250308 -183203 -367072 21618 230558 172637 -366656
6849 174030 292130 -457039 114394 38086 419918 -236728 -146492 -80149 464864 136545
6838 -263760 11228 -485 36640 191295 -150376 -334688 -31985 187987 -29721 -317941 52778
6826 -60825 -82200 97345 -194615 158482 -11435 -138084 -118661 68177 -231134 -6757 -63345
6815 -63345 -7028 -134821 -92834 256279 113179 209219 135291 -60303 110449 11507 -41311
6803 -187866 187015 -15994 122060 86492 -202292 -324180 -157583 58729 151024 1722 381491
6792 381491 64237 96861 127288 132211 115207 19023 67070 126815 -338058 143880 -103474
6780 -17378 49270 142340 130621 221027 -146611 266170 -145319 156735 137601 127429 -159248
6768 -9942 5317 130626 -134101 63323 1449 44349 -125493 -109850 -221473 -5866 146844 -60908
6755 -44584 339810 151060 -102730 39726 46311 -54766 30912 67025 -23712 -41948 -120004
6744 -120004 -25867 124838 -141495 -184764 272701 -8657 144121 57042 -85694 -261083 -153759
6733 -153759 24310 -151950 166163 -145874 78538 58681 -294977 -259551 103922 -36289 178267
6721 -7945 99607 -293015 -121865 360559 205606 268417 46874 -324894 -115355 -42837 -299273
6710 -299273 88942 286097 490514 -93529 -94570 -93522 75838 -41066 -63403 22226 126300
6699 126300 157629 169853 -150207 -225684 -43643 -509288 155037 -219633 -46114 -377947 74534
6687 -317888 -68235 -343836 -241886 163766 -37661 -95586 222405 637 -68602 -183693 -156869
6676 -156869 174541 1993 -214788 215816 170276 -95038 -159897 62330 -238436 -92776 119103
6664 -59910 -13052 -162150 304292 109087 -77756 -185207 20385 214713 139436 -128826 -262506
6653 -262506 -303222 90823 44756 68118 126119 104191 -133605 -122257 19806 -198562 103476
6641 -26185 80084 136824 348277 -117295 128291 -18108 -131080 26877 -140300 -176596 -37731
6629 -101064 -113832 -49875 -201712 123638 -306428 146432 -28910 -307531 -7941 226483 -34276
6617 104742 -261416 -207118 -14099 19056 14130 31403 -138425 14912 -151941 11012 430486
6606 430486 130014 275212 167514 55294 55375 -259542 230015 -245407 97851 211071 129450
6595 129450 142209 -165900 5229 -45728 -159820 -123172 55457 197098 241906 -114476 362962
6583 -1158 -140128 -256684 96415 106622 8397 60110 244591 196422 23224 -245006 136251
6571 6956 113029 74885 117545 -17859 -205667 -163706 111226 -119080 138448 -190374 -65544
6559 84694 114871 -67734 -5128 41359 -123117 200974 -182321 -30022 84836 -127484 -394329
6548 -394329 10098 -113254 -46987 -254965 -23582 1208 37263 -7512 -316089 228413 6429
6536 284441 -201017 27329 -97877 -108790 227559 32799 93749 -158254 -345813 4451 -271562
6524 215679 205495 -399720 431504 -210147 101564 63507 -162222 -230230 282231 66195
6513 -149323 32972 -122427 47282 -111162 -13626 -163148 -199706 -103792 -108287 131009 17754
6501 25896 237232 -4012 -181787 306900 100211 -13873 -33048 -28600 41868 -10879 -300147
6490 -300147 78768 -202202 -214483 310572 47201 123711 -210563 -111272 73903 -168874 -25720
6478 -13921 83082 283263 -359013 98913 4087 164846 -56061 36563 -108445 -205197 121089
6466 321468 21470 38232 -331407 345666 37715 44464 17974 38557 -81969 -1785 150191
6454 101920 165249 -314349 244990 13653 300485 74675 225058 54699 197386 39260 -49146
6442 -94830 -137274 26984 -268457 -179818 -17664 -72331 -29718 105602 -294728 -158453 -35715
6430 -54463 119617 39332 -175123 -279845 85179 -92994 -107588 32577 47547 175763 280157
6419 280157 332352 -11120 176228 -8078 17656 -112989 -10354 108171 -342389 -42623 -32570
6408 -32570 44292 -18792 -59107 -209987 -29706 68468 -57107 -229727 37204 203994 4132
6396 246305 -86517 -33975 -168473 -5987 103037 -325281 -123890 -169064 -338910 -314283 -267772
6385 -267772 -23678 -141367 -73593 -304510 -92292 -166649 -253561 -322311 -195786 -491067 -192296
6373 -62647 106209 -15490 -53241 95163 28570 219525 85305 18254 -323990 229517 -6351
6361 100555 -187176 157909 -284448 -320368 -174898 -126584 187572 -317150 -41801 50964
6350 90061 -166021 450151 -152930 -49468 -47402 -37595 91280 -201304 190349 106847 207017
6339 207017 -328574 -4962 -121431 -40931 -23868 155425 225167 154210 -276433 -201238 131757
6327 -132730 -94433 186188 -149036 66574 8012 -182593 32467 -27310 60209 -351517 -194410
6316 -194410 43270 -52381 295904 152192 -296777 294764 -152380 3879 -132263 -110118 -36292
6304 -117912 146161 -160132 -30933 -240251 -155759 -222600 139092 -412749 181785 46294
6293 79938 205871 323950 -172151 73767 -74801 2147 -214567 -51599 -8558 -217945 31081
6281 35526 -117491 101256 -59206 110380 158611 199240 -236728 7883 139202 -162482 148119
6269 117171 34853 78466 -6253 140504 10580 -90160 17911 65244 304950 71609 -50400
6257 -59218 62239 -66036 5799 199238 372947 46115 -293185 48334 -307411 92127 -213712
6245 54257 -65822 184246 -325182 184382 -405602 -27830 108252 84842 -368137 -55150 -131327
6234 -131327 47406 328119 159796 213888 -147886 13029 -30114 150002 -74016 -135154 123440
6222 -68233 -286572 -179581 -98604 58552 -91718 50634 143753 -78333 60301 426537 -129984
6210 -169037 -154563 44246 287449 10955 -81929 -50962 -164277 -62983 -180725 -147570 33087
6198 -169828 228135 48034 281702 204117 261002 -102208 285109 115821 31921 -105305
6187 -157894 -23093 -31746 62554 49677 -191787 32344 31365 -212738 173535 -145363 213908
6175 -235759 94261 6703 -67638 204707 251535 -88182 82529 -303501 -110613 -44422 -188992
6164 -188992 -430236 161849 218267 -101264 51877 162928 327224 -228859 248663 161935
6154 161935 145243 277319 -219635 -211427 316133 -114201 130251 91021 -271145 265924
6143 -231308 -183598 20553 -182539 -2045 -16362 -77573 135298 -41491 3932 273175 -144198
6131 -93393 -187732 264608 159937 100567 -554648 72065 -340293 -178138 -26156 -107128 73066
6119 -52800 100886 144618 -173638 141291 22342 169116 -81103 -242267 175891 -46214 -170262
6108 -170262 174274 -256907 50794 222542 46713 -125516 -157131 -7971 190341 -204471 -97706
6096 64595 -64151 -96039 -213404 382301 -98259 210273 71586 -157104 -7618 -263485 -27548
6084 -214473 -166488 27323 -248333 -351997 146333 95544 -253365 143035 -158537 -142748
6074 -142748 217783 129604 126207 59634 -109148 68562 -128936 -181340 -212485 192032 -177817
6062 249214 46687 68053 149767 -354691 -65878 93233 -85186 -132342 -305470 206652 -279536
6050 -162898 -3201 -223831 -269750 134990 -134685 110250 136339 97471 33522 -108949 -212610
6039 -212610 271254 -107398 -150800 -1754 -173909 -125606 15442 195185 -39743 -150770 -86588
6028 -86588 -99440 367417 145525 -203631 181815 65717 137366 58646 -203782 -123873 -75068
6017 -75068 -240760 -411595 -44662 -129197 222134 7603 61917 242815 219733 -57890 -139853
6006 -139853 -87681 57135 -43043 233557 141242 28062 -41298 26968 268032 44573 132376
5995 132376 -52574 -125780 246012 -28358 290649 133248 -51116 -37454 4671 94047 -201531
5983 175791 -449348 -45519 306775 -295288 -263810 -284546 -180622 -104518 -121216 -178631 113685
5971 -234232 184820 -363770 -39792 -171331 -171737 -175078 -247901 -5938 185958 160294 -67274 358543
5958 169693 -64968 201061 -245865 25219 101520 54637 -296137 30274 63615 -41293 -247506
5947 -247506 29879 165477 73586 93824 131459 -86228 93288 86629 -92978 66521 69214 114794
5935 114794 -188798 341131 7439 -160205 231380 -108582 293233 -134743 114159 -218692
5924 195233 88351 -142844 271601 514618 -82946 -15218 -163711 231687 -427074 233241
5913 -249928 -53645 252193 -23957 89425 -216796 286009 172005 -121071 17198 -154843
5902 347735 -9251 3716 473347 163753 123163 280717 159582 132771 5160 20519 2304 -169937
5889 -288149 6741 320229 116009 -241859 -62889 90536 -153003 350093 -203094 -216783 -258139
5878 -258139 149079 -192205 234544 -86580 -182464 180336 177995 15100 71632 -38320 -105492
5867 -105492 159344 -105797 -47109 -2497 -35484 395704 74778 46794 -414758 -200233 -350826
5856 -350826 -168825 76862 -188481 140560 -87022 -105938 379354 -259033 -95068 -184331 -181519
5845 -181519 -117266 -222729 53682 91803 -187789 -16530 107635 -77186 335765 72131 -295892
5833 -211230 -34195 -72939 215294 -50749 -88020 -75675 520 -71280 -16498 304114 -8842 -477373
5821 -477373 50485 -206047 -162916 63081 -117863 -226108 77419 300446 -12910 119133 1977
5809 -83185 -273583 110534 225566 145579 -412141 45 129960 -412668 -172240 -52400 -500
5797 6510 178489 314520 -66225 331214 22802 81932 -90068 237110 -36567 -49997 116794
5785 150484 254942 -44811 -264345 -98071 -128106 140045 83802 -50912 207888 231168 172431
5774 172431 34780 282546 -83260 206553 127641 -428018 -235246 -166106 -112959 102223 90817
5763 90817 -38719 -327847 78200 387949 8718 21547 -8244 86004 225365 75871 -48462 165747
5750 -130058 59023 194179 -231911 37505 -253964 -94514 141598 51912 55913 4322 -29955
5738 -61842 -317484 -162123 330783 -236652 32101 45648 89070 67160 106250 -204073 255012
5726 106321 -45868 94133 180409 -168301 322335 -87439 -144246 104575 28022 87043 -155638
5714 235340 332974 163951 -224537 28215 -419082 -28677 -172316 441163 -89863 -74512 -70447
5703 -70447 71828 -129151 -143585 -136358 224406 99716 22055 9797 -75927 -108428 -159789 107780
5690 -148650 -110664 261342 179220 225961 -240710 -64403 107894 51110 217144 81623 -233190
5678 -264401 74445 41357 67325 -19977 329740 -442786 -57720 -326466 -174720 52486 35463
5667 35463 -61637 123039 -102442 -41201 243500 -376929 43587 -87782 582413 -158865 -255828
5656 -255828 122343 -195314 69473 -113694 -175684 -44713 176845 162776 38947 166084 -75454
5644 -17336 -105360 -13344 65290 166271 -110722 383247 423474 331481 123164 -5450 203583
5632 130318 -180824 -133766 33953 -219400 214434 -172205 153068 203613 -132797 229124
5621 -86217 -62524 165304 10259 -113860 -199139 110547 18231 30239 -102207 115607 -291224
5609 -208452 -242771 321376 -244116 -273284 114531 183923 204086 146785 91833 316405 77744
5597 113339 20134 51017 75716 157789 194603 -112008 295622 -30533 17401 -211038 127671
5585 79187 411501 -18703 572555 8568 176951 -69081 61920 -127857 -277388 -190927 -107312
5574 -107312 -81044 353423 37754 -30559 279189 -61605 240824 -5765 -270684 223671 269083
5563 269083 -127991 199497 100919 -231417 -131002 -193747 31607 -266991 303084 -249708
5552 -60583 -55283 132827 248 -231821 -45867 193713 71257 -72444 60702 -173613 83885 -6319
5539 -56048 -27895 58636 128153 292306 -253656 -33245 -155616 49951 7492 277654 -137277
5527 564 146380 -205547 144746 277312 -164628 225312 -478252 -39163 50329 -20110 109531
5515 275809 -534278 -438549 -30269 45082 390663 40760 72161 -222958 154037 214231 -69747
5503 131211 78161 -138275 -162 -34592 258479 20815 148311 103947 -23141 -277346 -103779
5491 -8115 636104 122741 -32831 -68131 -33785 -202796 -87604 128085 -279749 220493 308865
5480 308865 -216867 -273684 116281 386058 -22784 43555 -81528 116462 25725 -67240 -4634
5468 31136 194253 323816 -7656 -1768 -203602 -132499 51407 -88965 347050 81299 134202
5457 134202 488391 6135 -221562 -526958 93625 -107450 -237235 -373129 65917 151325 210824
5446 210824 312717 251944 104877 338837 -264883 55152 -12713 58247 -84583 110483 285743
5435 285743 102834 -41823 127120 -167841 -247889 -125788 -17939 -212577 142985 126386
5425 126386 660929 -27360 285215 -6766 -112763 495458 216725 -281738 162641 151434
5415 151434 295938 -122556 -89000 83567 76733 -119467 316224 -44656 -17042 -117952 -127993
5404 -127993 41227 93816 -306145 -443023 -121639 -278113 -389607 49986 -33741 148891
5393 172151 -21714 133996 16797 179750 124393 178584 -216010 -206465 14349 164926 -417995
5381 -87301 42934 -44088 -7732 167102 -210658 -179581 62738 -359757 -269385 -38300 65 124256
5369 124256 -94626 74075 -97410 43887 82618 -178797 -242331 -135889 185616 -267502 26644
5357 42521 122464 -176785 -83531 87138 415080 -57599 -54284 -226700 -371751 65833 161024
5346 161024 186947 -168671 135826 -235784 72510 -521858 141414 -71033 -5066 -191329 -14598
5334 120014 415655 -35516 220438 143842 -309663 293235 303198 19149 92109 90284 -150120
5322 -244210 71587 189563 -152295 356649 -110686 -183381 158143 45350 -121803 102855
5311 -24083 168718 212701 233757 395507 35363 -285303 230081 -291912 -23218 234450 -243153
5299 -78301 185909 -235800 -47599 188342 60742 56073 97601 83029 132647 57268 -193810
5287 -335078 228440 21961 -106494 -258871 105705 47457 -163832 780 18548 268928 -50273
5275 -109675 -45162 395496 -251175 49871 -13369 76064 -20223 18118 -140914 96150 -20826
5263 282678 160413 -192068 -18464 -27721 -202090 -392013 -2476 316947 -1625 137370 174856
5252 174856 -9407 -14659 -34039 -136323 -141674 -107393 -118237 -42319 -35642 365775 -368952 117422
5239 124372 237390 -77621 -175392 143921 -40217 -165975 142270 -181147 -29017 60140 -174845
5227 -164899 -148968 -130185 -13919 192603 -56621 -43287 43504 -113279 303618 -306161 -81128
5215 -6964 82945 115006 182616 -347519 59614 274531 -115933 -312406 117731 273813 131776
5203 105776 86777 95707 61283 35826 100276 -27340 -169680 -40663 -5901 -89065 173766 -44701
5190 -189377 -428548 -163675 328600 329800 -308240 38110 147661 -10677 318802 -37359 -136598
5179 -136598 -83099 257414 -14160 262131 -61925 271580 -229730 -65353 227505 -112684
5168 85567 -152617 -133270 -45394 -121652 160421 -402214 150415 -336509 255553 -306695
5157 -32337 168800 -270473 179262 363096 8181 132345 -338569 330879 132552 194292
5147 194292 65097 225284 59875 -318492 121374 -252737 -146145 291672 -78351 -85145 391573
5135 -465053 -228965 131663 31148 32570 55907 -150059 89159 136114 156159 71161 -350953
5123 -65794 18481 -151280 -223402 -301750 24324 281055 152899 -326329 14255 169776 82129
5111 113062 -140891 24683 196957 -113166 247150 -80030 125339 -142843 81863 201115
5101 201115 318179 365226 -33174 -12401 124561 -92338 -31119 101531 -140580 9190 -174812
5089 46186 -112843 -95098 39955 548 -310549 122075 138096 116879 315835 33733 7083 357746
5077 357746 -66620 -226727 57577 63972 -105922 223672 17151 67013 -193978 255473 24855
5065 31222 -245997 416924 57330 -53521 134210 -147568 -39325 -181972 69130 -117814 125980
5053 -210527 12580 143750 67737 -195875 97706 -20037 58862 -211520 -214567 -2412 -24314
5042 -24314 72203 284070 124429 -136535 -22190 -73150 142216 202 28068 -356083 -149890
5030 -16420 144597 -39196 246078 243741 -127943 225940 -104184 175680 -86704 -93231 -178385
5019 -178385 -360688 -29447 -42241 78522 -126681 51403 -320660 -6305 155432 292894 227308
5008 227308 -310288 -116895 115971 19326 84321 280186 57760 40376 -62729 -368019 -241351
4997 -241351 426102 -72362 -265462 275505 83720 -161670 168546 -167971 12899 39565
4987 39565 -123590 -19802 3291 123575 52941 -31322 97211 188595 -193912 -337735 119046
4975 -72220 139233 12232 88449 -92601 356854 144178 194370 -13976 174016 188296 194376
4964 194376 -216337 -235149 -212942 -144352 -195277 96433 311769 187110 -53999 46438 -30412
4952 319236 -38687 90592 -233731 169302 53901 -23067 -238062 -84657 -18612 237336 -105219
4940 -78614 105858 -64968 -264889 -288829 89532 -219994 -82055 178644 -381119 -231318 69676
4928 118176 -393741 -39872 -46849 -24462 -197758 -180148 7246 279358 165483 139532 224655
4917 224655 -90633 13362 -13838 431556 -353158 368318 -73289 -272705 94922 -26100 40470
4905 -310495 171235 -39932 320138 13858 184888 -68956 -325301 97866 186132 383827 -265001
4893 -84638 -164267 -257984 370216 -51472 155729 -3294 298626 265939 -84293 83113 312698
4882 312698 169433 -23553 140119 11084 -96540 -54671 11058 114967 13570 -257380 183478
4870 67388 125232 -241706 143744 -166050 -38290 335568 299316 -26674 428339 151501 -222935
4858 830 55845 -179147 151388 -2030 71391 87867 -129914 -48408 -96144 191333 13744 -90
4845 -345140 66747 -37271 -159323 132006 -66017 295575 -427665 -328103 99904 10660 65559
4834 65559 -75791 28182 208933 -1548 250120 -111807 -105500 -246659 -81218 -161856 460777
4822 -86990 198408 55648 120568 -474280 -479397 -239824 334350 -14566 -136741 242805 -51283
4810 20894 200837 -362772 246021 -30206 260529 -9730 -192541 113370 37607 -91368 -140279
4799 -140279 -33791 137393 -241938 -164713 11094 30196 40205 -70670 -95001 -216734 12026
4787 11657 -348026 430293 190425 -225696 12802 -163082 321295 153660 154160 -39280 -52243
4776 -52243 85414 27512 -86948 -214305 11429 -160395 -126291 -284009 -72051 -99425 -98095
4765 -98095 -114130 33565 6798 83367 81807 109797 238355 -266127 293137 270782 -72780 315504
4752 9092 -134003 363858 29697 -121933 -166726 184546 -167593 -4468 509750 -183048 -273430
4741 -273430 40980 22165 -81249 158247 -56105 125527 116228 -54657 -26992 68625 -318140
4729 19259 -91753 -321320 -113824 397426 106159 -133882 -306544 274826 258497 71333
4718 -84241 409791 -68132 227291 231449 299389 -30489 52948 -276515 163498 -100545 138864
4706 347206 -220946 -88700 177231 -99550 350425 90090 -78982 97064 153256 -226630 -286371
4695 -286371 -11605 225298 -85133 10991 -99939 -25676 103972 251254 -143427 78507 192078
4684 192078 39319 144460 124088 23975 18217 25074 51498 -78900 -183014 -343336 96056
4672 795 155398 -165214 -20369 -32278 319530 330780 23276 165688 198611 -312535 -115500
4660 -205946 819 17840 -351077 -126193 60741 48013 -255058 296142 84328 -49937 17564
4648 65435 -105304 132083 16596 -145101 -178113 -141632 56003 201779 -28786 281884 284625
4637 284625 -151287 134948 -5256 475499 -97035 -26172 -114412 193217 170379 -1547 3056
4625 406597 47376 -57195 -40748 -11588 80287 -57331 -27333 249800 -10357 -63127 -58186 87022
4612 -3158 117871 78874 60502 -198927 101621 286779 -70855 -112809 -228197 522861 127613
4600 -5775 -244775 43694 -94455 16595 -241344 -291355 27345 -54174 348039 321620 173220
4589 173220 94294 -49867 -32985 -394389 57316 200262 185672 -50529 -179773 -211791 -118310
4578 -118310 208761 207916 223670 229778 -152511 -122467 3673 -140989 107491 233478 108939
4566 267022 142133 45956 -139086 243154 139184 -125710 -298040 148402 -63555 -29993
4555 -53138 141571 -69852 54985 131446 44221 -249887 34974 206441 148856 -215848 -80268
4543 -179288 -491126 -213596 -358195 -78293 97278 354220 126846 -3942 177335 -66980 -68939
4532 -68939 41117 141598 32917 93685 -108168 -289581 -13293 165945 154494 -120447 -361106
4521 -361106 268847 155591 -44170 164648 -44726 -143046 27136 -243102 -214438 211509 108805
4510 108805 -30551 -241534 -92023 -71359 -344376 18002 148152 -53566 52317 -41504 -16072
4498 -12142 -88171 -193339 -18340 -369375 -94230 -136137 -74763 202007 23060 -226816 205298
4486 371814 -29303 240961 -137102 143737 222751 37056 -261704 -93026 -260854 -272215 191291
4474 -83002 -290099 183016 -203322 46603 29138 133573 188760 159005 -248342 -211286 148307
$$ [...]
##END NTUPLES=NMR SPECTRUM
##END=
