
##TITLE=AC1302_PERAH12114_6535671_KetVU1Pe3j
##JCAMPDX= 6.0         $$ Bruker NMR JCAMP-DX V2.0
##DATA TYPE= NMR SPECTRUM
##DATA CLASS= NTUPLES
##ORIGIN= BRUKER
##OWNER= Administrator
$$ 1.72 TOPSPIN		Version 2.1
$$ 2012-12-11 19:56:02.375 -0500  Administrator@X
$$ Compression mode = diff/dup
##.OBSERVE FREQUENCY= 400.02188249412
##.OBSERVE NUCLEUS= ^1H
##.ACQUISITION MODE= SIMULTANEOUS (DQD)
##.ACQUISITION SCHEME= undefined
##.AVERAGES= 64
##.DIGITISER RES= 22
##SPECTROMETER/DATA SYSTEM= spect
##.PULSE SEQUENCE= noesygpps1d.comp
##.SOLVENT NAME= COFFEE_meoh
##.SHIFT REFERENCE= INTERNAL, COFFEE_meoh, 1, 14.96103
##AUDIT TRAIL= $$ (NUMBER, WHEN, WHO, WHERE, PROCESS, VERSION, WHAT)
$$ ##TITLE= Audit trail, TOPSPIN		Version 2.1
$$ ##JCAMPDX= 5.01
$$ ##ORIGIN= Bruker BioSpin GmbH
$$ ##OWNER= Administrator
$$ $$ E:\/data/COFFEE/nmr/AC1302_PERAH12114_6535671_KetVU1Pe3j/52/pdata/1/auditp.txt
$$ ##AUDIT TRAIL=  $$ (NUMBER, WHEN, WHO, WHERE, PROCESS, VERSION, WHAT)
(   1,<2012-12-11 19:55:56.187 -0500>,<Administrator>,<X>,<go>,<TOPSPIN 2.1>,
      <created by zg
	started at 2012-12-11 19:44:26.279 -0500,
	POWCHK enabled, PULCHK disabled,
       configuration hash MD5:
       86 BA 57 50 F2 9D 5C 9B 26 00 A9 28 5F 66 2E 89
       data hash MD5: 64K
       3C D3 BF B5 77 A3 9B 79 F7 0E 82 F9 C1 C8 C7 2E>)
(   2,<2012-12-11 19:55:59.344 -0500>,<Administrator>,<X>,<proc1d>,<TOPSPIN 2.1>,
      <Start of raw data processing
       efp LB = 0.3 FT_mod = 6 PKNL = 1 PHC0 = 0 PHC1 = 0 SI = 128K 
       data hash MD5: 128K
       70 10 1F B2 E5 5E CE 26 7A 0E 9C 7B 85 D0 DE E0>)
(   3,<2012-12-11 19:56:00.531 -0500>,<Administrator>,<X>,<proc1d>,<TOPSPIN 2.1>,
      <pk PHC0 = -82.26013 PHC1 = 0 
       data hash MD5: 128K
       34 D6 ED 5E F2 41 F6 AE BA D4 23 07 F3 F0 5E BC>)
(   4,<2012-12-11 19:56:01.266 -0500>,<Administrator>,<X>,<proc1d>,<TOPSPIN 2.1>,
      <abs ABSG = 1 
       data hash MD5: 128K
       52 10 69 C0 9F 23 F7 DE 35 19 98 72 F0 28 CD C1>)
(   5,<2012-12-11 19:56:01.469 -0500>,<Administrator>,<X>,<proc1d>,<TOPSPIN 2.1>,
      <abs ABSG = 2 
       data hash MD5: 128K
       18 92 62 7C 02 44 B6 2A 83 08 AB 43 EF BF EB 06>)
(   6,<2012-12-11 19:56:01.641 -0500>,<Administrator>,<X>,<proc1d>,<TOPSPIN 2.1>,
      <abs ABSG = 3 
       data hash MD5: 128K
       DE 29 3E CE CD D3 CE 53 D0 07 BF 0C B2 F1 22 92>)
(   7,<2012-12-11 19:56:01.828 -0500>,<Administrator>,<X>,<proc1d>,<TOPSPIN 2.1>,
      <abs ABSG = 4 
       data hash MD5: 128K
       4A F0 65 B2 67 C6 13 CA C7 E4 67 89 6A 2E 26 26>)
(   8,<2012-12-11 19:56:02.000 -0500>,<Administrator>,<X>,<proc1d>,<TOPSPIN 2.1>,
      <abs ABSG = 5 
       data hash MD5: 128K
       8C 26 8D 86 EC 9D FB 95 1E 6C F3 24 A5 21 0F C5>)
$$ ##END=
$$ 
$$ $$ hash MD5
$$ $$ 41 4A 27 45 98 02 DE EF 9A 38 86 2B 5D 9D 91 CE
##$RELAX= 
##$RELAX= 
##$RELAX= 
##$RELAX= 
##$RELAX= 
##$RELAX= 
##$RELAX= 
##$RELAX= 
##$RELAX= 
$$ Bruker specific parameters
$$ --------------------------
##$DU= <E:\>
##$EXPNO= 52
$$ [...]
##$TP07= 0
##$TPNAME0= <>
##$TPNAME1= <>
##$TPNAME2= <>
##$TPNAME3= <>
##$TPNAME4= <>
##$TPNAME5= <>
##$TPNAME6= <>
##$TPNAME7= <>
##$TPOAL= (0..7)
0.5 0.5 0.5 0.5 0.5 0.5 0.5 0.5
##$TPOFFS= (0..7)
0 0 0 0 0 0 0 0
##$TUNHIN= 0
##$TUNHOUT= 0
##$TUNXOUT= 0
##$USERA1= <user>
##$USERA2= <user>
##$USERA3= <user>
##$USERA4= <user>
##$USERA5= <user>
##$V9= 5
##$VALIST= <valist>
##$VCLIST= <CCCCCCCCCCCCCCC>
##$VD= 0
##$VDLIST= <DDDDDDDDDDDDDDD>
##$VPLIST= <PPPPPPPPPPPPPPP>
##$VTLIST= <TTTTTTTTTTTTTTT>
##$WBST= 2048
##$WBSW= 25
##$XGAIN= (0..3)
0 0 0 0
##$XL= 0
##$YL= 0
##$YMAX_a= 5946151
##$YMIN_a= -11667065
##$ZGOPTNS= <>
##$ZL1= 120
##$ZL2= 120
##$ZL3= 120
##$ZL4= 120
##$ABSF1= 14.96103
##$ABSF2= -5.597152
##$ABSG= 5
##$ABSL= 3
##$ALPHA= 0
##$AQORDER= 0
##$ASSFAC= 0
##$ASSFACI= 0
##$ASSFACX= 0
##$ASSWID= 0
##$AUNMP= <proc_prof1d_extract.lims>
##$AXLEFT= 0
##$AXNAME= <>
##$AXNUC= <1H>
##$AXRIGHT= 0
##$AXTYPE= 0
##$AXUNIT= <>
##$AZFE= 0.1
##$AZFW= 0.1
##$BCFW= 0
##$BC_mod= 0
##$BYTORDP= 0
##$COROFFS= 0
##$CY= 15
##$DATMOD= 1
##$DC= 0
##$DFILT= <>
##$DTYPP= 0
##$F1P= 0
##$F2P= 0
##$FCOR= 0.5
##$FTSIZE= 131072
##$FT_mod= 6
##$GAMMA= 0
##$GB= 0
##$INTBC= 1
##$INTSCL= 1
##$ISEN= 128
##$LB= 0.3
##$LEV0= 0
##$LPBIN= 0
##$MAXI= 10000
##$MC2= 0
##$MEAN= 0
##$ME_mod= 0
##$MI= 0
##$NCOEF= 0
##$NC_proc= -2
##$NLEV= 6
##$NOISF1= 0
##$NOISF2= 0
##$NSP= 0
##$NTH_PI= 0
##$NZP= 0
##$OFFSET= 14.96103
##$PC= 1
##$PHC0= -82.26013
##$PHC1= 0
##$PH_mod= 1
##$PKNL= yes
##$PPARMOD= 0
##$PPDIAG= 0
##$PPIPTYP= 0
##$PPMPNUM= 2147483647
##$PPRESOL= 1
##$PSCAL= 4
##$PSIGN= 0
##$PYNMP= <proc.py>
##$REVERSE= no
##$SF= 400.02000962448
##$SI= 131072
##$SIGF1= 0
##$SIGF2= 0
##$SINO= 400
##$SIOLD= 131072
##$SPECTYP= <>
##$SREGLST= <1H.CDCl3>
##$SSB= 0
##$STSI= 131072
##$STSR= 0
##$SW_p= 8223.68421052631
##$SYMM= 0
##$S_DEV= 0
##$TDeff= 65536
##$TDoff= 0
##$TI= <>
##$TILT= no
##$TM1= 0
##$TM2= 0
##$TOPLEV= 0
##$USERP1= <user>
##$USERP2= <user>
##$USERP3= <user>
##$USERP4= <user>
##$USERP5= <user>
##$WDW= 1
##$XDIM= 131072
##$YMAX_p= 439819601
##$YMIN_p= -16128
##$CURPLOT= <Network HP LaserJet P1505>
##$CURPRIN= <$Network HP LaserJet P1505>
##$DFORMAT= <normdp>
##$LAYOUT= <+/1D_H.xwp>
##$LFORMAT= <normlp>
##$PFORMAT= <normpl>
##$SURQMSG= 1
$$ End of Bruker specific parameters
$$ ---------------------------------
##NTUPLES= NMR SPECTRUM
##VAR_NAME=  FREQUENCY,     SPECTRUM/REAL,   SPECTRUM/IMAG
##SYMBOL=    X,             R,               I
##VAR_TYPE=  INDEPENDENT,   DEPENDENT,       DEPENDENT
##VAR_FORM=  AFFN,          ASDF,            ASDF
##VAR_DIM=   131072,        131072,          131072
##UNITS=     HZ,            ARBITRARY UNITS, ARBITRARY UNITS
##FACTOR=    0.0627417313425164, 1,          1
##FIRST=     8223.62146879497, 1232,         -55206
##LAST=      0,             2374,            -54919
##MIN=       0,             -16128,          0
##MAX=       8223.62146879497, 439819601,    0
$$ Real data points
##PAGE= N=1
##DATA TABLE= (X++(R..R)), XYDATA
$$ [...]
$$ plain form
61762 433633 435555 437035 438109 439170 440751 443078 445987 449208 452440 455225 457159 458277 458846 458835 458032
61747 458032 456698 455552 454929 454366 453185 451117 448252 444894 441670 439269 437771 436619 435519 434844 434806
61732 434806 434817 434307 433773 434284 436092 438398 440442 442141 443577 444597 445275 446253 448111 450613 452997 454927
61716 454927 456762 458886 461143 463128 464777 466325 467703 468328 467685 465918 463605 461049 458110 454716 451207
61701 451207 448029 445324 442982 440948 439236 437715 436087 434097 431730 429237 426992 425235 423837 422358
61687 422358 420346 417610 414328 411022 408305 406410 404926 403172 400824 398021 394967 391770 388684 386095
61673 386095 384138 382628 381425 380489 379459 377715 375240 372976 371894 371953 372417 372830 373145 373155 372534 371455
61657 371455 370528 369979 369408 368538 367724 367511 368019 369060 370529 372489 375154 378907 383949 389729 395102 399455
$$ packed form
61762D33633J922J480J074J061J581K327K909L221L232K785J934J118N69j1q03
61747D58032j334j146o23n63j181k068k865l358l224k401j498j152j100o75l8
61732D34806J1n10n34N11J808K306K044J699J436J020O78R78J858K502K384J930
61716D54927J835K124K257J985J649J548J378O25o43j767k313k556k939l394l509
61701D51207l178k705k342k034j712j521j628j990k367k493k245j757j398j479
61687D22358k012k736l282l306k717j895j484j754k348k803l054l197l086k589
61673C86095j957j510j203r36j030j744k475k264j082N9M64M13L15J0o21j079
61657C71455r27n49n71q70q14k13N08J041J469J960K665L753N042N780N373M353
$$ plain form
61641 399455 403299 407376 411476 414760 417026 418982 421082 422713 422853 421186 418244 414667 410706 406363
61627 406363 401690 396893 392242 387874 383654 379417 375504 372816 371964 372412 372843 372451 371532 370677 369886 368855
61611 368855 367807 367329 367290 366455 363509 358288 351819 345362 339621 334622 329976 325273 320504 316197 312936
61596 312936 310725 308918 306839 304363 301923 300065 298993 298336 297365 295593 293260 291068 289399 287956 286261
61581 286261 284351 282785 282068 282158 282483 282305 281193 279372 277616 276649 276580 276947 277193 276990 276247 275079 273806
61564 273806 272720 271831 271028 270527 270838 272165 274142 276303 278512 280606 282030 282405 282351 283032 284773 286672
61548 286672 287876 288700 290014 291864 293397 294041 294204 294620 295472 296425 297233 297978 298817 299780 300876 302177 303670
61531 303670 305075 306030 306531 307070 308125 309519 310495 310471 309527 308102 306522 305006 303770 302728 301303 298989
$$ packed form
61641C99455L844M077M100L284K266J956K100J631J40j667k942l577l961m343
61627D06363m673m797m651m368m220m237l913k688q52M48M31l92r19q55p91j031
61611C68855j048m78l9q35k946n221o469o457n741m999m646m703m769m307l261
61596C12936k211j807k079k476k440j858j072o57r71j772k333k192j669j443j695
61581B86261j910j566p17R0L25j78j112j821j756r67o9L67K46k03p43j168j273
61564B73806j086q89q03n01L11J327J977K161K209K094J424L75n4O81J741J899
61548B86672J204Q24J314J850J533O44J63M16Q52R53Q08P45Q39R63J096J301J493
61531C03670J405R55N01N39J055J394R76k4r44j425j580j516j236j042j425k314
$$ plain form
61515 298989 296087 293522 291932 291300 291421 292217 293414 294382 294600 294067 293098 291995 291034 290426 290072 289640 289146
61498 289146 289055 289524 289928 289621 288881 288576 289073 290015 291086 292394 294038 295827 297546 299026 299878 299690 298802
61481 298802 298396 299391 301440 303310 304081 303746 302934 302405 302643 303613 304903 306230 307599 308812 309237 308590 307732
61464 307732 308027 309806 311996 313420 313994 314287 314471 314254 313697 313390 313692 314251 314551 314611 314860 315484 316270 316970
61446 316970 317461 317514 316899 315971 315742 316865 318707 319982 320323 320758 322402 325233 328481 331750 335070 338131
61430 338131 340268 341419 342438 344131 346372 348531 350386 352153 353865 355254 356248 357165 358335 359816 361506
61415 361506 363276 364955 366464 367975 369662 371176 371710 370788 368753 366352 364019 361707 359189 356304 353102
61400 353102 350024 347750 346577 346069 345567 344915 344382 344033 343646 343225 343072 343209 343209 342919 342945 343956 345776 347620
$$ packed form
61515B98989k902k565j590o32J21P96J197R68K18n33r69j103r61o08l54m32m94
61498B89146r1M69M04l07p40l05M97R42J071J308J644J789J719J480Q52j88q88
61481B98802m06R95K049J870P71l35q12n29K38R70J290J327J369J213M25o47q58
61464C07732K95J779K190J424N74K93J84k17n57l07L02N59L00O0K49O24P86P00
61446C16970M91N3o15r28k29J123J842J275L41M35J644K831L248L269L320L061
61430C38131K137J151J019J693K241K159J855J767J712J389R94R17J170J481J690
61415C61506J770J679J509J511J687J514N34r22k035k401k333k312k518k885l202
61400C53102l078k274j173n08n02o52n33l49l87m21j53J37%k90K6J011J820J844
$$ plain form
61382 347620 349125 350583 352124 353271 353602 353477 353649 354358 355194 355823 356420 357294 358520 360144 362478 365759
61366 365759 369598 373121 375710 377439 378795 380238 382085 384488 387333 390351 393548 397368 402237 408066
61352 408066 414420 420982 427591 434027 440233 446728 454213 462469 470017 475257 477838 478714 479107 479726 480800
61337 480800 482331 484142 485999 487863 489839 491736 492907 492755 491321 489154 486593 483464 479536 475054
61323 475054 470514 466024 461258 456195 451603 448493 447184 447198 447978 449330 451156 453237 455600 458798 463460
61308 463460 469684 477164 485800 495808 507157 519202 530986 541772 551211 559123 565244 569233 571069
61295 571069 571429 571433 571685 571734 570698 568252 564655 560044 554345 547908 541588 535915 530666 525535 520686 516237
61279 516237 511813 507209 503137 500544 499390 498828 498453 498561 499139 499594 499881 501066 504029 508129 511884 514784
$$ packed form
61382C47620J505J458J541J147L31j25J72P09Q36O29N97Q74J226J624K334L281
61366C65759L839L523K589J729J356J443J847K403K845L018L197L820M869N829
61352D08066O354O562O609O436O206O495P485Q256P548N240K581Q76L93O19J074
61337D80800J531J811J857J864J976J897J171j52j434k167k561l129l928m482
61323D75054m540m490m766n063m592l110j309J4P80J352J826K081K363L198M662
61308D63460O224P480Q636J0008J1349J2045J1784J0786R439P912O121L989J836
61295E71069L60MK52M9j036k446l597m611n699o437o320n673n249n131m849m449
61279E16237m424m604m072k593j154n62l75J08N78M55K87J185K963M100L755K900
$$ plain form
61263 514784 517757 521908 527474 534075 541455 549620 558476 567605 576394 584393 591590 598256 604350 609231
61249 609231 612179 613077 612307 610100 606412 601474 595998 590652 585529 580310 574700 568607 562153 555678 549550
61234 549550 543774 538020 532175 526649 521936 518146 515238 513498 513417 515149 518394 522772 527943 533437 538762
61219 538762 543862 549152 554875 560675 566023 570913 575823 581044 586317 591151 595267 598568 600933 602383
61205 602383 603439 604993 607615 611101 614910 618980 623926 630448 638822 648959 660708 673886 688199
61192 688199 703331 718956 734469 748829 761005 770635 778083 783881 788307 791505 793663 794844 794782
61179 794782 793077 789550 784309 777586 769749 761438 753436 746142 739236 731928 723531 713776 702803 691076
61165 691076 679241 667756 656512 645008 633010 620881 609158 598007 587365 577430 568709 561574
$$ packed form
61263E14784K973M151N566O601P380Q165Q856R129Q789P999P197O666O094M881
61249F09231K948Q98p70k207l688m938n476n346n123n219n610o093o454o475o128
61234E49550n776n754n845n526m713l790k908j740q1J732L245M378N171N494N325
61219E38762N100N290N723N800N348M890M910N221N273M834M116L301K365J450
61205F02383J056J554K622L486L809M070M946O522Q374J0137J1749J3178J4313
61192F88199J5132J5625J5513J4360J2176R630P448N798M426L198K158J181o2
61179G94782j705l527n241o723p837q311q002p294o906p308q397r755j0973j1727
61165F91076j1835j1485j1244j1504j1998j2129j1723j1151j0642r935q721p135
$$ plain form
61153 561574 556068 552076 549416 547761 546821 546629 547310 548446 549014 548114 545488 541232 535443 528457 521053
61138 521053 514012 507664 502152 497858 495117 493697 493056 493028 493853 495617 498179 501702 506724 513547 521909
61123 521909 531439 542144 554289 568039 583342 599884 617027 634119 651102 668671 687644 708258
61111 708258 730060 752205 773793 794214 813368 831359 847891 862246 874035 883586 891332 897105
61099 897105 900409 901132 899531 895610 888972 879304 866723 851617 834584 816587 798724 781507 764563
61086 764563 747262 729527 711849 694730 678464 663432 650153 638837 629072 620249 612236 605451
61074 605451 600303 596748 594404 592838 591663 590544 589343 588242 587652 588013 589693 592850 597230 602295 607821
61059 607821 614342 622714 633175 645044 657392 669853 682665 696146 710371 725419 741723 759939
$$ packed form
61153E61574n506l992k660j655r40j92O81J136N68r00k626m256n789o986p404
61138E21053p041o348n512m294k741j420o41k8Q25J764K562L523N022O823Q362
61123E21909R530J0705J2145J3750J5303J6542J7143J7092J6983J7569J8973K0614
61111G08258K1802K2145K1588K0421J9154J7991J6532J4355J1789R551P746N773
61099H97105L304P23j601l921o638r668j2581j5106j7033j7997j7863j7217j6944
61086G64563j7301j7735j7678j7119j6266j5032j3279j1316r765q823q013o785
61074F05451n148l555k344j566j175j119j201j101n90L61J680L157M380N065N526
61059F07821O521Q372J0461J1869J2348J2461J2812J3481J4225J5048J6304J8216
$$ plain form
61047 759939 780372 802664 826234 850945 877092 904787 933735 963745 995017 1027660 1061314
61036 1061314 1095780 1131716 1170154 1211369 1254782 1299956 1347094 1396355 1447161 1498576 1550169
61025 1550169 1602356 1656192 1713053 1774407 1841698 1916421 2000088 2093707 2197246 2310034 2432104
61014 2432104 2565422 2714316 2885230 3086158 3326103 3614981 3963899 4384976 4890773
61005 4890773 5495121 6216096 7078935 8116954 9370622 10880955 12666223 14679119 16770152
60996 16770152 18701153 20224878 21188751 21594049 21579126 21354688 21136500 21091010 21285608
60987 21285608 21651325 21990793 22050553 21627931 20650912 19189336 17405527 15485220 13585133
60978 13585133 11809915 10213183 8811716 7602148 6572411 5706107 4983731 4384687
$$ packed form
61047G59939K0433K2292K3570K4711K6147K7695K8948L0010L1272L2643L3654
61036A061314L4466L5936L8438M1215M3413M5174M7138M9261N0806N1415N1593
61025A550169N2187N3836N6861O1354O7291P4723Q3667R3619J03539J12788J22070
61014B432104J33318J48894J70914K00928K39945K88878L48918M21077N05797
61005D890773O04348P20975Q62839J038019J253668J510333J785268K012896K091033
60996A6770152J931001J523725R63873M05298j4923k24438k18188m5490J94598
60987B1285608L65717L39468N9760m22622r77019j461576j783809j920307j900087
60978A3585133j775218j596732j401467j209568j029737q66304p22376n99044
$$ plain form
60970 4384687 3889799 3482045 3145746 2866395 2631542 2431210 2257375 2103744 1966180
60961 1966180 1842572 1731696 1632336 1543448 1464459 1394842 1333588 1279424 1231304 1188330 1149271
60950 1149271 1112515 1076636 1041038 1006123 972826 941825 913102 886287 861234 838038 816541
60939 816541 796185 776414 757007 738042 719785 702562 686437 671018 655857 641042 627017
60928 627017 613899 601438 589637 578838 569100 560088 551904 545373 541081 538451 536262 533695 530569
60915 530569 527025 523582 521122 520065 519699 518949 517723 516861 516826 517154 517332 517508 518039 518865 519726 520539 521175
60898 521175 521277 520784 520348 520681 521544 521844 520739 518312 515144 511614 507780 503652 499297 494710 489702 483977
60882 483977 477355 470014 462413 454822 447012 438682 430239 422823 417357 413674 410774 407789 404522 401216
$$ packed form
60970D384687m94888m07754l36299k79351k34853k00332j73835j53631j37564
60961A966180j23608j10876r9360q8888p8989o9617o1254n4164m8120m2974l9059
60950A149271l6756l5879l5598l4915l3297l1001k8723k6815k5053k3196k1497
60939H16541k0356j9771j9407j8965j8257j7223j6125j5419j5161j4815j4025
60928F27017j3118j2461j1801j0799r738r012q184o531m292k630k189k567l126
60915E30569l544l443k460j057l66p50j226q62l5L28J78J76N31Q26Q61Q13O36
60898E21175J02m93m36L33Q63L00j105k427l168l530l834m128m355m587n008n725
60882D83977o622p341p601p591p810q330q443p416n466l683k900k985l267l306
$$ plain form
60868 401216 398110 395271 392698 390506 389036 388693 389554 391234 393251 395378 397495 399307 400568 401468 402463
60853 402463 403770 405437 407859 411605 416488 421308 424863 426918 427930 428323 428537 429354 431346 433997 435956
60838 435956 436367 435573 434439 433343 431971 429770 426462 422382 418428 415479 413700 412540 411363 409879 408046
60823 408046 405985 404096 402862 402313 401902 401067 399677 397790 395270 391911 387766 383120 378264 373435 368787
60808 368787 364263 359616 354786 350093 345887 342176 338766 335640 332879 330352 327828 325417 323558 322407
60794 322407 321442 319919 317693 315427 313961 313590 313963 314544 314987 315155 315085 315064 315497 316464 317538 318297 318890 319822
60776 319822 321253 322867 324501 326480 329162 332398 335719 338910 342141 345582 349046 352013 353998 355008
60762 355008 355668 356737 358340 359851 360632 360782 360892 361156 361003 359741 357366 354513 351704 348985 346474 344858
$$ packed form
60868D01216l106k839k573k192j470l43Q61J680K017K127K117J812J261R00R95
60853D02463J307J667K422L746M883M820L555K055J012L93K14Q17J992K651J959
60838D35956M11p94j134j096j372k201l308m080l954k949j779j160j177j484j833
60823D08046k061j889j234n49m11q35j390j887k520l359m145m646m856m829m648
60808C68787m524m647m830m693m206l711l410l126k761k527k524k411j859j151
60794C22407r65j523k226k266j466l71L73N81M43J68p0k1M33R67J074P59N93R32
60776C19822J431J614J634J979K682L236L321L191L231L441L464K967J985J010
60762C55008O60J069J603J511P81J50J10K64j53j262k375k853k809k719k511j616
$$ plain form
60746 344858 344814 345973 347046 347194 346763 346338 345603 343747 340647 336895 332754 327886 322240 316568 311797 308326
60730 308326 306059 304580 303123 300963 298190 295636 293798 292274 290623 289200 288666 289081 289984 290979 291733
60715 291733 291809 291115 290345 290348 291218 292480 293983 295946 298252 300395 302187 303874 305502 306808 307943 309657
60699 309657 312376 315547 318320 320574 322859 325558 328529 331469 334248 336843 339239 341495 343760 346071
60685 346071 348155 349586 350285 350810 351913 353629 354999 354918 353211 350643 348074 345968 344680 344599 345647 346935
60669 346935 347320 346306 344186 341441 338286 334810 331263 327977 325123 322648 320448 318494 316806 315510
60655 315510 314930 315454 317047 318991 320405 321137 321965 323823 326954 330857 334783 338101 340437 341747 342177
60640 342177 341632 339609 335761 330594 325321 321009 318000 316104 314969 314196 313395 312417 311442 310754 310455 310425
$$ packed form
60746C44858m4J159J073J48m31m25p35j856l100l752m141m868n646n672m771l471
60730C08326k267j479j457k160k773k554j838j524j651j423n34M15R03R95P54
60715B91733P6o94p70LQ70J262J503J963K306K143J792J687J628J306J135J714
60699C09657K719L171K773K254K285K699K971K940K779K595K396K256K265K311
60685C46071K084J431O99N25J103J716J370q1j707k568k569k106j288q1J048J288
60669C46935L85j014k120k745l155l476l547l286k854k475k200j954j688j296
60655C15510n80N24J593J944J414P32Q28J858L131L903L926L318K336J310M30
60640C42177n45k023l848n167n273m312l009j896j135p73q01r78r75o88k99l0
$$ plain form
60624 310425 310469 310439 310367 310538 311324 312796 314485 315590 315571 314651 313676 313355 313588 313718 313472 313363 313974 315142 316148
60605 316148 316522 316312 315764 315257 315447 316860 319082 320885 321483 321390 321676 322706 324023 325284 326762 328862
60589 328862 331542 334388 336957 338868 339782 339581 338540 337157 335815 334690 333907 333566 333626 333906 334347 335210
60573 335210 336931 339785 343717 348442 353742 359697 366649 374837 384019 393552 402877 411802 420267 428021
60559 428021 434616 439578 442461 442937 441102 437619 433383 429142 425493 422929 421527 420887 420861 422112 425363
60544 425363 430232 435508 440720 446752 454711 464829 476780 490321 505109 520428 535658 550540
60532 550540 564393 575585 582620 585524 585469 583236 578840 572579 565519 558670 552307 546315 540645 535185
60518 535185 529749 524569 520438 517959 516869 516351 515806 515210 514933 515489 517295 520467 524875 530426 537198
$$ packed form
60624C10425M4l0p2J71P86J472J689J105j9r20r75l21K33J30k46j09O11J168J006
60605C16148L74k10n48n07J90J413K222J803N98r3K86J030J317J261J478K100
60589C28862K680K846K569J911R14k01j041j383j342j125p83l41O0K80M41Q63
60573C35210J721K854L932M725N300N955O952Q188R182R533R325Q925Q465P754
60559D28021O595M962K883M76j835l483m236m241l649k564j402o40k6J251L251
60544D25363M869N276N212O032P959J0118J1951J3541J4788J5319J5230J4882
60532E50540J3853J1192P035K904n5k233m396o261p060o849o363n992n670n460
60518E35185n436n180m131k479j090n18n45n96k77N56J806L172M408N551O772
$$ plain form
60503 537198 545439 555738 569183 586921 609348 635915 665824 698668 734332 772538 812688 853890
60491 853890 894937 934305 970249 1000829 1024000 1038014 1041867 1035234 1018136 991117 955803 914833
60479 914833 870943 826190 781970 739311 698935 661350 627084 596555 569609 545539 523786
60468 523786 504343 487334 472603 459969 449466 440922 433616 426743 420021 413512 407149 400923 395364
60455 395364 391233 388672 386989 385357 383410 381196 378842 376380 373667 370450 366781 363340 361044 360207
60441 360207 360320 360711 361154 361702 362228 362426 362201 361801 361495 361212 360523 359022 356746 354262 352273 351141 350744
60424 350744 350700 350600 350174 349474 348981 349305 350672 352841 355568 358883 362642 366050 368065 368358 367511 366206
60408 366206 364608 362835 361576 361678 363165 365169 366906 368345 369841 371536 373353 375237 377106 378773
$$ packed form
60503E37198Q241J0299J3445J7738K2427K6567K9909L2844L5664L8206M0150M1202
60491H53890M1047L9368L5944L0580K3171J4014L853o633j7098k7019l5314m0970
60479I14833m3890m4753m4220m2659m0376l7585l4266l0529k6946k4070k1753
60468E23786j9443j7009j4731j2634j0503q544p306o873o722o509o363o226n559
60455C95364m131k561j683j632j947k214k354k462k713l217l669l441k296q37
60441C60207J13L91M43N48N26J98k25m00l06k83o89j501k276k484j989j132l97
60424C50744m4j00m26p00m93L24J367K169K727L315L759L408K015K93q47j305
60408C66206j598j773j259J02J487K004J737J439J496J695J817J884J869J667
$$ plain form
60394 378773 380187 381595 383293 385368 387827 390748 394085 397569 401001 404390 407596 410174 411966 413579
60380 413579 415810 418798 422093 425330 428339 430847 432726 434433 436595 439130 441437 443478 445936 449052
60366 449052 451970 453714 454355 454808 455815 457518 459766 462416 465415 468861 472934 477655 482883 488622 495055
60351 495055 502169 509642 517250 524973 532460 538706 542721 544394 544384 543226 540765 536551 530667 524149 518451
60336 518451 514305 511164 508009 504557 501258 498188 494606 489842 484112 478138 472380 466950 461895 457210
60322 457210 452908 449360 447168 446336 445993 445412 444981 445690 447928 451360 455781 461470 468721 477501 487608
60307 487608 498742 510345 521751 532555 542742 552457 561797 570590 578129 583352 585614 585065 581935
60294 581935 575803 566175 553717 540234 527324 515403 504093 493087 482495 472714 464146 456839
$$ packed form
60394C78773J414J408J698K075K459K921L337L484L432L389L206K578J792J613
60380D13579K231K988L295L237L009K508J879J707K162K535K307K041K458L116
60366D49052K918J744O41M53J007J703K248K650K999L446M073M721N228N739O433
60351D95055P114P473P608P723P487O246M015J673j0j158k461m214n884o518n698
60336E18451m146l141l155l452l299l070l582m764n730n974n758n430n055m685
60322D57210m302l548k192q32l43n81m31P09K238L432M421N689P251Q780J0107
60307D87608J1134J1603J1406J0804J0187R715R340Q793P539N223K262n49l130
60294E81935o132r628j2458j3483j2910j1921j1310j1006j0592r781q568p307
$$ plain form
60282 456839 450383 444416 439221 435436 433141 431594 430016 428265 426546 424821 422858 420727 418905 417821
60268 417821 417395 417063 416272 414942 413448 412119 410926 409655 408214 406620 404948 403509 402851 403183 403945 404313
60252 404313 404110 403793 403596 403151 402172 401103 400757 401476 402888 404416 405790 407072 408291 409227 409562 409218 408376
60235 408376 407216 405824 404471 403683 403809 404655 405790 407088 408730 410766 412970 415053 416876 418551 420496
60220 420496 423170 426488 429783 432669 435667 439510 444048 448478 452523 456726 461526 466742 472117 477703
60206 477703 483341 488405 492557 496302 500318 504547 508554 512465 516832 521546 525516 527706 528141 527700 527173
60191 527173 526810 526547 526253 525672 524404 522200 519298 516335 513898 512219 511201 510506 509595 507959 505529 502763
60175 502763 500174 497937 496059 494692 493903 493329 492494 491511 491035 491341 491745 491164 489167 486363 483904 482616
$$ packed form
60282D56839o456n967n195l785k295j547j578j751j719j725j963k131j822j084
60268D17821m26l32p91j330j494j329j193j271j441j594j672j439o58L32P62L68
60252D04313k03l17j97m45r79j069l46P19J412J528J374J282J219R36L35l44q42
60235D08376j160j392j353p88J26Q46J135J298J642K036K204K083J823J675J945
60220D20496K674L318L295K886K998L843M538M430M045M203M800N216N375N586
60206D77703N638N064M152L745M016M229M007L911M367M714L970K190M35m41n27
60191E27173l63k63k94n81j268k204k902k963k437j679j018o95r11j636k430k766
60175E02763k589k237j878j367p89n74q35r83m76L06M04n81j997k804k459j288
$$ plain form
60159 482616 482393 482330 481614 480347 479341 479119 479367 479406 478921 478029 476941 475901 475330 475625 476681 477794 478175
60142 478175 477669 476966 477160 478933 482071 485739 489313 492917 497108 502019 506974 511028 513889 516064 518066
60127 518066 519712 520533 520688 520959 521772 522699 523224 523564 524264 525324 526364 527579 529761 533154 536773 539203
60111 539203 539814 538922 537081 534699 532234 530283 529185 528689 528224 527451 526401 525107 523384 521147 518767
60096 518767 516814 515550 514980 515327 516931 519569 522372 524779 527168 530192 533829 537551 541109 544521 547423
60081 547423 549095 549269 548412 547034 545080 542185 538258 533600 528566 523196 517172 510256 502886 496064 490352
60066 490352 485246 479900 474197 468589 463124 457346 451206 445347 440309 436030 432355 429497 427683 426744
60052 426744 426374 426399 426554 426374 425708 425111 425417 427032 429805 433296 436999 440559 443987 447488 450973 454013
$$ packed form
60159D82616k23o3p16j267j006k22K48L9m85q92j088j040n71K95J056J113L81
60142D78175n06p03J94J773L138L668L574L604M191M911M955M054K861K175K002
60127E18066J646Q21J55K71Q13R27N25L40P00J060J040J215K182L393L619K430
60111E39203O11q92j841k382k465j951j098m96m65p73j050j294j723k237k380
60096E18767j953j264n70L47J604K638K803K407K389L024L637L722L558L412K902
60081E47423J672J74q57j378j954k895l927m658n034n370o024o916p370o822n712
60066D90352n106n346n703n608n465n778o140n859n038m279l675k858j814r39
60052D26744l70K5J55j80o66n97L06J615K773L491L703L560L428L501L485L040
$$ plain form
60036 454013 456395 458398 460229 461518 461632 460367 458089 455380 452704 450231 447828 445325 442772 440252
60022 440252 437506 434114 430102 425909 421659 416988 411851 406987 403147 400190 397342 394095 390499 386840
60008 386840 383455 380648 378399 376235 373732 371054 368791 367369 366824 366925 367271 367532 367918 369135 371472
59993 371472 374127 375901 376506 376820 377858 379850 382315 384708 386840 388789 390527 391706 392010 391744 391715 392332
59977 392332 393069 393130 392316 390952 389221 387121 384936 383174 381962 380934 379857 379016 378801 379189 379824 380445
59961 380445 381053 381744 382518 383302 384064 384861 385703 386438 386874 386996 386929 386762 386663 387073 388324 389898 390607 389879 388508
59942 388508 387681 387554 387325 386522 385497 384611 383581 381995 380015 378187 376758 375602 374768 374758 376122 378924
59926 378924 382712 386928 391198 395306 399168 402920 406819 410766 414123 416304 417481 418311 419020 419224 418738
$$ packed form
60036D54013K382K003J831J289J14j265k278k709k676k473k403k503k553k520
60022D40252k746l392m012m193m250m671n137m864l840k957k848l247l596l659
60008C86840l385k807k249k164k503k678k263j422n45J01L46K61L86J217K337
59993C71472K655J774O05L14J038J992K465K393K132J949J738J179L04k66k9O17
59977C92332P37O1q14j364j731k100k185j762j212j028j077q41k15L88O35O21
59961C80445O08O91P74P84P62P97Q42P35M36J22o7j67r9M10J251J574P09p28j371
59942C88508q27j27k29q03j025q86j030j586j980j828j429j156q34j0J364K802
59926C78924L788M216M270M108L862L752L899L947L357K181J177Q30P09K04m86
$$ plain form
59911 418738 418053 417734 417759 417814 417909 418348 419310 420783 422672 424691 426374 427566 428624 429827 430833 431189 431165
59894 431165 431564 432819 434805 437473 441075 445595 450418 454814 458585 462146 466161 471077 476751 482487
59880 482487 487708 492653 498147 504648 511703 518379 523953 528112 530793 532124 532468 532272 531714 530510 528224
59865 528224 524971 521700 519469 518334 517347 515835 514289 513654 514082 514898 515647 516622 518321 520866 524131 528204
59849 528204 533518 540486 548833 557127 563287 566042 565898 564457 562939 561733 561093 561468 562870 564407 564783
59834 564783 563146 559401 554099 548202 542674 537999 534126 530921 528402 526469 524750 522910 520941 518969
59820 518969 516997 514997 513084 511346 509603 507553 505094 502294 499100 495298 490861 486134 481532 477108
59806 477108 472593 467889 463348 459446 456322 453785 451670 449956 448610 447596 447008 446913 447009 446750 445889 444614
$$ packed form
59911D18738o85l19K5N5R5M39R62J473J889K019J683J192J058J203J006L56k4
59894D31165L99J255J986K668L602M520M823M396L771L561M015M916N674N736
59880D82487N221M945N494O501P055O676N574M159K681J331L44j96n58j204k286
59865E28224l253l271k231j135r87j512j546o35M28Q16P49R75J699K545L265M073
59849E28204N314O968Q347Q294O160K755j44j441j518j206o40L75J402J537L76
59834E64783j637l745n302n897n528m675l873l205k519j933j719j840j969j972
59820E18969j972k000j913j738j743k050k459k800l194l802m437m727m602m424
59806D77108m515m704m541l902l124k537k115j714j346j014n88r5R6k59q61j275
$$ plain form
59790 444614 443107 441350 439512 438065 437272 436947 436965 437573 438827 440153 440968 441364 441710 441917 441754 441620 442324
59773 442324 444111 446502 449026 451548 453909 455904 457681 459598 461612 463347 464835 466585 468752 470833
59759 470833 472488 474074 475996 478031 479768 481392 483530 486492 490066 493936 497909 501820 505578 509372
59745 509372 513549 518171 522808 526893 530201 532912 535257 537251 538875 540377 542130 544195 546319 548461
59731 548461 550984 554109 557427 560257 562278 563538 564134 564261 564357 564745 565214 565359 565187 564998 564805 564379 563778
59714 563778 563342 563099 562635 561653 560282 558822 557530 556622 556116 555678 555052 554570 554761 555480 555972 555884 555703 556049
59696 556049 557027 558408 559952 561388 562460 563163 563582 563485 562493 560703 558683 556800 555022 553377 551992 550583
59680 550583 548570 545906 543155 540523 537439 533388 528525 523134 517181 510903 505242 501036 498166 495987
$$ packed form
59790D44614j507j757j838j447p93l25J8O08J254J326Q15L96L46K07j63j34P04
59773D42324J787K391K524K522K361J995J777J917K014J735J488J750K167K081
59759D70833J655J586J922K035J737J624K138K962L574L870L973L911L758L794
59745E09372M177M622M637M085L308K711K345J994J624J502J753K065K124K142
59731E48461K523L125L318K830K021J260N96J27R6L88M69J45j72j89j93m26o01
59714E63778m36k43m64r82j371j460j292r08n06m38o26m82J91P19M92q8j81L46
59696E56049R78J381J544J436J072P03M19r7r92j790k020j883j778j645j385j409
59680E50583k013k664k751k632l084m051m863n391n953o278n661m206k870k179
$$ plain form
59666 495987 494245 493065 492331 491619 490584 489118 487397 486011 485594 485986 486238 485862 485599 486458 488522 491250
59650 491250 494398 497799 500698 502270 502722 502966 503159 502347 499743 495655 490950 486197 481662 477669 474572
59635 474572 472532 471474 471102 470954 470734 470602 470874 471429 471716 471358 470385 468853 466645 463840 460860 457963
59619 457963 454812 450836 445910 440491 435157 430232 425774 421743 418082 414772 411917 409808 408796 409008
59605 409008 410161 411777 413569 415531 417686 419879 421879 423547 424828 425755 426580 427805 429882 432791 435919
59590 435919 438439 439987 440997 442235 443927 445532 446481 446765 446562 445721 444151 442402 441178 440424 439530 438302
59574 438302 436970 435275 432522 428764 425037 422037 419391 416667 414248 412607 411521 410669 410299 410512 410528
59559 410528 409599 408181 407250 406895 406531 406181 406478 407591 409160 411168 413863 416837 419333 421622 425020 430159
$$ packed form
59666D95987j742j180p34p12j035j466j721j386m17L92K52l76k63Q59K064K728
59650D91250L148L401K899J572M52K44J93q12k604m088m705m753m535l993l097
59635D74572k040j058l72j48k20j32K72N55K87l58r73j532k208k805k980k897
59619D57963l151l976m926n419n334m925m458m031l661l310k855k109j012K12
59605D09008J153J616J792J962K155K193K000J668J281R27Q25J225K077K909L128
59590D35919K520J548J010J238J692J605R49K84k03q41j570j749j224p54q94j228
59574D38302j332j695k753l758l727l000k646k724k419j641j086q52l70K13J6
59559D10528r29j418r31l55l64l50K97J113J569K008K695K974K496K289L398N139
$$ plain form
59543 430159 436229 442348 448880 456939 467430 481163 498971 520536 543200 562691 575283 579352
59531 579352 575598 566564 555715 546058 539038 534580 531995 530711 530452 531125 532581 534351 535781 536544 536828
59516 536828 536805 536159 534345 531114 526504 520532 513256 505046 496427 487730 479246 471601 465468 460771 456618
59501 456618 452263 447780 443567 439598 435677 432150 429731 428548 427934 427371 427078 427354 427815 427858 427577 427645 428347
59484 428347 429291 430050 430574 430944 431278 431989 433601 436135 439099 442249 445763 449507 452792 455292 457573 460158
59468 460158 462536 463787 463867 463616 463697 464128 464718 465337 465804 466131 466903 468932 472469 477104 482417 488271 494558
59451 494558 501155 508130 515510 522797 529166 534220 538081 540680 541474 540050 536613 531645 525518 518706
59437 518706 512038 506352 501922 498393 495207 492049 489055 486667 485196 484562 484590 485475 487737 491777 497725
$$ packed form
59543D30159O070O119O532Q059J0491J3733J7808K1565K2664J9491J2592M069
59531E79352l754r034j0849r657p020m458k585j284k59O73J456J770J430P63K84
59516E36828k3o46j814l231m610n972p276q210q619q697q484p645o133m697m153
59501D56618m355m483m213l969l921l527k419j183o14n63k93K76M61M3k81O8P02
59484D28347R44P59N24L70L34P11J612K534K964L150L514L744L285K500K281K585
59468D60158K378J251Q0k51Q1M31N90O19M67L27P72K029L537M635N313N854O287
59451D94558O597O975P380P287O369N054L861K599P94j424l437m968o127o812
59437E18706o668n686m430l529l186l158k994k388j471o34K8Q85K262M040N948
$$ plain form
59422 497725 505552 515005 525545 536853 549429 564214 581465 600545 621173 644347 671233 700885
59410 700885 729393 751584 763773 765216 757573 743591 726404 709334 695396 686614 683986 687851
59398 687851 697386 709372 718364 719335 710527 693633 671734 647692 624035 602959 585627 571843
59386 571843 560799 551973 545218 540368 537119 535158 534227 534142 534798 536052 537622 539264 540982 542917 545141
59371 545141 547714 550704 553889 556715 558939 561085 563778 566837 569529 571572 573267 574835 576420 578708
59357 578708 582598 587933 593390 598108 602846 608987 616962 626286 636698 648476 661680 675809 690329
59344 690329 705025 719644 733536 745990 756715 765733 772831 777514 779645 779877 779010 776918 772503
59331 772503 764854 754223 741784 728827 716366 705040 694884 685409 676241 667499 659361 651646 644220
$$ packed form
59422D97725P827R453J0540J1308J2576J4785J7251J9080K0628K3174K6886K9652
59410G00885K8508K2191J2189J443p643j3982j7187j7070j3938q782k628L865
59398F87851R535J1986Q992R71q808j6894k1899k4042k3657k1076j7332j3784
59386E71843j1044q826o755m850l249j961r31q5O56J254J570J642J718J935K224
59371E45141K573K990L185K826K224K146K693L059K692K043J695J568J585K288
59357E78708L890N335N457M718M738O141P975R324J0412J1778J3204J4129J4520
59344F90329J4696J4619J3892J2454J0725R018P098M683K131K32q67k092m415
59331G72503p649j0631j2439j2957j2461j1326j0156r475r168q742q138p715p426
$$ plain form
59318 644220 637330 631028 624694 617826 610949 605019 600202 595982 592190 589027 586319 583856 582453 583560
59304 583560 587576 593612 601215 611120 623573 636600 646722 651056 648481 639568 625995 609653 591756
59291 591756 572989 554548 538289 525434 515725 508255 502559 498446 495490 493407 492486 493003 494521 496373
59277 496373 498564 501640 505853 510956 516685 523082 530420 538983 548700 558897 568812 578387 588060 597636
59263 597636 606106 612817 618020 621828 623520 622602 619859 616442 612446 607237 600866 594285 588388 583504
59249 583504 579586 576182 572521 568375 564721 562890 563239 565223 568412 572653 577470 582237 586934 592024
59235 592024 597587 603237 608756 614052 618547 621447 622726 623115 623011 622028 619734 616181 611554 605963 599721
59220 599721 593260 586584 579412 571993 565170 559376 554126 548746 543162 537817 533290 530134 528516 527759
$$ packed form
59318F44220o890o302o334o868o877n930m817m220l792l163k708k463j403J107
59304E83560M016O036P603R905J2453J3027J0122M334k575q913j3573j6342j7897
59291E91756j8767j8441j6259j2855r709p470n696m113k956k083r21N17J518J852
59277D96373K191L076M213N103N729O397P338Q563R717J0197R915R575R673R576
59263E97636Q470O711N203L808J692r18k743l417l996n209o371o581n897m884
59249E83504l918l404l661m146l654j831L49J984L189M241M817M767M697N090
59235E92024N563N650N519N296M495K900J279L89j04r83k294l553m627n591o242
59220E99721o461o676p172p419o823n794n250n380n584n345m527l156j618p57
$$ plain form
59206 527759 526738 524933 522648 520131 517177 513861 510905 508841 507382 506135 505330 505264 505536 505631 505941 507364
59190 507364 509965 512763 514941 516651 518529 520889 523647 526630 529752 533159 537282 542415 548145 553563
59176 553563 558251 562681 567402 572224 576658 580823 585337 590356 595337 599897 604312 608864 613187 616793
59162 616793 619945 623434 627478 631312 633867 634472 632838 628903 622965 615705 607791 599560 591146 582697
59148 582697 574327 566055 557915 549999 542357 535060 528365 522544 517415 512340 506780 500686 494324 488074
59134 488074 482453 477964 474736 472569 471334 470908 470722 469999 468712 467771 467914 469023 470948 474330 479798
59119 479798 486730 493695 500038 506330 513209 520497 527686 534781 542280 550549 559451 568547 577518 586403
59105 586403 595367 604291 612757 620445 627276 633094 637584 640677 642712 643936 644217 643494 642166 640698 639182
$$ packed form
59206E27759j021j805k285k517k954l316k956k064j459j247q05o6K72R5L10J423
59190E07364K601K798K178J710J878K360K758K983L122L407M123N133N730N418
59176E53563M688M430M721M822M434M165M514N019M981M560M415M552M323L606
59162F16793L152L489M044L834K555O05j634l935n938p260p914q231q414q449
59148E82697q370q272q140p916p642p297o695n821n129n075n560o094o362o250
59134D88074n621m489l228k167j235m26j86p23j287r41J43J109J925L382N468
59119D79798O932O965O343O292O879P288P189P095P499Q269Q902R096Q971Q885
59105E86403Q964Q924Q466P688O831N818M490L093K035J224K81p23j328j468j516
$$ plain form
59090 639182 637632 636294 635291 634313 633146 632113 631450 630570 628561 625202 620916 615943 610205 603830 597139
59075 597139 590167 582785 575282 568274 562075 556572 551670 547329 543361 539741 536924 535145 533508 530619
59061 530619 526202 521353 517032 513111 509121 505189 501737 498801 496191 493948 492231 490977 489998 489221 488554
59046 488554 487711 486434 484848 483487 482945 483452 484620 485710 486341 486815 487524 488226 488330 487776 487189 487252 488341
59029 488341 490707 494515 499671 505946 513216 521215 529285 536973 544829 553935 564591 576045 587529
59016 587529 598780 609339 618112 624158 627506 628793 628482 626745 623825 620161 616335 613005 610645 609220
59002 609220 608454 608490 609924 613062 617544 622811 628527 634300 639392 643024 644821 644906 643797 642227 640703
58987 640703 639170 637362 635333 633201 630562 626907 622688 619160 616965 615597 614633 614733 616824 620857 626009
$$ packed form
59090F39182j550j338j003r78j167j033o63q80k009l359m286m973n738o375o691
59075E97139o972p382p503p008o199n503m902m341l968l620k817j779j637k889
59061E30619m417m849m321l921l990l932l452k936k610k243j717j254r79p77o67
59046D88554q43j277j586j361n42N07J168J090O31M74P09P02J04n54n87O3J089
59029D88341K366L808N156O275P270P999Q070P688P856R106J0656J1454J1484
59016E87529J1251J0559Q773O046L348J287l11j737k920l664l826l330k360j425
59002F09220p66L6J434L138M482N267N716N773N092L632J797Q5j109j570j524
58987F40703j533j808k029k132k639l655m219l528k195j368r64J00K091M033N152
$$ plain form
58972 626009 631789 638399 646243 655539 666180 677536 688572 698552 707552 715990 723876 730845 736783
58959 736783 742065 747206 752363 757081 760393 761404 759867 756060 750158 742161 732494 722110 711697 701092
58945 701092 689805 677812 665616 653785 642693 632470 623043 614453 607154 601554 597150 592717 587677
58932 587677 582821 579302 577372 576517 576439 577259 578924 580879 582351 582794 582229 581315 580762 580452 579513 577501 575112
58915 575112 573267 571942 570431 568549 566908 566089 566071 566626 567908 570439 574664 580579 587732 595659 604288
58900 604288 613817 624205 635078 646148 657347 668397 678683 687831 696209 704706 714258 725693
58888 725693 739525 755536 772851 790691 808685 826235 842062 854910 864401 870778 874144 874526
58876 874526 872485 868978 864483 858615 850693 840537 828724 816246 803857 791752 780029 769448
$$ packed form
58972F26009N780O610P844R296J0641J1356J1036R980R000Q438P886O969N938
58959G36783N282N141N157M718L312J011j537l807n902p997r667j0384j0413j0605
58945G01092j1287j1993j2196j1831j1092j0223r427q590p299n600m404m433n040
58932E87677m856l519j930q55p8Q20J665J955J472M43n65r14n53l10r39k012k389
58915E75112j845j325j511j882j641q19j8N55J282K531M225N915P153P927Q629
58900F04288R529J0388J0873J1070J1199J1050J0286R148Q378Q497R552J1435
58888G25693J3832J6011J7315J7840J7994J7550J5827J2848R491O377L366L82
58876H74526k041l507m495n868p922j0156j1813j2478j2389j2105j1723j0581
$$ plain form
58864 769448 761179 755540 751418 747331 742725 737826 732628 726702 719880 712475 704677 696204 686765 676653
58850 676653 666675 657527 649258 641356 633466 625935 619416 613931 608731 603170 597324 591548 585882 580201
58836 580201 574554 568983 563336 557682 552619 548682 545629 542763 539859 537402 536013 535958 537073 538799 540391
58821 540391 541469 542406 543939 546474 549919 553996 558393 562691 566488 569654 572370 574957 577698 580582
58807 580582 583061 584296 583859 582145 580007 578116 576624 575124 572887 569475 565247 561012 557163 553495
58793 553495 549736 545713 541045 535473 529671 524951 521849 519757 518162 517375 517594 518314 519383 521645 525479
58778 525479 529583 532472 534624 537744 542199 546523 549387 550757 550934 549746 547125 543476 538992 533448
58764 533448 527125 521092 516006 511334 506414 501689 498169 496026 494501 493064 491966 491566 491687 491956 492406
$$ packed form
58864G69448q269n639m122m087m606m899n198n926o822p405p798q473r439j0112
58850F76653r978r148q269p902p890p531o519n485n200n561n846n776n666n681
58836E80201n647n571n647n654n063l937l053k866k904k457j389n5J115J726J592
58821E40391J078R37J533K535L445M077M397M298L797L166K716K587K741K884
58807E80582K479J235m37j714k138j891j492j500k237l412m228m235l849l668
58793E53495l759m023m668n572n802m720l102k092j595p87K19P20J069K262L834
58778E25479M104K889K152L120M455M324K864J370J77j188k621l649m484n544
58764E33448o323o033n086m672m920m725l520k143j525j437j098m00J21K69M50
$$ plain form
58749 492406 493379 494886 496450 497683 498706 499742 500560 500902 501403 503414 507615 513213 518845 523871 528442
58734 528442 532805 537112 541658 546746 552357 558327 564615 570993 576738 581180 584408 586986 589120 590635
58720 590635 591678 592912 595007 598381 603346 609999 617865 626020 633702 640597 646622 651712 655764 658534
58706 658534 659680 659082 656931 653260 647653 639754 629812 618399 605879 592554 578975 565608 552393
58693 552393 539185 526435 514913 504858 495908 487743 480323 473638 467691 462619 458368 454399 450210
58680 450210 446072 442795 440851 440084 440014 440014 439480 438472 438031 439247 442071 445575 449239 453443 458872 466010
58664 466010 475147 486220 498574 511232 523358 534079 542205 546718 547562 545551 541680 536839 531704
58651 531704 526359 520372 513836 507826 503159 499248 495060 490705 487019 484056 481251 478733 477048 475665
$$ packed form
58749D92406R73J507J564J233J023J036Q18L42N01K011M201N598N632N026M571
58734E28442M363M307M546N088N611N970O288O378N745M442L228K578K134J515
58720E90635J043J234K095L374M965O653P866Q155P682O895O025N090M052K770
58706F58534J146n98k151l671n607p899r942j1413j2520j3325j3579j3367j3215
58693E52393j3208j2750j1522j0055q950q165p420o685n947n072m251l969m189
58680D50210m138l277j944p67p0%n34j008m41J216K824L504L664M204N429P138
58664D66010R137J1073J2354J2658J2126J0721Q126M513Q44k011l871m841n135
58651E31704n345n987o536o010m667l911m188m355l686k963k805k518j685j383
$$ plain form
58637 475665 473353 470282 468211 468030 468427 467688 465654 463131 460387 457247 454011 451240 449009 447112 445727
58622 445727 445307 446061 448047 451540 456846 463990 472901 483625 495934 508859 520944 531011 538692
58609 538692 544405 548823 552119 553808 553562 551922 549768 547361 544480 541320 538502 536272 534393 532749
58595 532749 531304 529551 526926 523861 521508 520277 519606 519351 520353 523208 527401 532238 537786 544301 551517
58580 551517 559097 567180 575781 584155 591409 597345 602246 606304 609807 613488 618100 623870 630730 638837
58566 638837 648531 660073 673631 689261 706743 725861 746788 769585 793164 815546 835470 853070
58554 853070 868596 881294 890106 894891 896346 895261 892474 889049 885739 882432 878588 873977 868571 862055
58540 862055 853993 844253 832817 819362 803612 786071 768051 750828 734883 719962 705892 693290
$$ packed form
58637D75665k312l071k071j81L97p39k034k523k744l140l236k771k231j897j385
58622D45727m20P54J986L493N306P144Q911J0724J2309J2925J2085J0067P681
58609E38692N713M418L296J689k46j640k154k407k881l160k818k230j879j644
58595E32749j445j753k625l065k353j231o71k55J002K855M193M837N548O515P216
58580E51517P580Q083Q601Q374P254N936M901M058L503L681M612N770O860Q107
58566F38837R694J1542J3558J5630J7482J9118K0927K2797K3579K2382J9924J7600
58554H53070J5526J2698Q812M785J455j085k787l425l310l307l844m611n406o516
58540H62055q062r740j1436j3455j5750j7541j8020j7223j5945j4921j4070j2602
$$ plain form
58528 693290 683226 675993 670584 665830 661628 658409 655809 652938 649899 647835 647179 646865 645668 643475
58514 643475 640768 637786 634807 632494 631201 630431 629500 628262 626750 624687 621970 619149 616798 614773 612553
58499 612553 610038 607578 605508 604009 603116 602581 602084 601808 602431 604292 606901 609546 612009 614569 617642
58484 617642 621565 626399 631949 638312 646172 656020 667298 679072 691299 704523 718419 731626 742957
58471 742957 751773 757297 758905 757166 753301 747482 739027 728496 718032 709149 701735 695746 692165 691401
58457 691401 692331 694070 697386 703244 711209 720418 730798 741971 752092 759367 763862 766507 767143 765096
58443 765096 760891 755876 750631 745157 740116 736373 733636 731000 728662 727691 728203 729093 729764 731009 733891
58428 733891 738534 744277 750463 756958 764162 772356 780856 788218 793609 797366 799900 800853 799878 797371 793689
$$ packed form
58528F93290j0064p233n409m754m202l219k600k871l039k064o56l14j197k193
58514F43475k707k982k979k313j293p70r31j238j512k063k717k821k351k025k220
58499F12553k515k460k070j499q93n35m97k76O23J861K609K645K463K560L073
58484F17642L923M834N550O363P860R848J1278J1774J2227J3224J3896J3207J1331
58471G42957Q816N524J608j739l865n819q455j0531j0464q883p414n989l581p64
58457F91401R30J739L316N858P965R209J0380J1173J0121P275M495K645O36k047
58443G65096m205n015n245n474n041l743k737k636k338r71N12Q90O71J245K882
58428G33891M643N743O186O495P204Q194Q500P362N391L757K534R53r75k507l682
$$ plain form
58413 793689 788504 781774 774577 767997 761790 755132 748144 741746 736519 732517 729767 728142 727264 727141 728304
58398 728304 730714 733372 735786 738928 743867 750288 757236 764283 770973 776155 779176 781009 782973 785056
58384 785056 786654 788121 790274 792968 795434 797463 799188 800398 801226 802782 805924 810149 814787 820338
58370 820338 827332 834909 842063 849345 857663 866334 874167 881803 890952 901734 912629 922777 932502
58357 932502 941705 949592 956080 962030 967980 973791 979380 984593 988698 991213 992911 994902 997299 999919
58343 999919 1003527 1008986 1015894 1023536 1032393 1043111 1054810 1066241 1077886 1091013 1105330 1119553
58331 1119553 1133720 1148775 1164270 1178591 1191240 1202872 1213321 1221640 1228000 1233649 1239016 1243611
58319 1243611 1247587 1251662 1255851 1260017 1265244 1272676 1281445 1289797 1297861 1307237 1318279 1329988 1342172
$$ packed form
58413G93689n185o730p197o580o207o658o988o398n227m002k750j625q78j23J163
58398G28304K410K658K414L142M939O421O948P047O690N182L021J833J964K083
58384G85056J598J467K153K694K466K029J725J210Q28J556L142M225M638N551
58370H20338O994P577P154P282Q318Q671P833P636R149J0782J0895J0148R725
58357I32502R203P887O488N950N950N811N589N213M105K515J698J991K397K620
58343I99919L608N459O908P642Q857J0718J1699J1431J1645J3127J4317J4223
58331A119553J4167J5055J5495J4321J2649J1632J0449Q319O360N649N367M595
58319A243611L976M075M189M166N227P432Q769Q352Q064R376J1042J1709J2184
$$ plain form
58306 1342172 1355322 1368710 1381112 1393335 1407534 1423973 1440758 1456747 1472479 1488348 1504261
58295 1504261 1521056 1539819 1559801 1579279 1598411 1618848 1640783 1662957 1685314 1708861 1733036
58284 1733036 1756218 1778923 1803451 1830095 1856712 1882405 1908647 1936292 1964450 1992994 2023321
58273 2023321 2055912 2089765 2124790 2162156 2201863 2242608 2284395 2328571 2375099 2422751 2472153
58262 2472153 2525490 2582879 2642201 2702732 2765613 2830483 2895271 2959822 3026160 3094619 3163445
58251 3163445 3232819 3305490 3382700 3463262 3547288 3636780 3731731 3829755 3930558 4036762 4149511
58240 4149511 4267526 4391356 4523963 4666056 4815377 4971732 5138011 5315152 5501122
58231 5501122 5696181 5904023 6126282 6361252 6609509 6875339 7161024 7465432 7789902
$$ packed form
58306A342172J3150J3388J2402J2223J4199J6439J6785J5989J5732J5869J5913
58295A504261J6795J8763J9982J9478J9132K0437K1935K2174K2357K3547K4175
58284A733036K3182K2705K4528K6644K6617K5693K6242K7645K8158K8544L0327
58273B023321L2591L3853L5025L7366L9707M0745M1787M4176M6528M7652M9402
58262B472153N3337N7389N9322O0531O2881O4870O4788O4551O6338O8459O8826
58251C163445O9374P2671P7210Q0562Q4026Q9492R4951R8024J00803J06204J12749
58240D149511J18015J23830J32607J42093J49321J56355J66279J77141J85970
58231E501122J95059K07842K22259K34970K48257K65830K85685L04408L24470
$$ plain form
58222 7789902 8139585 8517245 8922103 9356856 9829405 10345738 10908019 11521717 12197188
58213 12197188 12942147 13760682 14662458 15664762 16783291 18030253 19424421 20993306
58205 20993306 22763584 24762629 27035820 29653505 32701471 36283750 40544256 45672886
58197 45672886 51885587 59416216 68534366 79550728 92800699 108658937 127600059
58190 127600059 150235937 177280776 209447130 247170022 289955836 335462060 379015449
58183 379015449 414378864 435738588 439819601 426868292 400117269 364329530 324299337
58176 324299337 283858705 245521668 210633016 179747110 152965455 130123969 110888928
58169 110888928 94836855 81519237 70495803 61356420 53747390 47382880 42030784
$$ packed form
58222G789902L49683L77660M04858M34753M72549N16333N62281O13698O75471
58213A2197188P44959Q18535R01776J002304J118529J246962J394168J568885
58205B0993306J770278J999045K273191K617685L047966L582279M260506N128630
58197D5672886O212701P530629R118150J1016362J3249971J5858238J8941122
58190A27600059K2635878K7044839L2166354L7722892M2785814M5506224M3553389
58183C79015449L5363415K1359724M081013j2951309k6751023l5787739m0030193
58176C24299337m0440632l8337037l4888652l0885906k6781655k2841486j9235041
58169A10888928j6052073j3317618j1023434r139383p609030o364510n352096
$$ plain form
58162 42030784 37497264 33626673 30300311 27422486 24910745 22700577 20747448 19015638
58154 19015638 17470253 16083262 14838341 13723082 12721912 11820594 11010710 10284257
58146 10284257 9629201 9035007 8497363 8012836 7573412 7170300 6798610 6454363 6131299
58137 6131299 5824868 5535649 5265186 5011802 4773621 4551823 4347266 4157145 3978360
58128 3978360 3811151 3656358 3512028 3375804 3247848 3128539 3015990 2908622 2807587
58119 2807587 2713859 2625415 2539960 2458108 2381199 2308202 2237459 2169495 2105546 2045018 1986640
58108 1986640 1930568 1877300 1826135 1776487 1729069 1684210 1640801 1598365 1558196 1520915 1485052
58097 1485052 1449638 1415979 1385126 1355707 1326205 1297260 1269764 1242751 1215328 1188879 1165085
$$ packed form
58162D2030784m533520l870591l326362k877825k511741k210168j953129j731810
58154A9015638j545385j386991j244921j115259j001170r01318q09884p26453
58146A0284257o55056n94194n37644m84527m39424m03112l71690l44247l23064
58137F131299l06431k89219k70463k53384k38181k21798k04557j90121j78785
58128C978360j67209j54793j44330j36224j27956j19309j12549j07368j01035
58119B807587r3728q8444q5455q1852p6909p2997p0743o7964o3949o0528n8378
58108A986640n6072n3268n1165m9648m7418m4859m3409m2436m0169l7281l5863
58097A485052l5414l3659l0853k9419k9502k8945k7496k7013k7423k6449k3794
$$ plain form
58086 1165085 1143320 1122092 1101590 1082699 1064808 1046628 1028124 1009814 991276 972067 953060
58075 953060 935187 917859 900074 882039 864301 846466 828229 810559 794389 779205 764301
58064 764301 750314 738163 727561 717907 709522 702625 696161 688990 681208 673081 663857 653051 641807
58051 641807 631538 622112 612609 602958 593674 584958 577190 571179 566794 562477 557247 551982 547500 542771
58037 542771 536471 529035 521610 514172 506347 498983 493069 487845 481732 474460 466750 458579 449469 439979
58023 439979 431267 423421 415545 407237 398853 390759 383413 377695 373994 371386 368728 365982 363565 361186
58009 361186 358500 356173 354998 354557 354003 353585 354096 355264 355987 355804 355076 354108 353152 352819 353407 354262 354823
57992 354823 355770 358147 361918 366449 371744 377957 384223 389300 393026 395936 397806 397867 396158 393391 389643
$$ packed form
58086A165085k1765k1228k0502j8891j7891j8180j8504j8310j8538j9209j9007
58075I53060j7873j7328j7785j8035j7738j7835j8237j7670j6170j5184j4904
58064G64301j3987j2151j0602r654q385o897o464p171p782q127r224j0806j1244
58051F41807j0269r426r503r651r284q716p768o011m385m317n230n265m482m729
58037E42771o300p436p425p438p825p364n914n224o113p272p710q171r110r490
58023D39979q712p846p876q308q384q094p346n718l701k608k658k746k417k379
58009C61186k686k327j175m41n54m18N11J168P23j83p28r68r56l33N88Q55N61
57992C54823R47K377L771M531N295O213O266N077L726K910J870O1j709k767l748
$$ plain form
57977 389643 384392 377817 370939 364475 358429 352801 347825 343508 339621 336120 333082 330469 328424 327340
57963 327340 327123 326925 326249 325704 326031 327055 328280 329733 331355 332359 332147 331109 329581 326897 322628 317949
57947 317949 314440 312216 310506 309379 309318 309731 309573 309173 309828 311772 314186 317162 321961 329096 337629 346711
57931 346711 356416 366566 375904 383054 387489 389189 388192 384905 380100 374176 366961 358466 349292 340114
57917 340114 331214 322704 314802 307841 302217 298100 294897 291473 287468 284029 282579 283238 285036 287173
57903 287173 289273 290932 291989 292954 294257 295397 295747 295856 296872 298911 301080 302947 304958 307436 310233
57888 310233 313375 317087 321076 324638 327464 329597 330752 330631 329786 329162 328739 327584 325262 322226 318778
57873 318778 314686 310030 305512 301580 298019 294641 291635 288903 285730 281521 276569 271967 268996 268456
$$ packed form
57977C89643n251o575o878o464o046n628m976m317l887l501l038k613k045j084
57963C27340k17j98o76n45L27J024J225J453J622J004k12j038j528k684m269m679
57947C17949l509k224j710j127o1M13j58m00O55J944K414K976M799P135Q533R082
57931C46711R705J0150R338P150M435J700r97l287m805n924p215q495r174r178
57917C40114q900q510p902o961n624m117l203l424m005l439j450O59J798K137
57903B87173K100J659J057R65J303J140L50J09J016K039K169J867K011K478K797
57888C10233L142L712L989L562K826K133J155j21q45o24m23j155k322l036l448
57873C18778m092m656m518l932l561l378l006k732l173m209m952m602k971n40
$$ plain form
57859 268456 270156 273151 276768 281059 285917 290448 293965 297049 300708 304906 308945 312843 317165 321717
57845 321717 325592 328413 330493 331856 332272 332213 332574 333302 333363 332218 330381 328457 326590 324911 323480 321704
57829 321704 318934 315732 313472 312455 311508 309749 307683 306127 305025 303879 302654 301806 301900 303245 305329
57814 305329 306644 305780 302589 297640 290887 282055 272069 262753 254966 248228 242095 236556 231050 224811
57800 224811 218558 214266 212630 212161 211383 210421 209671 208517 206518 204620 203870 203910 203937 204272 205671 207737 209328
57783 209328 210212 211279 213395 216899 221849 227861 233907 239093 243530 247948 252742 257800 262826 267280
57769 267280 270507 272471 273905 275162 275504 274203 271761 269230 266801 263937 260640 257667 255633 254756 255444
57754 255444 258403 263902 271406 280009 288935 297547 305178 311088 314673 315901 315550 314635 313454 311508 308362
$$ packed form
57859B68456J700K995L617M291M858M531L517L084L659M198M039L898M322M552
57845C21717L875K821K080J363M16n9L61P28O1j145j837j924j867j679j431j776
57829C21704k770l202k260j017r47j759k066j556j102j146j225q48R4J345K084
57814C05329J315q64l191m949o753q832r986r316p787o738o133n539n506o239
57800B24811o253m292j636m69p78r62p50j154j999j898p50M0K7L35J399K066J591
57783B09328Q84J067K116L504M950O012O046N186M437M418M794N058N026M454
57769B67280L227J964J434J257L42j301k442k531k429k864l297k973k034q77O88
57754B55444K959N499P504Q603Q926Q612P631N910L585J228l51r15j181j946l146
$$ plain form
57739 308362 304164 299313 294253 289753 286684 285153 284354 283574 282781 282058 281183 280183 279572 279513 279382 278676 277758
57722 277758 277124 276590 275891 275618 276792 279761 284048 288971 293923 298385 302167 305413 308018 309426 309299
57707 309299 307899 305525 302237 298602 295978 295299 296072 297226 298463 300098 302041 303786 305050 305679 305149
57692 305149 302895 298962 293728 287211 279266 270288 261110 252327 244184 236861 230482 225123 221249 219697
57678 219697 220710 223457 227124 232010 238918 248080 259581 274415 294057 319201 349827 386246 428838
57665 428838 476395 525235 569788 603519 620187 616352 593706 558344 517081 474568 433426 395540
57653 395540 362212 333676 309438 289024 272089 258107 246499 236958 229387 223560 219021 215204
57641 215204 211584 207941 204590 202152 200950 200736 201047 201580 202135 202435 202237 201512 200440 199301 198409 197972
$$ packed form
57739C08362m198m851n060m500l069j531p99p80p93p23q75j000o11n9j31p06r18
57722B77758o34n34o99k73J174K969M287M923M952M462L782L246K605J408j27
57707C09299j400k374l288l635k624o79P73J154J237J635J943J745J264O29n30
57692C05149k254l933n234o517p945q978r178q783q143p323o379n359l874j552
57678B19697J013K747L667M886O908R162J1501J4834J9642K5144L0626L6419M2592
57665D28838M7557M8840M4553L3731J6668l835k2646l5362m1263m2513m1142l7886
57653C95540l3328k8536k4238k0414j6935j3982j1608r541p571n827m539l817
57641B15204l620l643l351k438j202k14L11N33N55L00j98p25j072j139q92m37
$$ plain form
57625 197972 197881 197708 197056 195941 194754 193740 192539 190464 187398 184245 182107 181022 179871 177637 174462
57610 174462 171378 169266 168219 167590 166535 164785 163021 162223 162589 163442 164212 164987 165893 166515 166346 165448 164249
57593 164249 162985 161654 160214 158552 156498 154150 151883 149800 147553 144954 142425 140511 139323 138655
57579 138655 138281 137869 137087 136072 135305 134707 133426 130952 127885 125168 123102 121607 120807 120606 120193 118794
57563 118794 116634 114499 112667 110941 109436 108547 108329 108524 109042 109798 110323 110214 109802 109733 110049 110236 110009
57546 110009 109512 109017 109028 110266 112811 115571 117446 118795 120877 124012 127246 129815 131864 133545 134330
57531 134330 133733 132137 130553 129938 130813 133063 135932 138716 141567 145245 149984 155066 159605 163384 166842
57516 166842 170553 174738 179057 182914 186179 189297 192381 194672 195467 195170 194705 194188 193004 191013 188767
$$ packed form
57625A97972r1j73o52j115j187j014j201k075l066l153k138j085j151k234l175
57610A74462l084k112j047o29j055j750j764p98L66Q53P70P75R06O22j69q98j199
57593A64249j264j331j440j662k054k348k267k083k247k599k529j914j188o68
57579A38655l74m12p82j015p67n98j281k474l067k717k066j495q00k01m13j399
57563A18794k160k135j832j726j505q89k18J95N18P56N25j09m12o9L16J87k27
57546A10009m97m95J1J238K545K760J875J349K082L135L234K569K049J681P85
57531A34330n97j596j584o15Q75K250K869K784K851L678M739N082M539L779L458
57516A66842L711M185M319L857L265L118L084K291P95k97m65n17j184j991k246
$$ plain form
57501 188767 186585 184263 181696 178982 175826 171661 166536 161203 156163 151286 146429 141717 137059 132140
57487 132140 127087 122471 118501 114866 111573 109173 107868 107077 106251 105468 104864 104110 102960 101863 101575 102411
57471 102411 104192 106549 108969 110863 111942 112405 112632 112866 113241 113814 114483 115076 115545 115887 116054 116230 116936
57454 116936 118407 120067 121122 121505 121633 121507 120792 119675 118823 118458 118183 117761 117370 117101 116939 117245 118419
57437 118419 120058 121279 121962 122724 123606 123817 123069 122074 121311 120336 118911 117814 117735 118119 117988 117272 116565 116018
57419 116018 115325 114524 113999 113758 113342 112455 111363 110642 110743 111695 113099 114514 115821 116980 117621 117375 116498
57402 116498 115588 114730 113662 112764 112969 114457 116246 117378 117787 117762 117394 116936 116897 117305 117588 117517 117483 117560 117302
57383 117302 116952 117711 119981 122358 123366 123363 123654 124435 124828 124485 123962 123721 123807 124358 125469 126587 126904 126281
$$ packed form
57501A88767k182k322k567k714l156m165n125n333n040m877m857m712m658m919
57487A32140n053m616l970l635l293k400j305p91q26p83o04p54j150j097k88Q36
57471A02411J781K357K420J894J079M63K27K34L75N73O69N93M69L42J67J76P06
57454A16936J471J660J055L83J28j26p15j117q52l65k75m22l91k69j62L06J174
57437A18419J639J221O83P62Q82K11p48r95p63r75j425j097p9L84j31p16p07n47
57419A16018o93q01n25k41m16q87j092p21J01R52J404J415J307J159O41k46q77
57402A16498r10q58j068q98K05J488J789J132M09k5l68m58l9M08K83p1l4P7k58
57383A17302l50P59K270K377J008lK91P81L93l43n23k41Q6N51J111J118L17o23
$$ plain form
57365 126281 125125 123556 121533 119605 118586 118436 118330 117981 118061 119103 120642 121816 122363 122708 123403 124666
57349 124666 126334 128145 130100 132390 134844 136800 137852 138377 138927 139409 139415 139092 139058 139520 140085 140476 140919
57332 140919 141733 142835 143726 143750 142576 140742 139509 139706 140816 141606 141516 140956 140344 139508 138204 136698 135535
57315 135535 134969 134820 134788 134744 134730 134779 134778 134612 134386 134366 134676 135219 135886 136627 137336 138027 139094 141059 143920 147091
57295 147091 149991 152356 154067 155246 156568 158823 161985 165286 168326 171321 174070 175640 175683 175272 175696
57280 175696 176938 178006 178233 177591 176228 174536 173349 173330 174238 175284 175988 176245 176029 175534 175254 175293 174989
57263 174989 173833 172392 171645 171695 171770 171287 170357 169510 169423 170572 172585 174297 175022 175395 176415 178166 180139
57246 180139 182272 184784 187402 189716 192012 194832 197928 200549 202584 204483 206250 207462 208211 209051 209957
$$ packed form
57365A26281j156j569k023j928j019j50j06l49Q0J042J539J174N47L45O95J263
57349A24666J668J811J955K290K454J956J052N25N50M82Ol23l4M62N65L91M43
57332A40919Q14J102Q91K4j174j834j233J97J110P90r0n60o12q36j304j506j163
57315A35535n66j49l2m4j4M9jj66k26k0L10N43O67P41P09O91J067J965K861L171
57295A47091K900K365J711J179J322K255L162L301L040K995K749J570M3m11M24
57280A75696J242J068K27o42j363j692j187j9R08J046P04K57k16m95k80L9l04
57263A74989j156j441p47N0P5m83r30q47q7J149K013J712P25L73J020J751J973
57246A80139K133K512K618K314K296K820L096K621K035J899J767J212P49Q40R06
$$ plain form
57231 209957 210317 210093 210119 211074 212866 215186 217891 220628 222813 224322 225743 227732 230478 233828 237473
57216 237473 240972 244052 246945 250087 253566 257242 261172 265427 269721 273756 277785 282284 287275 292446
57202 292446 297658 302793 307514 311831 316490 321970 327554 332347 336833 342292 348855 355362 361097 366512
57188 366512 372145 377960 384023 390759 398236 406042 414092 422714 431825 440965 450241 460205 470524 479948
57174 479948 488108 496329 506090 517422 529401 541410 553273 564767 575712 586217 596415 606312
57162 606312 616165 626530 637615 648994 660184 671129 681969 692849 704076 715990 728532 741477
57150 741477 755123 770147 786685 804190 822242 840831 859774 878632 897442 916829 937130
57139 937130 957937 978710 999270 1019633 1040005 1060977 1083033 1105783 1128434 1151089 1174836
$$ packed form
57231B09957L60k24K6R55J792K320K705K737K185J509J421J989K746L350L645
57216B37473L499L080K893L142L479L676L930M255M294M035M029M499M991N171
57202B92446N212N135M721M317M659N480N584M793M486N459O563O507N735N415
57188C66512N633N815O063O736P477P806Q050Q622R111R140R276R964J0319R424
57174D79948Q160Q221R761J1332J1979J2009J1863J1494J0945J0505J0198R897
57162F06312R853J0365J1085J1379J1190J0945J0840J0880J1227J1914J2542J2945
57150G41477J3646J5024J6538J7505J8052J8589J8943J8858J8810J9387K0301
57139I37130K0807K0773K0560K0363K0372K0972K2056K2750K2651K2655K3747
$$ plain form
57128 1174836 1200417 1227565 1255744 1284820 1314894 1346260 1379631 1415707 1454443 1495467 1539134
57117 1539134 1586383 1637646 1692791 1751978 1815623 1883763 1956683 2036062 2124271 2222619 2331597
57106 2331597 2452805 2589237 2743734 2918821 3118551 3349453 3619941 3940479 4324540
57097 4324540 4788139 5348588 6024880 6837808 7806159 8941246 10245250 11712191 13326800
57088 13326800 15063933 16893945 18788360 20716784 22644497 24549161 26445371 28375091
57080 28375091 30349618 32292988 34049103 35449401 36377458 36785034 36673890 36078092 35054540
57071 35054540 33670810 31991317 30073307 27973397 25753800 23482095 21227027 19052527
57063 19052527 17010242 15134081 13440761 11934412 10610152 9455951 8455225 7589871
$$ packed form
57128A174836K5581K7148K8179K9076L0074L1366L3371L6076L8736M1024M3667
57117A539134M7249N1263N5145N9187O3645O8140P2920P9379Q8209R8348J08978
57106B331597J21208J36432J54497J75087J99730K30902K70488L20538L84061
57097D324540M63599N60449O76292Q12928R68351J135087J304004J466941J614609
57088A3326800J737133J830012J894415J928424J927713J904664J896210J929720
57080B8375091J974527J943370J756115J400298R28057M07576j11144n95798j023552
57071C5054540j383730j679493j918010k099910k219597k271705k255068k174500
57063A9052527k042285j876161j693320j506349j324260j154201j000726q65354
$$ plain form
57055 7589871 6841623 6192618 5627081 5132699 4699350 4316979 3975834 3668339 3389517
57046 3389517 3136048 2906131 2699655 2516719 2355635 2213185 2086639 1974485 1875484 1788294
57036 1788294 1712144 1646801 1591754 1546374 1510951 1486448 1472973 1469341 1474152 1485701 1499638 1507560
57024 1507560 1499770 1470520 1420941 1357324 1286933 1215059 1144653 1077284 1013815 954621 899863
57013 899863 849756 804355 763175 725440 690790 659359 631074 605251 581079 558157 536421
57002 536421 515903 496717 478958 462453 446970 432729 420218 409315 399175 389418 380942 375018
56990 375018 371880 370714 370774 372011 374794 379576 386770 396452 407952 419893 430483 437681 439412 434365
56976 434365 422825 406558 387751 368035 348333 329223 311335 295467 282373 272382 265190 260119
$$ packed form
57055G589871p48248o49005n65537m94382m33349l82371l41145l07495k78822
57046C389517k53469k29917k06476j82936j61084j42450j26546j12154r9001q7190
57036A788294p6150o5343n5047m5380l5423k4503j3475l632M811J1549J3937P922
57024A507560p790k9250m9579o3617p0391p1874p0406o7369o3469n9194n4758
57013H99863n0107m5401m1180l7735l4650l1431k8285k5823k4172k2922k1736
57002E36421k0518j9186j7759j6505j5483j4241j2511j0903j0140r757q476n924
56990C75018l138j166O0J237K783M782P194R682J1500J1941J0590P198J731n047
56976D34365j1540j6267j8807j9716j9702j9110j7888j5868j3094r991p192n071
$$ plain form
56964 260119 256617 254633 254655 257367 263153 271975 283838 299109 317800 338390 357688 372082 378932
56951 378932 377131 367197 351164 331816 311338 290731 270626 252181 236681 224561 215367 208685
56939 208685 204678 203768 206165 211816 220601 232657 248675 269713 296223 327021 359145 388547 410985
56926 410985 422940 422661 410751 389626 362283 331544 299964 269642 241803 216876 195176 177188
56914 177188 162999 151761 142137 133229 124932 117499 111031 105351 100194 95432 91168 87567 84554 81879
56900 81879 79596 78231 78241 79491 81612 84800 89850 97408 107653 120791 137357 157739 181825 209457
56886 209457 240788 275610 312451 348647 381094 406650 422610 427973 424444 415333 403205 389109
56874 389109 374043 360043 349082 341515 336383 333008 331773 333679 339766 350927 367805 390828 420608
$$ packed form
56964B60119l502j984K2K712N786Q822J1863J5271J8691K0590J9298J4394O850
56951C78932j801r934j6033j9348k0478k0607k0105j8445j5500j2120r194o682
56939B08685m007r10K397N651Q785J2056J6018K1038K6510L0798L2124K9402K2438
56926D10985J1955k79j1910k1125k7343l0739l1580l0322k7839k4927k1700j7988
56914A77188j4189j1238r624q908q297p433o468n680n157m762m264l601l013k675
56900H1879k283j365J0J250K121L188N050P558J0245J3138J6566K0382K4086K7632
56886B09457L1331L4822L6841L6196L2447K5556J5960N363l529r111j2128j4096
56874C89109j5066j4000j0961p567n132l375j235J906O087J1161J6878K3023K9780
$$ plain form
56861 420608 458133 504123 557917 616709 675352 726793 763689 780969 777615 756324 721787 679269
56849 679269 633815 589613 549599 515653 488939 469851 458134 453620 456784 468314 488526 517707
56837 517707 556810 607282 670385 746892 836527 936188 1038123 1130477 1200480 1238186 1239068 1205117
56825 1205117 1144056 1066358 981605 896635 816045 743152 680043 627357 584770 551937 529058
56814 529058 516756 515382 524412 542776 570099 607341 655751 715155 783148 854911 922787 976636
56802 976636 1006684 1007639 980623 931534 868096 797857 727131 660225 599333 545394 499026 460712
56790 460712 430512 407948 392174 382398 378435 380727 389541 404426 424948 451623 485009 523348
56778 523348 561545 592868 611674 615017 602855 577519 542710 502290 459556 417182 377241 341026
$$ packed form
56861D20608L7525M5990N3794N8792N8643N1441L6896J7280l354k1291l4537m2518
56849F79269m5454m4202m0014l3946k6714j9088j1717m514L164J1530K0212K9181
56837E17707L9103N0472O3103P6507Q9635R9661J01935R2354P0003L7706Q82l3951
56825A205117o1061p7698q4753q4970q0590p2893o3109n2686m2587l2833k2879
56814E29058j2302j374R030J8364K7323L7242M8410N9404O7993P1763O7876N3849
56802I76636L0048R55k7016m9089o3438p0239p0726o6906o0892n3939m6368l8314
56790D60712l0200k2564j5774r776l963K292Q814J4885K0522K6675L3386L8339
56778E23348L8197L1323J8806L343j2162k5336l4809m0420m2734m2374l9941l6215
$$ plain form
56766 341026 309061 281361 257635 237485 220733 207367 196913 188194 180145 172583 165637 158870
56754 158870 151771 144778 138810 133861 129100 124377 120538 117960 115812 113219 110369 107982 106417 105745
56740 105745 105949 106535 106656 106165 106005 106930 108356 109064 108653 107715 106900 106381 106039 105755 105522 105510 105899 106666 107740
56721 107740 109275 111223 112769 112898 111735 110592 110445 111037 111795 112817 114418 116345 118109 119701 121452
56706 121452 123494 125758 128145 130287 131469 131174 129501 126893 123858 121119 119495 119244 119866 120696 121372
56691 121372 121717 121849 122480 124354 127100 129399 130608 131426 132686 134375 136317 138850 142102 145336 147791
56676 147791 149586 151117 152216 152610 152574 152361 151510 149552 146894 144261 141694 138848 135806 132846 129838
56661 129838 126618 123536 120858 118090 114727 111293 108791 107440 106767 106519 106581 106355 105246 103645 102470
$$ packed form
56766C41026l1965k7700k3726k0150j6752j3366j0454q719q049p562o946o767
56754A58870p099o993n968m949m761m723l839k578k148k593k850k387j565o72
56740A05745K04N86J21m91j60R25J426P08m11r38q15n19l42k84k33j2L89P67J074
56721A07740J535J948J546J29j163j143j47N92P58J022J601J927J764J592J751
56706A21452K042K264K387K142J182k95j673k608l035k739j624k51O22Q30O76
56691A21372L45J32O31J874K746K299J209Q18J260J689J942K533L252L234K455
56676A47791J795J531J099L94l6k13q51j958k658k633k567k846l042k960l008
56661A29838l220l082k678k768l363l434k502j351o73k48O2k26j109j601j175
$$ plain form
56646 102470 101878 101279 100515 100093 100298 100919 101900 103428 105304 106955 108104 108851 109195 109220 109595 111023 113150
56629 113150 114841 115658 116313 117497 119069 120552 121734 122429 122266 121105 119311 117407 115743 114572 114008
56614 114008 113841 113732 113647 113770 114057 114322 114714 115595 116898 118086 118767 118980 118864 118509 118201 118374 119184 120364
56596 120364 121481 122133 122085 121570 121309 121747 122387 122279 121139 119560 118257 117536 117400 117684 118031 118104 117941 117918
56578 117918 118456 119848 122056 124500 126491 128144 130331 133350 136290 138335 139993 142166 144614 146513
56564 146513 148173 150931 155361 160800 166804 173853 182175 190841 198644 205271 211130 216615 222004 227611
56550 227611 233498 239325 244782 249947 254912 259294 262424 264005 264436 264439 264327 263603 261539 258222 254667 251719
56534 251719 249222 246598 243703 240596 236921 232226 226721 221106 215861 211198 207374 204417 201795 199025
$$ packed form
56646A02470n92n99p64m22K05O21R81J528J876J651J149P47L44K5L75J428K127
56629A13150J691Q17O55J184J572J483J182O95j63j161j794j904j664j171n64
56614A14008j67j09q5J23K87K65L92Q81J303J188O81K13j16l55l08J73Q10J180
56596A20364J117O52m8n15k61M38O40j08j140j579j303p21j36K84L47P3j63k3
56578A17918N38J392K208K444J991J653K187L019K940K045J658K173K448J899
56564A46513J660K758M430N439O004P049Q322Q666P803O627N859N485N389N607
56550B27611N887N827N457N165M965M382L130J581M31Lj12p24k064l317l555k948
56534B51719k497k624k895l107l675m695n505n615n245m663l824k957k622k770
$$ plain form
56520 199025 196358 194232 192364 190134 187521 184856 181946 178422 174788 172023 170141 168102 165258 162057
56506 162057 159206 156976 155457 154683 154348 154066 153982 154449 155186 155539 155456 155273 154648 152857 150296 148496 148273
56489 148273 148870 149334 149782 150757 152211 153723 155059 155963 156012 155208 154217 153676 153652 154046 154952 156279 157569 158448
56471 158448 158880 158877 158459 157921 157476 156700 155162 153617 153493 154932 156469 157060 157399 158571 160366 161757 162331
56454 162331 162407 162235 161865 161547 161631 162211 163210 164498 165703 166361 166486 166564 166815 167060 167459 168551 170199 171306
56436 171306 171141 170261 169615 169376 169211 169033 168815 168207 167052 165834 165059 164604 164251 164345 165229 166397 166976 166828
56418 166828 166532 166445 166364 166091 165875 166281 167810 170413 173176 174835 174976 174520 174712 175855 177274 178238 178607
56401 178607 178758 179130 179711 179940 179356 178264 177357 176747 175938 174753 173570 172544 171252 169438 167441 165660
$$ packed form
56520A99025k667k126j868k230k613k665k910l524l634k765j882k039k844l201
56506A62057k851k230j519p74l35k82q4M67P37L53q3j83o25j791k561j800k23
56489A48273N97M64M48R75J454J512J336R04M9q04r91n41k4L94R06J327J290Q79
56471A58448M32lm18n38m45p76j538j545j24J439J537N91L39J172J795J391N74
56454A62331P6j72l70l18Q4N80R99J288J205O58J25P8K51K45L99J092J648J107
56436A71306j65q80o46k39j65j78k18o08j155j218p75m55l53R4Q84J168N79j48
56418A66828k96q7q1k73k16M06J529K603K763J659J41m56J92J143J419R64L69
56401A78607J51L72N81K29n84j092r07o10q09j185j183j026j292j814j997j781
$$ plain form
56385 165660 164192 163275 163351 164358 165595 166732 168423 171521 176171 181951 188374 195021 201749 208931 216721
56370 216721 223940 228689 230508 231011 231815 232799 233072 232620 232031 231296 230018 228342 226776 225426 224252 223721
56354 223721 224328 225659 226712 227008 226800 226442 226128 226019 226006 225613 224714 224065 224461 225660 226770 227520 228462 230044
56336 230044 232115 234271 236133 237342 237833 238098 238693 239504 239932 239818 239762 240376 241548 242639 243330 244099 245719
56319 245719 248233 250701 252235 253017 253839 254887 255672 256067 256607 257622 258878 260278 262128 264435 266706
56304 266706 268885 271837 276364 282250 288600 294586 299604 303395 306442 309700 313505 317264 320454 323339
56290 323339 326465 330146 334719 340504 347102 353411 358766 363446 367793 371737 375532 380035 385739 392387
56276 392387 399973 409093 419690 430476 440490 450371 461284 473371 486108 499418 513481 528092
$$ packed form
56385A65660j468r17P6J007J237J137J691L098M650N780O423O647O728P182P790
56370B16721P219M749J819N03Q04R84K73m52n89p35j278j676j566j350j174n31
56354B23721O07J331J053K96k08l58l14j09j3l93q99o49L96J199J110P50R42J582
56336B30044K071K156J862J209M91K65N95Q11M28j14n6O14J172J091O91P69J620
56319B45719K514K468J534P82Q22J048P85L95N40J015J256J400J850K307K271
56304B66706K179K952M527N886O350N986N018L791L047L258L805L759L190K885
56290C23339L126L681M573N785O598O309N355M680M347L944L795M503N704O648
56276C92387P586R120J0597J0786J0014R881J0913J2087J2737J3310J4063J4611
$$ plain form
56264 528092 543177 559536 578194 599325 622468 647457 674684 704933 739364 779065 824245
56253 824245 874572 930650 994211 1066407 1146925 1235333 1332034 1437072 1549149 1666854 1789795
56242 1789795 1917355 2047259 2176472 2302636 2423413 2535248 2634113 2716878 2780972 2823690
56232 2823690 2843334 2840599 2817574 2775825 2716553 2641933 2554863 2457748 2352716 2242602 2130465
56221 2130465 2018377 1907684 1800000 1696760 1598211 1504030 1414679 1331167 1253805 1182194
56211 1182194 1116086 1055384 999714 948851 903016 861956 824496 789885 758684 731221 706192
56200 706192 682221 659915 640733 624531 609901 596406 584710 574826 565940 557856 551039 545320
56188 545320 540004 535104 531116 527700 524022 520246 517312 515342 513605 511940 510824 510128 509184 508096 507655
$$ packed form
56264E28092J5085J6359J8658K1131K3143K4989K7227L0249L4431L9701M5180
56253H24245N0327N6078O3561P2196Q0518Q8408R6701J05038J12077J17705J22941
56242A789795J27560J29904J29213J26164J20777J11835R8865Q2765O4094M2718
56232B823690J9644k735k3025m1749n9272p4620q7070r7115j05032j10114j12137
56221B130465j12088j10693j07684j03240r8549r4181q9351q3512p7362p1611
56211A182194o6108o0702n5670n0863m5835m1060l7460l4611l1201k7463k5029
56200G06192k3971k2306j9182j6202j4630j3495j1696r884q886q084o817n719
56188E45320n316m900l988l416l678l776k934j970j737j665j116o96r44j088m41
$$ plain form
56173 507655 507955 508269 508356 508756 509845 511595 514108 517368 520781 524085 528295 534529 542300 550223 557988
56158 557988 566178 574639 582729 591007 600968 612973 625869 638767 651910 665817 680863 697821
56146 697821 717688 740977 768158 800578 839913 887067 942668 1008003 1083968 1169321 1261192
56135 1261192 1356794 1453206 1546092 1630659 1704231 1767100 1821440 1870572 1918271 1966618 2014347
56124 2014347 2058304 2095894 2124975 2142790 2147470 2140201 2123892 2099977 2068095 2027931 1979048 1919560
56112 1919560 1847738 1765093 1675905 1583951 1491727 1402309 1319261 1244496 1178318 1121364 1074192
56101 1074192 1035198 1001595 972647 949612 932451 919153 908465 900786 895982 892741 890474 889588
56089 889588 889621 889412 889381 891306 895548 900702 906033 911880 917709 922498 927219 934135 943312 952650 961580
$$ packed form
56173E07655L00L14Q7M00J089J750K513L260L413L304M210O234P771P923P765
56158E57988Q190Q461Q090Q278R961J2005J2896J2898J3143J3907J5046J6958
56146F97821J9867K3289K7181L2420L9335M7154N5601O5335P5965Q5353R1871
56135A261192R5602R6412R2886Q4567P3572O2869N4340M9132M7699M8347M7729
56124B014347M3957L7590K9081J7815M680p269j6309k3915l1882m0164m8883n9488
56112A919560p1822q2645q9188r1954r2224q9418q3048p4765o6178n6954m7172
56101A074192l8994l3603k8948k3035j7161j3298j0688p679m804l241k267q86
56089H89588L3k09l1J925M242N154N331N847N829M789M721O916R177R338Q930
$$ plain form
56074 961580 971720 983417 994850 1005381 1016671 1029428 1041983 1053322 1064825 1077716 1091336
56063 1091336 1105075 1119616 1135067 1150227 1164752 1179867 1196060 1212309 1228291 1244928 1262087
56052 1262087 1278255 1293160 1308199 1323763 1338932 1354297 1371965 1391959 1411770 1430421 1449895
56041 1449895 1471496 1493921 1516063 1538718 1562307 1585931 1609788 1635629 1663777 1692715 1722416
56030 1722416 1754835 1790170 1826154 1862026 1899711 1939966 1981045 2022268 2065243 2110395 2156180
56019 2156180 2202786 2252535 2305434 2358723 2412161 2469199 2531361 2596238 2662868 2734173 2811882
56008 2811882 2893790 2978346 3067201 3160985 3257486 3356479 3461363 3573557 3690344 3810799
55998 3810799 3938405 4075007 4217707 4364772 4519008 4682200 4852088 5028162 5214515
$$ packed form
56074I61580J0140J1697J1433J0531J1290J2757J2555J1339J1503J2891J3620
56063A091336J3739J4541J5451J5160J4525J5115J6193J6249J5982J6637J7159
56052A262087J6168J4905J5039J5564J5169J5365J7668J9994J9811J8651J9474
56041A449895K1601K2425K2142K2655K3589K3624K3857K5841K8148K8938K9701
56030A722416L2419L5335L5984L5872L7685M0255M1079M1223M2975M5152M5785
56019B156180M6606M9749N2899N3289N3438N7038O2162O4877O6630P1305P7709
56008B811882Q1908Q4556Q8855R3784R6501R8993J04884J12194J16787J20455
55998C810799J27606J36602J42700J47065J54236J63192J69888J76074J86353
$$ plain form
55989 5214515 5413520 5623004 5843292 6080388 6338107 6613853 6906501 7221439 7563197
55980 7563197 7930502 8323829 8750485 9216897 9723514 10272937 10875270 11539766 12269761
55971 12269761 13071978 13961937 14954172 16057502 17287504 18673534 20246724 22034347
55963 22034347 24076401 26437185 29194187 32434298 36276760 40887770 46462149 53209227
55955 53209227 61371004 71233552 83106256 97323042 114300556 134584875 158824919
55948 158824919 187698684 221734140 260787215 303142719 344845316 380159187 403340983
55941 403340983 410760396 402055282 379807345 348252791 311874434 274408927 238415694
55934 238415694 205333713 175809276 150026264 127896908 109155553 93437462 80345066
$$ packed form
55989E214515J99005K09484K20288K37096K57719K75746K92648L14938L41758
55980G563197L67305L93327M26656M66412N06617N49423O02333O64496P29995
55971A2269761Q02217Q89959R92235J103330J230002J386030J573190J787623
55963B2034347K042054K360784K757002L240111L842462M611010N574379O747078
55955E3209227Q161777R862548J1872704J4216786J6977514K0284319K4240044
55948A58824919K8873765L4035456L9053075M2355504M1702597L5313871K3181796
55941D03340983P419413q705114k2247937l1554554l6378357l7465507l5993233
55934B38415694l3081981k9524437k5783012k2129356j8741355j5718091j3092396
$$ plain form
55927 80345066 69478354 60452210 52925797 46621998 41315742 36816131 32968115 29656497
55919 29656497 26791954 24296091 22104639 20173319 18468492 16956570 15608506 14406340
55911 14406340 13336348 12380587 11521186 10746875 10048774 9415065 8835657 8306825 7825622
55902 7825622 7384563 6976797 6601309 6257800 5941246 5646499 5373486 5122773 4890463
55893 4890463 4672482 4469711 4283973 4112844 3953144 3805760 3672236 3549936 3435036
55884 3435036 3326970 3225514 3126675 3026152 2924422 2824470 2727095 2632281 2542352 2459495
55874 2459495 2382035 2306724 2232861 2161157 2090923 2021659 1955259 1893498 1835327 1779412 1726983
55863 1726983 1679242 1634354 1590149 1547677 1508945 1473129 1438114 1403972 1371949 1341627 1311882
$$ packed form
55927H0345066j0866712r026144p526413o303799n306256m499611l848016l311618
55919B9656497k864543k495863k191452j931320j704827j511922j348064j202166
55911A4406340j069992r55761q59401p74311o98101o33709n79408n28832m81203
55902G825622m41059m07766l75488l43509l16554k94747k73013k50713k32310
55893D890463k17981k02771j85738j71129j59700j47384j33524j22300j14900
55884C435036j08066j01456r8839j00523j01730r9952r7375r4814q9929q2857
55874B459495p7460p5311p3863p1704p0234o9264o6400o1761n8171n5915n2429
55863A726983m7741m4888m4205m2472l8732l5816l5015l4142l2023l0322k9745
$$ plain form
55852 1311882 1283129 1256025 1229486 1202346 1175264 1148801 1121637 1093115 1065557 1041358 1019504
55841 1019504 997525 975170 953659 933034 912880 894117 877474 861664 845471 830159 817377
55830 817377 806213 794815 783428 773264 763770 753674 743572 734853 726986 718239 708175 697253
55818 697253 685018 670987 656441 643156 631161 619653 609142 600681 593913 587806 582390 578009
55806 578009 573944 569681 566455 565662 566863 569130 573028 579233 586412 592658 597878 602621 605731 605502 602343
55791 602343 597962 592676 585697 577433 569351 562063 555340 549291 543642 536636 526637 514241 501039 487262
55777 487262 472630 458666 447893 441193 437879 437740 440974 446536 452458 457371 460128 458839 452422 442553
55763 442553 432095 422041 411858 402000 393718 386764 379574 371667 363952 356873 350164 344162 339379
$$ packed form
55852A311882k8753k7104k6539k7140k7082k6463k7164k8522k7558k4199k1854
55841A019504k1979k2355k1511k0625k0154j8763j6643j5810j6193j5312j2782
55830H17377j1164j1398j1387j0164r494j0096j0102q719p867q747j0064j0922
55818F97253j2235j4031j4546j3285j1995j1508j0511q461o768o107n416m381
55806E78009m065m263l226p93J201K267L898O205P179O246N220M743L110k29l159
55791F02343m381n286o979q264q082p288o723o049n649p006r999j2396j3202j3777
55777D87262j4632j3964j0773o700l314j39L234N562N922M913K757j289o417r869
55763D42553j0458j0054j0183r858q282o954p190p907p715p079o709o002m783
$$ plain form
55750 339379 335001 329742 324026 319366 315812 312106 308258 305749 304937 304353 302980 301346 299876 297862 294752
55735 294752 291006 287124 283000 278729 275024 272506 271388 271782 273324 274614 274188 272027 269073 265525 260869
55720 260869 255382 250224 246037 242623 239935 238262 237502 237439 238587 241642 246196 251053 255487 259120 261116
55705 261116 260930 259581 258683 258409 257741 256333 254576 252007 247431 240805 233570 226956 221218 216474 212838
55690 212838 209683 206195 202818 200887 200799 201823 203623 206495 210076 213375 216248 219475 223174 226542 229341
55675 229341 232144 234841 236332 236134 234960 233327 230884 227576 224266 221674 219729 218323 217593 217111 215975
55660 215975 214217 213111 213591 215263 217343 219568 221728 223285 224072 224706 225804 227306 228845 230210 231231
55645 231231 231670 231345 229936 226920 222261 216848 211549 206222 200493 194916 190202 185818 180771 175435 171126
$$ packed form
55750C39379m378n259n716m660l554l706l848k509q12n84j373j634j470k014l110
55735B94752l746l882m124m271l705k518j118L94J542J290m26k161k954l548m656
55720B60869n487n158m187l414k688j673p60o3J148L055M554M857M434L633J996
55705B61116j86j349q98k74o68j408j757k569m576o626p235o614n738m744l636
55690B12838l155l488l377j931q8J024J800K872L581L299K873L227L699L368K799
55675B29341K803K697J491j98j174j633k443l308l310k592j945j406p30m82j136
55660B15975j758j106M80J672K080K225K160J557P87O34J098J502J539J365J021
55645B31231M39l25j409l016m659n413n299n327n729n577m714m384n047n336m309
$$ plain form
55630 171126 168083 165418 163002 161640 161261 160680 159533 158850 159222 159949 160559 161606 163163 163959 162947 160649
55614 160649 158135 155647 153060 150729 148958 147330 145355 143231 141435 140113 139288 139086 139318 139421 139022
55599 139022 138073 136427 134144 132143 131482 131818 131703 130593 129417 128812 128151 126896 125701 125367 125645 125881
55583 125881 126123 126928 128720 131803 136288 141549 146481 150785 155336 161005 167932 176257 186526 198868
55569 198868 212570 226831 240937 253306 261639 264934 264520 262305 258699 252997 245005 235428 225111
55556 225111 214645 204302 193836 182767 171353 160770 151921 144555 137928 131810 126523 122543 120335
55543 120335 119946 120468 120562 119739 118516 117305 116074 115226 115565 116922 117938 117848 117465 117772 118425 118331 116812 113632
55525 113632 108852 103393 98829 95791 93316 90418 87431 85059 83159 81528 81153 83505 89016 97045
$$ packed form
55630A71126l043k665k416j362l79n81j147o83L72P27O10J047J557P96j012k298
55614A60649k514k488k587k331j771j628j975k124j796j322q25k02K32J03l99
55599A39022r49j646k283k001o61L36j15j110j176o05o61j255j195l34K78K36
55583A25881K42Q05J792L083M485N261M932M304M551N669O927Q325J0269J2342
55569A98868J3702J4261J4106J2369Q333L295m14k215l606n702p992r577j0317
55556B25111j0466j0343j0466j1069j1414j0583q849p366o627o118n287l980k208
55543A20335l89N22R4q23j223j211j231q48L39J357J016r0l83L07O53r4j519l180
55525A13632m780n459m564l038k475k898k987k372j900j631l75K352N511Q029
$$ plain form
55511 97045 106807 117484 127900 137003 144378 149754 152580 152758 151197 148901 146035 142506 138797 135448
55497 135448 132287 128930 125501 122106 118262 113708 109195 105658 103179 101608 101433 102882 104722 105243 104232
55482 104232 102880 101911 100957 99688 98456 97578 96900 96341 96222 96724 97458 97810 97538 96973 96699 96903 97009 96301
55464 96301 94940 93830 93382 93113 92680 92446 92649 92876 92922 93266 94098 94752 94838 95000 95638 95852 94768 93110
55446 93110 92205 92111 92094 92320 93516 95227 96000 95403 94544 94391 94738 95014 95045 94753 93980 93018 92591 93115 94438
55427 94438 96262 98208 99605 99979 99690 99400 99098 98481 98053 98833 100996 103759 106668 109938 113396 116202
55411 116202 118027 119531 121120 121997 121061 118246 114479 110695 107312 104395 101979 100257 99444 99348 99274 98729
55395 98729 98030 97767 97940 98104 98144 98187 98008 97305 96406 95935 95831 95584 95360 95912 97226 98331 98739 99110 100021
$$ packed form
55511I7045R762J0677J0416R103P375N376K826J78j561k296k866l529l709l349
55497A35448l161l357l429l395l844m554m513l537k479j571j75J449J840N21j011
55482A04232j352r69r54j269j232q78o78n59j19N02P34L52k72n65k74K04J06p08
55464I6301j361j110m48k69m33k34K03K27M6L44Q32O54Q6J62O38K14j084j658
55446I3110r05r4j7K26J196J711P73n97q59j53L47K76L1k92p73r62m27N24J323
55427I4438J824J946J397L74k89k90l02o17m28P80K163K763K909L270L458K806
55411A16202J825J504J589Q77r36k815l767l784l383k917k416j722q13r6p4n45
55395I8729o99k63J73J64M0M3j79p03q99m71j04k47k24N52J314J105M08L71R11
$$ plain form
55376 100021 100923 100913 99887 98382 96788 95233 93816 92495 91063 89508 88010 86418 84398 82355 81464
55361 81464 82229 83655 84470 84641 84916 85345 85226 84418 83739 83783 84046 83631 82443 81225 80574 80301 79815 78908
55343 78908 77970 77545 77872 78864 80252 81600 82368 82303 81685 80975 80334 79802 79772 80773 82625 84325 85089 85226
55325 85226 85613 86494 87174 86890 85671 84205 83088 82425 82056 81933 82175 82876 84039 85570 87200 88435 88798
55308 88798 88180 86883 85395 84257 83905 84341 85008 85364 85514 85936 86634 87067 86915 86406 85808 85195 84844 85264
55290 85264 86472 87734 88335 88146 87262 85720 83902 82591 82198 82442 83082 84224 85483 85774 84734 83588
55274 83588 83619 84458 84886 84798 85106 85986 86572 86397 85957 85621 85051 84060 83182 82905 82922 82507 81279 79478 77879
55255 77879 77464 78632 80651 82309 83080 83216 82979 82532 82458 83459 85328 86942 87530 87380 87138 87064 87162 87455
$$ packed form
55376A00021R02j0j026j505j594j555j417j321j432j555j498j592k020k043q91
55361H1464P65J426Q15J71K75M29j19q08o79M4K63m15j188j218o51k73m86r07
55343G8908r38m25L27R92J388J348P68o5o18p10o41n32l0J001J852J700P64J37
55325H5226L87Q81O80k84j219j466j117o63l69j23K42P01J163J531J630J235L63
55308H8798o18j297j488j138l52M36O67L56J50M22O98M33j52n09n98o13l51M20
55290H5264J208J262O01j89q84j542j818j311l93K44O40J142J259K91j040j146
55274H3588L1Q39M28q8L08Q80N86j75m40l36n70r91q78k77J7m15j228j801j599
55255G7879m15J168K019J658P71J36k37m47p4J001J869J614N88j50k42p4R8K93
$$ plain form
55237 87455 87874 88327 88995 90045 91019 91126 90322 89480 89272 89481 89588 89438 89039 88316 87413 86789 86644 86662 86544
55218 86544 86399 86373 86329 86173 86134 86467 87148 88005 88821 89202 88766 87672 86634 86270 86647 87435 88122 88148 87356 86378
55198 86378 86074 86508 86965 86961 86670 86330 85896 85425 85204 85313 85609 86263 87606 89275 90216 89891 88932 88239 88008
55179 88008 87889 87589 87011 86299 86015 86687 87948 88708 88492 87972 87878 88121 88418 89011 90122 91314 92059 92521
55161 92521 93125 93738 93900 93566 93040 92543 92333 92881 94237 95465 95448 94218 92956 92633 93104 93526 93258 92268
55143 92268 91002 89948 89291 88926 88776 88841 88950 88801 88373 87989 87876 87986 88311 88887 89384 89247 88537 88137 88824
55124 88824 90468 92375 93897 94477 93687 91695 89303 87206 85623 84795 85168 86616 88156 88979 89233 89346
55108 89346 89242 88882 88867 89632 90544 90693 90241 90107 90557 91123 91683 92604 93787 94512 94449 94022 93558 92839 91791
$$ packed form
55237H7455M19M53O68J050R74J07q04q42k08K09J07j50l99p23r03o24j45J8j18
55218H6544j45k6m4j56l9L33O81Q57Q16L81m36j094j038l64L77P88O87K6p92r78
55198H6378l04M34M57mk91l40m34m71k21J09K96O54J343J669R41l25r59o93k31
55179H8008j19l00n78p12k84O72J261P60k16n20r4K43K97N93J111J192P45M62
55161I2521O04O13J62l34n26m97k10N48J356J228j7j230j262l23M71M22k68r90
55143I2268j266j054o57l65j50O5J09j49m28l84j13J10L25N76M97j37p10m00O87
55124H8824J644J907J522N80p90j992k392k097j583q28L73J448J540Q23K54J13
55108H9346j04l60j5P65R12J49m52j34M50N66N60R21J183P25o3m27m64p19j048
$$ plain form
55089 91791 90964 90872 91306 91738 92106 92786 93919 95125 95890 96143 96327 96877 97646 98032 97699 96989 96537 96782 97916
55070 97916 99807 101713 102551 101967 100846 100314 100515 100819 100851 100750 100619 100369 99993 99468 98557 97221 96058 95700
55052 95700 95910 95967 95850 96228 97171 97680 96880 95127 93561 92940 93195 93801 94226 94216 93897 93560 93349 93347 93837 95115
55032 95115 96945 98601 99560 99912 99995 99949 99718 99254 98555 97699 96896 96374 96167 96179 96397 96842 97393 97866 98209
55013 98209 98333 97921 96811 95440 94479 93990 93466 92762 92497 93248 94775 96375 97745 99087 100493 101595
54997 101595 101965 101694 101438 101862 103104 104833 106638 108126 108755 108095 106482 104965 104251 104055 103861 103857 104473
54980 104473 105310 105434 104750 104288 104852 106077 107177 108080 109266 110826 112233 112973 113006 112623 112141 111767 111537
54963 111537 111249 110658 109892 109599 110373 111932 113097 112971 112036 111590 112125 112762 112512 111439 110145 108736 107006
$$ packed form
55089I1791q27r2M34M32L68O80J133J206P65K53J84N50P69L86l33p10m52K45J134
55070I7916J891J906Q38n84j121n32K01L04L2j01j31k50l76n25r11j336j163l58
55052I5700K10N7j17L78R43N09q00j753j566o21K55O06M25j0l19l37k11kM90J278
55032I5115J830J656R59L52Q3m6k31m64o99q56q03n22k07J2K18M45N51M73L43
55013I8209J24m12j110j371r61m89n24p04k65P51J527J600J370J342J406J102
54997A01595L70k71k56M24J242J729J805J488O29o60j613j517p14j96j94mO16
54980A04473Q37J24o84m62N64J225J100R03J186J560J407P40L3l83m82l74k30
54963A11537k88n91p66k93P74J559J165j26r35m46N35O37k50j073j294j409j730
$$ plain form
54946 107006 105271 104203 103974 104267 105011 106294 107596 107967 107210 106124 105366 104829 104480 104971 106765 109230
54930 109230 111293 112705 113990 115364 116431 117001 117675 119370 122518 126822 131638 136503 141423 146609 151918
54915 151918 156616 159840 161202 160875 159202 156429 152777 148604 144401 140576 137228 134087 130774 127148
54901 127148 123428 120020 117262 115243 113816 112822 112352 112577 113230 113580 113190 112504 112318 112831 113645 114565 115840
54884 115840 117553 119279 120666 122019 124084 127385 131920 137285 142952 148558 153932 158772 162426 164321
54870 164321 164512 163561 161911 159776 157491 155380 153191 150253 146457 142605 139511 137171 135113 133126 131252
54855 131252 129393 127421 125518 123970 122726 121395 119631 117298 114505 111708 109562 108300 107373 106030
54841 106030 104196 102522 101589 101410 101711 102385 103487 104854 105924 106103 105367 104378 103797 103538 102994 101966 101013
$$ packed form
54946A07006j735j068k29K93P44J283J302L71p57j086p58n37l49M91J794K465
54930A09230K063J412J285J374J067N70O74J695L148M304M816M865M920N186N309
54915A51918M698L224J362l27j673k773l652m173m203l825l348l141l313l626
54901A27148l720l408k758k019j427r94m70K25O53L50l90o86j86N13Q14R20J275
54884A15840J713J726J387J353K065L301M535N365N667N606N374M840L654J895
54870A64321J91r51j650k135k285k111k189k938l796l852l094k340k058j987j874
54855A31252j859j972j903j548j244j331j764k333k793k797k146j262r27j343
54841A06030j834j674r33j79L01O74J102J367J070J79p36r89n81k59n44j028r53
$$ plain form
54824 101013 100759 101209 101944 102667 103263 103608 103677 103718 104060 104785 105758 106799 107665 108096 108103 108066 108300 108719 109099 109421
54804 109421 109652 109490 108825 108251 108583 109846 111204 111987 112347 112737 113126 113050 112243 110922 109511 108292 107356
54787 107356 106777 106723 107302 108252 108939 108920 108504 108521 109424 110817 112016 112880 113851 115256 116947 118749 120950 124024
54769 124024 127923 132042 136000 140147 145081 150828 156745 162086 166392 169440 171191 171866 171749 170822 168786
54754 168786 165489 161114 155938 150265 144672 139928 136333 133400 130487 127656 125583 124677 124485 124040 122739
54739 122739 120940 119691 119668 120296 120154 118412 115723 113605 113174 114584 117312 120568 123582 126002 128154
54724 128154 130701 134010 137893 141912 145727 149258 152646 156031 159204 161603 162795 162800 161759 159532 156008
54709 156008 151660 147365 143624 140253 136868 133325 129695 126224 123452 121922 121538 121543 121436 121537 122238 123018
$$ packed form
54824A01013k54M50P35P23N96L45O9M1L42P25R73J041Q66M31Pl7K34M19L80L22
54804A09421K31j62o65n74L32J263J358P83L60L90L89p6q07j321j411j219r36
54787A07356n79n4N79R50O87j9m16J7R03J393J199Q64R71J405J691J802K201L074
54769A24024L899M119L958M147M934N747N917N341M306L048J751O75j17r27k036
54754A68786l297m375n176n673n593m744l595k933k913k831k073r06j92m45j301
54739A22739j799j249k3O28j42j742k689k118m31J410K728L256L014K420K152
54724A28154K547L309L883M019L815L531L388L385L173K399J192Nj041k227l524
54709A56008m348m295l741l371l385l543l630l471k772j530l84Nj07J01P01P80
$$ plain form
54693 123018 122829 121448 119788 118634 117628 115990 113882 112387 112135 112542 112623 112112 111385 110676 109931 109349 109432
54676 109432 110257 111095 111104 110242 109257 108893 109324 110239 111159 111677 111705 111585 111824 112545 113316 113598 113270 112620 111926 111310
54656 111310 110975 111256 112222 113386 114101 114224 114167 114319 114727 115358 116274 117352 118181 118528 118659 118872 118996 118747
54638 118747 118301 118020 117762 117084 116041 115140 114443 113432 112030 111120 111566 113102 114618 115213 114685 113440 112326
54621 112326 112194 113042 113892 113939 113567 113663 114280 114733 114849 115219 116091 116862 117088 117269 118042 119095 119612 119536 119629 120232
54601 120232 120610 119916 118396 117184 116996 117419 117480 116641 115094 113422 112217 111916 112571 113691 114539 114732 114402
54584 114402 113746 112715 111387 110407 110607 112105 114048 115390 115850 116000 116457 117162 117528 117235 116647 116332 116383
54567 116383 116497 116645 117183 118143 118795 118318 116780 115157 114416 114804 115938 117336 118729 120023 121069 121595
$$ packed form
54693A23018j89j381j660j154j006j638k108j495k52M07Q1n11p27p09p45n82Q3
54676A09432Q25Q38Rq62r85l64M31R15R20N18K8j20K39P21P71K82l28o50o94o16
54656A11310l35K81R66J164P15J23n7J52M08O31R16J078Q29L47J31K13J24k49
54638A18747m46k81k58o78j043r01o97j011j402r10M46J536J516N95n28j245j114
54621A12326j32Q48Q50M7l72R6O17M53J16L70Q72P71K26J81P73J053N17p6R3O03
54601A20232L78o94j520j212j88M23O1q39j547j672j205l01O55J120Q48J93l30
54584A14402o56j031j328r80K00J498J943J342M60J50M57P05L66k93n88l15N1
54567A16383J14J48N38R60O52m77j538j623p41L88J134J398J393J294J046N26
$$ plain form
54551 121595 121501 121215 121471 122588 124173 125711 127211 128970 130920 132649 133976 135157 136445 137731 138653
54536 138653 138814 137903 135969 133667 131872 130825 129805 127900 125071 122410 121356 122553 125230 127684 128608
54521 128608 128115 127325 127003 126937 126714 126622 127266 128530 129496 129502 128797 127897 126693 124689 122011 119675 118667 119005
54503 119005 119875 120499 120695 120734 120881 121069 120935 120235 119258 118656 118742 119183 119597 120157 121248 122744 124132 125272
54485 125272 126507 127943 129161 129820 130149 130548 131099 131696 132339 133004 133498 133727 133882 134088 134146 133869 133463 133308
54467 133308 133623 134517 136045 137815 138908 138670 137447 136195 135543 135578 136219 137231 138061 138237 137917 137565 137192
54450 137192 136479 135637 135453 136236 137255 137552 137005 136260 135859 135753 135587 135214 134873 134883 135216 135508 135506 135310 135067
54431 135067 134707 134211 133810 133601 133296 132771 132551 133236 134656 136182 137619 139118 140396 140918 140866 141038 141553
$$ packed form
54551A21595r4k86K56J117J585J538J500J759J950J729J327J181J288J286R22
54536A38653J61r11j934k302j795j047j020j905k829k661j054J197K677K454R24
54521A28608m93p90l22o6k23r2O44J264R66Op05r00j204k004k678k336j008L38
54503A19005Q70O24J96L9J47J88j34p00r77o02Q6M41M14N60J091J496J388J140
54485A25272J235J436J218O59L29L99N51N97O43O65M94K29J55K06N8k77m06j55
54467A33308L15Q94J528J770J093k38j223j252o52L5O41J012Q30J76l20l52l73
54450A37192p13q42j84P83J019K97n47p45m01j06j66l73l41J0L33K92kj96k43
54431A35067l60m96m01k09l05n25k20O85J420J526J437J499J278N22n2J72N15
$$ plain form
54414 141553 141524 140295 138272 136187 134338 133069 133190 135096 137883 140074 141021 141141 141127 141474 142419 143688
54398 143688 144528 144581 144568 145439 146993 147978 147615 146426 145466 145221 145397 145339 144529 143036 141608 141070 141519 142340
54380 142340 142937 143153 143044 142788 142872 143892 145797 147643 148446 148191 147797 148189 149567 151478 153418 155287 157315
54363 157315 159582 161765 163553 165193 167323 170174 173146 175377 176557 177006 177032 176497 175064 172728 169902
54348 169902 167036 164268 161552 159004 156935 155560 154770 154203 153420 152093 150278 148519 147424 147093 147154 147362
54332 147362 147773 148201 148013 146861 145347 144457 144494 144937 145207 145070 144390 143043 141280 139780 139084 139131 139453 139668
54314 139668 139764 140090 141030 142441 143476 143334 142170 140881 139976 139143 138063 137099 136715 136632 136116 134947 133624
54297 133624 132646 132019 131526 131087 130691 130255 129761 129431 129543 130156 131140 132409 133979 135737 137325 138413 139045
$$ packed form
54414A41553k9j229k023k085j849j269J21J906K787K191R47J20j4L47R45J269
54398A43688Q40N3j3Q71J554R85l63j189r60k45J76n8q10j493j428n38M49Q21
54380A42340N97K16j09k56Q4J020J905J846Q03k55l94L92J378J911J940J869K028
54363A57315K267K183J788J640K130K851K972K231J180M49K6n35j433k336k826
54348A69902k866k768k716k548k069j375p90n67p83j327j815j759j095l31O1K08
54332A47362M11M28j88j152j514q90L7M43K70j37o80j347j763j500o96M7L22K15
54314A39668R6L26R40J411J035j42j164j289r05q33j080r64l84q3n16j169j323
54297A33624r78o27m93m39l96m36m94l30J12O13R84J269J570J758J588J088O32
$$ plain form
54280 139045 139589 140264 140838 140906 140382 139581 138849 138313 138008 138042 138577 139719 141501 143770 146066 147775 148539 148444
54262 148444 147753 146736 145886 145996 147546 150002 152106 153051 153135 153134 153281 153205 152717 152226 152212 152579 152778 152419 151495
54243 151495 150158 148614 147262 146531 146308 145800 144337 142272 140784 140764 142027 143643 144824 145468 145998 146809
54227 146809 147834 148648 148934 148722 148094 146969 145444 144143 143775 144333 145118 145638 146007 146387 146532 146247 145899
54210 145899 145983 146380 146487 145999 145162 144297 143439 142530 141659 140979 140507 140086 139485 138633 137893 137946 139128 140928 142367
54191 142367 142895 142746 142523 142685 143332 144159 144610 144375 143746 143249 142982 142696 142431 142527 142863 142700 141632 140292
54173 140292 139612 139684 139790 139445 138932 138835 139406 140491 141792 143063 144202 145188 145953 146387 146575 146832 147327 147804
54155 147804 147938 147831 147904 148333 148803 148855 148243 146994 145349 143750 142672 142402 142957 144077 145184 145596 145064
$$ packed form
54280A39045N44O75N74O8n24q01p32n36l05L4N35J142J782K269K296J709P64r5
54262A48444o91j017q50J10J550K456K104R45Q4jJ47p6m88m91j4L67J99l59r24
54243A51495j337j544j352p31k23n08j463k065j488k0J263J616J181O44N30Q11
54227A46809J025Q14K86k12o28j125j525j301l68N58P85N20L69L80J45k85l48
54210A45899Q4L97J07m88q37q65q58r09q71o80m72m21o01q52p40N3J182J800J439
54191A42367N28j49k23J62O47Q27M51k35o29m97k67k86k65R6L36j63j068j340
54173A40292o80P2J06l45n13r7N71J085J301J271J139R86P65M34J88K57M95M77
54155A47804J34j07P3M29M70N2o12j249j645j599j078k70N55J120J107M12n32
$$ plain form
54138 145064 144100 143508 143664 144388 145355 146275 146830 146895 146849 147226 147951 148359 148129 147748 147821 148264 148598 148747 149089 149768
54118 149768 150371 150423 150082 150162 151377 153529 155505 156323 156147 156070 156895 158427 159980 161139 161865 162231 162444 162894
54100 162894 163843 165166 166632 168315 170492 173319 176878 181346 186754 192663 198328 203129 206542 207889
54086 207889 206625 202980 197968 192598 187287 182122 177377 173541 170939 169518 168983 169033 169444 169987 170471 170973
54070 170973 171942 173761 176141 178298 179943 181777 184672 188507 192147 194490 195198 194535 192963 191010 189154
54055 189154 187577 186163 184863 183888 183437 183370 183296 182977 182639 182830 183931 185795 188014 190534 193702 197602
54039 197602 201748 205763 210003 214965 220290 224974 228585 231712 235070 238689 242192 245411 248382 250987
54025 250987 252940 254018 254238 253935 253724 254068 254761 255121 254848 254387 254232 254151 253423 251616 248880 245569 241898
$$ packed form
54138A45064r64n92J56P24R67R20N55O5m6L77P25M08k30l81P3M43L34J49L42O79
54118A49768O03N2l41Q0J215K152J976Q18j76p7Q25J532J553J159P26L66K13M50
54100A62894R49J323J466J683K177K827L559M468N408N909N665M801L413J347
54086B07889j264l645n012n370n311n165m745l836k602j421n35N0M11N43M84N02
54070A70973R69J819K380K157J645J834K895L835L640K343P08o63j572j953j856
54055A89154j577j414j300r75m51o7p4l19l38J91J101J864K219K520L168L900
54039A97602M146M015M240M962N325M684L611L127L358L619L503L219K971K605
54025B50987J953J078K20l03k11L44O93L60k73m61j55q1p28j807k736l311l671
$$ plain form
54008 241898 237915 233648 229195 224745 220477 216453 212701 209260 206008 202609 198989 195797 193865 193124
53994 193124 192513 191179 189282 187443 185959 185001 185021 186222 187813 188507 187828 186502 185504 185127 184988 184514 183414
53977 183414 182017 181222 181724 183203 184617 185381 185824 186357 186747 186648 186537 187512 190105 193701 197292 200559 204004
53960 204004 208212 213303 219230 226372 235499 247071 260644 275012 288647 299838 306728 308012 304038
53947 304038 296955 289255 282030 274883 267472 260610 255531 252432 250381 248659 247583 247741 248947 250477
53933 250477 252068 254071 256655 259438 262054 264594 267218 269708 271766 273456 275014 276414 277605 279069
53919 279069 281680 285832 291000 296323 301424 306469 311585 316564 321193 325661 330413 335588 340696 344883
53905 344883 347458 348195 347317 345348 342883 340337 337837 335366 332894 330349 327588 324541 321218 317463 312876
$$ packed form
54008B41898l983m267m453m450m268m024l752l441l252l399l620l192j932p41
53994A93124o11j334j897j839j484r58K0J201J591O94o79j326r98l77j39m74j100
53977A83414j397p95N02J479J414P64M43N33L90r9j11R75K593L596L591L267L445
53960B04004M208N091N927P142R127J1572J3573J4368J3635J1191O890J284l974
53947C04038p083p700p225p147p411o862n079l099k051j722j076J58J206J530
53933B50477J591K003K584K783K616K540K624K490K058J690J558J400J191J464
53919B79069K611M152N168N323N101N045N116M979M629M468M752N175N108M187
53905C44883K575P37q78j969k465k546k500k471k472k545k761l047l323l755m587
$$ plain form
53890 312876 307208 300675 293661 286308 278718 271319 264585 258516 252904 248032 244485 242167 240140 237712
53876 237712 235133 232869 230727 228181 225168 222018 218841 215538 212311 209621 207580 205783 203841 201807
53862 201807 199988 198534 197343 196264 195318 194650 194188 193468 192071 190270 188919 188534 188722 188717 188216 187484 186896
53845 186896 186626 186622 186648 186489 186233 186155 186245 186187 185941 185919 186312 186672 186575 186306 186374 186649 186534 185865 185091 184678 184789 185469
53823 185469 186625 187821 188574 188935 189415 190326 191534 192781 193892 194700 195204 195874 197370 199843 202731 205313
53807 205313 207235 208657 210171 212555 216218 220815 225685 230556 235532 240544 245264 249531 253373 256646
53793 256646 259157 261233 263653 266788 270160 272968 274760 275550 275668 275576 275489 275030 273618 271266 268591 265949
53777 265949 263007 259349 255088 250611 246107 241685 237645 234225 231245 228297 225233 222285 219714 217489
$$ packed form
53890C12876n668o533p014p353p590p399o734o069n612m872l547k318k027k428
53876B37712k579k264k142k546l013l150l177l303l227k690k041j797j942k034
53862B01807j819j454j191j079r46o68m62p20j397j801j351l85J88nn01p32n88
53845A86896k70mK6j59k56p8R0n8k46k2L93L60r7k69O8K75j15o69p74m13J11O80
53823A85469J156J196P53L61M80R11J208J247J111Q08N04O70J496K473K888K582
53807B05313J922J422J514K384L663M597M870M871M976N012M720M267L842L273
53793B56646K511K076K420L135L372K808J792P90J18r2q7m59j412k352k675k642
53777B65949k942l658m261m477m504m422m040l420k980k948l064k948k571k225
$$ plain form
53763 217489 215287 212768 209940 207241 205125 203600 202335 201121 199964 198761 197198 195050 192488 190105
53749 190105 188716 188789 189758 190216 189339 188007 187867 189344 191210 192146 191968 191166 190024 188710 187660 187312 187715
53732 187715 188739 190353 192349 194112 195095 195331 195237 195171 195442 196441 198360 200886 203418 205477 206841 207563
53716 207563 208056 208894 210294 212026 213882 215874 217834 219320 220230 221121 222601 224696 227127 229803 232728
53701 232728 235780 238960 242524 246509 250435 253876 256965 259920 262418 264029 265021 266163 267815 269701
53687 269701 271427 272728 273326 273089 272345 271623 271060 270439 269734 269163 268727 268165 267463 266994 266950 266961 266479 265408
53669 265408 264247 263628 263691 263865 263375 262053 260512 259390 258679 258000 257274 256789 256746 257072 257631 258357 259217 260189
53651 260189 261159 261766 261606 260751 259814 259305 259279 259774 261059 263034 264890 266002 266841 268343 270619 272910 274659
$$ packed form
53763B17489k202k519k828k699k116j525j265j214j157j203j563k148k562k383
53749A90105j389P3R69M58q77j332j40J477J866R36j78q02j142j314j050l48M03
53732A87715J024J614J996J763R83K36r4o6K71R99J919K526K532K059J364P22
53716B07563M93Q38J400J732J856J992J960J486R10Q91J480K095K431K676K925
53701B32728L052L180L564L985L926L441L089K955K498J611R92J142J652J886
53687B69701J726J301N98k37p44p22n63o21p05n71m36n62p02m69m4J1m82j071
53669B65408j161o19O3J74m90j322j541j122p11o79p26m85m3L26N59P26Q60R72
53651B60189R70O07j60q55r37n09k6M95J285J975J856J112Q39J502K276K291J749
$$ plain form
53634 274659 275939 276958 277851 278969 280709 282929 285099 287072 289202 291700 294474 297610 301385 305674
53620 305674 309987 314184 318546 322973 326781 329557 331547 333006 333924 334786 336766 340395 344597 347837 349924
53605 349924 351946 354696 358026 361667 365757 370205 374209 376952 378546 379857 381502 383294 384660 385283
53591 385283 385172 384382 382971 381249 379711 378542 377388 375919 374433 373508 373090 372339 370558 367969 365401
53576 365401 363419 361932 360457 358610 356433 354375 352909 352084 351499 350699 349515 348090 346752 345812 345243
53561 345243 344595 343490 342149 341149 340687 340459 340272 340284 340478 340392 339722 338865 338447 338531 338716 338951 339818 341880
53543 341880 344971 348278 351066 353270 355443 358232 361924 366436 371480 376605 381271 385214 388735 392466
53529 392466 396950 402635 410033 419356 429997 440897 451612 462587 474254 486312 498209 509942
$$ packed form
53634B74659J280J019Q93J118J740K220K170J973K130K498K774L136L775M289
53620C05674M313M197M362M427L808K776J990J459R18Q62J980L629M202L240K087
53605C49924K022K750L330L641M090M448M004K743J594J311J645J792J366O23
53591C85283j11p90j411j722j538j169j154j469j486r25m18p51j781k589k568
53576C65401j982j487j475j847k177k058j466q25n85q00j184j425j338r40n69
53561C45243o48j105j341j000m62k28j87J2J94q6o70q57m18Q4J85K35Q67K062
53543C41880L091L307K788K204K173K789L692M512N044N125M666L943L521L731
53529C92466M484N685P398R323J0641J0900J0715J0975J1667J2058J1897J1733
$$ plain form
53517 509942 521937 534459 547563 561504 576802 593866 612765 633269 654882 676958 699055
53506 699055 721162 743438 765832 788181 810555 833178 855945 878258 899461 919442 938718
53495 938718 957962 977450 996975 1016232 1035161 1053840 1072223 1090171 1107596 1124418 1140582
53484 1140582 1156380 1172489 1189225 1206012 1222223 1238430 1255893 1274617 1292793 1308691 1322386
53473 1322386 1334947 1346523 1356138 1363119 1367817 1370780 1371906 1370548 1366113 1358485 1348249 1336552 1324412
53460 1324412 1312105 1299444 1286477 1273536 1260616 1247147 1232379 1215718 1196864 1176118 1154604
53449 1154604 1133715 1114148 1095680 1077779 1059992 1041805 1022780 1003176 984095 966727 951619
53438 951619 938752 927982 919194 912303 907283 903972 901759 899757 897497 895279 893807 893784 895913 900707
$$ packed form
53517E09942J1995J2522J3104J3941J5298J7064J8899K0504K1613K2076K2097
53506F99055K2107K2276K2394K2349K2374K2623K2767K2313K1203J9981J9276
53495I38718J9244J9488J9525J9257J8929J8679J8383J7948J7425J6822J6164
53484A140582J5798J6109J6736J6787J6211J6207J7463J8724J8176J5898J3695
53473A322386J2561J1576R615O981M698K963J126j358m435p628j0236j1697j2140
53460A324412j2307j2661j2967j2941j2920j3469j4768j6661j8854k0746k1514
53449A154604k0889j9567j8468j7901j7787j8187j9025j9604j9081j7368j5108
53438I51619j2867j0770q788o891n020l311k213k002k260k218j472k3K129M794
$$ plain form
53424 900707 907904 916393 925087 933742 942741 952470 963322 975941 990815 1007675 1025811 1044956 1065376
53411 1065376 1087059 1109424 1132063 1155273 1179558 1205000 1231532 1259501 1289467 1321604 1355796
53400 1355796 1392254 1431519 1473655 1517870 1563250 1609601 1657317 1706568 1756951 1807964 1859596
53389 1859596 1912319 1966539 2021961 2077446 2131597 2183637 2233666 2282028 2328634 2373098 2415323
53378 2415323 2455472 2493321 2528024 2558820 2585758 2609501 2630451 2648225 2661901 2670600 2673780 2671114
53366 2671114 2662271 2646959 2625153 2597124 2563210 2523877 2480151 2433652 2385734 2336751 2286589
53355 2286589 2235712 2185042 2134866 2084724 2034696 1986028 1939949 1896432 1854702 1814363 1775189
53344 1775189 1736233 1696275 1655235 1614328 1574635 1536231 1499000 1463575 1430936 1401438 1374600
$$ packed form
53424I00707P197Q489Q694Q655Q999R729J0852J2619J4874J6860J8136J9145K0420
53411A065376K1683K2365K2639K3210K4285K5442K6532K7969K9966L2137L4192
53400A355796L6458L9265M2136M4215M5380M6351M7716M9251N0383N1013N1632
53389A859596N2723N4220N5422N5485N4151N2040N0029M8362M6606M4464M2225
53378B415323M0149L7849L4703L0796K6938K3743K0950J7774J3676Q699L180k666
53366B671114q843j5312k1806k8029l3914l9333m3726m6499m7918m8983n0162
53355B286589n0877n0670n0176n0142n0028m8668m6079m3517m1730m0339l9174
53344A775189l8956l9958m1040m0907l9693l8404l7231l5425l2639k9498k6838
$$ plain form
53333 1374600 1349658 1326072 1303832 1283505 1265762 1250614 1237319 1225086 1213446 1201813 1189298
53322 1189298 1175510 1161192 1147493 1134781 1122679 1111074 1100384 1090795 1081842 1073129 1065062 1058500
53310 1058500 1053876 1050945 1049286 1048703 1049142 1050488 1052620 1055630 1059830 1065523 1072785 1081537 1091762 1103593
53296 1103593 1117161 1132475 1149497 1168205 1188535 1210335 1233467 1257789 1282901 1308035 1332436
53285 1332436 1355866 1378570 1400691 1421885 1441544 1459300 1475235 1489644 1502571 1513492 1521529
53274 1521529 1526178 1527840 1527417 1525278 1520827 1513202 1502211 1488404 1472428 1454608 1435072 1413938 1391256
53261 1391256 1366976 1341119 1313912 1285748 1257137 1228687 1200829 1173467 1146079 1118363 1090636
53250 1090636 1063480 1037214 1011882 987571 964305 941695 919000 895708 871938 848217 825035
$$ packed form
53333A374600k4942k3586k2240k0327j7743j5148j3295j2233j1640j1633j2515
53322A189298j3788j4318j3699j2712j2102j1605j0690r589q953q713q067o562
53310A058500m624k931j659n83M39J346K132L010M200N693P262Q752J0225J1831
53296A103593J3568J5314J7022J8708K0330K1800K3132K4322K5112K5134K4401
53285A332436K3430K2704K2121K1194J9659J7756J5935J4409J2927J0921Q037
53274A521529M649J662m23k139m451p625j0991j3807j5976j7820j9536k1134k2682
53261A391256k4280k5857k7207k8164k8611k8450k7858k7362k7388k7716k7727
53250A090636k7156k6266k5332k4311k3266k2610k2695k3292k3770k3721k3182
$$ plain form
53239 825035 802607 780910 759856 739525 720183 702014 684948 668939 654227 641094 629480
53228 629480 619205 610388 603067 596439 589201 580932 572480 564595 556755 547916 537866 527071 515561
53215 515561 502916 489311 475648 462463 449533 436879 425424 416032 408372 401338 394383 387866
53203 387866 382214 377187 372073 366323 359920 353278 346749 340166 333036 325248 317433 310408 304455 299319
53189 299319 294700 290436 286347 282246 278124 274071 270013 265788 261494 257528 254207 251490 249139 247016
53175 247016 245172 243710 242587 241518 240242 238950 238231 238348 238743 238586 237701 236573 235500 234211 232483
53160 232483 230661 229292 228579 228450 228891 229782 230565 230502 229358 227619 226030 225095 224903 225121 225086 224194 222367
53143 222367 220094 218020 216591 216000 216167 216754 217404 218077 218941 219911 220594 220863 221150 221866 222742 223170 223178 223611
$$ packed form
53239H25035k2428k1697k1054k0331j9342j8169j7066j6009j4712j3133j1614
53228F29480j0275q817p321o628p238q269q452p885p840q839j0050j0795j1510
53215E15561j2645j3605j3663j3185j2930j2654j1455r392p660p034o955o517
53203C87866n652n027n114n750o403o642o529o583p130p788p815p025n953n136
53189B99319m619m264m089m101m122m053m058m225m294l966l321k717k351k123
53175B47016j844j462j123j069j276j292p19J17L95j57q85j128j073j289j728
53160B32483j822j369p13j29M41Q91P83o3j144j739j589r35j92K18l5q92j827
53143B22367k273k074j429n91J67N87O50O73Q64R70O83K69K87P16Q76M28QM33
$$ plain form
53125 223611 225228 227879 230712 232968 234396 235146 235602 236251 237402 238871 240130 240871 241300 241770 242260 242379
53109 242379 241893 240990 239949 238714 236999 234699 232007 229115 226054 222915 220035 217782 216277 215469 215394
53094 215394 216069 217110 217715 217253 215882 214501 214044 214825 216440 218172 219432 219941 219751 219254 219043 219445 220172
53077 220172 220621 220613 220590 220965 221565 221969 222119 222212 222087 221236 219526 217514 215860 214652 213533 212246 210845 209499
53059 209499 208348 207528 207173 207366 208112 209284 210597 211739 212594 213203 213539 213480 213097 212785 212960 213660 214529 215132
53041 215132 215273 215108 214962 214976 215011 214941 214890 214910 214640 213742 212557 211824 211731 211818 211912 212457 213591 214624 214993 215190
53021 215190 216032 217451 218764 219844 221158 222737 223986 224644 225125 225726 226170 226226 226126 226012 225525 224417 223159
53004 223159 222543 222900 224027 225487 226649 226821 225859 224443 223421 223059 223196 223689 224225 224143 223216 222452 223270
$$ packed form
53125B23611J617K651K833K256J428P50M56O49J151J469J259P41M29M70M90J19
53109B42379m86r03j041j235j715k300k692k892l061l139k880k253j505q08p5
53094B15394O75J041O05m62j371j381m57P81J615J732J260N09j90m97k11M02P27
53077B20172M49qk3L75O00M04J50R3j25q51j710k012j654j208j119j287j401j346
53059B09499j151q20l55J93P46J172J313J142Q55O09L36n9l83l12J75P00Q69O03
53041B15132J41j65j46J4L5p0n1K0k70q98j185p33r3Q7R4N45J134J033L69J97
53021B15190Q42J419J313J080J314J579J249O58M81O01M44N6j00j14m87j108j258
53004B23159o16L57J127J460J162J72r62j416j022l62J37M93N36q2r27p64Q18
$$ plain form
52987 223270 225716 228174 229117 228572 227627 227114 227296 228312 230166 232333 233971 234633 234499 234013 233667 234089 235744
52970 235744 238368 241056 243108 244483 245341 245716 245917 246679 248270 249748 249820 248322 246183 244021 241608 238874
52954 238874 236531 235177 234449 233709 233014 232709 232482 231685 230462 229709 229844 230408 231019 231960 233429 234791 235207
52937 235207 234714 234195 234292 234608 234028 231758 228198 224810 222929 222598 222755 222549 222101 221905 221916 221679 221074 220536
52919 220536 220492 220870 221245 221342 221368 221817 222901 224224 225153 225466 225402 225156 224765 224560 225181 226716 228167 228313 227015
52900 227015 225288 224076 223418 222876 222367 222256 222723 223343 223384 222510 221193 220425 221017 223092 226060 228947 230805
52883 230805 231137 230174 228742 227670 227229 227087 226759 226123 225581 225725 226882 228934 231498 234113 236325 237920
52867 237920 239217 240775 242584 243862 244048 243694 243782 244311 244258 242992 241084 239498 238557 237982 237418 236524 234947
$$ packed form
52987B23270K446K458R43n45r45n13J82J016J854K167J638O62j34m86l46M22J655
52970B35744K624K688K052J375Q58L75K01P62J591J478P2j498k139k162k413k734
52954B38874k343j354p28p40o95l05k27p97j223p53J35N64O11R41J469J362M16
52937B35207m93n19R7L16n80k270l560l388j881l31J57k06m48j96J1k37o05n38
52919B20536m4L78L75R7K6M49J084J323R29L13o4k46l91k05O21J535J451J46j298
52900B27015j727j212o58n42n09j11M67O20M1q74j317p68N92K075K968K887J858
52883B30805L32r63j432j072m41j42l28o36n42J44J157K052K564K615K212J595
52867B37920J297J558J809J278J86l54Q8N29n3j266j908j586r41n75n64q94j577
$$ plain form
52850 234947 232657 230096 227734 225674 223863 222284 220747 218917 216851 215108 213976 213001 211734 210495
52836 210495 209866 209737 209491 208908 208309 207919 207647 207522 207758 208362 209034 209461 209385 208510 206751 204601 202864 202039
52818 202039 202203 203330 205285 207671 210171 212997 216502 220385 223781 226161 227639 228336 228061 226788 224969
52803 224969 223088 221214 219216 217140 215170 213459 212069 210908 209698 208349 207324 207224 207935 208582 208517
52788 208517 207987 207666 207834 208240 208480 208345 207981 207822 208247 209274 210757 212679 214905 216728 217269 216436 215034
52771 215034 213796 212709 211404 209784 208066 206655 206105 206756 208166 209302 209494 208834 207604 205939 204306
52756 204306 203584 204130 205216 205966 206441 207282 208596 209886 210903 211952 213381 215181 217085 218745 219892
52741 219892 220624 221376 222343 223134 223314 223104 223202 224132 226044 228825 231931 234438 235823 236530 237264 237900 237707
$$ packed form
52850B34947k290k561k362k060j811j579j537j830k066j743j132r75j267j239
52836B10495o29j29k46n83n99l90k72j25K36O04O72M27p6q75j759k150j737q25
52818B02039J64J127J955K386K500K826L505L883L396K380J478O97k75j273j819
52803B24969j881j874j998k076j970j711j390j161j210j349j025j00P11O47o5
52788B08517n30l21J68M06K40j35l64j59M25J027J483J922K226J823N41q33j402
52771B15034j238j087j305j620j718j411n50O51J410J136J92o60j230j665j633
52756B04306p22N46J086P50M75Q41J314J290J017J049J429J800J904J660J147
52741B19892P32P52R67P91J80k10R8R30J912K781L106K507J385P07P34O36j93
$$ plain form
52724 237707 236498 234875 233340 231807 230113 228368 226630 224771 222931 221606 220986 220612 219993 219273 219024
52709 219024 219614 220941 222546 223796 224212 223850 223227 222815 222828 223432 224663 226001 226556 226071 225370 225454 226394 227501
52691 227501 228253 228625 228718 228636 228692 229172 229803 229905 229274 228566 228513 228952 228935 227746 225659 223717 222879 223304 224262
52672 224262 224760 224342 223358 222454 221884 221426 220882 220391 220140 220007 219730 219399 219543 220672 222835 225642 228589
52655 228589 231357 233971 236715 239718 242560 244414 244674 243356 240965 238230 235937 234574 233924 233317 232535
52640 232535 232117 232458 233017 232927 232148 231409 231113 230948 230662 230602 231273 232830 235130 237832 240216 241417 241179 240034
52622 240034 238481 236520 234321 232739 232425 232724 232323 230988 229887 230048 231178 232390 233473 234828 236489
52607 236489 237840 238318 237916 236916 235583 234276 233481 233387 233582 233436 232717 231624 230434 229473 229298 230382 232396
$$ packed form
52724B37707j209j623j535j533j694j745j738j859j840j325o20l74o19p20k49
52709B19024N90J327J605J250M16l62o23m12J3O04J231J338N55m85p01Q4R40J107
52691B27501P52L72R3q2N6M80O31J02o31p08n3M39j7j189k087j942q38M25R58
52672B24262M98m18r84r04n70m58n44m91k51j33k77l31J44J129K163K807K947
52655B28589K768K614K744L003K842J854K60j318k391k735k293j363o50o07p82
52640B32535m18L41N59r0p79p39k96j65k86o0O71J557K300K702K384J201k38j145
52622B40034j553j961k199j582l14K99m01j335j101J61J130J212J083J355J661
52607B36489J351M78m02j000j333j307p95r4J95j46p19j093j190r61j75J084K014
$$ plain form
52590 232396 234257 235229 235683 236428 237543 238445 238989 239858 241565 243505 244428 243739 242058 240539 239874 239943 240249
52573 240249 240516 240834 241281 241601 241487 241063 240781 240748 240457 239359 237527 235486 233549 231656 229883 228723 228569
52556 228569 229044 229181 228369 226958 225776 225263 225317 225808 226779 228056 229207 230131 231262 232786 234073 234407 233955
52539 233955 233393 232845 231990 231119 231151 232401 234142 235734 237370 239252 240833 241655 242297 243590 245203 245946
52523 245946 245371 244219 243249 242435 241536 240758 240404 240298 239999 239458 239173 239718 241179 243041 244682 246063 247714
52506 247714 249903 252071 253419 253814 253697 253256 252288 250823 249319 248123 247159 246232 245239 244052 242716 241809
52490 241809 241998 243023 243682 243119 241713 240472 240073 240775 242623 245149 247339 248514 248998 249393 249545 248886
52474 248886 247548 246338 245634 245078 244512 244497 245502 247064 248268 248804 249195 250044 251399 252846 253979 254721
$$ packed form
52590B32396J861R72M54P45J115R02N44Q69J707J940R23o89j681j519o65O9L06
52573B40249K67L18M47L20j14m24k82l3k91j098j832k041j937j893j773j160j54
52556B28569M75J37q12j411j182n13N4M91R71J277J151R24J131J524J287L34m52
52539B33955n62n48q55q71L2J250J741J592J636J882J581Q22O42J293J613P43
52523B45946n75j152r70q14q99p78l54j06k99n41k85N45J461J862J641J381J651
52506B47714K189K168J348L95j17m41r68j465j504j196r64r27r93j187j336r07
52490B41809J89J025O59n63j406j241l99P02J848K526K190J175M84L95J52o59
52474B48886j338j210p04n56n66j5J005J562J204N36L91Q49J355J447J133P42
$$ plain form
52458 254721 255284 255903 256612 257213 257386 256842 255519 253755 252134 250977 249997 248636 246732 244716 243165 242266
52442 242266 241719 241031 239953 238719 237859 237691 238043 238521 238952 239383 239785 239988 239948 239884 240126 240877 242027 243071
52424 243071 243379 242816 242027 241822 242263 242732 242959 243619 245669 249283 253656 257730 260981 263700 266794 271228
52408 271228 277398 284953 293312 302303 312043 322091 330926 336563 337840 335084 329600 322679 315159 307580
52394 307580 300331 293559 287270 281668 277185 274005 271737 269773 267852 266162 264996 264455 264325 264184 263892
52379 263892 264079 265784 269247 273379 276832 279333 281487 283637 285630 287611 290201 293697 297695 301698
52365 301698 305449 308481 310090 310239 309916 310040 310484 310683 310732 311191 312145 313228 314414 315980 317745 319068
52349 319068 319717 320097 320482 320709 320919 321921 324304 327581 330758 333518 336411 340018 344438 349549 355355
$$ packed form
52458B54721N63O19P09O01J73n44j323j764j621j157r80j361j904k016j551q99
52442B42266n47o88j078j234q60j68L52M78M31M31M02K03m0o4K42P51J150J044
52424B43071L08n63p89k05M41M69K27O60K050L614M373M074L251K719L094M434
52408B71228O170P555Q359Q991R740J0048Q835N637J277k756n484o921p520p579
52394C07580p249o772o289n602m483l180k268j964j921j690j166n41j30j41k92
52379B63892J87J705L463M132L453K501K154K150J993J981K590L496L998M003
52365C01698L751L032J609J49l23J24M44J99M9M59R54J083J186J566J765J323
52349C19068O49L80L85K27K10J002K383L277L177K760K893L607M420N111N806
$$ plain form
52334 355355 361857 368861 376096 383485 391254 399803 409497 420461 432494 445174 458082 471039 484259
52321 484259 498276 513570 530118 547419 565007 582819 600900 618905 636201 652509 668256
52310 668256 684185 700751 717947 735491 752923 769653 785222 799625 813188 826079 838149
52299 838149 849283 859584 868957 876827 882710 886955 890415 893254 894521 893211 889501 884607 879558 874389
52285 874389 868487 861484 853803 846451 840306 835541 831792 828855 827006 826563 827386 829136 831837 835900 841619
52270 841619 848926 857554 867083 876801 885924 894216 902245 910874 920573 931319 942962 955465 968812
52257 968812 982849 997241 1011530 1025243 1038061 1049969 1061222 1072017 1082086 1090617 1096694 1099818
52245 1099818 1099956 1097251 1092012 1085010 1077300 1069413 1060960 1051424 1041176 1031247 1022131 1013285 1003937 993966
$$ packed form
52334C55355O502P004P235P389P769Q549R694J0964J2033J2680J2908J2957J3220
52321D84259J4017J5294J6548J7301J7588J7812J8081J8005J7296J6308J5747
52310F68256J5929J6566J7196J7544J7432J6730J5569J4403J3563J2891J2070
52299H38149J1134J0301R373P870N883M245L460K839J267j310l710m894n049n169
52285H74389n902p003p681p352o145m765l749k937j849m43Q23J750K701M063N719
52270H41619P307Q628R529R718R123Q292Q029Q629R699J0746J1643J2503J3347
52257I68812J4037J4392J4289J3713J2818J1908J1253J0795J0069Q531O077L124
52245A099818J38k705n239p002p710p887q453r536j0248r929r116q846r348r971
$$ plain form
52231 993966 983760 973569 963384 953349 943896 935431 928049 921652 916258 912080 909262 907582 906484
52218 906484 905493 904539 903859 903711 904332 905998 908851 912674 917049 921716 926570 931305 935460 938915 942090
52203 942090 945398 948715 951654 954244 957065 960687 965190 970281 975708 981387 987109 992328 996489 999639
52189 999639 1002477 1005549 1008463 1010159 1009969 1008140 1005260 1001478 996517 990330 983450 976569 969896 963047
52175 963047 955662 948035 940947 934888 929741 925415 922389 921145 921243 921540 921401 921201 921506 922337 923456 924764
52159 924764 926002 926537 926056 925221 925037 925726 926852 928395 930890 934289 937433 939256 940102 941208 943048 944804
52143 944804 945547 945388 945063 944748 943775 941622 938832 936752 936425 937853 940270 943066 946505 951574 959089 969014
52127 969014 980740 993953 1008876 1025632 1043841 1063163 1083878 1106427 1130555 1155446 1180651
$$ packed form
52231I93966j0206j0191j0185j0035r453q465p382o397n394m178k818j680j098
52218I06484r91r54o80j48O21J666K853L823M375M667M854M735M155L455L175
52203I42090L308L317K939K590K821L622M503N091N427N679N722N219M161L150
52189I99639K838L072K914J696j90j829k880l782m961o187o880o881o673o849
52175I63047p385p627p088o059n147m326l026j244R8K97j39k00L05Q31J119J308
52159I24764J238N35m81q35j84O89J126J543K495L399L144J823Q46J106J840J756
52143I44804P43j59l25l15r73k153k790k080l27J428K417K796L439N069P515R925
52127I69014J1726J3213J4923J6756J8209J9322K0715K2549K4128K4891K5205
$$ plain form
52116 1180651 1206314 1232344 1257931 1282133 1304598 1325482 1345009 1363348 1380626 1396721 1411281
52105 1411281 1424159 1435615 1445792 1454258 1460468 1464515 1467026 1468324 1468009 1465424 1460359 1453240 1444671
52092 1444671 1434780 1423041 1408917 1392713 1375562 1358525 1342042 1326342 1311907 1299139 1287922
52081 1287922 1277998 1269545 1262927 1257988 1254110 1250985 1248927 1248439 1249832 1253294 1258878 1266291 1275009 1284759
52067 1284759 1295701 1308036 1321604 1335864 1350115 1363785 1376769 1389530 1402685 1416425 1430404
52056 1430404 1444006 1456422 1466662 1474044 1478791 1481802 1483647 1483993 1482004 1476980 1468573 1456874 1442605
52043 1442605 1426875 1410438 1393360 1375583 1357536 1339846 1322715 1305981 1289665 1274010 1258949
52032 1258949 1243986 1228813 1213706 1199042 1184673 1170080 1155026 1139714 1124329 1108837 1093328
$$ packed form
52116A180651K5663K6030K5587K4202K2465K0884J9527J8339J7278J6095J4560
52105A411281J2878J1456J0177Q466O210M047K511J298l15k585n065p119q569
52092A444671r891j1739j4124j6204j7151j7037j6483j5700j4435j2768j1217
52081A287922r924q453o618m939l878l125k058m88J393L462N584P413Q718R750
52067A284759J0942J2335J3568J4260J4251J3670J2984J2761J3155J3740J3979
52056A430404J3602J2416J0240P382M747L011J845L46j989n024q407j1699j4269
52043A442605j5730j6437j7078j7777j8047j7690j7131j6734j6316j5655j5061
52032A258949j4963j5173j5107j4664j4369j4593j5054j5312j5385j5492j5509
$$ plain form
52021 1093328 1078183 1063666 1049682 1036268 1024003 1013477 1004464 996108 987822 979509 970987 961900
52009 961900 952357 942927 933613 923421 911376 897523 882410 866172 848822 831137 814433 799527
51997 799527 786475 775170 765496 756905 748514 739772 730519 720407 708965 696479 684178 673130
51985 673130 663198 653380 642874 631559 619675 607285 594110 579935 565265 551343 539213 528909
51973 528909 519928 512193 506001 501168 497082 493731 492045 492878 496113 500894 506218 511182 515278 518722
51959 518722 521973 524702 525852 524974 522881 520497 517706 513872 509036 503984 499510 496156 494386 494412 495989
51944 495989 498804 502900 508394 515103 522909 532207 543528 556920 572038 588510 605811 623184 640264
51931 640264 657521 675493 693853 711718 728416 743061 753548 757007 751611 737542 716303 689780
$$ packed form
52021A093328j5145j4517j3984j3414j2265j0526r013q356q286q313q522r087
52009I61900r543r430r314j0192j2045j3853j5113j6238j7350j7685j6704j4906
51997G99527j3052j1305r674q591q391q742r253j0112j1442j2486j2301j1048
51985F73130r932r818j0506j1315j1884j2390j3175j4175j4670j3922j2130j0304
51973E28909q981p735o192m833m086l351j686Q33L235M781N324M964M096L444
51959E18722L251K729J150q78k093k384k791l834m836n052m474l354j770K6J577
51944D95989K815M096N494O709P806R298J1321J3392J5118J6472J7301J7373J7080
51931F40264J7257J7972J8360J7865J6698J4645J0487L459n396j4069k1239k6523
$$ plain form
51919 689780 659998 628959 598229 568935 542202 519015 499566 483269 469637 458654 450153 443513
51907 443513 438353 435000 433796 434307 435680 437481 439674 441976 443701 444276 443512 441349 437611 432182 425233
51892 425233 417177 408492 399659 391297 384192 379015 375915 374472 374073 374280 374862 375839 377673 381110 386473
51877 386473 393256 400694 408465 416390 423706 429298 432704 434324 434595 433603 431607 429207 426544 422910 417700
51862 417700 411478 405637 401273 398764 398123 399127 401150 403403 405517 407597 409693 411440 412262 411674 409433
51847 409433 405683 401087 396546 392569 388966 385187 380919 376383 372176 368849 366533 364922 363678 362892
51833 362892 363016 364267 366185 367922 368962 369435 369691 369736 369239 367961 365959 363399 360483 357627 355369 353917
51817 353917 353056 352710 353253 354879 356985 358720 360030 361600 363703 365689 366757 366776 366131 365210 364329 363780
$$ packed form
51919F89780k9782l1039l0730k9294k6733k3187j9449j6297j3632j0983q501o640
51907D43513n160l353j204N11J373J801K193K302J725N75p64k163l738n429o949
51892D25233q056q685q833q362p105n177l100j443l99K07N82R77J834L437N363
51877C86473O783P438P771P925P316N592L406J620K71r92j996k400k663l634n210
51862D17700o222n841m364k509o41J004K023K253K114K080K096J747Q22n88k241
51847D09433l750m596m541l977l603l779m268m536m207l327k316j611j244p86
51833C62892J24J251J918J737J040M73K56M5m97j278k002k560k916k856k258j452
51817C53917q61l46N43J626K106J735J310J570K103J986J068J9o45r21q81n49
$$ plain form
51801 363780 363605 363589 363671 364051 364639 364790 364013 362626 361312 360226 358991 357434 355809 354391 353286 352678 352778
51784 352778 353394 353894 353787 353142 352400 351970 352094 352831 354035 355520 357329 359761 363096 367458 372903 379388
51768 379388 386582 393992 401357 408697 415739 421558 425124 426155 425160 422685 418802 413467 407070 400287
51754 400287 393400 386077 378014 369689 362234 356497 352351 348961 345652 342471 340055 338992 339287 340394
51740 340394 341790 343479 345795 348753 351932 355072 358440 362273 366090 368968 370456 370888 370771 370304 369641
51725 369641 369258 369659 370782 371902 372158 371139 369091 366723 364760 363540 362938 362603 362206 361535 360576 359597
51709 359597 359016 359113 360023 362046 365689 371095 377468 383273 387051 388090 386674 383962 381542 380655 381630 384017
51693 384017 387062 389896 391564 391406 389499 386371 382298 377267 371651 366267 361531 357057 352538 348589
$$ packed form
51801C63780j75j6Q2L80N88J51p77j387j314j086j235j557j625j418j105o08J00
51784C52778O16N00j07o45p42m30J24P37J204J485J809K432L335M362N445O485
51768C79388P194P410P365P340P042N819L566J031r95k475l883n335o397o783
51754D00287o887p323q063q325p455n737m146l390l309l181k416j063K95J107
51740C40394J396J689K316K958L179L140L368L833L817K878J488M32j17m67o63
51725C69641l83M01J123J120K56j019k048k368j963j220o02l35l97o71r59r79
51709C59597n81R7R10K023L643N406O373N805L778J039j416k712k420q87R75K387
51693C84017L045K834J668j58j907l128m073n031n616n384m736m474m519l949
$$ plain form
51679 348589 346206 345705 346680 348684 351268 353600 354896 355351 355954 357217 358759 360354 362625 366167 370551
51664 370551 374811 378537 381859 384575 386013 385821 384401 382477 380603 379161 378491 378900 380729 384387 390090
51649 390090 397388 405012 411246 414569 414330 411047 405905 399736 392587 384399 375816 367975 361702 357224
51635 357224 354463 353219 353137 353829 355036 356403 357390 357828 358362 359792 361967 363750 364038 362423 359032 354393
51619 354393 349539 345555 342673 340179 337448 334677 332466 331048 330154 329334 328189 326619 325008 323876 323269
51604 323269 322841 322610 323229 325324 328971 333952 340151 347547 356201 366276 377459 388220 396347 400622
51590 400622 401496 399895 396177 390772 384998 380226 376583 373395 370701 369489 370541 373955 379902 388894
51576 388894 400805 414206 427329 439598 451880 465225 479631 494043 507278 518569 527275 532768
$$ packed form
51679C48589k383n01R75K004K584K332J296M55O03J263J542J595K271L542M384
51664C70551M260L726L322K716J438j92j420j924j874j442o70M09J829L658N703
51649C90090P298P624O234L323k39l283n142o169p149q188q583p841o273m478
51635C57224k761j244q2O92J207J367R87M38N34J430K175J783K88j615l391m639
51619C54393m854l984k882k494k731k771k211j418q94q20j145j570j611j132o07
51604C23269m28k31O19K095L647M981O199P396Q654J0075J1183J0761Q127M275
51590D00622Q74j601l718n405n774m772l643l188k694j212J052L414N947Q992
51576C88894J1911J3401J3123J2269J2282J3345J4406J4412J3235J1291Q706N493
$$ plain form
51564 532768 535396 537320 541523 549685 561704 577391 597509 622379 650338 678630 705404 729926
51552 729926 751327 768384 780430 787403 788882 784139 773355 757897 739048 717204 692629 666174
51540 666174 638853 611372 584519 559454 537117 517731 501209 487568 476612 467708 460391 454793
51528 454793 451046 448551 446190 443117 439085 434287 429125 423821 418093 411534 404450 397847 392393 387877
51514 387877 383916 380607 378023 375656 372945 369997 367155 364194 360533 356075 351334 346913 343294 340845
51500 340845 339460 338442 337270 336254 335824 335467 334247 332311 330997 331259 332686 334353 335903 337408 338815
51485 338815 340118 341643 343577 345355 346084 345562 344490 343672 343268 342814 341661 339374 336036 332317 329080
51470 329080 326734 325016 323422 321704 319835 317725 315357 313188 311956 311808 311927 311431 310530 310299 311307
$$ packed form
51564E32768K628J924M203Q162J2019J5687K0118K4870K7959K8292K6774K4522
51552G29926K1401J7057J2046O973J479m743j0784j5458j8849k1844k4575k6455
51540F66174k7321k7481k6853k5065k2337j9386j6522j3641j0956q904p317n598
51528D54793l747k495k361l073m032m798n162n304n728o559p084o603n454m516
51514C87877l961l309k584k367k711k948k842k961l661m458m741m421l619k449
51500C40845j385j018j172j016m30l57j220j936j314K62J427J667J550J505J407
51485C38815J303J525J934J778P29n22j072q18m04m54j153k287l338l719l237
51470C29080k346j718j594j718j869k110k368k169j232j48J19m96r01k31J008
$$ plain form
51455 311307 312993 314546 315927 317693 320199 323469 327641 333081 340018 348367 357895 368358 379494 391050
51441 391050 402659 413451 422009 427166 428985 428790 428232 428371 429349 430434 430368 428076 423347 416749 408958
51426 408958 400392 391410 382544 374383 367370 361708 357227 353425 349910 346810 344483 342837 341327 339754
51412 339754 338667 338711 339804 341223 342318 342873 342920 342550 342028 341818 342316 343531 345165 346940 348765 350557
51396 350557 352114 353406 354882 357156 360356 364108 368317 373487 380002 387496 395451 404119 414318 426506
51382 426506 440749 457553 477926 502352 530293 561090 594818 631711 670970 710597 748267
51371 748267 782174 811271 835103 853432 865772 871336 869463 859946 842880 818558 787889 752685
51359 752685 715092 676652 638124 600150 563866 530769 502038 477896 457554 439842 424049
$$ packed form
51455C11307J686J553J381J766K506L270M172N440O937Q349R528J0463J1136J1556
51441C91050J1609J0792Q558N157J819j95n58J39R78J085o6k292m729o598p791
51426D08958q566q982q866q161p013n662m481l802l515l100k327j646j510j573
51412C39754j087M4J093J419J095N55M7l70n22k10M98J215J634J775J825J792
51396C50557J557J292J476K274L200L752M209N170O515P494P955Q668J0199J2188
51382D26506J4243J6804K0373K4426K7941L0797L3728L6893L9259L9627L7670
51371G48267L3907K9097K3832J8329J2340N564j873r517j7066k4322l0669l5204
51359G52685l7593l8440l8528l7974l6284l3097k8731k4142k0342j7712j5793
$$ plain form
51348 424049 410080 397913 387216 377692 369455 362712 357202 352261 347458 342919 339070 336208 334248
51335 334248 332745 331227 329703 328721 328779 329731 330961 332044 333043 334239 335739 337323 338551 339024 338613 337321
51319 337321 335085 332031 328947 327027 326787 327629 328691 329628 330168 329519 327135 323799 321047 319424 318125
51304 318125 316432 314747 313867 313950 314613 315478 316122 315941 314695 312963 311596 310794 310057 308909 307389 305950
51288 305950 305158 305409 306698 308690 311128 314036 317479 321417 325886 330958 336277 340995 344471 346760 348167
51273 348167 348728 348584 348430 348973 350092 351124 351878 352782 354043 355292 356188 356815 357316 357565 357367 356623 355142
51256 355142 352717 349631 346661 344272 342086 339505 336610 334107 332486 331536 330647 329416 327969 326778 326158
51241 326158 325940 325748 325538 325539 325712 325692 325441 325533 326457 327995 329641 331340 333326 335373 336757 336992 336210 334834
$$ packed form
51348D24049j3969j2167j0697r524q237o743n510m941m803m539l849k862j960
51335C34248j503j518j524r82N8R52J230J083R99J196J500J584J228M73m11j292
51319C37321k236l054l084j920k40Q42J062R37N40o49k384l336k752j623j299
51304C18125j693j685q80Q3O63Q65O44j81j246j732j367q02p37j148j520j439
51288C05950p92K51J289J992K438K908L443L938M469N072N319M718L476K289J407
51273C48167N61j44j54N43J119J032P54R04J261J249Q96O27N01K49j98p44j481
51256C55142k425l086k970k389k186k581k895k503j621r50q89j231j447j191o20
51241C26158k18j92k10JJ73k0k51R2R24J538J646J699J986K047J384K35p82j376
$$ plain form
51223 334834 333281 332068 331694 332199 333089 333945 334848 335956 336950 337306 337036 336813 337242 338266 339380 340287 341198
51206 341198 342595 344839 347946 351547 355056 357997 360269 362013 363207 363557 362960 361906 361180 361088 361246 361162
51190 361162 360829 360540 360339 359925 359109 358077 357155 356460 355948 355719 356115 357338 358980 360068 359850 358539 357138
51173 357138 356406 356216 356069 356015 356742 358773 361822 365007 367470 368786 369061 368881 368962 369576 370256 370221 369115 367216
51155 367216 364964 362500 359747 356754 353715 350663 347409 343892 340483 337791 336210 335656 335627 335437 334620
51140 334620 333333 332240 331870 332223 333216 335111 338010 341139 343393 344719 346202 348512 350973 352657 353801
51125 353801 355408 357848 360576 362977 364726 365499 365232 364719 365196 367098 369817 372682 375433 377604 378443
51110 378443 377964 377349 377639 378566 379284 379762 380681 382290 384085 385465 386116 385926 385188 384753 385299 386468 387305
$$ packed form
51223C34834j553j213l74N05Q90Q56R03J108R94L56k70k23M29J024J114R07R11
51206C41198J397K244L107L601L509K941K272J744J194L50n97j054p26r2J58q4
51190C61162l33k89k01m14q16j032r22o95n12k29L96J223J642J088k18j311j401
51173C57138p32j90j47n4P27K031L049L185K463J316K75j80Q1O14O80l5j106j899
51155C67216k252k464k753k993l039l052l254l517l409k692j581n54k9j90q17
51140C34620j287j093l70L53R93J895K899L129K254J326J483K310K461J684J144
51125C53801J607K440K728K401J749P73k67n13M77J902K719K865K751K171Q39
51110C78443m79o15K90R27P18M78R19J609J795J380O51j90p38m35N46J169Q37
$$ plain form
51093 387305 387515 387644 388076 388572 388919 389365 390153 391248 392692 394619 396640 397816 397700 396871 396102 395550 395185
51076 395185 395431 396630 398313 399778 401179 403323 406428 409747 412498 414652 416737 419425 423319 428679
51062 428679 435235 442748 451750 463106 476648 490768 503626 514380 523152 530497 537386 545116 554441
51049 554441 564841 575029 584007 591291 596452 599064 599081 596726 592022 584917 575962 566438 557595 550022
51035 550022 543794 538795 534633 530525 525662 519736 513003 505873 498627 491517 485042 479893 476451 474387
51021 474387 473058 472432 473257 476045 480210 484705 489284 494564 500908 507903 515157 522984 531963 542130
51007 542130 552904 563577 573743 583576 593846 605181 617067 628048 637252 645215 652736 659409
50995 659409 663981 665897 665726 664238 661916 659440 657775 657355 657712 658416 660087 664059 671163 681091 692781
$$ packed form
51093C87305K10J29M32M96L47M46P88J095J444J927K021J176j16q29p69n52l65
51076C95185K46J199J683J465J401K144L105L319K751K154K085K688L894N360
51062D28679O556P513R002J1356J3542J4120J2858J0754Q772P345O889P730R325
51049E54441J0400J0188Q978P284N161K612J7k355m704p105q955r524q843p573
51035E50022o228m999m162m108m863n926o733p130p246p110o475n149l442k064
51021D74387j329o26Q25K788M165M495M579N280O344O995P254P827Q979J0167
51007E42130J0774J0673J0166R833J0270J1335J1886J0981R204P963P521O673
50995F59409M572J916j71j488k322k476j665m20L57P04J671L972P104R928J1690
$$ plain form
50980 692781 705119 717344 729116 740424 751527 762984 775617 790283 807653 828319 852932
50969 852932 882000 915531 953175 994774 1040637 1091196 1146461 1205703 1267563 1330640 1394242
50958 1394242 1458340 1522475 1584989 1643883 1698303 1748406 1793764 1832812 1864320 1888767 1907659
50947 1907659 1921986 1932056 1938565 1943010 1946897 1950954 1955074 1958527 1960141 1958744 1953781 1945469 1934354
50934 1934354 1920914 1905484 1888263 1869196 1847952 1824078 1797083 1766457 1731743 1692688 1649312
50923 1649312 1602013 1551660 1499394 1446100 1392262 1338593 1286589 1237904 1193111 1151467 1112089
50912 1112089 1075079 1041297 1011307 984881 961384 940290 921203 903723 887584 872875 859849
50901 859849 848393 837910 827954 818842 811311 805574 801127 797534 794988 793753 793409 793200 792997 793378 794681
$$ packed form
50980F92781J2338J2225J1772J1308J1103J1457J2633J4666J7370K0666K4613
50969H52932K9068L3531L7644M1599M5863N0559N5265N9242O1860O3077O3602
50958A394242O4098O4135O2514N8894N4420N0103M5358L9048L1508K4447J8892
50947A907659J4327J0070O509M445L887M057M120L453J614j397m963q312j1115
50934A934354j3440j5430j7221j9067k1244k3874k6995l0626l4714l9055m3376
50923A649312m7299n0353n2266n3294n3838n3669n2004m8685m4793m1644l9378
50912A112089l7010l3782k9990k6426k3497k1094j9087j7480j6139j4709j3026
50901H59849j1456j0483r956r112p531n737m447l593k546j235l44k09k03L81J303
$$ plain form
50886 794681 796433 797952 799131 800343 801805 803514 805717 809015 813762 819614 825987 832823 840668 849942
50872 849942 860420 871531 882947 894741 907183 920642 935524 952104 970535 991266 1015132
50861 1015132 1042632 1073261 1106188 1141632 1181049 1225909 1276827 1334048 1398105 1469645 1549108
50850 1549108 1637000 1733995 1840265 1955055 2077365 2206623 2342175 2482514 2625634 2769873
50840 2769873 2913655 3054522 3188963 3313115 3423180 3515652 3588260 3640916 3675117 3692301
50830 3692301 3693323 3679504 3653418 3618566 3578985 3539188 3503378 3474034 3451760 3436754 3429636 3430242
50818 3430242 3436292 3444002 3449544 3449340 3439568 3416701 3378849 3326084 3259279 3178982 3085410 2979176
50806 2979176 2861923 2736509 2606532 2475444 2346100 2221143 2103328 1994944 1897025 1809522
$$ packed form
50886G94681J752J519J179J212J462J709K203L298M747N852O373O836P845R274
50872H49942J0478J1111J1416J1794J2442J3459J4882J6580J8431K0731K3866
50861A015132K7500L0629L2927L5444L9417M4860N0918N7221O4057P1540P9463
50850A549108Q7892R6995J06270J14790J22310J29258J35552J40339J43120J44239
50840B769873J43782J40867J34441J24152J10065R2472P2608N2656L4201J7184
50830C692301J022j3819k6086l4852l9581l9797l5810k9344k2274j5006p118O06
50818C430242O050P710N542k04r772k2867l7852n2765o6805q0297r3572j06234
50806B979176j17253j25414j29977j31088j29344j24957j17815j08384r7919q7503
$$ plain form
50796 1809522 1732163 1664815 1607224 1558938 1519509 1488390 1464634 1447164 1435403 1429219 1427989 1430076
50784 1430076 1433512 1437049 1440378 1443469 1445939 1447026 1446050 1442826 1437719 1431335 1424198 1416512 1407993 1397862
50770 1397862 1385325 1370295 1353429 1335293 1315696 1294166 1270835 1246423 1221515 1196409 1171704
50759 1171704 1148437 1127316 1108113 1090156 1073263 1057998 1045152 1035191 1028089 1023479 1021016 1020783
50747 1020783 1023392 1029593 1039793 1054005 1072164 1094324 1120551 1150731 1184623 1222141 1263522 1309165
50735 1309165 1359316 1413938 1472804 1535478 1601205 1669075 1738578 1809812 1882889 1957128 2031056
50724 2031056 2103169 2172441 2238102 2299190 2354398 2402019 2439847 2465405 2476779 2473509 2456786
50713 2456786 2428971 2392990 2352012 2309296 2268026 2231006 2200245 2176580 2159758 2149120 2144259
$$ packed form
50796A809522p7359o7348n7591m8286l9429l1119k3756j7470j1761o184j230K087
50784A430076L436L537L329L091K470J087r76l224n107o384p137p686q519j0131
50770A397862j2537j5030j6866j8136j9597k1530k3331k4412k4908k5106k4705
50759A171704k3267k1121j9203j7957j6893j5265j2846r961p102m610k463k33
50747A020783K609O201J0200J4212J8159K2160K6227L0180L3892L7518M1381M5643
50735A309165N0151N4622N8866O2674O5727O7870O9503P1234P3077P4239P3928
50724B031056P2113O9272O5661O1088N5208M7621L7828K5558J1374l270j6723
50713B456786k7815l5981m0978m2716m1270l7020l0761k3665j6822j0638m861
$$ plain form
50702 2144259 2144936 2150339 2158594 2167141 2173420 2175032 2169412 2153847 2126206 2085802 2033662 1972211 1904677
50689 1904677 1834273 1763386 1693434 1625626 1561672 1503481 1452322 1408669 1372792 1344981 1325121
50678 1325121 1312633 1307127 1308726 1317540 1333248 1355474 1384028 1418181 1456090 1495559 1535192 1574228
50666 1574228 1611521 1645535 1675493 1701780 1724980 1745130 1762206 1776780 1789682 1801365 1811958
50655 1811958 1821637 1830458 1838070 1844058 1848503 1851979 1855188 1858938 1864199 1871717 1881630 1893908 1909039
50642 1909039 1927804 1950354 1975992 2003966 2033964 2065686 2098383 2131130 2163245 2194191 2223458
50631 2223458 2250955 2277351 2303758 2331283 2360945 2393126 2425877 2453645 2468754 2465220 2441646
50620 2441646 2401035 2348814 2291261 2234606 2183924 2142013 2109362 2085197 2068488 2058296 2053802
$$ packed form
50702B144259O77N403Q255Q547O279J612n620j5565k7641m0404n2140o1451o7534
50689A904677p0404p0887o9952o7808o3954n8191n1159m3653l5877k7811j9860
50678A325121j2488n506J599Q814J5708K2226K8554L4153L7909L9469L9633L9036
50666A574228L7293L4014K9958K6287K3200K0150J7076J4574J2902J1683J0593
50655A811958R679Q821P612N988M445L476L209L750N261P518R913J2278J5131
50642A909039J8765K2550K5638K7974K9998L1722L2697L2747L2115L0946K9267
50631B223458K7497K6396K6407K7525K9662L2181L2751K7768J5109l534k3574
50620B441646m0611n2221n7553n6655n0682m1911l2651k4165j6709j0192m494
$$ plain form
50609 2053802 2054217 2058499 2065083 2072092 2077734 2080219 2077436 2067209 2048140 2020018 1983350 1938812 1887260
50596 1887260 1830000 1768790 1705561 1642046 1579440 1518393 1459513 1403672 1351504 1302745 1256751
50585 1256751 1213702 1174638 1140056 1109152 1080931 1055447 1033373 1014829 999394 987003 977999
50574 977999 972340 969482 969132 971506 976607 983774 992183 1001498 1011956 1024101 1038533 1055485 1074524
50561 1074524 1095000 1116915 1141008 1167881 1197404 1229141 1262867 1298321 1334770 1371221 1407009
50550 1407009 1441940 1475970 1508953 1540599 1570511 1598396 1624462 1649611 1675103 1702095 1731475
50539 1731475 1763899 1799735 1839042 1881782 1928117 1978479 2033441 2093510 2158914 2229519 2305108
50528 2305108 2385862 2472373 2565040 2663417 2766198 2871686 2978191 3084042 3187340 3285725
$$ packed form
50609B053802M15M282O584P009N642K485k783j0227j9069k8122l6668m4538n1552
50596A887260n7260o1210o3229o3515o2606o1047n8880n5841n2168m8759m5994
50585A256751m3049l9064l4582l0904k8221k5484k2074j8544j5435j2391r004
50574I77999n659k858l50K374N101P167Q409R315J0458J2145J4432J6952J9039
50561A074524K0476K1915K4093K6873K9523L1737L3726L5454L6449L6451L5788
50550A407009L4931L4030L2983L1646K9912K7885K6066K5149K5492K6992K9380
50539A731475L2424L5836L9307M2740M6335N0362N4962O0069O5404P0605P5589
50528B305108Q0754Q6511R2667R8377J02781J05488J06505J05851J03298R8385
$$ plain form
50518 3285725 3376422 3456648 3524124 3577256 3614908 3636098 3639836 3625211 3591783 3540152 3472162
50507 3472162 3390478 3298013 3197868 3093521 2988659 2886803 2791289 2705393 2631898 2572487
50497 2572487 2527997 2499303 2487406 2492373 2512733 2546139 2590059 2641262 2695013 2745577 2787617
50486 2787617 2816811 2829348 2821626 2791048 2737193 2662284 2570555 2466965 2355985 2241195 2125692
50475 2125692 2012536 1904511 1803544 1710580 1625988 1549898 1482141 1422034 1368354 1319600 1274439
50464 1274439 1232127 1192602 1156246 1123634 1095342 1071655 1052292 1036645 1024363 1015461 1009814 1006911
50452 1006911 1006340 1008179 1012515 1018892 1026648 1035563 1045769 1057201 1069690 1083436 1098749 1115217 1131723
50439 1131723 1147504 1162655 1177303 1190723 1201771 1209955 1215742 1219988 1223487 1226900 1230615 1234547 1238417
$$ packed form
50518C285725R0697Q0226O7476N3132L7652K1190L738j4625l3428n1631o7990
50507C472162q1684r2465j00145j04347j04862j01856r5514q5896p3495n9411
50497B572487m4490k8694j1897M967K0360L3406M3920N1203N3751N0564M2040
50486B787617K9194J2537p722l0578n3855p4909r1729j03590j10980j14790j15503
50475B125692j13156j08025j00967r2964q4592p6090o7757o0107n3680m8754m5161
50464A274439m2312l9525l6356l2612k8292k3687j9363j5647j2282q902n647k903
50452A006911n71J839M336O377P756Q915J0206J1432J2489J3746J5313J6468J6506
50439A131723J5781J5151J4648J3420J1048Q184N787M246L499L413L715L932L870
$$ plain form
50426 1238417 1242365 1247064 1253101 1260518 1269217 1279615 1292572 1308677 1327928 1350285 1376264 1406716
50414 1406716 1442112 1482326 1527091 1576338 1629901 1687088 1746725 1807528 1868245 1927570 1984241
50403 1984241 2037318 2086223 2130357 2168752 2200159 2223463 2237833 2242433 2236158 2217926 2187377 2145273
50391 2145273 2093188 2033051 1967081 1897892 1828212 1760359 1696164 1637269 1585147 1540689 1504093
50380 1504093 1475378 1454860 1443020 1439999 1445286 1457640 1475210 1495936 1517966 1539499 1558234 1571383
50368 1571383 1576488 1572107 1557656 1533106 1499279 1458170 1412420 1364402 1315924 1268528 1223502 1181531
50356 1181531 1142673 1106841 1074185 1045097 1020023 999300 982990 970827 962270 956324 951172 944326
50344 944326 933605 918170 898706 876930 854984 834757 817205 802372 790267 781327 775671 772355
$$ packed form
50426A238417L948M699O037P417Q699J0398J2957J6105J9251K2357K5979L0452
50414A406716L5396M0214M4765M9247N3563N7187N9637O0803O0717N9325N6671
50403A984241N3077M8905M4134L8395L1407K3304J4370M600o275j8232l0549m2104
50391B145273n2085o0137o5970o9189o9680o7853o4195n8895n2122m4458l6596
50380A504093k8715k0518j1840l021N287J2354J7570K0726K2030K1533J8735J3149
50368A571383N105m381j4451k4550l3827m1109m5750m8018m8478m7396m5026m1971
50356A181531l8858l5832l2656k9088k5074k0723j6310j2163q557n946n152o846
50344I44326j0721j5435j9464k1776k1946k0227j7552j4833j2105q940n656l316
$$ plain form
50332 772355 770105 768608 768394 769617 771755 774537 778336 783345 789086 795123 801689 809137 817165 825065
50318 825065 832463 839368 845628 850719 854145 855916 856742 857738 859733 862743 866234 869788 873252 876402 879016
50303 879016 881333 883867 886586 888825 890273 891525 893328 895711 898258 900848 903688 906925 910569 914484
50289 914484 918167 920974 922990 925300 928912 933723 938937 944018 948619 952052 953787 954367 954978 956101 957319
50274 957319 958567 960704 964475 969495 974748 979730 984729 990145 995871 1001309 1006030 1010551 1016350 1024764
50260 1024764 1035988 1049614 1065948 1085983 1109888 1136284 1163469 1190755 1218158 1245369 1271750
50249 1271750 1296996 1321106 1343926 1365426 1386256 1407209 1427991 1447101 1462960 1474433 1480050
50238 1480050 1477709 1466046 1445852 1419577 1389551 1357214 1323834 1291131 1260830 1233986 1210940
$$ packed form
50332G72355k250j497k14J223K138K782L799N009N741O037O566P448Q028P900
50318H25065P398O905O260N091L426J771Q26R96J995L010L491L554L464L150K614
50303H79016K317K534K719K239J448J252J803K383K547K590K840L237L644L915
50289I14484L683K807K016K310L612M811N214N081M601L433J735N80O11J123J218
50274I57319J248K137L771N020N253M982M999N416N726N438M721M521N799Q414
50260A024764J1224J3626J6334K0035K3905K6396K7185K7286K7403K7211K6381
50249A271750K5246K4110K2820K1500K0830K0953K0782J9110J5859J1473N617
50238A480050k341j1663k0194k6275l0026l2337l3380l2703l0301k6844k3046
$$ plain form
50227 1210940 1191428 1174209 1156794 1136133 1110016 1078028 1041518 1002944 965002 929754 898076
50216 898076 869791 844326 821273 800626 782690 767716 755390 744770 735034 726223 718912 713251
50204 713251 708727 704841 701363 697796 693350 687958 682804 679114 676747 674573 671958 669077 665946 662097
50190 662097 657476 652828 648794 645199 641659 638292 635310 632375 629059 625698 623084 621358 619794 617819
50176 617819 615769 614467 614376 615356 616979 618886 620958 623274 625843 628443 630907 633509 636787 640871 645298
50161 645298 649640 654040 658928 664447 670580 677745 686828 698446 712394 727949 744513 761728 779213
50148 779213 796707 814630 834126 856193 880916 907893 937341 970415 1008372 1051856 1101050
50137 1101050 1155846 1215108 1276059 1335342 1391176 1444223 1496207 1548104 1599890 1651281 1701785
$$ packed form
50227A210940j9512j7219j7415k0661k6117l1988l6510l8574l7942l5248l1678
50216H98076k8285k5465k3053k0647j7936j4974j2326j0620r736q811p311n661
50204G13251m524l886l478l567m446n392n154l690k367k174k615k881l131l849
50190F62097m621m648m034l595l540l367k982k935l316l361k614j726j564j975
50176F17819k050j302r1R80J623J907K072K316K569K600K464K602L278M084M427
50161F45298M342M400M888N519O133P165R083J1618J3948J5555J6564J7215J7485
50148G79213J7494J7923J9496K2067K4723K6977K9448L3074L7957M3484M9194
50137A101050N4796N9262O0951N9283N5834N3047N1984N1897N1786N1391N0504
$$ plain form
50126 1701785 1749907 1792912 1827683 1851568 1862476 1858834 1840153 1807541 1763321 1710032 1649888
50115 1649888 1584964 1517446 1449526 1383172 1320009 1261218 1207479 1159124 1116241 1078450 1044638
50104 1044638 1013309 983387 954568 926944 900681 876195 854175 834929 817963 802706 789609
50093 789609 779980 774529 772433 772032 772197 772818 774226 776576 779777 783731 788417 793709 799180 804187 808308
50078 808308 811651 814607 817320 819653 821739 824220 827605 831556 835124 837680 839298 840225 840365 839438 837401
50063 837401 834432 830697 826388 821860 817387 812736 807298 800863 794076 787934 782968 779119 776285 774676
50049 774676 774563 775984 778896 783429 789753 797725 806857 816654 826929 837805 849514 862102 875280
50036 875280 888647 902172 916310 931393 947007 962246 976551 989986 1002722 1014672 1025867
$$ packed form
50126A701785M8122M3005L4771K3885J0908l642j8681l2612m4220n3289o0144
50115A649888o4924o7518o7920o6354o3163n8791n3739m8355m2883l7791l3812
50104A044638l1329k9922k8819k7624k6263k4486k2020j9246j6966j5257j3097
50093G89609r629n451k096m01J65O21J408K350L201L954M686N292N471N007M121
50078H08308L343K956K713K333K086K481L385L951L568K556J618R27J40r27k037
50063H37401k969l735m309m528m473m651n438o435o787o142m966l849k834j609
50049G74676j13J421K912M533O324P972R132R797J0275J0876J1709J2588J3178
50036H75280J3367J3525J4138J5083J5614J5239J4305J3435J2736J1950J1195
$$ plain form
50025 1025867 1036910 1048764 1062235 1077819 1095841 1116394 1139245 1163943 1189916 1216323 1242015
50014 1242015 1266002 1287875 1307558 1324942 1340277 1354770 1370006 1386402 1402550 1416306 1426044
50003 1426044 1430518 1428059 1416781 1395810 1365941 1329030 1287078 1241890 1195110 1148151 1102188 1058382
49991 1058382 1017900 981442 948752 918861 890900 864644 840334 818201 798181 779947 763043
49980 763043 747064 731818 717324 703609 690586 678269 667027 657417 649632 643223 637442 631824
49968 631824 626404 621499 617390 614065 611122 607990 604475 601103 598790 598122 599028 601095 604060 608107 613799
49953 613799 621597 631158 641162 650187 657794 664424 670332 675133 678562 681021 682914 683960 683768 682749
49939 682749 681619 680078 676788 670822 662456 652276 640275 626456 611882 598307 586753 576907 567979
$$ packed form
50025A025867J1043J1854J3471J5584J8022K0553K2851K4698K5973K6407K5692
50014A242015K3987K1873J9683J7384J5335J4493J5236J6396J6148J3756R738
50003A426044M474k459j1278k0971k9869l6911m1952m5188m6780m6959m5963m3806
49991A058382m0482l6458l2690k9891k7961k6256k4310k2133k0020j8234j6904
49980G63043j5979j5246j4494j3715j3023j2317j1242r610p785o409n781n618
49968F31824n420m905m109l325k943l132l515l372k313o68R06K067K965M047N692
49953F13799P798R561J0004R025P607O630N908M801L429K459J893J046j92j019
49939F82749j130j541l290n966q366j0180j2001j3819j4574j3575j1554r846q928
$$ plain form
49926 567979 559695 552307 545995 540697 536526 534032 533781 535679 538912 542585 546192 549377 551648 552810
49912 552810 553511 554860 557468 561270 566195 572386 579635 587265 594860 602647 610890 619513 628581 638323
49898 638323 648078 656019 660944 663851 666614 669352 670288 668169 663612 657777 650918 642831 633774 624187
49884 624187 614198 604107 594769 586690 579154 571007 562051 553042 544636 536991 530141 524051 518427 513160
49870 513160 508832 506144 504918 504342 504154 504882 506946 510271 514879 521063 528697 537085 545851 555384 566001
49855 566001 577271 588548 599593 610119 619255 626221 631316 635610 639717 643347 645895 646893 645908 642539
$$ packed form
49926E67979q284p388o312n298m171k494k51J898L233L673L607L185K271J162
49912E52810P01J349K608L802M925O191P249P630P595P787Q243Q623R068R742
49898F38323R755P941M925K907K763K738R36k119m557n835o859q087r057r587
49884F24187r989j0091r338q079p536q147q956r009q406p645o850o090n624n267
49870E13160m328k688j226n76j88P28K064L325M608O184P634Q388Q766R533J0617
49855E66001J1270J1277J1045J0526R136O966N095M294M107L630K548R98r85l369
$$ [...]
##END NTUPLES=NMR SPECTRUM
##END=
