
##TITLE=AC1302_PERAH12114_6535671_KetVU1Pe3j
##JCAMPDX= 6.0         $$ Bruker NMR JCAMP-DX V2.0
##DATA TYPE= NMR SPECTRUM
##DATA CLASS= NTUPLES
##ORIGIN= BRUKER
##OWNER= Administrator
$$ 1.72 TOPSPIN		Version 2.1
$$ 2012-12-11 21:32:31.524 -0500  Administrator@X
$$ Compression mode = diff/dup
##.OBSERVE FREQUENCY= 400.02188249412
##.OBSERVE NUCLEUS= ^1H
##.ACQUISITION MODE= SIMULTANEOUS (DQD)
##.ACQUISITION SCHEME= undefined
##.AVERAGES= 8
##.DIGITISER RES= 22
##SPECTROMETER/DATA SYSTEM= spect
##.PULSE SEQUENCE= zg30
##.SOLVENT NAME= COFFEE_meoh
##.SHIFT REFERENCE= INTERNAL, COFFEE_meoh, 1, 14.98509
##AUDIT TRAIL= $$ (NUMBER, WHEN, WHO, WHERE, PROCESS, VERSION, WHAT)
$$ ##TITLE= Audit trail, TOPSPIN		Version 2.1
$$ ##JCAMPDX= 5.01
$$ ##ORIGIN= Bruker BioSpin GmbH
$$ ##OWNER= Administrator
$$ $$ E:\/data/COFFEE/nmr/AC1302_PERAH12114_6535671_KetVU1Pe3j/60/pdata/1/auditp.txt
$$ ##AUDIT TRAIL=  $$ (NUMBER, WHEN, WHO, WHERE, PROCESS, VERSION, WHAT)
(   1,<2012-12-11 21:32:22.977 -0500>,<Administrator>,<X>,<go>,<TOPSPIN 2.1>,
      <created by zg
	started at 2012-12-11 21:31:16.055 -0500,
	POWCHK enabled, PULCHK disabled,
       configuration hash MD5:
       86 BA 57 50 F2 9D 5C 9B 26 00 A9 28 5F 66 2E 89
       data hash MD5: 64K
       1B 5E B6 8F 65 4E FD BC E8 33 10 33 26 3B 0B 59>)
(   2,<2012-12-11 21:32:26.290 -0500>,<Administrator>,<X>,<proc1d>,<TOPSPIN 2.1>,
      <Start of raw data processing
       efp LB = 0 FT_mod = 6 PKNL = 1 PHC0 = 0 PHC1 = 0 SI = 32K 
       data hash MD5: 32K
       59 A2 0B B9 82 D3 C8 D7 FD D2 2F 51 6E 43 78 6C>)
(   3,<2012-12-11 21:32:26.759 -0500>,<Administrator>,<X>,<proc1d>,<TOPSPIN 2.1>,
      <pk PHC0 = 96.77307 PHC1 = 0 
       data hash MD5: 32K
       CA 09 09 91 2A 5E 7C 60 00 8E 1B AA B2 7F 4B AB>)
(   4,<2012-12-11 21:32:27.024 -0500>,<Administrator>,<X>,<proc1d>,<TOPSPIN 2.1>,
      <abs ABSG = 1 
       data hash MD5: 32K
       CA E9 4E 25 8A C4 E6 D3 BC 05 65 93 11 91 AF 9E>)
(   5,<2012-12-11 21:32:27.212 -0500>,<Administrator>,<X>,<proc1d>,<TOPSPIN 2.1>,
      <abs ABSG = 2 
       data hash MD5: 32K
       B3 FC D1 86 DE 36 A7 F4 63 73 B9 63 D3 B9 D9 AE>)
(   6,<2012-12-11 21:32:27.368 -0500>,<Administrator>,<X>,<proc1d>,<TOPSPIN 2.1>,
      <abs ABSG = 3 
       data hash MD5: 32K
       0C 8E A2 38 27 B6 34 87 8A 5F 96 2E DF 40 10 D9>)
(   7,<2012-12-11 21:32:27.540 -0500>,<Administrator>,<X>,<proc1d>,<TOPSPIN 2.1>,
      <abs ABSG = 4 
       data hash MD5: 32K
       82 A9 F2 8E C0 5B A6 56 6E EF A1 29 46 8D A7 C9>)
(   8,<2012-12-11 21:32:27.712 -0500>,<Administrator>,<X>,<proc1d>,<TOPSPIN 2.1>,
      <abs ABSG = 5 
       data hash MD5: 32K
       1F DD A6 9D 31 D7 E1 14 01 DC 0D 9D C6 8B E4 55>)
$$ ##END=
$$ 
$$ $$ hash MD5
$$ $$ 99 04 64 AD 36 77 29 09 CA DE 2A 41 FD BF C8 99
##$RELAX= 
##$RELAX= 
##$RELAX= 
##$RELAX= 
##$RELAX= 
##$RELAX= 
##$RELAX= 
##$RELAX= 
$$ Bruker specific parameters
$$ --------------------------
##$DU= <E:\>
##$EXPNO= 60
$$ [...]
150 150 150 150 150 150 150 150
##$TP07= 0
##$TPNAME0= <>
##$TPNAME1= <>
##$TPNAME2= <>
##$TPNAME3= <>
##$TPNAME4= <>
##$TPNAME5= <>
##$TPNAME6= <>
##$TPNAME7= <>
##$TPOAL= (0..7)
0.5 0.5 0.5 0.5 0.5 0.5 0.5 0.5
##$TPOFFS= (0..7)
0 0 0 0 0 0 0 0
##$TUNHIN= 0
##$TUNHOUT= 0
##$TUNXOUT= 0
##$USERA1= <user>
##$USERA2= <user>
##$USERA3= <user>
##$USERA4= <user>
##$USERA5= <user>
##$V9= 5
##$VALIST= <valist>
##$VCLIST= <CCCCCCCCCCCCCCC>
##$VD= 0
##$VDLIST= <DDDDDDDDDDDDDDD>
##$VPLIST= <PPPPPPPPPPPPPPP>
##$VTLIST= <TTTTTTTTTTTTTTT>
##$WBST= 2048
##$WBSW= 25
##$XGAIN= (0..3)
0 0 0 0
##$XL= 0
##$YL= 0
##$YMAX_a= 631173
##$YMIN_a= -537746
##$ZGOPTNS= <>
##$ZL1= 120
##$ZL2= 120
##$ZL3= 120
##$ZL4= 120
##$ABSF1= 14.98509
##$ABSF2= -5.573092
##$ABSG= 5
##$ABSL= 3
##$ALPHA= 0
##$AQORDER= 0
##$ASSFAC= 0
##$ASSFACI= 0
##$ASSFACX= 0
##$ASSWID= 0
##$AUNMP= <proc_prof1d_extract_pilot.lims>
##$AXLEFT= 0
##$AXNAME= <>
##$AXNUC= <1H>
##$AXRIGHT= 0
##$AXTYPE= 0
##$AXUNIT= <>
##$AZFE= 0.1
##$AZFW= 0.1
##$BCFW= 0
##$BC_mod= 0
##$BYTORDP= 0
##$COROFFS= 0
##$CY= 15
##$DATMOD= 1
##$DC= 0
##$DFILT= <>
##$DTYPP= 0
##$F1P= 0
##$F2P= 0
##$FCOR= 0.5
##$FTSIZE= 32768
##$FT_mod= 6
##$GAMMA= 0
##$GB= 0
##$INTBC= 1
##$INTSCL= 1
##$ISEN= 128
##$LB= 0
##$LEV0= 0
##$LPBIN= 0
##$MAXI= 10000
##$MC2= 0
##$MEAN= 0
##$ME_mod= 0
##$MI= 0
##$NCOEF= 0
##$NC_proc= -8
##$NLEV= 6
##$NOISF1= 0
##$NOISF2= 0
##$NSP= 0
##$NTH_PI= 0
##$NZP= 0
##$OFFSET= 14.98509
##$PC= 1
##$PHC0= 96.77307
##$PHC1= 0
##$PH_mod= 1
##$PKNL= yes
##$PPARMOD= 0
##$PPDIAG= 0
##$PPIPTYP= 0
##$PPMPNUM= 2147483647
##$PPRESOL= 1
##$PSCAL= 4
##$PSIGN= 0
##$PYNMP= <proc.py>
##$REVERSE= no
##$SF= 400.02
##$SI= 32768
##$SIGF1= 0
##$SIGF2= 0
##$SINO= 400
##$SIOLD= 32768
##$SPECTYP= <>
##$SREGLST= <1H.CDCl3>
##$SSB= 0
##$STSI= 32768
##$STSR= 0
##$SW_p= 8223.68421052631
##$SYMM= 0
##$S_DEV= 0
##$TDeff= 65536
##$TDoff= 0
##$TI= <>
##$TILT= no
##$TM1= 0
##$TM2= 0
##$TOPLEV= 0
##$USERP1= <user>
##$USERP2= <user>
##$USERP3= <user>
##$USERP4= <user>
##$USERP5= <user>
##$WDW= 1
##$XDIM= 32768
##$YMAX_p= 477932139
##$YMIN_p= -739372
##$CURPLOT= <Network HP LaserJet P1505>
##$CURPRIN= <$Network HP LaserJet P1505>
##$DFORMAT= <normdp>
##$LAYOUT= <+/1D_H.xwp>
##$LFORMAT= <normlp>
##$PFORMAT= <normpl>
##$SURQMSG= 1
$$ End of Bruker specific parameters
$$ ---------------------------------
##NTUPLES= NMR SPECTRUM
##VAR_NAME=  FREQUENCY,     SPECTRUM/REAL,   SPECTRUM/IMAG
##SYMBOL=    X,             R,               I
##VAR_TYPE=  INDEPENDENT,   DEPENDENT,       DEPENDENT
##VAR_FORM=  AFFN,          ASDF,            ASDF
##VAR_DIM=   32768,         32768,           32768
##UNITS=     HZ,            ARBITRARY UNITS, ARBITRARY UNITS
##FACTOR=    0.250966925370066, 1,           1
##FIRST=     8223.43324360094, -73289,       -89283
##LAST=      0,             -62506,          -247944
##MIN=       0,             -739372,         0
##MAX=       8223.43324360094, 477932139,    0
$$ Real data points
##PAGE= N=1
##DATA TABLE= (X++(R..R)), XYDATA
$$ [...]
23821 -233566 -192878 -265740 -146753 -491089 136640 -46368 -17637 93924 -105992 -129348 -65280
23810 -65280 -129349 -209277 -328974 120271 65400 -31795 -12448 145743 -50950 -64606 -204679
23799 -204679 -170422 124479 -282542 115099 -122032 228021 59454 74785 -162306 240563
23788 -107945 -221756 -70686 218740 -8459 -138740 50272 211350 -43075 51412 270275 -202709
23776 -284223 -184945 -31628 -196442 152478 80958 272752 124680 105980 138809 257182
23766 257182 69817 -196138 -6912 163676 241964 -47668 289698 -36374 109632 -38224 56246
23754 -45260 3497 -334736 -193959 -149870 -166510 -25320 -216681 262967 193808 -366185 21000
23742 -115584 -102427 90300 311149 47461 26235 317998 -55185 124743 183365 81811 104686
23731 104686 161110 -6484 -468632 -50503 438429 86946 161591 43415 -33906 32040 -39194
23719 -118905 247215 45460 -32954 134655 -296261 -16956 192840 -47605 -177236 74091
23708 -190996 -263275 -290554 -29733 90823 74460 -296210 173594 154088 308675 -22291 -128323
23697 -128323 37102 69558 118778 57924 154862 116074 -127121 -43553 -86337 -108549 -218218
23686 -218218 299917 107534 -257478 36045 132174 -87818 -22148 -21941 -183669 -46333 226616
23674 75614 -13342 -103721 -71342 -38790 93014 53219 -66237 -4169 -74345 -110020 23218 39169
23662 39169 -327434 -351142 -86144 25428 134256 -64245 -171118 112017 -243709 173857
23651 -101435 170476 -366503 -300526 -248593 152767 -181509 -192025 -149237 -69724 61938 -68099
23639 99227 147182 -21067 140447 29831 235053 -106479 105000 163275 48203 -78813 -82754
23628 -82754 -25172 314997 -87851 -74093 -206976 107902 327129 251351 377813 31685 -46904
23616 -43900 -2219 -242006 71439 90694 40855 20235 457170 16887 -97209 24688 120110
23605 120110 -149124 75862 3315 16 -207918 -158395 -134090 -85335 -168923 -292 -132070 -88383
23593 -88383 -47575 -74432 252388 -129629 -154706 16846 392023 -170113 -11079 -115156 -198707
23582 -198707 11714 -212654 -195724 -231873 119990 -117123 112919 228022 307213 -175505
23571 -277882 -99200 62770 -236564 -111328 -165395 -93982 -15921 34790 -42063 -77370 191091
23559 -291982 -180882 -76436 204919 85515 -126950 -16671 -189667 -295048 -51376 -434824
23549 -434824 -183151 385532 43249 -149082 226864 121489 93538 161712 -9305 -195358
23539 -195358 -138402 -192137 70903 -73663 229097 -115717 -97918 108674 -135817 87274 -148923
23527 267129 -55457 -193677 -57033 -180913 138792 -112924 355285 27091 -114767 13362
23516 -66101 73127 167074 -9098 -27335 -196347 -236158 45820 93864 129788 -118306 -121118 -4922
23503 -254431 -59806 -115856 -95116 106515 115966 150420 -6733 -78033 239731 120288 -83707
23491 214195 135797 -210365 -238658 154951 -49554 188325 35396 -244348 -148399 303414
23480 75679 -230047 -380266 -193356 -169691 33564 -268193 -220754 -399294 -91626 131763
23469 -42867 188063 7591 -333892 -244717 97965 267215 103813 115861 -238216 -61322 -228411
23458 -228411 -414364 172122 -129877 96441 40204 -78317 -333887 -139953 -17796 -303306
23448 -303306 201035 -17043 114059 74409 -10808 310015 7432 35662 -89506 223268 107092
23436 379879 3737 -342190 -378685 87081 -101816 -71162 141462 -120192 -70676 -112070 9871
23424 -98487 -25106 125013 18858 179661 -128988 -234737 -148028 -221814 65955 129017 -106410
23412 76421 -57314 -148365 107482 -133488 -68916 300048 14353 78198 158049 -84526 155019
23400 -319630 48850 97440 85080 12828 -104247 -394306 99657 -4130 -52871 231759 -226610
23388 159339 -252639 286929 106930 124156 60159 60297 -13099 -92520 -184702 177320 -92018
23376 -172059 -30515 -465462 -206551 -52478 -260752 -254821 -91997 258029 -66605 24975 -23513
23364 -109578 88514 259445 -124571 109064 117115 177067 107721 -257698 175716 76480 -33801
23352 167030 -59467 261057 105844 305055 5199 -75838 -27881 110913 -88505 -187077 150192
23340 -69523 155088 -560193 10245 -36231 -91646 57684 -438464 57598 23373 -121621 -36786
23328 -160728 -429 60258 231637 23034 -79045 -97271 434526 -323471 -57251 142731 328986
23317 328986 -203735 -82159 36981 -35784 39330 73496 -48869 -43409 -533121 -261031 365681
23305 -115264 15924 128518 -246386 191451 80523 -55659 -105820 -213765 115938 183907
23295 183907 -209516 32561 153630 -887 -198143 -192241 -6161 130026 84590 263970 72485
23283 -18045 -180217 -70476 -62234 -174993 87921 66716 122321 145195 -44559 -69468 198670
23271 -177858 -559574 -1508 -65431 -177882 96072 239285 84906 -355470 -71473 -257472 -78880
23259 136413 -382021 -123792 95374 -303794 108587 -106717 -101457 19217 -174098 -77449
23248 -16834 -173184 -502604 90757 56497 93387 -112620 -195579 -54370 172946 75172 29386
23236 70100 65522 118493 -136678 -128354 66176 210562 -59740 -379581 66033 -108636 324 162243
23224 162243 -378295 -277256 -257498 -29200 -193482 100903 -107748 -5712 166428 -70418
23213 -13047 49687 -65707 -208271 171132 136884 238128 135630 20099 454155 -152262
23202 -513193 -267519 193016 -352264 93022 -219706 -92341 -13329 141266 -31269 213908
23191 -49516 281864 -143563 -67878 -6862 -109027 -80906 -26204 109997 -40872 330713 -205762
23179 -79116 228382 217008 53788 139544 59593 696 -218557 386942 -14770 326252 -14805
23167 -9237 223911 519694 379121 98361 -111968 45887 25593 -181937 -35720 33892 90846
23156 90846 -159796 141410 23909 32856 -253188 72532 42845 -259422 -153862 -43833 -80192
23145 -80192 51820 -30442 -147030 -99398 -119036 38969 -176233 38435 -61090 -108035 -21251
23133 -158876 33026 86474 -205191 -143978 -206869 179360 -187816 18268 272777 391102
23123 391102 -188561 -467003 328225 -334094 -125354 22477 321391 -165477 4273 -128467
23112 -190552 -228386 -124541 -188476 -67003 89160 173153 165631 274214 -53265 2340 -242414
23100 -62105 28032 -397072 -121237 -65954 150261 -192845 200618 -196857 87064 89897 -90571
23088 163924 -191775 -25574 -56680 -151336 15625 -361507 13806 -13536 126019 -287557 5752
23076 -351111 -464102 59846 1920 -35044 96270 204722 44090 -287273 -40683 -226371 -160322
23065 -160322 -84553 4614 -135833 -53462 -53906 -66086 -209518 -267796 -279180 47036 -17454 74158
23052 -268729 -228178 119764 39229 -81728 -169027 -211442 65841 -284999 -129932 -170964 148179
23040 -42413 189813 -27549 67104 73892 -163728 164192 -207614 104291 167995 260235 43231
23028 30360 -263470 123118 -15425 60282 102725 -43712 -141275 129960 -91330 -89744 -238142
23017 -238142 158222 -395420 108062 -5958 43666 70136 294457 -227772 -61621 -144682 -269318
23006 -269318 -192458 -301836 121247 142385 62464 66519 85090 -39289 -285050 41281 -65752
22994 369238 -7197 40188 185482 70842 90009 20751 -205694 -121283 -29762 -424 38842 313491
22982 313491 -1482 6657 -165752 -178470 -5371 106479 211462 -141914 -287961 -254935 -164494
22971 -164494 -38876 194368 -116366 -271012 -147007 65659 -58189 -62790 -41296 -91116 -272488
22960 -272488 21164 74838 204661 -118958 -85850 41093 69072 -239501 -220500 -69088 -66943
22949 -66943 -18866 358857 269444 221850 -164238 -139425 -149845 -148118 243457 -101197 46015
22937 174648 339781 124050 104133 -15443 -329962 170564 22782 -55407 51838 -216723
22926 -31911 -15940 -346660 108963 322080 314681 -76804 149896 2796 -107686 -178370 -72877
22914 -256299 -6960 203217 -203596 49622 143887 247234 -117731 294511 -102428 -366097
22904 -366097 -27955 -28924 115981 -285572 105297 -104240 -91905 50232 107665 192410 28988
22892 -265563 -82418 133502 33407 45200 -84887 -78101 215007 -55934 -96821 55122 -60460
22880 205185 155346 160350 -138841 14033 -17301 -28589 321759 -173492 290091 -38394 265988
22868 -233142 -179235 449363 -162084 -32330 113800 -157149 182545 182290 135003 -38662 -410728
22857 -410728 96911 -2645 167869 -207026 170493 86442 -133200 -248740 -372134 397891
22846 -142652 257310 -149928 -38199 -249087 -85459 -201928 -116200 56658 -121106 194134
22835 6369 279695 310019 -50971 -198786 -204118 -233219 122840 -195565 87747 -135709 -44623
22823 -160733 -50690 -23392 -143015 -142369 -68166 -131643 443126 -150277 128267 -75434 -285233
22812 -285233 -306165 -22543 -96822 -119459 120487 -135610 -358024 -36852 -94376 -330367 57087
22800 43632 145360 -73194 154915 -53685 249825 100941 187167 161126 277721 77406 -3564
22788 87586 -131311 -200184 -93736 -91293 257572 58113 58477 248971 -205444 -142611 -90221
22777 -90221 113880 77161 -90532 25591 -92645 407476 306203 186730 9020 -45396 19983
22765 -116613 486254 258721 58625 139863 1774 -34980 33450 222449 -298543 -8896 -28727
22754 -28727 162696 189014 -267769 26996 -19618 -9026 -37013 350480 -124605 -402700 94050
22742 -281168 -33729 67316 -231080 -65799 -121405 -119779 -38207 245287 -207554 155945 -195305
22730 -53262 4474 -181644 -149450 67514 -205092 -162348 -388940 160512 107069 48703 49560
22719 49560 -246262 24359 -105932 -6440 -95474 -200310 -294831 -132814 110827 -99642 11645
22707 88489 -63853 264741 -99839 -145821 -112636 100678 78716 23601 -262579 -130583 -59538
22695 131911 2870 32261 -165283 -161473 81159 12670 -158049 13641 -105259 24760 -18975
22683 -223824 85065 57192 -161754 66966 91899 91290 -253078 -75639 -198580 18120 128523
22672 128523 169895 -123709 17875 -112868 18348 -540424 62734 -210098 138678 22471
22661 -24215 34329 -558195 -80791 -58199 172704 -263674 -550693 99491 89661 -37350 -131002
22650 -131002 53393 -114047 -363301 253658 152935 185955 -395802 2610 -72032 173757
22639 -142569 -179297 -301782 -127085 62090 188373 -352869 -48657 216222 359224 -94029
22628 -39415 -164859 294880 -39328 380099 97636 33755 22269 139723 -261143 152645
22617 -17366 -86954 -292204 37303 -5782 -362055 -65753 -218086 250062 41154 172429 140136
22606 140136 -65039 -139117 77220 42092 -13881 -372729 110892 -127089 -64257 -8765 56427
22594 344733 -125782 -387975 -322086 -153705 -111099 -81143 90250 96868 127418 125142 -156022
22582 12676 70942 -208649 91498 -404681 -183093 -314327 -161717 -127978 -33719 -961 382092
22570 -6217 139433 132919 -150147 -136767 -15547 -386137 380 -282657 43173 -99243 203900
22558 -24219 55627 271587 3311 -296338 -207030 10345 2178 -143243 215970 -212300 -46404
22546 -201247 -141876 -450014 -134093 -173558 -53059 -344444 -26843 -189011 2608 -257066 25036
22534 -64255 -47491 -63344 19710 479705 -136322 24811 -211920 -605 -131655 -15170 -14028
22523 -14028 -57439 220033 -392321 44035 -392522 215865 5690 -192060 -72385 93808 298469
22512 298469 -100275 -137018 266185 412888 -118570 186329 157018 -6631 112737 137466
22502 137466 -115470 -305758 154662 181271 -36674 81590 -335584 136506 -376182 -455605
22492 -455605 38231 252273 227016 173928 326362 -48697 -104338 -114343 93 -154121 -37593
22480 148853 -88076 94465 199902 -204547 -184010 -233815 -199684 181176 100874 -13282 -71478
22469 -71478 -13460 137899 -61917 3095 172096 -264581 39789 259566 102542 136743 -173348
22457 123393 -25083 -168581 346968 -106510 -229955 -158096 237853 150570 346005 -34359
22446 5608 4109 84944 53605 23802 114363 24260 85874 -978 6182 121900 77168 150022
22434 150022 -151236 -104693 235026 -170330 -87489 -95639 -81927 -74568 -185482 312341 25961
22422 142210 128710 62947 -106156 -13557 -74241 361604 162235 -181069 -74247 -124526 -186363
22411 -186363 412508 -52838 269010 88946 -243808 -112794 -136530 -113923 -124232 42173 -267708
22399 -14806 7752 38059 -208535 49134 -136268 -425559 -163697 -539027 -46681 -42980 -79465
22388 -79465 100979 -208870 -218795 59046 -301074 22716 -60768 606 -89653 5844 -172512 -24245
22375 93822 -408760 -215253 107255 -528930 -244101 -34188 -61270 78510 112658 178505 -22089
22363 -70546 301691 -29060 -291810 -233698 -61566 212693 -399259 -151847 22359 -53095 128540
22351 -193001 44341 -246927 64319 -290412 10837 16285 44254 65415 -124195 -156487 107183
22339 257059 -137654 106785 -261971 199739 303312 -80373 -6969 -274225 -65441 101758
22328 -79641 -177788 -10751 46919 -156100 102908 -246524 195178 -123709 -300491 -12883
22317 -167402 251091 159995 45766 -254552 65554 -277626 -40197 -11713 -15193 106615 -85714
22305 59103 -6058 -274920 -64015 -100813 120506 78549 -19095 42326 274321 101365 518033
22294 518033 -204080 216376 166582 -136558 -27631 -149267 -202369 -53521 1140 -123417 104788
22282 -243852 307238 -91009 -99832 -108119 -256685 216365 -278999 9934 55834 -19928 -189329
22271 -189329 -106288 65937 -204727 206724 69359 -162107 -316267 -16443 -228805 -133103
22261 -133103 -125518 -37817 -267189 3007 -146279 -148140 -104218 -335069 -51266 66306 -130684
22249 149876 239142 -13011 49310 -196907 -183175 150400 34522 207366 153720 -69547 -65806
22238 -65806 -69665 323055 48459 3467 172752 -11539 133632 52420 -33152 106068 200496
22227 200496 74652 119948 145441 -431253 -286479 -11841 -41004 247749 73821 109077 -217431
22215 258878 41531 22708 -96856 128086 -129173 343266 -35455 84045 42519 28338 -188926
22203 -78570 -206401 -198838 118596 199061 19985 -155520 -354540 -106107 -114331 113729 -367574
22191 231385 140404 -241589 -76302 -322612 171631 -97507 -273731 105198 -212841 -94016
22180 52511 -350175 -223978 -241698 -120938 -54996 145106 -271698 -78961 107567 -135832
22169 -27365 -97755 -67390 58500 126184 154164 -195900 105701 -170863 -99825 -99470 14259
22157 393476 206845 -12178 -32217 -297203 -236934 231595 170471 13388 -257035 20493 346725
22146 346725 -67577 -28449 -10114 158812 -121127 23513 -343888 307395 -106071 -138339
22136 -138339 234687 -232991 30097 -185531 47529 -203 -174324 220451 251116 -128371 87928
22124 -22917 -63208 111542 -80772 -214680 27002 125799 -24718 247129 271728 -209931 -154129
22113 -154129 215842 404570 -162877 15390 183658 -36820 -269549 56390 -21824 37202
22102 49907 102787 -85788 5248 -433924 38354 -227532 230358 168594 75644 -4687 -46411
22091 -46411 -323891 125545 -236905 15609 336863 315403 -73360 -14286 -92910 -150208 215336
22079 -326148 160209 174473 -77829 -235176 -231921 -177641 135237 -50204 -130654 -25748 130838
22067 3016 -235594 192075 91451 -125220 -11518 -277120 -405043 107601 68355 93701 -67334
22055 -99522 -78326 -57014 3174 -180659 -121227 -91390 245187 50692 -35486 196426 261820
22044 261820 -19251 51404 -390568 -260749 -180262 -192249 -175433 294171 -325477 185936
22033 65850 5204 146783 -85596 21421 -82708 -309685 -322344 107993 -116470 -203588 207435
22021 -38795 158535 -253858 47665 46235 178738 -11076 -132452 -118569 27369 -44215 -262660
22010 -262660 158042 262904 -118888 96065 32415 260545 432623 75191 107248 181864
22000 181864 -227319 136852 -83414 -6388 143 -77131 157520 256891 -12707 93603 -423757
21988 12318 180285 64530 107432 229087 -317756 -199368 -163320 253516 -65682 211804
21977 96298 -72776 25729 -35831 -123823 28188 62150 -48500 119756 -260702 -126238 -410188
21966 -410188 -10075 -30251 -48217 74606 -11425 64385 -234773 -197519 -11448 -104545 -322620
21955 -322620 87478 -153982 -121042 128623 -251707 -22965 155611 -11729 1016 -274929 284291
21943 -87160 -114734 -15634 59127 -344393 205173 28564 -53481 -93295 -206337 93212 -64793
21931 -7716 -253698 -211595 -163261 -73289 -194438 -39475 -119737 -32842 71016 -434629 -8108
21919 -78516 -222170 -225406 -9194 -4764 -287097 169491 -283150 -237642 80148 10999 127298
21908 127298 77052 -38383 -296468 24497 -84140 -35196 -216437 64464 -109409 188316 -309486
21896 -20097 41589 -74759 -282035 -105254 -41546 -192493 -147335 253823 -341383 12451 -270972
21884 -144278 79687 363518 -275237 46399 -114008 170658 -33059 -15711 61897 -456867
21873 -289411 -57401 -68287 12048 -318331 -131467 246926 -114111 218306 -54552 -146851
21863 -146851 134939 110437 48283 130448 -194269 347423 433910 -60262 52777 85300 257261
21852 257261 264896 246457 285037 202805 -74221 4298 149379 -342400 -85495 67803 75113 58232
21840 58232 -40834 -159966 150677 58423 201306 -251414 -212204 251145 -36202 -236405
21830 -236405 91539 -51879 106822 67168 252142 83761 -145107 121715 233043 53676
21819 -158202 129333 171016 142868 145857 -131948 -240398 -195245 -81638 -265645 -132207 196100
21807 -117987 52666 -307735 -124845 187813 65107 -208553 -109314 -185876 -75975 -46838 129309
21795 49610 -275466 47342 -285309 17781 315955 -427399 -236163 -292603 -143877 113955
21784 141585 -16074 251034 -156297 -151947 580433 124187 -217940 -30851 -5340 -280943 -285052
21773 -285052 -94808 364341 -107090 -307417 -340633 75965 38883 -476685 50992 24419 54252
21762 54252 -68729 65296 64786 71226 192293 108862 -131152 281124 11183 47272 -227953
21750 -106715 271536 -68322 2596 183843 -33378 411797 -15503 -108337 -126608 -405535 -106251
21738 372863 42180 -187876 73558 -357394 87549 60494 -95704 70717 -139553 8775 99110
21727 99110 -220044 -340662 217929 53140 -245831 -185826 37976 98690 -24779 -52077 143698
21715 -100828 -70015 355963 -337081 84572 152671 -145850 -187126 -91265 -318379 -483804
21705 -483804 -457712 -142002 -196884 -140082 -181316 -6488 -32521 375881 114581 -262047 -36623
21693 -134349 -30853 -122850 -45363 77857 -210617 -276471 150132 -38173 -73076 -13466 -44272
21682 -44272 32067 14113 -381779 91515 115960 -210942 -18500 -232203 66238 148639 -367732
21670 -97758 -56853 -194537 59826 -258137 -5162 155193 194387 185074 -176595 -242862 -175855
21659 -175855 269886 90223 187027 -4223 -101399 -109440 -23755 206387 -196170 -98439 254263
21647 90492 -11339 -98857 281933 162847 -257691 -237525 -65866 184841 187165 -200144 276993
21635 -39053 -44861 59052 -61071 -94250 5595 28764 115871 -308327 -64082 205419 92092 -336333
21622 87465 95203 -84605 65218 56454 -163774 -180455 -252260 -108725 -21242 57722 229555
21611 229555 -191316 69892 90532 55080 -96944 -9548 -23372 135062 90772 122056 17415
21599 6326 -106630 -196861 79013 37633 -200178 -28457 -58296 11128 -200185 -99489 79931
21587 -59301 -59629 -236868 -80335 246373 16365 118891 -169823 -371576 -12564 -189933 -95136
21576 -95136 -26300 -118410 -92212 9277 -238549 -10604 375577 22108 -6753 -83158 33493 -119751
21563 -243022 -31543 -144136 -98742 114188 -248391 -257987 -128718 179550 128957 -236052
21552 -32757 -191985 76115 -256495 76792 -108073 -77931 19110 94680 -229733 82036 -224744
21540 165302 -65586 -264342 34080 16980 -185937 -219399 181790 167379 -172464 78975 91469
21529 91469 415925 -210058 228749 -55700 -105557 -80165 94426 25375 -129349 -51835 -128282
21518 -128282 -23882 163414 114799 -219088 -271440 -15524 216223 151574 -88576 206628 -132649
21506 252011 111778 -420516 137031 -241189 -158109 -212292 22939 -271610 18505 -47951
21495 62635 -272471 -123545 60072 -35124 -13726 209767 280312 -15298 118164 -78713 -282199
21484 -282199 -182979 -102968 34843 164361 -351885 -214462 113569 135972 -164419 -174099 -17383
21472 -28056 14302 266372 114366 -220047 -80649 -8391 98454 -146998 181025 28741 -579058
21460 -49893 -128899 157498 -283651 173941 -303054 263373 -51831 -68995 -35422 -25806 -104080
21449 -104080 -39752 -27741 -145213 -549546 402537 -88242 -148500 -183585 182322 59319 129747
21438 129747 380113 273773 81425 -151547 191278 122043 335314 276090 243086 -97702
21427 -458545 191111 -205358 -243014 -51533 -302632 348198 -299097 -397925 56903 253018
21417 253018 47750 71937 5329 76712 -131111 163549 -261265 -129461 -104177 -312864 229183
21405 -438031 122706 -357893 -311747 -95897 8143 -154320 10239 -59973 -106155 79397 -87542
21393 -140136 -270548 -154139 145532 -289740 12203 -279958 -42629 147947 -69592 -499132
21383 -499132 -128713 116651 -58907 -56299 -92803 -87261 303133 310361 -128926 -30438 -124432
21372 -124432 199211 -3293 105613 -51617 -270833 -53047 -49900 100625 -112217 64908 -192220
21360 -199573 -193632 368205 73206 -560776 -226796 330869 80966 -48306 91596 401655 -51805
21348 -53602 70447 285748 -288793 183617 74003 217573 63199 -83594 92898 -109316 112218
21336 188328 -44154 103838 8426 132182 -255504 263417 172820 -163659 74113 11056 105737
21325 105737 237277 -467590 -226301 265526 -338241 159757 -406324 -62832 45416 6368
21314 -29887 139862 143050 54027 100598 43137 77399 84561 84718 -149376 -217139 -23440 -85703
21302 -85703 -19780 -110273 -113894 -562240 -29911 81027 108908 -49269 -17075 469947 59765
21290 186171 -61388 53764 -314304 -43350 -173370 85915 -74814 -25475 -359141 51707 128092
21279 128092 322889 -89831 -199141 -487116 -320599 -195149 -149428 -355458 93688 38556
21268 -157338 41701 -144309 153766 -40900 -356278 149026 -9035 -195088 -208086 221451
21257 -121731 -212230 -93506 69647 -131423 -423894 -271342 -66537 -325507 33351 154269
21247 154269 -433224 -466416 17622 355861 -38517 139598 597 -85384 -196632 -123415 171359
21235 238195 230184 -119689 -74942 -155599 -263029 52523 132102 127621 18309 -97270 -237387
21224 -237387 -362354 -310827 -14382 86969 12681 -125875 5504 -120427 -280099 -43683 260407
21212 -20880 154167 130797 -161403 9653 74959 -120424 -42274 86541 -39646 372119 172629
21200 -40110 -68494 -460016 -121223 -462509 -98627 -241204 32454 -297964 -73538 -67579 -114911
21189 -114911 -68889 -38794 30158 -302097 -241474 -81281 -76632 64801 -214241 -169672 -41528
21177 -271984 139802 240122 -38400 -264458 -44953 72361 -157209 -119153 -418226 -154087
21166 -244690 -7833 7145 88598 -217469 -88992 -326288 -225307 -53249 109399 -585920 -201322
21154 74763 -1543 36812 211121 183433 165816 -64739 253611 40423 -148580 -21780 -183892
21143 -183892 -48131 -305792 -314344 -323089 -278558 -114397 -200286 -356938 47311 -47285 -196884
21132 -196884 196392 -30732 -67154 -87552 50247 -2380 190865 176714 -82909 109528 58950
21121 58950 -32844 -305171 -32333 -223480 -164073 194166 112982 -215096 -19990 68742 -48592
21109 -232684 -300562 90378 -254075 -66324 -276501 -44239 -5145 -217380 -216878 -143422 210815
21097 87945 -104793 121993 -16353 85355 -103991 -58924 -285893 -276030 -332991 -167639 -83310
21085 -202317 -180334 -59475 25401 -134057 -112337 -51218 -77714 90922 -237792 -486043 -229101
21073 116483 -374284 -48934 -86748 28969 75160 -231487 -232192 342651 -174201 190858 -166937
21061 114785 -211959 85741 -111797 -79560 -235577 210523 24310 -249632 -76416 111210
21050 48332 145769 107421 -138581 -457387 -5599 201739 -161289 -10489 -105803 -184897 -205347
21039 -205347 -177877 -45895 -22421 -71116 -70697 23159 250634 -107842 49255 40330 213389
21028 213389 -300092 6214 48181 67849 122980 80980 -105489 -134779 -184400 210296 56999
21016 -57537 -194461 -41126 88124 -135154 208410 -223079 58070 -327617 -65832 -265388
21006 -265388 -381802 -236939 101847 74514 -180393 -136134 -33525 -58684 -12727 -72519 -183950
20995 -183950 43036 144745 -170387 33203 -88201 -282659 -187264 225313 26491 -214704
20984 -70112 1743 -320056 -158834 -143770 36214 48255 -56558 16625 -358212 144352 141382
20973 141382 141890 85198 148013 -210979 -81446 -117949 32954 -52176 -169370 -135108 63590
20961 186655 118495 -17007 -435836 386422 172043 -421651 -69486 8570 -104904 116551
20950 -286686 -219350 27619 -67352 190559 -9261 -334987 170615 280477 -90486 -189034 -306496
20939 -306496 -6467 294226 -24312 -101380 -59489 130146 244124 -7883 25598 -83279 -8815
20927 -36477 -24867 64463 -7991 141993 92229 -130798 -355399 -21175 -28744 -129847 153616
20915 92253 -176931 -94079 164108 -452738 78455 -26781 -5819 -222850 -75128 -189079 -4813
20903 324786 -8666 117885 -198646 -327734 180861 -121045 -29674 19729 -355647 143352
20892 -318326 -50923 94797 -387814 217604 -144944 -68484 75553 56332 79891 -23687 177620
20880 -216378 -8785 -247471 -83317 133559 -1310 132473 -140485 203739 -251178 45967 17970
20868 -292879 -106426 -348993 -63166 230483 -11700 -252846 -18648 -329749 -2072 -146665
20858 -146665 -284584 1412 -99446 -119546 272877 -82623 124140 -236472 -46002 -210655 -235355
20847 -235355 -43272 -373014 -84566 54069 49603 99801 90698 88385 -316736 88182 216706
20836 216706 263071 213897 -178171 153564 45785 -10029 111971 206798 -325350 -246896 -118098
20824 55312 -434179 211533 -45152 -87197 12981 309706 -95630 26368 180440 -380430 -367839
20813 -367839 32814 -32014 -44959 80118 275614 -201853 -17073 -89139 -185930 -283889 -74957
20801 192945 76091 -117200 -157735 263766 -139227 -409178 -106189 -312606 225972 213511
20791 213511 -464889 -387290 135267 -112069 -205795 -155129 -122205 -188765 8654 -82014 113989
20779 -70739 134684 -33957 -62100 -70748 -80861 -252076 -133394 -172493 182028 -149242 19206
20767 -262195 200372 74639 82970 -143639 217239 91291 -18946 186012 -235971 -178738 129991
20755 113710 -20604 -343813 -110999 158969 -195337 53819 28369 2203 -2959 382565 -37516
20743 168036 596 -96341 -67549 135129 46794 -162609 -20563 251929 -92583 -91283 -34180
20731 163502 119081 -222189 -52026 -22480 98435 117876 109751 223718 -382232 -32121 409443
20719 -264626 -290611 -25269 -307722 -400078 -75662 137403 -168250 -124589 12701 83601 177164
20708 177164 18573 90318 7514 -31527 -1249 142370 111583 269322 -109286 -137027 77250
20696 -186872 -22335 123689 -227367 -117535 -451451 -37257 -82032 62517 205863 -258239
20685 -222054 -145590 -206280 -9077 185158 -157496 61796 -7427 -61570 106805 -26966 -284539
20674 -284539 100240 -157299 -246013 -322325 64704 -83424 -58103 208160 57442 115587 -419172
20662 -19364 -507858 56588 -90466 -156849 -255648 -45138 -73300 -335731 -445456 83086 -17038
20650 -204567 430666 -329166 -53867 -313933 -333261 46325 -237552 109548 -5600 -429595
20640 -429595 -320536 -250315 -148315 -19747 -210280 -334029 170434 69540 -256239 -447786
20630 -447786 -88421 -242572 -159895 -250932 -185077 -42984 29226 -209290 -412825 95163 226749
20619 226749 143084 198111 -78808 -79339 -20429 -240952 -18839 833 114463 -62211 -476461 226169
20606 173699 51887 -48710 97899 300793 -178998 -138324 -302710 -175977 -122799 -30592 246662
20594 -97552 142340 117599 -208174 11092 -101267 -244609 -30777 -193774 134087 46457
20583 -291961 35575 321832 69543 17638 260859 238379 -157708 -152190 273291 -206424 145402
20571 29203 -56079 72483 232023 -109905 74169 384472 -274443 -153614 -302501 -365852
20561 -365852 62907 390058 22873 -39429 -264838 -242323 -63493 -116603 -527087 159533 -148347
20549 74450 343328 -14054 -300 -124448 -376246 -18019 -280630 -178197 95516 -107926 -118247
20538 -118247 -130017 -91649 -133423 -101643 -92068 -268648 212816 259664 97277 349986 -155670
20526 208758 -196375 -89466 40761 -142609 116869 -212280 -194308 -264416 165394 -187028
20515 112993 -502263 -69358 -138589 143351 -143203 29822 -128862 -14093 -57384 -82396 235015
20503 -272115 211845 -306857 -140140 -3503 136483 -101631 42951 -80574 35911 -120467
20492 -97098 -219727 -189639 -141003 75874 -345506 -191881 -105632 -426323 -76936 20414 232505
20481 232505 9784 79040 120097 -43096 -23557 -26818 19354 -59022 294280 -106628 104003
20469 -130570 -83765 45000 -417059 -172146 147565 -188473 38805 -24605 51708 -61561 -197061
20458 -197061 140895 3381 147132 47394 -29948 -53347 -209588 115391 -5890 -92697 -383120
20447 -383120 105810 127813 -312691 -154762 -96764 -201062 104134 125029 124407 -157069 -86911
20436 -86911 719940 -103205 -4024 -217273 8465 83046 -25098 -122214 -186756 -161155 -235335
20425 -235335 -6140 25527 33117 262692 -244445 154229 -331447 -255450 7064 115476 -58947
20413 -183870 -46044 12261 121652 -226964 -358388 -98224 -237727 -92050 -201705 63024
20402 -56559 230628 -227102 -94948 124045 -102331 -175712 -163822 -88936 276080 -62184 -19684
20390 -61984 -258904 54499 17064 -241853 -152876 -516474 -177255 103479 90348 -113914
20379 -147262 -75962 186434 117957 -38658 -154722 -20247 64341 -32328 -42847 74705 -260121
20367 -207892 -147515 -188519 325205 -186719 88445 102390 -421610 -389759 17168 -251364 -28139
20355 98456 -30470 -47007 97688 -207460 265138 -166588 313373 -320854 81574 195101
20345 195101 -485463 -33410 -138739 -216287 -88689 -8414 -95229 -205955 175424 -115055 -129522
20334 -129522 -100108 -265306 -28731 39015 -19378 -211044 -282630 -990 -61806 -201987 -226081
20323 -226081 52469 15792 -13990 -36045 161273 -179488 -157757 -283820 -54653 58255 -22344
20311 -168148 211030 -218847 27138 -123536 -13644 -4811 156553 -61565 -71728 -167671 -302500
20300 -302500 190110 140950 -144168 -206418 -196667 -253043 263977 83084 224706 -135092 39260
20288 -264721 -111253 -468637 -116369 -83028 -168491 -177549 -175748 246587 -146048 -11411 -9274
20277 -9274 484503 -324328 -245904 42552 -359415 -1525 93958 45340 -262384 -109885 -332744
20266 -332744 -105129 67135 -229611 -186586 723 -266328 312552 -219549 100473 -62222 -313145
20255 -313145 77884 -240722 406741 -263165 125155 -70963 295750 169838 -280602 55976
20244 30369 -20989 187771 1663 -163187 -224557 126551 -154667 -166758 -139299 -501953 87448
20232 -195442 -21531 -80772 -78937 -101493 -51007 -149586 -14590 -250198 -73615 15025 253002
20221 253002 61146 61384 83935 -109726 -62266 153489 34321 -122762 -78681 56562 -7378
20209 -174787 -311155 105404 223568 -24488 -95382 -321970 -79144 -31697 -380346 -170159
20198 138195 -208159 -73232 -130390 51276 6626 -102215 194075 -288349 -123470 -141108 -212566
20187 -212566 4757 -16262 -89617 -357430 208499 -449788 114221 -221025 4412 -53366 -227912
20176 -227912 65774 3732 -36986 -58807 15935 150177 -403951 -28917 1426 -81222 21654
20164 166950 -148927 14162 171900 -443957 -335346 -105785 -399464 -30318 -57508 -133538
20154 -133538 45286 -193547 -288728 -312735 -151720 -246802 43755 251235 149527 171127 -450849
20142 134695 -240670 224490 -36532 74035 306985 -260394 -316043 27215 -182651 107543
20131 -79755 -80044 -35712 -312117 -93400 189393 -303592 -1222 -70398 -70178 165656 9488 -168577
20118 -194737 -22212 -74335 175751 -129079 310190 99107 103877 -73938 66349 162342 -187570
20106 -213685 -90580 49703 -20589 -61038 264980 -194594 7055 -113270 -160527 172201 -156091
20094 69018 -86649 -96923 -182838 306882 -78912 175604 -64964 -403857 82808 -122773 387447
20082 -133135 -318927 -273028 136522 31803 -80126 28896 -178005 89571 -263488 108938
20071 37926 37143 -111701 81094 -310506 -182697 -109598 -271348 -24606 -68891 310349 212462
20060 212462 -365388 -96821 30897 261624 11776 -142904 -87502 -211732 -40891 -443793
20050 -443793 -198973 48206 -75052 39797 -216751 143960 94937 -166002 -293385 -369464
20040 -369464 70441 -359950 -128320 214116 277551 -85952 -21967 -145967 296425 -79149
20029 25096 -17884 63557 67564 -169850 405129 194517 -224381 -138857 181677 -243195 -18788
20017 128063 -143615 662 162849 -279479 131774 -142946 -506923 -133991 -105517 -224887
20007 -224887 -20936 -13532 -178084 -78153 -390780 -158481 -195500 -29967 -153298 28119 138468
19996 138468 -353612 -450004 17253 19134 -241727 -152893 213991 -95243 -172501 -167824 -38289
19984 168050 285987 440513 -367406 -282665 144731 -25032 -377458 -151664 -120308 -301832
19974 -301832 -348450 -40482 -102627 161386 1621 44724 -241387 -43419 22967 -59461 211337
19962 243059 15585 -155919 -38498 -114662 -135537 -313660 -44427 -188828 -39885 -15636 -174846
19951 -174846 21346 -83393 122089 189090 223332 -273655 -25716 -193233 76362 83055 -125678
19939 -116587 -140487 -573305 -477739 81706 -147183 13168 -22978 225819 -95319 -15142 74501
19927 -71740 -240284 35540 76347 4308 -200231 -44953 -90018 -159613 67057 -197019 -216438
19916 -216438 117759 415691 76738 -152038 -291211 -150641 -79623 -76425 63515 -226285
19905 113761 -162278 71650 -320545 -35867 -289491 55538 280650 22026 80332 -66392 122580
19893 -183834 158876 119437 151386 -95329 120414 -145642 -72470 -275667 -104346 -237183
19883 -237183 -151562 17784 -137457 208799 -193980 89236 25716 -140092 -53558 -97782 -2863
19871 -84380 32485 -185826 -173399 188586 -81721 -131109 107742 -35528 -183039 -104317 -357729
19860 -357729 -6835 -79968 -242737 -57026 67459 -52086 -269495 -67663 -107492 -225054 -121508
19849 -121508 -107308 58870 -68129 -116237 333776 -43283 -127454 -117324 -339211 72905 -151422
19837 -321222 -34985 -35307 230370 -274416 -96467 136563 -313059 -272497 -88449 61321 116367
19826 116367 141943 -418012 -326419 103440 -114207 -241568 366408 162800 125624 -147917
19815 98832 245135 6323 -203854 38658 148286 -233113 123018 1133 -301138 -83793 -74585
19804 -74585 131630 112003 -245160 -171722 71249 -260331 -14589 -192741 229714 -183615
19793 -226224 -71086 -322947 217161 1533 44822 17604 225199 49395 -89010 185552 71737
19781 -10833 34303 -3761 -125302 160687 56217 -74561 39485 -14758 -421438 -223502 -5217
19769 -109171 -23646 19947 -111454 -6048 -197424 73328 -274320 -58235 190596 -320814 47835
19757 -189400 -32339 219215 -276792 -109408 -122464 -82601 68580 286303 52111 -235699
19746 -5702 -8436 -345353 -298561 57322 -64173 94620 -110350 423236 -37455 -27159 -120209
19735 -120209 -46949 -240364 -98863 -47841 -51702 -204068 79808 -326047 -143284 -26168 100817
19723 -332663 64125 23800 -98485 51321 55534 -97550 16913 83172 -102947 47345 -71577
19711 -235175 -369802 31255 -84464 25326 -35770 -38162 -166592 32439 -191969 -9830 125670
19699 -32369 -191616 -171167 -321279 110337 151274 -47553 -97825 -161407 -102639 182924 -468105
19687 117227 225807 -85665 -2160 76892 -412980 116255 -182551 -209975 -155268 -182118 -356796
19676 -356796 -191290 -158267 -59960 -138726 -18369 15589 -45476 -253458 81552 -179620 28556
19664 9591 -120739 109334 56917 -68065 6518 -307067 -375720 -352747 -300472 -50854 15195
19652 363100 -762 -49927 -503478 201144 -188015 -78678 68518 -149901 -272672 202809 -30777
19640 6595 -391232 -101901 97808 -369984 -34494 1892 -109648 262209 125567 154455 289241
19629 289241 -159517 -345716 -39589 -295336 -231898 -219311 413821 -80693 -267827 -118802
19618 92678 268986 153589 94598 157949 -264822 175438 -71224 -35140 -195735 -168264 181881
19606 165226 75637 -127704 -382810 237582 -68011 -160767 -229486 125010 13552 -256198
19595 -182235 53180 85320 -426617 -83456 266656 -78410 30263 -423754 -308907 -225948 253457
19583 -200160 -99371 -306519 -230168 -88229 -28185 -339693 55317 -83427 -228027 175670 -276094
19571 -325328 50951 -125119 30366 134929 -347904 299877 -12132 72109 -130435 -123950 406978
19559 64965 -147534 -8803 -75424 314932 286400 -262814 -98488 90748 -327288 31954 -80871
19547 -146709 -134270 -340033 -38862 -4384 333146 -136186 -416903 -141660 -108448 -103200 -205297
19536 -205297 -178578 -131851 88753 85759 -85057 37253 71283 -127222 -209575 327639 -112996
19524 -183625 -3458 -5067 64012 -247196 -99987 97872 366145 -76747 -125042 -227157 -115774
19513 -115774 -2949 -250259 35878 -10115 -55510 -203589 -155049 -335756 -376292 73417 160532
19502 160532 -113041 57831 -54335 -316574 113118 104355 -532914 29001 -41977 -148269 379466
19490 198006 -361558 264259 -63617 -162798 -276693 -40323 -167985 -6142 -339355 299630
19479 134891 98421 -138745 10285 -102775 -199612 244540 -278661 -286168 195947 -88060 -413704
19468 -413704 -39299 -479821 94864 -381857 -236167 279917 192993 -31829 4910 -145845 59374
19456 -230935 -295863 -68596 153104 -22064 -203831 212796 -201532 97774 -42216 -111234 -362912
19445 -362912 149011 159873 -144145 -381052 -247303 124367 5498 -36917 -45042 -195561 -20748
19433 -159511 -6500 -67610 150424 -188511 -178344 -241240 -57243 89544 -264962 -191968 317061
19421 -198966 31684 -265669 166446 112883 100388 17371 232042 -368687 158002 -325025
19410 178576 279020 -46153 -94432 -56962 -59029 195728 96296 -22021 -26750 5432 -156858
19398 -117598 -68641 -29795 -33722 -130738 -49973 172663 -265413 -259729 -61815 -109690 342541
19386 -54559 144947 -36277 45088 71101 -140633 -161498 -150752 -243193 66410 -98173 80529
19374 79047 -17995 -215581 109766 50400 -27938 88834 12951 -88725 -9788 42844 -46759
19362 267415 -260736 -173864 -133246 16208 188079 -15301 -379267 -423603 -160701 76396 61584
19351 61584 189299 -219578 -164903 -182104 -9838 -352112 -47649 112237 -145568 193967 268171
19340 268171 -232226 34967 -134100 349335 154594 169504 -125506 62314 -128993 -212007
19330 -212007 -306223 -41614 -359155 -20342 -92418 -516115 -80287 97360 27155 -12394 -223020
19319 -223020 -143968 16800 -232405 71811 115400 105098 -113251 -159427 -207546 123607 -252528
19307 -18613 -202088 -113758 -178901 -144075 58521 171177 -41662 -360607 31443 31752 -21154
19295 -102026 -32788 73795 -41488 -194250 -136333 83942 -141310 -109427 108868 -111556 87474
19283 72614 232920 -72296 111471 152966 -173000 -44407 49013 70801 -210519 -55127 -30824
19272 -30824 -109861 -225214 -435599 -250392 57639 -118948 46041 -151083 -35784 12802 15079
19261 15079 101567 -223802 -213612 -102815 -171404 -25595 -161816 -71365 -27437 -154072 -177044
19250 -177044 161074 297606 185959 -252227 164427 -320562 -367220 -14275 139663 315408
19240 315408 -62463 -92110 -90475 -18450 -54592 -167959 32542 150915 11239 -333369 -131273
19228 -60850 -25058 30724 -13210 319680 -306626 56649 189734 -95036 -339833 -110827 -38561
19216 -302190 122565 -266822 40866 -57678 -104212 -268524 -68288 -331106 -190555 72699
19205 -221051 -11749 23627 -164120 82328 -36481 -63644 67703 -139082 84627 322197 -57431
19193 418744 27226 60408 -188631 -136157 -11131 -187304 -70672 -94657 -96602 -42826 234142
19181 -353051 -61470 -72355 -13766 320810 227012 53143 9779 -281578 302317 -177249 31595
19169 267752 -174465 22666 -118670 34748 -134318 -39553 -58397 -89436 187067 -254689
19158 173376 216671 -307327 103169 -290390 -349438 -75905 144702 -141291 -229747 420266
19147 -253227 -144850 149114 -5573 60505 -320587 30065 -35072 147255 336929 -119137
19136 359921 -392768 -152075 -261589 -154132 -9637 -228008 -121418 64689 -21347 -233974
19126 -233974 -102454 -61495 55458 -111120 64502 20208 48699 -37793 132993 -67784 -106956
19115 -106956 52282 85980 168907 -79348 336076 143297 -148401 -192740 -223291 10353 291734
19104 291734 -153032 348579 -191694 -145947 16148 19827 -126739 -270896 -310327 -284274 135442
19092 -10808 -125962 39930 -34313 -219155 -2090 86553 -62244 -147425 -329887 -190116 -217366
19081 -217366 -231302 61108 -92649 -175771 158145 347279 -145181 -7753 25444 -406506 -322573
19070 -322573 89758 -77849 162339 -137315 300492 253367 93576 -201204 204281 15742
19059 -24250 -144793 36333 -248886 29156 -188448 -87197 -180858 -49724 -260669 138313 180875
19048 180875 -175355 -78233 23171 165232 -29506 42959 -126503 -148060 -110582 81537 -123749
19036 -55370 128193 -135865 64314 -420132 26661 122504 95609 -228978 -242787 -251130 246183
19024 -150007 87926 192459 -47715 291510 196446 201934 -103761 -30326 -9510 50475 168904
19013 168904 -171221 -139265 -236918 -219773 22520 -174110 51129 -148024 -282745 -20957 -494810
19002 -494810 174379 -89657 81128 -8511 120240 -422966 -64073 307502 -175225 -164397 -243821
18991 -243821 201408 -135317 140322 161319 -95961 -266282 174181 57435 -150193 -279368
18981 -279368 378157 -22080 -64741 140182 -227098 -82999 25086 -145663 -52631 -136679 36099
18969 -194179 -338204 340647 -6343 46450 -170204 66808 95933 -55687 -36959 -408540 -63330
18957 -202857 201503 -168551 -192384 121109 64286 -89851 14886 -270425 -221640 202682
18946 -32962 -9781 -57331 6655 277965 186259 154476 64865 32210 80445 -83304 -416851 -216202
18934 -216202 -238803 -328197 -600116 105828 -199740 138201 -163066 -201160 25102 -623289
18923 -83468 -194039 -521443 53677 112260 -183625 -152812 -184425 -65096 -246351 -319010 -216223
18912 -216223 240583 -332157 -335578 260517 42801 -170296 226461 77096 -60201 148065
18901 162537 -306114 387837 -70037 191766 222037 -185139 -96171 -440566 -237433 134050
18890 4822 -302486 -47205 34397 -139098 116192 -203290 -302256 -339734 -157508 -21703 213466
18878 -54509 -141876 -443478 -119765 -69373 -212599 -136732 -179459 -16468 -130293 -244480 -7379
18866 -113496 -341967 15510 -199998 86399 178972 17104 -148228 -330695 60498 206933
18856 206933 97717 -390897 -270551 129268 347546 208818 -34934 -58000 -110197 40995
18845 203142 56037 -67946 -284735 149166 -193546 -68279 312736 -118688 -187513 -266745
18835 -266745 -262191 -184079 -73894 66110 26057 23008 -1559 444038 -191267 84670 -20644 122781
18822 -23392 148817 54737 -35695 43814 -100577 214801 208546 -12280 -150755 -47733 64076
18810 174130 266621 -52395 122888 86852 40385 -183422 -36565 80710 -225310 5904 31150
18799 31150 -87312 75145 210933 130441 -29835 46116 -130287 -20289 128492 3665 245822
18788 245822 -105681 23435 -63694 109749 -187671 -47110 -94900 -27960 -28876 206048 -21394
18776 -44740 -196277 285624 -219264 -915 -99004 -296931 -81638 -118227 235029 -260719 -142491
18765 -142491 -260702 -1810 171766 -46916 21376 -32487 -873 -167315 -401189 -158570 11240
18753 -114251 -235158 -400879 247224 -304961 229764 144012 -19083 -408208 -224492 6568
18742 135871 -170908 -62626 -23690 -308257 148365 -10659 -180572 175617 -168485 319816
18731 -167738 86829 -70651 -161038 158803 -145644 -41260 209905 -406840 -141917 -279210
18721 -279210 -125819 -132824 -93027 383394 182671 -166190 -240942 -285176 62026 -278632 186290
18709 156859 254609 180906 -185574 106399 -106845 -268731 -80292 -2414 219221 4719 -116530
18697 -126931 -83776 -25574 -77613 -174784 -58643 -164169 52004 -2073 -312885 -160011 -22431
18685 -105976 254856 -75121 65146 -370223 47045 -97010 -45928 138503 160736 -122411 180264
18673 166170 -147448 166152 -222225 210082 63677 247221 -239631 275498 -171694 -2858
18662 428974 91417 -166624 -167906 -172802 -216825 -92351 -120426 -57221 -262322 298291 -9513
18650 97483 -64841 -173629 -31612 -435299 -90234 -252982 -67172 -12610 -69506 -22647 -259990
18639 -259990 69732 68853 338722 -67981 -110902 152199 -98547 -281772 -91249 -53531 -323398
18628 -323398 -453494 11484 350279 -226647 98188 -327632 -69263 -465789 -397801 57312
18617 -15767 -75615 -157796 -44306 -223909 -376191 476 31060 25457 -410749 -146490 73125
18605 -295137 -303077 -66125 194893 32724 404151 17321 129828 167912 -114542 -293086 -31675
18593 56928 73764 -48490 -179359 162930 -179749 -160610 12569 193960 -21385 -70642 30041
18581 451975 105529 -122139 -534135 -226491 73051 -92062 148283 94509 -237900 -134898
18571 -134898 -515350 -87620 -324047 -191107 -182723 -194853 140567 -303699 -160293 213625
18560 -273558 -43677 -181782 -53366 -15505 -11536 -6690 -107097 136768 -321059 -19176 61143
18548 -37269 -327475 -210653 -67921 -195646 110542 -23500 138674 49977 -271173 -198829
18538 -198829 -327801 -66581 -70519 111959 -234656 -57990 98001 -14713 -96855 -72612 393125
18526 -186887 -60898 -197026 -226386 -93704 -93458 -166824 18888 -319047 43096 4931 -80295 -300846
18514 -300846 -69449 -371014 -125361 -109330 -68558 -143629 -137027 179144 418235 -6889 -80845
18503 -80845 122079 667164 3771 -27925 -172408 -206713 -114988 17705 343346 -252109 -74598
18491 -4092 157128 257318 114589 -38656 -55188 -85133 264886 55542 153831 -250140 -222968
18480 -222968 140546 149230 22582 23770 77472 278209 -48459 -79480 6123 -28648 -424846
18469 -424846 261702 -31490 -75620 -227071 -195315 -164365 173348 -582014 -101861 -158034
18459 -158034 61460 -501916 -189027 -230998 281208 -60993 131194 2851 -213212 157008
18448 -93045 148899 -107306 -30307 -46878 -13174 -105410 9518 72974 -14535 -48278 -188393
18437 -188393 -163685 -95839 -245583 -301993 228104 68557 -764 64818 -122486 -261837 92876
18425 -443141 -55074 52746 50255 -1723 85595 7390 -163039 282545 -104551 -78380 -65144
18414 -65144 -167000 -291615 -294240 -405689 109216 115320 131764 133990 -191252 -389211 -167706
18402 -86950 -125852 153697 286308 338562 108592 -155412 -554721 -108698 -134268 121812
18391 234818 -145120 189037 270735 186869 48292 88783 386959 67048 -309152 -101856
18380 188206 356978 321246 1156 -94386 -181140 209851 -112997 -79794 71622 -153589 -121045
18369 -121045 -61485 -120638 -144967 -94519 -204786 243448 186021 22735 412153 -124287 -118774
18358 -118774 -266520 -119500 -67870 -74513 -132132 -97695 65088 58715 115723 172105 -210137
18346 -36513 187532 2174 141944 -4157 -122211 -291872 210243 106540 80291 197110 -118462
18334 21433 -561343 108006 -34534 -33243 -123482 76063 -392688 -146022 -93248 -227762 -108308
18322 297494 -83239 -503418 -9227 -65017 -190285 -212695 -406005 -266163 169129 -57925 316544
18310 -153815 150344 -341067 -176884 67002 -283749 274530 -30399 -155944 -18006 233934
18299 156035 296801 -316007 44622 172251 47706 44292 10972 -96843 62656 -8607 617 117003
18287 117003 116276 38310 35375 -136332 32145 -96242 173106 -21723 -194774 -16200 79568
18275 -244733 58990 -4000 290306 72473 -382453 -188350 115012 -290641 -277302 -41277 243569
18263 -425001 -206311 209101 -101280 -254793 -179415 -263676 -166541 -109958 205536 69774
18252 473723 77995 463972 -117376 -57934 60248 205253 -141216 -25337 -220587 161491
18241 -81265 96421 -289456 144897 115306 99162 -123028 -209747 -239158 25036 -92148 -152331
18230 -152331 73002 -211638 -140188 -103250 -54546 50684 224524 -53916 -193137 -40443 -40144
18219 -40144 -155539 -285603 8769 48977 -359109 -322376 19489 213899 40973 -128538 173900
18207 124200 25546 323173 -183438 -14580 -16277 93102 -233104 -339137 -273703 -115754 -283147
18196 -283147 -183475 78816 -75512 -362382 181261 -93667 -49629 81136 -203801 154761 79387
18185 79387 6500 88086 -447647 -396904 -189005 -62529 -98045 -147922 -35632 155801 14592
18173 -345922 64248 -110441 -390930 -147288 165730 -275844 186744 -194920 14192 -273703
18162 -308544 -285754 -257542 -61788 -423707 90081 -155839 -247645 -58556 -53364 -17016 -110470
18151 -110470 -349645 -60840 277463 -631956 245185 -264460 -353945 191205 57159 -168776
18140 -290084 41875 49569 -289370 271214 -92969 74985 230239 -7482 220944 -289047 143090
18128 -160343 -3599 265204 -157998 -172113 79214 -13587 -113918 -240412 -42150 -169264 -10193
18116 -84582 66965 5106 -165223 -62618 361263 35668 -195766 -212444 -8035 583 -18419 -195148
18104 -195148 284756 -92254 -44828 -95244 -16051 -314 -201876 -241517 37090 74374 50800
18093 50800 43869 35903 -285977 -97808 -122716 -2560 111675 -200887 29977 -150304 70683
18081 267513 -177979 239120 -11529 84560 25943 139284 -292217 98217 -234600 -74639
18070 62462 128091 25808 -6452 29628 -159254 -121262 -37440 -42992 -5554 -313611 -88087 -421804
18058 -421804 -235551 288033 27424 -5418 24351 12660 -108988 -311541 -163080 155256
18047 -66765 -357628 -198515 -200182 59792 -529852 -202214 -62033 38774 63516 -89985 221975
18035 149794 192347 -435374 -31747 17558 -135561 159169 -99258 -23429 -19464 377886 -263700
18023 -345009 241778 -155968 -179414 -56176 -16637 -476219 -119065 -85490 332692 -221786
18012 -85521 8679 171733 118048 56818 -168140 132293 156384 7006 -182229 -298861 173536
18000 252751 -11270 194396 87590 -216380 17231 -67093 -97883 -197182 104169 271392 -229311
17988 -91908 -54235 184230 -346696 -235232 139541 42697 334679 60695 23336 162227
17978 162227 150933 215107 -1003 -143682 -323850 200085 -148267 -50194 347126 -332144
17967 41379 65243 175808 207078 -175302 -46878 -55143 -42808 -41573 348038 67521 -89649
17955 262044 111557 -90531 -178558 43037 -134341 -54604 -146412 96856 -152561 -189138 156521
17943 -235459 -22462 -209249 -145273 130884 -122908 -64903 -10710 -171950 49411 215672
17933 215672 -137857 211100 -268613 -64525 72563 -88640 -215422 -321583 281078 283207
17923 283207 127485 139084 -36959 -202302 -177308 -148221 -255714 28009 -159159 -58819 132887
17911 -27739 -66947 253189 -110025 -169399 119563 186968 -144152 -157148 2769 242703 -263217
17899 63637 248765 -303379 -34616 246439 -265327 65780 -9105 -44228 12276 -215508 115336
17887 -332780 155840 -16078 182968 153207 -33539 -26246 -188226 239286 -71574 -14810 -225291
17876 -225291 -34951 -86814 -98522 114892 -19662 81470 -31707 78302 -71713 -204158 68099
17864 -328734 -98137 232621 -8612 105929 117009 -347432 -368317 -128003 -109352 195791 -616278
17852 125672 -72371 -55973 -197442 -48239 147176 169108 29449 11561 66982 338655 14906
17840 -110685 -71592 -3978 -390 210059 100585 103152 44572 -218605 226148 26727 -411957
17828 11071 -299671 154488 -258069 -153639 -185834 -9051 94671 -72801 50174 57462 103558
17817 103558 125521 -199281 -252920 -26366 -97030 -245182 10653 -70995 -255641 -279800 1571
17805 -206084 -115410 26598 -185609 -54216 34363 -474419 -89856 -146096 163308 125412 147884
17794 147884 -175955 75110 19835 -238244 -68584 -213032 38339 88307 49671 -164651 226282
17782 -127465 -25914 -104384 181723 -61396 -112166 -77387 -151078 -97145 163918 73283 -283836
17770 -149959 222770 312130 -115304 -30787 33964 -141352 -165606 18362 -161523 207829
17759 -149472 247259 -323377 -134150 134319 -121306 89265 -252980 -49795 253472 116597
17748 -36591 156532 -327117 -22060 -98095 -22084 441945 264488 -192585 37125 114748 -208705
17736 163046 336742 -49784 -139235 -257081 -107290 -50415 140608 120928 -37393 -160037
17726 -160037 -236156 315441 -217489 -255021 156418 114403 179275 29471 259383 84822 -94877
17714 402429 131640 370910 -442590 -153853 103508 135317 -410276 -255456 293835 -173228
17703 -324089 -145916 117552 144618 25430 90941 202003 215366 34735 62156 -147376 -210245
17692 -210245 8913 236754 358542 -5472 -159041 -130823 73202 -8379 -71726 252578 110347
17680 17542 63201 -103750 -21741 -50184 21278 18515 292428 924 -168704 -33137 52476 -3775
17667 44078 130787 146422 -46525 18672 144746 197003 -130666 -57622 317257 86060 191082
17656 191082 -35902 161945 174547 -28177 -223045 -138937 -38097 -93040 192976 139430 -30872
17644 343899 62861 -108050 -74232 204255 -141532 -2384 10492 315698 -110633 195832
17633 55576 56672 198529 -187974 174516 -23687 -237875 -186156 -185786 -470697 122613 -168804
17621 -41652 191055 -22964 -113793 207214 175100 260660 47298 98863 97423 6650 -87848 -277258
17609 -277258 36577 410807 37474 -76170 -112399 83041 17804 134971 -45991 226216 98930
17597 53939 76755 -204801 198800 -173887 43523 900 178605 98072 -98954 -46223 -179036
17586 -179036 -463080 104755 -57546 1028 265752 115786 121861 -82765 -26135 -52136 -62539
17575 -62539 219967 24403 -94653 -1168 -17017 42351 231162 -27584 -43942 -288819 -37062
17563 -66565 -167364 -283941 18315 -196388 -131418 -150744 64152 -36642 438326 156609 21034
17551 234730 -37450 35989 324095 -71407 -230183 -94243 91156 98228 -143650 37771 106266
17540 106266 -13584 -164088 281191 199152 58489 359920 192199 321753 123514 347097
17530 347097 194608 2470 -221548 325043 -69907 -5013 143577 275105 34049 -65639 -10627
17518 357432 167554 457118 -194870 182902 264979 177723 -80059 -312440 -345922 219121
17507 210 -25435 198258 104260 46583 -44679 329032 -207015 240440 241088 75931 297892
17496 297892 85824 37864 233417 346624 -74006 -178989 -148896 257221 -159550 -83814
17486 -83814 67366 -109000 26193 236520 -35895 -9067 87910 -9826 113668 43269 4248 173864
17474 173864 103013 293534 -300194 101615 269767 -101468 388847 14917 210890 229949
17464 229949 173019 104604 43948 -24120 409133 204061 30330 226295 243214 64646 24718
17452 248440 2183 192939 -11154 96389 311125 435305 56181 157038 245605 162292 152820
17441 152820 -100179 14782 380660 371282 -116214 59364 48718 131314 349541 173367 200901
17430 200901 70607 327312 -206452 75445 104693 285175 577424 81621 459069 325933
17420 325933 323478 373117 393160 -85444 251288 320942 289181 301026 357231 314587 226513
17409 226513 215787 311379 126376 30482 203688 163540 207203 278412 126147 157713 240143
17398 240143 104394 12296 -184016 -60763 135070 256913 126050 196452 369252 116810
17387 217931 493933 -43455 27475 147978 87326 143526 -8682 218479 365804 419550 -46615
17375 426547 231112 148392 -40414 -358193 -5151 234229 417236 136226 -44320 264623
17364 156645 30082 -74014 206546 390778 272207 -76665 117746 567122 266041 -301223
17353 -241356 370555 382481 52506 -91223 59742 -236090 -97550 246473 95377 127226 -35304
17341 108879 216361 88197 -248029 249155 237739 55684 526075 121714 228459 543964
17331 543964 108852 -90616 85311 73612 -172364 -153280 94561 -33006 261536 379890 248651
17320 248651 278020 292849 183953 243441 336389 127122 261646 -28465 91313 62367 -60297
17308 207625 25821 502460 -63538 43961 -184814 254618 86186 342346 274912 58594 -87427
17296 308670 308282 33970 -148970 164966 43690 231112 -148084 67766 162167 -75568 145888
17284 -32195 308472 426570 322622 157210 350930 130275 192197 163715 -6626 295703
17273 -74099 330389 363589 170888 159606 -136454 -183728 383302 424532 464985 -62298 286754
17261 172561 389325 237106 23152 243582 -225775 -1647 270338 72943 185744 175055
17251 175055 63887 -83678 184005 152518 221485 304532 -303111 413962 119905 2941 495506
17240 495506 45262 234158 54157 -106388 178989 93285 163698 145825 153535 59430 263303
17229 263303 -246676 350426 332527 -48225 116920 -8470 234363 155095 408522 550200
17219 550200 242856 749819 307154 362278 96049 242971 134350 230318 82706 52800
17209 52800 436317 -19516 272125 -160199 180628 413792 297496 277054 356464 279910
17199 279910 -182561 93026 415697 -77144 184115 309842 360970 316749 226616 68335 318820
17188 318820 38178 117436 418128 178333 313120 533802 149038 35300 273563 209814
17178 209814 166078 457551 152082 387428 84465 244883 475915 595305 192181 274565
17168 274565 189015 -148995 -88102 -91470 527317 143152 211910 447284 294411 260155 421903
17157 421903 19402 276587 357976 290976 402712 -41647 -56384 481214 103479 422787
17147 422787 212134 138185 484706 390200 288647 405573 114454 299477 330375 223201
17137 223201 525423 550331 509818 446867 383407 247743 547098 316284 185599 374348
17127 374348 579604 -65742 370547 167874 130834 194336 323582 434199 12435 211810
17117 211810 415767 48975 518787 285308 417276 577342 173051 -27966 381984 272425
17107 272425 538525 198799 283605 588570 202450 188231 370346 304745 767025 532365
17097 532365 532859 674341 689430 409864 464262 564175 401428 259286 514502 429428 342192
17086 342192 490920 534647 524434 318065 413279 -44739 287775 702469 420712 485998
17076 485998 377426 480625 422870 438479 176277 115939 547771 518243 605647 297176
17065 628972 537849 293025 263630 707412 453887 455932 604819 308821 608238 522091
17055 522091 390284 355439 530785 603046 628007 624536 537852 342295 713279 323300 861150
17044 861150 477292 737821 689798 594799 514901 623950 444434 801269 667368 799248
17034 799248 785234 764532 553174 554318 687930 596010 444355 662703 155363 543759
17024 543759 813403 123479 678868 703055 515636 256370 495648 648033 586681 585647
17014 585647 524028 581849 698382 328104 445019 661273 508037 415373 894063 745619
17004 745619 859895 701608 839439 773239 949804 707405 913118 638037 767624 780058
16994 780058 759857 710947 670894 1196538 648817 505728 674292 723841 773717 638343
16984 638343 696003 681981 841549 832447 987501 760634 776658 941265 586781 546789 1059275
16973 1059275 1018670 811749 788395 1001380 953972 771520 1162361 884317 950340 1007910
16963 1007910 774246 1022092 1043761 1000633 1046902 1027493 1050528 883033 993970 1129943
16953 1129943 902398 977787 829632 774417 1164993 961538 1025761 1241820 1166575 1023271
16943 1023271 1283604 1027394 828544 1449640 1060029 1187299 1257743 1285370 1625800 1304260
16933 1304260 1237092 1195801 1229833 1214759 1715311 1277714 1468017 1401421 1803171 1143660
16923 1143660 1113063 1311812 1100279 1809299 1463857 1338825 1665099 1568474 1550142 1859234
16913 1859234 1657394 1414123 1309119 1949624 1469389 1800345 1592928 1486285 1722655
16904 1722655 1729010 2060827 1817486 1799738 1765776 1744507 1614208 1947443 1628500 1626252 1864990
16893 1864990 1763492 1858427 2095352 2154872 2288426 2098084 1974386 1952426 2107718 2027676
16883 2027676 2173268 2354832 2116822 2208981 2306599 2390711 2413090 1804610 2403890 2325716
16873 2325716 2519650 2569792 2538908 2538636 2841523 2904086 2906852 2869371 2547899 2530776 3096599
16862 3096599 2622824 2981431 2895814 3313423 3293274 3100515 2921154 3268467 3243947 3160119
16852 3160119 3435813 3488682 3681735 3566248 3429668 3504971 3877757 3942974 3644844 3494413
16842 3494413 3925529 4182685 3910051 3961525 4123183 4331879 4522077 4327335 4363458 4540160
16832 4540160 4463041 4783277 4800990 4889308 4730467 4772345 4992148 5395716 5383205 5444156
16822 5444156 5351385 5588024 5723817 5665595 5880783 5945068 6244218 6192215 6292551 6699239
16812 6699239 6825276 6896592 6662741 7083286 7217727 7386836 7329208 7656441 7715404 8187654
16802 8187654 8465561 8529884 8957667 8898638 8935321 9396691 9340971 9770909 10114983 10050537
16792 10050537 10231557 10959722 10966050 11076486 11751971 12136573 12236833 12628074 13020481 13537099
16782 13537099 13910124 14347994 14722255 15067622 15500425 16268346 16681554 16715745 17866281
16773 17866281 18282185 18925962 19447077 20131536 20905678 21604397 22319043 23261142 24023416
16764 24023416 25214368 25922683 27237795 28205410 29137437 30502229 31702808 32965790
16756 32965790 34246697 35952632 37631594 39428492 40851865 42827154 44557753 47284501
16748 47284501 49147198 51824994 54391047 57036182 59992202 63086726 66417508 69763538
16740 69763538 73607718 77740303 81810443 85966712 91017871 95888668 100777545 106502883
16732 106502883 111731085 117722294 123043407 129066030 135360550 140749020 146607925 151590275
16724 151590275 156359149 160690493 164455746 167440260 169678308 170848060 171167161 170685668
16716 170685668 169014647 166641536 163541685 159595154 154743144 150024759 144371223 139144043
16708 139144043 133145072 127495620 121651478 115684200 109814335 104519758 98868134 93772526
16700 93772526 88919695 84298043 79829544 75689826 71558688 67973367 64661709 60901337
16692 60901337 58386199 55329619 52568930 50093728 47528562 45475872 43008683 41524044
16684 41524044 39473488 37735944 36410408 34575304 33310859 31665509 30588725 28954178
16676 28954178 28242952 26890553 25978522 24674508 23907250 22980054 22282516 21677454 20656813
16667 20656813 19776043 19367038 18676213 17943928 17562962 16812378 16531162 15629560 15298878
16658 15298878 14649648 14301472 14367618 13584424 13373119 12896339 12158694 12233549 11768684 11140983
16648 11140983 11313178 10825891 10890800 10274927 9721270 9622193 9501028 9293426 8934634 8970272
16638 8970272 8634938 8570264 7794704 8248718 8014643 7861288 7499360 7381317 7018869 7095183
16628 7095183 6774434 6728969 6676772 6579025 6272879 6146238 5827216 5927206 5504192 5620503
16618 5620503 5886107 5473271 5303727 5420473 5202184 4940199 4764761 4865266 4498975
16609 4498975 4769682 4137318 4289328 3936741 4512988 4424630 4003823 4093106 3932236 4192942
16599 4192942 3981002 4109232 4223837 3564519 3520204 3872187 3593179 3721036 3528119 3160124
16589 3160124 3255365 3670094 3340529 3460737 3104050 3369521 2970736 2901469 2968862 2966562
16579 2966562 3083160 2899402 2562376 3016203 2605486 2797490 2442538 2619925 2709075 2653791
16569 2653791 2436655 2480389 2622132 2317085 2457024 2344774 2306027 1893591 2145903 2328228
16559 2328228 2282384 2321454 2232975 2178447 1929734 1812487 1883540 2053991 2285669 1785893
16549 1785893 1641554 2058668 1733850 1762383 1746723 1834194 1618112 1695626 2306347 1988997
16539 1988997 1657035 1502685 1603712 1701800 1927272 1495054 1739277 1590235 1360607 1419297
16529 1419297 1444152 1511243 1521993 1591187 1835007 1349996 1737476 1273422 1421953 1389268
16519 1389268 1294035 1498494 1510577 1400357 1233353 1397268 1297603 1398836 758741 1099307
16509 1099307 1293944 1315187 1129937 1141009 1126574 1114350 914101 946206 1155675 1085701
16499 1085701 1123678 979835 1317156 1335229 1179097 1207150 852484 1255105 704728 1014410
16489 1014410 952466 965758 807777 965067 1143212 944027 902214 1017665 925397 916498
16479 916498 885452 1070381 641279 847747 897251 1008565 1154629 743183 937183 912615
16469 912615 555666 745796 914880 604366 1042358 642214 761743 893114 654624 771997
16459 771997 909066 1041324 433894 608845 713254 996510 768535 1057850 798081 445847
16449 445847 566502 707197 600276 617873 444551 704673 964902 648430 905874 760885
16439 760885 647152 724057 609352 450840 771163 772616 727189 473085 681023 385040
16429 385040 604376 340261 560166 431461 622789 290581 344681 640968 452884 569461
16419 569461 542387 714807 740487 660027 568251 326902 615118 659884 406511 537629
16409 537629 679003 655432 321163 792854 397074 225063 458040 510598 279610 530383
16399 530383 265845 502048 461470 310856 633654 378984 307376 519065 206851 602328
16389 602328 443493 155705 239014 197672 643982 641754 207105 253991 572779 370418
16379 370418 430318 347983 429168 512341 550991 380883 600568 500390 308864 289355 924945
16368 924945 245512 197756 581928 50040 184898 293926 434609 105242 200381 364459
16358 364459 392201 393492 486548 363529 234646 714322 283323 34102 184554 292508
16348 292508 30106 448695 527005 429552 403903 340705 257681 430368 280681 269952 648459
16337 648459 154347 268639 443413 453915 203495 452439 218246 312800 143042 682886
16327 682886 302802 592050 532304 687891 185520 107559 518199 337232 310452 491050
16317 491050 2071 295052 592738 81783 404629 172982 197750 512131 495974 107148
16306 243001 360862 413336 369884 488843 204406 68433 398031 58795 49680 342934 35459
16294 -13727 277715 -157990 88407 234529 -31073 314080 -229618 297723 233151 317501
16284 317501 88564 -51693 293824 302696 -81342 158833 162227 42433 66664 220579 -12944
16272 -52372 184032 188556 49019 -11521 96828 -83881 153156 -109237 640172 190384 251694
16261 251694 87566 -132791 156743 -90642 432171 25668 392144 227561 123838 77298
16251 77298 251474 406995 306290 181597 450544 -150371 51130 -154730 -51297 27875
16240 378572 78536 288090 401522 74261 284401 234497 536953 278115 277353 52842 104810
16229 104810 -122541 -1595 158426 242709 -19423 -4617 334910 86190 283577 175318 453982
16218 453982 240293 88568 195149 -30844 31649 342359 384829 236353 -132288 201377
16207 186026 350046 54845 38596 -103827 1122 247501 -111405 169797 32328 251310
16197 251310 183442 120698 -132522 -115198 -107930 395297 77881 158247 322740 66041 150636
16186 150636 189284 144975 -11131 150898 24531 69100 -93194 -137460 156099 115778 -128971
16174 116475 163115 162807 -44287 357406 -119795 -44007 336417 -15191 152050 33698 48495
16163 48495 -116316 352187 -250278 124142 -190653 -26357 40329 70626 118680 127082 332639
16152 332639 198256 217452 2389 -197517 251871 360920 -237970 112773 -265848 160450
16141 261685 -67908 167466 26151 -192693 -290348 199706 25283 20991 32696 198913 21940
16129 -41514 286618 25696 -28421 -126367 373707 -29692 -135667 -130710 20379 61091 164227
16118 164227 -12765 -207181 -327156 22050 296737 -206026 466927 120499 43048 245399
16108 245399 85360 113087 95567 265014 467646 224678 -300372 -534920 -156365 -19924
16097 63927 173513 -64735 -383507 -32458 95749 64410 103251 255701 -146997 -99181 47716
16085 -68121 -152821 68771 21983 201723 -36776 458663 -36442 1895 -456921 -83066 234381
16073 78404 231835 -103440 87165 122075 -71164 51222 -262157 186028 -242985 -10244 133238
16061 119678 -18724 364633 106734 -126529 -331808 -193800 -119730 16064 14870 -228098
16050 23882 6096 177920 243067 -108658 -80764 -241155 -170084 -38747 7916 78012 -168285
16038 -141836 99061 -97468 -74507 256293 88474 197284 -44389 186753 98674 66863 310067
16027 310067 -172287 -286849 -79005 289591 -69411 129813 131336 29785 -130731 -110005 139853
16015 15091 -112376 -279873 -79767 257859 -86488 -165265 -70705 158334 -303403 -118605
16004 -88926 113143 162279 11437 -224098 -21505 143379 91233 51213 -44854 -49894 -38395
15993 -38395 -266394 140318 161744 -2093 363038 59911 221494 117956 -125260 -111011 406095
15981 214246 74919 315402 388489 -26561 52034 -34097 226023 -128236 -68310 -212234 71238
15969 -119054 57359 368396 108665 -241574 -198639 -75534 -284061 10839 323693 -73685
15958 -105794 -118086 83856 41231 159380 -152683 23635 16603 155312 -124848 -94895 -264321
15947 -264321 172708 80797 484727 -39325 -75918 137953 -168429 -44231 76840 69689 149854
15936 149854 -331230 -101964 90545 -56542 -177854 -85072 -21862 -29992 -149796 -90352 79989
15924 -307851 238942 -200090 23968 -72829 -17616 180423 -51174 87788 63669 84732 -37392
15912 35697 -290874 20528 -188833 166761 -255730 -203410 399625 116698 -165935 -172840
15902 -172840 -174461 296335 -107303 -133847 -3324 -75112 -87207 -117897 42726 -149580 84730
15890 -255574 137364 19192 120964 -344763 -236270 318532 -171726 207333 -128936 -226724
15880 -226724 -16891 -13054 107101 -131379 -9053 -84947 -58892 63383 161935 -27834 2289 271565
15868 271565 -9065 296977 -8497 156210 152114 22929 144219 49103 -188980 14900 -172752
15856 257436 -101499 21440 298394 140862 -154784 -92197 -93926 -158698 -86123 -152323 -97444
15845 -97444 152661 -3081 -253862 -23562 78180 -122898 150371 98786 -54595 10083 -306448
15833 46878 225236 -60375 -299136 303779 -63500 119896 -286122 -255912 17591 -184535
15822 245675 245446 -304862 81267 -213715 15620 196007 -134670 176835 241173 255920 314928
15811 314928 -20950 70789 -149242 -127305 50324 -333264 -114667 191569 -4385 -317401 -156363
15799 -12217 -148536 221120 -251758 -453989 77377 -247206 332824 135297 94634 -214639
15788 106930 -271023 -49320 -282674 182084 257432 43914 199136 241513 -95136 -105126 -105512
15777 -105512 -153594 -186141 89858 -353565 -178898 -141112 12233 -97113 -218260 4915 -41441
15765 -20940 -2855 -131791 -412947 -67662 281462 199567 -53761 -20655 25804 -189781 85840
15753 8001 255207 -76332 -267266 -29811 -99676 -323654 -48659 303930 -5972 24733 189354
15742 189354 293534 36555 350478 -184463 -182896 181868 -177544 -149340 20271 -240036
15731 248177 83360 7124 -105683 155937 115741 -517954 -43125 149955 34763 -312074 -129767
15719 -36367 129878 136213 -101348 97213 187428 -81527 22396 -336637 168630 12497 111799
15708 111799 232723 -131426 250743 -214921 -268162 99872 -309998 -125644 -381557 -38058
15697 -166750 -264871 99785 -953 -97794 -162444 185758 307886 105657 158482 438718 67890
15685 -352 27935 -118341 -107030 -14410 -77321 -116577 -49923 -221025 163948 64832 -160120
15673 -44683 -86573 -11411 -108437 -263903 -95394 -7550 -99533 -142045 108845 120920 -115665
15661 -506631 -224529 161150 -5666 -127734 -16726 -299748 93957 122765 50777 295262 -311062
15649 167256 214495 66886 45972 64402 121250 153409 1522 225053 47824 -96590 35997
15637 -9292 -151188 168837 -316210 126051 20322 256249 83568 -403816 -172611 -197962
15627 -197962 36823 -67440 -73377 230974 57416 -174408 -34951 -214756 116659 -111278 54982
15615 -168609 53392 39634 -118603 -28944 116257 -20554 -277489 -403914 154646 -241641
15604 177593 -114586 -64129 57381 -25065 39081 29431 52550 -122646 183566 -119644 -204978
15593 -204978 -233904 -280916 -58350 -282466 -88816 136682 -141414 5867 -116258 9564 -92392
15581 246471 -91608 -154866 -172629 -79546 -159312 -226620 -87571 42211 7231 -111560 -133080
15570 -133080 -150763 -42024 -110173 -208405 177368 -175238 28506 -42388 163272 447672 -136761
15558 -121099 -102929 230652 -252582 -160826 41791 93853 -359512 -182389 -269731 -35732 301275
15546 88244 16377 194162 85848 -119156 97276 -97668 177324 65226 -197239 415163 -201929
15534 -4382 289037 81112 52596 -82533 58379 208938 -172036 -129504 -127582 147423 -245800
15522 -55365 117880 -34009 -81732 657 -238163 -39275 -38918 66204 -72702 156918 -173303 5133
15509 19925 202726 215070 -153086 357486 -251789 -85872 -50020 68494 39075 -306991 51234
15497 4024 -136043 69369 -126811 90252 -257611 -325939 -259345 41073 -180787 -136523 -422418
15486 -422418 -408303 32290 120513 137129 -154022 66619 45003 17983 76257 -117606 105197
15474 -67107 -120798 -181253 -227879 -32112 54743 43840 312321 6171 -36040 205966 166069
15463 166069 -214789 -35112 135226 247948 -116209 -37034 -4530 96673 193307 233784 -279864
15451 -2657 219373 114290 -276041 -150462 51337 -297858 20639 -171984 -6042 -138728 -18151
15439 -86181 410172 77469 -94492 63624 -110947 -63826 -208942 126125 40791 112641 358423
15428 358423 200377 -35803 87214 -52039 -36470 29690 124070 -193302 -146332 -34655 -105477
15417 -105477 172795 -252912 -291031 102507 141040 -59450 119165 6609 64115 -79537 161347
15405 -217713 -90387 -76348 -197442 77779 -87628 -163882 -181953 234209 46612 21408 7001
15393 29994 71301 183383 -379493 -302405 374783 -200883 -125186 -185040 -306705 38826 -246954
15381 -300641 -51528 164363 65996 -134046 148309 -293776 -205760 -48961 -72835 -158902 -180929
15370 -180929 -216789 -75745 -57283 138506 222621 85643 -97817 -128176 5964 -91939 375339
15358 237943 193164 -114493 -14196 -24331 -339811 54785 -221377 127275 109313 150512 291733
15347 291733 151294 -297852 -138574 -170144 -75012 73164 263393 144402 -2883 -72388 47908
15335 152349 41901 8170 -169230 7796 55799 -196360 10393 -238649 9372 -76255 153103
15323 -17564 -78782 109351 -10434 424076 -170266 162259 403304 124879 52811 13007
15312 -154746 -110166 129568 -98572 20672 -18107 190654 212694 -359180 -31801 -200530 106038
15300 201984 50284 117131 -66530 45113 -165962 -214873 -26526 315991 102667 47642 247176
15289 247176 47781 224441 -287243 282221 26571 125412 9359 91267 126190 -78199 98377
15277 17 -225441 -39164 81718 -21032 624086 -24981 243518 -26628 113478 92299 175958
15266 175958 52910 -27417 63135 67542 -88435 -101384 -175547 -42937 -547808 81319 170856
15255 170856 -161212 9919 169981 87740 277598 463663 1085543 1601077 1013963 1013170 953814
15244 953814 253233 122276 -156864 281522 -53917 14995 204423 211084 -54694 34034 -8483
15232 109344 133820 152616 -86303 -447883 -5458 286165 258236 204328 38695 -141567 210487
15220 47515 18020 -42725 -128847 -187305 -164694 -188229 260933 151439 -89926 94574 292812
15209 292812 -61302 237787 271245 91259 -140987 123159 -14365 411095 -233474 -153965
15199 -153965 -98094 59317 -50294 -8477 377622 -51670 138705 238508 141078 -164996 170371
15187 114819 -122541 106511 283350 40452 20294 101120 -10475 144946 -168952 311489
15176 -133857 -61854 -114670 308521 223742 203325 100484 -233279 149128 351724 -46493
15165 -142810 314548 10338 292113 -340771 79768 60306 345134 179092 215169 158500
15155 158500 34272 174278 -161786 170468 205636 155903 -116640 84413 81639 -120413 -143535
15144 -143535 -225632 167163 211413 41446 51467 -70181 90182 477316 235482 110874 -26120
15132 26274 266990 366111 -29610 272501 240883 77916 202142 -32328 189334 -135411 321194
15120 74171 223426 236186 29495 -69299 240037 -79799 -57308 319674 501184 -47366 -45950
15109 -45950 -210187 316253 99606 77128 -260042 160364 289071 53775 -21824 126254
15098 -175836 96586 -6728 -152371 226519 17049 -27209 85096 -127882 48843 440605 353512
15087 353512 53199 322088 493252 -29446 97614 162948 -69946 -70899 98776 107402 252082
15076 252082 -114893 29446 77568 -131346 353492 -115298 233702 189786 94136 -43065
15065 198890 281943 167996 281001 -13294 236119 218564 -144016 150163 73404 636524
15055 636524 236605 208920 171920 392244 161765 -152771 439027 305833 216081 135803
15045 135803 96487 95928 193422 287992 -179593 408363 -78731 560453 258364 173742 -170974
15033 196441 -238907 137308 65614 -45818 146800 45214 82411 536274 182089 -91827
15022 361265 -107398 -155268 73641 -62413 47138 171999 214304 105297 195391 391917 339142
15011 339142 221334 208340 284451 125489 150240 42855 109905 417147 300233 -60275 197863
14999 251571 130401 -150017 211954 232876 55523 40396 122915 215953 85276 63289 200028
14988 200028 36061 254894 209561 47647 378409 -91001 -2155 218018 320534 -781 261264
14976 384358 194289 180842 352904 -8284 264559 370119 146869 85555 418477 338758
14966 338758 475772 -42752 436479 230481 126407 499863 479451 397648 -22505 59475
14955 29535 118895 119140 301590 285093 155172 242970 180074 396263 202062 111116 191972
14944 191972 262352 275401 496949 671454 212947 199138 123792 240373 185344 315097
14934 315097 -242832 303517 -40968 -84691 -39381 309176 -10961 398353 434833 203749
14923 144891 336767 202252 233497 430870 375151 381437 32446 77253 8118 14126 211860
14912 211860 266499 244423 156177 126303 282846 34869 287418 252338 -82642 428208 511591
14901 511591 314016 230665 136216 472514 390650 167007 183319 96462 866668 303007
14890 454434 -233389 261630 216459 549886 534409 199410 127406 85969 203863 374125
14880 374125 89967 7656 206599 235045 445307 213735 402553 213884 266400 401265
14870 401265 358952 322600 386155 401827 315558 320983 151436 429525 436867 254579 528406
14859 528406 145257 48728 238952 323477 398213 585642 244698 293510 521318 145377
14848 191708 427794 200804 288140 827708 378882 214616 347648 222940 818614 598189
14838 598189 457788 132007 73681 327574 741880 495307 290876 635498 476505 375954
14828 375954 410924 558769 452775 470003 349764 513694 531171 65923 395154 409568
14818 409568 120177 470481 294979 525063 555036 348528 627225 315157 462203 556685
14808 556685 -17226 314977 393705 395278 834991 773601 623817 653058 386689 726265 546990
14797 546990 519763 535587 636143 222732 294276 318591 131748 490960 813126 808176 237947
14785 317700 280878 424575 594031 448509 760760 696209 553412 451673 672906 253162
14774 775673 321418 634606 594318 700606 720405 644830 544337 509762 543249 521242 676706
14763 676706 588890 688205 541761 452542 742168 224748 664608 490986 594807 441463
14753 441463 581985 262435 534322 699144 675202 312622 505704 370844 208713 793580
14743 793580 870364 618176 408520 464815 546815 534290 757767 506264 546814 373524
14733 373524 722868 618288 156528 360184 685919 528205 627201 633096 882784 696002
14723 696002 345184 546947 720852 542649 664869 546409 583129 958086 661263 824262
14713 824262 886367 407307 475425 566737 732163 836803 625635 579274 701596 784613
14703 784613 794725 810360 556836 659449 857298 577612 629639 774440 1183998 485925
14692 677545 475791 770644 649797 1045202 980571 811080 932430 934591 842012 962548
14682 962548 838861 864935 848251 924935 920052 1116492 1017237 766256 605294 801110 879370
14671 879370 845982 1264463 525136 525127 840251 682215 1021471 765812 893108 1319610 1142908
14660 1142908 1164996 1092126 944213 851464 953048 1331989 1114277 1121017 1088496 777147
14650 777147 1167184 790915 1218755 927037 1047116 977371 1497900 1389101 1088992 990057
14640 990057 754373 1040579 1073809 1161355 1297316 1116411 1090368 1264299 1018345 1178921
14630 1178921 1053825 1054801 1280542 1250511 1400378 1072092 1404278 1285139 974125 880873
14620 880873 1197346 1141008 1445855 1332912 1359875 1047774 1296318 871593 1351965 1220065
14610 1220065 1459749 1311447 1195100 1466005 1788786 1385299 1627238 1209670 1861568
14601 1861568 1228025 1315421 1489007 1433755 1551458 1589150 1360404 1742090 1788988 1208715
14591 1208715 1646316 1376819 1733294 1329836 1835773 1513705 1599610 1848253 1577213 1918256
14581 1918256 1809240 1641377 1699524 1623431 1973915 1687548 2019519 1824671 1815550 2151284
14571 2151284 2219317 1719546 1850022 2026580 1948546 2144341 2009074 2043299 2436329 2400422
14561 2400422 2416883 2485377 2537808 2754824 2498410 2573121 3470890 3285903 3646795 3858882
14551 3858882 4364665 5460329 7291685 11618622 19685334 35728389 44158423 23054876
14543 23054876 9841407 5192121 2859372 2351466 2130986 1797124 2318455 1882016 1895946
14534 1895946 1776606 2024782 1700293 1756228 2037986 1625816 1935954 2099675 2109642 2102607
14524 2102607 1978804 1804542 1975459 2229344 2222506 2344479 2158026 2340690 2589526 2194438
14514 2194438 2597498 2315385 2733193 2340913 2663328 2602131 2652229 2393913 2518688 2737337
14504 2737337 2917100 2931435 2828197 2591293 2993598 2544359 2795905 3154231 2711562 3049143
14494 3049143 3085515 2950622 2966067 2987666 3302845 3231068 3089790 3468983 3614666 3247983
14484 3247983 3253511 3360763 3563340 3261297 3336533 3416599 3328862 3804702 3637954 3506094
14474 3506094 4042880 3917191 4011151 3917729 3818529 3654494 3561266 4309886 4006071 4292967
14464 4292967 4076114 4069533 4135079 3923368 4280977 4575020 4375749 4293061 4593850 4158213
14454 4158213 4628601 4849194 4716144 4870155 4725502 4841345 4932558 4697772 5328560 5274472
14444 5274472 5384690 5125497 5533263 5585258 5387891 5389146 5731238 5673866 5576287 5769060
14434 5769060 5774797 5965087 6207703 6258733 6042713 6560430 6100408 6255162 6418037 6488559
14424 6488559 6712117 7131547 7154757 6818584 7044186 6999566 7432827 7656494 7755080 7892798
14414 7892798 8053735 7450950 8129218 8517625 8436895 8453498 8885300 8553626 8980968 8982786
14404 8982786 9098372 9839147 9104761 9646528 9964035 9853155 10004156 9988594 10503371 10247198
14394 10247198 10752463 10900922 11167771 10660854 11663245 11835895 11781340 12131327 12055185
14385 12055185 12015044 12534097 13211532 12926069 13755391 13387912 13980490 14012309 14177883 14817688
14375 14817688 14721343 15030513 15404259 15772804 15994209 16357787 16443577 17037871 17377066 18041001
14365 18041001 18167210 18355536 19007705 19330603 19697402 19809854 20382859 21128395 21605509
14356 21605509 21963523 22378890 23130408 23584259 24244806 24535909 25253979 25915722 26880175
14347 26880175 26894553 27893295 28451849 29556389 30086388 31002481 31772557 32586496 33615908
14338 33615908 34874380 35489118 36663613 37750200 38937152 39474124 41300119 42526468
14330 42526468 43641343 45017982 46585078 48544649 49848110 51640883 53004314 55008400
14322 55008400 56994199 59049239 60949443 63365686 65653843 68365394 70963666 73702075
14314 73702075 76469687 79778111 82703033 86443884 90209933 93800042 98350552 102491799
14306 102491799 107256892 111943239 117391056 123051668 128769953 134915710 141822818 148886991
14298 148886991 156652378 164741212 173692876 182673632 192587861 202743006 213678956 225656715
14290 225656715 237701306 250465720 264506223 278989688 294119086 309615312 326238643
14283 326238643 342539995 359677470 376747245 393711525 410107656 425860566 440150441
14276 440150441 453422317 464809349 473344840 477204042 477932139 476913562 475169822 474014848
14268 474014848 470290678 463887196 456777578 446539480 433624470 419194512 403323819
14261 403323819 386548430 369277339 351977452 334938710 318092766 302153871 286758364
14254 286758364 271968342 257752224 243704174 230957091 218654022 207530993 196338300
14247 196338300 186197113 176641359 168028899 159723794 152243460 144673217 137595515 131170612
14239 131170612 124790750 119707863 114300912 109356733 103813691 99729111 95725876 91883135
14231 91883135 88012129 84795780 81297148 78133671 74731437 71869218 69165877 66973178
14223 66973178 64346211 61860359 59928292 57978927 55707695 54177808 52293790 50506222
14215 50506222 48786655 47600507 46342151 44649846 43300381 41491780 40664872 39645955
14207 39645955 39038461 38077827 36762555 35456422 34489266 33573190 33084561 32292656 31236603
14198 31236603 30162922 29094365 28791258 28055686 27497833 26608590 25713001 25425503 24622547
14189 24622547 24204957 23434614 22951102 22450888 22096801 21191829 21119694 20426536 19854938
14180 19854938 19688578 19207542 19140413 18608836 18045621 17802782 17251526 17052449 16663150
14171 16663150 16226201 16126550 15325272 15395646 15135099 14853504 14709883 14641584 13970027 13961843
14161 13961843 13698724 13137050 13116160 13104059 12438947 12692101 12342128 11876290 11909937 11729625
14151 11729625 11341119 11432724 10853994 10864539 10701452 10629287 10243741 10132258 9536182 9561400
14141 9561400 9727659 9912579 9650886 9684506 9087936 9193280 8962524 8798061 8783568 8674661
14131 8674661 8159175 8151869 8027015 7940648 7983971 8028326 7882757 7495023 7598698 7540998
14121 7540998 7234221 7175148 7317443 6962748 6801254 7047412 7020080 6569348 6751964 6704635
14111 6704635 6864301 6312174 6589341 6260427 5899210 6140541 6138968 5779768 5750966 5721489
14101 5721489 5833349 5514830 5604245 5873565 5451652 5424926 5281969 5399459 4995328 5468350
14091 5468350 5073394 4917112 5119617 5243263 4867036 4723663 5189103 4855105 4390392
14082 4390392 4492042 4614040 4512886 4387647 4571805 4555579 4456909 4263125 4237872 3958463
14072 3958463 4192033 4220707 3775859 4166733 4167591 3988936 3870508 3991954 3748141 3651406
14062 3651406 3956116 3662314 3606416 3388573 3924631 3500698 3748828 3616825 3761392 3125814
14052 3125814 3334043 3652029 3319139 3196942 3315224 3334901 3126036 3148835 3062682 3134423
14042 3134423 3267153 3152349 3193004 3052582 3019177 2972821 2648401 2913674 2659631 2984499
14032 2984499 2917920 2857839 2691465 2773941 2937319 2464299 2725217 2692010 2430546 2549859
14022 2549859 2513867 2608606 2393152 2470800 2377559 2233197 2518685 2341079 2638699 2567502
14012 2567502 2279527 2573878 2580050 2036200 1739474 2257850 2387340 2103249 2351810 2036531
14002 2036531 2228774 2180177 1989015 2239482 2282676 1836175 2032597 1592926 1917741 1995268
13992 1995268 2154153 2108697 2593445 4072699 6540644 12626787 27641113 42975278
13984 42975278 28316115 14341966 8687938 5694597 5031350 4235555 3172688 3451116
13976 3451116 3137078 2963625 2369697 2227041 2237339 2331244 2270289 2244342 2261624 2223459
13966 2223459 1751669 2007421 2117175 2201783 1901220 1821637 1826023 1911630 2126438 1819410
13956 1819410 1716628 2127299 2062656 1570724 1525966 2066025 1769152 1848475 1800220 1850086
13946 1850086 1802755 1688031 1820074 1720544 1678527 1325707 1658488 1636628 1534983 1577634
13936 1577634 1901147 1711525 1601814 1901751 1568635 1601338 1766635 1574703 1579516 1462415
13926 1462415 1540537 1257804 1568733 1564056 1683678 1725442 1285798 1447653 1255677 1626941
13916 1626941 1543106 1310282 1409282 1358988 1348482 1248205 1350496 1184840 1515100 1461040
13906 1461040 1265688 1111336 1353183 1233194 1218729 1259959 1720729 1146106 1252758 1188531
13896 1188531 1279637 1050972 1297845 1170151 1173335 1358511 1316035 1409666 1228234 1052495
13886 1052495 1109570 1181406 1100314 1140445 1054587 926577 1012929 1026101 1246480 1129755 1108170
13875 1108170 753025 1164916 1039331 1054269 1065361 992027 1195504 994460 1277672 1146607
13865 1146607 940296 1315461 938359 1134979 1155517 1474577 734593 1048899 732259 953204
13855 953204 888763 1121149 837561 768678 1067748 849298 778060 1286616 795123 972094
13845 972094 756767 816901 1088416 890108 801415 835707 897836 1200032 1288835 667362
13835 667362 912373 636384 368042 644695 725542 1117201 960388 990872 781273 742486
13825 742486 695361 930588 988415 704776 727327 756229 817660 625520 1394698 663958
13814 806730 940526 700022 607413 917660 1010570 747798 704303 817152 772973 547818
13804 547818 731879 764069 697319 652272 800712 668633 650321 1003461 617844 852271
13794 852271 604463 777631 720679 486210 633195 1067327 999093 745910 877865 479267
13784 479267 297167 636988 599745 652809 600848 418265 715771 605378 439233 637131
13774 637131 715261 876095 686255 539553 633469 887401 356180 1036018 600615 630594
13764 630594 583413 777402 751770 794558 682531 921459 580974 544631 697913 495622
13754 495622 651924 691919 407101 871433 562599 633395 665206 1048578 569645 415444
13744 415444 379078 683891 714725 691488 570143 324777 461779 689968 521755 747231
13734 747231 812366 730136 569049 456303 359296 550772 610054 567658 559598 544530 530565
13723 530565 421563 447905 407786 580413 308919 551947 550545 460945 700685 412283
13713 412283 848422 403811 465473 407574 619039 888443 542824 418325 731737 227374
13702 549809 1000044 271173 570938 161062 511151 599489 406577 481526 538308 630779
13692 630779 157758 350820 465302 446824 663092 456482 288569 630155 329476 577903
13682 577903 604127 760804 435590 167764 231952 526487 388869 460366 800051 572014
13672 572014 415693 273132 580356 458001 522508 335852 730383 313791 527957 182227
13661 486569 703794 291721 603586 -34813 553288 539343 154309 393473 557375 477888
13651 477888 445437 583357 240780 94230 453248 229255 277421 78144 554328 330673
13641 330673 30632 551910 297737 357352 317980 306655 528213 562059 726079 634501 574472
13630 574472 232808 422864 886151 478856 299810 132564 562527 403163 180066 371242
13620 371242 459278 604154 388493 407100 565889 611275 210103 217426 419599 556624
13610 556624 562872 412554 410899 497418 406888 219419 272763 195657 367049 225352 325469
13599 325469 305413 258086 101930 458289 152727 297323 85961 461474 655839 331328
13589 331328 337964 370249 470660 181916 162942 270882 435366 345063 362177 28620 324837
13578 324837 390081 -249043 374139 515672 175194 -100675 230731 34387 286791 313275
13568 313275 136374 129724 403196 191679 497151 304424 204322 209255 199471 394035 123239
13556 433210 167545 135587 391509 556432 301179 224472 403518 250730 341010 298552
13546 298552 463936 105528 120842 561055 271807 316036 217013 66154 140841 235782 43921
13534 195828 300617 -80707 384059 401872 108137 283103 201518 578181 266860 260286
13524 260286 230862 292019 399097 114678 -2034 764682 122570 496216 -63720 467514
13513 76253 280831 171916 444957 161841 130342 403240 347072 98404 286276 394717
13503 394717 185661 191688 363827 32547 90136 160254 61512 472451 171919 381219 353387
13492 353387 437958 311146 -74815 49204 379141 -22680 104630 156447 299956 195037
13482 195037 351492 288332 14272 401317 254443 328977 253259 513912 369991 241211
13472 241211 317536 -132331 212714 554473 348037 307849 72340 240331 333897 324098 175322
13461 175322 439062 425008 113163 240034 77960 176535 430292 170313 81184 369840
13451 369840 345682 480442 -17541 281557 188181 211496 330843 -112152 -47085 711883
13440 239012 522708 -77082 367642 413892 208254 212698 34999 -65627 225396 75403 -87035
13428 357006 53461 116970 -64561 32453 395567 34236 138949 71092 220279 141857 226031
13417 226031 450175 67251 315699 -125529 -53017 197882 145376 383245 -134218 266929
13406 557108 385918 194693 103039 -56642 322785 123472 224363 134884 222683 318886
13396 318886 -36975 183101 169370 235045 292152 -65791 376912 226553 -211451 90657 194954
13385 194954 196139 -92519 266451 308487 374788 315285 38856 188776 68060 -209926 32644
13373 -132263 379315 99322 287503 322880 287140 329265 89930 48477 288648 689382 333172
13361 139817 70088 269708 223065 333763 243463 469268 148081 552984 255060 653356
13351 653356 440665 106852 -118688 520451 228054 67996 430648 72287 194036 225616
13341 225616 378720 102148 252908 195270 553176 93324 97920 316257 403424 324434 142262
13329 97232 60007 106227 531965 174356 227489 -56422 -95090 443724 347641 295201 368369
13318 368369 -75594 511483 145904 36573 -131887 171091 131918 94477 249266 184946
13308 184946 120283 173384 243218 213814 88852 98304 -321713 -84740 -19828 12856 119240
13297 119240 95891 -199888 -46230 -66446 -101320 58172 33154 437680 170063 338892 91940
13285 338842 302933 124814 -23866 52372 117366 72266 130663 303975 72052 11954 200694
13274 200694 52575 -87231 -152521 128989 132291 -103138 424035 91365 137167 270972 -78905
13262 99734 208029 419628 128284 365798 470734 205903 -101727 -132087 -132687 177816
13251 -32871 -107344 52622 365467 336521 137804 -331683 -64386 202053 -158536 104480
13240 130388 345158 330457 240886 204894 -77412 21388 -200910 195539 335966 323777 -114648
13228 246166 111095 172091 -205788 330908 30781 -89300 34033 -109900 90424 201410
13218 201410 -123248 81272 -38374 453678 85889 156630 -189377 104938 313304 197314
13208 197314 166121 -54081 -125893 -184885 -401973 -214705 -160528 66748 154127 -95606 241056
13196 31297 167819 188266 -307958 266442 -102801 -27730 170565 123609 76295 34162 54508
13185 54508 222409 13134 369769 -265332 -20545 252083 143131 -38273 56676 304394
13175 304394 133842 261347 511912 -33466 -103450 37757 -61665 251291 58526 314043
13165 314043 322137 334141 199327 -80758 -140071 197649 439322 126685 429230 196327
13154 14068 59401 46917 97394 -162365 -166608 -72572 38316 -100438 11188 -363635 402853
13142 278305 72825 -91964 371050 -140463 34817 217354 -54722 -18179 71841 -153256 22039
13130 179755 264336 75190 315986 -55503 -320263 73483 269274 50552 -113519 216356
13119 681317 73052 158994 -3350 234854 31564 40202 215351 52472 -244942 -116761 -129328
13108 -129328 75292 -101424 7975 -73833 186190 142444 -54949 61648 283471 37154 9983
13096 -291965 341399 202136 -276522 18464 332462 256940 144183 -187729 -119309 -253378
13086 -253378 -148612 -186650 209487 350023 97293 29046 121612 13186 24348 -100700 111486
13074 29742 481998 42640 9581 164679 85667 -49829 75902 126532 117692 222056 67404
13062 -119826 173846 127686 -212114 -45430 29989 16461 74766 273117 161742 277272
13052 277272 56711 303546 145738 494725 -207417 152617 68720 122320 139145 265833
13042 265833 141117 -310143 26930 -64384 -274927 -35591 17282 69450 175335 287465
13032 287465 318826 85091 -92627 662649 99434 334230 263098 -120015 -173011 -7575 114144
13020 149817 182152 172065 -196708 -32940 316441 104052 -202777 109653 140467 48279
13009 235481 302458 68035 -302500 -345268 -54798 183753 199872 33124 181403 -94874 74366
12997 415750 38502 -139993 181319 4701 265269 -98852 124298 203385 174707 3196 21512
12986 21512 -78945 -10645 -88730 -359753 -84182 110557 -59937 141550 85654 121998 -227103
12974 95593 226527 157550 264805 317504 -399839 304838 -20385 -85543 196962 92666 -35940
12962 -72740 198884 -59370 -74674 73620 -117259 -292138 -207253 -102886 221426 40514 -6061
12950 428367 -262597 -40241 239183 -144757 -196734 -21409 -34262 -50802 -357807 228554
12939 268835 199869 48435 254534 52750 110024 181931 -56456 -128041 6708 -49997 -90497
12928 -90497 98029 -23629 190201 -10465 -88422 132236 11714 378033 155895 -7876 -201824
12917 -201824 222733 268129 323712 -36730 -335751 -4920 -49782 -107991 -79437 -252582 -60560
12905 -49399 -322381 125130 69986 -4896 341777 -132289 -69446 -94903 -102635 206284 341785
12894 341785 269486 -119727 182855 148977 -59053 173197 416093 102180 138037 125132
12884 125132 81572 -32704 31499 203592 103567 -39846 171389 -108762 226489 113236
12873 2979 -8475 508207 -91300 -181593 -17198 -261702 285268 181880 162262 -283441 351224
12861 131850 206838 -38251 186920 49980 48562 89445 -455942 -157154 -246434 24651 -173172
12849 43568 250768 -134230 159093 -91828 37944 388102 407063 -27973 195126 352749
12839 352749 151866 -117655 105615 196414 -323364 -110761 -9100 167240 -131163 181690
12828 36056 140080 -67894 -158658 -307465 -66539 115556 -40568 134410 277021 -429522
12817 124373 16076 -257813 -223764 -164810 54887 -279147 -74432 -16269 -18479 206202 -309570
12805 13827 204600 -94722 -87475 -235119 194727 -335564 181327 17405 24458 23710 57862
12794 57862 -90107 152486 248502 -238807 -62566 -24295 -109565 174973 94924 -207485 57487
12782 321666 131630 365393 -44856 -46685 210672 285573 299418 -222805 -15767 136197 -113443
12770 110163 190741 -76903 374040 204268 383666 14514 282958 124569 -50672 -121297
12760 -121297 -186169 98911 35129 -58457 -41551 153184 -257052 104810 343320 162580
12749 214246 -133929 91931 -7234 -108115 584534 231841 -185299 139374 200785 -25767
12738 153554 -90622 -128127 35319 25839 401919 26946 -278876 262290 -183803 220309 -107255
12726 -225962 -150883 134566 17722 467063 188101 -32224 -248430 60816 329103 -161366
12715 -528818 132902 20807 114003 -34709 471279 72291 -85656 83508 39941 358844 180943
12704 180943 239421 162041 34995 -89210 75248 290665 -137069 63696 28968 273683 428330
12693 428330 -164197 -112341 -177051 -16439 -559585 -219800 11590 -157389 255608 244395
12683 244395 45457 169340 223145 -8588 99102 -320456 150852 311582 -174807 444923
12672 147925 112053 277774 -29822 -27656 -23962 -375086 248944 437099 558356 318134 84185
12660 -51780 222560 508670 -28934 252840 195437 140100 72076 277288 142384 82949 289579
12649 289579 341503 -95188 86591 49492 -193693 -291169 183361 125340 -13829 -102706 136957
12637 75333 -8451 432752 190098 21957 169376 32180 432997 25244 128092 45448 264668
12626 264668 210692 -54094 133785 266698 65936 53691 -166086 99377 55882 234608 -111015
12614 105930 -8853 -62081 64541 -23546 -33506 -304903 -78444 187170 -91627 -12061 25315
12602 126690 39784 -105966 13648 246129 55419 382607 14348 186025 196553 176101 -135988
12590 -141848 -68866 29332 286676 3492 -164237 -63358 -67641 108426 6025 -290093 192112
12578 -69547 445811 -193522 199985 -34371 -28903 2145 56685 -91544 36475 467164 -48561
12566 341940 322177 337106 -79751 -218387 -265199 -122357 294234 193572 -206272 -90523
12555 284757 156392 200581 323419 -52407 -162720 -115480 44419 150880 112598 -225370
12544 -196682 43459 113604 34815 -36383 118271 128207 43035 -118762 64659 -37531 136240
12532 138273 6904 91377 50397 216941 12482 46937 4043 -79729 -13169 -104294 190985
12520 186498 -10997 33148 -154751 24561 -373911 394455 92252 210565 -79088 -220631
12510 -220631 49811 298408 114152 352941 -196831 311737 -90803 9272 339541 -92330
12499 -103359 95801 -150794 235688 -71084 -30267 44516 -29098 22079 -148852 71791 221031
12488 221031 12164 255572 148349 354870 -119773 -7628 -256110 -79811 7138 -98287 448594
12476 28836 16585 -89876 -114298 29549 -105924 98762 -26306 306991 -222405 -32325 247495
12464 93960 -121066 63018 -369959 62008 -36423 -62024 32836 17897 180524 157077 -465094
12452 -231921 39368 59249 85798 372921 -306998 -114076 155492 88804 -230758 201393
12441 -106732 8116 -202435 -143962 -269542 -107877 117788 -289021 249605 125631 -114667
12430 92293 35427 113470 5168 -121442 -39075 -122562 209458 92823 -294189 -160311 -96987
12419 -96987 49706 109046 990 -223853 -60781 143796 -204414 -218734 -72608 -138539 -71553
12408 -71553 148273 -5972 70990 -497736 -48263 -234838 -198078 223047 139881 134590 -96170
12396 -75790 90416 -3208 -157737 -320057 306755 86310 -88732 199185 -292353 62628 -79690
12384 65751 40936 -86479 -31661 102034 -190953 78013 -157466 129634 124119 -25421 51100
12372 -67270 83311 6241 -141832 -295485 18357 -112736 208310 105421 192315 40272 -277159
12360 -356327 121618 -48536 299757 -227764 -290012 -377594 97643 142474 -138723 -141535 -138098
12349 -138098 -171058 96687 79861 -6997 160655 179499 215409 -17559 114182 69768 -215096
12337 -215692 19226 -59814 58114 236306 297576 -215203 -94942 1211 -81956 -27061 -279646
12326 -279646 248214 -470549 -53582 293925 241688 107268 3142 243908 43407 -192651
12315 82511 276399 -26957 -10402 318729 244012 130054 117667 67259 64152 -91414 -119601
12304 -119601 -76769 -25733 -90684 149456 144817 187374 -206393 -126823 134600 -17783 80357
12292 148985 222178 -161789 167995 -426734 -93380 90680 -168459 19348 83640 394957
12282 394957 85619 439554 71973 299099 -137390 187088 -59675 -25394 6722 212838 69810
12270 -36659 -110717 298380 422568 -125429 149211 -95751 126678 -295725 69434 49454
12260 49454 54648 -122875 64159 46393 -88618 90330 2742 555992 215790 92275 262815
12249 262815 184630 120744 -81696 -107349 69929 17821 -246374 330157 33816 52520 -70663
12237 33759 243380 203798 -45637 61487 156531 210481 210127 236175 432038 229989 -24899
12225 -87588 373189 -82708 230748 172935 -24581 289129 454273 230587 393200 338340
12215 338340 191314 110098 -163644 231498 245271 197982 212755 449322 -148560 24281
12204 -104589 198348 352954 328212 469148 280573 387517 30999 341584 233469 256850
12194 256850 107339 295454 138579 61686 19046 -13481 592490 206575 -171362 158946
12183 144620 79144 -16733 18694 93092 38721 -202277 -190644 197010 233101 235990 231387
12172 231387 -53035 104829 4211 58082 -201999 -448222 169216 285051 61854 244010
12162 244010 41038 273955 -80111 -244064 168434 -83724 238334 176249 -104535 71890
12151 213953 53367 112096 56121 249903 133645 35948 -314917 68089 178641 39898 163599
12140 163599 143131 133012 -128396 216780 -168203 -153626 172968 -16625 301181 -157378
12129 14924 66294 38044 107148 -37578 -213810 21419 -15321 6949 -257722 63119 -94952
12117 -53169 -9783 -67932 359431 -221 -257836 -78670 -2784 -159702 -299459 -129136 133215
12105 -71924 -40935 -5491 89494 -44424 -22352 -386413 37677 -318843 163894 -163301 169291
12093 75059 -7229 535673 208732 148191 165416 125780 -32791 -14560 181970 190611 41350
12081 16774 41371 -101752 238344 15883 424172 942256 1652849 370569 603197 -201274
12070 -261258 -9263 195958 -269637 223599 216091 -41760 125750 48667 402800 18595 -192323
12058 79030 -47194 34766 -55878 -34922 203530 -3616 75906 -154346 240033 -169885 -109309
12047 -109309 -437894 127922 107638 46771 -125457 -278088 -18072 -167715 -175174 88643 135884
12036 135884 85648 -124296 115370 226437 25903 -209641 123067 331 54948 234934 -92770
12024 121480 123777 -66600 -66453 341864 -89210 -162004 -253239 -174857 -132447 109539 -289678
12012 -3260 158532 -63276 -317886 224169 114752 -374505 55064 -56518 293637 -21524 -41533
12001 -41533 -70745 190649 -281440 210461 115975 15469 -238982 111311 -207367 -89091
11990 31196 -58884 389589 73153 -139251 -205149 207602 -142469 -220107 24935 205931 124783
11979 124783 -185898 -111408 26972 92755 159673 -174158 47423 -132952 -123097 -208254 -209584
11968 -209584 75666 221019 35591 114971 -388092 -105475 -20810 -149247 3042 -66279 -362442
11957 -362442 -111715 -160164 165113 171485 -18598 184460 -214599 454653 138873 61781
11946 -314217 48312 155027 247849 -176716 127591 44686 -173605 150393 55568 -103393
11935 132842 144877 145067 27725 182106 264963 49679 -126280 16951 90072 -40826 273419
11923 -185301 109976 -229640 346184 317353 293256 -40902 -104105 -15405 -27274 -6363 -125066
11912 -125066 102767 -153125 176266 -208285 -111235 -65728 89147 -231492 206909 -97486
11901 279185 -584 -285860 -28344 115050 8327 133332 -70331 -219687 204519 344772 231712
11890 231712 -98056 -181806 -168570 114913 408133 -154077 71679 12967 -139900 -72683 -38796
11879 -38796 28054 -8520 -305618 -233086 30003 -167101 -193758 -24703 100317 218929 -175793
11867 83932 -108217 66339 1796 -380540 209009 36093 181687 -376917 -34187 77901 160118
11856 160118 -283919 67538 -337985 6244 -163866 125630 -221994 238887 -64273 -32710
11846 -32710 155718 80256 -11674 339212 147493 144292 -159262 -349523 -1367 -193913 64232
11834 -24514 239672 -73551 -46567 -67649 -369983 -38652 -17051 -284324 -366365 58077 44015
11823 44015 83349 334326 -262072 -38466 178505 83799 -146021 -221901 -277330 -2068 162170
11811 -27966 -132304 28758 195023 60417 -281401 73122 280601 -17965 264460 -159683
11800 86679 85150 -32526 59846 -79508 174153 -284148 470641 -146280 129668 -29151 33920
11788 192637 -73661 68625 -11600 -366608 84445 -13307 13980 363628 30022 -312299 -59194
11776 -232004 -82433 55146 170694 301942 -17114 21218 70246 229281 -116790 -22032 67627
11764 118070 -117366 97702 -161241 -286615 -322608 269381 44171 199884 163676 -115731
11753 -150211 73360 94642 77177 -134292 98046 -302945 -235359 -259244 98328 -113586 -164255
11742 -164255 64524 -70377 -98345 -160949 160546 154135 213661 188968 -72563 -265706 68532
11730 -42326 -258573 -81694 -174024 -95495 -85734 91359 -119497 234212 36688 11767 114195
11719 114195 329688 -200029 -192581 -257935 -114821 223321 293489 -137542 -54845 -252555
11709 -252555 232933 -71990 -288144 -386891 -73171 98639 139610 165516 101723 242667 287919
11698 287919 -28547 132118 24846 97290 -165433 -25525 -105146 -181412 -28225 371850 -81619
11686 202881 -206252 -79227 86689 182659 367201 305262 -2676 -8090 23389 -75413 122436
11674 138083 -45998 155444 106082 276956 -316792 -63255 37853 -3488 -11609 302942 76468
11662 -5521 -160218 -31714 257680 119691 124691 -143490 -119927 160400 -87658 -139162 73874
11650 22468 112489 -18736 316858 208718 -141942 -274731 -87099 -138822 -243250 11188 -92924
11638 14577 410317 -352387 -155583 260285 -63456 80138 12585 135258 -21456 -132781
11628 -132781 163829 -55159 104510 156155 -15008 85533 -162462 365246 -106257 40138
11617 -324436 -56512 138066 107617 -115607 150552 64033 -7066 47363 308659 -123096 -263176
11606 -263176 -78407 8932 -213534 -61539 125486 231613 118988 308445 178553 145222
11596 145222 75138 106381 283075 199404 -29984 -332453 -154320 -63534 -100837 -181769 380149
11584 -174072 53932 123099 201543 41032 139955 106538 6462 2115 -167832 164894 -59203
11572 87125 151933 5656 62659 -36592 261192 239508 368857 78081 312889 139690 242399
11561 242399 272502 23692 274597 -50829 339634 97489 243061 -58951 41861 164190 7677
11549 -122173 25925 510018 56029 -236033 -39624 -5954 195723 129829 191669 278949 190216
11538 190216 201925 -207946 71370 266841 -29513 213098 -2934 424926 144819 74663 18360
11526 -24425 143652 97266 10714 235164 131642 298070 166088 291796 588089 142840
11515 154856 -129090 35587 108604 51081 -195206 314282 275132 324069 -199598 -164806 -38756
11503 57510 308132 233393 307428 74350 -1626 -97220 230205 12109 129367 79855 -312865
11491 314306 97788 199690 107627 -134867 -119967 41440 383201 121175 244279 -30858
11480 78174 104635 319118 80991 304788 132198 55619 -168924 81374 -56081 131280 152902
11469 152902 128135 353610 479586 91108 -210534 -88605 -16003 226836 712176 105794
11458 176131 179369 147447 -20274 -184101 21347 191374 75429 -235592 148168 167816 63356
11446 -197149 137063 -5361 174972 -23223 -188660 408168 69424 220566 67256 190635
11436 190635 -66877 374534 1620 -130599 225888 177110 -167421 176353 -27222 -113382 -23170
11424 -6934 90904 74843 269857 184745 16751 287960 84345 120733 -96017 185153 -104221
11412 -402778 21515 -181321 -83432 -66026 -220015 38058 -350412 171369 -49854 -55898 365975
11400 166873 -291534 90767 -2846 7015 -203037 297869 79914 -237965 -207829 -195107 -195108 -59487
11387 -97283 -135424 -61767 73356 -310786 -53379 -109372 -9054 -210599 175355 73514 95549
11376 95549 94623 276200 -5340 53914 -36123 174036 -199118 -196551 64009 -49377 102440 1506
11363 -281752 157590 -233243 -150221 -69514 -210328 -129220 111541 25546 -85087 31654 -120106
11351 -1287 -50262 161830 122328 321866 79164 -141419 30600 274280 9180 417892 -219175
11339 80694 -86927 109122 94716 -76111 37015 65686 -66441 -19271 -123191 -35940 -374511
11328 -374511 -51958 7728 221363 164785 131290 63521 -92757 160086 -41821 -189908 -27287
11316 35763 79848 344794 124998 110402 -92585 -88191 35975 272557 -227274 333949 174074
11305 174074 -265891 77054 -112799 22478 -437925 -275900 -254215 212561 -157076 -144206
11295 -144206 -137125 -354993 -124464 -170603 -92092 35747 26954 221487 -104354 75589 -376313
11283 -107391 -140273 -91872 264303 -291312 -123733 -84721 16774 -141134 68095 14246 48205
11272 48205 -29125 -89224 -135165 29435 -152995 -178716 -180221 -85863 -83502 26710 218253 226591
11260 226591 318783 -115540 254679 118270 94634 -172744 131914 -9954 303647 173593
11250 173593 293556 120902 126785 -186800 65639 -361945 196543 87070 137442 -382901
11239 -30937 477273 180311 113407 166518 -362955 -169498 -180641 -164006 -380455 92680 -128019
11227 20818 -116145 58561 183301 20443 128294 -259821 124461 44503 34276 69687 -95166
11215 -65340 -266223 -220241 121362 -66059 -72102 -5915 169167 -184990 -233348 -10052 225459
11203 -84966 80767 -169405 40241 -185338 218350 -60833 231371 -7134 -419580 -143543 150630
11191 -211000 -253174 23912 115282 66438 -34226 34151 9476 145832 -133626 -180280 2215
11179 -11481 -32605 -89079 210535 -605 270288 -30025 328417 90522 -170097 71045 -226654
11167 -89471 -346440 -82071 -141170 -246314 79787 -80299 -28389 223676 289015 -101354 260245
11155 103650 19707 144414 -139097 47670 -12030 -110996 -159403 10405 -126619 -360365 -419316
11144 -419316 370702 -210156 417696 15595 310720 -254184 -495068 161630 -182424 35604
11133 66412 282699 176937 -133627 -118648 -213921 78073 179914 310100 106693 -137691
11122 190439 154055 97455 192261 -57089 14519 -101344 -145187 -93348 390248 238431 -13170
11110 361112 -17652 172405 66067 293956 -11193 203034 409528 16087 -83201 202193
11099 247058 50694 279864 -102302 142524 -125290 -109669 -82103 115365 -222000 -28580
11088 201748 245944 168094 131530 58454 361129 -177518 155285 -67246 181213 239451 332274
11077 332274 -112493 258143 420576 194157 310255 446233 709607 150730 492600 295463
11067 295463 168809 169097 602202 162844 203164 564768 130934 453157 645941 767372
11057 767372 317586 502612 740518 607381 506764 965423 442822 715329 474710 900119
11047 900119 728761 650449 1077183 733923 1007062 646398 648389 833476 650198 551262
11037 551262 631904 589604 847213 581614 838129 501308 665753 755850 701687 492452
11027 492452 658191 930484 513307 616175 691182 851296 698601 694688 268369 578608
11017 578608 561745 389843 664219 511121 478563 594414 989746 891484 481230 275057
11007 275057 618368 677915 720717 829109 684833 660607 581340 406781 626882 548439
10997 548439 706863 940202 920124 479759 807342 738452 608330 962808 747084 591642
10987 591642 762325 964016 704128 1087818 1099815 1060458 1323573 1113488 986655 1061213
10977 1061213 1683046 1888068 1989717 2381565 2685579 2723747 2915033 2772130 2278403 2619134
10967 2619134 2483005 1944260 2270470 1811594 1708752 1571130 1587957 1534423 1556438 1842239
10957 1842239 1352115 1583837 1273862 1567045 1403393 1259076 1551423 634690 658800 480777
10947 480777 297307 36251 487337 202291 128039 461449 373024 258450 -22377 447360
10936 -95811 133885 54406 -149180 121516 120354 42254 29189 242857 -93758 -168146 101439
10924 -94338 172771 18673 230198 -112260 -80094 117100 95557 -378534 -28180 -249185
10914 -249185 -338419 114322 -356476 219297 -8777 -552632 -36937 -376135 316065 257734
10904 257734 47689 91811 -139232 -37036 -88628 -109074 -213087 156736 -129595 144632
10893 228680 285617 -119761 -165501 319279 -59043 -166299 158911 -23828 184313 46662
10882 -287235 -24675 351979 54700 -307049 205456 -103930 292509 -225333 216248 34557
10871 -198229 -154685 -115290 -106986 82916 12278 -120305 145450 92578 17379 -153829 -47202
10859 -48489 -128578 -194042 105971 -74849 118962 75391 -136733 -226018 -18002 344614 -264019
10847 105308 15653 -54425 252995 61208 -97129 -218412 -4543 138509 247008 -101808 -36115
10835 -194484 107759 182218 51425 -47420 -219499 -74218 -67148 87805 -286874 190761 -171744
10823 -295448 191958 218801 76016 200763 -164943 -77771 -132033 72554 -273395 -211427 15495
10811 77148 -88460 20868 67694 -47792 -53304 -8946 -179055 -41248 -80465 -235832 11691 403045
10799 403045 -31899 50516 233861 272887 19384 205554 142589 -297296 -47922 -331816 160951
10787 -214652 241685 -67225 18405 -90211 -85353 -133465 36280 2502 1879 158666 -363356 134365
10774 -53995 -3050 -270191 -11823 -142878 -198921 286327 147235 -56930 -108446 -396495 -66268
10762 -245253 207240 -280309 -17480 209768 74199 -81581 -59482 -199680 -124222 -163386 83096
10750 64162 -62329 65637 -276639 -310241 191300 81782 54711 -9010 -368974 -1294 -51962
10739 -51962 -484726 50111 -73567 -121585 -2272 134779 -30877 46145 72383 211795 410775
10728 410775 237188 105147 55298 158482 136752 -130666 -36469 16953 138392 -268406
10717 224456 -264858 -68104 11833 -75682 -98063 -480173 22567 91934 -51364 1965 -139428
10705 -3021 -161144 -206670 -186602 -183727 130867 -170888 259226 -165899 -188165 -160448 -14570
10693 166867 186103 84251 -159918 -88425 165547 209138 72855 163110 -132223 -282056 -16320
10681 62232 -270348 -124492 -71404 -520679 -57501 -41611 -162909 107353 103146 15934 -158654
10669 -167729 66977 128451 158454 -22705 48577 -254068 -160349 -224790 -36842 293613 -236886
10657 -14055 -74276 -116122 -407724 149153 -141390 -40757 -253707 -306028 -175880 -66634 185357
10645 94919 -63965 300361 -398105 -80367 -319666 4451 -103050 -176228 -225974 -191598 -459046
10634 -459046 -41666 -118914 -282552 -173906 42280 126092 -47407 1837 -116416 -260704 142395
10622 -328880 264401 137788 -54455 -186234 169113 160076 -174687 -186506 -63064 300772
10611 32974 15179 -140326 -331472 9644 -117391 122823 83867 -52847 -82034 -36032 347833
10599 -12016 -262257 73137 -83819 8620 -174263 -306230 6099 -333953 -678 -151692 -158099 47214
10586 -21796 71499 59020 -360212 146530 -115599 -233902 -176064 -129179 137405 91348 -110933
10574 -396221 143791 -123376 9168 78837 83364 50629 390914 -144871 -127664 237505 5048
10562 135183 -69788 -54622 -84698 78421 272414 -183928 110622 -6078 -19740 -437199 9741
10550 -203801 11345 -77388 50633 -261369 91873 -213975 -129733 -223957 13060 138209 -100906
10538 -54483 127099 -40200 -70109 10007 206490 151938 -235443 72907 -264741 47566 -157039
10526 281499 341730 -87870 -72365 -43976 -76166 28705 -60767 112157 -115503 -75434 74415
10514 6058 17547 20424 271511 -172279 -73470 110587 14285 -217061 162945 -479686 -153533
10502 -43014 22092 -230505 -137711 -77686 -183745 -27957 -122881 218580 -191353 -90754 145791
10490 -87602 -191534 94849 -80192 9433 -48059 -270622 -672 155148 170443 373237 405968
10479 405968 274748 353311 37052 15248 160136 415372 173088 88369 15343 218505
10469 218505 200826 -367042 409182 -176984 385357 -123377 -217296 -142009 -610 -121399 -317887
10458 -317887 172869 -94200 46284 -146902 49441 -25126 -24253 242012 -126513 -423209 -227076
10447 -227076 100416 99915 132925 -138995 43653 -8323 -251282 124816 -280824 129501 88563
10436 88563 79309 -23737 112028 141998 -26954 96579 207744 57832 -82207 89752 -142381
10424 443405 290080 28138 -168535 -140556 -162501 234888 -96653 -48352 -175574 374402
10413 151314 153413 308005 4656 101429 49580 -124223 205475 -516638 323781 5287 138241
10402 138241 -433821 -194842 28587 -239554 -4952 64451 270764 -71959 58389 -89785 19782
10390 -188214 423940 -97227 -48950 34226 -14013 223826 14212 294769 -346573 -34998 -195405
10379 -195405 53238 239037 -168017 33261 512604 171946 189867 286041 237367 119223
10369 119223 260686 270653 419648 313505 379500 363853 115496 2051 258094 112825 -125681
10357 -59779 247082 129128 375460 -165020 501257 149926 472530 417495 543054 307177
10347 307177 421327 450994 333918 431902 210028 242397 179588 195780 170033 -26513 223811
10335 93499 356051 23291 328583 -29553 -112267 -36360 37251 267406 273409 488985 230222
10323 40250 104582 118841 67695 276976 -75546 135537 206989 307137 133342 308296 197326
10312 197326 -43149 255455 25767 257292 -389903 134388 -33271 408781 -18036 -130157
10302 -130157 52458 -92289 42878 40562 377339 117048 -255198 -49278 -226633 -270507 -23542
10290 -299188 32537 -79276 7057 -149314 -149749 79946 -142393 -70147 -54621 -154740 94777
10278 -53651 -341034 -180160 80515 106576 70550 3168 184057 46927 111766 18713 -35256
10266 213652 178332 56109 -101602 129418 9893 -411639 -19293 281275 -58767 130445 361178
10255 361178 301423 51033 453538 -51355 -103223 60090 -126653 -36543 -144252 440933 -90855
10243 -25763 93322 28274 -202916 -75524 4633 -226469 194302 -34256 102109 -1941 124614
10231 -55044 -262351 -121485 -116575 -72536 -152217 -22975 -169766 145152 -112353 -115504 41351
10219 -76774 -197485 -66134 202232 73536 -247298 -149862 -45261 113129 -98198 -19745 -19082
10208 -19082 -713 -133807 -373190 115244 259162 61729 46540 165909 138217 -336652 -165010
10196 -107392 208460 -383390 -160748 229925 -51209 105996 33726 100264 21623 -31517
10185 -65489 -223041 -208340 53267 140832 68501 -200636 345273 -183733 -336965 28254 -309413
10173 88512 22809 38797 -454485 25048 -132832 -50814 -59736 -150386 -4461 95714 -394975
10161 14802 -69001 -51331 22195 -23935 -363102 260797 -162730 -88532 -8017 193017 -237198
10149 111098 -352830 50993 257869 45430 -264598 -46655 337294 -60624 -114843 -6039 -28971
10138 -28971 -274179 -112567 77781 -255545 148170 30063 -99918 -420664 191241 -206517
10127 -249871 -206634 -241825 -188481 42832 276592 146671 -247247 140422 21323 -163574
10116 -380199 -36159 -42593 11910 51752 415032 -122004 -516795 -58370 -233601 -60232 -96879
10105 -96879 -80738 -246676 189871 191026 -419943 -56490 -167074 130136 -206733 -406683
10095 -406683 95672 -37272 -70294 121692 8663 42684 -93669 -117000 -139034 34733 61558
10084 61558 -237969 -282038 36747 280463 149495 107160 -448121 -194212 -214711 -382363
10074 -382363 -36172 338297 -9379 -197987 25447 227322 32463 -58687 -134349 -156435 -40007
10062 183478 -79445 207828 -241695 164384 -38421 154818 -428987 -49099 -363900 67254
10051 2397 184084 -226443 7949 -38643 -165896 125231 -15722 177441 187438 106069 -203127
10039 -86536 100392 95403 -198828 42584 -20799 10805 19123 -163218 -15902 -70378 -139160
10028 -139160 -148719 -40132 -178435 -209561 -339064 -150088 -81024 -219125 -129918 96590 64060
10017 64060 -148091 -185224 18032 -412871 -541699 186632 -121614 239450 48115 84408
10007 84408 -63424 220673 132514 5855 368593 99209 -429307 -152172 143643 16027 -42986
9995 -182970 -15989 122787 221835 -144003 -80196 -25339 25839 -44749 -85255 -1522 -135114
9984 -135114 -11277 -248424 -27258 -44100 -69179 -278359 -17178 109521 -209526 18820 -123716
9972 -9900 30736 -135342 -97071 35627 -386555 -190823 6986 47012 199154 -65138 164706
9960 115441 8395 -105231 27059 110159 -57833 129739 -197353 -91821 -156308 -74166 -153223
9949 -153223 -211852 -93731 -161566 -233029 77114 -366138 248418 -361551 -409647 409504 -259376
9937 9336 -45621 -90883 -62129 -229359 -143966 -150805 54564 184410 119427 215553 -258329 -166206
9925 -166206 80656 -105570 23315 28030 -241848 130802 -118801 -75143 175870 -130034 -146531
9914 -146531 31505 -116871 -60046 -182160 -187497 11867 -62089 257736 -51026 117751 -343084
9902 -106393 -70337 16636 -128396 -159296 -56297 -45086 69391 -245089 -24824 -333629 -160934
9890 186717 -265518 -166719 43743 -47091 -213544 25746 -95588 -1929 -111576 175916 226919
9879 226919 201444 -164104 -114089 -6184 -40748 -137307 -341141 -205128 -183145 -6323 227543
9867 -42395 -231691 -88613 145693 -213809 -321499 -101379 -125016 12032 107671 237848 67172
9855 -329558 146074 -399515 -225296 -209500 383699 -305395 15140 225209 -20997 -197461
9845 -197461 107663 -110783 -81791 -309670 -369157 -173632 51538 290665 -300349 -521161
9835 -521161 -297720 -81851 178170 -102915 -79593 -145852 -253468 -39230 -62877 -564746 -186063
9823 268749 10877 155647 -37503 -234990 41120 -127894 -18549 -34725 -57461 223735 258073
9812 258073 22911 126517 -15667 -230648 -107850 -120631 -38978 -99324 -440407 13100 1942
9800 -475736 -55854 58913 -465509 -76873 -155583 59118 -153822 -489835 -165616 45243 -117614
9788 -3018 171264 363464 -114795 -346918 -66210 -104742 -109789 -150682 124324 139898 139840 87702
9776 87702 88973 -32661 -42733 -308273 -44905 -288814 -211765 -315888 -185468 105649 34180
9764 10178 159701 -417343 -105852 -84981 3548 -51622 108630 59982 190091 261279 48202
9752 -61475 -389875 67059 177394 -190708 96670 -127678 -348386 -237636 247436 -46787
9741 -126767 46421 -193410 -276006 70799 381001 -9947 -248975 -183261 -335724 -379825 -234446
9730 -234446 27817 79449 -80664 -151381 -259315 71738 25670 146213 -265932 210825 -80751
9718 -8908 1137 185511 -301251 70525 115918 -222091 55341 160255 -179851 -162582 107740
9706 -451413 -168750 -104091 -3485 78804 -316589 -302173 -8053 65590 -72137 -162575 -19782 77562
9693 144354 -90403 -123222 18249 10780 -249785 -483984 -178565 -198617 181124 -7583 -431805
9682 -431805 -210431 183589 -225050 -141407 -95213 140817 -158989 -259513 -83560 170876
9671 -436881 -24753 -38008 -394636 63456 -431800 -99370 31118 41248 -148522 -44363 -46551
9660 -46551 -69005 -97628 -157253 -135177 -147400 -17174 -15655 164056 -154446 -139961 -93375 -281955
9648 -281955 -155347 -146186 129203 -45028 -268828 142532 -213744 62680 83516 -228054 -31919
9636 -66191 -54481 -59734 -30626 292923 -189355 -39693 -185874 268968 -126143 -106454 -16441
9624 294797 30642 -62841 54099 -279580 -164475 -36076 77107 -233779 -197777 303470 -104737
9612 -426999 -44584 290779 -287955 102838 15300 71982 -286604 -215027 -214404 -189068 -233074
9601 -233074 -241124 -46856 45573 38610 -19067 -180945 259983 -207210 173831 -115158 -33130
9589 -125482 -117450 40413 237946 -33023 101387 80908 196341 -71124 148547 81297 -120752
9577 138408 130264 15788 -189943 131531 91856 -209590 -108248 44902 -48541 -86640 -130754
9566 -130754 -76553 55019 -116612 -358521 106190 -20045 18787 -309420 -21435 7807 -37541
9554 -52131 -69088 -70217 -291462 -265658 -17628 -134816 74508 -146240 -285213 47014 8002
9542 -77147 -313043 -139834 -141818 253475 49120 5834 180268 -101913 -301304 -409721 -11199
9530 -178148 37364 -65422 27254 106550 -222605 -103311 165639 284992 57197 -155448 139197
9518 -187486 -193776 -35001 244282 -271801 -141824 28636 -405390 160909 -404890 -168566
9507 120590 156083 218271 -302014 -72305 213210 120164 394849 -331423 -207773 -469055
9497 -469055 75859 88428 -98117 -132671 -16140 178609 100208 -122955 -284905 -229200 -61804
9485 -55891 -72442 9438 127045 32158 -456464 -170096 194595 529 -342813 -97170 -210155
9474 -210155 -64951 118533 34459 6355 96658 -122448 58924 -297256 -62230 -168893 -57145
9462 13820 -280426 -251817 82401 -339016 -15441 151644 128482 407021 -22996 -117631 -269785
9451 -269785 -40247 30027 -224776 -55239 135636 -317593 -306419 -42922 34400 -379313 69894
9439 -274311 -46084 -118365 42029 127593 -168844 -395896 170622 16703 -71100 -187096 -146454
9428 -146454 -97634 241440 -244356 121884 -144526 110321 130144 -221847 54472 -134841
9417 -63061 377056 -423187 -105731 -295263 56753 184100 40386 270980 -7422 -326355 -122256
9405 149995 60022 -102013 -144026 -138383 -191411 -203380 -216318 -35348 15074 144396 -356544
9393 -64156 114787 32766 -161188 -119212 -306886 290014 -175517 -35376 -93358 -193753 42489
9381 10557 38955 71686 -4614 365635 -387328 -232282 138230 -245989 38627 -412677 -44804
9369 47312 -64475 -157424 -273326 -129898 89818 7373 -344890 10097 -178265 -479614 -74277
9357 104936 18771 -164682 -80937 -54340 99918 -60909 -188580 64616 -38459 424749 -80967
9345 -447098 54883 45927 -101576 -245069 22116 -242652 -80408 195212 -350559 83993 -291
9333 47496 91825 -248220 60072 74706 -30761 -140020 -343950 -4556 -398148 125320 -318490
9321 60149 -108607 18239 485598 37914 64362 -117434 -144641 -147466 52269 -45349 -255249
9310 -255249 -220011 110211 -17085 180476 -56559 -56799 211064 60254 -15125 -161302 -73289
9298 67682 -1349 -488455 262739 -162623 20735 -245539 83238 157075 124001 -24861 -148797
9287 -148797 87371 -324410 -25078 -240919 -250635 -165491 -37325 -426266 -3903 -224466 -113946
9276 -113946 -293471 76738 47858 -90144 -11024 -185399 -10911 -342700 160628 9363 -78118
9264 4071 -619900 22718 -410816 -66112 201583 -328539 140533 82772 60562 282678 143773
9253 143773 -9381 -235250 -308709 -15004 159673 333739 -119119 127153 -46695 -111803 95492
9241 -43038 -239753 -89363 -358659 -125652 -289894 231648 -131991 -189531 -296086 101801
9230 -77118 -215111 160201 122331 -93979 10437 201 -281267 -244990 -364996 -117991 106176
9218 -155386 -6099 97775 -225803 -216154 -64930 20990 -43774 152743 -244191 178310 -78376
9206 -353738 -77404 -42647 -114429 -219979 -38160 111339 -137746 230827 137793 -18235 -162346
9195 -162346 109246 -138452 -227242 49070 -28727 -69429 -91324 -284046 -31477 -149174 -288990
9184 -288990 102772 -49183 -71520 -320169 -230089 198936 200011 -180162 -63657 -106955 117251
9172 -305597 457 -121740 409428 2666 -421210 102267 -82499 29129 -25173 -263157 -292662
9161 -292662 116393 -211188 -316039 -112809 128832 52965 -430892 221256 3399 244032
9151 244032 -437531 77685 -330301 -23262 -298489 457689 180933 -108410 -22730 -34942
9141 -34942 -164122 -128348 88664 -69302 76109 -83962 -160339 -245962 81651 -150238 -198029
9130 -198029 25498 -160917 3150 -206513 15959 -184737 -278562 299873 -105589 309079 -280779
9118 95529 -27915 -160339 -109276 233947 185065 321957 -126640 -29872 -428705 -401602 -11523
9106 31212 -398556 -187401 -11231 160702 -40058 89561 -18236 103550 70605 26118 161753
9095 161753 -279249 -1542 98748 -120154 8660 110834 142830 -170029 -75938 165932 179331
9084 179331 1900 3162 201561 -102679 44537 -83595 118670 175629 -82351 41610 -19636
9072 -20502 132470 -276081 6206 11001 175836 -507721 -448353 215947 -27780 -24703 -99234
9061 -99234 -224403 -33657 71253 -58882 206468 -173165 72486 128842 270772 -109288 109221
9049 -143318 -165672 -150696 -374788 -144008 71711 -140710 -147175 -82304 149533 -21534 -251731
9038 -251731 -249371 -27825 55299 196404 -402375 65733 -140475 -196190 -246122 -395933 58493
9026 -208729 -407718 -241710 -291137 160073 150990 -173329 -111429 -174442 -161268 -72234 41185
9014 -355792 4479 -175078 14862 208216 -208444 242855 171315 -1595 -39427 -349926 -179139
9003 -179139 88723 428703 -23304 -178085 -178472 -239640 -96346 193354 151655 12045 -362606
8991 -43796 -143399 -92303 -109467 -4386 19580 -96504 -98579 -114736 -143350 -94428 -48981 4624
8978 130354 -178442 -354773 37851 -119660 26119 121331 -256752 -488386 109393 183856
8968 183856 138082 -255472 -122067 206275 -273050 -133380 68132 403699 5114 -148652
8957 -51086 138062 -10795 146950 -88246 -97211 142427 -258080 -167096 -199247 -62652 45757
8945 -254040 69035 -257566 -199053 37073 -56333 -100954 -76728 -357772 69370 256909 -22451
8933 114223 55398 -372275 -153210 -66789 -47573 315322 -114301 484041 268087 561044
8923 561044 1753594 4935477 8136583 2466622 1124940 479579 157626 287040 109718
8913 232581 58506 88968 301000 216912 -112496 175149 -150863 -261356 92415 -306222
8902 509306 -60692 48721 90333 -167261 -58680 17615 61542 -13325 2413 -275581 -52788
8890 21477 105861 -415215 123621 -335914 93978 96441 -160512 -193310 -401252 -11387 -12739
8879 -12739 -110018 -274704 6633 -11668 -206192 -86152 115671 63260 7698 91998 -22282 26705
8866 -105407 -299845 -189009 -13931 -75650 97149 -218356 279565 240783 244864 -290514 120533
8854 -49679 -389359 -60108 -46581 -57564 -85302 -324789 -328187 -11786 10342 109581 -165718
8842 163663 -43078 -193344 -84385 -42886 -59470 -76981 -38390 -216792 -141136 117429 -333883
8830 42852 -58055 -92697 -268782 112258 5081 -198488 -96735 -46682 18611 -506155 -34100
8818 -24297 -86213 55345 99744 75661 52079 -42130 32135 -175679 -99007 -328268 169628
8806 -55476 -9637 249311 -238785 -215911 321819 -27742 236819 -150607 -256532 225810 177650
8795 177650 -35104 -50040 -154679 -242035 -405344 -146522 -150369 -49849 -122686 -110316 93424
8783 -354675 -94835 144545 -112705 -103001 105422 -77534 -217511 -75894 -48908 -268253 -17537
8771 -203912 148966 182295 16341 -13843 -23066 -138207 50602 89836 22722 233611 46188
8759 71397 41259 133752 -102136 114851 -235522 -213351 -411035 57831 165812 -214608 75384
8747 -242716 -184912 -287524 -56434 -105428 154326 17832 97044 -28018 251952 9266 -50263
8735 -38064 -138407 65709 -212467 -219071 30519 -129285 -40844 -110985 -57182 -18164 -61605
8724 -61605 -152058 -37580 318603 93935 463 -259264 -63139 -120322 -61092 -69603 64406 4157
8711 87426 -89389 533 -360883 -61917 -124827 -108543 -96239 3331 -344100 -100315 188840 154935
8699 154935 -462326 -346891 -152034 -22070 -109544 356516 -4408 -106037 -122793 172380 149679
8688 149679 91924 -100510 297675 -74361 -95789 249345 102423 -33129 -67483 -44768 100631
8676 -216138 -81375 -173797 -76315 -197008 108142 -739372 -211043 -154246 -347303 96307 -254828
8664 -138979 491285 57076 -221724 14363 -97821 85057 35284 13391 -79254 -281182 -56714
8652 -202943 -108299 -211615 46995 -186880 84937 -76483 -192342 -157635 142582 166270 -65296
8640 79835 -70488 -160900 -136 30787 99644 154513 -46768 -3418 45862 -135666 41861 -89399
8627 -95519 -283322 -238829 -270254 -246298 -63593 -177988 -61527 -66532 25093 -114859 -458611
8616 -458611 -45631 -207778 -211836 94415 -81119 196416 -373090 -142629 -112353 -124964 -88786
8605 -88786 -46941 -299158 104696 -142800 42832 7759 -192744 -85992 -245356 -133812 50555
8593 -395232 78631 -229169 103055 -165768 -136454 -351611 94628 277042 -278852 -189422
8583 -189422 45669 26528 -50394 -13729 199064 -137321 70116 84960 82774 248949 -58108
8571 -26651 -214178 289411 -115879 -219288 226915 115366 286467 -328961 1942 38766
8561 38766 -126619 -163704 -130672 215852 -218482 -477236 57046 -157051 106819 -260960
8550 68199 -130600 -52874 -157305 410185 117440 52246 55162 49854 30934 -165962 50339
8538 -284866 -168816 152274 -140377 -91332 -196139 101833 -11832 153844 6624 -59692 -151146
8527 -151146 199988 -102958 -157375 195286 48834 -162624 389806 -41320 -61631 -146674 -194820
8516 -194820 33612 -57928 -51101 -61108 -114323 -74142 124927 -159652 173115 -143232 13865
8504 -449448 4992 56676 -71128 263116 -228398 -24551 49973 220485 290231 279937 958 294132
8492 294132 -72244 -218037 -108187 -89325 -183155 -204384 -191725 -131066 -71019 136847 -7368
8480 -150116 -90811 162779 166030 -134661 -199039 16843 -332455 -73496 -205672 169315 -151985
8468 -34592 229890 58179 279760 -328365 -152945 -21087 50085 169207 -40860 -235892 6192
8456 -252314 -131703 -39718 -501155 -161463 219755 -203269 -132508 -149467 -47219 -461 -340738
8445 -340738 141113 -304588 -80776 -225964 -58969 82705 45284 156771 -169699 7846 -165895
8433 -103125 -354016 -281566 -13180 225559 -191314 -232399 -7219 -344748 333219 -242404 96253
8421 -626153 -181584 -47700 322979 -397057 -316603 -102756 -165967 -299555 -68480 -270892
8411 -270892 -109475 181418 62468 186009 -67254 70161 205664 254918 177014 -200638 128129
8399 -162246 -201087 30033 175733 2125 133555 -346983 -492781 -41918 -87023 -111856 -37974
8387 27332 -118385 -85753 96595 182510 347539 384713 -174298 25888 4323 117985 41840
8375 5835 32098 122547 -42428 163544 -80198 -74289 227905 161460 234172 -56349 106354 -290409
8362 -333640 -70615 -150383 74597 80431 -35464 73267 -11514 50288 215303 -116968 -90648
8351 -90648 -193074 243287 79432 -373873 133220 -182125 -144817 20313 198429 -48645 -107085
8340 -107085 74919 180997 138579 -114641 -143019 -300355 -74497 -100410 -138073 -349076 -243079
8329 -243079 -163950 -15543 -361451 258823 -144098 41677 78461 -83479 -96917 -212975 -66662
8317 106412 208761 443102 -246036 289861 -346571 -275326 -334979 -197876 606266 -75403
8306 -108350 -187996 -182842 -85067 -254390 255699 -319932 -16055 290072 154705 100324 131677
8295 131677 -159267 377866 -457478 -221442 97039 278582 -62616 84415 -410394 150888
8284 83918 -169971 -147744 71562 -189100 -97778 -267614 -112975 -103293 124871 -418513 268755
8272 -42612 135347 257198 88210 11796 -15969 170941 156063 36413 184596 -147417 212535
8260 26977 -129847 -33223 58071 103686 250113 193136 189738 -162032 -18488 -161303 -159873
8249 -159873 83599 -71213 -192844 -241957 -94814 -54167 -187904 -131446 -76869 18804 -88060
8237 -133043 463445 144113 -394329 -38431 -8321 33739 -247987 80246 221315 -347308 -495815
8226 -495815 -220846 -108527 -31817 -34995 -112811 -244595 73252 -256386 -174627 -73006 -56002
8215 -56002 52472 -121429 -169259 -156751 36582 -177824 35140 3153 -253747 -103578 -2144
8203 -105094 -89092 52515 -2838 79857 86465 -188421 -311122 153798 -204334 -302805 48906
8191 -292630 -9089 76469 -172315 43260 199875 -244365 -235597 314420 -444673 -74416 223595
8179 -229873 -201433 121745 -178260 311042 -298015 219300 72180 50673 152326 -210164
8168 -140026 136845 219798 75785 -168289 -21830 -85915 -59834 473948 109014 69663 -289764
8156 89652 -60306 -40794 99264 -211375 -203934 106650 -87280 38695 98283 96766 76438 -37883
8143 128241 -197091 -33980 -178206 131406 -193612 288680 -188732 -263680 -198677 189739
8132 -149072 -361129 112750 256386 -136590 1269 111585 -306751 -336075 218518 105364
8121 298452 219679 -154987 -118521 -55766 -215008 113955 -217214 -243027 102022 129263 -149599
8109 -160168 -287047 21188 -39219 -445810 72728 -408646 -6445 -66651 -176502 129003 -66913
8097 -18354 -146653 57882 -16101 165372 -92526 -357165 -153124 -153995 -289238 156268 -249006
8085 229178 87005 -152324 -83253 -258743 -46880 194066 -384336 188791 173021 2770 -131127
8073 -134411 -374151 -99885 -148104 101107 -185384 84018 -11240 -127638 -57636 -69575 -101007
8062 -101007 -43999 -107529 -128709 -156576 230154 -31682 178605 -116810 27006 235346 -115611
8050 -131480 -74741 6851 70458 -256754 -109118 -334727 361720 239468 -172989 -209728 -227051
8039 -227051 686182 206595 -128085 -275403 227685 -194435 -3615 16547 44848 -157293
8028 -94126 -238786 -38486 -357754 -193879 56457 150013 43377 105960 -223821 126022 -8375
8016 152715 -265235 -122437 -408293 68097 202382 -28524 79108 -138334 -59192 -280120
8006 -280120 184478 -235303 -352342 -10079 -386289 243956 31511 -118821 30819 110378
7996 110378 -8184 -9232 -26399 199769 322766 -126453 -301861 577590 -469655 -236129 -17619
7984 -364207 -21115 313987 -4756 -124825 150980 64239 279031 -263291 169211 -58227 -65982
7973 -65982 165808 247144 -234719 98988 -302989 116371 114846 -126918 280853 -318725 -345952
7962 -345952 -238804 112525 182917 -259529 -169880 166030 188725 155312 -33580 360161 -13514
7950 66672 219952 -119666 87634 -277613 -143488 -97795 -31041 -350144 -118411 21610 -241772
7938 369141 -92322 150822 -102777 -413843 38710 -311775 31677 55056 99710 -341212 -393212
7927 -393212 -5783 -139849 -195720 157432 -713444 -94018 58266 25539 -78136 -101494 -32600
7915 -22453 -155902 -114214 179211 48733 -5127 -270628 8581 -93838 107526 -114491 226742
7903 -199407 218975 184268 53482 -138011 -51352 -103897 -17929 144195 -144737 70897 -265097
7891 -200540 111589 -30912 414535 -53177 55801 -88278 -242819 -1075 -100802 -46664 14157
7879 236191 -156897 -153499 -177413 -416382 291933 300545 -100803 37274 -35973 -202387 187768
7867 145996 -287688 -93234 -77028 -160147 -35024 198088 -219966 -111842 61990 47646 61786
7856 61786 -66750 -1415 -240930 -122566 -151511 28200 -165007 254780 -6507 -318035 20843
7844 47559 -235304 154526 -95438 -307752 -140230 -110305 -204078 -165113 -224910 142281 -140998
7832 -315184 -244356 -241261 45879 70909 78102 167927 -47420 -70350 -49957 -85118 -47665 11329
7819 -292104 130197 31283 44173 299996 -6807 256573 -226054 199021 319866 -258312
7808 29018 -41961 -120585 -72845 -793 -137939 -73571 228226 -291996 5763 4381 100522 5248
7795 -87935 -223825 -177456 38544 147773 74961 -222377 99667 122086 -175946 523123 -133191
7783 -218509 26322 -249929 -5935 171967 -275258 278817 -25632 -17810 133367 -32505 50151
7771 41010 -7169 81865 -43831 -88303 -133993 -276095 168606 151162 221671 -68528 105754
7759 -32000 -199219 -42051 133566 108249 -12818 -93345 -108978 -282269 -15184 -271928 287908
7747 -8670 12759 -71564 -102988 55545 39144 34931 122509 -37392 -12249 -392245 -190142 -68466
7734 24699 118792 -290276 53787 -162018 151051 -143263 110271 -184026 -13251 126621
7723 -100744 -270281 -67481 -26837 194544 -42193 -249101 161599 -325540 -223187 409284
7712 -16946 158274 300335 129043 -330411 11411 -264491 -23917 -19060 144382 -149489 -114264
7701 -114264 85392 -109215 -99812 84199 -60117 -13489 32003 219429 50985 -174547 268392
7689 227768 51182 -45182 61478 36396 158923 -222564 -74970 118758 72253 -143685 -346788
7678 -346788 183805 -240273 -166489 68404 126818 -67068 -151657 5459 -239247 212306 -3127
7666 -51418 81625 -159867 10980 -309853 -382447 125082 187471 -353249 -199347 233521 -119242
7654 -119461 89554 450193 -36109 134123 -53418 218767 240403 -191970 -165008 12442 34489
7643 34489 -24940 158968 -156161 -200244 -27938 67627 229250 55272 76028 -160679 -204448
7632 -204448 97492 -2671 169439 -180736 -27484 192686 -5268 285854 -15107 54379 131888
7621 131888 73006 -81561 -5302 -117539 98865 57792 -320761 57170 -211831 -81793 -128727
7610 -128727 -425748 -34031 191644 37378 61657 -42067 -331739 230649 -281380 -431801
7600 -431801 -135615 -64846 -175771 153476 6495 -20074 -138583 -120327 -112968 -51823 290586
7588 -29539 49186 167860 -63680 370335 -18100 63774 -335664 -291196 -176184 42854 112939
7577 112939 -26800 130480 -210265 -65348 -69403 -234334 -152528 488103 -138464 246130 63562
7565 -55553 134823 -56420 248367 -63995 -49720 -48066 -317847 -150905 -32620 121635 -136454
7553 -102093 157762 253429 118876 -116159 66215 49629 127419 -143058 -235215 87185 -36840
7541 62088 94066 62893 -456887 -123415 186291 18770 -29043 -206833 -200313 -77435 21691
7529 -15275 -374588 -164856 172965 -48224 -148147 140102 -143329 296840 73978 -157722
7518 -39761 27890 -81038 -62256 -260069 -238317 -145457 -188278 -220444 -92869 -235859 -282343
7507 -282343 119460 -154919 -207525 -28444 -125023 -65774 -152064 -203484 -113142 -67101 16090
7495 167570 106737 -368 119702 -68364 -67862 -14698 -473009 147739 -373699 -101098 64255
7483 -157813 -147944 -201424 49384 1271 61588 141375 -269406 -40198 107159 -30885 -205320
7472 -205320 -97235 -71028 11268 -263293 -458112 140546 178606 39693 -116140 -27448 -256725
7461 -256725 -215467 185722 228668 311257 110663 -129509 243461 156946 -70267 -241502 -311463
7450 -311463 -52903 129695 -52794 -178423 77036 -30676 -157501 116795 55394 199360 144415
7439 144415 -247482 -306325 -118924 -22494 -13053 -5004 -43088 -134518 58325 -157531 -256495
7428 -256495 -84698 -398654 -50810 -366881 135590 189277 -50557 -284924 -70706 -979 122485
7416 -84540 -240136 357362 77493 84573 201606 152811 -103122 244293 62310 4980 -275773
7404 -45843 -12189 -55335 384715 -345830 180281 -481 53838 -57150 111630 -446415 -262555
7393 -262555 -93985 98267 -171291 -201678 141502 -189500 -65628 -68012 -64147 -49531 -549 -22835
7381 -22835 -104609 -200052 78339 140085 222537 -376080 181092 86651 160971 -161700 -249330
7370 -249330 189427 -317840 -88315 -234794 -269702 -60464 -219679 121290 -184453 -197028
7360 -197028 -276062 -136598 123789 11689 -262038 144429 222565 297218 -175818 155048
7349 -71615 274696 -233086 -49918 48789 291101 513445 43007 47809 53912 173582 -86360
7337 -64159 -200041 55772 194534 -373696 106282 -269511 27891 -238095 96581 -324851
7326 -112860 327568 -35397 19523 46153 -27749 -152003 -115586 -41429 88175 -95471 219951
7314 -138626 73408 108192 -192581 121972 -114466 -206637 -85705 -93245 297440 5373 -232184
7302 -308289 93573 15889 -24783 -189226 -52390 -29180 -205489 88748 126749 35624 -75656
7290 -89219 -322312 137115 -15481 76000 327027 -78373 -68223 -2684 -61985 -378631 248808
7278 289842 -306612 176056 -84996 -98192 49879 252415 -41078 -174980 -133948 235420 -157242
7266 212075 -134879 -309906 -111139 -496476 -64360 -36237 119470 -5299 69992 -20313 -84795
7255 -84795 -280685 -81064 -314133 -321628 -30985 -17619 21084 94777 -80397 13147 32065 -34243
7242 -238247 89830 -23971 -41522 229025 8752 54704 -7616 -206654 -36688 116451 -119276
7230 -259201 -125401 221713 106592 172468 98735 5899 73291 204240 204219 92458 41309 -33006
7217 -375768 239472 20518 -75589 31639 -218733 -7481 26636 123393 -309322 -79711 -63139
7206 -63139 -452233 224610 267503 47657 -133075 192263 62050 -122508 130323 3133 41686
7195 41686 -21437 -116530 102930 183215 -122197 -165510 -114332 249819 60782 4708 13174 103709
7183 103709 135326 -361898 65333 -156817 -298536 -22238 -151289 -9451 97098 74638 93438
7172 93438 -183358 -166314 -156064 43011 122243 -82752 -174100 13502 90139 99740 -136150 352180
7159 96645 -312318 -5913 -249406 44251 -57288 -180603 -154268 -282125 -73532 -293076 -76841
7147 47918 110656 -116875 -173771 133567 159411 -89549 -302583 -271752 160915 -162359 121767
7135 -293523 1637 -377949 161671 20200 -276763 -55818 -258076 -237121 210536 152738 51494
7123 15717 32925 109524 39167 -220342 -352022 31123 -30152 -80829 76981 -18801 -189529
7112 -189529 40916 54906 73146 196972 -129622 -386599 -99623 -296623 278019 38596 -58857
7100 -119880 -42500 -2934 111763 -130485 -284706 -154166 266142 147643 -74020 99122 -389110
7088 -215761 -147410 -58987 -28709 209138 60122 73647 80739 -57079 71326 -134478 -254960
7077 -254960 -220624 -256547 -113179 170055 51469 -95795 169385 -202204 -265819 212559 407251
7066 407251 204063 -322634 206859 -101988 133731 -154744 -116549 -199466 40632 14223
7055 247210 -200057 -84182 -202307 35443 -114008 -100668 -82022 -204453 -174991 -194254 -59730
7043 34538 -32852 -399145 -120639 -185218 -138737 53619 -7488 -15880 149172 -162062 -62733
7031 -175719 -200828 -293846 116184 339896 -137177 132969 -167596 -20594 -204298 200494
7020 -164411 44198 73174 77511 50458 -29760 -15953 50221 -237044 -47511 -446463 -402339
7009 -402339 10568 33636 189647 123005 -331008 150787 -302187 -351151 169087 25801 -107143
6997 165828 169070 -19406 66309 -14575 20647 76673 -201255 -81310 -120681 206578 -226203
6985 -30002 75753 226024 -341296 -90542 -71136 -26616 -193931 -164729 170249 -24295 181364
6973 -115337 -218849 -257737 90181 127003 240599 120548 -230991 -134914 -50176 34937 -194147
6961 178414 -13957 -383449 99227 48786 -121200 49653 197064 -116049 95046 -90077 -300109
6950 -300109 -10114 -163658 421822 13138 -171745 -142125 -7927 -256268 -186205 -97477 -88566
6939 -88566 52599 47966 -68543 -36992 -154269 -268734 -90477 167086 -123457 -19545 -151357
6928 -151357 -204599 282829 -339465 -96029 75836 126810 -81135 -163694 112118 137590 152971
6917 152971 41833 -53685 -15924 117568 14284 -48573 9119 67874 -169389 -163381 100002
6905 -25107 -125732 -197865 -377409 -240787 210592 -94532 26964 263833 38254 -165783 229546
6893 384028 -486048 -43790 -35342 47578 -289253 149584 93919 138729 75047 54042 -174333
6881 345121 -18241 -117628 -9704 236162 -45743 -103090 -2063 39851 -50974 -319707 67252 46949
6869 46949 -282350 -84521 213171 96790 -302524 138095 29481 -17949 -194410 -206970 -57325
6857 12050 166369 131736 -127455 -112186 -69051 -197972 -75592 43504 -167163 -194859 -29654
6845 -223905 108324 -210311 -15873 -16876 44340 172351 79645 -161799 34522 -318933 311347
6833 -96182 192164 -147939 -369254 -63701 -142315 -301863 73977 18235 -97230 -52462 27372
6821 -283325 17630 -79641 -58307 14106 136749 85336 73727 82708 107315 -32048 -17760 -222114
6809 -222114 -400347 108451 37535 -407534 302821 271631 -3754 64824 -149220 -56317 427326
6797 -109593 -299456 43090 -224847 116879 -68848 -150231 7000 -119195 -233582 -430557 176681
6785 106354 202072 -145603 47554 286563 -263041 27873 -25873 190886 -75027 -187569 -389085
6774 -389085 -48695 170234 -19969 -207479 -309289 -246501 -213716 50973 -282185 -311466 57457
6762 -84929 59519 -174072 73360 16478 304840 250125 -268933 -80179 -282136 6431 -19096
6750 227545 105096 -39602 33057 -77350 32503 181762 -111509 8656 93831 41178 -213047
6738 340875 167813 107395 70004 357866 -36467 185756 270831 -59813 349195 -71809 15369
6726 -48954 -267461 8714 -134586 183211 109625 74042 50111 -210540 138469 -78635 -207795
6715 -207795 -133615 77977 -355237 -231032 -299641 -241923 -297410 293739 -61804 291992 13203
6703 327824 -120188 -376186 -153224 -216654 -134934 -2074 161194 67694 -172423 -481706 -135148
6691 381854 63148 -33875 -48339 -99131 62390 -231325 431366 231286 -83626 -71714 155686
6679 -101296 229882 186059 26897 402221 -69048 114818 -115091 117091 -48627 274413
6668 -155136 -84020 -7980 225048 -101181 132752 -76671 136991 -67252 -236640 70285 8745
6656 -145464 -53735 -52602 411137 213637 204712 -66019 -200019 -169310 128038 92362 -283723
6644 -248299 -159525 -80177 304094 -80960 -5365 -176 -113019 126572 177968 -10038 12387 -139288
6631 -302949 -19519 -235184 221968 -48412 -361211 89606 79619 -109858 -74802 -68277 -84867
6620 -84867 110055 -45847 -214586 -86659 358657 -73953 -266523 -240797 -78375 -9117 38273
6608 1059 -98916 -210142 -1897 -140811 -65792 -340047 37750 159278 455391 -288680 -10720
6596 -26943 -198803 -82910 206312 -254457 -159433 -118650 -21318 -92393 -81070 90497 37695
6584 85276 437804 105334 -335942 -369590 -37244 236599 -169993 494 195670 -25338 -205989
6573 -205989 -131012 -112953 -75041 -211912 35350 91752 -61117 24047 289961 89706 -127951
6561 -37518 -32758 -138706 395824 -63345 301709 5527 104454 -199374 192982 19321 -52039
6549 -75482 -151660 136990 -432928 -194025 -122704 23819 -28042 -451568 96464 -285025 7203
6537 -136593 119519 43633 -89380 657 336126 185906 -288469 -32250 -294915 106602 107085
6526 107085 121896 -71751 42955 -29976 217214 65015 74742 -444110 -82326 -408649 -506887
6515 -506887 89132 77007 -4920 237624 104318 -42656 122722 60032 -98922 41462 -275897
6503 200932 -123852 -338348 -118389 243516 335929 249405 -405570 -52056 132421 130842 -257754
6491 -57442 -196967 -144200 -170620 278022 -135254 110666 -389776 -496954 125831 124649 350215
6480 350215 16064 -321164 -102489 220238 -235566 -188947 -250026 101718 -165684 -354260
6470 -354260 -181084 321102 79862 148457 98234 -70504 -307208 -139626 -57992 21212 217332
6459 217332 -52733 -140967 320881 48130 224020 139976 147221 -118007 -270562 -38372 -76941
6448 -76941 45916 -36299 65155 -72361 138536 31432 -72573 124503 167149 118839 -80215
6436 -113742 -246642 107371 67066 227015 61602 -313123 97273 69996 62173 22554 134810
6425 134810 -185675 -49771 -130816 187015 -438986 143491 142141 112051 -112868 -51622 -15350
6413 -102800 290305 313115 -174381 45862 94233 -84834 114788 -68765 -19359 253832 -75278
6401 3589 -35244 19529 -304676 81241 -98981 -140743 397112 -450877 -76811 340581 -68691
6389 -8151 205386 -228083 -136314 -67171 -251101 328629 -79713 404705 -1961 114348 -46606
6377 -16329 3689 90181 50640 -202617 183802 -130816 -380879 -109021 -131374 54653 60986
6366 60986 61254 112889 -153058 -105001 111908 7730 83971 -273410 110828 5801 137468 -245184
6353 16047 -76270 48 -132240 241532 163556 381183 166458 142081 -25242 241256 -299171
6341 -250056 -201220 -323567 -277898 24141 51983 137612 -16717 -257814 -128224 162667 -271224
6329 -339713 100153 -57834 14587 59392 -202459 48534 -47652 -181003 -1030 -162392 -76761
6317 367510 32388 -113975 -160562 -80220 21907 -69383 -64809 -386306 -52315 130284 -46533
6305 -48881 60075 -95981 -97045 -266302 423207 -92364 51639 -78538 -237343 93636 88164 52448
6293 52448 -74105 56931 -18963 -116006 36057 94945 228130 172922 137096 -98337 117908
6281 -105317 -282738 210829 4928 -243663 -42963 88889 123615 167322 71002 -148711 68128
6269 309824 103408 -25222 36895 114617 -262937 13853 4456 -85459 -42031 -102161 60787
6257 -117562 -303536 180893 -160095 -115699 -99272 -130112 -17739 -287970 116712 230572
6247 230572 337560 -335227 -141961 -117854 34417 -266426 -21474 -211805 97616 434325
6237 434325 346570 -139043 -271836 52713 239632 -114618 48454 -52426 -205930 -77125 -181216
6226 -181216 -76646 -13831 -127098 -216988 53085 -55721 95441 -38186 124020 -106169 312385
6214 18422 38270 222624 -335593 -239008 133216 56921 164837 89859 -178241 -168976 209164
6202 141747 -4600 -103989 338681 9871 133946 194210 -32814 122089 -190757 -172547 95794
6190 -321574 -103058 -86030 -194520 -15545 121855 -208519 114238 -168472 50029 -43237
6179 70527 -137499 105914 -94335 -288532 188586 -126327 -177407 165472 198609 -403754
6168 64114 3217 -14336 268298 225046 -165020 168799 128442 -102947 -14636 351004 -41216
6156 -157142 199697 -140950 75343 -241397 -164218 336688 43897 63727 231727 210137 53819
6144 -159336 271264 -212567 334341 -144407 -34993 -253073 296150 -27423 53347 250194
6134 250194 192119 321784 -66160 83306 -158130 51994 -38026 144580 -231146 -172848 50401
6122 -84032 -110734 65972 -97009 -42863 91122 -115535 -171307 -79029 -141386 -60720 -28123 -31599
6110 -31599 135209 -168399 12703 198831 250440 -52138 175993 294416 107562 15052 8163
6099 8163 -70239 80283 187556 -186126 178890 -105919 9982 -76498 115090 30743 -60301
6087 -16135 60153 -278568 148313 111333 -275353 -138679 -407420 -149968 87555 50715 -15398
6075 264490 30853 -168296 100260 18108 255120 20789 24693 -99864 66959 130292 -154564
6063 -288652 -308927 215305 -23110 77690 -17886 64260 -268253 -110752 59166 193248 106793
6052 106793 -195465 -84548 191149 -177941 -345073 -43223 -135537 117049 -41934 -159676
6042 -159676 219623 -29721 306399 30472 85859 145226 -151729 -28167 50583 164643 363675
6031 363675 -90413 178248 49746 222857 372048 203153 188071 -330574 -36880 -205982
6021 -205982 -117374 380567 -286154 322453 118258 84205 -136216 226083 382310 -212706
6010 -115511 346998 8333 -143464 -195521 -22171 -86117 173917 50901 -36178 18863 266914
5999 266914 -80651 -27202 -486114 -34588 6314 -356808 -120574 -188260 213683 301742 18682
5987 -22305 -326356 95853 187728 8959 124085 167983 -84557 -29764 -172390 -243385 174802
5975 -61932 374192 110683 -149669 44538 -217327 13996 151392 191374 -156150 -98259 43314
5963 -73181 -270082 1333 -223425 6968 267907 -87413 -252806 -144849 -197264 -61299 -63619
5952 -63619 108206 -3810 -284983 -409239 -154540 286119 56743 207863 -465102 -125575
5941 373912 -265923 312680 -95821 -301177 -96870 -128835 -260802 44029 30448 -289773 7447
5929 45951 40915 -150981 129519 -260138 -94630 -98933 -43040 -170972 181811 -127760 -87397
5918 -87397 106186 104695 -15106 -136143 -144502 202181 115304 266507 -6255 -88135 -318223
5907 -318223 201440 -295736 -135604 226660 -272182 -37836 47434 -87372 -52243 -34962 -49172
5896 -49172 130923 133769 200573 -179961 -317432 250087 -44200 -39376 359521 187854 70732
5884 71192 -157438 406068 -2893 -204985 -69300 -101783 99981 -110228 71265 9183 -327353
5872 37485 -10894 156854 -14709 205353 -176835 52469 -306875 -255236 -230961 -118803 -31629
5860 2932 -59481 -266146 7405 108958 -384325 -39976 157665 40867 -76557 44432 -258798
5848 203882 -92971 -7372 271222 412377 -193180 88599 218097 -65540 20453 29039 17319
5837 17319 -93724 340537 -425546 385373 209244 -174719 143339 -55090 -121901 174491
5826 170504 -84629 -77622 -312213 -132030 101564 195739 -143421 -268996 -430453 129657
5815 -94409 -92625 49555 10753 17747 83437 72546 96591 -253764 -238305 93611 -234558 -115930
5802 -9832 -341782 -175427 -69760 -112174 -12292 -300506 -154369 -23139 120643 51956 -90012
5790 183023 -108378 -32847 330459 -283486 -65507 52082 3477 -158014 154920 -190339 -23722
5778 -130425 133302 -214258 -78771 -79961 33680 -76887 -31093 -268984 39284 47912 154433
5767 154433 -201475 54283 174615 291945 -106077 313151 -164125 385379 24898 44697
5757 44697 -164775 -408062 233615 210189 139306 167568 265347 82407 -175422 174062 96108
5746 96108 -15744 39291 492333 -194364 172105 -2630 74702 68690 326495 17940 214523
5735 214523 -8971 149457 173396 91425 95644 257369 -250438 -225598 54119 41795 -306242
5723 193807 60939 -468916 295853 -302620 162895 174242 55873 283180 -161023 -283199
5713 -283199 309163 117324 85298 -247910 -32108 126636 102255 -210798 69086 169118
5703 169118 166643 -175092 -86464 208978 287601 -59672 119591 161139 -116855 81400 203889
5692 203889 101243 172204 -278918 -202359 -230182 -321080 303589 -211560 -69118 242563 -28718
5680 11925 -224654 135418 164940 85173 282060 23514 108373 282192 175310 -9526 102970
5668 -51025 -16680 206813 111952 -36034 -34962 255267 192401 -1762 -197835 -106214 -1378 138858
5655 134911 171544 225540 235304 201989 62729 426944 405074 -123186 -7891 -2972 -89818 168213
5642 -63342 24531 83165 38933 -114947 216923 140906 -44500 -313589 115878 -9473 244498
5630 -150043 -218518 48747 167028 69566 -178847 -12846 34165 -288342 69661 -184939 169802
5618 -108598 -101563 -363697 207906 109628 -254073 -214503 -179757 73719 -243049 -318092 115359
5606 -334305 276201 23753 4548 142858 -182237 -142751 -130937 228903 -226399 -261251 190859
5594 90482 24202 -347318 73253 141787 66029 -183114 -290058 70023 -292446 -272133 -163436
5583 -163436 -63913 -64782 -535790 -26836 -95772 -266281 -378986 2963 -330367 98437 -273552
5571 -122293 -5016 -23727 -48631 -559942 26600 139312 -36720 -7747 -144640 -25166 -350572
5560 -350572 -188978 -17000 -232830 -142341 133902 172847 -207350 236643 -239006 132664
5549 -1230 16643 85999 328182 226778 186892 2549 213964 121773 -128225 204691 87765
5537 -139725 -185958 -94854 -52120 542475 281090 -70845 -78820 82968 111834 105204 -174553
5525 52311 15271 -184877 4206 307297 263390 198271 -10883 -129931 30368 -36627 -303804
5514 -303804 -87677 -214466 170219 51182 161103 219852 -372395 -308135 -182245 -302 64679
5502 -154265 315334 34452 7814 185975 349223 88590 33411 90094 -11715 362870 -27481
5490 -100297 272666 458706 -303936 -195419 -402701 115155 100354 -203265 -138675 140786
5479 59789 -55021 -49768 202695 -49090 -147284 58701 -103298 -25438 12379 43986 -367579
5467 -6125 182032 85968 -40944 67198 -118965 162300 207503 -49046 -458178 63258 -131892
5455 47583 -61843 -198812 187145 -34396 128360 77884 20692 -9778 -163743 292 134883
5444 134883 -77134 -231306 -96657 -82394 -95009 147323 -118991 -157752 11441 61412 -4408
5432 135433 40487 150956 100482 49838 26829 -30554 -441745 171032 154611 -35111 57151
5420 28355 -272581 -153703 -116235 161722 338545 43850 -229321 86338 75203 -86081 209076
5408 -301378 -279514 226906 44182 284214 112934 181765 -50679 311991 -4701 71785 -228266
5396 -129428 19943 -103923 66925 -76595 70325 -113179 -72036 137469 223751 -48393 243596
5384 -66934 -111250 -135269 -359650 100956 -87417 -83485 217587 -35349 327783 7573 109575
5373 109575 -44060 27615 210283 23204 -131460 -170717 168753 416671 -165013 100542
5362 284133 119482 -115668 -511248 -2164 -65684 419435 -19196 193382 -126425 48707 -5997
5350 -43245 86743 -117545 -19718 -282114 -262784 -281503 -127833 -409730 111428 355570 87137
5338 198171 -56091 -120685 38869 36081 -287110 401513 101447 54388 -118856 366725 161470
5326 90266 375804 -284103 37007 -138107 -127424 99430 -38416 148580 -255566 -323916 -209767
5315 -209767 -249011 221915 345756 141348 79702 33763 -79761 -205361 -206603 124876 125380
5304 125380 203164 -67210 34740 -210994 -100657 -109160 -190113 -34960 210362 73417 160398
5293 160398 37212 -74204 137982 212603 -386588 100677 12377 -53566 51986 -145399 192330
5281 38675 249107 -54235 158095 371580 -154553 214252 13206 105213 22695 -145288 40912
5269 -61331 -91619 -302753 -156018 165660 -81983 257776 295461 299422 87224 -175736 68918
5257 326041 169315 91635 -203141 109405 -114234 -154738 -89988 -28004 -148542 -244338 -198064
5246 -198064 274635 69695 -302486 8297 86701 -42855 8599 -304695 407103 444150 -41754
5234 217039 -89603 -134224 -196838 -328249 -83350 -35309 18058 96764 -143071 429917 -306681
5222 -142690 35896 -128623 -128575 64090 -116204 97423 -51661 77238 -81979 -48626 137295 -116639
5209 -81883 83486 -70636 -103413 -159498 220368 355139 72160 -186686 -3416 -81539 -325691
5198 -325691 28250 60270 204283 161246 -182011 162353 -235670 -156618 220166 360690
5188 360690 212866 129054 -230789 -229513 -221555 152480 121921 -61923 75416 -101036 -112420
5177 -112420 -79569 30390 211906 -103034 -226232 147040 2304 -91204 -324782 -13227 -159541
5166 -159541 -10814 -56218 204556 260482 -207567 -48841 45666 298017 -63877 -202645 25867
5154 -60803 35514 35090 -151010 -379087 118400 -89195 168027 365952 -381139 32587 62569
5143 62569 134937 -32419 -3640 6299 78445 201783 109430 2315 -122804 -186334 -54345 101411
5130 -192094 -27608 -27230 133540 -169414 -103690 -21470 105263 238762 -126574 -55261 4041
5118 -111545 -421172 130598 229402 -144705 19988 28322 -169080 -222727 284789 358497 -265542
5106 -17476 159752 -71069 -294901 -124938 -115219 44301 118283 298236 181551 -86352 -188607
5095 -188607 -317382 -108224 39678 197140 -33479 -85997 233791 365686 35337 49245 253569
5084 253569 263221 -96591 27722 -82609 39894 -32028 79808 483446 -72241 256249 113493
5072 -244776 -115380 7426 -227002 307126 -51071 -184596 -36068 200263 -275098 31381 227813
5061 227813 -16124 199503 340445 -278691 171287 210430 52324 204204 68321 -109255
5050 -133088 -95567 -202221 -39266 8485 306568 -243574 -97681 -232903 -78764 111023 -202271
5038 -72976 140403 -474525 230747 -19584 60585 124675 -34525 71258 69646 128940 -52770
5026 139221 189594 -370786 118420 -362576 87485 -139016 277301 166128 -80298 -318945
5016 -318945 -59420 2775 265632 -161792 -248264 -20166 -132526 -79736 424729 84118 -86454
5004 -58487 -135611 271999 74460 63810 -152623 54798 33842 -40528 97842 -211246 -250053
4993 -250053 6339 -183440 -50256 93324 182263 -232953 192487 18933 4385 -15210 -145435
4982 -145435 204833 -67219 -15549 245322 -76585 1135 256716 -210730 238377 -313375 -12378
4970 197597 122892 107953 191011 -129852 -22791 85171 -37786 198234 197726 -41510 -107376 -111066
4958 -111066 354604 -82786 -112909 72246 95341 -245308 169237 318507 391407 121112 -87133
4946 212933 -183119 -146269 355096 -236937 24494 -210297 -203083 65842 48979 -115793 80970
4934 -184714 -160849 55780 86429 16583 -88927 109975 86995 294812 -272306 38034 4150
4922 -85423 28776 -2135 -274305 -308658 -12441 98026 -391828 -108755 9045 -181321 -68821
4910 59447 35401 -13319 19195 33793 -96597 36138 -117446 72395 141212 283356 36132
4898 195291 -265172 -222519 68019 12810 -214667 -160864 -63510 -18422 202580 106990 179439
4887 179439 -450255 64583 80221 169630 118979 -465645 96217 -40367 -140089 2237 67355
4876 67355 289667 -68628 -48363 131765 -174798 -168897 58661 -58385 41397 -94923 -3265 139445
4863 9121 18686 46030 77482 118521 71102 -77515 13808 103948 97668 118951 364785 72725
4850 -23653 5349 109881 53534 -185696 -148458 64744 484544 101878 -5058 -237204 8612
4838 85832 -92066 92225 133228 -17540 -58637 268833 -193753 42554 -212664 -68556 182865
4826 175798 264872 180447 89234 -44658 -229953 -14089 -31764 -132683 127129 -230598 -2147
4814 -59779 233541 -117637 -150007 33562 -53210 -61942 -8251 -14710 156213 35324 351302 273950
4802 273950 441987 -255245 116731 -176201 -103917 126107 53296 213361 325729 108224
4791 24571 -134137 -23474 -76458 159460 152493 -65872 -92867 -193702 -59829 -54311 -14759 228839
4778 -196070 -25731 -106804 -479149 74362 -119384 -171616 191769 49806 12998 -163376 245205
4766 -33888 200962 -256340 -3058 77238 -16198 193167 -124834 95482 72244 297871 -152889
4754 -103317 -10233 -348337 157575 -34723 31329 21895 -275366 164320 21823 49047 126235
4743 126235 -6219 -44628 -193043 -266594 295293 60929 177109 -94298 95476 352925 -73511
4731 152045 -261630 15771 -565409 -61093 -218990 22391 17906 25444 92192 -261507 88925
4719 -158528 -55987 -442324 34594 -89875 170639 -119862 151622 29347 148861 97426 157902
4708 157902 -83482 1769 -162069 15675 16753 -3319 -121709 145869 -250692 -271679 -22206
4696 118611 23232 -88608 -19372 419421 155293 -159476 17125 375429 63240 164801 -74623
4684 -96098 307117 42295 -197835 114972 -164662 -10485 -52587 68836 90153 14895 13231
4673 13231 275179 345414 35142 249035 7007 76234 -212414 -429879 -268522 34988 -157041
4661 9034 -119341 -114776 99764 86224 -92064 162464 -105970 -51843 -2205 41905 -233932 -4431
4648 -43003 -30990 64049 132245 305523 -182997 176263 -340965 -371967 -39368 -81285 96803
4636 -214946 -172212 195933 -103228 -24127 -11132 -7614 295485 184045 539680 70449 321493
4625 321493 81444 -77872 108881 -134368 314069 -73725 -147810 -237009 -253925 50268 19278
4613 43237 -71760 -139178 -57655 169964 -15218 -90620 197824 46866 -165656 -88326 -88864 214458
4600 -43565 -13181 -14391 61340 -389122 -45858 5774 -144765 -230926 -55077 -217905 46024 -25732
4587 95496 162583 166967 265672 234698 16945 -469709 179168 134532 16822 -241187 237510
4575 -108480 103911 184767 3586 -266364 -42916 -98608 120092 4168 159745 -20328 -26166
4564 -26166 -270286 -109750 136030 71453 -195048 186586 -127059 72912 61529 48668 316555
4553 316555 -81147 -12847 111991 -90065 107582 -32687 -33623 276254 -325632 -277478 -42249
4541 171764 -281648 -12809 88375 -24680 -51535 -140532 10191 135086 -20147 49397 261644
4530 261644 19506 137506 85790 211355 21830 112151 -93340 301228 294412 109349 245092
4519 245092 29474 -118996 -37779 -16692 367382 -82812 70171 -12780 -108624 -19404 -383303
4508 -383303 -170596 174679 72667 31946 48642 95218 -31783 198869 -131243 -254124 79608
$$ [...]
##END NTUPLES=NMR SPECTRUM
##END=
