
##TITLE=AC1302_PERAH12114_6535671_KetVU1Pe3j
##JCAMPDX= 6.0         $$ Bruker NMR JCAMP-DX V2.0
##DATA TYPE= NMR SPECTRUM
##DATA CLASS= NTUPLES
##ORIGIN= BRUKER
##OWNER= Administrator
$$ 1.72 TOPSPIN		Version 2.1
$$ 2012-12-12 01:25:13.382 -0500  Administrator@X
$$ Compression mode = diff/dup
##.OBSERVE FREQUENCY= 400.02188249412
##.OBSERVE NUCLEUS= ^1H
##.ACQUISITION MODE= SIMULTANEOUS (DQD)
##.ACQUISITION SCHEME= undefined
##.AVERAGES= 64
##.DIGITISER RES= 22
##SPECTROMETER/DATA SYSTEM= spect
##.PULSE SEQUENCE= noesygpps1d.comp
##.SOLVENT NAME= COFFEE_meoh
##.SHIFT REFERENCE= INTERNAL, COFFEE_meoh, 1, 14.96107
##AUDIT TRAIL= $$ (NUMBER, WHEN, WHO, WHERE, PROCESS, VERSION, WHAT)
$$ ##TITLE= Audit trail, TOPSPIN		Version 2.1
$$ ##JCAMPDX= 5.01
$$ ##ORIGIN= Bruker BioSpin GmbH
$$ ##OWNER= Administrator
$$ $$ E:\/data/COFFEE/nmr/AC1302_PERAH12114_6535671_KetVU1Pe3j/82/pdata/1/auditp.txt
$$ ##AUDIT TRAIL=  $$ (NUMBER, WHEN, WHO, WHERE, PROCESS, VERSION, WHAT)
(   1,<2012-12-12 01:25:06.413 -0500>,<Administrator>,<X>,<go>,<TOPSPIN 2.1>,
      <created by zg
	started at 2012-12-12 01:13:36.241 -0500,
	POWCHK enabled, PULCHK disabled,
       configuration hash MD5:
       86 BA 57 50 F2 9D 5C 9B 26 00 A9 28 5F 66 2E 89
       data hash MD5: 64K
       A6 D5 FE 38 A7 C1 89 0D 19 79 AD 9C 03 49 7D 99>)
(   2,<2012-12-12 01:25:09.648 -0500>,<Administrator>,<X>,<proc1d>,<TOPSPIN 2.1>,
      <Start of raw data processing
       efp LB = 0.3 FT_mod = 6 PKNL = 1 PHC0 = 0 PHC1 = 0 SI = 128K 
       data hash MD5: 128K
       0E 65 D6 F9 4B E5 87 B1 DB 96 8F AE 3E AE AB B3>)
(   3,<2012-12-12 01:25:11.569 -0500>,<Administrator>,<X>,<proc1d>,<TOPSPIN 2.1>,
      <pk PHC0 = -82.06238 PHC1 = 0 
       data hash MD5: 128K
       2A 2E 40 70 80 CA BF 14 A0 67 7D EC 64 19 65 E4>)
(   4,<2012-12-12 01:25:12.366 -0500>,<Administrator>,<X>,<proc1d>,<TOPSPIN 2.1>,
      <abs ABSG = 1 
       data hash MD5: 128K
       15 C3 53 80 2D 48 57 8B E6 0F 55 56 62 7E 96 F0>)
(   5,<2012-12-12 01:25:12.569 -0500>,<Administrator>,<X>,<proc1d>,<TOPSPIN 2.1>,
      <abs ABSG = 2 
       data hash MD5: 128K
       37 38 F4 C3 5F A3 74 99 DD D6 8F 26 B3 BC AA 78>)
(   6,<2012-12-12 01:25:12.710 -0500>,<Administrator>,<X>,<proc1d>,<TOPSPIN 2.1>,
      <abs ABSG = 3 
       data hash MD5: 128K
       60 4A BE E0 29 0E C4 ED D8 77 87 54 57 8B B7 1E>)
(   7,<2012-12-12 01:25:12.882 -0500>,<Administrator>,<X>,<proc1d>,<TOPSPIN 2.1>,
      <abs ABSG = 4 
       data hash MD5: 128K
       FF B4 41 C4 14 68 12 F1 16 05 EE 63 00 95 72 41>)
(   8,<2012-12-12 01:25:13.038 -0500>,<Administrator>,<X>,<proc1d>,<TOPSPIN 2.1>,
      <abs ABSG = 5 
       data hash MD5: 128K
       46 32 E2 56 E9 D0 41 73 98 25 86 A5 2D 4F F9 49>)
$$ ##END=
$$ 
$$ $$ hash MD5
$$ $$ DC CA 91 D5 1A 1F EB DA 20 6B DF 20 DC B9 50 D8
##$RELAX= 
##$RELAX= 
##$RELAX= 
##$RELAX= 
##$RELAX= 
##$RELAX= 
##$RELAX= 
##$RELAX= 
##$RELAX= 
$$ Bruker specific parameters
$$ --------------------------
##$DU= <E:\>
##$EXPNO= 82
$$ [...]
##$TP07= 0
##$TPNAME0= <>
##$TPNAME1= <>
##$TPNAME2= <>
##$TPNAME3= <>
##$TPNAME4= <>
##$TPNAME5= <>
##$TPNAME6= <>
##$TPNAME7= <>
##$TPOAL= (0..7)
0.5 0.5 0.5 0.5 0.5 0.5 0.5 0.5
##$TPOFFS= (0..7)
0 0 0 0 0 0 0 0
##$TUNHIN= 0
##$TUNHOUT= 0
##$TUNXOUT= 0
##$USERA1= <user>
##$USERA2= <user>
##$USERA3= <user>
##$USERA4= <user>
##$USERA5= <user>
##$V9= 5
##$VALIST= <valist>
##$VCLIST= <CCCCCCCCCCCCCCC>
##$VD= 0
##$VDLIST= <DDDDDDDDDDDDDDD>
##$VPLIST= <PPPPPPPPPPPPPPP>
##$VTLIST= <TTTTTTTTTTTTTTT>
##$WBST= 2048
##$WBSW= 25
##$XGAIN= (0..3)
0 0 0 0
##$XL= 0
##$YL= 0
##$YMAX_a= 6270448
##$YMIN_a= -12521919
##$ZGOPTNS= <>
##$ZL1= 120
##$ZL2= 120
##$ZL3= 120
##$ZL4= 120
##$ABSF1= 14.96107
##$ABSF2= -5.597112
##$ABSG= 5
##$ABSL= 3
##$ALPHA= 0
##$AQORDER= 0
##$ASSFAC= 0
##$ASSFACI= 0
##$ASSFACX= 0
##$ASSWID= 0
##$AUNMP= <proc_prof1d_extract.lims>
##$AXLEFT= 0
##$AXNAME= <>
##$AXNUC= <1H>
##$AXRIGHT= 0
##$AXTYPE= 0
##$AXUNIT= <>
##$AZFE= 0.1
##$AZFW= 0.1
##$BCFW= 0
##$BC_mod= 0
##$BYTORDP= 0
##$COROFFS= 0
##$CY= 15
##$DATMOD= 1
##$DC= 0
##$DFILT= <>
##$DTYPP= 0
##$F1P= 0
##$F2P= 0
##$FCOR= 0.5
##$FTSIZE= 131072
##$FT_mod= 6
##$GAMMA= 0
##$GB= 0
##$INTBC= 1
##$INTSCL= 1
##$ISEN= 128
##$LB= 0.3
##$LEV0= 0
##$LPBIN= 0
##$MAXI= 10000
##$MC2= 0
##$MEAN= 0
##$ME_mod= 0
##$MI= 0
##$NCOEF= 0
##$NC_proc= -2
##$NLEV= 6
##$NOISF1= 0
##$NOISF2= 0
##$NSP= 0
##$NTH_PI= 0
##$NZP= 0
##$OFFSET= 14.96107
##$PC= 1
##$PHC0= -82.06238
##$PHC1= 0
##$PH_mod= 1
##$PKNL= yes
##$PPARMOD= 0
##$PPDIAG= 0
##$PPIPTYP= 0
##$PPMPNUM= 2147483647
##$PPRESOL= 1
##$PSCAL= 4
##$PSIGN= 0
##$PYNMP= <proc.py>
##$REVERSE= no
##$SF= 400.020009609775
##$SI= 131072
##$SIGF1= 0
##$SIGF2= 0
##$SINO= 400
##$SIOLD= 131072
##$SPECTYP= <>
##$SREGLST= <1H.CDCl3>
##$SSB= 0
##$STSI= 131072
##$STSR= 0
##$SW_p= 8223.68421052631
##$SYMM= 0
##$S_DEV= 0
##$TDeff= 65536
##$TDoff= 0
##$TI= <>
##$TILT= no
##$TM1= 0
##$TM2= 0
##$TOPLEV= 0
##$USERP1= <user>
##$USERP2= <user>
##$USERP3= <user>
##$USERP4= <user>
##$USERP5= <user>
##$WDW= 1
##$XDIM= 131072
##$YMAX_p= 473422734
##$YMIN_p= -14899
##$CURPLOT= <Network HP LaserJet P1505>
##$CURPRIN= <$Network HP LaserJet P1505>
##$DFORMAT= <normdp>
##$LAYOUT= <+/1D_H.xwp>
##$LFORMAT= <normlp>
##$PFORMAT= <normpl>
##$SURQMSG= 1
$$ End of Bruker specific parameters
$$ ---------------------------------
##NTUPLES= NMR SPECTRUM
##VAR_NAME=  FREQUENCY,     SPECTRUM/REAL,   SPECTRUM/IMAG
##SYMBOL=    X,             R,               I
##VAR_TYPE=  INDEPENDENT,   DEPENDENT,       DEPENDENT
##VAR_FORM=  AFFN,          ASDF,            ASDF
##VAR_DIM=   131072,        131072,          131072
##UNITS=     HZ,            ARBITRARY UNITS, ARBITRARY UNITS
##FACTOR=    0.0627417313425164, 1,          1
##FIRST=     8223.62146879497, 1839,         -57147
##LAST=      0,             2120,            -57404
##MIN=       0,             -14899,          0
##MAX=       8223.62146879497, 473422734,    0
$$ Real data points
##PAGE= N=1
##DATA TABLE= (X++(R..R)), XYDATA
$$ [...]
63923D479004j36073j62940j85219k02529k14608k21694k24237k22320k16136
63914B693248k06857j95999j84037j70590j55932j41131j26647j12077r7675q4775
63904A217528p4150o5066n6716m9494m3880l9096l4012k8830k4681k1970k0126
63893G59507j8735j7847j7279j6534j5496j4494j3648j2703j1556j0382r194p772
63881E93867n944l677j015J724M019N900Q219J1540J5161J7975K0013K2201K4732
63868G14715K6737K7599K7734K7775K7864K7953K8044K7762K6480K4168K1521
63857A008352J8916J5920J2157P946L705m93m394p412r659j2332j6218k0489k3814
63844I72185k6095k8156l0196l1714l2662l3488l4104l3966l3194l2478l1745
$$ plain form
63923 4479004 4342931 4179991 3994772 3792243 3577635 3355941 3131704 2909384 2693248
63914 2693248 2486391 2290392 2106355 1935765 1779833 1638702 1512055 1399978 1302303 1217528
63904 1217528 1143378 1078312 1021596 972102 928222 889126 855114 826284 801603 779633 759507
63893 759507 740772 722925 705646 689112 673616 659122 645474 632771 621215 610833 601639 593867
63881 593867 587923 584246 583231 584955 588974 594874 603093 614633 629794 647769 667782 689983 714715
63868 714715 741452 769051 796785 824560 852424 880377 908421 936183 962663 986831 1008352
63857 1008352 1027268 1043188 1055345 1063291 1066996 1066503 1062109 1054697 1045038 1032706 1016488 995999 972185
63844 972185 946090 917934 887738 856024 823362 789874 755770 721804 688610 656132 624387
63833F24387l0138k7635k5447k4258k3235k1572j9867j8903j7972j5799j2736
63822C86825j0542j0065j0356j0212r502q594p567o559o068o198o180n344m174
63809B85464l606l629l331k345j416j244j478j343r01r72j859k869l319l450l810
63794B49892m135l641k335j243j093j526j935k299k614k308j110N6Q0p11j030
63779B24048n80k97o25q69o16n36j050j359p43J60L53J02L24Q68O95l73j333j493
63761B16676j276j231j127n17M11J015R05K46m54p09m04J59P29J405K236K844
63745B20908K901K675K513K132J169J78J35R81J607J446J053R53R24Q38J175K070
63729B43658K763K752K722L420M321M367L640L174L389L698L603L260K831K203
$$ plain form
63833 624387 594249 566614 541167 516909 493674 472102 452235 433332 415360 399561 386825
63822 386825 376283 366218 355862 345650 336148 327554 319987 313428 307360 301162 294982 289638 285464
63809 285464 281858 278229 274898 272553 271137 269893 268415 267072 266171 265199 263340 260471 257152 253702 249892
63794 249892 245757 242116 239781 238538 237445 235919 233984 231685 229071 226763 225653 225709 225789 225078 224048
63779 224048 223468 223171 222546 221677 221061 220525 219475 218116 217373 217533 217886 217988 218312 219180 219875 219502 218169 216676
63761 216676 215400 214169 213042 212525 212936 213951 214856 215102 214648 213939 213535 213694 214423 215828 218064 220908
63745 220908 223809 226484 228997 231129 232298 232476 232611 233592 235199 236645 237698 238651 239575 240413 241588 243658
63729 243658 246421 249173 251895 255315 259636 264003 267643 270817 274206 277904 281507 284767 287598 289801
63715B89801J489J080R29M65n14j466j868j901k001k256k531k784k834k258r91
63700B72360K66P38N55N96J387K583L549M013M074L949L887M105M509M697M321
63685C15589L377K039M56j025j753j345l70O1m76j272j478j059m61K69J342K438
63669C16332K791K204J367R30P19K79l54q35j219j910k928l722l813l325k793
63654C03723k580k618k591k390k355k892l821m322l825k701j764j220o11L41J323
63639B71697K004K496K968L246L183L143L623M536N257N447N388N509N930O607
63625C31034P584Q804R966J0844J1641J2794J4425J6246J7924J9346K0557K1689
63613E02854K2992K4647K6541K8387L0058L1491L2206L1367K8553K4194J8978
$$ plain form
63715 289801 291290 292370 293299 293764 293250 291784 289916 288015 286014 283758 281227 278443 275609 273351 272360
63700 272360 272626 273364 273919 274515 275902 278485 282034 286047 290121 294070 297957 302062 306571 311268 315589
63685 315589 318966 321005 321461 320436 318683 317338 316968 317029 316553 315281 313803 312744 312283 312552 313894 316332
63669 316332 319123 321327 322694 323624 324343 324622 324268 323433 322214 320304 317376 313654 309841 306516 303723
63654 303723 301143 298525 295934 293544 291189 288297 284476 280154 276329 273628 271864 270644 270033 270374 271697
63639 271697 273701 276197 279165 282411 285594 288737 292360 296896 302153 307600 312988 318497 324427 331034
63625 331034 338618 347422 357388 368232 379873 392667 407092 423338 441262 460608 481165 502854
63613 502854 525846 550493 577034 605421 635479 666970 699176 730543 759096 783290 802268
63602H02268J3125O748O41l892o202o888p088p394p651p566p299p475q755j1292
63588G41280j4544j7737k0517k2922k4801k5612k5043k3489k1593j9487j6924
63577E08611j4057j1524r609p740n292k499j86J301K352L358M278N133O290P882
63563D88298R353J0143J0483J0942J1531J1925J2376J3591J5639J7810J9781K2089
63551F53961K5221K8984L3187L7939M2547M4851M2739L6069K6407J5355M073n952
63539I85381j3055j6681j7789j7585j6392j3960j0470o978m951n281p544j0451
63527H44244j3313j6617k0763k4917k7986l0087l1913l3054l2356k9906k7228
63516E56104k5212k3252k0803j8469j6794j5241j3236j1282j0092r417q622p705
$$ plain form
63602 802268 815393 822141 822782 818890 812688 805800 798712 791318 783667 776101 768802 761327 752572 741280
63588 741280 726736 708999 688482 665560 640759 615147 590104 566615 545022 525535 508611
63577 508611 494554 483030 473421 465681 460389 457890 457704 459005 461357 464715 468993 474126 480416 488298
63563 488298 497651 507794 518277 529219 540750 552675 565051 578642 594281 612091 631872 653961
63551 653961 679182 708166 741353 779292 821839 866690 909429 945498 971905 987260 991333 985381
63539 985381 972326 955645 937856 920271 903879 889919 879449 872471 867520 862239 854695 844244
63527 844244 830931 814314 793551 768634 740648 710561 678648 645594 613238 583332 556104
63516 556104 530892 507640 486837 468368 451574 436333 423097 411815 401723 392306 383684 375979
63504C75979o937o091m963m042l765l667l102k339k004j972j750j476j533j547
63490C30791r11N6N35N62Q41J379J519J266J387K063K616K828L376M517N364N071
63474C63260M010L127K693K218J222l19k008l276l931m419n184n828n572m514
63460C41479l609l312l084k462j736j184n02M64J284J766K518M033N874P399Q740
63445C57668J0289J1886J3253J4735J6702J8767K0594K3051K7239L2360L5771
63434E82315L5577L2221K7215K1315J4667P958K445j008k307j608R63N084J0152
63421G34989J5563K0922K5910L0200L3563L5845L6744L5650L1961K5636J7589
63410A044572R405K450k901p084j0355j2214j2105j0536r101r190j0985j3848
$$ plain form
63504 375979 369042 362951 357988 353946 350181 346514 343412 341073 339069 337097 335347 333871 332338 330791
63490 330791 329880 329936 330471 331033 331874 333253 334772 336038 337425 339488 342104 344932 348308 352825 358189 363260
63474 363260 367270 370397 373090 375308 376530 376211 374203 370927 366996 362577 357393 351565 345993 341479
63460 341479 337870 334558 331474 329012 327276 326092 325590 326054 327338 329104 331622 335655 341529 348928 357668
63445 357668 367957 379843 393096 407831 424533 443300 463894 486945 514184 546544 582315
63434 582315 617892 650113 677328 698643 713310 721268 723713 722705 720398 718790 719753 724837 734989
63421 734989 750552 771474 797384 827584 861147 896992 933736 969386 1001347 1026983 1044572
63410 1044572 1053977 1056427 1053526 1046442 1036087 1023873 1011768 1001232 992131 982941 971956 958108
63398I58108j7347k1381k5565k9139l1674l3357l4268l3971l2253k9924k8096
63387F41133k6772k4903k1922j8555j5795j3728j1799r813p929n958l414l27K610
63374D82828M900O693Q186R128R401R713J1013J3346J5863J7993K0023K2337K4733
63361F56157K6890K9015L1458L3990L5979L7084L7164L5730L2229K6981K1045
63350A003722J4988Q514J685m267p997r507r902j0006r913r738j0076j1491j3992
63337I32020j7129k0396k3481k6317k8846l0681l1205l0210k8198k5749k2922
63326F46886j9558j5770j1662p011j990K034L158N92m857j1627j8055k2448k3693
63313E15999k2268j9902j7817j5852j3620j1621j0531r955q796o707m549l384
$$ plain form
63398 958108 940761 919380 893815 864676 833002 799645 765377 731406 699153 669229 641133
63387 641133 614361 589458 567536 548981 533186 519458 507659 497846 489917 483959 480545 480218 482828
63374 482828 487728 494421 502607 511735 521136 530849 541862 555208 571071 589064 609087 631424 656157
63361 656157 683047 712062 743520 777510 813489 850573 887737 923467 955696 982677 1003722
63350 1003722 1018710 1027224 1028909 1024642 1016645 1007138 997236 987230 977317 967579 957503 946012 932020
63337 932020 914891 894495 871014 844697 815851 785170 753965 723755 695557 669808 646886
63326 646886 627328 611558 599896 592885 590895 592929 596087 596679 591822 580195 562140 539692 515999
63313 515999 493731 473829 456012 440160 426540 414919 404388 394433 385637 378930 374381 370997
63301C70997l499m352n097n096m270l105k184j705j485j364j407j719k202k521
63287C30991k412k041j918k265k667k597k148j835j729j345m59M53P89M84p0m04
63271C10827j79N76J310J442J118J027J330J404Q55J44k21l70m63mJ431L220M212
63254C27659M054L337K727K603L278M674N930O175N735N763O601P448P832Q452
63240D02268R975J1848J3057J3563J4181J5389J7010J8877K0986K2932K3983K3995
63228F08064K3686K3687K3781K3471K2853K2390K2140K1839K1650K2082K3001
63217H58644K3439K2777K1633K0967K0717J9901J7895J4840J0854N652o75p196
63205A029448j2934j7806k2288k6449k9812l1976l2936l2741l1346k8840k5632
$$ plain form
63301 370997 367498 363146 358049 352953 348683 345578 343394 341689 340204 338840 337433 335714 333512 330991
63287 330991 328579 326538 324620 322355 319688 317091 314943 313108 311379 310034 309575 310028 310817 311301 311231 310827
63271 310827 310648 311224 312534 313976 315094 316121 317451 318855 319710 319854 319633 319263 318800 318796 320227 323447 327659
63254 327659 331713 335050 337777 340380 343658 348332 354262 360437 366172 371935 378536 385984 393816 402268
63240 402268 412243 424091 437148 450711 464892 480281 497291 516168 537154 560086 584069 608064
63228 608064 631750 655437 679218 702689 725542 747932 770072 791911 813561 835643 858644
63217 858644 882083 904860 926493 947460 968177 988078 1005973 1020813 1031667 1037319 1036644 1029448
63205 1029448 1016514 998708 976420 949971 920159 888183 855247 822506 791160 762320 736688
63194G36688k2217j8939j5903j2911r546n565j324K365M964O747Q519J0838J3533
63181F97249J5971J7759J9050K0188K1161K1672K1625K1286K0917K0532K0137
63170I17547J9878J9769J9460J8524J6797J4242J0668N940L53n444j0873j5665
63158A011196j9803k3482k7019l0485l3377l4903l4705l3224l1348k9733k8449
63147F84668k7084k5183k2670j9845j7058j4532j2501j1202j0476r670q275o601
63135D99571n453n085m867m084k784j532o45J6N32P14N57N29J048J847K327K469
63119D85160K945M067N147N289M468L440K783K572K750L189L475L197K615K367
63105E33464K458K084Q84l60o46j9O65Q99Q93R18Q04K15q61j968k477k161j445
$$ plain form
63194 736688 714471 695532 679629 666718 657172 651607 650283 652648 657612 664359 672878 683716 697249
63181 697249 713220 730979 750029 770217 791378 813050 834675 855961 876878 897410 917547
63170 917547 937425 957194 976654 995178 1011975 1026217 1036885 1042825 1043178 1037734 1026861 1011196
63158 1011196 991393 967911 940892 910407 877030 842127 807422 774198 742850 713117 684668
63147 684668 657584 632401 609731 589886 572828 558296 545795 534593 524117 514447 506172 499571
63135 499571 494118 489033 484166 480082 477298 475766 475121 475137 475669 476383 476940 477469 478517 480364 482691 485160
63119 485160 488105 492172 497319 502608 507076 510516 513299 515871 518621 521810 525285 528482 531097 533464
63105 533464 535922 538006 538890 538530 537884 537865 538530 539429 540322 541240 542044 542259 541398 539430 536953 534792 533347
63088E33347r29o06L9J085J915K135K236K812L622M066M259M849N893O596O334
63073E77653N416M671M690N552O925Q312R438J0488J1736J3048J4133J5167J6691
63060G03920J8751K0753K2362K4091K6590K9736L2847L5692L8715M2275M5996
63049A041728M9161N1440N3071N4410N5601N6595N7189N7054N6041N4619N3648
63038A640557N3486N3619N3511N3394N3667N3844N2874N0488M7317M3587L8507
63027B194851L1308K2129J1387q97j4488k8325m1220n2705o2488o9682p3554p4642
63015A841674p4136p2376o8915o3896n8150n1939m4775l6767k9015k2094j5195
63004A304416p486L63O976J2130J6835K1792K6579L0431L3143L4972L6115L6669
$$ plain form
63088 533347 532418 531812 531851 532936 534851 536986 539222 542034 545656 549722 553981 558830 564723 571319 577653
63073 577653 583069 587740 592430 597982 604907 613219 622657 633145 644881 657929 672062 687229 703920
63060 703920 722671 743424 765786 789877 816467 846203 879050 914742 953457 995732 1041728
63049 1041728 1090889 1142329 1195400 1249810 1305411 1362006 1419195 1476249 1532290 1586909 1640557
63038 1640557 1694043 1747662 1801173 1854567 1908234 1962078 2014952 2065440 2112757 2156344 2194851
63027 2194851 2226159 2248288 2259675 2258778 2244290 2215965 2174745 2122040 2059552 1989870 1916316 1841674
63015 1841674 1767538 1695162 1626247 1562351 1504201 1452262 1407487 1370720 1341705 1319611 1304416
63004 1304416 1296930 1297293 1304269 1316399 1333234 1355026 1381605 1412036 1445179 1480151 1516266 1552935
62992A552935L6816L6813L6814L6854L6861L6595L5687L3901L1346K8109K3764
62981A926495J7586R463K75q997j8240k7761l7173m5487n2361n8376o3785o7807
62969A573832o9627o9397o7631o4454o0148n5767n2142m8732m4588m0045l6320
62958I64981l3634l1034k8136k5748k4381k3340k1892k0345j9350j8832j8256
62947G00033j7391j6283j5021j3993j3739j4102j4068j2987j1381j0070r124q302
62935E43572p741p488o909n545m166l872m378m271l037j818j782k594k952k150
62921D84869o02P67J282Q15k08j139j587j608j447j277j209j380j865k584l331
62906D69496l820l762l086k159j568j504j525j086l15K9n01j349j504o73L89Q43
$$ plain form
62992 1552935 1589751 1626564 1663378 1700232 1737093 1773688 1809375 1843276 1874622 1902731 1926495
62981 1926495 1944081 1953544 1953819 1944822 1926582 1898821 1861648 1816161 1763800 1705424 1641639 1573832
62969 1573832 1504205 1434808 1367177 1302723 1242575 1186808 1134666 1085934 1041346 1001301 964981
62958 964981 931347 900313 872177 846429 822048 798708 776816 756471 737121 718289 700033
62947 700033 682642 666359 651338 637345 623606 609504 595436 582449 571068 560998 551874 543572
62935 543572 535831 528343 521434 515889 511723 507851 503473 499202 496165 494347 492565 489971 487019 484869
62921 484869 484267 485034 486316 487131 486923 485784 484197 482589 481142 479865 478656 477276 475411 472827 469496
62906 469496 465676 461914 458828 456669 455101 453597 452072 450986 450671 450700 450199 448850 447346 446673 447062 447905
62890D47905O09Q3m84r17q05L6R73J192Q55Q80J493J863J517J173J588K219J954
62873D62134P22m36p99o04l72k78l27n09n62j39N81Q92M72o5Q7R00J551J396O47
62854D65291R6L48J347K451K951K644J934J395J266J330J213P05j24r31j262r03
62838D79751k11Q2l88j158j440j043m70j39J39O84J390J923K173K165J780R99
62822D86237K40k1J39L40O08J307K343L058L066K688K454K566L072L990N012N508
62806E22607N201M620M553N272O429P478Q003P932P673P834Q645R860J1297J3043
62792F30447J5051J6920J8526K0439K3412K7522L2178L6759M1047M5181M9506
62781I56988N4405O0002O6027P2026P7613Q2520Q6554Q9509R1029R0665Q8251
$$ plain form
62890 447905 448514 448597 448113 447196 446391 446427 447400 448592 449447 450327 451820 453683 455200 456373 457961 460180 462134
62873 462134 462856 462420 461621 461017 460645 460367 460040 459531 458969 458830 459411 460303 460775 460710 460797 461697 463248 464644 465291
62854 465291 465387 465735 467082 469533 472484 475128 477062 478457 479723 481053 482266 482971 482847 481916 480654 479751
62838 479751 479540 479622 479234 478076 476636 475593 475123 474984 475123 475807 477197 479120 481293 483458 485238 486237
62822 486237 486477 486456 486595 486935 487543 488850 491193 494251 497317 500005 502459 505025 508097 512087 517099 522607
62806 522607 527808 532428 536981 542253 548682 556160 564163 572095 579768 587602 596247 606107 617404 630447
62792 630447 645498 662418 680944 701383 724795 752317 784495 821254 862301 907482 956988
62781 956988 1011393 1071395 1137422 1209448 1287061 1369581 1456135 1545644 1636673 1727338 1815589
62770A815589Q4037P8060O9649N8109M3784K7860J1188n865k2514l7484n0175
62759B072238o1016p0297p7479q2235q5217q7001q7054q4740q0819p6886p3531
62748A205963o9928o5233n9593n3750m8307m3511l9315l5552l2209k9336k6622
62737G02607k3470j9851j6514j3987j1949j0097q875q569q275o886m665k832j870
62724E64767j253o43j59L91J401K496K898K886L822O262R167J1390J3006J4637
62710F31068J6373J8038J9804K1852K4024K6408K9648L4084L9013M3568M7797
62699I51677N2250N6879O1183O5200O9489P4078P8074Q0441Q0616P8355P3530
62688A721772O6302N7138M6311L3682J9254L829j1267k5101l7617m9114n9508
$$ plain form
62770 1815589 1899626 1977686 2047335 2105444 2149228 2177088 2188276 2182411 2159897 2122413 2072238
62759 2072238 2011222 1940925 1863446 1781211 1695994 1608993 1521939 1437199 1356380 1279494 1205963
62748 1205963 1136035 1070802 1011209 957459 909152 865641 826326 790774 758565 729229 702607
62737 702607 679137 659286 642772 628785 616836 606739 597864 589295 581020 574134 569469 566637 564767
62724 564767 563514 562871 562712 563103 564504 567000 569898 572784 576606 582868 592035 603425 616431 631068
62710 631068 647441 665479 685283 707135 731159 757567 787215 821299 860312 903880 951677
62699 951677 1003927 1060806 1121989 1187189 1256678 1330756 1408830 1489271 1569887 1648242 1721772
62688 1721772 1788074 1845212 1891523 1925205 1944459 1948288 1937021 1911920 1874303 1825189 1765681
62677A765681o8276p4955p9321q1168q0435p7680p3972p0008o5638o0670n5578
62666I77980n1040m7037m3053l8902l4818l0945k7347k4332k2066k0029j7608
62655F20803j5162j3699j3432j3450j2937j1953j0808r499q085o896n987n065
62643D93830m193l857l938l500k090n13L13N01N31K16p40j747j939j507j311j411
62627D68645j053j42L63j33r40j056m37K86Q61J565K444L056L109K985L312M081
62611D86946M551M201L542L608M675O019P027Q086R890J2320J4552J6229J7949
62598E99595K0491K3929K7698L1297L4623L7688M0237M1864M2547M2785M2946
62587I85700M2542M0580L6644L1210K4851J7549R102j76r514j8200k5731l1732
$$ plain form
62677 1765681 1697405 1622450 1543129 1461961 1381526 1303846 1229874 1159866 1094228 1033558 977980
62666 977980 926940 879903 836850 797948 763130 732185 704838 680506 658440 638411 620803
62655 620803 605641 591942 578510 565060 552123 540170 529362 519863 511778 504882 498895 493830
62643 493830 489637 485780 481842 478342 476252 475739 476052 476553 477084 477300 476560 474813 472874 471367 470056 468645
62627 468645 467592 467450 467813 467680 466740 465684 465247 465533 466394 467959 470403 473459 476568 479553 482865 486946
62611 486946 491497 495698 499240 502848 507523 513542 520569 528655 538545 550865 565417 581646 599595
62598 599595 620086 644015 671713 703010 737633 775321 815558 857422 899969 942754 985700
62587 985700 1028242 1068822 1105466 1136676 1161527 1179076 1188178 1188002 1178488 1160288 1134557 1102825
62575A102825l6073l8970m0694m1390m1286m0745l9850l8234l5679l2664k9901
62564F87339k7649k5733k3944k2075j9824j7211j4833j3189j2006j0688r249q153
62552D82785p369o314m819l523l073l328l565l162k067q73l97q41j451j322n06
62537D40175K28M85N17M95L33L08J011K297L099K875K546L390N475P926J0283
62522D81443J2710J5092J6919J8217J9810K2328K5460K8599L1660L4855L7981
62511G45074M0539M2428M3998M5260M5497M3933M0594L6225L1355K5735J8802
62500A159440J0561J827o343j3349j9158k3876k7333k9206k9468k8574k7078k5091
62488I42352k2324j8707j4721j0935p341l481P79M865P962R704J0204R587P792
$$ plain form
62575 1102825 1066752 1027782 987088 945698 904412 863667 823817 785583 749904 717240 687339
62564 687339 659690 633957 610013 587938 568114 550903 536070 522881 510875 500187 490938 482785
62552 482785 475416 469102 464283 460760 457687 454359 450794 447632 445565 444692 444295 443454 442003 440681 440175
62537 440175 440403 440888 441405 441900 442233 442541 443552 445849 448948 451823 454369 457759 463234 471160 481443
62522 481443 494153 509245 526164 544381 564191 586519 611979 640578 672238 707093 745074
62511 745074 785613 828041 872039 917299 962796 1006729 1047323 1083548 1114903 1140638 1159440
62500 1159440 1170001 1171828 1165485 1152136 1132978 1109102 1081769 1052563 1023095 994521 967443 942352
62488 942352 920028 901321 886600 875665 868324 864843 865622 870487 878449 888153 898357 907944 915736
62475I15736M897J406j977m999q096j1879j6362k0822k4400k6791k8232k9090
62463G49391k9528k9547k9046k7856k5829k3059j9902j6818j4145j1978j0162
62452E11521q420o613m876l490k592k029j457n45P40K023K776K936L095L885N174
62437E02128O138O152N331M158K861J371k90j930l430m856o222p368q147q591
62423D87305q789q701q223p415o549n905n580n463n251m585l430k302j861k189
62409D11062k712l001l236l548l406k252n53N63P60Q04J234J577J375J190J767
62394D01624K727L025K530K178K552L177L479L606L901M157L974L471L155L336
62380D46892M001N055O252P158P558P788Q278Q935R322R374R514J0127J1275J2933
$$ plain form
62475 915736 920633 922039 920062 915063 906967 895088 878726 857904 833504 806713 778481 749391
62463 749391 719863 690316 661270 633414 607585 584526 564624 547806 533661 521683 511521
62452 511521 503101 496488 491612 488122 485530 483501 482044 481499 482239 484262 487038 489974 493069 496954 502128
62437 502128 508266 514418 519749 523907 526768 528139 527849 525919 522489 517633 511411 504043 495896 487305
62423 487305 478516 469815 461592 454177 447628 441723 436143 430680 425429 420844 417414 415112 413251 411062
62409 411062 408350 405349 402113 398565 395159 392907 392354 392917 393677 394481 395715 397292 398667 399857 401624
62394 401624 404351 407376 409906 412084 414636 417813 421292 424898 428799 432956 436930 440401 443556 446892
62380 446892 450893 455948 462200 469358 476916 484704 492982 501917 511239 520613 530127 540254 551529 564462
62366E64462J5118J7733K0545K3426K6372K9373L2478L6014M0255M4945M9444
62355I00165N3414N6807N9073N9041N6067N0816M4385L7043K8481J9050R884J783
62343A376009n385j2030j8232k3974k9351l4171l7876m0232m1665m2488m2246
62332A048359m0396l7270l3776l0473k7494k5118k3521k2118k0032j7488j5881
62321G54792j6106j7433j8441j8613j8471j8562j8818j8809j8183j6936j5479
62310E58941j4267j3224j1855j0071q562p932p857p526o646n486m234k899j682
62297D56700r03n21k18J04L85Q62J840K965L468L276L272M142N452O290O358O077
62281D99549N982O499P866R765J1233J1523J1044J0915J1672J2837J3797J4523
$$ plain form
62366 564462 579580 597313 617858 641284 667656 697029 729507 765521 805776 850721 900165
62355 900165 953579 1010386 1069459 1128500 1184567 1235383 1279768 1316811 1345292 1364342 1374226 1376009
62343 1376009 1370624 1358594 1340362 1316388 1287037 1252866 1214990 1174758 1133093 1090605 1048359
62332 1048359 1007963 970693 936917 906444 878950 853832 830311 808193 788161 770673 754792
62321 754792 738686 721253 702812 684199 665728 647166 628348 609539 591356 574420 558941
62310 558941 544674 531450 519595 509524 500962 493030 485173 477647 471001 465515 461281 458382 456700
62297 456700 455797 455276 455058 455162 455547 456409 458249 461214 464682 467958 471230 475372 480824 487114 493472 499549
62281 499549 505531 512030 519896 529661 540894 552417 563461 574376 586048 598885 612682 627205
62269F27205J5298J6165J7026J7990J9286K0908K2623K4345K6299K8843L2169
62258H68157L6217M0732M5376M9757N3353N5529N5776N3944N0224M4888L8183
62247A392136L0391K1824J2724L425n400j2982j9220k4992l1403l8686m6021n2265
62235A229531n6619n8790n8961n7718n5632n2761m8873m4273l9927l6411l3100
62224F86466k8995k4195j9989j7375j5993j4741j2966j0785q570o704n633n600
62212E14920o160o389n835m977m470m182l452k143q75n3P93K190L678M197L504
62197D90746K575K462L254M379N447O414P263P989Q726R546J0285J0830J1350
62184E81266J1937J2215J1791J0877J0018R332Q526P576O885O732P053P782Q985
$$ plain form
62269 627205 642503 658668 675694 693684 712970 733878 756501 780846 807145 835988 868157
62258 868157 904374 945106 990482 1040239 1093592 1149121 1204897 1258841 1309065 1353953 1392136
62247 1392136 1422527 1444351 1457075 1460500 1455100 1442118 1422898 1397906 1366503 1327817 1281796 1229531
62235 1229531 1172912 1114122 1055161 997443 941811 889050 840177 795904 755977 719566 686466
62224 686466 657471 633276 613287 595912 579919 565178 552212 541427 532857 526153 520520 514920
62212 514920 508760 502371 496536 491559 487089 482907 479455 477312 476437 476384 477177 479367 483045 487242 490746
62197 490746 493321 495783 499037 503416 508863 515277 522540 530529 539255 548801 559086 569916 581266
62184 581266 593203 605418 617209 628086 638104 647436 655962 663538 670423 677155 684208 691990 700975
62171G00975J0654J2837J5951K0367K5661L0784L5110L8758M1797M3889M4830
62160A021613M4671M2915L8505L1333K3100J5848J0005M591r80o320j1109j5758
62148A198414k0699k5648k9877l2945l4891l5941l6166l5275l2842k8947k4493
62137H60690k0625j7774j5508j3220j0774q532o970o144n415m037k128o92l20
62124G48551k73N90K453M733P236J0111J2694J3499J1742Q323M890K394Q41j58
62110H27626r34j647k271k931m214o663r879j2613j3965j4066j3360j1934r871
62097G23278p682n760l774j221J706M305O223P595Q478Q751Q486P995P503P164
62083G73047P337Q288R727J1033J2024J3061J4398J5939J7675J9798K2110K3855
$$ plain form
62171 700975 711629 724466 740417 760784 786445 817229 852339 891097 932894 976783 1021613
62160 1021613 1066284 1109199 1147704 1179037 1202137 1217985 1227990 1232581 1231601 1225281 1214172 1198414
62148 1198414 1177715 1152067 1122190 1089245 1054354 1018413 982247 946972 914130 885183 860690
62137 860690 840065 822291 806783 793563 782789 774257 767287 761143 755728 751691 749563 748871 748551
62124 748551 748278 748868 751321 756054 763290 773401 786095 799594 811336 819659 824549 826943 827784 827626
62110 827626 826692 825045 822774 819843 815629 808966 799087 786474 772509 758443 745083 733149 723278
62097 723278 715596 709836 706062 704841 706547 710852 717075 724670 733148 741899 750385 758380 765883 773047
62083 773047 780384 788672 798399 809432 821456 834517 848915 864854 882529 902327 924437 948292
62071I48292K4604K4896K5578K6730K7714K8160K8417K8952K9751L0433L0594
62060A254121K9877K7873K4301J9232J3104O657P68l915p453j0612j4183j8312
62048A321458k2577k6531l0072l3362l6610l9704m2007m2741m1913m0539l9478
62037I25924l8365l6304l3442l1004k9573k8313k6306k3851k1697j9679j7149
62026F20241j4377j2438j1657j1133j0032q607p579p207p333p791q276q228p345
62013D98238o021m866m006l207k411j762j205m65N49J584K365K862L295L934M877
61998D93761N824O242N839M841L610K161K81j935l962n275n779n854o070o812
61984D86872p935q805q913q421p943p796p691p224o321n145l785k384j359j131
$$ plain form
62071 948292 972896 997792 1023370 1050100 1077814 1105974 1134391 1163343 1193094 1223527 1254121
62060 1254121 1283998 1311871 1336172 1355404 1368508 1375165 1375933 1372018 1364565 1353953 1339770 1321458
62048 1321458 1298881 1272350 1242278 1208916 1172306 1132602 1090595 1047854 1005941 965402 925924
62037 925924 887559 851255 817813 786809 757236 728923 702617 678766 657069 637390 620241
62026 620241 605864 593426 581769 570636 560604 551997 544418 537211 529878 522087 513811 505583 498238
62013 498238 492217 487351 483345 480138 477727 475965 474760 474295 474844 476428 478793 481655 484950 488884 493761
61998 493761 499585 505827 511666 516507 520117 522278 522559 520624 516662 511387 505608 499754 493684 486872
61984 486872 478937 470132 461219 452798 444855 437059 429368 422144 415823 410678 406893 404509 403150 402019
61970D02019j581k031j899j263o44l43j55K36P84J084R31P37J141K188L074L065
61954D07343K529K593L744N179N823N641N501O042P168Q574J0158J1843J3489
61941D95627J5115J6900J8742K0171K0891K1137K1332K1579K1632K1127J9855
61930G14108J8057J6457J5574J4959J3591J1129Q213N330K142j613n233p761r128
61917G95825r869j0021r096p040m441j778R40L732O454R106J1770J4116J5475
61904H15173J5551J4683J3206J0976P693L495j049n353r126j2340j4951j6727
61892H21231j7584j8007j8734j9761k0172j9293j7648j6310j5694j5480j5287
61881F27261j4810j3714j2177j1207j1545j2453j2468j1165r301p413n386l479
$$ plain form
61970 402019 400438 398407 396508 395245 394601 394258 394103 394339 395123 396207 397138 397875 399016 401204 404278 407343
61954 407343 409872 412465 416209 421388 427211 432852 438353 444395 451563 460137 470295 482138 495627
61941 495627 510742 527642 546384 566555 587446 608583 629915 651494 673126 694253 714108
61930 714108 732165 748622 764196 779155 792746 803875 812088 817418 819560 817947 812714 804953 795825
61917 795825 785956 775935 766839 759799 755358 753580 754520 758252 764706 773812 785582 799698 815173
61904 815173 830724 845407 858613 869589 877282 880777 879728 874375 865249 852909 837958 821231
61892 821231 803647 785640 766906 747145 726973 707680 690032 673722 658028 642548 627261
61881 627261 612451 598737 586560 575353 563808 551355 538887 527722 518421 511008 505622 502143
61869E02143k489k529k601j833l50J415L373N327O767P622Q586J0191J2250J4584
61855E62456J7488K0946K4218K6825K9168L1578L3546L4680L5571L6751L7474
61844H90701L6571L4042L0719K6752K1652J5562R304L218k897q572j2620j4597
61832A029835j5264j5122j3502r838n098r03K422N958J0345J4563J6927J6760
61820A037083J4648J1339O953J324n337j2449j9334k5277k9599l2205l3845l5343
61808H77958l6615l6962l6167l4617l2450k9436k5873k2683k0255j7922j5210
61797E69768j2752j1371j0758r908q441o801n460m570m152m006l630k822k104
61784D82993k105k631k963k755k231j731j564j926k450k255j066J19K41l82o21
$$ plain form
61869 502143 499654 497125 494524 492691 492341 493756 497129 502456 509223 516845 525431 535622 547872 562456
61855 562456 579944 600890 625108 651933 681101 712679 746225 780905 816476 853227 890701
61844 890701 927272 961314 992033 1018785 1040437 1055999 1065303 1068521 1065624 1057052 1044432 1029835
61832 1029835 1014571 999449 985947 976109 971011 970108 972530 978488 988833 1003396 1020323 1037083
61820 1037083 1051731 1063070 1070023 1071347 1066010 1053561 1034227 1008950 979351 947146 913301 877958
61808 877958 841343 804381 768214 733597 701147 671711 645838 623155 602900 584978 569768
61797 569768 557016 545645 534887 524979 516538 509737 504277 499707 495555 491549 487919 485097 482993
61784 482993 480888 478257 475294 472539 470308 468577 467013 465087 462637 460382 459316 459435 459676 459294 458673
61769D58673k19J00K3J32Q51J853K641L025K909K323J807J963K550K643J932J148
61753D84354J047J540K047K084J364o7j558k269k130j919k231k899l473l633l098
61738D69159j826n68l73j213j786j119K67J229J433J319J210J126J131J301J501
61723D72791J669K033K661L094K887K256J775J646J722J955K297K307J538L08
61709E00939m46l28k2m79j804l213l984m093l897l533k897k176j909k313k802
61694D67043k623j813j148j201j815k509k971l078k864k574k455k372j995j460
61680D36165j372j971k740l102l147l247l289k738j457o9N61N2j276k668l388
61665D06314l124k204j373j168j303r24K80J340J058k89j012j66J238J795J686
$$ plain form
61769 458673 458454 458554 458577 458709 459560 461413 464054 467079 469988 472311 474118 476081 478631 481274 483206 484354
61753 484354 485401 486941 488988 491072 492436 492369 490811 488542 486412 484493 482262 479363 475890 472257 469159
61738 469159 467333 466765 466392 465179 463393 462274 462541 463770 465203 466522 467732 468858 469989 471290 472791
61723 472791 474460 476493 479154 482248 485135 487391 489166 490812 492534 494489 496786 499093 500631 500939
61709 500939 500493 500165 500143 499664 497860 494647 490663 486570 482673 479140 476243 474067 472158 469845 467043
61694 467043 464420 462607 461459 460258 458443 455934 452963 449885 447021 444447 441992 439620 437625 436165
61680 436165 434793 432822 430082 426980 423833 420586 417297 414559 413102 413033 413594 413646 412370 409702 406314
61665 406314 403190 400986 399613 398445 397142 396218 396498 397838 398896 398607 397595 397429 398667 400462 402148
61650D02148J979K621K554J802J818L317N078N669N337N246N605N610M804L531
61636D57119K140O03j023k344l099l506m069n070o183o642o009m782l854l327
61622D09954k481j118j82n09j594k247k074j604j261r63o66o49j161k153l362
61607C87930m411m953n044n138n429n518n142m748m822m928m290l128k535k934
61593C24910l477l265k426j613j025n45l66q28j707k245k029j406r17o23l26j49
61577C01963m61j155j516j108m25k49n80p42n07l71n93o41K5J040J512J013r5
61560B97110j068j219l22J019J734J384O65M99R75J572J994K207K003J225K79
61545C10057j88j02Q3J19J25J70K43N92J446K480L089L170L014K610J730O95J24
$$ plain form
61650 402148 404127 406748 409302 411104 412922 416239 421317 426986 432323 437569 443174 448784 453588 457119
61636 457119 459259 459862 458839 456495 453396 449890 445821 440751 434568 427926 421917 417135 413281 409954
61622 409954 407473 406355 406173 405664 404070 401823 399749 398145 396884 395921 395255 394606 393445 391292 387930
61607 387930 383519 378566 373522 368384 362955 357437 352295 347547 342725 337797 333507 330379 327844 324910
61593 324910 321433 318168 315742 314129 313104 312559 312193 311365 309658 307413 305384 303978 303061 302438 302112 301963
61577 301963 301502 300347 298831 297723 297298 297049 296469 295727 295220 294849 294256 293615 293640 294680 296192 297205 297110
61560 297110 296042 294823 294501 295520 297254 298638 299303 299802 300777 302349 304343 306550 308553 309778 310057
61545 310057 309869 309767 309850 309969 310094 310264 310507 311099 312545 315025 318114 321284 324298 326908 328638 329333 329457
61528C29457j20p67j755k012j184m89j010k024k037r31L5J53l9M3J90J12J10N50
61510C18282J188J480J203M79m07r85q05r4J97n47j757k325j934j206p15m18n6
61493C11580M32J053J829K495K545J878J033N47L63J94J23M08R61J438J697J761
61477C30337J477P72Q7rL45M34K3k36K27J092J613J551J217R41P97P13M83q9q34
61458C40941j149o45L18J021J149Q88M95J97K85Q67J484J447O62k11n49l67l2
61441C46801L27P98J280J446J227J063J481K420L193L239K816K679L094L475L157
61426C78496K213J221M85j49p31r72p39l80k30NQ84K279L220K980K014J350J216
61409C93162P86n84k391l568l676l104k401j892j775j997k057j416k35O99Q51
$$ plain form
61528 329457 329337 328570 326815 324803 323619 323130 322120 320096 318059 317128 317163 317316 317277 317320 317510 317622 317732 318282
61510 318282 319470 320950 322153 322632 322225 321240 320435 320341 320538 319991 318234 315909 313975 312769 312054 311636 311580
61493 311580 312012 313065 314894 317389 319934 321812 322845 323392 323755 323949 324072 324480 325441 326879 328576 330337
61477 330337 331814 332586 332673 332664 333009 333443 333466 333230 333457 334549 336162 337713 338930 339871 340668 341381 341864 341775 340941
61458 340941 339792 339147 339465 340486 341635 342523 343018 343215 343500 344367 345851 347298 347960 347749 347200 346833 346801
61441 346801 347128 347926 349206 350652 351879 352942 354423 356843 360036 363275 366091 368770 371864 375339 378496
61426 378496 380709 381930 382415 382266 381535 380563 379824 379444 379214 379219 380103 382382 385602 388582 390596 391946 393162
61409 393162 393948 393364 390973 387405 383729 380625 378224 376332 374557 372560 370503 369087 368852 369551 370402
61394C70402L87k36o63o48j56L81M45J69J87O33R24P48N53O76P25M30M05J231
61376C76593K286K462J797J425J868K385K263J865J878K209K271K053K135K708
61362D06198L182K965K254J753J880K545L512M548N261N356N237N846P477R177
61348D67191R820R381Q560P586O237M841M163M183L957L012J945J307Q84M96N44
61333E34107J043R98l26k259l763m885o194p307p228n953m595l878l505k996k278
61318D80981j396m23K80M62N88J334K540L459L989M773O065P458Q871J0750J2948
61303E42679J4379J4291J3122J1622R800P292M302J553l74j381j825k349l307
61290F09804m204m287l842m128n641p225p540o697n807n395n122m718m228l451
$$ plain form
61394 370402 370789 370553 369890 369242 369086 369467 369912 370081 370268 370901 371825 372573 373126 373802 374527 374957 375362 376593
61376 376593 378879 381341 383138 384563 386431 388816 391079 392944 394822 397031 399302 401355 403490 406198
61362 406198 409380 412345 414599 416352 418232 420777 424289 428837 434098 439454 444691 450537 458014 467191
61348 467191 477011 486392 494952 502538 508775 513616 517779 521962 525919 528931 530876 532183 533067 533563 534107
61333 534107 535150 536148 535822 533563 529800 524915 518721 511414 504186 498233 493638 489760 486255 483259 480981
61318 480981 479585 479162 479442 479904 480492 481826 484366 487825 491814 496587 502652 510110 518981 529731 542679
61303 542679 557058 571349 584471 596093 605893 613185 617487 619040 618666 617285 615460 613111 609804
61290 609804 605600 601313 597471 593343 587702 580477 572937 566240 560433 555038 549916 545198 540970 537519
61276E37519k020j79J200J694J804K078K246J827J152J194K240L440M003M355
61262E62553N546P664R606J0506J0625J0574J0322R570Q489P380O025M151K187
61249F65198O91p01k733n052o453o732p083q229r262r053p898o931o489o003n116
61234E78154m077l222k711k644k829k561j284O03K087K720L021L619M450M965
61220E80291M840M355M133M544N316N801N691N319N121N017M624L921L331L138
61206F45442L128L026L014L554M681N885O803P759R167J0758J1932J2834J4249
61193G42232J6198J7519J7259J5781J3883J1598Q766O004M080K703J201j14n50
61180H56560p14j982m340o347p496q855j0830j2030j1407j0056r650j0215j0734
$$ plain form
61276 537519 535499 535320 536520 538214 540018 542096 544342 546169 547321 548515 550755 554195 558198 562553
61262 562553 568099 575763 585369 595875 606500 617074 627396 636966 645455 652835 658860 663011 665198
61249 665198 665889 665188 662455 657403 650950 644218 637135 628906 619644 610591 602693 595762 589273 583270 578154
61234 578154 574077 570855 568144 565500 562671 560110 558826 559429 561516 564236 567257 570876 575326 580291
61220 580291 585131 589486 593619 598163 603479 609280 614971 620290 625411 630428 635052 638973 642304 645442
61206 645442 648570 651596 654610 658164 662845 668730 675533 683292 692459 703217 715149 727983 742232
61193 742232 758430 775949 793208 808989 822872 834470 843236 849240 853320 856023 857224 857110 856560
61180 856560 855846 853864 849524 843177 835681 826826 815996 803966 792559 782503 772853 762638 751904
61167G51904j0998j1526j2248j2610j2608j2639j2663j2434j2126j1838j1005
61156F19209r258p410o468o089n135l377j530J02J761L070L028J288j515m601
61142E83075p334q829q522p204o326o124n538m124k787k226j774m55J714M089
61128E27635O302Q206R548J0261J0744J1439J2551J4215J6336J8149J8774J8567
61116F82727J9011K0809K2827K3510K2696K1419K0526K0123J9914J9411J8187
61105I11160J6364J4519J2710J0239O816L298N10k005n148q665j1486j3405j5302
61092I19605j7575j9475k0252k0131j9725j9170j8398j7702j7375j7096j6280
61081G16426j4931j3609j2534j1258r442p546o359n941n446m044j808M43J907
$$ plain form
61167 751904 740906 729380 717132 704522 691914 679275 666612 654178 642052 630214 619209
61156 619209 609951 602541 596073 589984 584849 581472 579942 580044 581805 584875 587903 589191 587676 583075
61142 583075 575741 566912 558390 551186 544860 538736 533198 529074 526287 524061 522287 521832 523546 527635
61128 527635 533937 542143 551691 561952 572696 584135 596686 610901 627237 645386 664160 682727
61116 682727 701738 722547 745374 768884 791580 812999 833525 853648 873562 892973 911160
61105 911160 927524 942043 954753 964992 971808 975106 975616 973611 968463 959798 948312 934907 919605
61092 919605 902030 882555 862303 842172 822447 803277 784879 767177 749802 732706 716426
61081 716426 701495 687886 675352 664094 654652 647106 640747 634806 629360 625316 623508 623951 625858
61068F25858K351K159K071K680L934N238O220P141Q324R526J0363J1016J1941
61055G08822J3053J3886J4502J5517J7104J8724K0048K1427K3190K5106K6870
61044I18249K8522L0023L1083L1851L3076L5041L6984L8188L9057M0435M2357
61033A304866M4362M6524M9218N2126N4437N5940N7063N8005N8755N9887O2399
61022A903582O6675P2432P9674Q8691R9070J09788J20565J32245J45863J62549
61012B981134J84590K15054K55670L06450L67940M42185N30685O33931P55084
61003F672723R02350J085143J308842J572320J859493K118356K249791K143341
60995A9912359J756147J168601N52309P0280j99352k58870j46368P5103K92882
$$ plain form
61068 625858 628209 630368 632439 635119 639053 644291 650511 657652 665976 675502 685865 696881 708822
61055 708822 721875 735761 750263 765780 782884 801608 821656 843083 866273 891379 918249
61044 918249 946771 976794 1007877 1039728 1072804 1107845 1144829 1183017 1222074 1262509 1304866
61033 1304866 1349228 1395752 1444970 1497096 1551533 1607473 1664536 1722541 1781296 1841183 1903582
61022 1903582 1970257 2042689 2122363 2211054 2310124 2419912 2540477 2672722 2818585 2981134
61012 2981134 3165724 3380778 3636448 3942898 4310838 4753023 5283708 5917639 6672723
61003 6672723 7575073 8660216 9969058 11541378 13400871 15519227 17769018 19912359
60995 19912359 21668506 22837107 23389416 23459696 23260344 23001474 22855106 22930209 23223091
60986B3223091L54583J47390l17018r02866j441062j823815k027595k075430j999221
60977A3138057j832340j613790j381760j161923r65423p95677o53141n35552m38987
60968C759464l60663k99165k52008k15240j85880j62963j45524j31240j18089
60959A888692j06008r5736q6788p7737o8097n8864n1347m6142m3025m1150l9367
60948A174431l7053l4731l3407l3252l3319l2618l0983k8824k6509k4292k2513
60937H36930k1424k0826k0216j9352j8463j7794j7101j5862j4034j2325j1531
60926F48002j1561j1414j0215q153o274n386n238m872l736k314j531j637j980
60913E73691j973j839k065k417k113r35L73J040J159J398K075K802K931K142P64
$$ plain form
60986 23223091 23577674 23725064 23408046 22505180 21064118 19240303 17212708 15137278 13138057
60977 13138057 11305717 9691927 8310167 7148244 6182821 5387144 4734003 4198451 3759464
60968 3759464 3398801 3099636 2847628 2632388 2446508 2283545 2138021 2006781 1888692
60959 1888692 1782684 1686948 1600160 1522423 1454326 1395462 1344115 1297973 1254948 1213798 1174431
60948 1174431 1137378 1102647 1069240 1035988 1002669 970051 939068 910244 883735 859443 836930
60937 836930 815506 794680 774464 755112 736649 718855 701754 685892 671858 659533 648002
60926 648002 636441 625027 614812 606659 600385 594999 589761 584889 581153 578839 577308 575671 573691
60913 573691 571718 569879 567814 565397 563284 562349 562722 563762 564921 566319 568394 571196 574127 576269 577033
60898E77033m35r34j023j471k592l906m808n263n598n948o172o158n893n434n030
60883E16368n167o133p553q600q751q202p554p193o979o499n654m831m402m155
60869D24695l533k357j015Q1Q42J283J416J521K064L080L934L960L102J765M79
60854D41317j74K99J804L554M762N164M789L715K377J565J580J787J479Q13M19
60839D75250M18L92Oq66k270l873m861m760m065l509l073k417j821j804k100j993
60823D38654j466j099r81p80p38j398k362k665k504l153m772n798n280m387m552
60808C96719n322n344m587m109m146l955l255k572k216k043k183k910l698l543
60794C46836k414j386j132j236j234j320j543j335m26N25R08J092J682K445K786
$$ plain form
60898 577033 576598 575664 574641 573170 570578 566672 561864 556601 551003 545055 538883 532725 526832 521398 516368
60883 516368 511201 505068 497515 488915 480164 471962 464408 457215 450236 443737 438083 433252 428850 424695
60869 424695 421162 418805 417790 417871 418713 419996 421412 422933 424997 428077 432011 435971 439073 440838 441317
60854 441317 441143 441442 443246 446800 451562 456726 461515 465230 467607 469172 470752 472539 474018 474831 475250
60839 475250 475668 476060 476066 475200 472930 469057 464196 459436 455371 451862 448789 446372 444551 442747 440647 438654
60823 438654 437188 436089 435108 434328 433590 432192 429830 427165 424661 421508 416736 410938 405658 401271 396719
60808 396719 391397 386053 381466 377357 373211 369256 366001 363429 361213 359170 356987 354077 350379 346836
60794 346836 344422 343036 341904 340668 339434 338114 336571 335236 334810 335335 336243 337335 339017 341462 344248
60779C44248K770K835K828K316J645J698K531L170K981K479K371K566K605K511
60765C79554K611K858K933K730K273J376Jj280j750j554j601k309l053l113k621
60750C77055k127j678r08J16Q05Q22M84J44l30j165k089k666l066m011n624o920
60734C48842o863n669m530m038l650k824k025j997k592k953k638j869q96J94J050
60719C07542J253J048J140J585J652J063N66P96J389J795K253L075L521K591O89
60704C31958n83l71O24J472K183L071L815L815L188K718K885L410L645L169K008
60689C67007N71n59r66o53M3P37J210J406J340J049O25K32j5j56k71l37l18l36
60671C70609n13o65n90o06j297k545l446l511l402l871m460m046k507j037o46
$$ plain form
60779 344248 347018 349853 352681 354997 356642 358340 360871 364041 367022 369501 371872 374438 377043 379554
60765 379554 382165 385023 387956 390686 392959 394335 394336 393056 391306 389752 388151 385842 382789 379676 377055
60750 377055 374928 373250 372342 372458 373263 374085 374569 374713 374383 373218 371129 368463 365397 361386 355762 348842
60734 348842 341979 336310 331780 327742 324092 321268 319243 317246 314654 311701 309063 307194 306298 306492 307542
60719 307542 308795 309843 310983 312568 314220 315283 315849 316645 318034 319829 322082 325157 328678 331269 331958
60704 331958 331375 331004 331628 333100 335283 338354 342169 345984 349172 351890 354775 358185 361830 364999 367007
60689 367007 367578 367019 366053 365400 365443 366180 367390 368796 370136 371185 371810 372042 372027 371871 371600 371263 370945 370609
60671 370609 370096 369431 368841 368235 366938 364393 360947 357436 354034 350163 345703 341657 339150 338113 337467
60656C37467j011j050k12J070J991K137J799J564J709K027K271K395K244J500
60642C55901K76o55p63n97j082k231l164l275k742j928r63j1O11Q08P37M48j17
60625C41253p96j293j585j731j407k65J247K072J762R41L86J88P0oJ48N39R09
60608C42432Q91K92n41q25j49R12J446J261Q35M45J7k75m4O53J357J951K665L304
60590C56627L317K648J853J158K87p27j335j290q86j95R91K227K498J664Q93J112
60574C70842J906K489K897L488M101M502N053O132P392Q321R002R667R978R458
60560D55228Q211O642M871K930J030q46l045n356o603n844l578j174M41J092J099
60545D55098J282K530M690O553P610Q838J1032J3348J4654J5347J6390J7294J6754
$$ plain form
60656 337467 336456 335406 335194 336264 338255 340392 342191 343755 345464 347491 349762 352157 354401 355901
60642 355901 356177 355522 354759 354162 353080 350849 347685 344410 341668 339740 338777 338766 339377 340185 340922 341370 341253
60625 341253 340457 339164 337579 335848 334441 334176 335423 337495 339257 340198 340584 340772 340842 340836 340984 341523 342432
60608 342432 343323 343615 343074 342249 342100 343012 344458 345719 346554 346999 347016 346741 346697 347350 348707 350658 353323 356627
60590 356627 359944 362592 364445 365603 365890 365163 363828 362538 361652 361457 362448 364675 367173 368837 369730 370842
60574 370842 372748 375237 378134 381622 385723 390225 395278 401410 408802 417123 426125 435792 445770 455228
60560 455228 463439 470081 474952 477882 478912 478066 475021 469665 463062 457218 453640 452466 452907 453999 455098
60545 455098 456380 458910 463600 470153 477763 486601 497633 510981 525635 540982 557372 574666 591420
60532E91420J4786J2506J0077O615K242j613m247o424q585r861r571q428p435
60519E81482o593n566m639m088l373j915j90Q23R63Q91J058J389J915L078N215
60504E70450Q033J0788J2999J5095J8159K2740K8065L2813L6592L9981M3159M5303
60492H84177M5664M4509M2463L9347L4221K6424J6207M507p534j8949k9150l7793
60480A044093m4538m9051n1204n1050m8750m4844m0401l6357l2726k8982k5191
60469E90999k2107k0011j8178j5859j3266j1135r760q874q163p528o921o314n715
60456D37168n023m055k860j887j640k232l282m077l965k941j846j639k349l091
60442C96281l088k349j312l24L51M73M4o19j188j501j475j183r84j113j169n87
$$ plain form
60532 591420 606206 618712 628789 635404 637646 636033 631786 625362 616777 606916 597345 588917 581482
60519 581482 574889 569323 564684 560596 557223 555308 555118 555941 556904 557795 558853 560242 562157 565235 570450
60504 570450 578483 589271 602270 617365 635524 658264 686329 719142 755734 795715 838874 884177
60492 884177 929841 974350 1016813 1056160 1090381 1116805 1133012 1137519 1129985 1111036 1081886 1044093
60480 1044093 999555 950504 899300 848250 799500 754656 714255 677898 645172 616190 590999
60469 590999 568892 548881 530703 514844 501578 490443 480683 471809 463646 456118 449197 442883 437168
60456 437168 432145 428090 425230 423343 421703 419471 416189 412112 408147 405206 403360 401721 399372 396281
60442 396281 393193 390844 389532 389208 389559 390032 390076 389457 388269 386768 385293 384110 383126 382013 380844 380257
60426C80257L27N40k36r27m45Q45J702J694J570J972K533K442J544N25J21L69
60410C94833P38P96N57J85k89p12o25J66J056J269R66J095J984K771K624J915
60394D09329J706K360L241L607L368K936K689K713K810K736K477K294K449K920
60380D47635L399L539L204K615K171K088K234K412K619K900L120L218L441L940
60366D88535M330M045L128K213J770J771J995K219K190J948K155L440N402O928
60352E32069P612Q114Q881R315Q750P524O399N347L694J244j446l851n877p447
60338E80328q217q015p202o353n694n048m271l517l077l070l405l971m574m864
60324E09050m656m347m566n172n159l908k094p90j11O56J915L505N317P339R189
$$ plain form
60426 380257 380584 381124 380888 379961 379516 380361 382063 383757 385327 387299 389832 392274 393818 394343 394464 394833
60410 394833 395571 396367 396924 397109 396820 396108 395483 395649 396705 397974 398940 400035 402019 404790 407414 409329
60394 409329 411035 413395 416636 420243 423611 426547 429236 431949 434759 437495 439972 442266 444715 447635
60380 447635 451034 454573 457777 460392 462563 464651 466885 469297 471916 474816 477936 481154 484595 488535
60366 488535 492865 496910 500038 502251 504021 505792 507787 510006 512196 514144 516299 519739 525141 532069
60352 532069 539681 547795 556676 565991 574741 582265 588664 594011 597705 598949 597503 593652 587775 580328
60338 580328 572111 564096 556894 550541 544847 539799 535528 532011 528934 525864 522459 518488 513914 509050
60324 509050 504394 500047 495481 490309 485150 481242 479148 478358 478247 478903 480818 484323 489640 496979 506168
60309E06168J0418J1228J2042J2551J2147J1239J0985J1480J1400R872P580N423
60297F32533L154J54l353o789j0172j3537j6040j6617j5367j3378j1465r779q408
60284E10936p528p014o566o152n806n298m463l630l095k513j556p86j020j960
60270D53549k397j813r77p34j002j209j107p84l37J08L64M20M68N57N50M55M94
60253D46605O56N31j70j142j769j727j187n28J1L94N81M47k1n35p59p95j058j558
60235D37976j745j258l90N01J539K819L772L748L026K489K364K050J255N58N13
60220D59217R20J393K140L546N290O466O601O088N536N126M834M894N540O374
60206E23965O476N395L814K831K849L388L898M238M384M197L657K945K125J052
$$ plain form
60309 506168 516586 527814 539856 552407 564554 575793 586778 598258 609658 619530 627110 632533
60297 632533 635687 635841 632488 625699 615527 601990 585950 569333 553966 540588 529123 519344 510936
60284 510936 503408 496394 489828 483676 477870 472572 468109 464479 461384 458871 457315 456529 455509 453549
60270 453549 451152 449339 448362 447628 446626 445417 444310 443526 443189 443297 443661 444081 444549 445106 445656 446111 446605
60253 446605 447261 447792 447622 446480 444711 442984 441797 441269 441280 441674 442255 442702 442681 442146 441387 440592 439534 437976
60235 437976 436231 434973 434583 435084 436623 439442 443214 446962 449988 452477 454841 456891 458146 458704 459217
60220 459217 460137 461530 463670 467216 472506 478972 485573 491661 497197 502323 507157 512051 517591 523965
60206 523965 530441 535836 539650 542481 545330 548718 552616 556854 561238 565435 569092 572037 574162 575214
60192E75214j59j030j327j509k122l010l494l248k641k216k093j914j385q49j139
60177E47078k572m156m381k945j117j68nJ80N11M64j34q77j479j978k242j923
60161E24256j149n96o48q79o87j14K96K97J99K97L99N9p55j540j743j259l26P49
60143E16856J596J798J324Q18J018J980L188M237M932M984M362L807M118M813
60129E59831M525K946J357P92P32L37l3M26J430J934J664J252J106J087J128J288
60113E81802J232N32n38j244j396j448j687j991k324k758l003k650j923j502j564
60098E59538j619j342q74l00M68J234J685K120L157M572N184M381L009K206J958
60083E85377J471N32k13l04j71n59j606k776l589m139m808n647o431p116p791
$$ plain form
60192 575214 575055 574025 572698 571189 569067 566057 562563 559315 556674 554458 552365 550451 549066 548217 547078
60177 547078 544506 540350 535969 533024 531907 531739 531734 531914 532425 532889 532755 531878 530399 528421 526179 524256
60161 524256 523107 522511 521863 520984 520297 520183 520479 520776 520975 521272 521671 521730 520975 519435 517692 516433 516107 516856
60143 516856 518452 520250 521574 522392 523410 525390 528578 532815 537747 542731 547093 550900 555018 559831
60129 559831 564356 567302 568659 569451 570183 570520 570487 570913 572343 574277 575941 577193 578299 579386 580514 581802
60113 581802 583034 583566 583028 581784 580388 578940 577253 575262 572938 570180 567177 564527 562604 561102 559538
60098 559538 557919 556577 555703 555403 555871 557105 558790 560910 564067 568639 573823 578204 581213 583419 585377
60083 585377 586848 587380 587167 586863 586692 586133 584527 581751 578162 574023 569215 563568 557137 550021 542230
60068E42230q092p338n629m134l860m536n254n692n996o033n598n026m657m019
60054D66366k562r90o20j378j702o87P99J644J972K445K995L168L073L153L427
60039D81103L619L733L804L394K075K73r86j252j006r52j279j811k433l108l661
60024D81513l780l399k990l213m205n377o102o344o330n977n134m183l710l661
60010D17108l458l005k837l080l013k073p35J11K15n8m19p82r42o59j6O67J200
59993C98224J566J685J517J328J456J818J935J648J466J955K830L115K308J034
59979D23885K16o6l96r09j134r39q92j297j683j652j507j465j021J27J192J243
59963D13702O02K28K45J24l0L67J096J292R42Q78J159Q16l94j273r22l7K31j23
$$ plain form
60068 542230 534138 526800 521171 517037 513177 508641 503387 497695 491699 485666 480068 475042 470385 466366
60054 466366 463804 462814 462194 460816 459114 458427 459226 460870 462842 465287 468282 471450 474523 477676 481103
60039 481103 484722 488455 492259 495653 497728 498001 497015 495763 494757 493805 492526 490715 488282 485174 481513
60024 481513 477733 474334 471344 468131 463926 458549 452447 446103 439773 433796 428662 424479 420769 417108
60010 417108 413650 410645 407808 404728 401715 399642 398907 399018 399233 399175 398756 397974 397032 396373 396357 397024 398224
59993 398224 399790 401475 402992 404320 405776 407594 409529 411177 412643 414598 417428 420543 422851 423885
59979 423885 424101 424035 423639 422730 421596 420657 419765 418468 416785 415133 413626 412161 411140 411267 412459 413702
59963 413702 414304 414532 414777 414901 414871 415238 416334 417626 418568 419446 420605 421421 421027 419754 418832 418795 419026 418903
59945D18903l89l97m65o15o16n10n13n88o42q03j145j435j450j276j034o50q2
59928D06293N74J374K473L741M842N669O175N951M790L479K952K724J440p68j956
59913D49753j012P45J492J168P80O01L58L99J189K099K056J135M37N06Q92J097
59897D63695J079R12O95P39J189J703K027K540L524M473M850N030N578O123N964
59882E10121N432N455O092O633O941P478Q001P539N887M056K855J995Q78n16j826
59867E77021k735k966k538k120k386k986k917j993j015m04L15J284J706J150O44
59852E60060J528L728N907P057P291P164O810N849L956J452p08j712j570q67J0
59837F05955R24J462J026l91k068l385m363n173n646n527m824l765k678j989j854
$$ plain form
59945 418903 418514 418117 417652 417037 416421 415911 415398 414810 414168 413365 412220 410785 409335 408059 407025 406375 406293
59928 406293 406867 408241 410714 414455 419297 424966 431141 437092 441882 445361 448313 451037 452477 451709 449753
59913 449753 448741 449486 450978 452146 452926 453527 453885 454284 455473 457572 459628 460763 461200 461706 462598 463695
59897 463695 464774 465686 466381 467120 468309 470012 472039 474579 478103 482576 487426 492456 498034 504157 510121
59882 510121 515553 521008 527100 533733 540674 548152 556153 563692 569579 573635 576490 578485 579363 578847 577021
59867 577021 574286 571320 568782 566662 564276 561290 558373 556380 555365 554961 555276 556560 558266 559416 560060
59852 560060 561588 565316 571223 578280 585571 592735 599545 605394 609350 610802 610094 608382 606812 605945 605955
59837 605955 606879 608341 609367 608976 606908 603523 599160 593987 588341 582814 577990 574225 571547 569558 567704
59822E67704j847j484j064j328k258k980l112l283l937m491m333l926m079m640
59808E24942m823m486m189m120l825l128k602k787l458l882l504k250n80O40O69
59793D82617l80j500j730j040j74K46K50K05K22P8l72q23p46J1R31J286Q72K36
59775D80189N8L65N90M32M17J237K686L719L666K992K572K607K658K476K273K260
59759E11197K371K472K487K323K002J874K291L076L687L955M205M566M660M217
59745E55383L657L584L949M070L524K678K289K635L209L211K367J223N33O38J364
59730E94314K391L326L636K991J766R30J123K007K594K158Q11o07j271j058n84
59715F14527m50o20p76r71j475k040j986j194m40l71n94k78N78J087O37l03p67
$$ plain form
59822 567704 565857 564373 563309 561981 559723 556743 553631 550348 546411 541920 537587 533661 529582 524942
59808 524942 520119 515633 511444 507324 503499 500371 497769 494982 491524 487642 484138 481888 481308 481948 482617
59793 482617 482237 480737 479007 477967 477793 478039 478289 478494 478716 478794 478422 477599 476853 476864 477795 479081 479953 480189
59775 480189 480247 480612 481202 481634 482051 483288 485974 489693 493359 496351 498923 501530 504188 506664 508937 511197
59759 511197 513568 516040 518527 520850 522852 524726 527017 530093 533780 537735 541940 546506 551166 555383
59745 555383 559040 562624 566573 570643 574167 576845 579134 581769 584978 588189 590556 591779 592312 592950 594314
59730 594314 596705 600031 603667 606658 608424 609354 610477 612484 615078 617236 618047 617440 616169 615111 614527
59715 614527 614077 613457 612681 611710 610235 608195 606209 605015 604575 604204 603610 603332 603910 604997 605634 605331 604564
59698F04564l40N97J493K149K567K556J845N90n46j010r08p43p60q86j171j796
59682F08201k553k775k169j461j763l347n333o608o833o443n964n559n129m594
59668E47670l976l402l016k802k458j709p67k36l19m34R4J158K104K635K980L214
59652E40736L037K325J402N67k14r46j408j589j871k477l184l777m351m798m635
59637E18817l760k863k484k198j382l61J7l20o92q23j153j935k784l262l344l207
59621D88266l111l449m313n015m763l834l353l724m082l591k528j577p77K06J237
59606D45592J821J864J748J723J682J504J282J192J320J606J790J588J092Q98
59592D66702J578K999M320M716M067K895J696M71r24k212k841k798k741l054l225
$$ plain form
59698 604564 604224 604821 606314 608463 611030 613586 615431 616021 615475 614465 613557 612814 612054 611168 609997 608201
59682 608201 605648 602873 600704 599243 597480 594133 588800 582192 575359 568916 562952 557393 552264 547670
59668 547670 543694 540292 537276 534474 532016 530307 529540 529304 528985 528551 528645 529803 531907 534542 537522 540736
59652 540736 543773 546098 547500 548067 547853 546907 545499 543910 542039 539562 536378 532601 528250 523452 518817
59637 518817 515057 512194 509710 507512 506130 505769 505786 505466 504774 503951 502798 500863 498079 494817 491473 488266
59621 488266 485155 481706 477393 472378 467615 463781 460428 456704 452622 449031 446503 444926 444149 444355 445592
59606 445592 447413 449277 451025 452748 454430 455934 457216 458408 459728 461334 463124 464712 465804 466702
59592 466702 468280 471279 475599 480315 484382 487277 488973 489444 488520 486308 483467 480669 477928 474874 471649
59577D71649k699j902j721k173k385j901j203p93n15j24Q0k91j039j624j894k139
59561D49326k500k604j925m55R55J235L03o11l27Q48J630J598J663K594L939M811
59545D60480N072N192N506O165P514R896J3322J7540K2033K5362K5188J9960J0809
59532F34039J128o005r710j0822j0248q368n605k813p74L94J000J114N85l35r54
59517E82626j050j320k423l963n041n543o122o998p616p617p332p111o843o500
59503E07147o411o525o131m862l454k862l013l026k402j360l08M95Q62Q18P26
59488D69694Q34Q77N07k9j90Q9M43P61J299K058K677L020L414M106M812N052M667
59471E04091L886L040K318J660Q30k65j292j715j293k97P34J412J749K200L230
$$ plain form
59577 471649 468950 467048 465327 463154 460769 458868 457665 456872 456357 456233 456313 456022 454983 453359 451465 449326
59561 449326 446826 444222 442297 441842 442797 444032 444335 443724 443397 444245 445875 447473 449136 451730 455669 460480
59545 460480 465552 470744 476250 482415 489929 499825 513147 530687 552720 578082 603270 623230 634039
59532 634039 635167 629162 619452 608630 598382 590014 584409 581596 580822 581216 582216 583330 583915 583580 582626
59517 582626 581576 580256 577833 573870 568829 563286 557164 550166 542550 534933 527601 520490 513647 507147
59503 507147 500736 494211 488080 483218 479764 476902 473889 470863 468461 467101 466793 467288 468150 468968 469694
59488 469694 470528 471405 471912 471883 471693 471782 472225 472986 474285 476343 479020 482040 485454 489560 494372 499424 504091
59471 504091 507977 511017 513335 514995 515825 515560 514268 512553 511260 510963 511697 513109 514858 517058 520288
59456E20288M734O020O594O738P088P737Q184Q024P291O202M943L687K426P31
59442F00687j815m792p053p833p466o657n613m278l087k699l036l263k847k119
59428E38129j489o41R81L225N276O617P508Q531J0098J2368J5248J8227K0595
59415F44673K2116K3451K5613K8776L1382L0491K3768J1824j470j1718j7138j8740
59403G93028j7832j4480q561j138N920J0839J1972Q022n11j0558j8430k2606k3991
59390G11674k3825k2439j9865j6560j3148j0070p608n690l784j637N3M74K0j89
59376E87406J51M69P52J689L146L871L325K551K524K721K299J725K091L310M186
59361F22216L981L070K212J947K568L941N426O535P555R025J0853J2483J3756
$$ plain form
59456 520288 525022 531042 537636 544374 551462 559199 567383 575407 582698 588900 593843 597530 599956 600687
59442 600687 598872 594080 587027 579194 571728 565071 559458 555180 552093 549394 546358 543095 540248 538129
59428 538129 536640 535999 536980 540205 545481 552098 559606 568137 578235 590603 605851 624078 644673
59415 644673 666789 690240 715853 744629 776011 806502 830270 842094 840624 828906 811768 793028
59403 793028 775196 760716 752155 751017 756937 767776 779748 787770 787259 776701 758271 735665 711674
59390 711674 687849 665410 645545 628985 615837 605767 598159 592469 588685 587048 587101 587575 587595 587406
59376 587406 587557 588026 588778 590467 593613 597484 600809 603360 605884 608605 610904 612629 614720 618030 622216
59361 622216 626197 629267 631479 633426 635994 639935 645361 651896 659451 668476 679329 691812 705568
59348G05568J4979J6209J7081J7304J6907J6001J4730J3378J2154J0860R077O559
59336H70807L261p37m920q281j0150j1010j1915j3204j4312j4779j4772j4440
59324G55548j3449j1651r763q830r044r527r353q466p457o714o151n645n323n209
59310F38966m945m200l105k044j073Q8J673L841O829J0527J3804J4795J2148O075
59296F93379j682q816j3712j6316j7659j8312j7688j5311j2135r656q011o095
59284E47986l497j173M0M70Q14J237J741K527L577M600N747P548R711J1011J0920
59269F03259J0415J0516J0890J0661R777Q693P430N862M286K873J101j364l798
59256F80601n311o073o738p221p023o366n865n457m627l496k588j753m27J172
$$ plain form
59348 705568 720547 736756 753837 771141 788048 804049 818779 832157 844311 855171 864248 870807
59336 870807 874068 873331 868411 860130 849980 838970 827055 813851 799539 784760 769988 755548
59324 755548 742099 730448 720685 711855 702811 693284 683931 675465 668008 661294 655143 649498 644175 638966
59310 638966 634021 629821 626716 624672 623599 623687 625360 629201 636030 646557 660361 675156 687304 693379
59296 693379 691697 682881 669169 652853 635194 616882 599194 583883 571748 562092 554081 547986
59284 547986 544489 543316 543356 543826 544640 545877 547618 550145 553722 558322 564069 571617 581328 592339 603259
59269 603259 613674 624190 635080 645741 655518 664211 671641 677503 681789 684662 685763 684399 680601
59256 680601 675290 669217 662479 655258 648235 641869 636004 630547 625920 622424 619836 618083 617656 618828
59242F18828K189K501K981M186N647O608O769O163N063M099L799L872L465K253
59228F78423P15o87j977l313m670n993p180p932q016p663p266o823o142n405n016
59213F01055m999n083n185n311n213m806m613n075n552m911l081j275n23p19j183
59198E43526j460j346p63M7O67J020J439K073K621K758K600K634L274M410N322
59183E68822N336M714M426M813N157N005N073O016P017O754N375M319M377N012
59169F42216N558N884N811N004L782L009K838K422J226j55r72j418k224l591n086
59154F64304o257p045p686q366q914q902q281p565p193o961o566o282o538p123
59140E60625p481p481p233o552n366m315l991l924l273k280j888k122k044j269
$$ plain form
59242 618828 621017 623518 626499 630685 636332 642940 649709 655872 660935 665034 668833 672705 676170 678423
59228 678423 679138 678451 676474 673161 668491 662498 655318 647386 639370 631707 624441 617618 611476 606071 601055
59213 601055 596056 590973 585788 580477 575264 570458 565845 560770 555218 550307 547226 545951 545428 544709 543526
59198 543526 542066 540720 539957 540004 540671 541691 543130 545203 547824 550582 553182 555816 559090 563500 568822
59183 568822 574158 578872 583298 588111 593268 598273 603346 609362 616379 623133 628508 632827 637204 642216
59169 642216 647774 653658 659469 664473 668255 671264 674102 676524 677750 677595 676623 675205 672981 669390 664304
59154 664304 658047 651002 643316 634950 626036 617134 608853 601288 594095 587134 580568 574286 567748 560625
59140 560625 553144 545663 538430 531878 526512 522197 518206 514282 511009 508729 506841 504719 502675 501406
59126E01406l04O59J953L293L742L294L228M334N881O936P688Q754R995J0890
59112E71749J1360J1575J1431J0878J0324J0111J0022R696R194Q740Q291P657
59100F91028O673N150L083J017l96j273k224l150l186k126j022q35j273j514j456
59085F88496j606k174k879l421l855m536n752p131p677o975o092o407p646q168
59071F14177p293o088n508n067m048k961k767l433m117m327m124l625k998k679
59057E55142k928l410l643l572l400l182k905k603k172j399m32K60N06N25L73
59042E27160j17o81p40l34j93n42o96j68O15J112J452J949K515K985L455L992
59026E41764M615N714P694R991J1415J1716J1867J2431J2799J2473J1825J0876
$$ plain form
59126 501406 501102 501761 503714 507007 510749 514043 517271 521605 527486 534422 542110 550864 560859 571749
59112 571749 583109 594684 606115 616993 627317 637428 647450 657146 666340 675080 683371 691028
59100 691028 697701 702851 705934 706951 706555 705282 703058 699908 696722 694596 693574 692739 691466 689952 688496
59085 688496 686890 684716 681837 678416 674561 670025 664273 657142 649465 642490 636398 629991 622345 614177
59071 614177 606884 600796 595288 590221 586173 583212 580445 577012 572895 568568 564444 560819 557821 555142
59057 555142 552214 548804 545161 541589 538189 535007 532102 529499 527327 525928 525496 525756 526262 526787 527160
59042 527160 527043 526362 525622 525288 525095 524553 523857 523689 524304 525416 526868 528817 531332 534317 537772 541764
59026 541764 546379 552093 559787 569778 581193 592909 604776 617207 630006 642479 654304 665180
59014F65180Q690M980J191j087j941k367k653k679k860l387l250j421J358L341
59000F63095M046M488N331O039N956N109L834K371J023K4p30j393j782j804j970
58985F93637k783l813m115l396k203j061o6Q21J635K528L600M751N956P323Q625
58970G11439R271R217R282R998J0732J0627R890R352R204Q994Q501P811O731N016
58956H36065K938R53j025l437o308r236j1822j3665j4313j3914j3456j3723j4249
58943G24808j4007j2765j1092r381p635n996m712l757l058k810l015l091k580
58930F40909j888j656j759j621j151o85k90N8qp79j808k414k613k870l163l060
58914F15202k446j546m51P13J556J929K322L125M008M714N856P998J0367J1595
$$ plain form
59014 665180 673870 678850 680041 678954 677013 674646 671993 669314 666454 663067 659817 658396 659754 663095
59000 663095 667141 671629 676960 682999 688955 694064 697898 700269 701292 701316 700586 699193 697411 695607 693637
58985 693637 690854 687041 682926 679530 677327 676266 676200 677021 678656 681184 684784 689535 695491 702814 711439
58970 711439 720710 729927 739209 749207 759939 770566 780456 789808 799012 808006 816507 824318 831049 836065
58956 836065 839003 839956 838931 835494 829186 819950 808128 794463 780150 766236 752780 739057 724808
58943 724808 710801 698036 686944 677563 669928 663932 659220 655463 652405 649595 646580 643489 640909
58930 640909 639021 637365 635606 633985 632834 632149 631859 631917 631909 631130 629322 626908 624295 621425 618262 615202
58914 615202 612756 611210 610759 611472 613028 614957 617279 620404 624412 629126 634982 642980 653347 664942
58900F64942J1494J1163J1508J2396J3143J3118J2134J0846J0421J1216J2375
58889G94756J3256J4475J6544J8464J8951J8292J7562J6559J4163J0417O578L207
58877I63224j81l512n929p391r030j1350j3397j4249j4196j3864j3143j1627r429
58864H35926p078n158m238m558n601o541p154p743q324q701r153j0133j1295j1747
58850G28502j1215j0154q862p474o548o583p025o963o652p046p914p975o986o146
58836F20959o083o038n490n052n001m472k999j547r85o88J97J221J506J330J517
58821E88375J939J986J980K812M273N089M743M171M268M512L709J630o08j766
58807F27113j658j050o16l80k00k78q64j754k550l268m192n284o192o742o977
$$ plain form
58900 664942 676436 687599 699107 711503 724646 737764 749898 760744 771165 782381 794756
58889 794756 808012 822487 839031 857495 876446 894738 912300 928859 943022 953439 960017 963224
58877 963224 963043 959531 953602 946211 937181 925831 912434 898185 883989 870125 856982 845355 835926
58864 835926 828848 823690 819452 814894 809293 802752 795598 787855 779531 770830 761677 751544 740249 728502
58850 728502 717287 707133 698271 690797 684249 677666 670641 663678 657026 649980 642066 634091 627105 620959
58836 620959 614876 608838 603348 598296 593295 588823 585824 584277 583292 582604 582801 584022 585528 586858 588375
58821 588375 590314 592300 594280 597092 601365 606454 611197 615368 619636 624148 627857 629487 628879 627113
58807 627113 625455 624405 623789 623409 623209 622931 622067 620313 617763 614495 610303 605019 598827 592085 585108
58792E85108o836o266n520m801l858k422r10N3N74J286K340L294L929M409M697
58777E75077M591M299M241M274L807K668J153o85k951n197o642p207p515p876
58763E62037q030p905p709p294o281m855l567k376q18Q51J781J882J943K284K363
58748E24306K022J908K301K526K158J806K142K891L420L637L832M177M772N637
58734E67535O394O534O256O325O919P374P275P050P074O995O319N107L731K512
58720F53400J786J856K591L603M810O277P584Q060P646O835N824M456K870J313
58706G18911m93k888n350p091q432j0358j2761j4443j4911j4931j5102j5144j4796
58693E82211j4193j3145j1326r253p827o812n269l580l305m600n601n039l806
$$ plain form
58792 585108 578272 572006 566486 561685 557827 555405 554495 554548 555122 556408 558748 562042 565971 570380 575077
58777 575077 579668 583967 588208 592482 596289 598957 600110 599425 596474 591277 584635 577428 569913 562037
58763 562037 554007 546102 538393 531099 524818 519963 516396 514020 513202 514053 515834 517716 519659 521943 524306
58748 524306 526328 528236 530537 533063 535221 537027 539169 542060 545480 549117 552949 557126 561898 567535
58734 567535 573929 580463 586719 593044 599963 607337 614612 621662 628736 635731 642050 647157 650888 653400
58720 653400 655186 657042 659633 663236 668046 674323 681907 689967 697613 704448 710272 714728 717598 718911
58706 718911 718418 715530 710180 703089 694657 684299 671538 657095 642184 627253 612151 597007 582211
58693 582211 568018 554873 543547 534294 526467 519655 514386 510806 507501 502901 497300 492261 488455
58680D88455l157k914k499k195k277k080j022M24J654K799L954M675N081O213
58666D97111Q460J0743J2154J3181J4375J4937J3764J0977P438L730M55j572k401
58653F03352l222m649n774n772n287n138m930m104l238l012k878k075j054o20
58639E51599m23L23J421K191K673L190L400K962K352J902Q78j223l264l772k996
58624E61213k339k311k435k671l531n034o633p884q380p527n355k920j060N81
58610E03714K429L829M130L944M002L708K339Q23O24J315J108m59j957k243j753
58595E25553j449j580j759j445l01J359K719L517M399N691O690O902P104Q101
58581E65501R367J0071J0488J1107J1201R894P928O801O656O584O569P417R057
$$ plain form
58680 488455 485298 482384 479885 477690 475413 473333 472311 472735 474389 477188 481142 485817 490898 497111
58666 497111 505571 516314 528468 541649 556024 570961 584725 595702 603140 606870 607325 605753 603352
58653 603352 600130 595481 589707 583935 578648 573510 568580 564476 561238 558226 555348 553273 552219 551599
58639 551599 551176 551499 552920 555111 557784 560974 564374 567336 569688 571590 572468 571245 567981 564209 561213
58624 561213 558874 556563 554128 551457 547926 542892 536259 528375 519995 512468 507113 504193 503133 503714
58610 503714 506143 509972 514102 518046 522048 525756 528095 528918 529542 530857 531965 531506 529549 527306 525553
58595 525553 524104 522524 520765 519320 519019 520378 523097 526614 531013 536704 543394 550296 557400 565501
58581 565501 574868 584939 595427 606534 617735 627629 635557 642358 649014 655598 662167 669584 678641
58568F78641J0519J1519J2658J4073J5342J6554J8248K0309K2080K3371K4144
58557H67458K3512K0588J6156J2146R353O961M250J457j041l197m718n260n260
58544I42405n586o366p143q117j0036j2835j5450j7132j8010j8363j8294j8052
58532G87021j7752j6830j4706j1929r664q164o696m915l318k284j567q85l25q4
58518F87902k92r49j630j718j315j364k238l015k898k544k930l760m079l765l254
58503F52151k446j184j72j07m48l19n2m79j289j477r96n27p1Q38J900K528L105
58486F50955M387O020P021P419Q047R122J0355J1975J4099J5629J5351J3727J2084
58473G86191J0472Q002M776J698j238m606p689r000q578p933p670o932n300l498
$$ plain form
58568 678641 689160 700679 713337 727410 742752 759306 777554 797863 819943 843314 867458
58557 867458 890970 911558 927714 939860 949213 956174 960424 961881 960840 957643 952925 947665 942405
58544 942405 936819 930453 923310 915193 905157 892322 876872 859740 841730 823367 805073 787021
58532 787021 769269 752439 737733 725804 716140 707976 701280 696365 693047 690763 689196 688311 687986 687902
58518 687902 687610 686661 685031 683313 681998 680634 678396 675381 672483 669939 667009 663249 659170 655405 652151
58503 652151 649705 648521 648349 648242 647794 647475 647423 646944 645655 644178 643182 642655 642584 643422 645322 647850 650955
58486 650955 655342 661362 668383 675802 683849 692971 703326 715301 729400 745029 760380 774107 786191
58473 786191 796663 804665 809441 811139 809901 805295 797606 788606 780028 772095 764425 757493 752193 748695
58459G48695j970l50J472L176M993P388R782J0993J0952J0509R624P378L786R7
58445H26525k825m989o264o372n840n523n183l993k348j544j750j782r43L48J629
58430G79146K726L211K986L134M679O831P975P998P939P861O919N186L471J623
58416H51685j015l742n151n414n925o866p196o828o645o536n654m492m356m858
58402G77007m258k400r10l58M40J975L270L913M689N752O182N652M813L889K734
58387H12390J987K181K152O67r89p41N12Qk159k909r75J592L275N058P534R369
58371H38952R878J0318J1353J1839J1300J1056J1762J2219J1712J1224J1371J1433
58359I74417J1178J1341J1614J0635Q591P273O974O044M155L067L416L695L299
$$ plain form
58459 748695 746725 746375 747847 751023 756016 763404 773186 784179 795131 805640 815264 822642 826428 826525
58445 826525 823700 818711 812447 806075 800235 794712 789529 785536 783188 781644 779894 778112 777169 777517 779146
58430 779146 781872 785083 788069 791203 795882 802713 810688 818686 826625 834486 841405 846591 850062 851685
58416 851685 850670 846928 841777 836363 830438 823572 816376 809548 802903 796367 790713 786221 781865 777007
58402 777007 772749 770349 769439 769081 769521 771496 774766 778679 783368 789120 795302 800954 805767 809656 812390
58387 812390 814377 816558 818710 819377 818388 817647 818159 818167 816008 813099 812124 813716 816991 822049 829583 838952
58371 838952 848830 859148 870501 882340 893640 904696 916458 928677 940389 951613 962984 974417
58359 974417 985595 996936 1008550 1019185 1027776 1035049 1042023 1048067 1052222 1055289 1058705 1062400 1065699
58346A065699L561M810N481N202N729P664R263R735J0651J2803J4696J5480J6339
58333A187113J7667J7905J6623J5663J5790J5270J3265J1471J0810R714P377N576
58321A344244N431N418M414L738M426N379N941P247R427J0527R968R899J1446
58308A437505J2883J3169J3861J5684J6742J6132J5860J7129J8164J7774J7525
58297A612428J8311J8410J7118J6606J7966J9172J9142J9908K2362K3993K3494
58286A828910K3474K5783K8178K8578K8628L0025L1344L1529L2463L4973L6499
58275B160384L5924L6344L9676M2947M3566M3809M6235M9057N0136N1281N4377
58264B653736N7488N8991O1268O5968O9955P0398O9698P0822P2112P1337P0565
$$ plain form
58346 1065699 1069260 1074070 1079551 1084753 1090482 1098146 1107409 1117144 1127795 1140598 1155294 1170774 1187113
58333 1187113 1204780 1222685 1239308 1254971 1270761 1286031 1299296 1310767 1321577 1331291 1338668 1344244
58321 1344244 1349675 1355093 1359507 1363245 1367671 1373050 1378991 1386238 1395665 1406192 1416160 1426059 1437505
58308 1437505 1450388 1463557 1477418 1493102 1509844 1525976 1541836 1558965 1577129 1594903 1612428
58297 1612428 1630739 1649149 1666267 1682873 1700839 1720011 1739153 1759061 1781423 1805416 1828910
58286 1828910 1852384 1878167 1906345 1934923 1963551 1993576 2024920 2056449 2088912 2123885 2160384
58275 2160384 2196308 2232652 2272328 2315275 2358841 2402650 2448885 2497942 2548078 2599359 2653736
58264 2653736 2711224 2770215 2831483 2897451 2967406 3037804 3107502 3178324 3250436 3321773 3392338
58253C392338P2170P4224P4659P5798P9999Q5103Q8876R3439J00572J07455J11983
58242D356616J17299J25985J34970J41441J48343J58532J69093J77202J85855
58233E715336J97871K10283K20763K33161K50301K67999K83080L00215L23515
58224H002524L48747L71628L96271M27208M60913M93940N31356N78019O29904
58215A2240510O83557P45253Q20851R06183R98122J104965J234604J383344J548617
58206B1666006J741170J972339K242934K559524K948489L440016M054675M821364
58198D5446517N788222O995740Q459266J0198025J2256576J4677778J7494254
58191A21316378K0784205K4695453K9349828L4696052M0360298M5392176M7995994
$$ plain form
58253 3392338 3464508 3538732 3613391 3689189 3769188 3854291 3943167 4036606 4137178 4244633 4356616
58242 4356616 4473915 4599900 4734870 4876311 5024654 5183186 5352279 5529481 5715336
58233 5715336 5913207 6123490 6344253 6577414 6827715 7095714 7378794 7679009 8002524
58224 8002524 8351271 8722899 9119170 9546378 10007291 10501231 11032587 11610606 12240510
58215 12240510 12924067 13669320 14490171 15396354 16394476 17499441 18734045 20117389 21666006
58206 21666006 23407176 25379515 27622449 30181973 33130462 36570478 40625153 45446517
58198 45446517 51234739 58230479 66689745 76887770 89144346 103822124 121316378
58191 121316378 142100583 166796036 196145864 230841916 271202214 316594390 364590384
58184C64590384M5800214L7062885K2142242L827009j4023557k8409405l8107951
58177C92881821m3251975m4521697m2775159l9012518l4245300k9261208k4537636
58170A35276328k0328283j6745391j3783380j1363416r401344p827171o564073
58163D9263270n534522m688775m000586l439601k971672k579323k257392j992270
58155B1799129j765168j570110j409037j273743j150423j037340r40882q58181
58147A1794245p79682p05050o41239n87510n36561m88073m47971m16394l88116
58138F803649l62643l42769l25528l05203k83032k64108k47356k28274k08628
58129D236108j93654j82087j68589j53757j42473j34438j25347j15563j08841
$$ plain form
58184 364590384 410390598 447453483 469595725 473422734 459399177 430989772 392881821
58177 392881821 349629846 305108149 262332990 223320472 189075172 159813964 135276328
58170 135276328 114948045 98202654 84419274 73055858 63654514 55827343 49263270
58163 49263270 43728748 39039973 35039387 31599786 28628114 26048791 23791399 21799129
58155 21799129 20033961 18463851 17054814 15781071 14630648 13593308 12652426 11794245
58147 11794245 11014563 10309513 9668274 9080764 8544203 8056130 7608159 7191765 6803649
58138 6803649 6441006 6098237 5772709 5467506 5184474 4920366 4673010 4444736 4236108
58129 4236108 4042454 3860367 3691778 3538021 3395548 3261110 3135763 3020200 2911359
58120B911359j04203r7574q9986q5881q4630q1640p6613p3051p0861o7064o2584
58109B017272o0890o0842n8164n3261n0471n0267m9033m6043m3979m2947m0452
58098A460923l7024l5705l6143l5045l2258l0626l0132k7931k4023k1362k0463
58087A130211j9105j7220j6839j7454j6639j5068j5837j8781k0511k0071j9756
58076I32930k0328k0146j9155j9130j9855j9417j8169j8139j8729j7419j4567
58065G27876j3011j3046j2282j0402r494r615q579o437n778p118q231q429r341
58052F06113j1013j1313r877q804q859q548p425o740o516n576m526n143o658o548
58038D98567n072n070o938p930o974o092o331o290n603o029p886r022q474p913
$$ plain form
58120 2911359 2807156 2709582 2619596 2533715 2449085 2367445 2290832 2217781 2146920 2079856 2017272
58109 2017272 1956382 1895540 1837376 1784115 1733644 1683377 1634344 1588301 1544322 1501375 1460923
58098 1460923 1423899 1388194 1352051 1317006 1284748 1254122 1223990 1196059 1172036 1150674 1130211
58087 1130211 1111106 1093886 1077047 1059593 1042954 1027886 1012049 993268 972757 952686 932930
58076 932930 912602 892456 873301 854171 834316 814899 796730 778591 759862 742443 727876
58065 727876 714865 701819 689537 679135 669641 660026 651447 645010 639232 632114 623883 615454 606113
58052 606113 595100 583787 573910 565106 556247 547699 540274 533534 527018 521442 516916 511773 505115 498567
58038 498567 493495 488425 481487 473557 466583 460491 454160 447870 442267 436238 428352 419330 410856 402943
58024D02943q262q230p191o417o342n695m298l726m268m224l047k193k079j316
58010C35655J81N81m19p83J41L42j080k045r47R09J844K160K387J798K38q26n65
57993C39571N7M68J578L523M746M493L986L828K722M0k662m104n124o640p865
57978C38617p957p499p033o003m360l313l343l323k692k475l075l193k192j433
57964B80726j832k112j003O56J579K021K615K769J811L74o95j589k557l044k877
57949B76842k941l610l898l120j948r40M14K197L272L088K812L541M798N834O927
57934B93268Q341R427R757R795R578Q226N686L261J484q33m347p681r414r934
57920C26614j0140r885r074q712r370r932r236p736o325m841k997j498p89l8J339
$$ plain form
58024 402943 394681 386451 379260 372843 366501 360806 356508 352782 348514 344290 341243 339050 336971 335655
58010 335655 335836 336417 335998 335215 335356 335698 334618 332573 331626 332535 334379 336539 338926 340724 340962 340136 339571
57993 339571 339628 340096 341674 345197 349943 354436 358422 362250 364972 365012 362350 358246 353122 346482 338617
57978 338617 330660 323161 316128 310125 305765 302452 299109 295786 293094 290619 287544 284351 282159 280726
57964 280726 278894 276782 275779 276435 278014 280035 282650 285419 287230 287604 286909 285320 282763 279719 276842
57949 276842 273901 270291 266393 263273 261325 260385 260799 262996 266268 269356 272168 275709 280507 286341 293268
57934 293268 301609 311036 320793 330588 340166 348392 354078 357339 358823 357990 353643 345962 336548 326614
57920 326614 316474 306589 297515 288803 279433 269501 260265 252529 246204 241363 238366 236868 236079 236041 237380
57905B37380K383K197J539J434J419O83j79j14O48J258J807K752L574L448K645
57890B62874K047J884K011K704M021N028M782L562K274J222K58n91j375k380l424
57875B84897l882l923m602o026o792o053m862m430m348l642k444j386m04O61J324
57860B34088J454J974L356M479M249L446L538M562N386N459M995M126L032K289
57846B86433K109J898J352J168J698J949J029l91j171j418j843k282k098j454
57832B86979r64p50p50j293k332k933k470j582r99m21M44Q76L31l78l62j06m03
57815B72887q70j050j887m366p447r126r130q863r118r416r351r055q427p222
57801A77559n840m886m095k682o65J142K169K421K103J651J620J902J679Q52N41
$$ plain form
57905 237380 239763 241960 243499 244933 246352 247035 246856 246742 247390 248648 250455 253207 256781 260229 262874
57890 262874 264921 266805 268816 271520 275541 280569 285351 288913 291187 292409 292667 292076 290701 288321 284897
57875 284897 281015 277092 272490 266464 259672 253619 248757 244327 239979 236337 233893 232507 232103 232764 234088
57860 234088 235542 237516 240872 245351 249600 253046 256584 261146 266532 271991 276986 281112 284144 286433
57846 286433 288542 290440 291792 292960 294658 296607 297636 297245 296074 294656 292813 290531 288433 286979
57832 286979 286015 285265 284515 283222 280890 277957 275487 273905 272906 272485 272929 273805 274136 273758 273396 273290 272887
57815 272887 272017 270967 269080 264714 257267 248141 239011 230148 221030 211614 202263 193208 184781 177559
57801 177559 171719 166833 162738 160056 159391 160533 162702 165123 167226 168877 170497 172399 174078 174930 175471
57786A75471J429K642L249L684M500M972M462M018M861O209O481N923O006O747
57772B40654O700N436M086L360K708J656M67o65j811k601k530j971j823k190k416
57757B49060k220j789j136m81p56k488m635n851o335o994p427o568m947m291m856
57742A88286n105m263l405l508m018l933l094j896p01J14M40Q72J859K635K145
57727A66428R60P98K091L462L824L616L671M050M448M652M305L271K367K627L744
57712B14314M374M010L345K745J762L71o89j203j701k117j647l78L80N5k35N15
57696B23901J640J874J003m05k051l857n538o939q202r139r056p731n935m541
57682A65024l635k811j749k22J811L864N375O687Q859J2272J6254K0253K4574
$$ plain form
57786 175471 176900 179542 182791 186475 190975 195947 200409 204427 209288 215497 221978 227901 233907 240654
57772 240654 247354 252790 256876 260236 262944 264600 265067 264402 262591 259990 257460 255489 253666 251476 249060
57757 249060 246840 245051 243915 243434 242678 240190 235555 229704 223369 216375 208948 202380 197433 193142 188286
57742 188286 183181 178918 175513 172005 167987 164054 160960 159064 158363 158477 158917 159789 161648 164283 166428
57727 166428 167388 168186 170277 173739 177563 181179 184850 188900 193348 198000 202305 205576 207943 210570 214314
57712 214314 218688 222698 226043 228788 230550 230921 230232 229029 227328 225211 223564 223186 223566 223621 223386 223901
57696 223901 225541 227415 228418 228013 225962 222105 216567 209628 201426 192287 183231 175500 169565 165024
57682 165024 161389 158578 156829 156607 158418 162282 167657 174344 183203 195475 211729 231982 256556
57669B56556K9614L5300M1480M7784N2511N2586M5491L1123J1686r369k8269m2044
57657E24449m9687n2055n0421m5735l9208l2431k6383k1088j6656j3698j2200
57646A64887j0970r027o906n707n448n051l749j817j22O13K95m30o90j76P19J461
57630A17882J699J198N2j032j355j118j048j232j128p90r70j734k007j097K00
57615A07520O39R6n43n99j59K85L01j86p64r40p83q45j465k468l508m234m225
57598H8122l394k349j749j398p28On0r46j747j934j982k361k823l011k960k669
57582E8027j947j018n04n63p49q53j051j138n69M25P74Oj120j780k038k242k355
57565D1305k317k304k233j732r56n57o17m86MJ72k75o95o36n60q07q98m86o3k
$$ plain form
57669 256556 286170 321470 362950 410734 463245 515831 561322 592445 604131 594762 566493 524449
57657 524449 474762 422707 372286 326551 287343 254912 228529 207441 190785 177087 164887
57646 164887 153917 144890 137984 132277 126829 121778 118029 116212 116090 116703 116998 116568 115878 115702 116421 117882
57630 117882 119581 120779 120831 119799 118444 117326 116278 115046 113918 113128 112158 110424 108417 107320 107520
57615 107520 108159 108255 107712 107113 106954 107239 107540 107354 106590 105650 104867 104022 102557 100089 96581 92347 88122
57598 88122 84728 82379 80630 79232 78504 78510 78460 77514 75767 73833 71851 69490 66667 63656 60696 58027
57582 58027 56080 55062 54558 53995 53246 52393 51342 50204 49635 50060 50834 50840 49720 47940 45902 43660 41305
57565 41305 38988 36684 34451 32719 31763 31206 30589 30103 30107 30279 30004 29309 28673 28113 27306 26408 25922 25859 25857
57546B5857J91R15J610J698J591J946K531K718K506K268K002J514R74O44M77N01
57530D9943J086K229L125L066K391J999K288K929L344L093K271J629J789K268
57516H3450K042J088L32j9p95k147k918k461j800k043k715k684j841r22m43o65
57500F5459j752l150l692l128k647l006l323k736k046k315k890k489j426j030
57486B9829j384j361p12m20r25j436j209l82O31J532J929J639J252J479K013J950
57470C4425J266Q86J213J576J316O23L5k46l90o23r72j105o58N2J14p78j803k183
57452C2748k097j889j196J04R58L61j005j569r50n7M81P43P16K94l0L23R97J269
57434C0201J259J486J570Q71M4L09J247J186o7p18J84J218Q29m00r00m15N2n7
$$ plain form
57546 25857 26048 26963 28573 30271 31862 33808 36339 39057 41563 43831 45833 47347 48321 48965 49442 49943
57530 49943 51029 53258 56383 59449 61840 63839 66127 69056 72400 75493 77764 79393 81182 83450
57516 83450 85492 86580 86912 86893 86098 83951 81033 78572 76772 74729 72014 69330 67489 66567 66124 65459
57500 65459 63707 60557 56865 53737 51090 48084 44761 42025 39979 37664 34774 32285 30859 29829
57486 29829 28445 27084 26372 25952 25027 23591 22382 22000 22631 24163 26092 27731 28983 30462 32475 34425
57470 34425 35691 36577 37790 39366 40682 41305 41340 41094 40704 40081 39109 38004 37346 37398 37512 36734 34931 32748
57452 32748 30651 28762 27566 27670 28628 28989 27984 26415 25465 25408 25889 26632 27348 27642 27612 27935 28932 30201
57434 30201 31460 32946 34516 35387 35431 35740 36987 38173 38106 37388 37572 38790 39619 39219 38319 37904 37956 37899
57416C7899l65l65J22J029J928K182J678J059Q40P40L33j69l14k09l04o24p65
57399D4695n18o3M00Q75J371J713J648J139N45L28N54Q33R76J295J970K471K143
57382F2375J118J10m48n29o4Q94J675J545P31J69K32M13L84N20J098J700J816
57365G3739J515J205J111J203J247Q66m1q39o78L87J377J670J763K387L384L912
57349I4208L516K568J744J300R70M81K6K6M52P91Q32R91J482J785J466J008J089
57332A14735J461J398R93R86J451J662J328R86R82R57O99O73J263K122K685K871
57316A37252K868K704K340J967J847K055K448K719K471J590N65J50O51J752K928
57301A66307L725L888L549L160K919K573K055J853K226K606K457K142K190K138
$$ plain form
57416 37899 37534 37169 37291 38320 40248 42430 44108 45167 46007 46747 47080 46911 46597 46388 46084 45460 44695
57399 44695 44177 44114 44514 45389 46760 48473 50121 51260 51805 52133 52687 53520 54496 55791 57761 60232 62375
57382 62375 63493 63603 63155 62626 62562 63456 65131 66676 67407 67576 67808 68221 68605 69125 70223 71923 73739
57365 73739 75254 76459 77570 78773 80020 80886 80845 80006 79328 79715 81092 82762 84525 86912 90296 94208
57349 94208 97724 100292 102036 103336 104306 104787 104813 104839 105291 106082 106914 107905 109387 111172 112638 113646 114735
57332 114735 116196 117594 118587 119573 121024 122686 124014 125000 125982 126939 127638 128311 129574 131696 134381 137252
57316 137252 140120 142824 145164 147131 148978 151033 153481 156200 158671 160261 160826 160976 161627 163379 166307
57301 166307 170032 173920 177469 180629 183548 186121 188176 190029 192255 194861 197318 199460 201650 203788
57287B03788J225k16j190j602k246l265l895l793l504l454l553l859m506m785
57273A65145l547q31J983L934N322O539P344P749Q392R338R684R108Q767R738
57259B48665J1490J2768J3217J3158J2562J1284R867R131R162R474R780J0042
57247C80600J0051R701R378R444R679R771J0000J0835J2108J3156J3571J3382
57235E11676J2720J1798J0967J0422J0097J0074J0656J1701J2463J2546J2547
57224F37667J3151J4095J4642J4752J5044J5841J6849J7743J8475J9106J9690
57213H17055K0394K1357K2498K3639K4650K5302K5309K4782K4391K4762K5820
57202A079959K6883K7247K6712K5796K5458K6126K7007K6885K5662K4391K3755
$$ plain form
57287 203788 205013 204797 203607 202005 199759 196494 192599 188806 185302 181848 178295 174436 169930 165145
57273 165145 161598 160767 162750 166684 172006 178545 185889 193638 202030 211368 221052 230160 238927 248665
57259 248665 260155 272923 286140 299298 311860 323144 333011 342142 351304 360778 370558 380600
57247 380600 390651 400352 409730 419174 428853 438624 448624 459459 471567 484723 498294 511676
57235 511676 524396 536194 547161 557583 567680 577754 588410 600111 612574 625120 637667
57224 637667 650818 664913 679555 694307 709351 725192 742041 759784 778259 797365 817055
57213 817055 837449 858806 881304 904943 929593 954895 980204 1004986 1029377 1054139 1079959
57202 1079959 1106842 1134089 1160801 1186597 1212055 1238181 1265188 1292073 1317735 1342126 1365881
57191A365881K3324K2659K2164K2208K2255K1648K0712K0276K0574K1340K2498
57180A605539K3931K4932K4831K3981K3392K3447K3768K4123K4647K5037K4497
57169A872125K2791K0790J9552J9217J9085J8514J7454J6309J5497J5144J5101
57158B071579J5196J5435J5886J6507J7225J8012J8788J9322J9392J9010J8389
57147B264741J7826J7619J7907J8470J8820J8645J8090J7517J7128J6895J6654
57136B460312J6208J5427J4378J3263J2217J1199R995Q246N577J966j999n372
57124B561417p440q024p397n955l809o68L650Q587J3167J7051K0652K3989K6206
57111B641426K6726K6387K6758K8847L2999L9582M9062O1826P8615J00905J30436
$$ plain form
57191 1365881 1389205 1411864 1434028 1456236 1478491 1500139 1520851 1541127 1561701 1583041 1605539
57180 1605539 1629470 1654402 1679233 1703214 1726606 1750053 1773821 1797944 1822591 1847628 1872125
57169 1872125 1894916 1915706 1935258 1954475 1973560 1992074 2009528 2025837 2041334 2056478 2071579
57158 2071579 2086775 2102210 2118096 2134603 2151828 2169840 2188628 2207950 2227342 2246352 2264741
57147 2264741 2282567 2300186 2318093 2336563 2355383 2374028 2392118 2409635 2426763 2443658 2460312
57136 2460312 2476520 2491947 2506325 2519588 2531805 2543004 2552999 2561245 2566822 2568788 2566789 2561417
57124 2561417 2553977 2545953 2538556 2532601 2528792 2528124 2531774 2540361 2553528 2570579 2591231 2615220 2641426
57111 2641426 2668152 2694539 2721297 2750144 2783143 2822725 2871787 2933613 3012228 3113133 3243569
57100C243569J69007K19130K83999L66149M66889N87538P29474Q91383J067213
57091H024351J248049J425287J591426J739897J866035J966278K034140K059080
57083B1954543K032274J951296J815612J621892J372937J092079Q18278N78007
57075C3236918L62683J37018j31990m54171q14766j182793j520612j794542j984183
57066B5853562k084429k100855k045514j935479j790108j626504j457366j292048
57058A1521259j137031r95104q66418p51291o50761n64542m90456m26431l71587
57049E267638l25077k85446k51641k23410k00320j81478j66258j54135j43878
57040C335995j34277j25669j19340j15279j11977j08423j04698j00345r3867q4444
$$ plain form
57100 3243569 3412576 3631706 3915705 4281854 4748743 5336281 6065755 6957138 8024351
57091 8024351 9272400 10697687 12289113 14029010 15895045 17861323 19895463 21954543
57083 21954543 23986817 25938113 27753725 29375617 30748554 31840633 32658911 33236918
57075 33236918 33599601 33736619 33604629 33150458 32335692 31152899 29632287 27837745 25853562
57066 25853562 23769133 21668278 19622764 17687285 15897177 14270673 12813307 11521259
57058 11521259 10384228 9389124 8522706 7771415 7120654 6556112 6065656 5639225 5267638
57049 5267638 4942561 4657115 4405474 4182064 3981744 3800266 3634008 3479873 3335995
57040 3335995 3201718 3076049 2956709 2841430 2729453 2621030 2516332 2415987 2322120 2237676
57030B237676p2751n9582m5277l1418k1831k0453k8282m2704n9220p3697q3852
57019A698609q9305r0343q6998p9818p0773o2110n4387m6865l9603l3771k9778
57008A014858k6655k3649k1105j9303j7717j6012j4661j4003j3620j3244j3296
56997H21593j3895j4257j3730j2649j1566j0394q940p550o566n676m426k838r99
56984G08107J439M668P836R348Q043M007j534p087j1840j5780j8748j9917j8780
56971F49762j6321j4265j3199j2247j0504p955m931j653J487M056O203Q531J1184
56958F00148J3831J6392J8856K0170J8503J3119N277l029j0604j7030k1941k4923
56946F28769k5695k4195k0838j6736j3046r980p005l912r75J914N297R243J3185
$$ plain form
57030 2237676 2164925 2105343 2060066 2028648 2006817 1986364 1958082 1915378 1856158 1782461 1698609
57019 1698609 1609304 1518961 1431963 1352145 1281372 1219262 1164875 1118010 1078407 1044636 1014858
57008 1014858 988203 964554 943449 924146 906429 890417 875756 861753 848133 834889 821593
56997 821593 807698 793441 779711 767062 755496 745102 736162 728612 722046 716370 711944 709106 708107
56984 708107 709546 714214 722050 731398 739441 743448 741914 734827 722987 707207 688459 668542 649762
56971 649762 633441 619176 605977 593730 583226 575271 570340 568687 570174 574230 580433 588964 600148
56958 600148 613979 630371 649227 669397 687900 701019 706296 703267 692663 675633 653692 628769
56946 628769 603074 578879 558041 541305 528259 518279 511274 507362 506387 508301 513598 522841 536026
56933E36026J6923K0962K5505K9687L1906L0380K3653J1763k837j6443k6615l3030
56921F47880l6084l5902l3088k9170k5483k2246j9195j6409j4063j1963r922q084
56909C86271o551n094l557k165j234r11j136j436r20P52K654L653L989M831O400
56894C85546P801Q710R892J1695J3487J5047J7285K0768K4473K6840K7175K5300
56882E94019K0650J2878L074o364j3207j6647j7482j7279j6965j6113j3900j0445
56870E02219o621k763J529O378J1407J6556K2177K8244L4398M0822M7970N5046
56858G57362N9565N8691N0514L4700J3322q974k7253l9339m5906m7983m5895m0637
56846G18167l4144k7394j9758j0874j708O946J5545K4600L3786M3091N3496O5581
$$ plain form
56933 536026 552949 573911 599416 629103 661009 691389 715042 726805 723968 707525 680910 647880
56921 647880 611796 575894 542806 513636 488153 465907 446712 430303 416240 404277 394355 386271
56909 386271 379720 374626 371069 368904 367670 366759 365623 364187 363267 364019 366673 370326 374315 379146 385546
56894 385546 393347 402057 411949 423644 437131 452178 469463 490231 514704 541544 568719 594019
56882 594019 614669 627547 630621 624257 611050 594403 576921 559642 542677 526564 512664 502219
56870 502219 495598 492835 494364 500742 512149 528705 550882 579126 613524 654346 702316 757362
56858 757362 816927 875618 926132 960832 974154 965180 937927 898588 852682 804699 758804 718167
56846 718167 684023 656629 636871 625997 624289 631235 646780 671380 705166 748257 801753 867334
56834H67334P8408R0235R8728R9799Q8579O3552K9053p588m0493o6298q2921q9824
56822A128564q8848q3011p4292o3531n1732m0071k8947j8166p861J710J0900K0287
56810G05002K9938L9747M9901O0008O7999P0616O4893M9293K4764m342l1549n1970
56798A074300o4702p1234p2575o9085o2080n3815m5790l7987k9900k1559j3635
56787E31938o887j345M014J0223J6954K3060K8395L3565L7436L6698K9098J5953
56775G59102N08j4844k8559l8795m4222m5452m4167m1275l7101l2502k8424k4784
56763C79485k1084j7587j4846j2618j0396q450p293o717o341o390o881o872n684
56750B48326m147l408l293k977k465k151j737r45m55p57r94l85J04p41k155k455
$$ plain form
56834 867334 945742 1035977 1134705 1234504 1323083 1386635 1415688 1408100 1367607 1301309 1218388 1128564
56822 1128564 1039716 956705 882413 818882 767150 727079 698132 679966 672105 673815 684715 705002
56810 705002 734940 774687 824588 884596 952595 1023211 1088104 1137397 1162161 1157819 1126270 1074300
56798 1074300 1009598 938364 865789 796704 734624 680809 635019 597032 567132 545573 531938
56787 531938 525051 523706 527720 537943 554897 577957 606352 639917 677353 714051 743149 759102
56775 759102 759610 744766 716207 677412 633190 587738 543571 502296 465195 432693 404269 379485
56763 379485 358401 340814 325968 313350 302954 294504 287211 280494 274153 267763 260882 254010 248326
56750 248326 244179 240771 237478 234501 232036 229885 228148 227203 226748 225991 224997 224612 224716 223975 221820 219365
56734B19365j658j071q97k73O13N60n16j316j184p89p25q43j033j282j119k29
56718B07603N81N04K96J125K316K136O49k37L15J089J020N70M38N66Q83J616K375
56701B23845K305J505J007J090R70M18K66R64J928K666L233L347K445J002L87
56686B47378R82J729J940K167K810L188K772K113J846J708J190M06k06l88M2J049
56670B70726J972K002J232M66Mn01j036j099o37q9M69J225J745J396N80L84R68
56653B79807J489J538J397R92pj074j286r47j188j970k092j411j269k297l426
56638B68256l649l313l082l054l424m514n634n351l553j847j362j555j741k166
56624B24011k833k827j842r94j091j375r31k17n2k17j38pj92k81K43J028J398
$$ plain form
56734 219365 217707 216636 215739 215466 216079 216639 216123 214807 213623 212834 212109 211266 210233 208951 207832 207603
56718 207603 208184 208688 208984 210109 212425 214561 215210 214973 215288 216377 217397 217967 218405 218971 219854 221470 223845
56701 223845 226150 227655 228662 229752 230722 231140 231406 232370 234298 236964 240197 243544 245989 246991 247378
56686 247378 248360 250089 252029 254196 257006 260194 262966 265079 266925 268633 269823 270229 270023 269635 269677 270726
56670 270726 272698 274700 275932 276398 276402 275901 274865 273766 273129 273040 273509 274734 276479 277875 278455 278839 279807
56653 279807 281296 282834 284231 285223 285216 284142 282856 281909 280721 278751 276659 275248 273979 271682 268256
56638 268256 264607 261294 258212 255158 251734 247220 241586 236235 232682 230835 229473 227918 226177 224011
56624 224011 221178 218351 216509 215515 214424 213049 212118 211901 211849 211632 211494 211487 211295 211014 211257 212285 213683
56607B13683J276R49N14J57L10R58J427J298Q46L79j10m44l18K5J41M18J484K642
56589B25635K468J139M58J041J423N78m58n43j88j68NQ18J427J075N73R02J438
56572B37623J149N41Q28J913K771L180L635M021L862L530L902N005O096O813P281
56557B92150P421P186P106P614Q075P419N616L765K818K812L160L201K687K081
56543C63111J964K012J205o44k437l294l587l970m342m503m866n643o163n893
56529C22950n447n581n980n913n515n395n488n206m468l696l137k777k621k591
56515B59135k433k118j826j374l60Q86J430J195J197J835K170J559Q07P46Q16
56500B63665K05o25p85n43p68j337j387p55j30K8k42q71j711k248k057j341n69
$$ plain form
56607 213683 214959 215908 216422 216579 216889 217847 219274 220572 221418 221797 221687 221243 220925 220950 221091 221509 222993 225635
56589 225635 228103 229242 229700 230741 232164 232742 232284 231741 231553 231385 231390 232208 233635 234710 235283 236185 237623
56572 237623 238772 239313 240141 242054 244825 248005 251640 255661 259523 263053 266955 271960 278056 284869 292150
56557 292150 299571 306757 313863 321477 329552 336971 342587 346352 349170 351982 355142 358343 361030 363111
56543 363111 365075 367087 368292 367648 365211 361917 358330 354360 350018 345515 340649 335006 328843 322950
56529 322950 317503 311922 305942 300029 294514 289119 283631 278425 273957 270261 267124 264347 261726 259135
56515 259135 256702 254584 252758 251384 251024 251910 253340 254535 255732 257567 259737 261296 262103 262849 263665
56500 263665 263870 263245 262460 261917 261149 259812 258425 257670 257540 257568 257326 256455 254744 252496 250439 249098 248529
56483B48529J4K25j24o96p28j57J81q9j66N71J469J623J191Q46O18J37m89q52
56465B52103q46n79j59R3j87o54m92L82J210J678K110K249J288l50r18K15J560
56448B58703J802J509J559J482P14J8J50L73j77q41o12O5K14J6P4j7p93j454r84
56429B61801N9M58L50O73J250J123M09J32N02P48N51L32K99L04M64R43J398J458
56411B73254J332J275J067P14P78J255J218M90L80J681L109L210K563K563L055
56396B97944K969K407K302K593K467J858J258N48n77j620k085k528l439l993l426
56381B96678k747l391m957o003o323o571o473n346l783k903k334r11J049K160
56367B48145K227K300K650K641K262K094J904J086K03L64J287J700J432J327J395
$$ plain form
56483 248529 248543 248768 248644 247948 247220 247063 247244 247155 246989 247560 249029 250652 251843 252689 253307 253444 252955 252103
56465 252103 251257 250678 250519 250612 250425 249771 249279 249661 250871 252549 254659 256908 258196 257846 256928 257143 258703
56448 258703 260505 262014 263573 265055 265769 265787 265937 266310 266133 265292 264680 264745 264959 264975 265049 265032 264239 262785 261801
56429 261801 261860 262318 262668 263341 264591 265714 266123 266255 266757 267505 268056 268388 268687 268991 269455 270398 271796 273254
56411 273254 274586 275861 276928 277642 278420 279675 280893 281383 281763 283444 286553 289763 292326 294889 297944
56396 297944 300913 303320 305622 308215 310682 312540 313798 314346 313769 312149 310064 307536 304097 300104 296678
56381 296678 293931 290540 285583 279580 273257 266686 260213 254867 251084 248181 245847 244936 245985 248145
56367 248145 250372 252672 255322 257963 260225 262319 264223 265309 265512 265876 267163 268863 270295 271622 273017
56352B73017R07K03M84J770K754K723K132J343L99j93N8N04K87NP99K139K401
56335B91732J443P20R52J550K248L416M607M673L625K782K818L083K981K680K369
56320C31679K088K168K685K788J851P04M19N33J01l21L73J584J810J251J411K454
56304C53578L141L197L554M349M737M675M854N016M331L316L212L725L460K540
56290D07685K533L775M996N614O163O545O082N330N565O485O693O363P019Q672
56276D89520R720R762R956J0471J0308R820J0613J2542J3676J3782J4893J7667
56264F32730K0119K1022K1804K3893K6696K9517L3071L7767M2666M7361N2882
56253I89528N9666O6697P3658Q1746R1271J00559J08498J16033J23860J30653
$$ plain form
56352 273017 273924 274127 274611 276381 279135 281858 283990 285333 285732 285539 285597 286101 286388 286393 287192 289331 291732
56335 291732 293175 293895 294847 296397 298645 302061 306668 311341 314966 317748 320566 323649 326630 329310 331679
56320 331679 333767 335935 338620 341408 343259 343963 344382 344915 345016 344695 345068 346652 348462 349713 351124 353578
56304 353578 356719 359916 363470 367819 372556 377231 382085 387101 391432 394748 397960 401685 405145 407685
56290 407685 410218 413993 418989 424603 430766 437311 443393 448723 454288 460773 467466 473829 480848 489520
56276 489520 499240 509002 518958 529429 539737 549557 560170 572712 586388 600170 615063 632730
56264 632730 652849 673871 695675 719568 746264 775781 808852 846619 889285 936646 989528
56253 989528 1049194 1115891 1189549 1271295 1362566 1463125 1571623 1687656 1811516 1942169
56243A942169J34888J36622J36194J32947J26476J17407J05849R0659P1383M9451
56233C044045K6545L364j9309m0187n8922p6175r1464j02949j10157j14909j18488
56222B341394j19954j18395j14870j10820j06260j00825r5060q9471q3672p7408
56212A324659p1106o4841n8341n2384m8368m5939m3060l9011l5194l2405k9619
56201H04391k6307k3505k1589j9269j5985j3148j1792j1038r981r088q592p595
56189F26502n906m753m592m149k727j459j231j389j411j789k370k014q06k95p14
56174E90897l84J192K241J869J574K429L379L647M188N272N405M183L588M756
56160F34236O083O246O515Q129R977J0814J1463J2843J4102J4540J5262J7108
$$ plain form
56243 1942169 2077057 2213679 2349873 2482820 2609296 2726703 2832552 2923211 2994594 3044045
56233 3044045 3070590 3073954 3054645 3014458 2955536 2879361 2787897 2684948 2574791 2459882 2341394
56222 2341394 2221440 2103045 1988175 1877355 1771095 1670270 1575210 1485739 1402067 1324659
56212 1324659 1253553 1188712 1130371 1077987 1029619 983680 940620 901609 866415 834010 804391
56201 804391 778084 754579 732990 713721 697736 684588 672796 661758 651777 642689 634097 626502
56189 626502 620596 615843 611251 607102 604375 602916 601685 600296 598885 597096 594726 592712 591906 591611 590897
56174 590897 590513 591705 593946 595815 597389 599818 603197 606844 611032 616304 621709 625892 629480 634236
56160 634236 640319 646565 653080 661209 671186 682000 693463 706306 720408 734948 750210 767318
56148G67318J9184K1112K4375K9678L5412M0557M6721N5385O5482P5498Q5473
56137A266195R4964J01430J02772R9374R2072Q0824O7224N5542M8724M5555M3489
56126B098165M1670L9176L3473K3434J1663J275p451j5355k2005k7545l4354m4173
56114B097973n5624o6730p7390q7262r3838r5283r2857q8282q1270p1922o2605
56103A224910n4762m6608l6778k7548k1529j7736j3916j0318q103o387l956j711
56091I75558o63M11K608M511M703M405N081N898N959O429P936Q737P959P683R245
56076A056460J0623J0222R887J1282J2653J2363J2134J3562J4804J4143J3352
56065A191485J4156J4903J4227J4217J6264J7578J5935J3963J4512J5605J4534
$$ plain form
56148 767318 786502 807614 831989 861667 897079 937636 984357 1039742 1105224 1180722 1266195
56137 1266195 1361159 1462589 1565361 1664735 1756807 1837631 1904855 1960397 2009121 2054676 2098165
56126 2098165 2139835 2179011 2212484 2235918 2247581 2248856 2241405 2226050 2204045 2176500 2142146 2097973
56114 2097973 2042349 1975619 1898229 1810967 1717129 1621846 1528989 1440707 1359437 1287515 1224910
56103 1224910 1170148 1123540 1086762 1059214 1037685 1019949 1006033 995715 987612 981225 977269 975558
56091 975558 974895 975306 977914 982425 987128 991533 996614 1002512 1008471 1014900 1022836 1031573 1039532 1047215 1056460
56076 1056460 1067083 1077305 1087192 1098474 1111127 1123490 1135624 1149186 1163990 1178133 1191485
56065 1191485 1205641 1220544 1234771 1248988 1265252 1282830 1298765 1312728 1327240 1342845 1357379
56054A357379J3160J4317J6483J6900J6677J7904J9067J8189J7310J8928K1231
56043A547545K1667K1865K4126K6463K6280K5513K7060K9511L0490L1568L4645
56032A846733L7322L7151L6713L8954M1626M1902M2127M5016M7658M6674M4941
56021B306817M6513M9349M9869N0208N3748N7913N8894N9125O2567O7000O8780
56010B930783P0587P6421Q3518Q7540R0977R7876J05236J08694J11673J19417
56000C882722J28981J34985J40050J49208J59194J64216J67270J74548J83756
55991E284930J89663J95924K09139K26286K40563K54493K74340K97021L16302
55982G488661L36321L64650L97603M27308M57516M96869N42687N87844O37296
$$ plain form
56054 1357379 1370539 1384856 1401339 1418239 1434916 1452820 1471887 1490076 1507386 1526314 1547545
56043 1547545 1569212 1591077 1615203 1641666 1667946 1693459 1720519 1750030 1780520 1812088 1846733
56032 1846733 1884055 1921206 1957919 1996873 2038499 2080401 2122528 2167544 2215202 2261876 2306817
56021 2306817 2353330 2402679 2452548 2502756 2556504 2614417 2673311 2732436 2795003 2862003 2930783
56010 2930783 3001370 3077791 3161309 3248849 3339826 3437702 3542938 3651632 3763305 3882722
56000 3882722 4011703 4146688 4286738 4435946 4595140 4759356 4926626 5101174 5284930
55991 5284930 5474593 5670517 5879656 6105942 6346505 6600998 6875338 7172359 7488661
55982 7488661 7824982 8189632 8587235 9014543 9472059 9968928 10511615 11099459 11736755
55973A1736755P00471P74030Q50425R36433J043953J170272J308269J467976J666256
55964B1654840J904795K182683K521171K950764L486155M142444M961693N989913
55956D9794458P242509Q728198J0488088J2570782J4998163J7816140K1154297
55949A42792635K5154612K9819138L4893596L9687540M2765401M1967405L5364329
55942C92444656K2786606O505260r851861k3274062l2487247l7603532l9238071
55935B79281749l8104715l5051789l0995264k6668991k2508314j8746431j5508556
55928I1697689j2813813j0597212q784712p323821o152776n196987m407177l764282
55920C2656909l243501k807291k434881k126068j872721j654114j461402j300272
$$ plain form
55973 11736755 12437226 13211256 14061681 14998114 16042067 17212339 18520608 19988584 21654840
55964 21654840 23559635 25742318 28263489 31214253 34700408 38842852 43804545 49794458
55956 49794458 57036967 65765165 76253253 88824035 103822198 121638338 142792635
55949 142792635 167947247 197766385 232659981 272347521 315112922 357080327 392444656
55942 392444656 415231262 421736522 411884661 388610599 356123352 318519820 279281749
55935 279281749 241177034 206125245 175129981 148460990 125952676 107206245 91697689
55928 91697689 78883876 68286664 59501952 52178131 46025355 40828368 36421191 32656909
55920 32656909 29413408 26606117 24171236 22045168 20172447 18518333 17056931 15756659
55912A5756659j167631j049201r41036q51087p78319p10980o46158n91708n47828
55903H472711n05142m61758m25026l95577l65912l35342l10713k91775k70787
55894E110679k47174k28138k14193j98097j78857j63342j52896j41223j26683
55885C460076j14663j06701r8891r1844r0821r4837r6481r3650r1185r0291q6737
55874B403975q0512p6938p6886p5414p1169o8038o6490o2535n6127n1704m9502
55863A668660m5220l9144l6532l7902l7843l4881l3653l5579l5949l2540k9153
55852A270264k8142k6857k3877k1933k2302k2559k1881k2545k4695k5406k4244
55841A005823k3880k4330k2665j9227j7806j8758j8305j5650j4312j5274j5277
$$ plain form
55912 15756659 14589028 13539827 12598791 11747704 10969385 10258405 9612247 9020539 8472711
55903 8472711 7967569 7505811 7080785 6685208 6319296 5983954 5673241 5381466 5110679
55894 5110679 4863505 4635367 4421174 4223077 4044220 3880878 3727982 3586759 3460076
55885 3460076 3345413 3238712 3139821 3047977 2957156 2862319 2765838 2672188 2581003 2490712 2403975
55874 2403975 2323463 2246525 2169639 2094225 2023056 1955018 1888528 1825993 1769866 1718162 1668660
55863 1668660 1623440 1584296 1547764 1509862 1472019 1437138 1403485 1367906 1331957 1299417 1270264
55852 1270264 1242122 1215265 1191388 1169455 1147153 1124594 1102713 1080168 1055473 1030067 1005823
55841 1005823 981943 957613 934948 915721 897915 879157 860852 845202 830890 815616 800339
55830H00339j3303j2389j3371j3112j0622q946r228q781o869o491q592j0172j0066
55817F68397j0935j3521j4551j2603j0673j0604j0077p507m974l878k384M08K291
55804E69389K199K300L742M612M191M767P085Q272O580M086K494L26l381o575
55790F10087p732q305r405r578q009o497o243o090n653o613r112j0485r385p617
55776D99363o062k712L194Q935J2555J5577J8912J9592J4612N324m568j2895j8802
55763E53025k1378k0999j9767j8688j6555j3035j0116q914p830n685l866l618
55751D02574l905l850m487o313p770p941q092q776q247n673l083k146j745p35
55737C29811l00j395k540k517k686m247n629n141l932l901m542m370l624l308
$$ plain form
55830 800339 787036 774647 761276 748164 737542 728596 719368 710587 703718 697227 688635 678463 668397
55817 668397 657462 643941 629390 616787 606114 595510 585433 577926 572952 569074 566690 567098 569389
55804 569389 571588 573888 577630 582242 586433 591200 598285 606557 613137 617223 619717 620043 616662 610087
55790 610087 602355 594050 584645 575067 567058 560561 554318 548228 542575 535962 526850 516365 506980 499363
55776 499363 493301 490589 493783 502718 515273 530850 549762 569354 583966 589290 584722 571827 553025
55763 553025 531647 510648 490881 472193 455638 442603 432487 423573 415743 410058 406192 402574
55751 402574 398669 394819 390332 384019 376249 368308 360216 351440 343193 337520 334437 332291 330546 329811
55737 329811 329511 328116 325576 323059 320373 316126 310497 305356 301424 297523 292981 288611 284987 281679
55723B81679l209k877k980l785m003k921j798j441m23K352N283O418O306O406
55709B85007O375N132L110J371k24k031l206l155l021m001n421o107o316o719
55695B60794o888o349n803n748n296l829k370j860j545n95K29J34K6J024K588
55680B24512L646M356N212N681N193M242L265J740m00j928k110j940k346k742
55666B46381k533k338k491k088q43l4k76k61Q01J563J062P53K053L739M034L493
55650B53015L554L820L112J860J106K86j651l955n094n255n702o495o864p003
55636B24734p496p692o656n050m229m103l638k829k323j852p97J97M9q14r93k68
55620A76240L92N38N24M03j02q04j379j934k423k145r68j01m72j251j216o61o07
$$ plain form
55723 281679 278470 275593 272613 268828 264825 261904 260106 258665 258242 260594 265877 272295 278601 285007
55709 285007 291382 296514 299624 300995 300771 298740 295534 292379 289358 285357 279936 273829 267513 260794
55695 260794 253906 247557 241754 236006 230710 226881 224511 222651 221106 220511 220740 220874 220900 221924 224512
55680 224512 228158 232514 237726 243407 248600 252842 256107 257847 257447 255519 253409 251469 249123 246381
55666 246381 243848 241510 239019 236931 236088 236054 235778 235517 236318 237881 238943 239696 241749 245488 249522 253015
55650 253015 256569 260389 263501 265361 266467 266753 265102 261147 256053 250798 245096 238601 231737 224734
55636 224734 217238 209546 202890 197840 193611 189508 185870 183041 180718 178866 178069 178266 178315 177501 176508 176240
55620 176240 176632 177170 177694 178097 177995 177191 175812 173878 171455 169310 168342 168241 167769 166518 165302 164641 164034
55603A64034j003j259j627k559l324k831j343p3M37M06k8n85n29K23M97m43j464
55586A48529j120K22J121J192J124J264J511J936K460K562K372L103N282P575
55572A79133Q578Q686R000R474R617R766J0057R160N948J561j862l824n277o528
55558B43489p155p391p868q332q081p284o583n951n178m728m822m487l008j514
55544A61107j409k073j795m24O70Q12N33K15j76k94K59J017J333J458J835J981
55528A65049J345N32K66l3j110k145j917r87r06j745k153j632j019r20j177j714
55512A49734k602l569m540o086q194r437q747p130o071n230l577j865j754k991
55498G7941l644k869j546l76O64J246R89O18J128J963J883J250J477K448K637
$$ plain form
55603 164034 163031 161772 160145 157586 154262 151431 150088 150015 150452 150858 150830 150245 149716 149939 150436 149993 148529
55586 148529 147409 147631 148752 149944 151068 152332 153843 155779 158239 160801 163173 166276 171558 179133
55572 179133 187711 196397 205397 214871 224488 234254 244311 253471 259419 260980 259118 255294 250017 243489
55558 243489 236334 228943 221075 212743 204662 197378 190795 184844 179666 174938 170116 165629 162621 161107
55544 161107 159698 157625 155830 155406 156076 156888 157421 157636 157460 157166 157425 158442 159775 161233 163068 165049
55528 165049 166394 166926 167192 167159 166049 163904 161987 161000 160094 158349 156196 154564 153545 152625 151448 149734
55512 149734 147132 143563 139023 132937 124743 115306 106559 99429 93358 88128 84551 82686 80932 77941
55498 77941 74297 71428 69882 69506 70170 71416 72405 73023 74151 76114 77997 79247 80724 83172 85809
55483H5809J751J087J190J167O13K96N58P52O20O48Q23O19L32Q58J945K317J677
55466A03062R97P12K95k76l03J84L67K25M92Q88K55j275k027j238p2L47K86L02
55448A03221K98K40M18N40q1j065j174l23J67k93o93j81P93J651K483L060K630
55431A11691J351N47P81R87K79n89m59O43J935K943L451L281K792K756L334L920
55415A39643M212M518M800M534L733K975K160M97j954m023n077n652o046n682
55401A38638m408l201k821k869k751k525k282j740r71n57o12n73k96k04j61N42
55385A13209J732K235J706J178J261J180L05o72r52p94o94m66J6K35l2j68K01
55368A19480N43M42K37M9p17k176l281l226k549k096j846j465j118r81q07n63
$$ plain form
55483 85809 87560 88647 89837 91004 91617 91913 92471 93223 93843 94491 95314 95933 96265 97123 99068 101385 103062
55466 103062 104059 104771 105066 104790 104487 104671 105038 105263 105755 106643 106898 105623 103596 102358 102286 102633 102919 103221
55448 103221 103519 103759 104177 104717 104636 103571 102397 102074 102241 101948 101255 101074 101867 103518 106001 109061 111691
55431 111691 113042 113589 114370 115357 115636 115047 114588 115231 117166 120109 123560 126841 129633 132389 135723 139643
55415 139643 143855 148373 153173 157707 161440 164415 166575 167072 165118 161095 156018 150366 144320 138638
55401 138638 134230 131029 128208 125339 122588 120063 117781 116041 115070 114513 113901 113328 113032 112828 112667 113209
55385 113209 114941 117176 118882 120060 121321 122501 122806 122134 121182 120388 119694 119228 119244 119479 119447 119279 119480
55368 119480 120023 120465 120702 120751 120034 117858 114577 111351 108802 106706 104860 103395 102277 101296 100489 99926
55352I9926o46q78m57N51Q40j12r73m61P26J086M36k73n55n48j88O08J299J254
55334A01635O82L08L57M52K73k01p72j097r98q36j017j145n51M01O49K23L14J185
55316I9862J509M67q62j158n70J18Q83J833K258J554L66l49o57j100j548j628
55300A00978j597j734j539n30O78J130Q44M66K07j4R3P71J521J685J300P77K48
55283A05284j27M2O23P20p3q99r12n24n03p21p14o60p95o75l8L67m6n31j83M72
55263A00107M78K37P91J817J976R96o3m80m20N8J079J978J691L53o98p72n80q45
55245A07703j242j155o37j94j55n47j066j150n24L21P03O64P34R86R86N96J09
55228A06132l29p75j020q05l91l00m81m83l03l60o13m88J88Q57R88O51K25n8j25
$$ plain form
55352 99926 99280 98402 97945 98496 99336 99224 98251 97790 98516 99602 100038 99765 99210 98662 98474 99082 100381 101635
55334 101635 102317 102625 102982 103434 103707 103506 102734 101637 100639 99803 98786 97641 97090 97491 98140 98363 98677 99862
55316 99862 101371 101838 100976 99818 99248 99366 100249 102082 104340 105894 106260 105911 105254 104154 102606 100978
55300 100978 99381 97647 96108 95578 96256 97386 98230 98696 98903 98889 98982 99753 101274 102959 104259 105036 105284
55283 105284 105157 105199 105822 106542 106469 105570 104658 104134 103631 102910 102196 101536 100741 100066 100028 100395 100349 99818 99635 100107
55263 100107 100585 100822 101613 103430 105406 106402 106339 105859 105439 105497 106576 108554 110245 110598 109900 109128 108548 107703
55245 107703 106461 105306 104669 104475 104320 103773 102707 101557 101033 101354 102057 102721 103455 104441 105427 106023 106132
55228 106132 105803 105028 104008 103203 102812 102512 102031 101548 101245 100885 100272 99784 99972 100829 101817 102468 102693 102635 102510
55209A02510l7j9j82k93r9K69M66L78O0m40q65p30L5P15O24l5n51o10l00L54J265
55188A02515J938J965J558J111N52k33p88o68k94m00r17j163r94q38p85m87P7
55171A02149N50Q99J342J621J204L14r8L73J060J248J053R56J009Q81M40r4m15
55154A14492m79o03j076j630j561o46M14Q18N88J84l02r47j312q54J33P24N98
55137A08541M01P33J356J586J113J94o40j030j027r09p50m10m5j12o06q38l94
55120A07163K02L02J02J22K57J54Q8N77J314J443Q08J47l2K8jq7j57k72l73l25
55100A11460k05j11K53J234K457L007K453J277K35k89l51k62l71o90q36n90l12
55083A18359m39q70j187j186q01OQ40Q76n2q64m80P53J675J917J941J854J319
$$ plain form
55209 102510 102473 102454 102272 101979 101880 102149 102615 102993 103053 102613 101748 101018 101053 101768 102392 102357 101806 101196 100896 101250 102515
55188 102515 104453 106418 107976 109087 109639 109406 108618 107950 107656 107256 106339 105176 104182 103344 102559 102072 102149
55171 102149 102699 103598 104940 106561 107765 108079 107981 108354 109414 110662 111715 112671 113680 114561 115001 114907 114492
55154 114492 114013 113410 112334 110704 109143 108497 108911 109729 110317 110501 110199 109252 107940 107086 107219 107943 108541
55137 108541 108942 109675 111031 112617 113730 113924 113284 112254 111227 110318 109568 109158 109113 109001 108395 107557 107163
55120 107163 107365 107667 107769 107891 108148 108302 108390 108967 110281 111724 112532 112679 112647 112675 112674 112587 112430 112158 111785 111460
55100 111460 111255 111144 111397 112631 115088 118095 120548 121825 122060 121771 121420 121158 120787 120097 119261 118671 118359
55083 118359 117920 117050 115863 114677 113876 113882 114722 115598 115546 114682 114202 114955 116630 118547 120488 122342 123661
55066A23661N00O3J28J88Q9J79L70L1r65j886k067j550o55L63J040R18K28k29
55048A20406j15R1m9l44m77n11o32q34r81q52j91Q95J671J479N69k74q00j227
55030A17824j418j000k68Ok38k27L87J000J034O84L93K69K86M08L57j30o95p08
55012A17964k76p7j18L32J343J886J289J86n33q25r49p09j0N56M87J51O0n9o45
54993A20053j290j241o33k70l48l16N6L40K86K67O02R62R15O16O00J041J571J816
54975A25027J826J886K092K277K245J914J238K50p38j217r93l85K01O11O99J96
54959A37129p89j491j283n45k04n01p56l84M10J023J116P86L58O2k22p35j261
54942A32713j216n48o5l37q31p83m64o21j072q91J17J170J732J989K053J766J439
$$ plain form
55066 123661 124161 124224 124352 124540 124629 124808 125178 125209 124244 122358 120291 118741 118086 118449 119489 120407 120635 120406
55048 120406 120291 120382 120333 119989 119512 119001 118369 117535 116554 115702 115511 116406 118077 119556 120125 119851 119051 117824
55030 117824 116406 115406 115138 115144 114906 114679 115066 116066 117100 117784 118177 118446 118732 119140 119497 119367 118672 117964
55012 117964 117688 117611 117493 117825 119168 121054 122343 122529 121996 121171 120222 119513 119503 120059 120546 120697 120757 120698 120053
54993 120053 118763 117522 116889 116619 116271 115955 116011 116351 116637 116904 117506 118468 119383 119999 120599 121640 123211 125027
54975 125027 126853 128739 130831 133108 135353 137267 138505 138755 138017 136800 135807 135422 135623 136234 136933 137129
54959 137129 136340 134849 133566 133021 132817 132316 131560 131176 131586 132609 133725 134511 134869 134931 134709 133974 132713
54942 132713 131497 130949 130884 130547 129716 128933 128469 127848 126776 125885 126002 127172 128904 130893 132946 134712 136151
54925A36151J780K741L399L339L250L781M562M922M803M487L966L102J925M73
54911A82681j199k685l503l869m447n171n202m337l509l344l166k163p92j47m72
54896A38675j096j391j140l15P85J437J187M39n9j06Q2M33R26J236J109R61J584
54879A44747L218N262O774P092O200M789L681L011K210R46l99j419k266l196l944
54864A76706m145l946l742l607l414l216l068k723k040j392j260j561j790j615
54850A39187j060l36K00J63m09r58j030p98o42o64q15j187j702j892j505r80r43
54833A24629j332j494r98j7R02J241Q83L17K21O90J151J155P93K26n78j314j316
54816A25159n32J52J12j50R2O08P96Q35J225J636J320N21K44O73R34O39N39J087
$$ plain form
54925 136151 137931 140672 144071 147410 150660 154441 159003 163925 168728 173215 177181 180283 182208 182681
54911 182681 181482 178797 175294 171425 166978 161807 156605 152268 148759 145415 142249 140086 139294 139147 138675
54896 138675 137579 136188 135048 134733 135518 136955 138142 138581 138522 138416 138498 138931 139857 141093 142202 143163 144747
54879 144747 147965 153227 160001 167093 173293 178082 181763 184774 186984 187930 187531 186112 183846 180650 176706
54864 176706 172561 168615 164873 161266 157852 154636 151568 148845 146805 145413 144153 142592 140802 139187
54850 139187 138127 137791 137991 138154 137745 136787 135757 134959 134317 133653 132838 131651 129949 128057 126552 125572 124629
54833 124629 123297 121803 120805 120788 121690 122931 123814 124131 124352 125042 126193 127348 128141 128367 127789 126475 125159
54816 125159 124627 124779 124891 124741 124833 125441 126237 127072 128297 129933 131253 131774 132018 132691 133625 134264 134803 135890
54798A35890J458P26n98j147n03L93N53l2p59j189j163o01L45J122J203P57M99
54781A36954P76J111R36L95J07L86J095K027K901L215K816K533L431N334O792
54766A70809O852O065N419N033M472L692K904J942N42r98k090k720l399m305n034
54751A89184n248n115n004n006m907m431l499k403j603j233r42l63L52O75L39
54736A50796l36o81l20M14P71N25L54R40J960K530K473K408K626K765K690K881
54720A72796L528M021L756K798J498O8j180j946k592l790n187n487m401l383l574
54705A56925m137l707k508j731j524j136n28l64n82m52K3Q7l56n15j11K39J94
54688A39817J34J78j42p87r27k10N05L46m00q48o27L1Q04J301J105K48o42j034
$$ plain form
54798 135890 137348 138074 137476 136329 135826 136219 136772 136740 135981 134792 133629 133028 133373 134495 135698 136455 136954
54781 136954 137730 138841 139777 140172 140279 140665 141760 143787 146688 149903 152719 155252 158683 164017 170809
54766 170809 177661 183726 189145 194178 198650 202342 205246 207188 207730 206732 204642 201922 198523 194218 189184
54751 189184 183936 178821 173817 168811 163904 159473 155974 153571 151968 150735 149793 149430 149782 150457 150796
54736 150796 150460 149779 149459 149873 150644 151169 151523 152463 154423 156953 159426 161834 164460 167225 169915 172796
54720 172796 176324 180345 184101 186899 188397 188465 187285 185339 182747 178957 173770 168283 163882 160499 156925
54705 156925 152788 149081 146573 144842 143318 142182 141654 141290 140708 140256 140279 140366 140010 139495 139384 139623 139817
54688 139817 139951 140129 139987 139200 138273 138063 138568 138914 138514 137666 137039 137070 137874 139175 140280 140528 139886 138852
54670A38852j000p93m14Q1K74j39q59j296j239q77m20L4L48L31j21q81j514j531
54652A28836r04j99J09K62P02J196J087L56k43j99K70Q83J725K654K929J964J75
54635A41603j355j903j537q28l62l95o68p15l94M1L94O94Q79P70M76M54Q60J211
54617A39225R90L37j67k27q5j75o62j297j627j425r35n23j94K81Q57J178J123
54600A36674R54Q56P17N13M47N45M02k52j087j518j358q82l98o8Lk03m93n70l36
54581A33946J8K25K31K24L82O17O98O08N51N60L70o9k81J44Q76J215R92O39M63
54562A42409L66K71K86K94o7q38j535j725j404p28K33J198J712J715J723K052
54546A45962K241J724P28K8n1J02Q5j4J01N17J115J719K052J804R32j85j073j586
$$ plain form
54670 138852 137852 137059 136645 136726 137000 136861 136002 134706 133467 132590 132170 132204 132552 132883 132762 131881 130367 128836
54652 128836 127932 127733 127842 128104 128806 130002 131089 131445 131202 131003 131273 132156 133881 136535 139464 141428 141603
54635 141603 140248 138345 136808 135980 135618 135223 134555 133840 133446 133487 133881 134575 135454 136224 136700 137154 138014 139225
54617 139225 140215 140552 140385 140158 140073 139898 139236 137939 136312 134887 133952 133429 133235 133516 134373 135551 136674
54600 136674 137628 138484 139201 139714 140161 140706 141108 140856 139769 138251 136893 136011 135613 135545 135548 135345 134852 134282 133946
54581 133946 133964 134189 134420 134644 135026 135643 136341 136949 137500 138060 138430 138361 138080 138224 139100 140315 141307 141946 142409
54562 142409 142775 143046 143332 143626 143559 142721 141186 139461 138057 137329 137562 138760 140472 142187 143910 145962
54546 145962 148203 149927 150655 150683 150632 150734 150819 150805 150906 151423 152538 154257 156309 158113 159045 158860 157787 156201
54528A56201j871j979j708r64j06K71j03q85j419j252m56M41Q46N66n9n50o96
54511A46277n36j07M83R12R01O17M11K60p8m24k93K26L78j59p42p26l31j13r0
54492A46866LO8o7j15K40O76P00N07O32J002J119R84J017J115P29o7m17J42J064
54473A56198J580J545J205P70M90O36J054J169O96J6l89m99n55o48p45q10p16
54456A60997k87L38O70L65m03j116j315q75j53K23M0j88J00O33O79J58k70k72
54438A59324k82o48r82p53j00M09N45N74P41Q66N17l89j180r61K18J152R22J83
54420A60156K41J120J533Q57Ml8M11N36M54Q62J622J693N79q84j539j249p57m20
54402A65181K42J451K265J574j49j158p31j00m60j134p93L08P69K73j74r6r5l43
$$ plain form
54528 156201 154330 152351 150643 149679 149573 149844 149741 148856 147437 146185 145729 146170 147016 147582 147523 146973 146277
54511 146277 145741 145634 146117 147029 147930 148547 148958 149218 149140 148716 148423 148649 149027 148868 148126 147400 147069 146956 146866
54492 146866 146869 146937 146870 146755 146995 147671 148371 148878 149510 150512 151631 152615 153632 154747 155476 155409 154992 155134 156198
54473 156198 157778 159323 160528 161298 161788 162424 163478 164647 165343 165359 164970 164471 163916 163268 162523 161713 160997
54456 160997 160710 161048 161718 162083 161680 160564 159249 158374 158221 158444 158484 158296 158396 159029 159708 159866 159596 159324
54438 159324 159042 158394 157412 156659 156559 156968 157513 158087 158828 159694 160211 159822 158642 157681 157899 159051 159973 160156
54420 160156 160397 161517 163050 163907 163911 163873 164284 164820 165274 166136 167758 169451 170030 169146 167607 166358 165601 165181
54402 165181 165423 166874 169139 170713 170564 169406 168675 168575 168115 166981 166188 166496 167265 167538 167364 167268 167173 166830
54384A66830j43N81P80K1n79n5Q13P19k14p49l14N63J272J633J642J453J537K186
54366A77976K991L329L172L020L161L410L517L422L190K901K520J833P65l81j309
54351B13517k224l353m221m145l451l160l450l425k716k102k107k128j616j052
54337A74367r43r39p57r50j741k111j260q5Q6m75n36K8K91Rk25l27p50j227r12
54318A61543J05P50O03L63M85N40K37p5k56p01j380j588j102o63p94j038q49l96
54300A55784K3N49J121J092K73l52K05J461K038J457N44J40J26p0n43q01m16M21
54282A63052J093J284J306J494J548R07k36r25o12J25L48q8n04k53O30J524J756
54265A72449J137J12o83j014j077j029p57j07Q74J913K479J990M85j033j467r11
$$ plain form
54384 166830 166687 167268 168048 168069 167490 167435 168248 168967 168753 168004 167690 168253 169525 171158 172800 174253 175790 177976
54366 177976 180967 184296 187468 190488 193649 197059 200576 203998 207188 210089 212609 214442 215207 214826 213517
54351 213517 211293 207940 203719 199574 196123 192963 189513 186088 183372 181270 179163 177035 175419 174367
54337 174367 173424 172485 171728 170778 169037 166926 165666 165581 165667 165192 164656 164684 164975 164984 164759 164432 163682 162455 161543
54318 161543 161648 162398 163001 163364 163849 164389 164626 164551 164295 163594 162214 160626 159524 158861 158067 157029 156180 155784
54300 155784 155807 156356 157477 158569 158842 158490 158695 160156 162194 163651 164195 164335 164461 164391 163848 163047 162631 163052
54282 163052 164145 165429 166735 168229 169777 170684 170448 169523 168911 169036 169384 169296 168792 168539 169169 170693 172449
54265 172449 173586 173698 173015 172001 170924 169895 169138 169031 169905 171818 174297 176287 176772 175739 174272 173361
54249A73361n29j000j708j682q94j02K01J97K61M94P94J030J071P59L3q74j438
54232A69974j200k90O01Q97P44P04J042J475J534R54j58j247j588j000j65P6m17
54215A71936j198j933k423k250j150L14J161J130P85M78L2m82n30o5J64k23n46
54198A65200j80L36Q7p37j112o44Q9N57Q25R55O67j02q68j143r04l16N51J463
54180A64724J877J538R49P70Q52M72m58j081p35N7K93r3k41K86Q54P89L58K66
54162A71477N63O71K67m34j154j744j889j312l58J92R4n9K19O05N79K95L03O42
54144A68957P77M00j90n49n62l78j15J56L14K78J80K68N86Q15O05P9j71K22Q66
54125A72538J006M36k66m52r8L97P88J152J551J862J929J746J408R93M98p1n66
$$ plain form
54249 173361 172832 171832 170124 168442 167548 167446 167647 167844 168105 168599 169393 170423 171494 172253 172286 171412 169974
54232 169974 168774 168484 169085 169982 170726 171430 172472 173947 175481 176435 176277 175030 173442 172442 172277 172353 171936
54215 171936 170738 168805 166382 164132 162982 163296 164457 165587 166372 166850 166882 166400 165870 165805 165969 165746 165200
54198 165200 165020 165356 165443 164706 163594 162950 163039 163596 164421 165376 166043 165941 165073 163930 163026 162710 163261 164724
54180 164724 166601 168139 169088 169858 170710 171182 170724 169643 168908 168965 169258 169165 168924 169210 170064 170853 171211 171477
54162 171477 172040 172711 172978 172544 171390 169646 167757 166445 166087 166279 166373 166314 166533 167138 167717 168012 168315 168957
54144 168957 169734 170134 169944 169395 168833 168455 168340 168496 168810 169088 169268 169536 170122 170937 171542 171621 171450 171672 172538
54125 172538 173544 173980 173714 173262 173164 173561 174349 175501 177052 178914 180843 182589 183997 184990 185488 185417 184851
54108A84851p16l80K48P67R78J055J249J595J994K453L061L783M555N517O776
54093B17786P797P443N107J668j279l108m542o160p296p013n600m226l357k413
54079A94807j096l4K35K04P11J808K876L526L965M521N196N495M704K634J75j390
54063B28337j785j902k359k742k716k913l793m377l343j031Q45J396J277J157
54049B06051P11l42j224r40M13J849K778L400L979M351M310M126M300M812N021
54034B43595M621M329M966N913N447L133Q85P55K334L458L100K247J950J914J465
54019B90112P62L72K62o2q28j858k808l296l123k642k568l214m227n139n727n790
54003B50226n127m028l212l033l167l209l081k691j812o71r5n78j572k094j727
$$ plain form
54108 184851 184135 183755 184003 184770 185748 186803 188052 189647 191641 194094 197155 200938 205493 211010 217786
54093 217786 225583 233026 238133 239801 238522 235414 230872 224712 217416 210403 204803 200577 197220 194807
54079 194807 193711 193677 193912 194116 194827 196635 199511 203037 207002 211523 216719 222214 226918 229552 229727 228337
54063 228337 226552 224650 222291 219549 216833 213920 210127 205750 202407 201376 202221 203617 204894 206051
54049 206051 206762 206420 205196 204256 204669 206518 209296 212696 216675 221026 225336 229462 233762 238574 243595
54034 243595 248216 252545 257511 263424 268871 272004 272889 273644 275978 279436 282536 284783 286733 288647 290112
54019 290112 290874 291246 291508 291446 290618 288760 285952 282656 279533 276891 274323 271109 266882 261743 256016 250226
54003 250226 245099 241071 237859 234826 231659 228450 225369 222678 220866 220195 220100 219522 217950 215856 214129
53988B14129p89J33M94J9r69j696j641r83j94M36P41N40j92j101j599j174K11
53971B06365J775K248J266J54N91K562M475N317N642O260P069P736Q618J0201
53957B70279J2265J4082J4913J3963J0615N336l31n069q535j0552j0675r290p900
53944B89101p378o769m968k670j302p81J71J780K974L312L562M103M131L080J780
53929B90126J452K239L306L884L791L268K695K330K152K094K333L005L761M167
53915C30603M369M850N621O198O383O445O464O074M968L237J177p67j986k171
53901C81465j801j650j873k077k189k536l157l750m309n123o055o606o782p068
53887C26489p450p313o629o238o502o562n617m224l518l655l843l566l007k426
$$ plain form
53988 214129 213340 213473 213967 213986 213017 211321 209680 208697 208503 208939 209680 210220 210028 208927 207328 206154 206365
53971 206365 208140 210388 211654 211808 212399 214961 219436 224753 230395 236655 243724 251460 260078 270279
53957 270279 282544 296626 311539 325502 336117 341453 341122 336053 327518 316966 306291 297001 289101
53944 289101 281723 274954 269986 267316 266014 265233 265404 267184 270158 273470 277032 281135 285266 288346 290126
53929 290126 291578 293817 297123 301007 304798 308066 310761 313091 315243 317337 319670 322675 326436 330603
53915 330603 334972 339822 345443 351641 358024 364469 370933 377007 381975 385212 386389 385622 383636 381465
53901 381465 379664 378014 376141 374064 371875 369339 366182 362432 358123 353000 346945 340339 333557 326489
53887 326489 319039 311726 305097 298859 292357 285795 280178 275954 272436 268781 264938 261372 258365 255939
53873B55939j919j760k259l186l798l637k993k430k155k014j884j814j850j832
53859B22408j528j047q97j465k462l150l100k521j809j074k60N37J077J206J048
53844B06963R89J323J787J676P41k77m80l0P9n81j362j509j044l70L27R64J331
53827B10527J392J421J532J426R36L88R1r4k83j47N67J417J816J857K027K340
53811B27213K347J946J564J568J928K430K888L129L224L559M306M934M731L769
53797B69536K865K554K685K987L449L954M079L638K963K361J702Q41O9k97n21
53782C02865j109j988k544k500k361k768l692m495m680m374m022l791l439k810
53768B58292k239k194k627k939k778k512k666l134l297k877k257j883j705j391
$$ plain form
53873 255939 254020 252260 250001 246815 243017 239380 236387 233957 231802 229788 227904 226090 224240 222408
53859 222408 220880 219833 218936 217471 215009 211859 208759 206238 204429 203355 203095 203632 204709 205915 206963
53844 206963 207952 209275 211062 212738 213479 213202 212722 212692 212771 212190 210828 209319 208275 207905 208232 209196 210527
53827 210527 211919 213340 214872 216298 217234 217622 217713 217619 217336 217189 217756 219173 220989 222846 224873 227213
53811 227213 229560 231506 233070 234638 236566 238996 241884 245013 248237 251796 256102 261036 265767 269536
53797 269536 272401 274955 277640 280627 284076 288030 292109 295747 298710 301071 302773 303614 303683 303386 302865
53782 302865 301756 299768 297224 294724 292363 289595 285903 281408 276728 272354 268332 264541 261102 258292
53768 258292 256053 253859 251232 248293 245515 243003 240337 237203 233906 231029 228772 226889 225184 223793
53754B23793q64l56j38l64j031j830k144j591n16K84M30K53J73J56k8l11m02k01
53736B15313J43N38R84J389J588J547J301Q09J20l38o5P63J302J009L37J85P95
53719B27720J530J694J303J003J369K312L150L283K780K218J909J594J038O18
53705B53521R12J844K706L030L026L051L100L153L547M470N277M932L326J621
53691B97516R78J295J499R14j29q78r17k78O92J412J368O78J16K14N43K96o01
53674C04718j402j606j555j757k050j862j058q6N99R02R04O85M30L10J71l37j107
53657B95899j408o99N12J066M23p77j504j371p55j50K96P12J218J745K034J801
53641B99042J072L01o0p1k00n06l13J000K970M287M201L310K693K617K647K741
$$ plain form
53754 223793 222929 222573 222435 222071 221040 219210 217066 215475 214959 215243 215673 215926 216099 216255 216227 215916 215514 215313
53736 215313 215456 215994 216978 218367 219955 221502 222803 223612 223732 223394 223329 224092 225394 226403 226740 226925 227720
53719 227720 229250 230944 232247 233250 234619 236931 240081 243364 246144 248362 250271 251865 252903 253521
53705 253521 254433 256277 258983 262013 265039 268090 271190 274343 277890 282360 287637 292569 295895 297516
53691 297516 298494 299789 301288 302202 302073 301195 300278 300000 300692 302104 303472 304150 304266 304480 305023 305319 304718
53674 304718 303316 301710 300155 298398 296348 294486 293428 293342 293941 294843 295747 296432 296862 297172 297343 297006 295899
53657 295899 294491 293792 294304 295370 295793 295016 293512 292141 291386 291236 291532 292244 293462 295207 297241 299042
53641 299042 300114 300415 300355 300284 300084 299578 299265 300265 303235 307522 311723 315033 317726 320343 322990 325731
53625C25731L447M797N826N808N364N572O259O159M741K997K113K156K483K697
53611C86150K666K238J602J511K319L243L255K491J962K107K506K852L290L659
53597D21851L393K424J438R07O23M18N24Q49O98j89j059j277j294j767k350k297
53581D22892j815j741k125k180j664j275j480j833j855j850k305k966l105k490
53567C94208j606j007p70o16l92k21k63l77k74KJ8m36r42j036q87q95q00R0J670
53548C85466K761K493J464R95J485K085J969J356J057J388J944K320K667L341
53534D12791M319N218N881O505P214P764P970Q091Q543R356J0139J0616J0900
53521E15307J1255J1760J2274J2651J2960J3469J4386J5691J7302J9305K1690
$$ plain form
53625 325731 329178 333975 339801 345609 350973 356545 362804 368963 373704 376701 378814 380970 383453 386150
53611 386150 388816 391054 392656 394167 396486 399729 402984 405475 407437 409544 412050 414902 418192 421851
53597 421851 425244 427668 429106 430013 430636 431054 431578 432427 433125 432936 431877 430600 429306 427539 425189 422892
53581 422892 421077 419336 417211 415031 413367 412092 410612 408779 406924 405074 402769 399803 396698 394208
53567 394208 392602 391595 390825 390209 389817 389596 389333 388956 388682 388684 388702 388266 387324 386288 385401 384506 383706 383796 385466
53548 385466 388227 390720 392184 393179 394664 396749 398718 400074 401131 402519 404463 406783 409450 412791
53534 412791 417110 422328 428209 434714 441928 449692 457662 465753 474296 483652 493791 504407 515307
53521 515307 526562 538322 550596 563247 576207 589676 604062 619753 637055 656360 678050
53510F78050K3932K5232K5321K4751K4252K4124K4386K4993K5625K5696K4954
53499I51316K3775K2570K1338K0210J9862K0672K1787K1858K0653J9286J8758
53488A182085J9013J9443J9702J9744J9503J8957J8263J7687J7448J7603J7912
53477A387360J7918J7420J6650J5779J4512J2603J0405Q335O114L245M6k703m977
53464A502707p439j0089j2058j3020j3761j4848j5719j5850j5919j6812j8142
53453A349050j8842j8909j9375k0556k1461k1303k0658k0568k1028k1084k0198
53442A125068j8955j8232j8053j7473j5606j2637r695p750o738n849m489k761
53430I86830j045N17J911K948L435L600M013M937O114P366R062J1524J4287J6463
$$ plain form
53510 678050 701982 727214 752535 777286 801538 825662 850048 875041 900666 926362 951316
53499 951316 975091 997661 1018999 1039209 1059071 1079743 1101530 1123388 1144041 1163327 1182085
53488 1182085 1201098 1220541 1240243 1259987 1279490 1298447 1316710 1334397 1351845 1369448 1387360
53477 1387360 1405278 1422698 1439348 1455127 1469639 1482242 1492647 1500982 1507096 1510341 1510387 1507684 1502707
53464 1502707 1495268 1485179 1473121 1460101 1446340 1431492 1415773 1399923 1384004 1367192 1349050
53453 1349050 1330208 1311299 1291924 1271368 1249907 1228604 1207946 1187378 1166350 1145266 1125068
53442 1125068 1106113 1087881 1069828 1052355 1036749 1024112 1014417 1006667 999929 994080 989591 986830
53430 986830 985785 986302 988213 991161 994596 998196 1002209 1007146 1013260 1020626 1029688 1041212 1055499 1071962
53416A071962J7871J9121K0608K1987K2959K3838K4955K6016K6626K7096K8084
53405A331123K9773L1828L3975L6126L8210M0368M2966M5984M8713N0631N2126
53394A781823N3730N5117N5786N6256N7488N9237O0182N9715N8513N7233N5739
53383B410819N3943N2306N0987M9402M7176M4683M2182L9170L5234L0810K6501
53372B883213K2239J7734J3146Q617L652k380r377j6668k3722l0293l6279m1839
53360B788043m7259n2286n5987n7718n7889n7417n6889n6484n6155n5461n3757
53349B180741n1109m8467m6605m5378m4380m3631m3140m2587m1960m1760m1852
53338A689872m1029l8624l5684l3510l1756k9231k5996k3177k1092j9050j6923
$$ plain form
53416 1071962 1089833 1108954 1129562 1151549 1174508 1198346 1223301 1249317 1275943 1303039 1331123
53405 1331123 1360896 1392724 1426699 1462825 1501035 1541403 1584369 1630353 1679066 1729697 1781823
53394 1781823 1835553 1890670 1946456 2002712 2060200 2119437 2179619 2239334 2297847 2355080 2410819
53383 2410819 2464762 2517068 2568055 2617457 2664633 2709316 2751498 2790668 2825902 2856712 2883213
53372 2883213 2905452 2923186 2936332 2944949 2948601 2946221 2936844 2920176 2896454 2866161 2829882 2788043
53360 2788043 2740784 2688498 2632511 2574793 2516904 2459487 2402598 2346114 2289959 2234498 2180741
53349 2180741 2129632 2081165 2034560 1989182 1944802 1901171 1858031 1815444 1773484 1731724 1689872
53338 1689872 1648843 1610219 1574535 1541025 1509269 1480038 1454042 1430865 1409773 1390723 1373800
53327A373800j5388j4471j3381j2073j1668j2675j3995j4428j4196j4155j4267
53316A223103j3765j2399j0673r095p799o739n707m336k526p49M67J292K392L980
53302A157446N457O272O899Q500J1477J4684J6522J6816J7040J8545K1087K3488
53290A324233K5178K6469K7648K8584K9105K9110K8324K6525K4125K1926K0258
53279A611485J8730J6843J4371J1262P696M258J481q53l447o451r313j1666j3806
53266A640590j6061j8368k0662k3150k5813k8129k9635l0405l0679l0526l0192
53255A356970l0316l1202l2207l2319l1288k9784k8498k7512k6601k5754k5264
53244A036225k5376k6021k6758k7009k6396k5074k3687k2811k2313k1430j9683
$$ plain form
53327 1373800 1358412 1343941 1330560 1318487 1306819 1294144 1280149 1265721 1251525 1237370 1223103
53316 1223103 1209338 1196939 1186266 1177171 1169372 1162633 1156926 1152590 1150064 1149315 1149782 1151074 1153466 1157446
53302 1157446 1162903 1169175 1176074 1184574 1196051 1210735 1227257 1244073 1261113 1279658 1300745 1324233
53290 1324233 1349411 1375880 1403528 1432112 1461217 1490327 1518651 1545176 1569301 1591227 1611485
53279 1611485 1630215 1647058 1661429 1672691 1680387 1684645 1686126 1685273 1681826 1675375 1666062 1654396 1640590
53266 1640590 1624529 1606161 1585499 1562349 1536536 1508407 1478772 1448367 1417688 1387162 1356970
53255 1356970 1326654 1295452 1263245 1230926 1199638 1169854 1141356 1113844 1087243 1061489 1036225
53244 1036225 1010849 984828 958070 931061 904665 879591 855904 833093 810780 789350 769667
53233G69667j7598j6124j5484j4987j3990j2460j0534q308o360n741o755q352
53221F32974r329r683j0114j0774j1368j2033j3053j3962j4020j3449j3154j3227
53209D88808j2773j1337r535q036o887o101n934o269o511o496o699p258p669p712
53195C79591p802q041p918p437p406p977p905o316m249l344l598l710l156k642
53181B98090k619k655k449k422k873l337l200k498j720j166q15o13o46r94j550
53166B68533j957j923j544j208j092j068j067j142j115p00j82k42q06q11K06J076
53150B54958N13q97j451q11m19j214k166j801k83Q55O62l40j068r94k78O99J624
53133B47589K267K503K317J765R35L8n36m60J19O38P62P57R43J073P48L38O93
$$ plain form
53233 769667 752069 735945 720461 705474 691484 679024 668490 660182 653822 648081 641326 632974
53221 632974 623645 613962 603848 593074 581706 569673 556620 542658 528638 515189 502035 488808
53209 488808 476035 464698 455163 447127 440240 434139 428205 421936 415425 408929 402230 394972 387303 379591
53195 379591 371789 363748 355830 348393 340987 333010 325105 318789 314540 311196 307598 303888 300732 298090
53181 298090 295471 292816 290367 287945 285072 281735 278535 276037 274317 273151 272336 271723 271077 270083 268533
53166 268533 266576 264653 263109 261901 260809 259741 258674 257532 256417 255717 255535 255293 254487 253676 253882 254958
53150 254958 255471 254574 253123 252312 251893 250679 248513 246712 246429 247284 247946 247606 246538 245544 245266 245965 247589
53133 247589 249856 252359 254676 256441 257376 257414 256878 256418 256537 257175 257937 258694 259637 260710 261458 261796 262489
53116B62489J817K618K317J457R46P90M13k06o34r41j621k618l209l008k387j757
53100B56466j074l17J83K22J09K08L77L19J39J92M09K64n03j411j677j142m97
53083B52267m60r26j199r32m60j21J84N34O28K48l01o93j091j638j814j116j11
53066B42999O9p50j537j447o63K53J007J293P62k08m37O60K106K487J639N05l15
53049B48423j018j677j774r81K38J093J238Q80M43L44O89J050P72k11j152j336
53033B47021r38p13r63j254j126o76k85j34q6P2N18J257J953K094J581R81R23
53016B50225J324J557J264O39k4o24j020j012o84m18l41k04M1J9l97o43k31M59
52998B49930P18N55N45Q31J046J134J404J674J193j60j305j169J4J153J627J612
$$ plain form
53116 262489 264306 266924 269241 270698 271644 272434 272847 272641 272007 271066 269445 266827 263618 260610 258223 256466
53100 256466 255392 255075 255258 255480 255589 255797 256174 256493 256632 256824 257233 257497 256994 255583 253906 252764 252267
53083 252267 251807 250881 249682 248750 248290 248169 248353 248887 249515 249763 249462 248769 247678 246040 244226 243110 242999
53066 242999 243068 242318 240781 239334 238671 238924 239931 241224 241986 241778 241341 242001 244107 246594 248233 248738 248423
53049 248423 247405 245728 243954 242973 243211 244304 245542 246422 246865 247209 247898 248948 249720 249509 248357 247021
53033 247021 246083 245370 244407 243153 242027 241351 241066 240932 240846 240918 241436 242693 244646 246740 248321 249302 250225
53016 250225 251549 253106 254370 255009 254985 254361 253341 252329 251645 251227 250886 250682 250723 250742 250345 249702 249471 249930
52998 249930 250648 251203 251748 252579 253625 254759 256163 257837 259030 258870 257565 256396 256410 257563 259190 260802
52982B60802J363R66O91Q94J390J475Q38N7j10L73Q93R68O64L07J51L05P44J244
52964B74015J466J211O61K65L59Q87J436J605J274N75l22j275k044k346k152j845
52948B73770j865k196k412k229j812j455j163p34j66K81L86J39l75j065j741k075
52932B55288j864j175k41O72J247J183N22k31n61m67l48k95M8Q32J533J535J009
52915B58687P28R25R29J63q97j235n46M66J009Q82L29l55q85j115j238j496j667
52898B54684j299n68k48n47o64kQ36R49N48N73J211J723J688J426J175P02j1m92
52880B61684m83l12k61j72L9J53K01O03J325J580R28J23J79J009J630J475Q84
52863B70585M26K86K32m0n88j086j210j210j627k354k591k096j683k048k753l067
$$ plain form
52982 260802 262165 263131 263822 264716 266106 267581 268419 268476 268366 268739 269632 270600 271264 271571 271722 272027 272771 274015
52964 274015 275481 276692 277353 277618 277977 278864 280300 281905 283179 283754 283432 282157 280113 277767 275615 273770
52948 273770 271905 269709 267297 265068 263256 261801 260638 259904 259738 260019 260405 260544 260169 259104 257363 255288
52932 255288 253424 252249 252008 252680 253927 255110 255632 255401 254840 254373 254025 253730 253778 254610 256143 257678 258687
52915 258687 259415 260340 261269 261432 260535 259300 258754 259220 260229 261111 261440 261085 260200 259085 257847 256351 254684
52898 254684 253385 252817 252569 252022 251358 251356 252192 253141 253689 254262 255473 257196 258884 260310 261485 262187 262176 261684
52880 261684 261201 260889 260628 260456 260495 260648 260849 261452 262777 264357 265285 265408 265587 266596 268226 269701 270585
52863 270585 271011 271297 271529 271489 270901 269815 268605 267395 265768 263414 260823 258727 257044 254996 252243 249176
52847B49176l082l129k731j317L63Q23j33j126j144p10p10j113j393j499j628
52832B30647j558r14J35R98J329J217Q54M01J37L17Q28J178R64L27j12J31Q29
52815B37708J251J047P00R27J793K739L257L161K402J063m41j638k494l259l893
52800B44323m064l699l030k175j151l26k15o90r96p63m66n74q31p81n01l27j85
52783B23549K63J037J752K052J807J094K36l16m31m41n86o01j81L94N42J67l28
52766B30009p06j117j495j341l91P78J260Q94M80P22J301J328N74j97k58J82M25
52749B32448L22L93J000J900K611K836K503J760J041P77R65J249J404J428J214
52734B53851O54J22K60J112J897J995J614J267J034P62M94K08m76j725k852k925
$$ plain form
52847 249176 246094 242965 240234 238917 239280 240103 239970 238844 237700 236990 236280 235167 233774 232275 230647
52832 230647 229089 228175 228310 229308 230637 231854 232708 233109 233246 233563 234391 235569 236533 236860 236748 236879 237708
52815 237708 238959 240006 240706 241633 243426 246165 249422 252583 254985 256048 255607 253969 251475 248216 244323
52800 244323 240259 236560 233530 231355 230204 229878 229663 228973 227977 227214 226748 226174 225343 224562 224061 223734 223549
52783 223549 223812 224849 226601 228653 230460 231554 231790 231474 231043 230602 230016 229415 229234 229628 230170 230337 230009
52766 230009 229303 228186 226691 225350 224959 225737 226997 227891 228371 229093 230394 231722 232296 232099 231841 232023 232448
52749 232448 232770 233163 234163 236063 238674 241510 244013 245773 246814 247591 248556 249805 251209 252637 253851
52734 253851 254505 254627 254887 255999 257896 259891 261505 262772 263806 264568 265062 265270 264794 263069 260217 257292
52718B57292j988j043p98r32p78l11q8m55j109j423j110m76q3j62m00l28J97R10
52700B46915J457J691J738J782J784J442N93m09r48q28m66l13l52k97j2L75O03
52683B54755L90l56j255j644j229m06K08L87L41L26M05M11R9m48o51o5P63P02
52665B52733m64j502j187J99J410J853J959K159K372K503K726L039L109K768K193
52650B75870J454L65r76j961k182k003k031k262k185j581q30m21m45o23o23k92
52634B59274K48O94Q87J039J510K284K817K529J385r5j359k169k490k274j584
52619B62696p50k29k20n38q35q16l79K78O96N76J38j31j4L43P91J223J280N88
52601B64697n80j308j055l07J51K20L04M89M65J57j01q1J10L67P43J163J322J097
$$ plain form
52718 257292 255304 254261 253463 252531 251753 251442 251354 250899 249790 248367 247257 246781 246698 246536 246136 245808 246005 246915
52700 246915 248372 250063 251801 253583 255367 256809 257402 256993 256045 255217 254751 254438 254086 253789 253777 254152 254755
52683 254755 255145 254789 253534 251890 250661 250255 250463 250850 251191 251517 251922 252333 252432 251984 251333 251268 252031 252733
52665 252733 252269 250767 249580 249779 251189 253042 255001 257160 259532 262035 264761 267800 270909 273677 275870
52650 275870 277324 277689 276713 274752 272570 270567 268536 266274 264089 262508 261678 261257 260812 260189 259566 259274
52634 259274 259522 260216 261103 262142 263652 265936 268753 271282 272667 272572 271213 269044 266554 264280 262696
52619 262696 261946 261717 261497 260959 260124 259308 258929 259207 259903 260479 260617 260486 260472 260815 261606 262829 264109 264697
52601 264697 264117 262809 261754 261447 261598 261818 262122 262611 263076 263233 263132 263051 263161 263528 264271 265434 266756 267853
52583B67853Q08Q67J217J373R38R9n09m36Q1M26L64K28L16M52L63J59M2j47o71
52564B73823j351j745j773j650j364p14J04M99K20l80q43r78o44J59Q74P21j86
52547B64772o60J07J363J710Q72j18l37J21O57R32Q51L62l93r70r70m33K71Q00
52529B68937J018J018J035J166J102L98q41j767j613n79L76N59J09l74n04k63
52513B69777J88P04J203J649J989K127K041J865J720J435P66j30p04p32p03j213
52497B81982k085k516k060j138n04m86q51j175j178q81n26l15k12q8Kp4k47k95
52479B67353k52l20m04j05N93J103R79N88N56R04J222J515K182L069L251K191
52463B84425O73P3Q01J920K331J878J136M73k21r76j498j601j549j667j896k012
$$ plain form
52583 267853 268661 269528 270745 272118 273056 273155 272646 272210 272291 272717 273081 273309 273625 274077 274440 274599 274641 274494 273823
52564 273823 272472 270727 268954 267304 265940 265226 265330 265829 266049 265669 264826 263848 263204 263363 264237 264958 264772
52547 264772 264112 264219 265582 267292 268164 268046 267709 267830 268487 269419 270270 270632 270239 269269 268299 267866 268137 268937
52529 268937 269955 270973 272008 273174 274276 274674 273833 272066 270453 269874 270250 270809 270918 270544 270040 269777
52513 269777 269965 270669 271872 273521 275510 277637 279678 281543 283263 284698 285464 285334 284630 283898 283195 281982
52497 281982 279897 277381 275321 274183 273679 273193 272342 271167 269989 269108 268582 268267 268055 267967 267969 267895 267648 267353
52479 267353 267101 266781 266377 266272 266865 267968 268947 269535 270091 270995 272217 273732 275914 278983 282234 284425
52463 284425 285098 285171 285972 287892 290223 292101 293237 293710 293489 292513 291015 289414 287865 286198 284302 282290
52447B82290k088k279k313j751p47n7r3m19m43j72k8j81m56n91m09J03N89N60
52429B71515J5m54m26j34J33N64J241J533Q69j70l89M80J549K118K377K647K818
52412B86286K956L606M903O036O375O629P997J0331J1990J1576R146N584J549
52399C74964k484n746p555q099q286q645q773q031o463m675l151k054j520j612
52385B97870j910j710q22J75P82J255K040K945L383L233K921K755K654K574K643
52370C20788K873L150L524M009M176L513K318J546J546J592J028K66R1M52O68
52355C51540M55J07j82m66n04J70J404K259K044J186P17J142K071K829L112L069
52339C70953L038L292L902M771N744O666P392P827Q036Q234Q619R313J0405J1912
$$ plain form
52447 282290 280202 277923 275610 273859 273112 273055 272962 272543 272100 271928 271900 271719 271263 270672 270263 270366 270955 271515
52429 271515 271530 271076 270650 270516 270649 271213 272454 273987 274856 274686 274297 274777 276326 278444 280821 283468 286286
52412 286286 289242 292848 297751 303787 310162 316791 324788 335119 347109 358685 367831 373415 374964
52399 374964 372480 366734 359179 351080 342794 334149 325376 317345 310882 306207 303056 301002 299482 297870
52385 297870 295960 294250 293428 293603 294385 295640 297680 300625 304008 307241 310162 312917 315571 318145 320788
52370 320788 323661 326811 330335 334344 338520 342033 344351 345897 347443 349035 350063 350329 350420 350872 351540
52355 351540 351995 352102 351920 351454 350950 351120 352524 354783 356827 358013 358730 359872 361943 364772 367884 370953
52339 370953 373991 377283 381185 385956 391700 398366 405758 413585 421621 429855 438474 447787 458192 470104
52325D70104J3577J4887J5531J5805J6317J7166J7752J7553J6929J6711J7065
52314F49397J7310J6950J6455J6576J7288J7875J7959J7840J7805J7692J7345
52303H40492J6989J6801J6484J5664J4439J3085J1445R162O525M432L318K571
52291I71407J303n71k431l934n352o877q081q384p853p105o467n623m262k714
52277I03056j619j111o57K66J601K948M092N184O437P879R311J0457J1119J1318
52263I70281J1256J1220J1475J2174J3196J4109J4487J4351J4130J4099J4051
52252A114829J3670J3051J2426J1490R458O109K429k10j452k201l405n071o635
52239A164488p881r008j0098j0920j1233j0936j0043q954q529r288j0505j0832
$$ plain form
52325 470104 483681 498568 514099 529904 546221 563387 581139 598692 615621 632332 649397
52314 649397 666707 683657 700112 716688 733976 751851 769810 787650 805455 823147 840492
52303 840492 857481 874282 890766 906430 920869 933954 945399 954561 961086 965518 968836 971407
52291 971407 972710 972139 969708 965774 960422 953545 945464 937080 929227 922122 915655 910032 905770 903056
52277 903056 901437 900326 899669 899935 901536 904484 908576 913760 920197 928076 937387 947844 958963 970281
52263 970281 981537 992757 1004232 1016406 1029602 1043711 1058198 1072549 1086679 1100778 1114829
52252 1114829 1128499 1141550 1153976 1165466 1174924 1181033 1183462 1183252 1181800 1179599 1176194 1171123 1164488
52239 1164488 1156607 1147599 1137501 1126581 1115348 1104412 1094369 1085415 1076886 1067598 1057093 1046261
52227A046261r952q854q213p462o041m665m352m735m524l284j728l63R38K055
52213I85081K520K638L424M969N873N129L572K673K678K897L157L788M552M779
52199A037730M524M614N444O507P186P287O750N538L981K626J627P99K47K39L90
52184A095489k82k160m495o308p296p677p722p712p853p926p509o755o296o210
52170A009288n775m583l147j938p27N26J053M99jQ45K530L369K876K194K155K228
52154A011392J715Q68L02J32K32O11J136J460J599J945K348K033Q25l27o46n64
52138A025061q18j217j163o95o9J022K791M392M907N043O464R467J2630J4974
52124A082789J7124J9798K2386K3903K4459K4886K5414K5649K5461K5127K4706
$$ plain form
52227 1046261 1036309 1027455 1019242 1011780 1005739 1001074 996722 991987 987463 984179 982451 982088 983026 985081
52213 985081 987601 990239 993663 998632 1004505 1009634 1013206 1015879 1018557 1021454 1024611 1028399 1032951 1037730
52199 1037730 1042254 1046868 1052312 1058819 1066005 1073292 1080042 1085580 1089561 1092187 1093814 1094613 1094860 1095099 1095489
52184 1095489 1095207 1093047 1088552 1082244 1074948 1067271 1059549 1051837 1043984 1036058 1028549 1021794 1015498 1009288
52170 1009288 1003513 998930 995783 993845 993118 993644 994697 995196 995195 996040 998570 1001939 1004815 1007009 1009164 1011392
52154 1011392 1013107 1013975 1014277 1014409 1014641 1015252 1016388 1017848 1019447 1021392 1023740 1025773 1026598 1026271 1025625 1025061
52138 1025061 1024243 1023026 1021863 1021168 1021099 1022121 1024912 1029304 1034211 1039254 1045718 1055185 1067815 1082789
52124 1082789 1099913 1119711 1142097 1166000 1190459 1215345 1240759 1266408 1291869 1316996 1341702
52113A341702K3921K2674K1227J9927J8990J8406J7835J6799J5172J3324J1615
52102A541592J0047Q598P379O215M526K055o72l027n100p421j0182j3167j6054
52089A524789j8295j9143j8424j7011j5896j5096j4042j2725j1584j0450q610
52078A363513o112m016l027k525j373P58L276N404O756P541Q490J0254J2618J4618
$$ plain form
52113 1341702 1365623 1388297 1409524 1429451 1448441 1466847 1484682 1501481 1516653 1529977 1541592
52102 1541592 1551639 1560237 1567616 1573831 1578357 1580412 1579740 1576713 1571613 1564192 1554010 1540843 1524789
52089 1524789 1506494 1487351 1468927 1451916 1436020 1420924 1406882 1394157 1382573 1372123 1363513
52078 1363513 1357401 1353385 1350358 1347833 1346460 1347218 1350494 1355898 1362654 1370195 1378685 1388939 1401557 1416175
$$ [...]
##END NTUPLES=NMR SPECTRUM
##END=
