
##TITLE=AC1302_PERAH12114_6535671_KetVU1Pe3j
##JCAMPDX= 6.0         $$ Bruker NMR JCAMP-DX V2.0
##DATA TYPE= NMR SPECTRUM
##DATA CLASS= NTUPLES
##ORIGIN= BRUKER
##OWNER= Administrator
$$ 1.72 TOPSPIN		Version 2.1
$$ 2012-12-12 03:01:56.106 -0500  Administrator@X
$$ Compression mode = diff/dup
##.OBSERVE FREQUENCY= 400.02188249412
##.OBSERVE NUCLEUS= ^1H
##.ACQUISITION MODE= SIMULTANEOUS (DQD)
##.ACQUISITION SCHEME= undefined
##.AVERAGES= 8
##.DIGITISER RES= 22
##SPECTROMETER/DATA SYSTEM= spect
##.PULSE SEQUENCE= zg30
##.SOLVENT NAME= COFFEE_meoh
##.SHIFT REFERENCE= INTERNAL, COFFEE_meoh, 1, 14.98509
##AUDIT TRAIL= $$ (NUMBER, WHEN, WHO, WHERE, PROCESS, VERSION, WHAT)
$$ ##TITLE= Audit trail, TOPSPIN		Version 2.1
$$ ##JCAMPDX= 5.01
$$ ##ORIGIN= Bruker BioSpin GmbH
$$ ##OWNER= Administrator
$$ $$ E:\/data/COFFEE/nmr/AC1302_PERAH12114_6535671_KetVU1Pe3j/90/pdata/1/auditp.txt
$$ ##AUDIT TRAIL=  $$ (NUMBER, WHEN, WHO, WHERE, PROCESS, VERSION, WHAT)
(   1,<2012-12-12 03:01:47.590 -0500>,<Administrator>,<X>,<go>,<TOPSPIN 2.1>,
      <created by zg
	started at 2012-12-12 03:00:41.059 -0500,
	POWCHK enabled, PULCHK disabled,
       configuration hash MD5:
       86 BA 57 50 F2 9D 5C 9B 26 00 A9 28 5F 66 2E 89
       data hash MD5: 64K
       61 38 1C CC D6 3E 32 45 89 69 57 AD 1E 01 6F 65>)
(   2,<2012-12-12 03:01:50.778 -0500>,<Administrator>,<X>,<proc1d>,<TOPSPIN 2.1>,
      <Start of raw data processing
       efp LB = 0 FT_mod = 6 PKNL = 1 PHC0 = 0 PHC1 = 0 SI = 32K 
       data hash MD5: 32K
       74 5E 39 E6 DA 3A 38 22 67 E0 83 0C 45 63 59 BC>)
(   3,<2012-12-12 03:01:51.278 -0500>,<Administrator>,<X>,<proc1d>,<TOPSPIN 2.1>,
      <pk PHC0 = 95.09216 PHC1 = 0 
       data hash MD5: 32K
       10 74 65 E1 CC A1 CF 8E E8 56 1F DE 60 E3 89 B7>)
(   4,<2012-12-12 03:01:51.543 -0500>,<Administrator>,<X>,<proc1d>,<TOPSPIN 2.1>,
      <abs ABSG = 1 
       data hash MD5: 32K
       7F FF 7F 9C A7 15 05 8B 87 32 65 46 76 80 EB 5B>)
(   5,<2012-12-12 03:01:51.699 -0500>,<Administrator>,<X>,<proc1d>,<TOPSPIN 2.1>,
      <abs ABSG = 2 
       data hash MD5: 32K
       27 96 47 29 7D 68 96 F1 62 1A 5F 1D 26 A3 85 2F>)
(   6,<2012-12-12 03:01:51.856 -0500>,<Administrator>,<X>,<proc1d>,<TOPSPIN 2.1>,
      <abs ABSG = 3 
       data hash MD5: 32K
       98 CA E7 ED A5 16 03 74 07 DB B8 A0 0F A2 B9 97>)
(   7,<2012-12-12 03:01:52.028 -0500>,<Administrator>,<X>,<proc1d>,<TOPSPIN 2.1>,
      <abs ABSG = 4 
       data hash MD5: 32K
       53 D1 83 6D B8 B4 68 40 20 27 E8 82 B7 D7 AE F6>)
(   8,<2012-12-12 03:01:52.184 -0500>,<Administrator>,<X>,<proc1d>,<TOPSPIN 2.1>,
      <abs ABSG = 5 
       data hash MD5: 32K
       4E 29 92 98 38 AF 53 09 E3 59 61 F3 77 F2 D8 1A>)
$$ ##END=
$$ 
$$ $$ hash MD5
$$ $$ 02 F4 AB 97 0C 9E 4A B1 B0 34 B4 90 55 5B 82 27
##$RELAX= 
##$RELAX= 
##$RELAX= 
##$RELAX= 
##$RELAX= 
##$RELAX= 
##$RELAX= 
##$RELAX= 
$$ Bruker specific parameters
$$ --------------------------
##$DU= <E:\>
##$EXPNO= 90
$$ [...]
##$TP= (0..7)
150 150 150 150 150 150 150 150
##$TP07= 0
##$TPNAME0= <>
##$TPNAME1= <>
##$TPNAME2= <>
##$TPNAME3= <>
##$TPNAME4= <>
##$TPNAME5= <>
##$TPNAME6= <>
##$TPNAME7= <>
##$TPOAL= (0..7)
0.5 0.5 0.5 0.5 0.5 0.5 0.5 0.5
##$TPOFFS= (0..7)
0 0 0 0 0 0 0 0
##$TUNHIN= 0
##$TUNHOUT= 0
##$TUNXOUT= 0
##$USERA1= <user>
##$USERA2= <user>
##$USERA3= <user>
##$USERA4= <user>
##$USERA5= <user>
##$V9= 5
##$VALIST= <valist>
##$VCLIST= <CCCCCCCCCCCCCCC>
##$VD= 0
##$VDLIST= <DDDDDDDDDDDDDDD>
##$VPLIST= <PPPPPPPPPPPPPPP>
##$VTLIST= <TTTTTTTTTTTTTTT>
##$WBST= 2048
##$WBSW= 25
##$XGAIN= (0..3)
0 0 0 0
##$XL= 0
##$YL= 0
##$YMAX_a= 663676
##$YMIN_a= -561893
##$ZGOPTNS= <>
##$ZL1= 120
##$ZL2= 120
##$ZL3= 120
##$ZL4= 120
##$ABSF1= 14.98509
##$ABSF2= -5.573092
##$ABSG= 5
##$ABSL= 3
##$ALPHA= 0
##$AQORDER= 0
##$ASSFAC= 0
##$ASSFACI= 0
##$ASSFACX= 0
##$ASSWID= 0
##$AUNMP= <proc_prof1d_extract_pilot.lims>
##$AXLEFT= 0
##$AXNAME= <>
##$AXNUC= <1H>
##$AXRIGHT= 0
##$AXTYPE= 0
##$AXUNIT= <>
##$AZFE= 0.1
##$AZFW= 0.1
##$BCFW= 0
##$BC_mod= 0
##$BYTORDP= 0
##$COROFFS= 0
##$CY= 15
##$DATMOD= 1
##$DC= 0
##$DFILT= <>
##$DTYPP= 0
##$F1P= 0
##$F2P= 0
##$FCOR= 0.5
##$FTSIZE= 32768
##$FT_mod= 6
##$GAMMA= 0
##$GB= 0
##$INTBC= 1
##$INTSCL= 1
##$ISEN= 128
##$LB= 0
##$LEV0= 0
##$LPBIN= 0
##$MAXI= 10000
##$MC2= 0
##$MEAN= 0
##$ME_mod= 0
##$MI= 0
##$NCOEF= 0
##$NC_proc= -8
##$NLEV= 6
##$NOISF1= 0
##$NOISF2= 0
##$NSP= 0
##$NTH_PI= 0
##$NZP= 0
##$OFFSET= 14.98509
##$PC= 1
##$PHC0= 95.09216
##$PHC1= 0
##$PH_mod= 1
##$PKNL= yes
##$PPARMOD= 0
##$PPDIAG= 0
##$PPIPTYP= 0
##$PPMPNUM= 2147483647
##$PPRESOL= 1
##$PSCAL= 4
##$PSIGN= 0
##$PYNMP= <proc.py>
##$REVERSE= no
##$SF= 400.02
##$SI= 32768
##$SIGF1= 0
##$SIGF2= 0
##$SINO= 400
##$SIOLD= 32768
##$SPECTYP= <>
##$SREGLST= <1H.CDCl3>
##$SSB= 0
##$STSI= 32768
##$STSR= 0
##$SW_p= 8223.68421052631
##$SYMM= 0
##$S_DEV= 0
##$TDeff= 65536
##$TDoff= 0
##$TI= <>
##$TILT= no
##$TM1= 0
##$TM2= 0
##$TOPLEV= 0
##$USERP1= <user>
##$USERP2= <user>
##$USERP3= <user>
##$USERP4= <user>
##$USERP5= <user>
##$WDW= 1
##$XDIM= 32768
##$YMAX_p= 478559405
##$YMIN_p= -741836
##$CURPLOT= <Network HP LaserJet P1505>
##$CURPRIN= <$Network HP LaserJet P1505>
##$DFORMAT= <normdp>
##$LAYOUT= <+/1D_H.xwp>
##$LFORMAT= <normlp>
##$PFORMAT= <normpl>
##$SURQMSG= 1
$$ End of Bruker specific parameters
$$ ---------------------------------
##NTUPLES= NMR SPECTRUM
##VAR_NAME=  FREQUENCY,     SPECTRUM/REAL,   SPECTRUM/IMAG
##SYMBOL=    X,             R,               I
##VAR_TYPE=  INDEPENDENT,   DEPENDENT,       DEPENDENT
##VAR_FORM=  AFFN,          ASDF,            ASDF
##VAR_DIM=   32768,         32768,           32768
##UNITS=     HZ,            ARBITRARY UNITS, ARBITRARY UNITS
##FACTOR=    0.250966925370066, 1,           1
##FIRST=     8223.43324360094, -116390,      -87178
##LAST=      0,             -80672,          6070
##MIN=       0,             -741836,         0
##MAX=       8223.43324360094, 478559405,    0
$$ Real data points
##PAGE= N=1
##DATA TABLE= (X++(R..R)), XYDATA
$$ [...]
$$ plain form
19524 -382094 -253104 -89124 -239286 -94436 -386465 -243528 192272 172410 91672 -329039
19513 -106728 159242 -35715 136599 105200 46650 -19556 -29430 89035 -24894 -397455 -151155
19501 1331 213927 -11365 -22053 -48652 -17493 -98782 105813 -102082 276010 258823 17438
19489 -46085 84444 -111843 413224 -8467 35422 -17819 -14024 -202107 22463 -188365 289116
19477 59097 -105837 -93546 -254022 -314463 -312264 303721 93372 -54453 24513 -150510 -156913
19466 -156913 -25093 -137429 -76994 -158971 -53701 -117538 -95729 -81487 -75134 -103458 -1005 102268
19453 -126092 -2370 -100399 212347 -283195 -311566 -343107 -57986 -279416 -199376 -1481 197520
19441 209459 -320911 280113 104382 -453592 -231253 87569 116901 -35036 7769 -147226
$$ packed form
19524c82094J28990h9124j50162i4436k92029J42937A92272j9862q0738c29039
19513a06728A59242c5715A36599l1399D6650a9556r874H9035b4894l72561a51155
19501A331K12596a1365j0688k6599a7493q1289A05813a02082B76010j7187A7438
19489d6085H4444a11843D13224h467C5422a7819L795j88083B2463a88365B89116
19477E9097a05837J2291j60476o0441K199C03721I3372e4453B4513a50510o403
19466a56913b5093j12336O0435q1977e3701o3837K1809J4242O353k8324a005A02268
19453a26092b370r8029B12347b83195k8371l1541e7986k21430Q0040a481A97520
19441B09459c20911B80113A04382d53592K22339H7569K9332c5036G769a47226
$$ plain form
19430 -84560 -12121 60689 -61096 -178893 312255 98728 -20723 -119475 -143890 -182010 -261662
19419 -261662 -68656 -98317 -156299 -50220 -275042 -293116 -12484 -669483 -410205 15875 -217552
19407 -245122 43904 23727 117059 -104357 -316370 -285717 87582 38882 -81578 -39311 126689
19395 199814 -98611 -7981 170233 -234720 168609 -336522 393735 -44642 -101287 -70426 -96765
19384 -96765 112499 -113559 -154332 -333697 -65490 131023 -84245 -198769 258885 -204533
19373 -76961 91227 215788 -150741 25685 239480 77843 -367813 -57296 195958 -232337
19362 -78625 -264392 -260528 -20750 -64384 -186822 279267 -227953 -135213 74330 -351450 -57733
19350 85457 -409727 29591 -97817 -33063 -201484 -33429 -43976 -285081 -53878 -56921 82964
$$ packed form
19430h4560a2121F0689f1096j17797C12255I8728b0723r8752k4415l8120p9652
19419b61662f8656k9661n7982e0220k24822j8074a2484o56999K59278A5875b17552
19407b45122D3904k0177R3332a04357k12013L0653H7582C8882h1578c9311A26689
19395A99814i8611g981A70233b34720A68609c36522C93735d4642n6645L0861k6339
19384i6765A12499a13559m0773j79365f5490A31023h4245j14524B58885b04533
19373g6961I1227J24561a50741B5685K13795G7843c67813e7296A95958b32337
19362g8625j85767L864b0750m3634j22438B79267b27953R2740G4330c51450e7733
19350H5457d09727B9591i7817c3063j68421c3429j0547k41105e3878l043H2964
$$ plain form
19338 -78848 -247600 -7216 -64440 25048 66155 -9063 -246711 52718 349205 -233213 -179847
19327 -179847 -195963 -193868 -191364 -36499 155024 -264594 -202487 -104680 288626 -329810 -201850
19316 -201850 -36107 -3686 -212597 29622 -207794 -121170 -337848 -180676 -162981 -88770 -331032
19305 -331032 66145 115308 -152700 -209284 -236465 9098 47495 -474293 -337083 -100370 -125122
19294 -125122 -208874 -244830 -130667 128200 94313 29836 67646 -17471 -315933 17473 -181977
19282 -238904 348765 193485 198204 61949 81436 -240160 83330 43602 87674 80146 -213254
19270 -14992 -88354 -178793 141552 83709 -215139 202305 -90900 -222019 33566 -297599 5311
19258 75794 280657 203659 155050 325311 125080 -13206 9452 -131281 128849 121491 -279999
$$ packed form
19338g8848j68752g216n7224B5048M1107i063k37648E2718K96487b33213N3366
19327a79847j6116K095K504c6499A55024b64594O2107R7807B88626c29810J27960
19316b01850c6107c686k08911B9622b07794Q6624k16678J57172J7695P4211k42262
19305c31032F6145M9163a52700n6584k7181I098L8397d74293J37210a00370k4752
19294a25122q3752l5956J14163A28200l3887B9836L7810a7471k98462A7473a81977
19282b38904C48765j55280M719F1949J9487b40160H3330l9728M4072p528b13254
19270a4992p3362r0439A41552n7843b15139B02305i0900j31119C3566b97599E311
19258G5794K04863p6998m8609J70261A25080a3206I452a31281A28849p358b79999
$$ plain form
19246 15141 -232603 -14974 -133069 -172766 -176539 -46359 2251 -886 -284799 -325066 85703 -86632
19233 -138141 95016 -243108 -45066 -293679 -307776 -200177 221345 -359107 151140 233015
19223 233015 -228595 340346 -168232 -106064 -103333 96848 -98798 -341828 188659 -176555
19212 72037 78241 -244249 -182499 -188165 80103 -97739 88326 176874 -133513 -69903 227152
19200 69114 -392060 9300 -129283 -164966 -212560 -246882 69421 84905 -189239 -163788 -204909
19189 -204909 -284131 78332 -50044 115028 13346 -266372 12487 -133125 79416 129806 -92911
19177 31230 -113393 62228 227989 63913 -159713 -428943 -211539 -77731 166241 172651 -277811
19165 -82297 200248 3587 -237793 -64507 -77481 -58669 -125982 -34710 50635 -13035 50198
$$ packed form
19246A5141b32603a4974j18095l9697l773d6359B251h86k83913m0267H5703h6632
19233a38141I5016b43108d5066k48613j4097J07599B21345c59107A51140Q1875
19223B33015b28595C40346a68232O2168K731I6848i8798k43030A88659a76555
19212G2037O204b44249O1750n666H0103i7739H8326Q8548a33513O3610B27152
19200F9114c92060I300a29283l5683m7594l4322F9421J5484a89239K5451m1121
19189b04909p9222G8332e0044A15028A3346b66372A2487a33125G9416N0390i2911
19177C1230a13393F2228J65761F3913a59713k69230b11539g7731A66241O410b77811
19165h2297B00248C587b37793f4507j2974J8812o7313c4710E0635a3035E0198
$$ plain form
19153 -39183 203827 -467363 -319274 -153321 416510 -430475 256911 -79474 -26242 116174
19142 -290049 100445 64819 -506882 -68022 -37692 -220304 73357 97736 217243 -41027 -159946
19131 -159946 8052 19371 -259489 -129468 -53415 137872 -12738 50099 31409 -298038 157326
19119 70453 157466 177757 -105069 -382865 -286591 -88333 -125573 68887 -129665 -239560 179943
19107 -193989 -37788 -150716 147427 282468 98186 106652 -90893 25055 -414088 -199396 24464
19095 -63565 -324147 -203397 187098 262872 -275971 -244197 -54795 -231912 -86164 233124
19084 -350831 12499 -241427 188435 88307 -225093 79849 3563 -155404 -430754 -129220
19073 -18773 213841 38343 -5402 153536 288933 -235209 -123915 -111532 76905 58351 95408
$$ packed form
19153c9183B03827d67363J48089a53321D16510d30475B56911g9474b6242A16174
19142b90049A00445l5626e06882f8022L0330j82612G3357K4379J19507d1027j18919
19131a59946H052J1319b59489a29468e3415A37872a2738E0099j8690b98038A57326
19119G0453Q7013K0291a05069k77796R6274h8333l7240F8887a29665j09895A79943
19107a93989c7788j12928A47427J35041I8186Q466i0893B5055d14088a99396B4464
19095f3565k60582J20750A87098P5774b75971L1774e4795j77117h6164B33124
19084c50831A2499b41427A88435H8307b25093G9849C563a55404k75350a29220
19073a8773B13841C8343e402A53536J35397b35209J11294J2383G6905j8554L7057
$$ plain form
19062 95408 39530 -322919 135565 56117 58571 -117365 235740 26255 -148562 -112557 67313
19050 -87843 -291628 -54837 357864 130864 -383823 -104909 -9021 -23473 -449343 81134 233018
19039 233018 176328 -14913 476922 122503 -170956 223201 6902 -167513 82184 -68949 -378071
19028 -378071 23793 115627 66161 399478 156783 49411 -90799 -204122 -6294 181337 100097
19017 100097 -330575 -240039 -26955 -97583 291925 -157870 93966 140524 -122453 -402463
19007 -402463 -264717 192915 217438 -55889 -435746 116249 -197840 123550 -29525 48177
18996 36927 -233663 146503 -518530 -379970 -9692 -293987 42831 -228643 128487 18244
18985 7322 -563417 86036 -477372 -254062 336052 13834 -45431 -44103 -257019 -276127 51576
$$ packed form
19062I5408C9530c22919A35565E6117K454a17365B35740B6255a48562L6005F7313
19050h7843k03785e4837C57864A30864c83823a04909i021j4452m25870H1134J51884
19039B33018n6690a4913D76922A22503a70956B23201F902a67513H2184f8949l09122
19028c78071B3793R1834m9466L33317A56783D9411i0799j13323f294A81337q1240
19017A00097c30575R0536b6955p0628B91925a57870I3966M6558a22453k80010
19007d02463J37746A92915K4523e5889l79857A16249a97840A23550b9525D8177
18996C6927b33663A46503e18530J38560i692k84295D2831b28643A28487A8244
18985G322e63417H6036d77372K23310C36052A3834d5431J328k12916j9108E1576
$$ plain form
18973 -66198 -344755 -122636 -340285 -74480 -266533 -147967 -137849 -334633 -66571 -16340
18962 -121911 74652 33827 82077 -219491 220362 306662 -46386 -211965 192407 -158750
18951 105604 81371 133175 -145720 -111863 -187164 -45649 -263082 -140474 -39714 -175537 259631
18939 -122729 83015 34052 -17108 -47026 -201718 -122399 263406 -330671 29668 -369418 -32203
18927 53378 -68924 -100092 -235753 85876 269367 -280146 -196107 177863 204318 -55894 -78077
18916 -78077 -249374 -229688 -160593 -55615 -92665 -587370 99878 92674 161641 -199186 4498
18904 -218370 -323176 -267805 83626 -243900 -67645 88414 -23342 -50899 -152661 169396 -50101
18892 -122703 -203872 -69612 328411 -297199 -128086 25544 -23699 106168 83561 73217 -90595
$$ packed form
18973f6198k78557a22636k17649g4480j92053J18566J0118j96784f6571a6340
18962a21911G4652C3827M8250b19491B20362Q6300d6386j65579A92407a58750
18951A05604k4233N1804a45720L3857p5301d5649k17433J22608c9714j35823B59631
18939a22729H3015C4052a7108k9918j54692P9319B63406c30671B9668c69418c2203
18927E3378f8924l1168j35661H5876J83491b80146Q4039A77863K6455e5894k2183
18916g8077j71297J9686O9095e5615l7050m94705I9878p204O8967a99186D498
18904b18370j04806N5371H3626b43900f7645H8414b3342k7557j01762A69396e0101
18892a22703q1169f9612C28411b97199a28086B5544b3699A06168k2607j0344i0595
$$ plain form
18880 106725 -61758 -156906 -52719 -154165 -40986 16593 -249083 -41888 -58058 -369015 200726
18868 -34429 63219 162367 94248 -94845 -89533 -153620 -98917 -156069 -129416 -243564 -138947
18857 -138947 192314 23937 394184 -86823 681 145300 142234 -56353 157761 -68986 -34311
18845 58730 355051 161762 55893 60512 44549 -53025 252545 -295880 -1511 -122198 -259468
18834 -259468 -113634 -260101 -63965 46754 -177261 -69494 -461733 -23639 -99255 93950 -229524
18822 45596 179560 -128158 -43345 151456 -121450 -14341 -83094 21226 63882 -61305 43723
18810 16123 305431 -48719 -236397 24680 -66008 42299 -291179 -70623 -68163 -143893 -113982
18799 -113982 -317225 -70082 -290262 -327660 -3226 -103322 40587 114301 -104896 -113699 -149655
$$ packed form
18880A06725f1758r5148e2719j01446d0986A6593b49083d1888j6170l10957B00726
18868c4429F3219R9148o8119i4845N312o4087N4703n7152K6653j14148J04617
18857a38947A92314B3937L70247h6823F81J44619l066e6353A57761f8986c4311
18845E8730K96321A61762E5893M619j5963e3025B52545b95880a511j20687j37270
18834b59468a13634j46467f3965D6754a77261f9494l92239b3639p5616I3950b29524
18822D5596J33964a28158d3345A51456a21450a4341o8753B1226M2656f1305D3723
18810A6123K89308d8719j87678B4680f6008D2299b91179g0623K460p5730K9911
18799a13982k03243g0082k20180l7398c226j00096D0587P3714a04896q803l5956
$$ plain form
18788 -149655 11097 -440638 -42617 -135168 -274111 -431774 -100815 -170928 -399464 -88370
18777 -41115 265573 -35087 -140789 37451 -253672 -36827 -261538 -169598 34879 26402 -70595
18765 -323468 20945 52632 -62731 -336609 -84924 258654 -187436 261970 -168517 -13298
18754 -162150 -128191 81011 113132 13144 -4558 -354487 150328 -331003 -203133 1384 -205269
18742 -210293 -84662 87234 232092 14235 -350725 -59059 167237 -133609 -10834 56285 -125200
18730 -30798 -222668 -58734 6530 172926 24262 333125 -336733 -21592 -223408 73847 177628
18719 177628 -130997 -212776 41067 167512 80763 -248887 -239788 349848 -405388 -3000 102665
18707 -234277 100901 127743 -17616 -102764 -55760 63249 -243534 433920 -312314 51117 80352
$$ packed form
18788a49655A1097d40638d2617r2551j38943j57663a00815p0113k28536h8370
18777d1115B65573c5087j05702C7451b53672c6827k24711R1940C4879q477g0595
18765c23468B0945L1687f2731k73878h4924B58654a87436B61970a68517a3298
18754a62150L3959H1011L2121A3144d558l49929A50328c31003J27870A384b05269
18742b10293h4662H7234J44858A4235c50725e9059A67237a33609a0834E6285a25200
18730c0798j91870e8734F530J66396B4262L08863c36733b1592k01816G3847J03781
18719A77628a30997q1779D1067J26445H0763b48887R099C49848d05388c000A02665
18707b34277A00901K6842a7616q5148M7004F3249b43534D33920c12314E1117K9235
$$ plain form
18696 80352 -269556 198336 250902 199663 87405 115487 -362417 270545 -5113 -167607 -84214
18685 -84214 -73016 116841 -184370 111693 -249463 -301651 -259415 -201865 11727 -124570 166240
18673 108183 -154740 91969 -23977 -31088 206439 -35974 -51195 -245952 129551 99765 -183936
18661 13496 -354586 -133736 -190050 173383 205848 273612 -56899 18269 -306979 181775 21798
18649 -133623 -255348 -185418 50944 -288183 -291406 -110219 -154278 -30355 -194020 -326773 -42496
18637 -75035 -32167 -113532 476031 -491245 -252645 62346 277790 63178 -397149 43138 107776
18626 107776 -404380 -192585 -383536 -130692 122720 -120256 95238 7910 -161822 -43121
18615 199333 -55648 -53083 36564 -251547 68764 19440 -185011 -44910 -219413 108738 52899
$$ packed form
18696H0352b69556A98336N2566n1239H7405K8082c62417B70545e113j62494Q3393
18685h4214J1198A16841a84370A11693b49463n2188M2236N7550A1727a24570A66240
18673A08183a54740I1969b3977p111B06439c5974j5221j94757A29551k9786a83936
18661A3496c54586a33736n6314A73383L2465O7764e6899A8269c06979A81775B1798
18649a33623j21725O9930E0944b88183l223a10219m4059c0355j63665j32753d2496
18637g5035c2167q1365D76031d91245K38600F2346K15444F3178c97149D3138O4638
18626A07776d04380a92585j90951a30692A22720a20256I5238G910a61822d3121
18615A99333e5648K565C6564b51547F8764A9440a85011d4910j74503A08738E2899
$$ plain form
18603 75328 -141493 -146456 -95460 -125280 70562 -236069 -71128 -28025 34209 -222121 96342
18591 -295197 8120 31434 -21141 -322478 -124156 -175268 -414415 159390 61038 187618 58432
18579 -175599 -82792 245485 -210848 -145850 -94524 -224764 106315 -8655 33173 -130143 -48459
18567 -83284 59641 13551 -107100 -73779 18690 46883 -184961 -443046 256594 -128411 -133840
18556 -133840 43011 70198 -88415 -88303 -1766 -182753 110555 -64844 -127197 -212907 241548
18544 23587 42674 -305322 158058 29264 -52974 -232897 -413984 -72048 -219826 -321349
18534 -321349 -92869 26796 -9811 203605 -199616 138586 63396 27723 70519 -432612 -98765
18522 -129241 145731 17940 164412 -19713 -373318 -92187 325636 188 -33482 226208 -32019
$$ packed form
18603G5328a41493m963N0996k9820G0562b36069g1128b8025C4209b22121I6342
18591b95197H120K3314b1141l01337a24156n1112k39147A59390F1038J26580E8432
18579a75599h2792B45485b10848O4998N1326j30240A06315h655C3173a30143d8459
18567h3284E9641A3551a07100L3321A8690K8193a84961k58085B56594a28411n429
18556a33840D3011K7187h8415J12a766j80987A10555f4844o2353q5710B41548
18544B3587J9087c05322A58058B9264e2974j79923j81087g2048j47778j01523
18534c21349i2869B6796i811B03605a99616A38586F3396B7723M2796d32612i8765
18522a29241A45731A7940J46472a9713l53605i2187C25636A88c3482B26208c2019
$$ plain form
18510 -151594 85277 -136433 -366100 -155434 -193904 -41360 263119 190079 -71934 -211865
18500 -211865 -38868 58359 -199013 -144471 6094 -39547 -76300 -159787 -85840 159817 106445
18489 106445 -94927 92797 -389879 276542 -103745 -61395 -43395 -125360 188023 -202042
18478 24366 91884 182683 45071 183650 -335181 43231 -53543 47572 -65661 -26384 -25783 19532
18465 -199956 95045 -145776 -157554 -104251 -163051 63198 -364371 79627 -198723 -9078 -326484
18454 -326484 -88415 -65049 23955 68760 -204532 335734 144807 -160251 -93947 -173621 -77116
18442 -208907 -310816 -186239 -73192 77681 32084 41878 399562 123378 7442 216040 -23433
18430 -34595 48583 -232822 -4757 20482 -62977 -176274 117000 93516 -201712 299479 -70994
$$ packed form
18510a51594H5277a36433k29667a55434l8470d1360B63119p3040g1934j39931
18500b11865c8868E8359a99013N4542F094c9547l6753q3487P3947A59817n3372
18489A06445i4927I2797c89879B76542a03745M2350J8000q1965A88023b02042
18478B4366O7518R0799D5071J38579c35181D3231e3543D7572f5661b6384O01A9532
18465a99956I5045a45776j1778N3303n8800F3198c64371G9627a98723i078l17406
18454c26484h8415K3366B3955M4805b04532C35734A44807a60251O6304p9674g7116
18442b08907j01909J24577g3192G7681C2084R794L57684A23378G442K08598b3433
18430c4595D8583b32822d757B0482f2977j13297A17000k3484b01712B99479g0994
$$ plain form
18418 -49982 -77053 -114384 125739 -97948 -165340 -50212 3388 8738 164381 101866 195319 -185657
18405 327165 -131836 130621 148497 -50590 320474 -62088 133597 -221050 -354054 -114155
18394 -14417 -257513 -104835 -372675 -141184 -33028 -367097 147325 -154502 78375 63515
18384 63515 -355454 -154483 31890 -25669 74688 -68078 53562 202824 -178731 60713 -548028
18372 -429066 -356473 -3532 -134380 32332 428253 -632381 -144008 268573 117317 165642
18362 165642 170966 -36467 -326783 -148133 -69431 113933 203025 351179 -134593 247881
18351 -119093 -43642 -27715 319239 -268697 -323002 113502 -186504 -36902 44800 -86630 147919
18339 19001 -216463 -277139 -179603 -210461 -265355 558 97990 -91030 -226075 356461 -121681
$$ packed form
18418d9982k7071l7331A25739i7948o7392e0212C388N350J55643o2515R3453a85657
18405C27165a31836A30621J7876e0590C20474f2088A33597b21050j33004a14155
18394a4417k43096a04835k67840a41184c3028l34069A47325a54502G8375j4860
18384F3515c55454a54483C1890b5669G4688f8078E3562J49262a78731F0713e48028
18372d29066P2593c532j30848C2332L95921f32381a44008B68573A17317M8325
18362A65642N324c6467k90316a48133f9431A13933Q9092J48154a34593B47881
18351a19093d3642J5927C19239b68697n4305A13502a86504c6902D4800h6630A47919
18339A9001b16463o0676R7536l0858n4894E58R7432i1030j35045C56461a21681
$$ plain form
18327 -312948 -177965 58960 -38087 34301 28996 -344882 104638 -144146 -23794 34138 -294559
18315 318671 -412099 23397 61134 115886 -59494 175979 -159544 -297901 -56362 -257181
18305 -257181 -165443 82475 45516 74913 -63811 31305 133342 148363 -57968 49451 180033
18294 180033 139375 -17478 111393 108858 -211811 -342027 -293328 -116599 -10219 -53207 339455
18282 146765 64275 319094 -25957 -32376 -121195 105175 10 -218019 181897 -29871 57369
18270 -63896 -27877 -2064 -171284 204234 -38250 -165316 75991 -258562 -79549 -180089 -297321
18259 -297321 276139 206128 -22372 -219845 139702 -68361 -238691 -57767 158258 121017
18249 121017 377201 -365933 -114950 -227058 121857 70721 -44175 -198315 -42504 -211721
$$ packed form
18327c12948J34983E8960c8087C4301n305c44882A04638a44146b3794C4138b94559
18315C18671d12099B3397L7737N4752e9494A75979a59544j38357e6362k00819
18305b57181R1738H2475l6959K9397f3811C1305J02037J5021e7968D9451J30582
18294A80033m0658a7478A11393k535b11811j30216M8699a16599a0219m2988C39455
18282A46765F4275K54819b5957o419q8819A05175A0b18019A81897b9871E7369
18270f3896b7877b064j69220B04234c8250j27066G5991b58562g9549j00540j17232
18259b97321B76139p0011b2372j97473A39702f8361j70330e7767A58258l7241
18249A21017K56184c65933a14950j12108A21857n1136d4175j54140d2504j69217
$$ plain form
18239 -211721 42661 -1602 -227758 -149293 -161895 -70711 -177520 109508 -315683 -207524 -49427
18227 81350 -219843 -291990 166318 317578 119515 10595 -326506 -55126 -222768 -241363
18217 -241363 126590 190311 170475 -82121 63642 -64678 -66141 -194007 62459 -39085 316779
18205 269672 -255345 256124 20378 78853 -270599 -100140 -201883 53802 203252 -67908
18194 -118763 132707 -159620 241134 150266 68265 -14651 259509 69281 -175924 83440
18183 128091 -2547 12732 -2370 137005 -98488 -179846 84946 -133813 120660 -39263 -310475
18172 -310475 -70627 -44634 43956 -129283 178523 -49921 79091 34285 27512 -256142 -267487
18161 -267487 50605 -8566 -129001 -63830 -309480 -146101 -71183 22217 -103953 -309416 -17421
$$ packed form
18239b11721D2661a602k26156P8465j2602g0711j06809A09508c15683J08159d9427
18227H1350b19843p2147A66318J51260A19515A0595c26506e5126j67642j8595
18217b41363A26590O3721j9836h2121F3642f4678j463j27866F2459c9085C16779
18205B69672b55345B56124B0378N8475b70599a00140j01743E3802J49450f7908
18194a18763A32707a59620B41134r0868F8265a4651B59509F9281a75924H3440
18183A28091b547A2732b370A37005i8488q1358H4946a33813A20660c9263k71212
18172c10475g0627K5993D3956a29283A78523d9921G9091C4285o773b56142j1345
18161b67487E0605h566j20435f3830k45650a46101g1183B2217a03953k05463a7421
$$ plain form
18149 -135203 12758 -39244 -343991 97619 74425 70467 -21440 -31473 70865 -182385 -77473
18137 55676 71838 324959 -149244 -66096 14548 165405 -351367 -165711 -193923 350782
18126 -239608 279622 106393 181103 -167311 -237676 43896 84044 -89970 -228538 6068 -512172
18114 -181788 268715 143064 -24791 335995 -5496 -149562 -42671 -74578 -66858 96941 -247071
18102 -39951 -92362 -132837 -70649 167167 -53854 164781 113749 -92510 -242799 -130343 368944
18090 42399 61159 375265 71 -104396 36384 3915 2167 263342 35843 -272562 -55700 -213299
18078 -213299 -115610 -144398 -177031 125128 -16902 -292198 -132264 -326213 183940 -286885
18067 20555 53160 -216705 -229946 112612 -11532 -2977 -323987 -6671 111990 -78910 -134932
$$ packed form
18149a35203A2758c9244l04747I7619k3194l958b1440j0033G0865a82385g7473
18137E5676J6162K53121a49244f6096A4548J50857c51367a65711k8212C50782
18126b39608B79622A06393P4710a67311p0365D3896M0148h9970j38568F068e12172
18114a81788B68715j25651b4791C35995e496j44066d2671l1907P720I6941b47071
18102c9951n2411m0475O2188A67167e3854A64781n1032i2510j50289J12456C68944
18090D2399J8760L14106G1a04396C6384C915j748K61175C5843b72562e5700j57599
18078b13299R7689k8788l2633A25128a6902k75296a32264j93949A83940b86885
18067B0555L2605b16705j3241A12612a1532b977l21010f671A11990g8910n6022
$$ plain form
18056 -134932 -137383 -11238 102549 -148484 -400678 -286171 28221 120674 33564 55746 -256874
18044 -110992 104795 -76240 -12661 126883 325457 330994 -275049 35784 -97422 -140203 126704
18032 11341 26032 -67215 -11157 46468 170229 -193305 -113245 5401 168152 42408 -295621
18020 -179801 149766 31710 -37298 -95822 83808 -95477 -97291 -364785 -214234 -145121 37468
18008 -208229 137832 67861 8930 -109650 191906 -365462 -22084 180352 103579 -76419 347680
17996 -36240 186006 19249 323895 -66521 76402 302983 -100805 -144144 412481 59955 19393
17984 261562 -65459 453258 -177845 -214970 11975 -226368 101543 -106261 210556 57899
17973 -142081 -78060 6279 125236 -111196 -366241 287606 282339 -6304 63328 -202324 181689
$$ packed form
18056a34932k451a1238A02549a48484k52194J14507B8221R2453C3564K2182b56874
18044a10992A04795g6240a2661A26883J98574N537b75049C5784i7422m2781A26704
18032A1341J4691f7215a1157D6468J23761a93305Q0060E401J62751D2408b95621
18020a79801A49766C1710c7298n8524H3808i5477j814k67494J50551O9113C7468
18008b08229A37832F7861H930a09650A91906c65462b2084A80352p6773g6419C47680
17996c6240A86006A9249L04646f6521G6402K26581a00805m3339D12481E9955A9393
17984B61562f5459D53258a77845l7125A1975b26368A01543a06261B10556E7899
17973a42081O4021F279J18957a11196k55045B87606n267f304F3328b02324A81689
$$ plain form
17961 -61818 38004 -243201 -87271 -209129 -69334 -85867 124072 24300 -172097 -246028 74671
17949 24 73302 58212 62757 -457005 78559 -141560 78343 -48806 -171701 15940 -126433 -44485
17936 62215 -257942 56435 -193633 289185 -162078 14554 -19082 401224 -120464 10368
17925 -204459 101231 88177 119884 71753 -21516 96268 -94635 134643 310497 -21181 159117
17913 -43575 108698 -319105 142943 -10303 77604 292271 -37408 -33108 -100081 205088 39363
17901 -32076 -76244 257431 -117230 -64588 -58660 -38262 83860 84239 99975 -169369 230777
17889 -32764 144375 18866 -279281 -237582 44772 -107364 375390 251768 114598 -66054
17878 114393 51157 93907 -54327 -307147 -205752 -213598 -196615 240042 -22638 86577 348619
$$ packed form
17961f1818C8004b43201h7271j21858f9334j6533A24072B4300a72097p3931G4671
17949B4P3278j5090M545d57005G8559a41560G8343d8806j22895A5940a26433d4485
17936F2215b57942E6435a93633B89185a62078A4554a9082D01224a20464A0368
17925b04459A01231j3054L1707m8131b1516I6268i4635A34643J75854b1181A59117
17913d3575A08698c19105A42943a0303G7604K14667c7408M300o6973B05088C9363
17901c2076m4168B57431a17230N2642N928K0398H3860L79J5736a69369B30777
17889c2764A44375A8866b79281M1699D4772a07364C75390j23622A14598f6054
17878A14393E1157M2750e4327k52820J01395p846J6983B40042b2638H6577K62042
$$ plain form
17867 348619 -126043 -36260 -148259 169153 -95654 255097 167547 -42528 66732 -33793 105056
17855 -99434 21954 -266123 9412 191115 98642 -79532 -166158 201593 335322 410252 76511
17843 -215029 -77958 133689 9196 213133 41771 125058 -84027 -22235 12699 17240 323865
17832 323865 235688 297098 -123286 149196 -297347 -121951 146618 -205013 -46973 22508
17821 188351 -25502 207114 -532675 89662 -206576 -305851 178871 37637 155789 193028
17811 193028 216651 -108988 36369 44536 -177698 -129421 104155 19041 77971 108509 -98612
17799 113889 -313136 223035 -18681 168277 -38389 -14571 -415747 -419620 65743 -149727 -57723
17787 -199053 243752 74791 -188117 -11568 120712 -117597 -68396 119401 104244 61492
$$ packed form
17867C48619a26043c6260j11999A69153i5654B55097q7550d2528F6732c3793A05056
17855i9434B1954b66123I412J81703r2473g9532q6626B01593J33729P4930G6511
17843b15029g7958A33689I196K03937D1771Q3287h4027b2235A2699M541L06625
17832C23865q8177O1410a23286A49196b97347a21951A46618b05013d6973B2508
17821A88351b5502B07114e32675H9662b06576r9275A78871C7637J18152L7239
17811A93028K3623a08988C6369Q167a77698M8277A04155A9041N8930L0538i8612
17799A13889c13136B23035a8681A68277c8389a4571m01176l873F5743a49727e7723
17787a99053B43752G4791a88117a1568A20712a17597M9201A19401j5157m2752
$$ plain form
17777 61492 -127444 162655 97745 111883 4873 -211598 -93399 46194 35013 -197937 17768
17765 14138 64168 -38827 9218 -242303 106694 76556 -60266 -175649 126049 -426189 -39340
17753 260536 143920 127653 -115618 -286709 332050 57515 -248811 -20793 -190336 -179949
17743 -179949 90583 180196 -2648 91279 27044 241443 49934 28800 209003 -6951 223786
17731 116863 146592 -66134 70599 -33229 35740 -99205 128077 -218014 -158959 205973 41979
17719 197982 170173 -86998 90886 -115414 9401 374306 -45184 -225667 256821 655 -5636
17707 365745 21024 68189 -87610 -15020 -235988 108846 -37296 -127386 152810 109944 149487
17696 149487 -227149 -151845 -174890 267464 44028 390961 51646 -138721 225517 17636
$$ packed form
17777F1492a27444A62655o4910J4138D873b11598i3399D6194j1181a97937A7768
17765A4138N0030c8827I218b42303A06694l0138f0266j15383A26049d26189c9340
17753B60536j16616j6267a15618j71091C32050E7515b48811b0793j69543J0387
17743a79949I0583Q9613b648I1279B7044K14399D9934k1134J80203f951B23786
17731A16863K9729f6134G0599c3229C5740i9205A28077b18014N9055B05973D1979
17719A97982k7809h6998I0886a15414I401L64905d5184j80483B56821F55e636
17707C65745B1024M7165h7610a5020k20968A08846c7296r0090A52810m2866L9543
17696A49487b27149P5304k3045B67464D4028L46933E1646a38721B25517A7636
$$ plain form
17685 147211 -9633 -284763 265476 203295 -64421 -301735 182244 -62786 -43457 9243 -31877
17673 -8191 197096 -91152 -189511 110949 -276707 27803 166197 111306 132505 -323497 -102822
17661 224190 -228238 -112804 14121 76565 28737 -98763 39218 -210802 7453 69767 -27607
17649 116032 5072 -139087 208869 -175101 28051 3429 266193 -90229 -141053 133299 -28719
17637 276466 245584 -224625 98378 -323487 303124 78590 205495 -46554 -202012 65686
17626 -114403 -28785 6398 -144810 -133946 420262 -55716 -168995 141546 128838 372951 -87628
17614 -190766 -654146 69018 244574 -23158 43096 196980 46967 247982 278480 -107795
17603 175107 353089 -170057 297027 111274 29357 123403 -92162 131729 116908 115986 -138422
$$ packed form
17685A47211i633k75130B65476o2181f4421k37314A82244f2786J9329I243c1877
17673h191A97096i1152r8359A10949b76707B7803J38394n4891K1199c23497a02822
17661B24190b28238a12804A4121O2444B8737i8763C9218b10802G453O2314b7607
17649A16032E072a39087B08869a75101B8051C429K62764i0229n0824A33299b8719
17637B76466l0882b24625I8378c23487C03124G8590J26905d6554j55458F5686
17626a14403b8785F398a44810J0864D20262e5716j13279A41546j2708K44113h7628
17614a90766m63380F9018J75556b3158D3096J53884D6967K01015L0498a07795
17603A75107J77982a70057B97027A11274B9357R4046i2162A31729j4821r22a38422
$$ plain form
17591 148409 -78532 -119493 226640 -24155 458578 325133 -285219 -189134 328189 450198
17581 450198 -219011 206021 -19327 -248575 111442 -96928 -36977 123163 370421 428180
17571 428180 105816 -39990 -182511 79925 24232 206506 439220 10140 48552 91051 -175258
17559 -130504 243107 -8802 221328 317164 -65158 201071 14610 134261 64222 44812 -34605
17547 190774 71105 204437 5928 -156761 210316 133221 21597 72634 -36704 82235 53953
17536 53953 119971 -122858 18378 -65037 283725 -289343 -47609 52957 314630 163910 -50578
17524 21375 110606 367788 116085 -83154 -11227 413256 230499 57062 -185171 237722
17513 108799 505977 19680 344522 -134711 61738 -161426 -134210 -24421 -90648 247494
$$ packed form
17591A48409g8532m0961B26640b4155D58578j33445b85219R6085C28189J22009
17581D50198b19011B06021a9327k29248A11442i6928c6977A23163K47258N7759
17571D28180A05816c9990j42521G9925B4232J82274K32714A0140L8412M2499a75258
17559a30504B43107h802B21328R5836f5158B01071A4610J19651F4222j9410c4605
17547A90774G1105J33332E928a56761B10316p7095B1597N1037c6704H2235k8282
17536E3953O6018a22858A8378f5037B83725b89343d7609E2957K61673j50720e0578
17524B1375Q9231K57182A16085h3154a1227D13256j82757E7062a85171B37722
17513A08799L97178A9680L24842a34711F1738a61426K7216b4421o6227B47494
$$ plain form
17502 95013 -144411 -104170 -214545 -265112 -7169 333653 -104627 -7369 -146383 382644 337606
17491 337606 197590 147182 -133277 98700 722698 -82818 245554 176556 178822 -80622 82962
17479 -46726 29240 121045 182003 326042 -92151 269471 1407 339790 44778 298280 -45069
17467 85001 -4829 185023 -2430 287665 -51857 -91103 -240898 -9923 347995 248800 286808
17456 286808 1337 315194 427927 -43447 555696 319417 97929 26746 466952 264192
17446 264192 271221 311122 167410 -195670 116952 132285 194193 369024 449328 19653 -97129
17434 209345 356517 169021 477082 -169929 117019 43767 237334 501913 294526 206832
17424 206832 141070 452639 336877 -7921 72054 463793 288983 346526 193440 178772 346561
$$ packed form
17502I5013a44411M0241j10375n0567g169C33653a04627g369j39014C82644m5038
17491C37606j40016n0408a33277I8700O23998h2818B45554o8998K266h0622H2962
17479d6726B9240R1805O0958J44039i2151B69471A407L38383D4778K53502d5069
17467H5001d829A85023b430B87665e1857l9246j49795i923C47995r9195L8008
17456B86808A337L13857J12733d3447E55696k36279I7929B6746M40206k02760
17446B64192P029L9901j43712a95670A16952J5333O1908J74831Q0304A9653i7129
17434B09345J47172A69021L08061a69929A17019D3767J93567K64579k07387q7694
17424B06832o5762L11569j15762g921G2054L91739j74810N7543j53086j4668J67789
$$ plain form
17413 346561 114121 205723 231686 384160 249551 115938 213070 -93180 101222 289325
17403 289325 378254 155714 -100861 474921 -81301 208361 345863 175530 -35393 305875
17392 114379 305511 9347 112769 413648 48315 502843 131328 -182545 88965 146935
17382 146935 152391 284486 -164752 99413 412227 122094 36324 447251 -22199 222754
17371 472187 167435 67046 368699 19522 -80228 260971 373231 119751 792 100314 -291227
17359 255185 609008 -83643 266390 -35438 18727 357625 95880 -197190 347163 287758
17349 287758 -190540 -165656 144601 78218 -36708 19388 -20426 211139 326068 -124735
17338 155826 166525 -10198 39287 39467 -126006 175099 104999 343729 505636 318022 37613
$$ packed form
17413C46561A14121R1602K5963J52474j34609A15938R7132i3180A01222J88103
17403B89325Q8929A55714a00861D74921h1301B08361J37502j70333c5393C05875
17392A14379J91132I347J03422L00879D8315M54528A31328a82545H8965N7970
17382A46935N456J32095a64752I9413L12814A22094C6324M10927b2199B22754
17371D72187A67435F7046L01653A9522h0228B60971J12260A19751G92R9522b91227
17359B55185L53823h3643B66390c5438A8727L38898I5880a97190C47163n9405
17349B87758a90540K4884A44601o6383c6708A9388b0426B11139J14929a24735
17338A55826J0699a0198C9287J80a26006A75099p0100K38730J61907j87614C7613
$$ plain form
17326 133323 -163340 283586 412584 634661 141380 446208 300719 -89332 37121 247307
17316 247307 369448 412662 -501190 49405 491438 310503 -103814 -73470 380180 160373
17305 392735 87677 486408 372169 549698 245254 638301 148544 488535 123251 44556
17294 371767 227918 273411 2929 138950 284012 195599 155050 277215 440807 156833
17283 109256 312109 413595 213882 79208 -14943 214388 436165 312537 -7408 407979
17272 591535 156286 167822 214916 367753 328854 -60395 507537 81454 135691 488450 110778
17260 -140039 -135825 -7833 57892 250837 228374 129590 336072 575965 305210 97859 345399
17249 345399 60790 222632 -146732 216783 183830 505413 137862 508761 436121 244091
$$ packed form
17326A33323a63340B83586J28998K22077A41380L04828j45489h9332C7121K10186
17316B47307J22141M3214e01190D9405M42033j80935a03814L0344C80180A60373
17305C92735H7677L98731j14239J77529B45254L93047A48544L39991A23251D4556
17294C71767j43849M5493B929J36021J45062q8413m0549J22165J63592A56833
17283A09256K02853J01486j99713G9208a4943B14388K21777j23628g408D07979
17272E91535A56286J1536M7094J52837l8899f0395E07537H1454N4237L52759A10778
17260a40039M214g833E7892J92945k2463r8784K06482K39893k70755I7859K47540
17249C45399F0790J61842a46732B16783l2953L21583A37862L70899p2640j92030
$$ plain form
17239 244091 551344 346732 218667 376503 401071 401694 268306 102582 473231 84957
17228 421400 160036 545548 -32248 126531 348751 386104 -25988 29529 129956 466270
17218 466270 405947 537409 120241 249392 89469 -140217 127011 467129 362085 17422
17207 261222 -74505 64588 266302 -24638 350695 430323 -17835 128877 187658 139801 287312
17196 287312 149795 199017 627286 459131 -25542 362425 219786 147902 171077 127491
17186 127491 234914 111743 373156 -148224 217687 349673 192718 320720 163251 421583
17176 421583 522561 224898 218692 478314 326709 394785 337403 370448 473793 150865
17165 234115 607419 564966 314770 401150 192896 91760 240031 348791 714214 590461
$$ packed form
17239B44091L07253k04612j28065J57836K4568O23j33388A02582L70649H4957
17228D21400A60036L85512c2248A26531K22220L7353b5988B9529J00427L36314
17218D66270o0323J31462A20241J29151H9469a40217A27011L40118j05044A7422
17207B61222g4505F4588K01714b4638C50695P9628a7835A28877N8781m7857J47511
17196B87312j37517M9222M28269j68155b5542C62425j42639p1884K3175m3586
17186A27491J07423A11743K61413a48224B17687J31986j56955J28002j57469K58332
17176D21583J00978B24898o206K59622j51605O8076n7382L3045J03345A50865
17165B34115L73304m2453k50196Q6380A92896I1760J48271J08760L65423j23753
$$ plain form
17155 590461 234085 462030 600395 388682 401005 232188 3265 480939 305518 230153
17145 230153 337792 416136 354064 691477 333990 123251 592554 207480 571217 398286
17135 398286 301845 272226 234004 320678 763626 261962 -246577 491049 298265 387748
17125 387748 614422 290758 326462 582373 554004 280263 558782 630671 109367 643084
17115 643084 563327 301481 504812 576230 337715 476073 298418 349858 515580 519132
17105 519132 452442 148938 477482 334914 413432 266836 465909 454979 619608 428404
17095 428404 292240 761672 611980 605081 606988 459590 638141 606627 534204 581355 388245
17084 388245 428766 444295 522814 621287 339157 552060 587271 442975 488331 654915 567799
$$ packed form
17155E90461B34085K27945J38365k11713J2323j68817C265M77674j75421p5365
17145B30153J07639P8344o2072L37413C33990A23251M69303B07480L63737j72931
17135C98286r6441k9619l8222Q6674M42948B61962b46577D91049j92784Q9483
17125C87748K26674B90758L5704K55911k8369k73741K78519P1889A09367N33717
17115F43084p9757k61846K03331P1418k38515J38358j77655N1440J65722L552
17105E19132o6690A48938L28544j42568P8518j46596J99073j0930J64629j91204
17095D28404j36164M69432j49692o899J907j47398J78551l1514p2423M7151j93110
17084C88245M0521J5529P8519R8473k82130K12903L5211j44296M5356J66584q7116
$$ plain form
17073 567799 263135 562027 712653 523070 674393 639081 520652 729669 460778 680630
17063 680630 527362 423333 685100 698415 349153 539518 661304 321051 666260 602915
17053 602915 808361 525448 865600 611009 502016 364197 483659 563012 422011 418076
17043 418076 591282 593375 544358 252016 799124 689535 589097 758212 659292 523324
17033 523324 926912 397243 311035 580154 763483 975823 708231 760227 526069 1061930
17023 1061930 841030 806329 678403 819669 779631 962503 696740 807340 873701 946980
17013 946980 875053 909831 799895 976978 799689 609796 1137745 432020 588994 1233886
17003 1233886 947318 862298 683857 578190 801347 1144334 813733 895468 1251171 929203
$$ packed form
17073E67799B63135K98892J50626j89583J51323l5312j18429K09017k68891K19852
17063F80630j53268j04029K61767J3315C49153J90365J21786C21051L45209o3345
17053F02915K05446k82913L40152k54591j08993j37819J19462P9353j41001l935
17043D18076J73206K093m9017B52016N47108j09589j00438J69115r8920j35968
17033E23324M03588C97243q6208K69119J83329K12340k67592N1996k34158N35861
17023A061930k20900l4701j27926J41266m0038J82872k65763J10600O6361P3279
17013I46980p1927L4778j09936J77083j77289j89893N27949D32020J56974O44892
17003A233886k86568q5020j78441j05667K23157L42987l30601Q1735L55703l21968
$$ plain form
16993 929203 1204794 734261 1225267 1244597 986029 1214870 856156 1383573 1133081 780491
16983 780491 1113063 751309 907486 1033500 927264 1169290 1252644 889537 986565 1087587
16973 1087587 961642 1077393 1057131 799173 919570 1308752 1038057 1296099 1110568 1305086
16963 1305086 998421 1342197 1094194 1168026 1184929 1082039 1574652 1187945 1381414 922875
16953 922875 1145893 1026944 1231555 1317557 1325689 1602602 1232510 1329190 1203197 1590139
16943 1590139 1638552 1572432 1622200 1516989 1025903 1494356 1361608 1745285 1712863 1387690
16933 1387690 1038310 1451801 1535867 1313778 1590964 1455115 1819013 1557926 1775900 1514708
16923 1514708 1550746 2029544 1910367 1412695 1748774 1542258 1834734 1734925 2022212 1734783
$$ packed form
16993I29203K75591m70533M91006J9330k58568K28841l58714N27417k50492l52590
16983G80491L32572l61754J56177J26014j06236K42026Q3354l63107R7028J01022
16973A087587j25945J15751k0262k57958J20397L89182k70695K58042j85531J94518
16963A305086l06665L43776k48003P3832J6903j02890M92613l86707J93469m58539
16953I22875K23018j18949K04611Q6002Q132K76913l70092R6680j25993L86942
16943A590139M8413o6120M9768j05211m91086M68453j32748L83677l2422l25173
16933A387690l49380M13491Q4066k22089K77186j35849L63898k61087K17974k61192
16923A514708L6038M78798j19177m97672L36079k06516K92476r9809K87287k87429
$$ plain form
16913 1734783 2040985 1684234 1675285 2086211 1940810 1849487 1886287 1654567 2196615 1746269
16903 1746269 1904952 2267452 1884935 2332074 2230178 2371490 2368978 2186375 2574387 2216785
16893 2216785 2049965 2549170 2488141 2484907 2490560 2449652 2552589 2380415 2609848 2591279 2345736
16882 2345736 2604105 2803914 2647785 2580543 2819579 2767381 2796564 2712528 2970286 2976868
16872 2976868 3417951 3027641 2880426 3178579 2927114 2926191 3271679 3122781 2904560 3350715
16862 3350715 2932175 3713462 3351771 3242087 3302496 3534596 3244252 3845688 3511271 3931593
16852 3931593 3939710 3596913 3809918 3912726 3943914 4060335 4234131 4225379 4692038 4131772
16842 4131772 4548406 4709781 4657792 4937602 4867975 4674600 4598804 5110303 4953158 5271891
$$ packed form
16913A734783L06202l56751q949M10926j45401r1323L6800k31720N42048m50346
16903A746269J58683L62500l82517M47139j01896J41312k512j82603L88012l57602
16893B216785j66820M99205o1029l234N653m0908J02937j72174K29433j8569k45543
16882B345736K58369J99809j56129o7242K39036n2198K9183q4036K57758O582
16872B976868M41083l90310j47215K98153k51465r23L45488j48898k18221M46155
16862C350715m18540P81287l61691j09684O0409K32100k90344O01436l34417M20322
16852C931593Q117l42797K13005J02808L1188J16421J73796q752M66659n60266
16842D131772M16634J61375n1989K79810o9627j93375p5796N11499j57145L18733
$$ plain form
16832 5271891 5632432 5457087 5305883 5501935 5699676 5802300 5783609 5982281 5624421 5641390
16822 5641390 5982097 6571312 6619490 6527154 6892261 6417318 7273430 6865728 7326477 7277805
16812 7277805 7170140 7721140 7650588 7780738 8075967 8216044 8436167 8834638 8678249 9079281
16802 9079281 9299140 9284881 9589223 9830804 10229676 10205269 10472714 10555703 10900699 11168617
16792 11168617 11692187 11688572 11835044 12370835 12567507 12912792 13493954 13700058 13781181 14729139
16782 14729139 14357091 14974155 15788520 15965131 16534430 16715311 17365783 17800015 18447708
16773 18447708 19006998 19498530 20386262 21072872 21325498 22383795 22948038 23839883 24571281
16764 24571281 25371054 26325581 27071269 28169481 29258409 30368159 31521083 32542912
$$ packed form
16832E271891L60541j75345j51204J96052J97741J02624j8691J98672l57860J6969
16822E641390L40707N89215M8178r2336L65107m74943Q56112m07702M60749m8672
16812G277805j07665N51000p0552J30150K95229J40077K20123L98471j56389M01032
16802I079281K19859j4259L04342K41581L98872k4407K67445Q2989L44996K67918
16792A1168617N23570l615J46472N35791J96672L45285N81162K06104Q1123R47958
16782A4729139l72048O17064Q14365J76611N69299J80881O50472M34232O47693
16773A8447708N59290M91532Q87732O86610K52626J058297N64243Q91845P31398
16764B4571281P99773R54527P45688J098212J088928J109750J152924J021829
$$ plain form
16756 32542912 33498754 35292245 36699781 38044529 39594101 41075275 42826636 44799799
16748 44799799 47131677 48746155 51527635 53519322 56391327 58777670 61311969 64421841
16740 64421841 67726017 70745903 74453221 77897990 81990110 85997310 90596696 94935662
16732 94935662 99872162 104725121 109739903 115010214 120519507 125820113 131784204 136618243
16724 136618243 141866807 147214252 152125854 156522563 161013650 164252751 167289385 169382698
16716 169382698 170442692 170841974 170274886 169372777 166783637 164054832 160472700 156613958
16708 156613958 151746727 146978224 141647670 136276981 130576920 125300501 119408050 113785399
16700 113785399 108650017 103293994 98234380 93466066 88664671 84248942 79890786 75777663
$$ packed form
16756C2542912R55842J793491J407536J344748J549572J481174J751361J973163
16748D4799799K331878J614478K781480J991687K872005K386343K534299L109872
16740F4421841L304176L019886L707318L444769M092120M007200M599386M338966
16732I4935662M936500M852959N014782N270311N509293N300606N964091M834039
16724A36618243N248564N347445M911602M396709M491087L239101L036634K093313
16716A69382698J059994L99282n67088r02109k589140k728805l582132l858742
16708A56613958m867231m768503n330554n370689n700061n276419n892451n622651
16700A13785399n135382n356023n059614m768314m801395m415729m358156m113123
$$ plain form
16692 75777663 71974171 68460764 65121810 61808968 58696127 55858577 53453467 51238943
16684 51238943 48692060 46228662 44598940 41873718 40429970 38641167 37340384 35560238
16676 35560238 33973684 32868265 31296510 29918757 28930083 27746882 26859045 25730042
16668 25730042 24658145 24141392 22998924 22465849 21462259 20315310 20203679 19431583 18972807
16659 18972807 18266296 17543494 16972247 16318923 15982904 15449532 14718243 14911381 14028084
16650 14028084 13817448 13553834 13479135 12653417 12444570 12346306 11692860 11587340 11124777 10825764
16640 10825764 10656522 10299486 9934132 9708241 9912104 9346019 9035261 8655335 8720107
16631 8720107 8402377 8475410 8032380 7640544 7926888 7142044 7101948 7355683 7124537 7037390
$$ packed form
16692G5777663l803492l513407l338954l312842l112841k837550k405110k214524
16684E1238943k546883k463398j629722k725222j443748j788803j300783j780146
16676C5560238j586554j105419j571755j377753r88674j183201q87837j129003
16668B5730042j071897n16753j142468n33075j003590j146949j11631p72096m58776
16659A8972807p06511p22802n71247o53324l36019n33372p31289J93138q83297
16650A4028084k10636k63614p4699q25718k08847r8264o53446j05520m62563k99013
16640A0825764j69242l57036l65354k25891K03863n66085l10758l79926O4772
16631H720107l17730P3033m43030l91836K86344p84844m0096K53735k31146q7147
$$ plain form
16621 7037390 6868616 6650488 6721089 6606197 6326152 6060363 5925225 5659209 5510722 5832440
16611 5832440 5701055 5425629 5475787 5255880 4952195 5031598 5141554 4808385 4737743 4771610
16601 4771610 4367467 4557096 4534015 4319227 4311318 4532620 4186091 4033380 4047660 3860925
16591 3860925 3900446 3753879 3480523 3459631 3623929 3220670 3650653 3272647 3257358 3479712
16581 3479712 3435245 3018561 3529951 3300911 2868597 3328058 2957853 2560017 3249559 2767236
16571 2767236 2490850 2979016 2843336 2736477 2599617 2316875 2381319 2704634 2334632 2626546
16561 2626546 2488301 2506456 2247870 2506211 2161221 2590491 2480745 1940360 2079601 2263528
16551 2263528 2253906 2071247 2103408 2239326 2116425 2078801 1909533 2137750 2201420 1811370
$$ packed form
16621G037390j68774k18128P0601j14892k80045k65789j35138k66016j48487L21718
16611E832440j31385k75426N0158k19907l03685P9403J09956l33169p0642L3867
16601D771610m04143J89629k3081k14788p909K21302l46529j52711J4280j86735
16591C860925L9521j46567k73356k0892J64298m03259M29983l78006j5289K22354
16581C479712m4467m16684N11390k29040m32314M59461l70205l97836O89542m82323
16571B767236k76386M88166j35680j06859j36860k82742O4444L23315l70002K91914
16561B626546j38245J8155k58586K58341l44990M29270j09746n40385J39241J83927
16551B263528r622j82659L2161J35918j22901l7624j69268K28217O3670l90050
$$ plain form
16541 1811370 2052739 2094264 1565243 2117523 1993328 1845690 1934052 1932662 1885732 1663796
16531 1663796 1757403 1787041 1750609 1898203 1863824 1824244 1560344 1386555 1656769 1288797
16521 1288797 1789177 1570644 1368580 1596522 1404343 1400779 1318441 1425846 1340395 1434254
16511 1434254 1430344 1586301 1357221 1638488 1306421 1172099 1140538 1098827 1223093 1180504
16501 1180504 1204310 1252744 1401250 1436595 1135395 1025152 1268230 1240441 1171623 1048493
16491 1048493 1150256 1303279 921701 1249249 882629 1437453 966213 1160160 1070528 1047515
16481 1047515 1121160 1165857 930757 1097587 727829 1412417 1109925 893461 1191077 571522
16470 800125 923491 1180192 958789 687492 983443 705981 1216376 1000554 1134449 1000463
$$ packed form
16541A811370K41369M1525n29021N52280j24195j47638Q8362j390m6930k21936
16531A663796R3607K9638l6432J47594l4379l9580k63900j73789K70214l67972
16521A288797N00380k18533k02064K27942j92179l564q2338J07405q5451R3859
16511A434254l910J55957k29080K81267l32067j34322l1561m1711J24266m2589
16501A180504K3806M8434J48506L5345l01200j10243K43078k7789o8818j23130
16491A048493J01763J53023l81578L27548l66620N54824m71240J93947q9632k3013
16481A047515P3645M4697k35100J66830l69758O84588l02492k16464K97616E71522
16470H00125J23366K56701k21403k71297K95951k77462N10395k15822J33895j33986
$$ plain form
16460 1000463 1202582 429836 1019550 974950 743502 826929 826189 699805 964776 731504
16450 731504 983226 707071 762066 738399 929278 702411 738689 415107 792645 989111
16440 989111 787881 511803 773090 461007 709334 1005907 680167 641958 554856 325202
16430 325202 372718 758412 883776 530482 683677 648453 981480 663471 484338 669845
16420 669845 918596 847661 577370 396180 605920 480635 439831 624690 920825 704498
16410 704498 678258 516617 635739 610387 388340 559964 418491 377282 480329 470968
16400 470968 415818 869993 496526 715665 359150 531350 533199 453682 272269 371430
16390 371430 684748 807072 625227 640519 631033 682006 407261 400969 663839 229618 480992
$$ packed form
16460A000463K02119D29836N89714m4600k31448Q3427p40j26384K64971k33272
16450G31504K51722k76155N4995k3667J90879k26867L6278l23582L77538J96466
16440I89111k01230k76078K61287l12083K48327K96573l25740l8209q7102k29654
16430C25202M7516L85694J25364l53294J53195l5224L33027l18009j79133J85507
16420F69845K48751p0935k70291j81190K09740j25285m0804J84859K96135k16327
16410G04498k6240j61641J19122k5352k22047J71624j41473m1209J03047r361
16400D70968n5150M54175l73467K19139l56515J72200J849p9517j81413R9161
16390C71430L13318J22324j81845J5292r486N0973k74745o292K62870B29618K51374
$$ plain form
16379 480992 423327 386477 497158 679409 295230 464863 433197 222632 187840 129559
16369 129559 557499 401153 241555 155886 651088 271558 519857 268504 691976 181855
16358 650150 450143 558006 294417 353528 471949 545316 286549 586474 343719 12084
16347 527013 570379 587588 369288 417271 303527 20875 237490 355561 267846 168791 217510
16336 217510 -176277 499010 245615 448157 290508 316939 217524 111402 288931 164451
16326 164451 193327 270674 243998 190189 -5416 306030 443398 471776 263056 451260 103931
16314 217363 65064 277803 608002 90887 360352 669373 297739 323654 564573 218310
16303 490539 205777 272240 394266 127918 303078 402707 259629 508266 -49793 127350
$$ packed form
16379D80992n7665l6850J10681J82251B95230J69633l1666k10565l4792n8281
16369A29559M27940j56346j59598q5669M95202B71558K48299k51353M23472A81855
16358F50150k00007J07863k63589N9111J18421P3367k58767K99925k42755A2084
16347E27013M3366J7209k18300M7983j13744B0875K16615J18071q7715r9055M8719
16336B17510a76277D99010B45615K02542j57649K6431r9415j06122J77529j24480
16326A64451K8876P7347k6676n3809e416C06030J37368K8378k08720J88204A03931
16314B17363F5064K12739L30199I0887K69465L09021B97739K5915K40919B18310
16303D90539B05777O6463J22026A27918J75160R9629j43078K48637d9793A27350
$$ plain form
16292 172811 66039 279246 538061 103411 265826 471112 28293 -20441 441666 1080
16281 395020 276095 240066 184959 298868 207980 285048 81271 153292 278139 48869 244816
16270 244816 71061 -41500 207803 141949 310093 154898 28102 159778 474734 643332
16260 643332 -73570 -112462 322887 616983 231867 43022 342230 210926 272255 136673
16250 136673 -170113 27486 -322269 70925 -12286 437441 421538 246026 196286 249007 214449
16239 214449 122093 199136 26990 113872 152321 30235 -160302 741685 124373 317763 -4591
16227 174437 50987 190912 -115442 103076 469050 14996 296476 136555 -97145 -149106
16217 -149106 230925 338500 220165 -157201 150747 169603 303163 195669 78659 -144966
$$ packed form
16292A72811F6039K13207K58815A03411J62415K05286B8293b0441D41666A080
16281C95020j18925l6029n5107J13909r0888P7068H1271P2021J24847D8869J95947
16270B44816G1061d1500B07803o5854J68144A54898B8102J31676L14956J68598
16260F43332g3570l8892C22887K94096B31867D3022K99208j31304O1329j35582
16250A36673a70113B7486c22269G0925a2286D37441j5903j75512m9740N2721l4558
16239B14449r2356P7043B6990Q6882L8449C0235a60302G41685A24373J93390d591
16227A74437E0987J39925a15442A03076L65974A4996K81480A36555i7145n1961
16217a49106B30925J07575j18335a57201A50747J8856J33560j07494G8659a44966
$$ plain form
16206 150431 -63706 295000 219642 50303 224736 170052 633570 -25630 418420 306804
16196 306804 60817 74099 249603 -57805 256051 483670 113556 404076 13413 84610
16186 84610 238944 212944 37941 340154 145294 87811 -128880 394075 41917 200396
16176 200396 79166 -114470 -113878 127868 284199 105498 40730 217951 146881 57105 116843
16165 116843 -32856 273419 -103490 -56640 12385 -26985 200556 281691 102927 32197 -63855
16153 21911 295622 108139 363532 -78990 228872 367933 -51333 297905 -114874 -148503
16143 -148503 485885 -22406 120761 121156 37365 8770 -211592 252203 3288 -20702 -291452
16132 -291452 -73504 153942 178994 157233 19966 278007 83245 276557 -18846 134966 -53943
$$ packed form
16206A50431f3706B95000p5358E0303J74433n4684M63518b5630D18420j11616
16196C06804F0817J3282J75504e7805B56051K27619A13556K90520A3413P1197
16186H4610J54334k6000C7941L02213A45294n7483a28880C94075D1917J58479
16176B00396G9166a14470N92A27868J56331A05498D0730J77221p1070E7105N9738
16165A16843c2856B73419a03490M6850A2385b6985B00556Q1135A02927C2197f3855
16153B1911K73711A08139K55393g8990B28872J39061e1333B97905a14874l3629
16143a48503D85885b2406A20761L95C7365H770b11592B52203C288b0702k70750
16132b91452g3504A53942K5052k1761A9966K58041H3245J93312a8846A34966e3943
$$ plain form
16120 133357 -148083 -221267 -195281 10587 24193 -59008 139525 -49751 269219 199049 -98376
16108 -15867 -135772 283563 165472 -3129 293369 75026 -90088 -72364 300275 165501 -127826
16096 -28938 93611 21341 278933 59148 -214042 -282509 72308 -173607 133981 38528 5928
16084 -32009 -200443 126859 -103104 146576 88488 -79311 150619 98763 327883 -263530
16073 327623 99710 136300 138167 179511 -70961 -25928 6480 273045 91462 12301 -554767
16061 25319 -151601 77414 217652 -203961 62385 -313907 -42292 130552 -263045 290149
16050 -16256 -160537 210105 -56417 -121449 -6843 -82290 -47814 -168897 -267894 -260657 302051
16038 -152021 15582 105593 275847 82393 334876 256627 135349 -13471 -129432 -198207 -159025
$$ packed form
16120A33357a48083p3184K5986A0587J3606e9008A39525d9751B69219p0170i8376
16108a5867j19905B83563j18091c129B93369G5026i0088J7724C00275j34774a27826
16096b8938I3611B1341K57592E9148b14042o8467G2308a73607A33981C8528E928
16084c2009j68434A26859a03104A46576n8088g9311A50619n1856K29120b63530
16073C27623I9710L6590J867M1344g0961b5928F480K66565I1462A2301e54767
16061B5319a51601G7414J40238b03961F2385c13907d2292A30552b63045B90149
16050a6256j44281B10105e6417o5032f843p5447L4476j21083r8997P237C02051
16038a52021A5582R0011J70254H2393K52483p8249j21278a3471j15961o8775L9182
$$ plain form
16027 -159025 -4891 -106486 309198 -91892 238059 70880 77735 105340 303779 65334 -69667
16015 89092 -95882 -213427 27432 152766 -19221 -39901 164751 -424553 128013 5520 -95477
16003 -281643 -125864 -24246 -170022 -106638 154571 -52806 26489 66696 -197314 201075
15992 198121 250103 424083 235300 -98267 97101 26821 107452 -81408 -53111 582142 381889
15981 381889 285351 18408 -107445 258577 94144 -26711 52457 290309 -12276 121942 329657
15970 329657 -4971 45114 34779 -113893 77878 -86409 -191811 140064 -225094 -111180 54072
15958 -224592 17536 -96640 -306968 -112320 -218736 2534 -192572 11129 -74285 29005 29918
15947 29918 125852 -354888 -41299 148472 171389 -288578 -3213 -89636 -172318 41110 -93869
$$ packed form
16027a59025d891j01595C09198i1892B38059G0880O855K7605J98439F5334f9667
16015H9092i5882j17545B7432J25334a9221k0680A64751d24553A28013E520i5477
16003b81643a25864b4246j45776O3384A54571e2806B6489M0207a97314B01075
15992A98121N1982J73980j88783i8267I7101B6821Q0631h1408K8297E82142k00253
15981C81889r6538A8408a07445B58577I4144b6711E2457K37852a2276A21942K07715
15970C29657d971D5114j0335a13893G7878h6409j05402A40064b25094a11180E4072
15958b24592A7536i6640k10328a12320j06416B534a92572A1129g4285B9005R13
15947B9918R5934c54888d1299A48472K2917b88578c213q6423q2682D1110i3869
$$ plain form
15935 -418491 138230 143168 182496 293162 -154637 -41307 238298 14822 167249 -31663 -360791
15924 -360791 109390 -11913 241011 -229186 -85441 106786 -250768 140370 36031 116484
15914 116484 -56180 -111714 -107307 -291791 10264 201757 -82301 -248796 -54990 -192281 -286292
15903 -286292 -69005 -123748 98946 147431 149138 -103341 114415 98853 -177648 -51568 73702
15891 -39145 66843 -72762 -271324 97895 122717 187373 -284689 -20976 -83449 71633 79360
15880 79360 -5372 -24077 -76921 100905 -165673 319223 -223813 140660 -83413 -173554 -24523
15868 -57604 241986 -31639 116134 -14082 -48388 -18062 95523 -144651 -195204 -104077 -47698
15856 220166 -213016 -250190 -32115 160888 -19391 -116457 -262023 -82837 130545 122738 -177555
$$ packed form
15935d18491A38230M938L9328J10666a54637d1307B38298A4822J52427c1663l29128
15924c60791A09390a1913B41011b29186h5441A06786b50768A40370C6031Q0453
15914A16484e6180n5534M407j84484A0264J91493h2301j66495e4990j37291r4011
15903b86292f9005n4743I8946M8485J707a03341A14415j5562a77648e1568G3702
15891c9145F6843g2762j98562I7895K4822O4656b84689b0976o2473G1633P727
15880G9360e372j8705n2844A00905a65673C19223b23813A40660h3413r0141b4523
15868e7604B41986c1639A16134a4082l4306a8062I5523a44651n0553R1127d7698
15856B20166b13016l7174c2115A60888a9391r7066j45566h2837A30545p807a77555
$$ plain form
15844 -171442 -98398 -212127 -54769 -290727 110626 -315893 139887 78142 216472 111112
15834 111112 -191863 153177 51510 184443 3884 -153300 -108166 257181 -135158 132739
15823 132129 49059 129233 130194 202210 -173549 11836 -147638 -153446 -164358 59388 67206 105721
15811 105721 -11180 -306000 -16611 -57883 -178924 -131480 -368819 67953 143885 207544 -31328
15799 -240267 -309459 -39776 -2462 39855 133911 -11395 -118844 112805 273675 11171 -220194
15787 -140443 -291748 -36598 -74657 -510186 121195 25737 70140 -41617 48110 -158667 -110187
15776 -110187 -384269 130161 -173469 25792 -83195 15869 -59006 39167 -100558 378935
15765 121426 -217586 -153528 93758 109455 -64121 -38080 -141925 24829 138292 -147714 95261
$$ packed form
15844a71442P3044j13729e4769k35958A10626c15893A39887o1745J38330j05360
15834A11112a91863A53177E1510J32933C884a53300M5134B57181a35158A32739
15823A32129D9059Q0174R61P2016a73549A1836a47638n808j0912E9388P818L8515
15811A05721a1180k94820a6611m1272j21041M7444k37339F7953P5932O3659c1328
15799b40267o9192c9776b462C9855R4056a1395j07449A12805J60870A1171b20194
15787a40443j51305c6598l8059m35529A21195B5737M4403d1617D8110a58667M8480
15776a10187k74082A30161a73469B5792h3195A5869e9006C9167a00558C78935
15765A21426b17586O4058I3758J5697f4121K6041j03845B4829J13463a47714I5261
$$ plain form
15753 153644 -115872 87755 -55484 -139810 -252762 105254 27216 88226 25313 -36448 -338562
15742 -338562 -318945 3967 219214 -298368 -48764 -23379 -34698 55134 55710 205453 -57353
15730 -336499 -78109 -171823 -275792 -153010 72979 -311692 -172134 174651 95692 41238
15719 -262510 98085 -190270 -80095 -6264 -3697 72328 -336435 101081 276641 -160068 287210
15707 -3549 -5605 -306277 -119421 -183422 392325 -191624 -66013 136832 -191347 120922 286883
15696 286883 236698 319084 46516 163332 157786 3671 317633 139776 -4276 -29749 -74400
15685 -74400 40507 -44657 166261 -174828 206584 -24941 94625 46937 254485 -45679 -360797
15674 -360797 57998 356518 166458 341301 46574 209780 -105571 -198105 84432 99468
$$ packed form
15753A53644a15872H7755e5484q4326j12952A05254B7216O1010B5313c6448l02114
15742c38562J9617C967K15247b98368d8764b3379j1319E5134N76J49743e7353
15730c36499g8109r3714j03969J22782G2979c11692J39558A74651p8959D1238
15719b62510I8085a90270h0095f264K567G2328c36435A01081J75560a60068B87210
15707c549k056l00672a19421o4001C92325a91624f6013A36832a91347A20922J65961
15696B86883n0185Q2386D6516J16816n546C671L13962A39776d276k5473m4651
15685g4400D0507d4657A66261a74828B06584b4941I4625D6937K07548d5679l15118
15674c60797E7998K98520A66458J74843D6574J63206a05571r2534H4432J5036
$$ plain form
15664 99468 -110957 -90904 -222683 -89374 -170123 -293074 324878 91977 183827 175361 -183675
15652 -230857 13339 99427 -45693 -166186 343007 -281640 -222081 -109439 -149474 72015 -123938
15640 -73948 -5089 -229025 66274 34445 29098 50246 167896 -59157 -63883 514780 80123 -77906
15627 -147172 -75202 -295566 -112986 -183770 -334560 -224187 -17194 -308167 185932 -192743
15616 -396100 238413 92617 -130991 -224544 167850 198149 108373 92212 -222507 104213
15605 -87287 -22755 -106108 49375 93671 85898 -122708 276170 195975 -85457 -164177 -188469
15594 -188469 170089 -139806 -109256 174419 -218851 -319524 -92799 202581 347406 -208657
15583 -116745 -50073 -154927 228689 -262934 -84795 -300259 -711 -113936 -105038 -67671 191504
$$ packed form
15664I9468a10957K0053j31779h9374q0749j22951C24878I1977R1850q466a83675
15652b30857A3339Q6088d5693j20493C43007b81640N9559a09439m0035G2015a23938
15640g3948e089k23936F6274l1829n347K1148J17650e9157m726E14780H0123g7906
15627a47172P1970k20364a12986p0784j50790J10373a7194k90973A85932a92743
15616c96100B38413I2617a30991r3553A67850L0299q9776j6161b22507A04213
15605h7287b2755q3353D9375M4296p773a22708B76170q0195h5457p8720k4292
15594a88469A70089a39806L0550A74419b18851j00673i2799B02581J44825b08657
15583a16745e0073j04854B28689b62934h4795k15464g11j13225Q898L7367A91504
$$ plain form
15571 -135890 -65210 184650 -73775 108019 184327 -553471 243689 59067 181947 -16011
15560 -87288 -76835 18738 70995 -154134 131862 -418854 -229745 18391 196059 488813
15550 488813 -251830 -334512 73969 246147 352696 -183314 102816 -283918 -13198 211589
15539 35920 -351528 215501 -14360 -240126 207857 315169 -259218 -193378 44419 -577300
15528 -126965 34284 -134818 -67821 -204369 -208096 -107570 567 -45180 -71905 -152017 147479
15516 -16625 -35427 256611 -59635 74990 366288 151474 -381305 143914 173832 117516 33460
15504 58329 -126107 -117942 5898 140115 -103622 -198229 -354578 -172021 42975 -319991 178
15492 -214645 104136 -36463 -204373 -29767 269725 12580 273122 160339 117131 83848
$$ packed form
15571a35890f5210A84650g3775A08019P6308e53471B43689E9067J22880a6011
15560h7288J0453A8738N2257a54134A31862d18854J89109A8391J77668K92754
15550D88813b51830q2682G3969J72178J06549a83314A02816b83918a3198B11589
15539C5920c51528B15501a4360k25766B07857J07312b59218O5840D4419e77300
15528a26965C4284a34818O6997j36548l727J00526E67d5180k6725q0112A47479
15516a6625j8802B56611e9635G4990K91298A51474c81305A43914K9918n6316C3460
15504E8329a26107Q165E898J34217a03622r4607j56349a72021D2975c19991A78
15492b14645A04136c6463j67910b9767B69725A2580K60542j12783m3208l3283
$$ plain form
15482 83848 -255684 143898 -54843 -246739 76500 100055 51987 381796 338829 15198 147822
15471 147822 38244 4462 109973 -45164 -68779 -109391 112838 -22099 -40150 -139892 -114750
15460 -114750 -432767 150400 -126512 342134 54889 100782 143649 -119638 -60480 219465
15449 119829 -166177 -221650 76426 144591 -288322 -34601 -84236 -172346 40216 -56190 271105
15437 89082 19000 262118 -263683 43109 194730 -86908 -348925 21924 47558 -512946 -142075
15425 481435 -26917 -205688 -300386 53649 244043 346464 -250019 146711 -98243 -7831 -7910
15414 -7910 164660 -113260 361638 473429 284261 -118214 40371 -440996 -193706 47936
15403 19162 176150 250596 -180234 -79463 53512 -241024 -241150 194465 93604 312795 -219759
$$ packed form
15482H3848b55684A43898e4843j91896G6500K3555m8068L29809m2967A5198J32624
15471A47822C8244D462J05511d5164k3615m0612A12838b2099j8051r9742K5142
15460a14750l18017A50400a26512C42134E4889M5893M2867a19638N9158B19465
15449A19829a66177n5473G6426O8165b88322c4601m9635q8110D0216e6190B71105
15437H9082A9000K43118b63683D3109J51621h6908k62017B1924K5634e12946a42075
15425D81435b6917j78771r4698E3649J90394J02421b50019A46711i8243g831p9
15414g910A64660a13260C61638J11791j89168a18214D0371d40996a93706D7936
15403A9162J56988P4446a80234g9463E3512b41024j26A94465I3604K19191b19759
$$ plain form
15391 -156707 31254 9789 -39074 -189244 185661 -357065 113644 282192 374310 -45502 31406
15379 -323412 -62961 -355394 393563 -336298 -165839 -132069 55761 279939 141599 -35364
15368 -101249 95346 -6593 -154193 -45480 143914 -161947 -109 -238811 6080 205678 300191
15357 300191 99391 -319800 -112026 17382 241438 118200 52339 -138079 19272 -198267
15346 181059 178057 336408 -125615 99244 327690 238741 -28278 -157929 49306 83747 78662
15335 78662 59277 107900 -98047 137382 136944 452035 61704 18352 -90381 -76305 -23426 -3233
15322 168683 10133 -334336 41532 175851 248897 -104036 -28049 -8600 47913 191825 27845
15310 344580 129153 -212932 -106142 125816 -197486 140586 -100008 83335 4459 170545
$$ packed form
15391a56707C1254I789c9074j50170A85661c57065A13644J68548R2118d5502C1406
15379c23412f2961k92433C93563c36298a65839L3770E5761K24178j38340c5364
15368a01249I5346f593j47600d5480A43914a61947a09k38702F080J99598R4513
15357C00191I9391c19800a12026A7382K24056A18200E2339a38079A9272a98267
15346A81059l002J58351a25615I9244K28446q8949b8278j29651D9306L4441n085
15335G8662j9385M8623i8047A37382m38L15091F1704A8352i0381J4076b3426c233
15322A68683A0133c34336D1532J34319P3046a04036b8049h600D7913J43912B7845
15310C44580A29153b12932a06142A25816a97486A40586a00008H3335D459J66086
$$ plain form
15300 170545 52327 50014 88344 -101004 -64066 142317 521 41800 -211499 361986 -3113
15288 -23025 -17793 -125802 243388 -234333 253160 103740 303341 -156236 119970 298514
15278 298514 215516 56355 -56740 -100194 -59938 163932 93364 -41105 347034 -403130 277935
15266 226837 188700 -49541 77817 264851 225505 114881 238276 224444 307176 237445 244512
15255 244512 71256 192845 201984 262802 243903 837933 1493690 979656 1255805 1101841
15245 1101841 845691 394056 261670 75710 -123422 236634 86274 -134215 235133 32528
15234 -202533 59292 392538 206641 196069 153014 34484 71170 -108130 283469 -216797
15223 -243459 -11545 337082 270821 80734 67955 264865 -140422 53345 44823 220182 122138
$$ packed form
15300A70545E2327k313L8330a01004L6938A42317E21M1279b11499C61986c113
15288b3025N232j08009B43388b34333B53160A03740J99601a56236A19970J78544
15278B98514q2998E6355e6740m3454M0256A63932p0568d1105C47034d03130B77935
15266B26837l8137d9541G7817J87034l9346j10624J23395j3832Q2732o9731P067
15255B44512G1256J21589R139O0818j8899N94030O55757n14034K76149j53964
15245A101841k56150C94056j32386G5710a23422B36634H6274a34215B35133C2528
15234b02533E9292L33246j85897j0572m3055C4484L6686a08130B83469b16797
15223b43459a1545C37082o6261H0734j2779J96910a40422E3345q522J75359r8044
$$ plain form
15212 122138 -121639 -344865 108279 -12154 -200720 -128799 -89734 37970 264339 -10091
15201 107899 120149 152797 60533 279115 81546 27617 -67311 14756 -19117 -32124 454571
15189 103339 192995 438597 -77456 -253300 275603 264441 80250 159672 110853 45830 116007
15178 116007 12238 -68112 285948 236784 216123 345345 250093 -38041 3915 102929 101274
15167 101274 21389 84159 -229458 164872 -219261 458820 -191912 979 -137825 123753
15156 241189 -125069 300292 213028 16338 61311 -73254 -21808 173040 93806 -28730 61972
15144 -112167 -36936 262420 479897 -71077 370813 55710 351182 182514 -237890 120923
15133 9234 178356 129223 118962 201234 199795 64927 -27814 110366 231670 199909 -87288
$$ packed form
15212A22138a21639k23226A08279a2154j88566P1921L9065C7970K26369a0091
15201A07899J2250L2648F0533K18582H1546B7617f7311A4756a9117j3007D54571
15189A03339Q9656K45602g7456j75844B75603j1162H0250P9422m8819D5830P0177
15178A16007A2238f8112B85948m9164k0661J29222r5252c8041C915R9014j655
15167A01274B1389O2770b29458A64872b19261D58820a91912I79a37825A23753
15156B41189a25069C00292q7264A6338M4973g3254b1808A73040p9234b8730F1972
15144a12167c6936B62420K17477g1077C70813E5710K95472j68668b37890A20923
15133I234J69122m9133j0261Q2272j439F4927b7814A10366J21304l1761h7288
$$ plain form
15121 -39397 -76721 21220 476107 156783 91552 377971 -19677 406378 254753 123002
15110 192034 271996 228967 305720 -105504 177467 175515 352837 64739 -42682 188636 151376
15099 151376 17829 -240918 63051 118185 423322 -257741 295632 359833 -77781 540119
15088 -19671 565100 -184478 361861 80806 189627 235727 48444 83247 28606 159 366107
15077 366107 165913 57202 188141 -3063 250872 119339 141740 151009 231420 172718 340777
15066 340777 -123847 -126856 115238 119089 -58606 157216 203398 -126965 294358 351664 322748
15055 322748 317135 405084 161797 409927 343836 237425 249349 29910 -129936 433921 146798
15043 374148 363163 91011 58927 -177009 364434 79789 174558 37391 183099 121591 530530
$$ packed form
15121c9397l7324B1220M54887A56783o5231K86419a9677D06378j51625A23002
15110A92034P9962m3029P6753a05504A77467j952J77322F4739d2682A88636l7260
15099A51376A7829b40918F3051N5134L05137b57741B95632O4201g7781E40119
15088a9671E65100a84478C61861H0806J08821M6100D8444L4803B8606A59L65948
15077C66107A65913E7202J30939c063B50872A19339K2401R269Q0411n8702J68059
15066C40777a23847l009A15238L851e8606A57216M6182a26965B94358N7306k8916
15055C22748n613Q7949A61797K48130o6091j06411J1924B9910a29936D33921A46798
15043C74148j0985I1011l2084a77009C64434G9789R4769C7391J45708o1508M08939
$$ plain form
15032 530530 255492 309697 352908 360194 227653 270250 230884 43844 412732 358465 -176854
15020 374595 129081 31462 131955 341644 235085 323947 325608 360320 285844 491121 254545
15009 254545 10062 215895 -14629 345952 38901 348500 182372 460197 -704 37800 255433
14998 255433 386172 91628 209208 12460 -218215 362884 291077 239792 319716 442106
14988 442106 143661 168031 -84902 264872 108494 263590 106442 536197 215677 -2325
14977 354010 228516 374171 339163 216639 72149 333640 -40502 218331 428066 433919
14967 433919 197210 648897 232725 215531 257473 134140 249527 363857 168806 482112
14957 482112 381301 541088 404835 70891 236660 346994 89207 188145 65720 432794
$$ packed form
15032E30530B55492N4205M3211P286j32541M2597l9366D3844L68888n4267a76854
15020C74595A29081C1462J00493K09689j06559Q8862J661L4712p4476K05277k36576
15009B54545A0062K05833a4629C45952C8901L09599j66128K77825g04C7800K17633
14998B55433J30739I1628J17580A2460b18215C62884p1807n1285P9924J22390
14988D42106A43661K4370h4902B64872A08494J55096A06442M29755B15677b325
14977C54010j25494J45655l5008j22524G2149K61491d0502B18331K09735N853
14967D33919A97210M51687B32725j7194M1942j23333J15387J14330A68806L13306
14957D82112j00811J59787j36253G0891J65769J10334H9207R8938F5720L67074
$$ plain form
14947 432794 305449 271290 132409 13176 200872 417964 -19671 46576 305943 337909
14937 337909 254649 391310 205910 334858 268424 314418 324184 186374 471466 213169
14926 176120 94230 221490 347879 299456 583431 389425 421128 673143 663506 407279
14916 407279 93502 272028 452101 307710 340512 244256 424432 502657 600685 234864
14905 274890 492952 407129 93554 155560 634721 183887 595214 259132 406640 436070
14895 436070 318638 250466 320399 147255 282939 403072 472904 -10320 22617 199245
14885 199245 295419 451236 469456 328785 170166 156650 594518 362886 360220 536445
14875 536445 420318 41535 471649 525901 33724 355715 429125 234992 484108 229579
$$ packed form
14947D32794j27345l4159A32409A3176J87696K17092a9671D6576K59367L1966
14937C37909q3260J36661j85400J28948o6434M5994R766j37810K85092B13169
14926A76120q1890J27260J26389m8423K83975j94006L1703K52015r637k56227
14916D07279I3502J78526J80073j44391L2802r6256J80176P8225R8028B34864
14905B74890K18062q5823I3554O2006M79161A83887M11327B59132J47508K9430
14895D36070j17432o8172O9933A47255J35684J20133O9832a0320B2617J76628
14885A99245R6174J55817J8220j40671j58619j3516M37868k31632k666J76225
14875E36445j16127D1535M30114N4252C3724L21991P3410j94133K49116B29579
$$ plain form
14864 593526 158254 241290 535797 486756 322508 411825 433087 225735 558166 639240
14854 639240 338462 -197222 690237 174299 103338 617653 374843 452604 350155 592894
14844 592894 490809 704886 524633 604026 440336 592835 514214 378990 476583 369080
14834 369080 504708 204194 562475 502497 470592 417664 300672 510813 442318 333625
14824 333625 437270 542915 636152 563171 426446 375357 547630 255415 408161 592898
14814 592898 570642 736785 558587 783134 581440 526341 545318 537260 621182 557465 471249
14803 471249 819843 637427 632054 499033 721418 738705 429310 829501 387638 790054
14793 790054 299264 784741 663061 893199 536802 603724 501874 660538 510632 842275
$$ packed form
14864E93526A58254Q3036K94507m9041j64248Q9317K1262k07352L32431Q1074
14854F39240l00778a97222F90237A74299p0961N14315k42810P7761j02449K42739
14844E92894j02085K14077j80253P9393j63690J52499p8621j35224R7593j07503
14834C69080J35628B04194L58281n9978l1905n2928j16992K10141o8495j08693
14824C33625J03645J05645R3237p2981j36725n1089J72273B55415J52746J84737
14814E92898k2256J66143j78198K24547k01694n5099J8977q058Q3922o3717q6216
14803D71249L48594j82416n373j33021K22385J7287l09395M00191C87638M02416
14793G90054B99264M85477j21680K30138l56397O6922j01850J58664j49906L31643
$$ plain form
14783 842275 781072 814237 871208 643874 568063 718735 723797 511307 528209 430657 510973
14772 510973 883612 792749 926962 656656 719035 629682 821830 922594 727400 347952
14761 545588 711421 986941 472095 522274 727575 671156 968332 692536 761764 623901
14751 623901 752738 828807 902038 971212 700108 649121 1067402 512358 733098 581471
14741 581471 898362 965734 776537 984893 821684 866099 916691 749635 654845 954647
14731 954647 910063 888388 813864 937640 679487 1094460 1171039 961845 899251 1047917
14721 1047917 928173 779161 971412 1171730 607498 932811 752869 1067895 1079797 725615
14711 725615 1022598 966970 1001488 1346410 1146975 782809 1135258 927250 1077902 1148529
$$ packed form
14783H42275o1203L3165N6971k27334p5811J50672N062k12490J6902r7552Q0316
14772E10973L72639r0863J34213k70306O2379q9353J92148J00764j95194C47952
14761E45588J65833K75520D72095N0179K05301n6419K97176k75796O9228j37863
14751F23901J28837P6069P3231O9174k71104n0987M18281E12358K20740j51627
14741E81471L16891O7372j89197K08356j63209M4415N0592j67056r4790K99802
14731I54647m4584k1675p4524J23776k58153M14973P6579k09194o2594J48666
14721A047917j19744j49012J92251K00318n64232L25313j79942L15026J1902l54182
14711G25615K96983n5628L4518L44922j99435l64166L52449k08008J50652P0627
$$ plain form
14701 1148529 1247327 1086769 703623 1173292 1024009 1136053 1009872 1008915 1296144 1210561
14691 1210561 712563 1088003 961877 670583 966666 897728 1093004 766029 1111327 934726
14681 934726 1216134 1085447 1092060 943965 963652 1067946 1140381 1136388 1158171 1104976 1291012
14670 1291012 1277379 1019502 1158638 1030144 1471006 1142439 1219552 1194232 1191205 1281386
14660 1281386 1227939 1238348 1237336 1469064 1327109 1184612 1380206 1176048 1508103 1267714
14650 1267714 1538732 1203120 1360563 1218006 1321469 1419397 1565704 1210640 1791676 1424763
14640 1424763 1396393 1883851 1417339 1245933 1307194 1193833 1362816 1747386 1424373 1421266
14630 1421266 1367346 1268209 1549272 1850423 1597048 1427961 1661041 1594517 1523814 1670763
$$ packed form
14701A148529R8798j60558l83146M69669j49283J12044j26181r57K87229q5583
14691A210561m97998L75440j26126k91294K96083o8938J95276l26975L45298j76601
14681I34726K81408j30687O613j48095J9687J04294P2435l993K1783n3195J86036
14670A291012j3633k57877J39136j28494M40862l28567P7113k5320l027R0181
14660A281386n3447J0409j012K31728j41955j42497J95594k04158L32055k40389
14650A267714K71018l35612J57443j42557J03463R7928J46307l55064N81036l66913
14640A424763k8370M87458m66512j71406O1261j13361J68983L84570l23013l107
14630A421266n3920r9137K81063L01151k53375j69087K33080o6524p0703J46949
$$ plain form
14620 1670763 1582770 1749907 1662789 1710469 1562553 1675823 1473507 1716484 1739309 1350066
14610 1350066 1865038 1636007 2001782 1617174 1544186 1852133 1882901 1744650 2002700 1819988
14600 1819988 1917267 1578052 1656336 2150098 1629567 2118880 1927630 1905991 2246884 2177680
14590 2177680 2276337 2176067 2011885 2186489 1970134 2714165 1885857 2218695 2370347 2244946
14580 2244946 2190419 2405058 2398003 2149053 2284443 2479449 2619187 2553998 2636077 2400563
14570 2400563 2870361 2878189 2451821 2448083 2831908 2960285 2792719 2847201 3053751 2880126
14560 2880126 2839935 3233534 3350106 3516191 3420356 3610559 3880910 3889697 4794224 5743691
14550 5743691 6133817 8227454 11560162 19936062 38750946 42249695 22971638 9923461
$$ packed form
14620A670763q7993J67137q7118M7680j47916J13270k02316K42977K2825l89243
14610A350066N14972k29031L65775l84608p2988L07947L0768j38251K58050j82712
14600A819988R7279l39215P8284M93762n20531M89313j91250k1639L40893o9204
14590B177680R8657j00270j64182J74604k16355P44031q28308L32838J51652j25401
14580B244946n4527K14639p055k48950J35390J95006J39738o5189Q2079k35514
14570B400563M69798P828m26368l738L83825J28377j67566N4482K06550j73625
14560B880126m0191L93599J16572J66085r5835J90203K70351Q787R04527R49467
14550E743691L90126K093637L332708Q375900J8814884L498749j9278057I923461
$$ plain form
14541 5660396 4075489 3287301 3002702 2728817 2626425 2485952 2550686 2513852 2544260 2179011
14531 2179011 2670077 2620871 2483164 2635530 2600095 3013599 2126890 2760743 2629566 2547596
14521 2547596 2847947 2895931 2846093 3040176 3083992 3285299 3061694 2884383 3222145 3001279
14511 3001279 3277463 3126665 2870491 3492767 3169311 3143195 3172239 3367847 3589076 3554023
14501 3554023 4015033 3386407 3944931 3692168 3326395 3547622 3893946 3907439 4061260 3753394
14491 3753394 3826388 3925724 4008543 4204812 4019065 4132775 3982693 3931790 4764573 4495171
14481 4495171 4110996 4281465 4741158 4614138 4506982 4575782 5067508 4726693 4796289 4647192
14471 4647192 4921469 4755578 5424169 5143157 5040312 5315692 5062976 5181037 5382592
$$ packed form
14541E660396j584907p88188k84599k73885j02392j40473O4734l6834L0408l65249
14531B179011M91066m9206j37707J52366l5435M13504q86709O33853j31177q1970
14521B547596L00351M7984m9838J94083M3816K01307k23605j77311L37762k20866
14511C001279K76184j50798k56174O22276l23456k6116K9044J95608K21229l5053
14501C554023M61010o28626N58524k52763l65773K21227L46324J3493J53821l07866
14491C753394P2994R9336Q2819J96269j85747J13710j50082n0903Q32783k69402
14481D495171l84175J70469M59693j27020j07156O8800M91726l40815O9596j49097
14471D647192K74277j65891O68591k81012j02845K75380k52716J18061K01555
$$ plain form
14462 5382592 5784780 5572789 5617662 5561353 5668519 5651912 5380686 5552869 5716337 5966710
14452 5966710 6009961 5720785 6296668 6071552 6206223 6414315 6485464 6227935 6672732 6597576
14442 6597576 7124326 6774914 6686155 6891635 6939003 7022411 7258765 7276432 7541087 7591507
14432 7591507 7545573 7496731 7681564 7853366 8115557 7879077 8436975 8270045 8411753 8516563
14422 8516563 8521376 8905948 9114810 8907381 9188727 9221140 9477771 9704170 9709809 9910694
14412 9910694 9676823 10251260 10247811 10274562 10826941 10610971 11026962 11412243 11510056 11079709
14402 11079709 11455315 11662614 11724599 11833816 12101402 12779725 12558092 12504759 13419844 13396176
14392 13396176 13313064 13916051 13742210 14109476 14683756 14543471 14900173 15319077 15504258
$$ packed form
14462E382592M02188k11991M4873n6309J07166j6607k71226J72183J63468K50373
14452E966710M3251k89176N75883k25116J34671K08092P1149k57529M44797p5156
14442F597576N26750l49412q8759K05480M7368Q3408K36354J7667K64655N0420
14432G591507m5934m8842J84833J71802K62191k36480N57898j66930J41708J04810
14422H516563M813L84572K08862k07429K81346L2413K56631K26399N639K00885
14412I910694k33871N74437l449K6751N52379k15970M15991L85281R7813m30347
14402A1079709L75606K07299O1985J09217K67586O78323k21633n3333R15085k3668
14392A3396176q3112O02987j73841L67266N74280j40285L56702M18904J85181
$$ plain form
14383 15504258 15566781 16139699 16519001 16511368 16694087 17423163 17861111 17776675 18203807 18529353
14373 18529353 19069994 19114022 19579492 20280146 20362072 20586512 21329681 21450112 21914753 22360711
14363 22360711 22755234 23221820 23737328 24546365 24895229 25564295 25984843 26566759 27023734
14354 27023734 27597503 28248861 29012695 29494720 30286078 30904399 31834648 32268687 33601058
14345 33601058 34425810 35336277 36250891 36839684 37758033 39000851 40156253 40871881 41953744
14336 41953744 43542720 44601183 45796443 47299702 48721272 50048723 51408331 53351344
14328 53351344 54827806 56115541 58537550 60293685 62231656 64286816 66340485 68781094
14320 68781094 70661401 73424149 75939764 78876557 81669219 84799316 87894747 91509597
$$ packed form
14383A5504258O2523N72918L79302p633J82719P29076M37948q4436M27132L25546
14373A8529353N40641M4028M65470P00654Q1926K24440P43169J20431M64641M45958
14363B2360711L94523M66586N15508Q09037L48864O69066M20548N81916M56975
14354B7023734N73769O51358P63834M82025P91358O18321R30249M34039J332371
14345C3601058Q24752R10467R14614N88793R18349J242818J155402P15628J081863
14336D1953744J588976J058463J195260J503259J421570J327451J359608J943013
14328E3351344J476462J287735K422009J756135J937971K055160K053669K440609
14320F8781094J880307K762748K515615K936793K792662L130097L095431L614850
$$ plain form
14312 91509597 94826329 98294736 102645533 106716523 110861271 115784415 120639714 125748410
14304 125748410 131231366 136728261 143049327 149869126 156491199 163876477 171403544 179663715
14296 179663715 188244036 197152504 207066208 216881275 227722319 238836122 250856479
14289 250856479 262978234 276096519 289500948 303493932 317405959 332617363 347808428
14282 347808428 363123551 378780645 394098114 408804608 423325833 436581629 449241639
14275 449241639 460072104 469070134 475444538 478491192 478559405 476462348 473449076 464987017
14267 464987017 459826263 451575128 439695421 425823911 411309710 396295721 381450187
14260 381450187 366397727 352104674 337497936 322765996 308811300 294680442 280722304
$$ packed form
14312I1509597L316732L468407M350797M070990M144748M923144M855299N108696
14304A25748410N482956N496895O321066O819799O622073P385278P527067Q260171
14296A79663715Q580321Q908468R913704R815067J0841044J1113803J2020357
14289B50856479J2121755J3118285J3404429J3992984J3912027J5211404J5191065
14282C47808428J5315123J5657094J5317469J4706494J4521225J3255796J2660010
14275D49241639J0830465Q998030O374404L046654O8213k097057l013272q462059
14267D64987017n160754q251135j1879707j3871510j4514201j5013989j4845534
14260C81450187j5052460j4293053j4606738j4731940j3954696j4130858j3958138
$$ plain form
14253 280722304 266377802 252968353 240102568 227616077 215944682 205192252 194379919
14246 194379919 184618256 176016582 167404760 159469960 151889969 144507354 137870993 131895668
14238 131895668 126059420 120746676 115445491 110333280 105601560 101422692 96895828 93549166
14230 93549166 89674723 86087645 82741677 79537234 76631233 73950322 70479153 68731118
14222 68731118 66231605 63775255 61810568 59983464 57664169 55804290 54185824 52107965
14214 52107965 51053124 49535082 48232451 46302406 45076447 43652948 42545119 42189358
14206 42189358 40969059 39033185 38127528 37008992 36081651 35305342 34604663 33795169 32656024
14197 32656024 31655656 31113879 30028874 29616267 28790555 28123947 27179356 26407007 25850234
$$ packed form
14253B80722304j4344502j3409449j2865785j2486491j1671395j0752430j0812333
14246A94379919r761663q601674q611822p934800p579991p382615o636361n975325
14238A31895668n836248n312744n301185n112211m731720m178868m526864l346662
14230I3549166l874443l587078l345968l204443k906001k680911l471169j748035
14222F8731118k499513k456350j964687j827104k319295j859879j618466k077859
14214E2107965j054841j518042j302631j930045j225959j423499j107829l55761
14206D2189358j220299j935874r05657j118536r27341p76309p00679q09494j139145
14197C2656024j000368n41777j085005m12607q25712o66608r44591p72349n56773
$$ plain form
14188 25850234 25354920 24951368 24244360 23703284 22995710 22876853 22042789 21480134 20818610
14179 20818610 20651672 20146949 19871684 19535437 19048088 18633785 18249270 17806694 17755837
14170 17755837 17182210 16856102 16650990 16691936 15882208 15842668 15630300 15453174 15019930 14287754
14160 14287754 14422181 14034142 14277099 13525906 13485578 13077833 13053773 12756232 12823405 12231933
14150 12231933 11911106 11965058 11737873 11600506 11463785 11170605 11048250 11122405 10673564 10651857
14140 10651857 10666158 10153363 9907522 10285251 10001525 9743068 9632767 9552874 9175362 9277440
14130 9277440 9349796 8923607 8849481 8654995 8531677 8367502 8351288 8285358 7957581 8258738
14120 8258738 8054190 7834351 7721409 7696262 7557765 7432515 7243044 7482479 7242014 7125437
$$ packed form
14188B5850234m95314m03552p07008n41076p07574j18857q34064n62655o61524
14179B0818610j66938n04723k75265l36247m87349m14303l84515m42576n0857
14170A7755837n73627l26108k05112M0946q09728l9540k12368j77126m33244p32176
14160A4287754J34427l88039K42957p51193m0328m07745k4060k97541O7173n91472
14150A2231933l20827N3952k27185j37367j36721k93180j22355P4155m48841k1707
14140A0651857J4301n12795k45841L77729k83726k58457j10301p9893l77512J02078
14130I277440P2356m26189p4126j94486j23318j64175j6214o5930l27777L01157
14120H258738k04548k19839j12942k5147j38497j25250j89471K39435k40465j16577
$$ plain form
14110 7125437 7098112 6746301 7161643 6703791 6813204 6687024 6757301 6128829 6255508 6264719
14100 6264719 6084481 5998681 6011203 5940069 6117520 5895787 5877160 5848456 5684199 5350612
14090 5350612 5806804 5698069 5538275 5230119 5507786 5200467 5052447 4944654 5132984
14081 5132984 4926015 4733518 4714764 4806258 4931622 4727071 4718892 4468191 4757057 4100847
14071 4100847 4090866 4152385 4332417 4455178 4285768 4045035 4008227 4307172 4102201 3934108
14061 3934108 4140004 4207995 4083505 4089089 3902896 3971126 3705605 4036124 3708428 3728815
14051 3728815 3718913 3918733 3452236 3248709 3485253 3282304 3219885 3607149 3195621 3553275
14041 3553275 2896143 3597074 3178833 3127979 3527508 3295740 3352370 3208995 3201778 2809919
$$ packed form
14110G125437k7325l51811M15342m57852J09413j26180P0277o28472J26679R211
14100F264719j80238q5800J2522p1134J77451k21733j8627k8704j64257l33587
14090E350612M56192j08735j59794l08156K77667l07319j48020j07793J88330
14081E132984k06969j92497j8754R1494J25364k04551q179k50701K88866o56210
14071D100847r981O1519J80032J22761j69410k40733l6808K98945k04971j68093
14061C934108K05896O7991j24490N584j86193O8230k65521L30519l27696K0387
14051C728815r902J99820m66497k03527K36544k02949o2419L87264m11528L57654
14041C553275o57132P00931m18241n0854L99529k31768N6630j43375p217l91859
$$ plain form
14031 2809919 3307458 3102891 3014867 3143956 2902281 3165210 3078131 2771766 2994998 2663488
14021 2663488 2905885 2877276 2606555 2622395 2919986 2554728 2633782 2404248 2656466 2828537
14011 2828537 2498890 2501152 2265477 2151515 2617038 2195775 2296452 2578780 2320198 2296214
14001 2296214 2073490 2426441 2391316 2466746 2228991 2262959 2300641 2540777 2149791 2428059
13991 2428059 2753013 3058074 3903669 6232678 12163825 29005370 42500779 27383296
13983 27383296 14811712 8929057 6297270 5301317 4521962 4056150 3778633 3316682 3652213
13974 3652213 2877991 3086925 2680596 2811855 2608182 2305651 2202200 2178567 2572082 2382352
13964 2382352 2351742 2463253 2200556 2047273 2025073 2158696 2141426 2266765 2217831 2031332
$$ packed form
14031B809919M97539k04567q8024J29089k41675K62929q7079l06365K23232l31510
14021B663488K42397k8609k70721J5840K97591l65258P9054k29534K52218J72071
14011B828537l29647K262k35675j13962M65523m21263J00677K82328k58582k3984
14001B296214k22724L52951l5125P5430k37755L3968L7682K40136l90986K78268
13991B428059L24954L05061Q45595K329009N931147J6841545J3495409j5117483
13983B7383296j2571584n882655k631787r95953p79355m65812k77517m61951L35531
13974C652213p74222K08934m06329J31259k03673l02531j03451k3633L93515j89730
13964B382352l0610J11511k62697j53283k2200J33623j7270J25339m8934j86499
$$ plain form
13954 2031332 2119822 2091980 1894546 1839332 1988901 1942737 2149591 1745896 1987178 2158292
13944 2158292 2098487 1977895 2100156 1648748 1921395 1912180 1719045 2027510 1510636 1642775
13934 1642775 1932286 1625443 1793629 1698873 1637167 1756555 1597043 1452859 1488366 1691320
13924 1691320 1619283 1851952 1543006 1683314 1729645 1754424 1789794 1747934 1707858 1393445
13914 1393445 1762660 1460420 1340898 1534230 1322624 1968258 1458903 1373765 1994872 1443160
13904 1443160 963159 1258452 1179702 1193567 1691450 1463361 1185442 1317182 1410764 1445691
13894 1445691 1230686 1716545 1303777 1049800 1213537 1225622 1144853 1045204 1204581 1308031
13884 1308031 1577699 1078843 1280734 1459215 1062377 1275170 1366948 871527 1081381 1187358
$$ packed form
13954B031332Q8490k7842j97434n5214J49569m6164K06854m03695K41282J71114
13944B158292n9805j20592J22261m51408K72647r215j93135L08465n16874J32139
13934A642775K89511l06843J68186r4756o1706J19388j59512j44184L5507K02954
13924A691320p2037K32669l08946J40308M6331K4779L5370m1860m0076l14413
13914A393445L69215l02240j19522J93332k11606O45634n09355q5138O21107n51712
13904A443160m80001K95293p8750J3865M97883k28089k77919J31740R3582L4927
13894A445691k15005M85859m12768k53977J63737J2085q0769r9649J59377J03450
13884A308031K69668m98856K01891J78481l96838K12793R1778m95421K09854J05977
$$ plain form
13874 1187358 1283924 1194925 1470193 1528871 1042923 956500 1180834 1015390 1136361 895286
13864 895286 1270748 1143547 1064197 1048093 1186500 1050978 1038016 1097935 1085150 899950
13854 899950 772424 1098855 1109779 1424086 803841 807933 990387 926255 1053498 1013079
13844 1013079 1070241 917978 1027021 1351401 1222339 1092023 963405 943835 1018326 759793
13834 759793 729140 1105329 576790 855961 1065484 739890 1316979 994097 1006313 942923
13824 942923 819691 1106313 871388 1078163 936668 956858 813357 975185 1295666 877115
13814 877115 951222 961663 1003991 770670 591079 990129 961843 946160 804827 643562
13804 643562 1184315 970011 1014028 1012388 826789 894492 688683 968200 650907 654103 807367
$$ packed form
13874A187358R6566q8999K75268N8678m85948q6423K24334j65444J20971k41075
13864H95286L75462j27201p9350j6104J38407j35522j2962N9919j2785j85200
13854H99950j27526L26431J0924L14307o20245M092J82454o4132J27243m0419
13844A013079N7162j52263J09043L24380j29062j30316j28618j9570P4491k58533
13834G59793l0653L76189n28539K79171K09523l25594N77089l22882J2216o3390
13824I42923j23232K86622k34925K06775j41495K0190j43501J61828L20481m18551
13814H77115P4107J0441M2328k33321j79591L99050k8286j5683j41333j61265
13804F43562N40753k14304M4017j640j85599O7703k05809K79517l17293L196J53264
$$ plain form
13793 807367 937330 760569 810369 724562 658157 577644 834784 449242 988232 863967
13783 863967 667023 733286 951361 479656 404935 617735 831905 800415 691062 851032
13773 851032 717812 672124 544669 781979 530328 721140 223325 773706 533306 889231
13763 889231 493099 674110 732964 380374 755350 903955 990607 570274 703899 668051
13753 668051 692516 537902 746741 370426 749771 512033 462035 655461 381957 720354
13743 720354 422094 396516 502956 514885 468821 759223 581723 736355 645666 587191
13733 587191 619251 474629 640454 494816 940125 426514 737572 246501 691428 674590
13723 674590 222827 590653 710971 814757 658395 366313 529912 592261 229019 804381
$$ packed form
13793H07367J29963j76761M9800q5807o6405q0513K57140l85542N38990j24265
13783H63967j96944O6263K18075m71705p4721K12800K14170l1490j09353J59970
13773H51032j33220m5688j27455K37310k51651J90812B23325N50381k40400L55925
13763H89231l96132J81011N8854l52590L74976J48605Q6652m20333J33625l5848
13753F68051K4465j54614K08839C70426L79345k37738m9998J93426k73504L38397
13743G20354k98260k5578J06440J1929m6064K90402j77500J54632r0689n8475
13733E87191L2060j44622J65825j45638M45309D26514L11058B46501M44927j6838
13723F74590B22827L67826J20318J03786j56362k92082J63599O2349B29019N75362
$$ plain form
13713 804381 741415 774527 552250 205456 271845 318816 1017982 366381 756416 521605
13703 521605 705678 553287 389430 576326 512082 636073 656430 627561 341640 347599
13693 347599 262442 664439 318096 354127 586452 599178 379518 432950 578062 715750
13683 715750 345005 718072 731832 794548 648774 456215 444157 663144 543610 418110
13673 418110 891903 531377 552740 242502 528718 436462 468407 217423 432703 515037
13663 515037 677192 461477 419641 499680 334562 440878 721064 328380 294124 354124
13653 354124 454698 581796 530110 290706 217489 385969 -79962 501896 521741 385967
13643 385967 487117 218415 401280 312133 386768 580578 353994 269345 516302 789533
$$ packed form
13713H04381o2966L3112k22277B05456O6389M6971O99166C66381L90035k34811
13703E21605J84073j52391j63857J86896o4244J23991K0357k8869k85921N959
13693C47599q5157M01997C18096L6031K32325J2726k19660N3432J45112J37688
13683G15750C45005L73067J3760O2716j45774j92559j2058K18987j19534j25500
13673D18110M73793l60526K1363B42502K86216r2256L1945B17423K15280Q2334
13663E15037J62155k15715m1836Q0039j65118J06316K80186C28380l4256O0000
13653C54124J00574J27098n1686k39404p3217J68480g9962E01896J9845j35774
13643C85967J01150B18415J82865q9147P4635J93810k26584q4649K46957K73231
$$ plain form
13633 789533 285544 448170 245129 87435 486496 637971 274007 238996 120429 313689
13623 313689 152012 123557 459135 462901 486220 268712 392095 373367 415754 251190 417268
13612 417268 621103 304862 317514 389864 273014 739251 259465 336842 335920 185273 427841
13601 427841 200613 200926 501605 411617 390614 254248 181879 133875 362136 473845 424192
13590 424192 640390 691820 538647 549369 361885 388872 -108826 156744 162662 323298
13580 323298 420840 279700 582155 649335 314618 -54631 498731 474632 434764 433359 -38280
13568 360398 396714 184378 460086 547642 176100 610529 550683 540004 518066 417570
13558 417570 263347 533322 465878 155292 55538 301011 242802 316009 371611 108827
$$ packed form
13633G89533B85544J62626k03041H7435L99061J51475B74007l5011j18567J93260
13623C13689A52012k8455L35578L766K3319k17508J23383j8728M2387j64564J66078
13612D17268K03835C04862J2652P2350j16850M66237B59465P7377r22j50647K42568
13601D27841B00613L13L00679q9988k1003j36366p2369m8004K28261J11709m9653
13590D24192K16198N1430j53173J0722j87484K6987a08826A56744N918J60636
13580C23298R7542j41140L02455O7180C14618e4631D98731k4099l9868j405c8280
13568C60398L6316A84378K75708Q7556A76100M34429n9846j0679k1938j00496
13558D17570j54223K69975o7444A55292E5538K45473n8209P3207N5602A08827
$$ plain form
13547 53581 298721 231511 156692 333754 101090 729099 294802 362824 169112 250489
13537 250489 350493 210109 271481 239725 249739 541364 289678 320905 211865 657195
13527 657195 456655 330139 71318 229864 232313 352108 226316 57100 159372 53317
13516 377786 264513 70052 367976 214934 427760 33657 422792 251845 199168 212515
13506 212515 70716 597952 720550 194349 298115 408832 150445 210253 430128 47578
13495 -79252 348661 348352 181829 540642 33267 268594 233468 111415 30579 132872 76921
13484 76921 590473 367824 71158 38711 306343 512217 322318 423967 131095 -65552
13473 160757 135536 241660 212334 96301 -127148 410285 76925 -184760 292154 224449
$$ packed form
13547E3581K45140o7210p4819J77062A01090O28009B94802O8022A69112Q1377
13537B50489J00004j40384O1372l1756J0014K91625k51686L1227j09040M45330
13527F57195k00540j26516G1318J58546K449J19795j25792E7100J02272E3317
13516C77786j13273G0052K97924j53042K12826C3657L89135j70947n2677J3347
13506B12515G0716N27236J22598A94349J03766J10717A50445N9808K19875D7578
13495g9252C48661l09j66523L58813C3267K35327l5126A11415C0579J02293n5951
13484G6921N13552k22649G1158l2447K67632K05874j89899J01649A31095f5552
13473A60757k5221J06124k9326I6301a27148D10285G6925a84760B92154o7705
$$ plain form
13463 224449 269846 -62340 366420 333981 248713 100276 388434 172238 161430 84210 275405
13452 275405 235493 155376 102044 91407 147989 218587 261636 418074 155245 186985 19538
13440 112476 310550 91112 153817 166605 205550 255785 192643 163090 302588 121452 123861
13429 123861 207773 197347 165628 567031 155799 247235 397537 450176 350803 385385 202772
13418 202772 502395 203662 395880 32389 169087 16289 133204 205183 68263 -156691
13407 640714 273662 220250 531997 358858 56996 -22386 -120671 35495 190546 102739 157088
13396 157088 178922 -18145 51086 -5542 63485 189454 293549 288763 -32866 46604 -16556
13384 109237 262013 -138533 237264 -26470 270793 -14160 -106691 431223 152723 365279
$$ packed form
13463B24449M5397f2340C66420l2439q5268A00276K88158A72238j0808p7220J91195
13452B75405l9912q0117n3332j0637N6582P0598M3049J56438A55245L1740A9538
13440A12476J98074I1112O2705J2788L8945N0235o3142k9553J39498A21452K409
13429A23861Q3912j0426l1719M01403A55799R1436J50302N2639r9373L4582j82613
13418B02772K99623B03662J92218C2389J36698A6289J16915P1979F8263a56691
13407F40714B73662n3412L11747j73139E6996b2386r8285C5495J55051q7807N4349
13396A57088K1834a8145E1086e542F3485J25969J04095m786c2866D6604a6556
13384A09237J52776a38533B37264b6470B70793a4160r2531D31223A52723K12556
$$ plain form
13374 365279 146312 240715 164300 335699 51782 -3549 -274997 213372 443416 115883
13363 357593 434610 285254 71732 439323 -22425 262088 361507 -34231 536429 63088 87088
13352 87088 308072 448422 -29752 95357 78239 155404 338860 -21812 -142799 505046 248794
13340 330388 611956 292722 613167 291297 240121 215269 -4339 349001 351406 119670 466302
13329 466302 78292 101853 134098 226540 173177 22262 217892 -154084 80080 -46667 121450
13317 188447 88185 144589 391458 -10131 246497 313563 272025 162471 103672 -92739 268890
13305 76147 -79702 140280 106161 247943 -46759 80206 153517 98112 19990 265480 -322151
13293 -109539 238183 469253 45541 -7638 468771 138693 325441 145206 -105677 100954
$$ packed form
13374C65279A46312R4403p6415J71399E1782c549k71448B13372K30044A15883
13363C57593P7017j49356G1732L67591b2425B62088R9419c4231E36429F3088K4000
13352H7088K20984J40350b9752I5357j7118P7165J83456b1812j20987E05046B48794
13340C30388K81568B92722L20445B91297n1176k4852d339C49001K405A19670L46632
13329D66302G8292K3561L2245R2442n3363B2262J95630a54084H0080d6667A21450
13317A88447H8185N6404K46869a0131B46497O7066m1538j09554n8799i2739B68890
13305G6147g9702A40280l4119J41782d6759H0206P3311n5405A9990K45490c22151
13293a09539B38183K31070D5541g638D68771A38693J86748A45206a05677A00954
$$ plain form
13282 133220 208832 392728 230741 -6797 84335 426496 -156720 160192 165257 127158 129826
13271 129826 341592 387832 -70800 263990 -21508 104402 -49630 259001 68438 284032
13261 284032 97813 80922 243052 71756 -88604 120992 -46896 -20441 155755 211671 -7459
13249 -42886 -44813 212881 399787 -135411 -28383 144667 -33786 -50631 -53838 8651 -38204
13237 165358 204959 479281 243312 256209 -41473 292889 43938 128516 157050 216266 56279
13225 -33468 -14090 -53123 -167289 258524 118747 72548 170586 -105669 -78283 38319 185376
13214 185376 -95546 64971 239457 -59889 -216945 -7318 206764 464252 -62992 175509 -99481
13202 297597 43775 148611 128204 -11091 383014 207117 259934 -13076 -53408 269398 104218
$$ packed form
13282A33220P5612J83896j61987f797H4335L42161a56720A60192N065l8099K668
13271A29826K11766M6240g0800B63990b1508A04402d9630B59001F8438K15594
13261B84032I7813j6891J62130G1756h8604A20992d6896b0441A55755N5916g459
13249d2886j927B12881J86906a35411b8383A44667c3786j6845l207H651c8204
13237A65358L9601K74322k35969J2897d1473B92889D3938Q4578K8534N9216E6279
13225c3468a4090l9033j14166B58524A18747m6199R8038a05669K7386C8319J47057
13214A85376i5546F4971J74486e9889j57056g318B06764K57488f2992A75509i9481
13202B97597D3775J04836k0407a1091C83014j75897N2817a3076m0332B69398A04218
$$ plain form
13190 -266568 412165 -267829 34941 594952 33558 150351 38925 228886 136538 -31094
13179 -40390 226601 -174474 87923 -76819 260457 147552 -6542 329827 8625 431313 276769
13168 276769 331484 221629 279009 22542 246027 -19337 409710 127983 84416 -87522 245759
13156 178392 -61828 167390 105846 -82012 140495 105450 58105 -124017 157413 -168403
13145 -12405 -148467 333437 218590 -6577 262013 212531 -68750 -77992 50300 51093 -106156
13133 408695 -137415 249463 230737 12097 442573 95848 -94458 187466 179999 116905 325489
13122 325489 -63745 215142 -332542 198705 196528 148419 18787 491486 -135993 485441
13111 93458 -347628 -220397 -16781 95215 -234666 216205 -170240 49289 139107 100893 5530
$$ packed form
13190b66568D12165b67829C4941N60011C3558J16793C8925J89961r2348c1094
13179d0390B26601a74474H7923g6819B60457j12905f542C29827H625M22688j54544
13168B76769N4715j09855N7380B2542K23485a9337D09710A27983m3567h7522B45759
13156A78392f1828A67390o1544h2012A40495l5045m7345a24017A57413a68403
13145a2405j36062C33437j14847f577B62013m9482f8750r242E0300P93a06156
13133D08695a37415B49463j8726A2097M30476I5848i4458A87466p467o3094K08584
13122C25489f3745B15142c32542A98705k177m8109A8787M72699a35993D85441
13111I3458c47628J27231a6781I5215b34666B16205a70240D9289Q9818l8214E530
$$ plain form
13099 65684 -185420 300842 69352 277290 -51099 254498 42564 -50507 -17090 199706 136762
13088 136762 82765 396293 -411830 313601 -3303 85693 -244740 -174164 4044 -269204 108559
13076 38462 -12970 -75712 251050 -268985 26520 -198965 341106 298948 -28457 54729 212176
13065 212176 243615 -135031 83532 161895 -26897 -172813 194120 -349048 163001 295267
13055 295267 450409 35695 -213991 -64817 325282 85509 321210 87694 -154077 316827
13044 156013 92928 313868 204992 346934 -52308 -25760 295231 -9755 279755 -64800 -34950
13033 -34950 186501 210748 154066 106622 87652 294350 228624 176442 107233 268000 -225972
13021 113474 -129200 227854 -77614 16301 56367 -254070 356009 130241 -159145 -114918
$$ packed form
13099F5684a85420C00842F9352K07938e1099B54498D2564e0507a7090A99706o2944
13088A36762n3997L13528d11830C13601c303H5693b44740P0576D044b69204A08559
13076C8462a2970o2742B51050b68985B6520a98965C41106m2158b8457E4729J57447
13065B12176L1439a35031H3532P8363b6897j45916A94120c49048A63001J32266
13055B95267J55142C5695b13991f4817C25282H5509K35701H7694a54077C16827
13044A56013o3085K20940j08876J41942e2308b5760B95231i755B79755f4800K9850
13033c4950A86501K4247n6682m7444j8970K06698o5726n2182o9209J60767b25972
13021A13474a29200B27854g7614A6301M0066b54070C56009A30241a59145M4227
$$ plain form
13011 -114918 88103 205314 94997 203778 -77063 -94547 389113 -1369 141793 -104218 11543
12999 101311 278439 -168851 -154739 325453 -289940 4300 19613 128795 -74409 189741
12988 67308 257203 -189200 -126370 -188610 257864 268404 -274272 -25469 163846 -20060 101730
12976 -87622 221374 243828 -159160 178288 -92235 -29708 -173653 91054 -82537 60705 -38039
12964 -249964 -125427 -20927 -72080 17027 -55224 146949 -49120 -6432 -353070 -7174 295165
12952 247270 -157562 9586 -660 179580 191367 -40667 -35626 -285279 -27902 322947 278894
12941 278894 -48659 -4499 280826 -304564 179758 -58277 219760 -100757 69380 -61593 -218671
12930 -218671 167371 258944 64669 -113610 -29523 247798 167557 394194 7197 36735 -101184
$$ packed form
13011a14918H8103J17211I4997J08781g7063j7484C89113a369A41793a04218A1543
12999A01311J77128a68851J4112C25453b89940D300J5313J09182g4409A89741
12988F7308J89895a89200O2830o2240B57864J0540b74272b5469A63846b0060A01730
12976h7622B21374K2454a59160A78288i2235b9708j43945I1054h2537F0705c8039
12964b49964J24537b0927n1153A7027e5224A46949d9120f432l46638g174B95165
12952B47270a57562I586f60A79580J1787d0667N041k49653b7902C22947m4053
12941B78894d8659d499B80826c04564A79758e8277B19760a00757F9380f1593j57078
12930b18671A67371R1573F4669a13610b9523B47798q0241K26637G197K9538a01184
$$ plain form
12918 27164 -125998 -119437 45739 117879 154822 -151123 -223606 159390 318224 250385 -129995
12906 -34400 -35604 198248 -44091 -107532 61023 -184822 177912 127960 48102 104100 51944
12894 11346 118757 523508 87216 -20584 164523 -166089 151688 -22867 -439485 -52106
12883 -128164 212366 11728 70630 -378222 178847 265120 -211490 -77346 23591 71859 110093
12872 110093 58851 85389 67872 18398 -190239 61377 -96702 22911 55354 20412 29977
12861 29977 97776 -219023 -65544 -305471 186428 -188173 170417 -119583 -90898 10567
12850 407308 -105345 24000 412861 228841 -229597 -74650 -111427 148548 58549 36080
12840 36080 -81887 56383 -122910 -54366 -394240 -186011 269162 -350711 -16163 173870
$$ packed form
12918B7164a25998O561D5739P2140L6943a51123p2483A59390J58834o7839a29995
12906c4400j204A98248d4091o3441F1023a84822A77912m9952D8102N5998E1944
12894A1346J07411M04751H7216b0584A64523a66089A51688b2867m16618e2106
12883a28164B12366A1728N8902c78222A78847Q6273b11490g7346B3591M8268L8234
12872A10093n1242K6538j7517A8398a90239F1377i6702B2911L2443B0412R565
12861B9977O7799b19023f5544k39927A86428a88173A70417a19583K8685A0567
12850D07308a05345B4000L88861j84020b29597g4650l6777A48548E8549k2469
12840C6080h1887E6383a22910e4366l39874a86011B69162c50711a6163A73870
$$ plain form
12829 83356 37899 288413 -47865 11503 -165704 -1045 194971 -197265 127438 -191178 4923
12817 -46037 -237367 137562 -60109 66147 -76559 -424571 74817 107733 42437 241593 -214259
12805 -336385 13732 97453 405 128958 103168 400822 -110570 -283744 162065 83818 66122
12794 66122 14343 108435 226299 -83475 125447 151382 -144171 152252 -9692 92544 158796
12783 158796 -92283 406222 252178 -183573 371850 249883 95756 151697 153172 422890
12773 422890 -193048 22898 91609 126012 56668 -298085 -62528 -107889 -14864 34331 -149253
12761 530533 209005 17220 152296 -280435 -98264 35316 -17027 -77103 -187761 -67614 -81074
12750 -81074 -152719 18183 -31547 167201 270563 -99003 202983 -257060 -72426 -4831 180374
$$ packed form
12829H3356C7899K50514d7865A1503a65704a045A94971a97265A27438a91178D923
12817d6037j91330A37562f0109F6147g6559l48012G4817L2916D2437J99156b14259
12805c36385A3732Q3721D05J28553k5790K97654a10570j73174A62065p8247j7696
12794F6122A4343R4092J17864h3475A25447K5935a44171A52252i692I2544O6252
12783A58796i2283D06222j54044a83573C71850j21967I5756N5941J475K69718
12773D22890a93048B2898O8711L4403E6668b98085f2528m5361a4864C4331a49253
12761E30533B09005A7220J35076b80435i8264C5316a7027o0076j10658f7614j3460
12750h1074p1645A8183c1547A67201J03362i9003B02983b57060g2426d831A80374
$$ plain form
12738 306655 -24498 103698 -47427 120755 43987 318517 259708 122062 -186339 109093
12727 78278 109648 -36367 -85794 76962 364192 -98124 -85982 -107196 183385 -59320 94019
12715 -120872 84166 -6388 -159762 229793 45852 277419 396342 269620 615305 -13448
12704 298514 104301 43535 282070 19600 -10218 3052 -74051 -75940 -78477 -219262 240253
12692 -89735 -138104 329393 -120143 218740 154119 63175 29773 304410 215815 6819 56013
12681 56013 369039 -14726 46843 97345 144001 188439 192759 118704 4551 93812 -31864 38229
12668 -4957 139249 -82928 112891 -133125 105084 245542 39679 98142 62688 -174728 -97826
12657 -97826 306578 346570 174013 217696 64473 130019 380956 63451 -193434 13946 -122041
$$ packed form
12738C06655b4498A03698d7427A20755D3987K74530n8809A22062a86339A09093
12727G8278L1370c6367m9427G6962K87230i8124J2142k1214A83385e9320I4019
12715a20872H4166f388j53374B29793D5852K31567J18923j26722L45685a3448
12704B98514A04301D3535K38535A9600a0218C052g4051j889k537j40785B40253
12692h9735m8369C29393a20143B18740o4621F3175B9773K74637q8595F819M9194
12681E6013L13026a4726D6843N0502M6656M4438M320p4055D551Q9261c1864C8229
12668d957A39249h2928A12891a33125A05084J40458C9679N8463l5454a74728P6902
12657i7826C06578L9992j72557M3683F4473O5546K50937F3451a93434A3946a22041
$$ plain form
12645 263948 245627 17279 -216034 28886 3094 -285438 108383 13242 -308820 45986 -110219
12633 252181 23679 -162559 264689 503414 95674 225729 302067 89748 212408 39235
12622 89588 177265 329726 -94307 114134 83535 -59953 -24105 22681 287567 44409 221634
12611 221634 -236904 79402 156349 -170797 194084 139836 -766 -6012 166439 -9887 195539
12599 160622 301126 -216585 21566 -229701 137000 240391 180848 49335 238005 -66137
12588 -7028 42124 -113866 -271998 -204336 4232 14987 -44672 124716 123282 -109412 -95789
12577 -95789 99046 17556 -208776 -141615 -299231 -161008 302448 -176594 196666 48396
12566 55608 -78581 -41844 -46718 -45133 -167518 249678 -76476 -125847 216311 40449 183915
$$ packed form
12645B63948j8321A7279b16034B8886C094b85438A08383A3242c08820D5986a10219
12633B52181B3679a62559B64689K38725I5674J30055P6338H9748J22660C9235
12622H9588Q7677J52461i4307A14134l0599e9953b4105B2681K64886D4409J77225
12611B21634b36904G9402P6947a70797A94084n4248g66n246A66439i887A95539
12599A60622J40504b16585B1566b29701A37000J03391n9543D9335J88670f6137
12588g028D2124a13866j58132O7662D232J0755d4672A24716j434a09412J3623
12577i5789I9046A7556b08776O7161j57616J38223C02448a76594A96666D8396
12566E5608g8581L6737m874J585j22385B49678g6476m9371B16311D0449J43466
$$ plain form
12555 183915 5951 194237 233225 -134767 -115512 -19432 -78731 -114175 -38385 29218 130655
12544 130655 -269409 -217890 -12958 246203 267574 -40134 202663 -152954 25707 260124
12534 260124 249796 -279750 61064 307952 -98828 212487 -43887 -219207 183361 -314769
12523 -34052 -101597 -50103 -266616 -90096 -437536 27599 -24890 -150170 -191060 171716 -209256
12511 -4422 81988 34799 -29509 165704 -80354 61397 1478 294435 144207 -251670 -113808
12499 343247 90776 -166060 52493 -132855 18055 110193 56453 -58888 291130 -328365 168908
12487 -145421 -257957 55403 -134474 -30560 23591 -111102 203355 137953 -602224 38311
12476 -16640 -14121 9559 -74602 91304 24719 59341 -173355 -61935 -166304 -80854 58212 -183345
$$ packed form
12555A83915E951J88286L8988a34767J9255a9432n9299l5444c8385B9218J01437
12544A30655b69409N1519a2958B46203K1371d0134B02663a52954B5707K34417
12534B60124j0328b79750F1064K46888i8828B12487d3887j75320A83361c14769
12523c4052o7545e0103k16513i0096l47440B7599b4890j25280m0890A71716b09256
12511d422H1988C4799b9509A65704h0354F1397A478K92957A44207b51670a13808
12499C43247I0776a66060E2493a32855A8055R2138n3740e8888B91130c28365A68908
12487a45421j12536E5403a34474c0560B3591a11102B03355o5402f02224C8311
12476a6640K519I559g4602I1304B4719L4622a73355f1935j04369h0854E8212a83345
$$ plain form
12463 228317 243368 243981 -92150 204836 -41690 82687 -52943 71518 347 -104588 141039 -334596
12450 -50881 -179502 -103476 -164304 41326 -54522 160614 -37124 -103074 -174043 -98968 96450
12438 236253 105373 91630 164284 -107344 -67127 -166729 120247 347527 -124083 26816
12427 141842 5797 162323 90049 186234 -37031 -172006 63588 -27252 -187370 146642 165607
12416 165607 111495 156946 -25803 -69206 194407 -80519 -193518 111965 -12422 93747 163294
12405 163294 100475 -317600 187643 -105675 -8382 -379938 -6351 -82554 -406674 29255 72564
12394 72564 159452 -32456 61227 52766 -9889 63527 -4114 -575448 -241116 -23227 58660 300371
12382 300371 378358 -223906 -188143 -15451 -235873 165772 -163506 6494 22360 -139557 -144733
$$ packed form
12463B28317J5051O13i2150B04836d1690H2687e2943G1518C47a04588A41039c34596
12450e0881j28621P6026o0828D1326e4522A60614c7124o5950p0969P5075I6450
12438B36253A05373j3743P2654a07344M0217r9602A20247K27280a24083B6816
12427A41842E797J56526p2274R6185c7031j34975F3588b7252j60118A46642J8965
12416A65607n4112M5451b5803m3403A94407h0519j12999A11965a2422I3747O9547
12405A63294o2819c17600A87643a05675h382l71556f351p6203l24120B9255M3309
12394G2564Q6888c2456F1227q461i889F3527d114n71334b41116b3227E8660K41711
12382C00371P7987b23906L5763a5451k20422A65772a63506F494J5866a39557n176
$$ plain form
12371 -144733 -213517 -222320 18207 121802 -84854 -192613 205844 -19835 174116 -183641 -160860
12360 -160860 29817 -165275 -190223 -242400 -189341 -144287 -35698 -227826 -1773 37259 57553
12349 57553 5695 -220427 -31628 -145037 -146423 287674 50421 -137396 -138162 -553417 75173
12337 84883 -124179 -231693 -224051 172754 -374464 -103898 -238332 183126 229003 -28836
12326 -124697 -345888 223181 -218965 306990 285934 215819 215387 -6434 134692 -121478 -100070
12315 -100070 88738 98770 -91691 -78024 -75144 -28116 -108428 215955 17242 10616 32980 -106723
12302 4094 1799 88244 -270884 135951 186713 -202462 145187 -9882 191857 -130179 112025
12290 -292298 -68312 -93296 -344539 73192 -96595 -191751 -55958 -57948 -62557 91026 -309615
$$ packed form
12371a44733o8784q803A8207J03595h4854j07759B05844a9835A74116a83641K2781
12360a60860B9817a65275k4948n2177N3059M5054c5698j92128a773C7259K0294
12349E7553E695b20427c1628j13409j386B87674E0421a37396p66m15255G5173
12337H4883a24179j07514P642A72754c74464a03898j34434A83126M5877b8836
12326a24697k21191B23181b18965C06990k1056p0115m32f434A34692a21478K1408
12315a00070H8738J0032i1691J3667K880b8116q0312B15955A7242o626K2364a06723
12302D094A799Q6445b70884A35951N0762b02462A45187i882A91857a30179A12025
12290b92298f8312k4984k51243G3192i6595r5156e5958j990m609I1026c09615
$$ plain form
12278 298902 -53183 -213073 152951 297476 -226832 53426 22870 138198 189246 22767
12267 35493 -30742 243915 44118 536407 -125349 -354958 22153 22496 146260 -38400 280857
12255 -257237 -160349 311665 -90968 -1596 257423 98494 -62022 44338 240054 65074 234329
12244 234329 162070 -181907 89904 329669 72604 286382 423663 148370 -299227 159980
12233 -116912 89638 103564 19138 -51941 -400539 158057 -152004 221052 306454 337813 182721
12222 182721 1537 -55993 124924 71964 307392 269914 227335 253749 -80863 -102533 -7733
12210 4630 396289 -149217 166943 298387 101192 188303 78570 176931 219548 18171 -184760
12198 162821 239443 178549 201243 79362 455606 301327 282567 211067 234033 -139672 -62820
$$ packed form
12278B98902e3183j59890A52951J44525b26832E3426B2870J15328N1048B2767
12267C5493c0742B43915D4118M92289a25349k29609B2153L43J23764c8400B80857
12255b57237R6888C11665i0968a596B57423I8494f2022D4338J95716F5074J69255
12244B34329p2259a81907H9904K39765G2604K13778J37281A48370b99227A59980
12233a16912H9638J3926A9138e1941l48598A58057a52004B21052Q5402L1359j55092
12222A82721A537e5993A24924n2960K35428l7478m2579K6414h0863k1670g733
12210D630L91659a49217A66943J31444A01192Q7111G8570R8361M2617A8171a84760
12198A62821P6622o0894K2694G9362L76244j54279j8760p1500K2966a39672f2820
$$ plain form
12186 72619 370235 157505 90905 114025 3387 2120 413265 66589 99851 -40261 267742
12174 25414 276578 362206 -125989 273964 172672 136957 1543 187625 -89616 161018 1195
12162 22216 43772 133529 173841 390882 63976 54368 -1008 299123 99628 44033 -249076
12150 -426341 -117386 323485 -158205 110322 522534 244781 -32765 -133139 184138 168196
12140 168196 207055 49355 45554 31457 -36515 -412580 13923 5343 173413 -240839 279253
12128 22454 251766 -359188 219456 9208 202036 403163 97821 46284 26835 78861 88855
12117 88855 4274 209273 162205 85908 29997 384494 -154461 -140542 -103136 95936 8276
12105 -115532 97119 -84858 -21046 33092 34725 -280891 139593 -50896 -86643 17153 -264982
$$ packed form
12186G2619K97616A57505o6600K3120C387j267M11145F6589L3262d0261B67742
12174B5414K51164Q5628a25989B73964j01292l5715A543J86082h9616A61018A195
12162B2216K1556Q9757M0312K17041F3976r608a008B99123I9628D4033b49076
12150d26341a17386C23485a58205A10322M12212B44781c2765j00374A84138j5942
12140A68196L8859D9355l801j4097c6515l76065A3923E343J68070b40839B79253
12128B2454K29312c59188B19456I208J92828K01127I7821D6284j9449N2026R994
12117H8855D274K04999m7068p6297B9997L54497a54461J3919L7406I5936H276
12105a15532I7119h4858b1046C3092J633b80891A39593e0896l5747A7153b64982
$$ plain form
12093 182362 157492 85690 -99652 -4071 -21382 -41775 -180232 -131023 -171183 14939 -136674
12081 25600 75655 -9554 -158229 204033 184097 1448359 984215 566698 68968 45458 -443927
12069 -91186 -34182 -326446 72394 42857 183809 123993 -96306 -296070 -53019 77389 275086
12058 275086 13234 68451 280785 -195669 24370 118389 120405 -246831 114623 62463 -227284
12046 249764 25595 -264233 5609 83314 139549 190919 31480 -216626 79650 -212989 231055
12034 -495822 259075 -223870 -326954 -76494 -1065 -383920 57463 -241873 -384450 -162774
12023 -212623 183640 -147407 -69504 162424 -146852 -110398 57905 233185 -29580 30504
12012 -30300 113131 -3292 155384 26135 -245735 65246 -318633 -204975 -159795 174050 -10536
$$ packed form
12093A82362k4870p1802i9652d071j7311k0393j38457M9209m0160A4939a36674
12081B5600N0055i554j48675B04033j9936J264262m64144m17517F8968k3510d43927
12069i1186c4182k92264G2394k9537J40952n9816i6306j99764e3019G7389J97697
12058B75086A3234N5217K12334a95669B4370R4019K016b46831A14623n2160b27284
12046B49764B5595b64233E609P7705N6235N1370C1480b16626G9650b12989B31055
12034d95822B59075b23870j03084g6494a065l82855E7463b41873j42577a62774
12023b12623A83640a47407f9504A62424a46852L6454E7905J75280b9580C0504
12012c0300A13131c292A55384B6135b45735F5246c18633J13658M5180A74050a0536
$$ plain form
12000 -115107 151326 54461 27372 122976 -103517 -144495 71454 -157790 196579 173633 -165161
11988 -8737 -78675 -93797 -258750 -46145 109004 109278 137830 25030 100666 -165260 96932 25402
11975 100939 38995 4164 139927 -10162 -283335 116013 225236 -227457 -290435 56478 154686
11964 154686 -34395 -205832 329652 15510 351065 -166815 -315195 411300 -150467 -223109
11954 -223109 -241107 -64656 58479 -21810 17260 239809 21549 -79353 204290 -200953 -413926
11943 -413926 64554 -480298 93658 -86001 127314 -224704 -435527 -203563 187694 167174
11933 167174 -123759 -129180 255625 -124545 -265257 -230791 147070 -52508 190149 -174046
11922 310489 374187 10000 -3198 -93751 7707 122467 147983 65371 -77093 56854 -94740 141733
$$ packed form
12000a15107A51326E4461k7089R5604a03517m0978G1454a57790A96579k2946a65161
11988h737o9938j5122j64953d6145A09004K74K8552B5030P5636a65260I6932B5402
11975A00939C8995D164J35763a0162k73173A16013J09223b27457o2978E6478R8208
11964A54686c4395j71437C29652A5510L35555a66815j48380D11300a50467p2642
11954b23109j7998f4656E8479b1810A7260K22549B1549g9353B04290b00953k12973
11943d13926F4554d80298I3658h6001A27314b24704k10823b03563A87694k0520
11933A67174a23759n421B55625a24545j40712L4466A47070e2508A90149a74046
11922C10489O3698A0000c198r0553G707J14760K5516F5371g7093E6854i4740A41733
$$ plain form
11909 -4481 326372 112156 148984 -88508 -58824 17065 -190792 202649 -173281 97200 -188565
11897 -90234 -88625 -297091 -210356 120847 -120942 -132871 -162547 -26501 -18197 67477 -296500
11885 -330094 30114 -162834 211394 22731 133714 42717 -162796 69532 -194408 188234
11874 193586 -308879 39844 -9216 -346907 51573 115308 -188384 128121 65402 -165679 -135650
11863 -135650 -289839 452416 -53237 229946 65683 -98382 -31855 -129501 124443 -172874
11852 -33784 -91628 -209882 -87030 -104325 130481 -5821 -289880 81416 252297 37318 -99128
11840 -41178 -257755 122250 -326692 32933 80291 -111173 -156113 80714 81226 -241727 45972
11828 -234692 -61162 -220663 214382 207889 61296 -349781 49329 -319893 -43676 29913 80827
$$ packed form
11909d481C26372A12156L6828h8508K9684A7065a90792B02649a73281I7200a88565
11897i0234J609k08466Q6735A20847a20942j1929k9676b6501Q304F7477b96500
11885c30094C0114a62834B11394B2731J10983D2717a62796F9532a94408A88234
11874A93586c08879C9844i216l37691E1573O3735a88384A28121o2719a65679L0029
11863a35650j54189D52416e3237B29946F5683i8382c1855r7646A24443a72874
11852c3784n7844j18254h7030j7295A30481e821k84059H1416J70881C7318i9128
11840d1178k16577A22250c26692C2933M7358a11173m4940H0714N12b41727D5972
11828b34692f1162j59501B14382o493F1296c49781D9329c19893d3676B9913N0914
$$ plain form
11817 80827 72132 -171460 -27023 -222172 -76114 -348987 -131551 37125 261660 -22800 -275113
11806 -275113 3771 -33135 11449 27426 12403 -189989 140029 178734 -62403 -145869 -208519
11795 -208519 122535 -72069 54951 4580 4170 79934 219451 212974 -87346 -223568 121164
11783 54540 -157888 -72508 -180240 135005 4873 253489 84242 311011 -265665 -91268 -88104
11772 -88104 198520 92716 -247787 75030 -48715 -41407 -186091 325278 4046 95003 136394
11761 136394 13032 -131329 22655 -372853 -12405 -289784 -372135 250004 374859 -50720
11750 -189980 -140184 -255327 34939 -5956 379194 -394743 -68838 -113761 130608 103946 107378
11739 107378 72579 -103637 281380 -56414 -155736 50960 -155722 -720 15843 -79584 38549
$$ packed form
11817H0827q695a71460b7023j95149g6114k72873a31551C7125K24535b2800k52313
11806b75113C771c3135A1449J5977A2403a89989A40029L8705f2403q3466o2650
11795b08519A22535g2069E4951D580m10P5764J39517o477h7346j36222A21164
11783E4540a57888g2508j07732A35005D873K48616H4242K26769b65665i1268L164
11772h8104A98520I2716b47787G5030d8715P308j44684C25278D046R0957M1391
11761A36394A3032a31329B2655c72853a2405k77379q2351B50004J24855e0720
11750a89980M9796j15143C4939e956C79194c94743f8838m4923A30608k6662L432
11739A07378l4799a03637B81380e6414r9322E0960a55722g20A5843g9584C8549
$$ plain form
11727 112604 -298841 -124418 239536 -101740 -340594 431317 -346932 10988 123820 33443
11716 17785 298713 -22013 94242 -56885 -78588 77212 192099 -308438 333796 -69078 116981
11704 -162108 417220 51771 117692 242478 1986 -63498 160321 -124665 139992 124735 168006
11693 168006 -145672 -233974 36912 41179 182612 -32770 -70252 -25880 -35479 163883 213170
11682 213170 -24774 36094 142343 7848 66442 77518 420178 -380368 463915 -103233 112558
11670 203515 -30119 -40738 149008 68105 -154641 138481 12092 134493 -9311 175396 54457
11658 -58489 -54267 116225 136148 -130398 156405 46810 134096 -12113 199204 120507 75143
11647 75143 100571 -48910 -348161 128910 -43128 -28626 -163852 224986 102420 -131548
$$ packed form
11727A12604b98841a24418B39536a01740k38854D31317c46932A0988J12832C3443
11716A7785K80928b2013I4242e6885k1703G7212J14887c08438C33796f9078A16981
11704a62108D17220E1771O5921J24786A986f3498A60321a24665A39992j5257M3271
11693A68006a45672q8302C6912M267J41433c2770l7482b5880r599A63883M9287
11682B13170b4774C6094J06249G848N8594J1076L42660c80368D63915a03233A12558
11670B03515c0119j0619A49008F8105a54641A38481A2092J22401i311A75396E4457
11658e8489M222A16225J9923a30398A56405D6810Q7286a2113A99204p8697m5364
11647G5143K5428d8910k99251A28910d3128J4502j35226B24986A02420a31548
$$ plain form
11636 360276 64104 311709 -93736 9332 -157816 -136511 -374109 -33440 59080 40821 -106751
11624 323628 93847 37485 390585 -177173 -155526 -41022 454170 43819 -127500 -6926 -32060
11613 -32060 237086 -118960 -154900 59607 8574 92327 212513 -51543 161836 -77728 164191
11601 122000 78638 142983 -80546 168301 -52922 372598 -155051 145903 77644 -52646 -97732
11590 -97732 64051 -237177 -85782 196105 298646 99812 -106092 28403 53084 166777 -129561
11578 140978 -89038 16701 -81292 6656 -14962 167161 290276 191060 22824 10054 -66614
11566 -4644 75890 21150 342278 69120 137334 175031 75348 287014 44345 145948 -25596
11554 198018 -81795 -89541 412581 -161466 -226087 -67828 172888 3125 331478 295246 -323434
$$ packed form
11636C60276F4104K47605i3736I332a57816K1305k37598c3440E9080j8259a06751
11624C23628I3847C7485L53100a77173K1647d1022D54170D3819a27500f926k5134
11613c2060B37086a18960l5940E9607H574Q3753J20186e1543A61836g7728A64191
11601A22000m3362O4345h0546A68301e2922C72598a55051A45903o8259e2646m5086
11590i7732F4051b37177h5782A96105J02541I9812a06092B8403K4681J13693a29561
11578A40978h9038A6701h1292F656a4962A67161J23115r9216B2824A0054f6614
11566d644G5890B1150L21128F9120O8214L7697G5348K11666D4345J01603b5596
11554A98018h1795p746D12581a61466o4621f7828A72888C125L28353l6232c23434
$$ plain form
11542 -39254 -41287 -47751 614483 133835 187594 59506 -40516 340518 242903 229965 98870
11530 350875 207948 -3281 143445 -117645 277927 45761 251557 -191580 178893 176090
11520 176090 718 -27781 65250 -77032 -31808 -100389 3379 241946 102005 148907 153816 76295
11507 173502 204270 312646 -96228 350272 -57138 200875 215214 288689 453116 -76084 357338
11495 122704 113446 -3572 370799 272425 -25101 318128 159460 158646 248639 205027 -17333 77250
11482 4232 224655 1126 18410 56263 252634 -90869 58268 239114 83538 382340 243263
11471 243263 -112025 115250 135655 141676 466850 83004 452694 241104 337603 124247
11460 -52924 35147 -92776 120849 11035 -148424 320693 -59753 -309672 127270 -34384 -96855
$$ packed form
11542c9254k033o464F14483A33835N3759E9506d0516C40518r7615j2938I8870
11530C50875j42927c281A43445a17645B77927D5761K05796a91580A78893k803
11520A76090G18b7781F5250g7032c1808o8581C379K38567A02005M6902M909G6295
11507A73502L0768J08376i6228C50272e7138B00875J4339P3475J64427g6084C57338
11495A22704r258c572C70799r8374b5101C18128j58668q14Q9993m3612a7333G7250
11482D232K20423A126J7284L7853J96371i0869E8268J80846H3538K98802j39077
11471B43263a12025A15250K0405O021L25174H3004L69690k11590R6499A24247
11460e2924C5147i2776A20849A1035a48424C20693e9753k49919A27270c4384o2471
$$ plain form
11449 -96855 -136308 -141479 -108699 446525 -31683 -261955 80979 -125400 369209 64400 39166
11438 39166 13895 -85944 -352576 2074 -185022 29605 -28095 -228270 -99494 99965 113670
11427 113670 -32057 94397 64123 8050 373671 290595 259160 -154098 163293 7041 -221488
11415 80951 -35938 -250123 -128829 -84407 37129 -10488 314903 52965 80987 -497710 44582
11403 -16793 198036 -150120 108313 -42707 -159016 -187107 -224931 130891 -165642 -80853
11392 -46753 122120 -29514 -150830 -126250 234356 -79074 -61344 -262774 -267887 -224530 262441
11380 2772 235592 -5177 -65745 31351 -78662 -141788 55308 275492 238776 48111 -105074
11368 73725 76275 90546 301107 -71421 -71127 142944 -306451 49558 37472 79046 -285507
$$ packed form
11449i6855l9453n171L2780D46525c1683k30272H0979a25400C69209F4400k5234
11438C9166A3895h5944k66632B074a85022B9605b8095k00175i9494I9965J3705
11427A13670c2057I4397l0274H050L65621q3076l1435a54098A63293G041b21488
11415H0951c5938k14185J21294M4422C7129a0488C14903E2965K8022d97710D4582
11403a6793A98036a50120A08313d2707j16309k8091l7824A30891a65642h0853
11392d6753A22120b9514j21316K4580B34356g9074J7730k01430n113M3357B62441
11380B772K32820e177o0568C1351g8662o3126E5308K20184l6716D8111a05074
11368G3725K550J4271K10561g1421K94A42944c06451D9558j2086M1574b85507
$$ plain form
11356 -9014 -388627 -56113 92842 -60819 -119290 -9567 61977 -128083 -156673 -5084 -194481 71589
11343 62218 55501 224007 -82534 79919 -131184 114763 -257056 -185480 75974 -152198 -89728
11332 -89728 48281 -42266 -77044 -239340 -106539 49682 -156237 -320651 65830 -15579 106602
11320 -53713 -3637 -255857 -220283 -162656 28331 174170 39402 -105118 -337473 -112645 66192
11308 -187900 -207954 31513 159607 -90400 -111678 -110101 217190 -98490 -432667 -58895 241279
11296 -198539 -281758 -185529 -233038 86369 262359 259949 -143516 118183 43046 102 -94059
11284 14076 123098 -72815 12692 58292 199833 -83541 -245613 -163064 225121 410078 -86661
11272 -409384 -28583 -89495 83774 209546 -121651 -85200 73588 -67185 -93404 99271 -81766
$$ packed form
11356i014l79613e6113I2842f0819n8471i567F1977a28083k8590e084j89397G1589
11343F2218o717J68506h2534G9919a31184A14763b57056P1576G5974a52198O2470
11332h9728D8281d2266l4778j62296a06539D9682a56237j64414F5830a5579A06602
11320e3713c637k52220L5574N7627B8331J45839C9402a05118k32355a12645F6192
11308a87900k0054C1513J28094i0400k1278J577B17190i8490l34177e8895B41279
11296a98539q3219R6229m7509H6369J75990k410a43516A18183D3046A02i4059
11284A4076J09022g2815A2692M5600J41541h3541j62072Q2549B25121J84957h6661
11272d09384b8583o0912H3774J25772a21651L6451G3588f7185k6219I9271h1766
$$ plain form
11260 -128495 -139784 -99651 -448849 -5220 158002 -163061 220469 -69103 -149553 148636 -69683
11248 -206497 -112341 -202519 -69892 -249316 -18658 -52384 -11762 -54819 -191273 -92333 -33049
11236 -46983 192921 -200624 -157910 -9570 83016 175844 -25349 -347143 6606 -25360 235890
11224 -89820 -34504 -152191 -452542 83450 -94653 -16426 61014 31371 -120946 217873 -473711
11212 70986 126223 -6650 -412695 200108 49053 -56821 142661 8310 35933 161087 10078
11200 53194 -335718 137487 58571 -84396 75584 -142038 24934 181937 -59977 24883 277442
11189 277442 48202 400581 17203 53022 -5173 106212 -358650 -163526 -147979 -39497 -8096
11177 -11652 -249975 -158460 246110 64766 271772 -345291 225581 -178810 412837 -225610
$$ packed form
11260a28495j1289M0133l49198e220A58002a63061B20469f9103q0450A48636f9683
11248b06497R4156r0178f9892j79424a8658l3726a1762m3057j36454i2333c3049
11236d6983A92921b00624M2714i570H3016R2828b5349l21794F606b5360B35890
11224h9820c4504j17687l00351H3450i4653a6426F1014k9643a20946B17873d73711
11212G0986N5237f650m06045B00108D9053e6821A42661H310K7623J25154A0078
11200E3194c35718A37487E8571h4396G5584a42038B4934J57003e9977B4883K52559
11189B77442D8202L52379A7203L5819e173A06212c58650a63526J5547c9497h096
11177a1652k38323R1515B46110F4766K07006c45291B25581a78810D12837b25610
$$ plain form
11166 222321 -238554 -355687 -5725 26144 39952 145366 -42479 -184434 -19485 46546 59439
11155 59439 -178258 74211 184667 59003 306574 -140508 414282 185893 -162887 -85952
11145 -85952 -213344 1650 -167154 166466 271863 -87205 13373 92498 23439 -330097 -28681
11133 214637 -215439 205687 308685 475883 12876 292921 179654 -134330 65666 -94964
11122 277277 117184 165979 217008 527191 -110457 -24499 -299029 105005 -154684 -213262
11112 -213262 279177 -223050 106118 144917 240001 219700 256825 58673 130021 440020 305835
11101 305835 350350 -131137 211355 -10041 186422 -261612 -14435 148873 32260 -50013
11090 266560 225731 -78654 116924 39823 54788 325431 325435 190763 20890 403795 315783
$$ packed form
11166B22321b38554j17133e725B6144J3808J05414d2479j41955a9485D6546J2893
11155E9439a78258G4211J10456E9003K47571a40508D14282A85893a62887P6935
11145h5952j27392A650a67154A66466J05397h7205A3373P9125B3439c30097b8681
11133B14637b15439B05687J02998J67198A2876K80045j13267a34330F5666i4964
11122B77277A17184M8795N1029L10183a10457b4499k74530A05005a54684n8578
11112b13262B79177b23050A06118L8799R5084k0301L7125E8673P1348L09999j34185
11101C05835M4515a31137B11355a0041A86422b61612a4435A48873C2260e0013
11090B66560m0829g8654A16924C9823J4965K70643Mj34672B0890L82905q8012
$$ plain form
11079 315783 -131188 68272 272028 528343 71033 225688 -61256 400192 547337 427405
11069 427405 484173 622314 295698 386255 353110 552335 187114 384237 514283 820866
11059 820866 700065 712759 590348 422476 382095 649392 154394 724120 868899 594948
11049 594948 841682 682490 855184 584678 734980 520479 642516 544206 796748 467566
11039 467566 732823 796239 641475 786593 888804 271071 635646 698114 790050 680053
11029 680053 483316 726381 729755 823531 616703 485484 935979 424284 607848 665494
11019 665494 471987 657804 816945 685090 959160 491967 539723 408223 404201 621263
11009 621263 909785 725901 484515 635810 647560 642997 751432 846158 575687 663592
$$ packed form
11079C15783a31188F8272K03756K56315G1033J54655f1256D00192J47145j19932
11069D27405N6768J38141B95698R0557l3145J99225A87114J97123J30046L06583
11059H20866j20801J2694j22411j67872m0381K67297A54394N69726J44779k73951
11049E94948K46734j59192J72694k70506J50302k14501J22037r8310K52542l29182
11039D67566K65257O3416j54764J45118J02211B71071L64575O2468R1936j09997
11029F80053j96737K43065L374R3776k06828j31219M50495D24284J83564N7646
11019F65494j93507J85817J59141j31855K74070m67193M7756j31500m022K17062
11009F21263K88522j83884k41386J51295J1750m563J08435R4726k70471Q7905
$$ plain form
10999 663592 416492 559168 830829 849516 993684 883460 585600 586552 676225 1012463
10989 1012463 777313 646003 737375 772784 1133149 1098673 1113855 1170668 700360 1354001
10979 1354001 1526484 1216438 1538949 1672570 2005698 2369897 2344040 2726264 2873105 2889944
10969 2889944 3032569 2277090 2622849 2184002 1832858 1808561 1415496 1527395 1583140 1295890
10959 1295890 1493292 1960083 1673649 1208742 1814815 1461118 1237245 909535 876074 739903
10949 739903 701493 757348 635269 186242 152063 156319 242019 233633 165475 152397 201052
10938 201052 3044 81603 186415 -98467 161178 104087 49812 240148 -349185 110958 71721
10927 71721 -65023 -243440 209672 125853 247172 130287 -213488 -18199 113196 67034
$$ packed form
10999F63592k47100J42676K71661J8687J44168j10224k97860R52Q9673L36238
10989A012463k35150j31310R1372L5409L60365l4476J5182N6813m70308O53641
10979A354001J72483l10046L22511J33621L33128L64199k5857L82224J46841J6839
10969B889944J42625p55479L45759m38847l51144k4297l93065J11899N5745k87250
10959A295890J97402M66791k86434m64907O06073l53697k23873l27710l3461j36171
10949G39903l8410N5855j22079A86242l4179M256Q5700q386o8158j3078M8655
10938B01052C044P8559J04812i8467A61178n7091D9812J90336c49185A10958l9237
10927G1721f5023j78417B09672q3819J21319j16885b13488a8199A13196m6162
$$ plain form
10917 67034 -371435 182575 186908 -468733 49878 -66853 215936 -327565 -70563 108672 294549
10906 294549 147552 -19199 153539 -201887 -32224 278459 -90359 132585 121289 -266244
10895 -55230 -208902 -142071 -72308 -195931 -21371 -119958 -14572 -375900 -28449 358355 24056
10883 -329297 -65685 243723 -291850 -45616 -34910 24841 -57584 198566 -58965 -122943 394386
10871 36540 -83346 -54709 24736 -182183 -190951 -103010 226875 155151 3739 210648 -119149
10859 -60605 45864 -42707 48415 -7077 148130 -196476 -149478 -120395 252792 149323 -121338
10847 -64389 -234975 -120903 22588 86396 20370 7300 -129769 224739 -29121 30155 -152004
10835 -258831 -62697 -73144 238561 6205 -240351 -376228 170248 17179 269873 295046 126723
$$ packed form
10917F7034c71435A82575M333d68733D9878f6853B15936c27565g0563A08672J85877
10906B94549j46997a9199A53539b01887c2224B78459i0359A32585j1296b66244
10895e5230j53672O6831O9763j23623b1371r8587a4572l61328b8449C58355B4056
10883c29297f5685B43723b91850d5616J0706B4841e7584A98566e8965o3978C94386
10871C6540h3346K8637B4736a82183q768Q7941B26875p1724C739K06909a19149
10859f0605D5864d2707D8415g077A48130a96476M6998K9083B52792j03469a21338
10847f4389j70586J14072B2588O3808B0370G300a29769B24739b9121C0155a52004
10835b58831f2697j0447B38561F205b40351j35877A70248A7179K52694K5173A26723
$$ plain form
10823 1055 -16749 -58113 29847 -100836 127251 300932 247586 24765 -217769 -331348 -211121
10812 -211121 258134 213293 -264051 -140779 -300893 -133237 -148882 -44129 -87426 -49658
10802 -49658 -34338 -214404 -94983 -278284 323146 21427 -208202 217038 -23167 40553 -433585
10790 -176647 -72648 -377428 -92512 -11764 -20677 113507 27065 -11189 85436 140644 116870
10779 116870 14647 7474 -123810 -164475 -340466 28833 256613 -340174 -22806 14334 162528
10768 162528 -374547 -269045 -116844 124454 -221459 243597 109981 79847 98869 -70206
10757 -40872 -21451 -67705 -33217 103374 310698 -17505 126620 -192840 -156894 479184 -286825
10745 -301814 -172140 339020 59021 -58370 -53946 37093 -124621 -45466 64684 -467686 154464
$$ packed form
10823A055a6749m1364B9847a00836A27251J73681n3346B4765b17769j13579J20227
10812b11121B58134m4841b64051J23272j60114a33237j5645d4129m3297L7768
10802d9658J5320j80066i4983j83301C23146B1427b08202B17038b3167D0553d33585
10790a76647g2648l04780i2512a1764q913A13507B7065a1189H5436N5208k3774
10779A16870A4647p173a23810m0665j75991B8833K27780c40174b2806A4334J48194
10768A62528c74547J05502a16844A24454b21459B43597A09981l0134J9022g0206
10757d0872J9421m6254c3217A03374K07324a7505A26620a92840L5946D79184b86825
10745c01814J29674C39020E9021e8370M424C7093a24621d5466F4684d67686A54464
$$ plain form
10733 -20400 -407393 -414539 -5276 25997 -238068 -349302 62841 102575 -345351 -182524 -39013
10721 361088 165875 -224745 -104308 -195315 -177235 -44067 -50412 -225688 95115 180650 82042
10709 -99523 37552 -114544 -577452 -395640 -186247 -235978 437773 79145 -52128 35369 -5723
10697 -269855 255582 23514 28810 -8438 -160133 -126066 106879 -147612 -216129 23852 -76873
10685 1626 176915 -248010 -77527 -48482 -76708 64705 49149 -226674 -324318 -235596 189153
10673 -21029 67320 -49248 -163912 -263170 -121713 -203138 194828 56220 -45186 75701 -51794
10661 29209 -131538 29398 -167636 -146284 -245961 -82842 -307813 94426 -63179 -215172 59531
10649 158063 66648 -230841 36323 -153478 -288535 90147 -265755 -340432 -137154 320237
$$ packed form
10733b0400l86993p146e276B5997b38068j11234F2841L9734c45351J62827c9013
10721C61088A65875b24745a04308r1007J8080d4067o345j75276I5115Q5535H2042
10709i9523C7552a14544m62908J81812a86247m9731D37773G9145e2128C5369e723
10697b69855B55582B3514N296h438j51695L4067A06879a47612o8517B3852g6873
10685A626J75289b48010g7527K9045k8226F4705j5556b26674r7644Q8722A89153
10673b1029F7320d9248j14664r9258a21713q1425A94828E6220d5186G5701e1794
10661B9209a31538B9398a67636K1352r9677h2842k24971I4426f3179j51993E9531
10649A58063F6648b30841C6323a53478j35057I0147b65755p4677a37154C20237
$$ plain form
10638 -254862 83396 -124760 207058 -137182 -170737 110236 23013 -27127 -297905 22073
10627 214208 -225351 -190051 11946 241019 -208269 136634 77534 -115433 -296447 27821
10616 -116828 -111958 183105 -391828 -84596 114972 -231764 -80774 -96837 -177239 137521 -27061
10604 69254 -53843 -203139 -119648 -125934 34895 -4364 -215709 38435 250479 211256 -28476
10592 -201370 -244494 -147146 -137940 208299 -116303 -214571 -63437 -35845 -178211 54753 -294872
10580 -89238 -22776 -65205 -265812 70375 123050 -77834 -185214 -125512 155292 -46768 -205452
10569 -205452 -285588 -325883 -5320 -244961 38706 -222992 -13710 300348 -246230 -93032 -114045
10558 -114045 -98998 225920 -4320 -187257 -45093 141118 -64796 -317958 -250495 -308238 -219924
$$ packed form
10638b54862H3396a24760B07058a37182l3555A10236B3013b7127k70778B2073
10627B14208b25351L5300A1946K29073b08269A36634n9100a15433j81014B7821
10616a16828M870A83105c91828h4596A14972b31764h0774j6063q0402A37521b7061
10604F9254e3843j49296Q3491o286C4895d364k11345C8435K12044l9223b8476
10592b01370m3124R7348R206B08299a16303r8268f3437K7592j42366E4753b94872
10580h9238b2776m2429k00607G0375N2675g7834j07380N9702A55292d6768j58684
10569b05452q0136m0295e320k39641C8706b22992a3710C00348b46230i3032k1013
10558a14045J5047B25920d320j82937d5093A41118f4796k53162O7463n7743Q8314
$$ plain form
10547 -219924 -455021 -168354 -291255 235504 -70793 25978 125496 -123943 -194978 32635
10536 18454 -44687 -412183 3563 178084 -64643 199794 138471 -243810 -131478 -91572 -93505
10525 -93505 -100908 -199830 188683 -15098 15505 -371345 -171531 -127879 70047 247642 129283
10514 129283 -199312 -44166 26008 -86257 -334690 117172 -190359 -59422 -165838 -589403
10504 -589403 -356667 -197536 -60940 -222183 -153281 -270181 -13383 15966 -205900 281834
10493 -136668 -62659 82778 -37509 47129 -104285 -247032 37703 -202602 523353 282144
10483 282144 118552 256345 444924 378107 172475 318596 -1307 133720 40358 93760
10473 93760 -195673 237889 52757 76085 61307 227066 -86417 -258300 -160996 139767 -325151
$$ packed form
10547b19924k35097a68354j22901B35504g0793B5978R9518a23943p1035C2635
10536A8454d4687l67496C563J74521f4643A99794o1323b43810J12332L9906j933
10525i3505p403r8922A88683a5098A5505c71345a71531M3652G0047J77595j18359
10514A29283a99312d4166B6008h6257k48433A17172a90359e9422j06416m23565
10504e89403K32736J59131f0940j61243O8902j16900a3383A5966b05900B81834
10493a36668f2659H2778c7509D7129a04285j42747C7703b02602E23353k41209
10483B82144A18552J37793J88579o6817A72475J46121a307A33720D0358N3402
10473I3760a95673B37889E2757K3328j4778J65759h6417j71883R7304A39767c25151
$$ plain form
10461 -126123 -218245 258157 68559 -288154 179648 86811 -41571 -78743 -185083 -338974
10451 -338974 -224775 80457 -101747 -366041 91698 -265890 100626 371464 -247833 -3670
10440 -91176 196129 -60211 61106 205772 45989 67753 -139024 89250 -6239 205705 -119847
10428 55690 -64814 79208 -100899 63462 -103278 -212293 36549 -9856 95029 212057 3675
10416 31561 34661 10411 92253 -309957 53038 -70385 234722 64396 -173237 213896 90064
10404 -286256 90223 5545 373359 -236100 -353839 -75088 -221306 50468 133862 18931 24150
10393 24150 357459 12501 164358 142743 52828 45798 126670 20223 1463 191912 424899
10382 424899 190923 -109533 60867 681784 141935 181692 1286 250927 267440 169134 75220
$$ packed form
10461a26123r2122B58157F8559b88154A79648H6811d1571l7172j06340j53891
10451c38974J14199H0457a01747k64294I1698b65890A00626K70838b47833c670
10440i1176A96129f0211F1106J44666D5989K1764a39024H9250f239B05705a19847
10428E5690f4814G9208a00899F3462a03278j09015C6549i856I5029J17028C675
10416C1561L100A0411Q1842c09957E3038g0385B34722F4396a73237B13896I0064
10404b86256I0223E545L67814b36100j17739g5088j46218E0468Q3394A8931N219
10393B4150L33309A2501J51857k1615E2828p030Q0872B0223A463J90449K32987
10382D24899A90923a09533F0867O20917A41935L9757A286K49641J6513r8306G5220
$$ plain form
10370 661204 138336 553247 428420 486975 539283 532892 787294 153533 286414 269246
10360 269246 100570 117450 291664 -269496 222910 192992 237811 329778 287985 656793
10350 656793 660797 93226 210897 408627 149515 148139 313724 272495 256236 214699 417933
10339 417933 256741 230348 86573 -80521 204191 132015 64030 195789 -65643 370599 283741
10328 283741 35608 237046 358414 187766 120056 197735 71760 477016 200777 -279959
10317 85106 13793 -13396 453107 38134 -321007 -18391 -294578 45421 -184191 -158647 -97985
10306 -97985 257038 101723 -132690 -110000 -220552 161749 -2837 162565 119588 175499 57838
10294 -90878 -220691 -323648 227895 83746 -276299 310291 116638 -292494 -227437 -216442
$$ packed form
10370F61204A38336M14911j24827N8555N2308o391K54402A53533J32881j7168
10360B69246A00570J6880J74214b69496B22910k9918M4819R1967m1793L68808
10350F56793M004I3226J17671J97730A49515j376J65585m1229j6259m1537K03234
10339D17933j61192k6393H6573h0521B04191p2176F4030J31759f5643C70599q6858
10328B83741C5608K01438J21368j70648o7710P7679G1760M05256B00777b79959
10317H5106A3793a3396D53107C8134c21007a8391k76187D5421a84191K5544O0662
10306i7985B57038A01723a32690K2690j10552A61749b837A62565m2977N5911E7838
10294i0878j29813j02957B27895H3746b76299C10291A16638b92494O5057J0995
$$ plain form
10284 -216442 34322 81333 -101459 -190609 196691 -250551 53001 -149469 -149690 132762 188452
10273 188452 121379 166994 -140328 -111783 -77938 -126782 -124856 -121390 -248502 269495 -77447
10261 149009 211809 354230 397939 -14568 320517 132988 82350 -86633 278454 -48320 308786
10249 -156117 -68166 -184179 -228377 87368 -171899 -218989 222520 125034 -174156 65874 76378
10238 76378 40483 -104972 -8463 -422438 -146882 74678 156453 23632 -16306 114670 -155039
10226 -208178 101006 100165 267554 61984 -198819 -139804 -113671 239124 -488946 307855 74066
10214 -127164 -50417 110055 -65845 -99848 -213077 48193 -244116 223708 83517 -69998 6005
10202 2178 -171958 -62190 123592 175883 101715 -261950 -249395 -107099 115684 -67994 -300574
$$ packed form
10284b16442C4322M7011a01459q9150A96691b50551E3001a49469k21A32762N5690
10273A88452o7073M5615a40328K8545L3845m8844J926L466j27112B69495g7447
10261A49009O2800J42421M3709a4568C20517A32988n0638h6633B78454d8320C08786
10249a56117f8166j16013m4198H7368a71899m7090B22520r7486a74156F5874J0504
10238G6378l5895a04972h463m13975a46882G4678Q1775B3632a6306A14670a55039
10226b08178A01006q41J67389F1984a98819N9015K6133B39124d88946C07855G4066
10214a27164e0417A10055f5845l4003j13229D8193b44116B23708H3517f9998F005
10202B178a71958f2190A23592N2291p4168b61950J2555a07099A15684f7994k32580
$$ plain form
10191 -300574 -104552 -71985 -479845 345496 -203236 18321 -387906 -19604 -29762 43506
10180 -309753 -91363 -210334 -104537 261437 -83099 82513 -154059 42982 -36773 91763 -206804
10168 -35056 214352 146202 -75295 -112069 144987 -201375 -94583 115603 -31413 -56502 -160464
10157 -160464 -86438 -121133 194945 223544 -33128 -209888 170453 -277135 2969 -214655 -71104
10145 -222661 238319 4331 -44189 -107448 -22482 220619 -30285 18841 10796 -81457 177645
10133 -500419 -8752 -29508 -253282 146198 -158416 -53542 -250132 -53033 2440 -24409 -340510
10122 -340510 42452 66070 179405 241400 168751 -191068 -53567 -274193 -365653 735 -44837
10110 -17912 -87826 -6558 152117 -157491 61405 -3591 -54035 -268759 177287 -4956 380314
$$ packed form
10191c00574a04552L2567m07860C45496b03236A8321c87906a9604j0158D3506
10180c09753i1363j18971a04537B61437h3099H2513a54059D2982c6773I1763b06804
10168c5056B14352o8150g5295l6774A44987b01375i4583A15603c1413k5089j03962
10157a60464P4026l4695A94945K8599c3128j76760A70453b77135B969b14655g1104
10145b22661B38319D331d4189o3259b2482B20619c0285A8841q045h1457A77645
10133e00419h752k0756k23774A46198a58416e3542j96590e3033B440b4409l16101
10122c40510D2452K3618J13335O1995p2649a91068e3567k20626r1460G35d4837
10110a7912o9914f558A52117a57491F1405c591n0444k14724A77287d956C80314
$$ plain form
10098 33159 -58835 -51640 -247373 82563 -164119 -186200 134739 -118497 -62618 -392509 166798
10086 181664 -319809 -136227 -220543 -333738 120930 14260 -72496 195895 -257308 -137099
10076 -137099 -108445 -1820 -689801 30708 -173508 -151822 -135312 -218050 -270343 -129333 292290
10064 72415 -172068 11074 200865 -66679 -68993 -90642 -188449 -251747 -96336 -49833 -127279
10053 -127279 124929 27688 -153106 30287 8584 -122828 -102000 223610 -75614 40422 -283919
10041 -1916 -217617 -212973 58549 -52971 -313562 65997 -179391 17813 15011 250211 47468
10029 2650 -251158 -282658 -206152 -87114 -33619 37246 -91190 -213215 -90206 183654 353328
10018 353328 -257483 61571 30464 357238 19624 -159421 61944 -44577 -129865 -283457 -249675
$$ packed form
10098C3159e8835P195j95733H2563a64119k2081A34739a18497N5879l29891A66798
10086A81664c19809a36227q4316j13195A20930A4260g2496A95895b57308J20209
10076a37099K8654a820o87981C0708a73508K1686J6510q2738n2293a29333B92290
10064G2415a72068A1074J89791f6679k314k1649r7807o3298i6336M6503p7446
10053a27279A24929B7688a53106C0287H584a22828K0828B23610g5614D0422b83919
10041a916k15701M644E8549e2971k60591F5997a79391A7813k802K35200D7468
10029B650b51158l1500P6506h7114c3619C7246i1190j22025i0206A83654J69674
10018C53328b57483F1571C0464L26774A9624a59421F1944d4577q5288j53592L3782
$$ plain form
10007 -249675 17705 67941 -414026 219431 -180864 -112025 -13275 -102054 -109986 -41215 47312
9995 -131116 68135 18156 54783 -258934 21214 -207564 -131254 156054 59300 -103132 -73844
9984 -73844 -310880 103500 47953 92699 150112 -79355 151431 -64539 62808 220634 14987
9972 -86315 38550 38191 -90469 -4058 51365 -216110 -5968 -55935 -271488 28788 -328587 23476
9959 -101729 90623 239904 -281832 -40659 -400246 -33874 110084 -168089 -331603 -222409
9949 -222409 -49158 -8676 321746 176586 3837 95213 -371420 -50729 125995 66410 -114746
9937 93438 -35200 74511 129606 309552 103871 -5889 -220033 50017 134316 -84560 -9869 275228
9924 -4384 64327 -80700 -154954 81131 152671 -47157 186454 186758 17901 -255942 93303 23933
$$ packed form
10007b49675A7705N0236d14026B19431a80864O8839a3275q8779p932d1215D7312
9995a31116F8135A8156L6627b58934B1214b07564P6310A56054E9300a03132K9288
9984g3844k37036A03500D7953M4746N7413g9355A51431f4539F2808J57826A4987
9972h6315C8550l59i0469d058E1365b16110e968m9967k15553B8788c28587B3476
9959a01729I0623J49281b81832d0659l59587c3874A10084a68089j63514J09194
9949b22409d9158h676C21746j45160C837R1376c71420e0729A25995n9585a14746
9937I3438c5200G4511N5095J79946A03871e889k14144E0017Q4299h4560i869B75228
9924d384F4327h0700p4254H1131P1540d7157A86454L04A7901b55942I3303B3933
$$ plain form
9911 15860 -350526 -188484 -525693 200030 89702 -247808 7188 -228762 -299281 -326795 -175134
9900 -175134 -254778 -75101 194059 -123066 -97294 78012 -41356 -371943 -79123 -240479 -91385
9888 64459 37175 -226422 -11341 -65292 86865 -130501 -7538 -190423 -449836 -228493 -71188
9876 102081 -245376 119850 -52571 -230234 -165023 -24531 -370787 -77947 -210107 90026 -278243
9864 -395079 -76371 -104774 32446 -433181 120337 -120055 51115 -264598 -95654 -103370 -16199
9852 -145116 -41221 30320 -170380 -238969 201695 -27847 41119 -49289 -34389 -92172 -166128
9841 -166128 -461876 -91624 -18674 90709 -159852 -307999 143717 111173 -217506 -5928 171653
9829 -530659 200270 -169462 -73045 -30575 80924 -43198 -151554 20270 -48295 -289350 5145
$$ packed form
9911A5860c50526J62042l37209B00030H9702b47808G188b28762p0519k7514J51661
9900a75134p9644g5101A94059a23066K5772G8012d1356l30587g9123j61356i1385
9888F4459k7284b26422a1341n3951H6865a30501g538j82885k59413K21343g1188
9876A02081b45376A19850e2571j77663O5211b4531l46256g7947j32160I0026b78243
9864c95079g6371k8403C2446d33181A20337a20055E1115b64598i5654p716a6199
9852a45116d1221C0320a70380o8589B01695b7847D1119d9289J4900n7783p3956
9841a66128k95748i1624a8674I0709a59852j48147A43717l2544b17506e928A71653
9829e30659B00270a69462g3045c0575H0924d3198j08356B0270d8295k41055E145
$$ plain form
9817 -280530 142802 -67490 183704 116313 -323794 8172 -45941 17207 23052 -186518 -34799
9805 -924 -161084 -73254 -203732 131397 -115994 -180976 85606 357383 -55402 -47446 -41004 -308071
9793 -308071 -13330 -157512 -97707 341252 42022 78939 220105 -237974 -39270 246900 -31762
9781 1418 -217428 -304053 -278719 -165223 42992 -114028 -160663 84814 74140 266013 -342730
9769 -51784 -12398 -58855 17047 -50290 -53282 -38194 319875 -51402 -42922 -28625 70420 -93139
9756 -126226 -151810 -5098 -72323 -233259 -150419 -271301 -97663 259973 -147997 -348060 -116441
9744 -462303 -232403 123698 -241134 118878 14105 128147 188407 -112361 144205 147284
9734 147284 -7941 380449 152683 93914 -138896 -160008 -222045 -20874 -277142 -24925 -190233
$$ packed form
9817b80530A42802f7490A83704o7391c23794H172d5941A7207N845a86518c4799
9805i24j60160g3254j30478A31397a15994o4982H5606K71777e5402P956O442k67067
9793c08071a3330j44182N9805C41252D2022L6917J41166b37974c9270B46900c1762
9781A418b17428q6625K5334J13496D2992a14028m6635H4814j0674J91873c42730
9769e1784a2398m6457A7047e0290k992J5088C19875e1402Q480J4297G0420i3139
9756a26226k5584e098o7225j60936Q2840j20882i7663B59973a47997k00063a16441
9744d62303K29900A23698b41134A18878A4105J14042O0260a12361A44205L079
9734A47284g941C80449A52683n8769a38896k1112o2037b0874k56268b4925j65308
$$ plain form
9723 -190233 146 -102458 -246273 58833 -138619 129370 -168886 282338 68159 16769 -14443
9711 -447537 -31904 140395 215870 53039 174635 83099 -291382 -160695 -206771 -24178 -196607
9700 -196607 -103065 329784 -15918 -142486 -64146 126168 -25709 -91877 -119319 157536 193846
9689 193846 -158468 167910 -276433 -23235 25716 -263276 244970 -292963 -404596 -395077
9679 -395077 -428100 -332645 63830 -119855 -275144 83823 -465098 -279956 -23034 -251828 -130786
9668 -130786 -441660 -30218 39638 -107627 121485 160939 -320124 -168612 -221507 7719 -23043
9656 155432 -39771 -97494 33680 -101691 -33575 -164490 180341 -212124 -178682 15160 -61714
9644 -21076 -196135 -160545 -23346 121028 8241 -63620 -27044 -4072 -79865 3282 78313 120893
$$ packed form
9723a90233A46a02458j43815E8833a38619A29370a68886B82338F8159A6769a4443
9711d47537c1904A40395P5475E3039J21596H3099b91382J30687m6076b4178j72429
9700a96607R3542C29784a5918j26568f4146A26168b5709o6168k7442A57536L6310
9689A93846a58468A67910b76433b3235B5716b63276B44970b92963j11633R519
9679c95077l3023R5455F3830a19855j55289H3823d65098J85142b3034k28794J21042
9668a30786l10874c0218C9638a07627A21485L9454c20124J51512n2895G719b3043
9656A55432c9771n7723C3680a01691c3575j30915A80341b12124L3442A5160f1714
9644b1076j75059L5590b3346A21028H241f3620b7044d072p5793C282P5031M2580
$$ plain form
9632 120893 -62845 -155823 -275794 140024 -258340 -209967 -194510 -367524 -52167 -12664 167713
9620 32192 13663 -265162 259591 -244080 -276008 3590 -36941 -77478 140722 -197093 68624
9608 42240 -217854 62750 37773 56732 106684 -60818 -254213 -16238 -53408 261987 -276339
9596 70123 -102622 -60553 -150585 -36343 -108783 -135707 90534 -201080 -170122 -121722 -147035
9585 -147035 39172 7838 -273747 -172356 -132152 -97363 -111376 -177634 -453525 -140398 29117
9573 -254781 20667 55469 -172937 31482 350740 -203066 111713 -203249 -144089 -287722
9563 -287722 -89963 -406499 -156215 230967 -47316 -81711 99291 -234740 -127464 -371777
9553 -371777 -232883 135618 -99221 -344864 85840 -192801 -129772 -33489 18933 -218058 24413
$$ packed form
9632A20893f2845r2978j19971A40024b58340M8373J5457j73014e2167a2664A67713
9620C2192A3663b65162B59591b44080l1928C590c6941m0537A40722a97093F8624
9608D2240b17854F2750k4977J8959M9952f0818j93395a6238l7170B61987b76339
9596G0123a02622M2069r0032c6343p2440k6924I0534b01080L0958M8400k5313
9585a47035C9172G838b73747J01391M0204L4789j4013o6258k75891a40398B9117
9573b54781B0667L4802a72937C1482L19258b03066A11713b03249N9160j43633
9563b87722h9963l16536a56215B30967d7316l4395I9291b34740J07276k44313
9553c71777J38894A35618i9221k45643H5840a92801O3029c3489A8933b18058B4413
$$ plain form
9541 188098 -285567 -275407 -63892 73211 -324892 64491 -205187 -72999 -389226 104180 -328624
9529 112816 138061 -373736 -281572 -9620 24497 65097 -232387 -109729 -76605 78326 -465673
9517 -163385 65912 -130852 -249141 -120792 -32857 -278499 298467 -25807 247960 294536
9507 294536 -36188 82618 -47053 91383 -131551 -153992 -108825 -238549 -162053 -91020 -64815
9496 -64815 209236 -42442 -229933 -141722 -192064 -42306 -173435 -263230 -224183 139136 198866
9485 198866 5115 -270138 -135623 -166291 167382 -10507 22823 51899 12189 -11534 108880
9473 109342 -5044 -257563 157069 289224 68391 -279844 -269334 -50098 -455298 -396477 -40389
9461 -45149 10484 -63817 -255841 376119 -14291 -26952 -366989 -313491 -220013 18614 79943
$$ packed form
9541A88098b85567J0160f3892G3211c24892F4491b05187g2999l16227A04180c28624
9529A12816K5245c73736R2164i620B4497M0600b32387a09729L3124G8326d65673
9517a63385F5912a30852j18289a20792c2857k45642B98467b5807B47960M6576
9507B94536c6188H2618d7053I1383a31551k2441M5167j29724P6496P1033K6205
9496f4815B09236d2442j87491Q8211n0342d2306j31129q9795L9047A39136N9730
9485A98866E115b70138J34515l0668A67382a0507B2823K9076A2189a1534A08880
9473A09342e044k52519A57069J32155F8391b79844J0510e0098m05200N8821d0389
9461d5149A0484f3817j92024C76119a4291j2661l40037N3498R3478A8614O1329
$$ plain form
9450 79943 26220 -116609 -237400 -263909 63872 61715 87235 -201760 -360173 -255283 -293818
9439 -293818 -191952 -39450 -32646 43446 -105704 -77259 240125 20740 -215217 179725 49319
9427 -62869 -136573 -93377 -12778 -93215 -11237 57246 59296 -327398 -66793 -337661 -115216
9415 50426 -63273 58477 53539 58437 113706 270171 -55675 198911 54462 53855 209393 211531
9403 211531 -177450 22861 135001 15974 -175368 -181013 162389 19200 36471 -86204 -377389
9392 -377389 187661 -229267 20846 91198 -199748 48281 106185 -1959 233956 93280 -167889
9380 -24590 48061 -40834 -11580 64724 -89703 -316605 -121470 295581 -261814 -287247 -267195
9369 -267195 -270649 -14151 -166408 -198779 143193 50029 50541 7782 209268 38561 38154 237824
$$ packed form
9450G9943B6220a16609j20791k6509F3872k157K5520b01760j58413J04890l8535
9439b93818J01866c9450O804D3446a05704K8445B40125B0740b15217A79725D9319
9427f2869p3704M3196a2778q0437a1237E7246K050c27398f6793k70868a15216
9415E0426f3273E8477m938M898N5269J56465e5675A98911E4462o07J55538K138
9403B11531a77450B2861J12140A5974a75368n645A62389A9200J7271h6204k91185
9392c77389A87661b29267B0846P0352a99748D8281N7904a959B33956I3280a67889
9380b4590D8061d0834a1580F4724h9703k26902a21470B95581b61814k5433K0052
9369b67195l454a4151j52257l2371A43193E0029N12G782K01486C8561m07J99670
$$ plain form
9357 237824 -130233 -538615 -206970 16174 -204687 -190009 -177150 -4727 332370 21962 61801
9346 61801 -121098 171608 18878 -127375 -43453 -110413 78424 -78053 -24433 254704 -32147
9334 -229130 -182470 -198948 27038 -187347 129074 80315 -4799 -169987 -130610 -225068 -204374
9323 -204374 -149300 71796 -421781 -50300 -274749 44227 -176842 -107454 -162692 -99484 12066
9311 -567361 -43592 173958 -327224 -345073 4459 2840 -150893 -39233 -55381 -5003 -35729 -172551
9299 -172551 -139807 -337017 1684 -144470 -133014 -49848 -211338 86020 6013 -271582 99419
9287 15121 -425862 169807 -69055 -184786 -307174 -167975 -238793 -150996 83152 -375404 -74492
9275 -14446 -25012 -46209 -280933 -165037 -159621 -185435 -158129 63408 -123628 30290 68323
$$ packed form
9357B37824a30233m08382b06970A6174b04687J4678J2859d727C32370B1962L9839
9346F1801a21098A71608A8878a27375d3453o6960G8424g8053b4433B54704c2147
9334b29130M6660j6478B7038a87347A29074m8759d799j65188L9377r4458K0694
9323b04374N5074G1796d21781e0300k24449D4227a76842O9388n5238O3208A2066
9311e67361d3592A73958c27224j7849D459j619a50893c9233j6148e003l0726j36822
9299a72551L2744j97210A684a44470J1456d9848j61490H6020F013b71582I9419
9287A5121d25862A69807f9055j15731j22388J39199p0818Q7797H3152c75404g4492
9275a4446j0566k1197k34724J15896N416k5814K7306F3408a23628C0290L8033
$$ plain form
9264 68323 -41904 -6258 5362 51987 -130192 -22550 -186155 -99202 -191391 43924 165612 193328
9252 193328 17871 -49117 -204795 181124 -219217 -161877 29320 -356834 159363 -227727
9241 -331777 56352 -68207 29075 128088 -61564 216259 -101685 -120175 23209 128917 162200
9230 162200 -171941 -34610 -141029 -214220 -578933 31333 -23094 76099 -154855 138887 -199820
9218 175749 -70498 -443991 -407839 325444 -72084 -275176 196876 -308212 2032 52849 -138332
9206 -214428 -476385 -389023 103045 -148612 10933 3009 73740 -131923 -202399 -165099 108343
9194 515048 103033 357200 -305539 -54097 61066 175322 -33568 16403 61064 207399 -105815
9182 71894 -202312 -238194 143415 -41897 29650 325908 23320 -116743 -68948 36442 -129792
$$ packed form
9264F8323d1904f258E362M6625a30192b2550j63605Q6953r2189D3924J21688K7716
9252A93328A7871d9117j55678A81124b19217N7340B9320c56834A59363b27727
9241c31777E6352f8207B9075R9013f1564B16259a01685j8490B3209J05708L3283
9230A62200a71941c4610j06419p3191l64713C1333b3094G6099a54855A38887a99820
9218A75749g0498l73493L6152C25444g2084k03092A96876c08212B032N0817a38332
9206b14428k61957Q7362A03045a48612A0933C009P0731a31923p0476L7300A08343
9194E15048A03033K54167c05539e4097F1066J14256c3568A6403M4661J46335a05815
9182G1894b02312l5882A43415d1897B9650K96258B3320a16743M7795C6442a29792
$$ plain form
9170 44361 306601 -296320 -110030 171974 80069 105850 113444 70794 208272 -102991 16961
9158 -229912 -84085 -405726 -248047 276721 -50280 170257 -293284 -136641 -303567 -115356
9147 165126 -23614 -122805 -217204 -116190 -619 27754 -175661 -212280 182237 156416 -313909
9135 -4231 -148295 253767 -51216 -183619 -241118 -98542 -217843 -215092 -213054 -83167 -135159 12779
9122 -17351 -152220 88209 -147457 -183459 -154313 -142229 -68572 -60130 147788 -53084 -120836
9111 -120836 -459399 75001 -170094 -150011 223386 -143094 9089 -245456 -56092 -139563 63062
9099 -205220 -33043 -394671 -197455 -372673 -33240 210490 -279180 -228024 -47730 -101224 -231280
9088 -231280 -104704 -7585 -136131 102929 -243030 -89982 -254810 569930 -68755 -62587 -14294
$$ packed form
9170D4361K62240b96320a10030A71974H0069K5781P594m2650J37478a02991A6961
9158b29912h4085l21641J57679B76721e0280A70257b93284a36641j66926a15356
9147A65126b3614r9191r4399J01014f19B7754a75661l6619A82237k5821c13909
9135d231j44064B53767e1216j32403n7499i8542j19301K751K038h3167n1992A2779
9122a7351j34869H8209a47457l6002K9146J2084f8572Q442A47788e3084o7752
9111a20836l38563G5001a70094K0083B23386a43094I089b45456e6092q3471F3062
9099b05220c3043l61628J97216j75218c3240B10490b79180N1156d7730n3494j30056
9088b31280a04704g585j28546A02929b43030h9982j64828E69930f8755O168a4294
$$ plain form
9076 405935 -291130 -255830 178711 -119314 286763 -78518 -3691 69508 -115493 140567 -378376
9064 -352920 166988 -226849 -172471 -80214 -234248 -201362 -207268 -18785 -298393 369806 -172947
9052 70305 -108323 -27809 -140504 353407 -189499 -445413 -71213 -133988 -274957 26310 164275
9041 164275 -245645 -123086 162301 -393123 -287876 -121414 -35998 -81192 193026 -177560
9030 131117 263143 -199807 354369 78521 -9769 -34817 -377684 -59869 -140283 -38803 69720
9018 318783 -214724 -270368 -281475 86052 -33770 -161100 -379054 -209560 28931 -234878 125057
9006 105972 149994 45844 7175 132347 -223866 108147 -159458 133824 63545 80837 -258637
8994 252404 11164 -115432 -115802 -272256 27684 -42942 -214332 33038 139651 347578 284192
$$ packed form
9076D05935b91130L5300A78711a19314B86763g8518c691F9508a15493A40567c78376
9064c52920A66988b26849N4378h0214j54034L2886n906a8785k79608C69806a72947
9052G0305a08323b7809j12695C53407a89499k55914g1213o2775j40969B6310J37965
9041A64275b45645J22559A62301c93123J05247a21414c5998m5194A93026a77560
9030A31117J32026a99807C54369G8521i769k5048l42867e9869q0414c8803F9720
9018C18783b14724n5644j1107H6052c3770j27330k17954J69494B8931b34878A25057
9006A05972M4022D5844G175J25172b23866A08147a59458A33824F3545J7292b58637
8994B52404A1164a15432l70j56454B7684d2942j71390C3038J06613K07927o3386
$$ plain form
8983 284192 -191916 -113444 -44377 -79781 -99105 -42769 58464 42208 -352076 12580 181844
8972 181844 -185375 -409991 310467 110344 -2559 -269021 -165932 -68724 -17567 169321
8961 -42857 -215334 -129413 -210507 21078 -295045 87406 -24580 -161944 -127843 362739 299737
8950 299737 -70637 143840 305016 227827 -372105 52121 -307734 160231 -158550 19797
8939 -361499 35113 248683 306794 159083 -22671 409385 -54645 218230 -156569 -66781 -31578
8927 70182 179822 -89148 464888 731955 1811413 7145074 6174242 2323715 713162 175311
8916 358051 335394 -268235 230109 -72597 115010 -268545 63420 -81531 183170 -16129 92370
8904 -38192 -72363 46356 -4269 191875 52686 181761 -179806 -313142 -85232 -185660 -208074
$$ packed form
8983B84192a91916P8472d4377l5404j9324d2769E8464j6256c52076A2580J69264
8972A81844a85375k24616C10467A10344b559k66462J03089f8724a7567A69321
8961d2857j72477Q5921q1094B1078b95045H7406b4580j37364L4101C62739o3002
8950B99737g0637A43840J61176p7189c72105E2121c07734A60231a58550A9797
8939c61499C5113K13570N8111j47711b2671D09385e4645B18230a56569f6781c1578
8927G0182J09640h9148D64888K67067J079458N333661r70832B323715G13162A75311
8916C58051k2657b68235B30109g2597A15010b68545F3420h1531A83170a6129I2370
8904c8192l4171D6356d269A91875E2686J29075a79806j33336h5232j00428k2414
$$ plain form
8893 -208074 43158 -196865 -177598 127744 -140288 -94122 -208665 -9306 -137655 -95201 -85017
8882 -85017 22620 -237217 11600 -103788 202953 -70348 -133296 -49190 31057 59527 -741035
8870 86434 114089 -45518 -59546 -242874 -78779 -34308 -242975 59992 48835 -75655 -4679 57176
8857 -191435 -24678 -277275 -74528 -96500 -97013 11664 -86582 -136304 -58217 327035 160968
8845 99763 93925 -53078 -133494 -200023 98543 352217 22138 -87610 -150612 206376 -150813
$$ packed form
8893b08074D3158a96865J9267A27744a40288M6166j14543i306j28349M2454J0184
8882h5017B2620b37217A1600a03788B02953g0348o2948d9190C1057K8470g41035
8870H6434K7655d5518j4028j83328g8779c4308k08667E9992j1157g5655d679E7176
8857a91435b4678k52597g4528k1972n13A1664h6582m9722e8217C27035A60968
8845I9763n838e3078q0416o6529I8543K53674B2138h7610o3002B06376a50813
$$ [...]
##END NTUPLES=NMR SPECTRUM
##END=
