
##TITLE=AC1302_PERAH12114_7525498_Bu7zzF2CVs
##JCAMPDX= 6.0         $$ Bruker NMR JCAMP-DX V2.0
##DATA TYPE= NMR SPECTRUM
##DATA CLASS= NTUPLES
##ORIGIN= BRUKER
##OWNER= Administrator
$$ 1.72 TOPSPIN		Version 2.1
$$ 2013-02-19 21:41:12.274 -0500  Administrator@X
$$ Compression mode = diff/dup
##.OBSERVE FREQUENCY= 400.02188249412
##.OBSERVE NUCLEUS= ^1H
##.ACQUISITION MODE= SIMULTANEOUS (DQD)
##.ACQUISITION SCHEME= undefined
##.AVERAGES= 8
##.DIGITISER RES= 22
##SPECTROMETER/DATA SYSTEM= spect
##.PULSE SEQUENCE= zg30
##.SOLVENT NAME= COFFEE_meoh
##.SHIFT REFERENCE= INTERNAL, COFFEE_meoh, 1, 14.98509
##AUDIT TRAIL= $$ (NUMBER, WHEN, WHO, WHERE, PROCESS, VERSION, WHAT)
$$ ##TITLE= Audit trail, TOPSPIN		Version 2.1
$$ ##JCAMPDX= 5.01
$$ ##ORIGIN= Bruker BioSpin GmbH
$$ ##OWNER= Administrator
$$ $$ E:\/data/COFFEE/nmr/AC1302_PERAH12114_7525498_Bu7zzF2CVs/10/pdata/1/auditp.txt
$$ ##AUDIT TRAIL=  $$ (NUMBER, WHEN, WHO, WHERE, PROCESS, VERSION, WHAT)
(   1,<2013-02-19 21:41:03.680 -0500>,<Administrator>,<X>,<go>,<TOPSPIN 2.1>,
      <created by zg
	started at 2013-02-19 21:39:58.308 -0500,
	POWCHK enabled, PULCHK disabled,
       configuration hash MD5:
       86 BA 57 50 F2 9D 5C 9B 26 00 A9 28 5F 66 2E 89
       data hash MD5: 64K
       88 E3 17 F3 97 BF A9 0A A3 3F 95 15 35 A2 51 9E>)
(   2,<2013-02-19 21:41:06.914 -0500>,<Administrator>,<X>,<proc1d>,<TOPSPIN 2.1>,
      <Start of raw data processing
       efp LB = 0 FT_mod = 6 PKNL = 1 PHC0 = 0 PHC1 = 0 SI = 32K 
       data hash MD5: 32K
       A6 7A 3D A5 A3 BA D0 AA 49 8E ED 4D 15 9E 59 E8>)
(   3,<2013-02-19 21:41:07.414 -0500>,<Administrator>,<X>,<proc1d>,<TOPSPIN 2.1>,
      <pk PHC0 = 70.42236 PHC1 = 0 
       data hash MD5: 32K
       CF 28 18 AC 26 FB 7D 07 5C 92 6E 60 CB ED 43 C4>)
(   4,<2013-02-19 21:41:07.649 -0500>,<Administrator>,<X>,<proc1d>,<TOPSPIN 2.1>,
      <abs ABSG = 1 
       data hash MD5: 32K
       CD E1 60 5C 21 BC 27 44 84 6B 78 DB 8B 3A A6 66>)
(   5,<2013-02-19 21:41:07.805 -0500>,<Administrator>,<X>,<proc1d>,<TOPSPIN 2.1>,
      <abs ABSG = 2 
       data hash MD5: 32K
       B0 CF BA D4 7F 88 AA 2C 48 FB 1F 52 9A 4D FC 07>)
(   6,<2013-02-19 21:41:07.961 -0500>,<Administrator>,<X>,<proc1d>,<TOPSPIN 2.1>,
      <abs ABSG = 3 
       data hash MD5: 32K
       E6 68 F9 35 0C E6 0E DF 91 32 55 8E 39 D4 C3 25>)
(   7,<2013-02-19 21:41:08.133 -0500>,<Administrator>,<X>,<proc1d>,<TOPSPIN 2.1>,
      <abs ABSG = 4 
       data hash MD5: 32K
       F3 A9 B0 DE C9 48 B1 F7 F0 62 E7 FB 30 87 FD BC>)
(   8,<2013-02-19 21:41:08.274 -0500>,<Administrator>,<X>,<proc1d>,<TOPSPIN 2.1>,
      <abs ABSG = 5 
       data hash MD5: 32K
       F1 E9 DB 66 FC 19 21 CC 95 86 4E 8E 04 29 E3 52>)
$$ ##END=
$$ 
$$ $$ hash MD5
$$ $$ B4 71 AF B0 CE 3A 21 6C C1 98 D6 C6 D8 98 96 C8
##$RELAX= 
##$RELAX= 
##$RELAX= 
##$RELAX= 
##$RELAX= 
##$RELAX= 
##$RELAX= 
$$ Bruker specific parameters
$$ --------------------------
##$DU= <E:\>
##$EXPNO= 10
##$NAME= <AC1302_PERAH12114_7525498_Bu7zzF2CVs>
$$ [...]
##$TP= (0..7)
150 150 150 150 150 150 150 150
##$TP07= 0
##$TPNAME0= <>
##$TPNAME1= <>
##$TPNAME2= <>
##$TPNAME3= <>
##$TPNAME4= <>
##$TPNAME5= <>
##$TPNAME6= <>
##$TPNAME7= <>
##$TPOAL= (0..7)
0.5 0.5 0.5 0.5 0.5 0.5 0.5 0.5
##$TPOFFS= (0..7)
0 0 0 0 0 0 0 0
##$TUNHIN= 0
##$TUNHOUT= 0
##$TUNXOUT= 0
##$USERA1= <user>
##$USERA2= <user>
##$USERA3= <user>
##$USERA4= <user>
##$USERA5= <user>
##$V9= 5
##$VALIST= <valist>
##$VCLIST= <CCCCCCCCCCCCCCC>
##$VD= 0
##$VDLIST= <DDDDDDDDDDDDDDD>
##$VPLIST= <PPPPPPPPPPPPPPP>
##$VTLIST= <TTTTTTTTTTTTTTT>
##$WBST= 1024
##$WBSW= 4
##$XGAIN= (0..3)
0 0 0 0
##$XL= 0
##$YL= 0
##$YMAX_a= 548594
##$YMIN_a= -545677
##$ZGOPTNS= <>
##$ZL1= 120
##$ZL2= 120
##$ZL3= 120
##$ZL4= 120
##$ABSF1= 14.98509
##$ABSF2= -5.573092
##$ABSG= 5
##$ABSL= 3
##$ALPHA= 0
##$AQORDER= 0
##$ASSFAC= 0
##$ASSFACI= 0
##$ASSFACX= 0
##$ASSWID= 0
##$AUNMP= <proc_prof1d_extract_pilot.lims>
##$AXLEFT= 0
##$AXNAME= <>
##$AXNUC= <1H>
##$AXRIGHT= 0
##$AXTYPE= 0
##$AXUNIT= <>
##$AZFE= 0.1
##$AZFW= 0.1
##$BCFW= 0
##$BC_mod= 0
##$BYTORDP= 0
##$COROFFS= 0
##$CY= 15
##$DATMOD= 1
##$DC= 0
##$DFILT= <>
##$DTYPP= 0
##$F1P= 0
##$F2P= 0
##$FCOR= 0.5
##$FTSIZE= 32768
##$FT_mod= 6
##$GAMMA= 0
##$GB= 0
##$INTBC= 1
##$INTSCL= 1
##$ISEN= 128
##$LB= 0
##$LEV0= 0
##$LPBIN= 0
##$MAXI= 10000
##$MC2= 0
##$MEAN= 0
##$ME_mod= 0
##$MI= 0
##$NCOEF= 0
##$NC_proc= -8
##$NLEV= 6
##$NOISF1= 0
##$NOISF2= 0
##$NSP= 0
##$NTH_PI= 0
##$NZP= 0
##$OFFSET= 14.98509
##$PC= 1
##$PHC0= 70.42236
##$PHC1= 0
##$PH_mod= 1
##$PKNL= yes
##$PPARMOD= 0
##$PPDIAG= 0
##$PPIPTYP= 0
##$PPMPNUM= 2147483647
##$PPRESOL= 1
##$PSCAL= 4
##$PSIGN= 0
##$PYNMP= <proc.py>
##$REVERSE= no
##$SF= 400.02
##$SI= 32768
##$SIGF1= 0
##$SIGF2= 0
##$SINO= 400
##$SIOLD= 32768
##$SPECTYP= <>
##$SREGLST= <1H.CDCl3>
##$SSB= 0
##$STSI= 32768
##$STSR= 0
##$SW_p= 8223.68421052631
##$SYMM= 0
##$S_DEV= 0
##$TDeff= 65536
##$TDoff= 0
##$TI= <>
##$TILT= no
##$TM1= 0
##$TM2= 0
##$TOPLEV= 0
##$USERP1= <user>
##$USERP2= <user>
##$USERP3= <user>
##$USERP4= <user>
##$USERP5= <user>
##$WDW= 1
##$XDIM= 32768
##$YMAX_p= 455375520
##$YMIN_p= -694417
##$CURPLOT= <Network HP LaserJet P1505>
##$CURPRIN= <$Network HP LaserJet P1505>
##$DFORMAT= <normdp>
##$LAYOUT= <+/1D_H.xwp>
##$LFORMAT= <normlp>
##$PFORMAT= <normpl>
##$SURQMSG= 1
$$ End of Bruker specific parameters
$$ ---------------------------------
##NTUPLES= NMR SPECTRUM
##VAR_NAME=  FREQUENCY,     SPECTRUM/REAL,   SPECTRUM/IMAG
##SYMBOL=    X,             R,               I
##VAR_TYPE=  INDEPENDENT,   DEPENDENT,       DEPENDENT
##VAR_FORM=  AFFN,          ASDF,            ASDF
##VAR_DIM=   32768,         32768,           32768
##UNITS=     HZ,            ARBITRARY UNITS, ARBITRARY UNITS
##FACTOR=    0.250966925370066, 1,           1
##FIRST=     8223.43324360094, -45108,       35031
##LAST=      0,             -22034,          -179683
##MIN=       0,             -694417,         0
##MAX=       8223.43324360094, 455375520,    0
$$ Real data points
##PAGE= N=1
##DATA TABLE= (X++(R..R)), XYDATA
$$ [...]
23851 -110486 -98866 45145 -11789 226238 159123 -161440 173435 -273586 126002 111512
23841 111512 173606 -85380 -240360 25167 -31837 -89450 9596 40669 -92262 -67957 -101360
23830 -101360 57871 27524 105675 220338 -51284 142266 102838 67078 250723 92602 163588
23819 163588 112121 64925 121066 -179350 -80946 -330465 -223528 277388 -161752 -184940
23809 -184940 -344709 -148910 -55397 92991 -17144 161079 -157344 278571 -134693 264992
23798 -321052 -118441 337454 158073 102497 70983 144258 -288803 -151650 198711 -38301
23787 -230859 -10086 -90784 199943 -42978 -98959 98422 102756 -228837 -316319 -181895 -9522
23775 -95653 -60637 -268310 118976 -145508 194847 78204 1814 -76704 68017 -473 -33829
23764 -33829 -78464 208434 -152047 122028 282350 -157182 -169923 -374799 -48065 8743 -333991
23752 -48815 -39673 31098 -19022 -97078 142533 -86247 72078 -61265 -155931 45992 237287
23741 237287 -85762 -140317 -151918 -153722 -188414 -67567 106266 325141 -315902 -431195 17576
23729 -130278 48543 4661 -781 -137765 279153 -165803 -238395 -242618 -161721 -298603 -13405
23717 -12844 40534 468795 -301253 42317 62199 174498 168146 -253056 -22892 16012 57305
23706 57305 135384 47628 -73111 328551 210647 50008 -380080 -8829 -100732 229917 224919
23695 224919 -139812 -112629 328459 -214087 -167536 10516 -234623 41507 -353862 -150953
23684 -42058 77034 -372928 181454 151015 160557 -81084 66456 -44119 -143536 -353488 137662
23672 156509 147621 -83956 343159 49997 84654 -240984 -84588 -229173 -9329 -56404 -31012
23661 -31012 -22045 258414 63910 174281 -108313 -111757 107046 -182023 328678 -126200 155155
23649 394010 157302 260980 -81259 -285896 189440 -175874 37008 -129760 229367 461947
23639 461947 -274586 -308754 -139017 -81678 97630 -139270 7834 237402 185889 30875 -71542
23627 -139933 -203524 -229627 -243970 -111798 -22123 18440 66311 21487 -24350 -160279 198757
23615 145171 -144840 -330347 121552 -235825 -166762 -194125 143111 64237 -62349 -33473
23605 -33473 180216 83686 -16307 -434467 -92208 -157061 -179037 -259184 6500 -38064 -411617
23594 -411617 -10794 99140 339662 25690 -50837 45432 -139944 30523 -183916 -8609 326179
23582 279413 -143990 16089 11822 -146754 252882 -41208 -166964 -218026 280786 112893
23571 39622 48466 1368 177088 -317743 216550 -219326 -247400 268687 -22787 -103740 -48617
23559 119017 271767 76785 109469 -305426 -109527 295958 -115583 -129731 -18219 178161
23548 -114584 -275761 -12151 35818 407277 -233994 271713 197611 25650 133459 -64635
23537 56155 -176821 6472 46948 285127 -200632 66079 32 186958 -57294 -33690 -99475 -81771
23525 -81771 199916 120470 -128668 -302392 -188157 -252403 3814 -120419 -138332 -157010 255960
23513 -76377 299538 -328414 -70144 -100250 -370558 -1160 30820 -293475 42816 -89823 -240845
23502 -240845 -208238 34667 381988 -193665 67592 -139578 223795 67178 17434 -157488
23491 -271952 14964 -45692 49561 8385 55464 133968 -67584 23788 70317 80591 -151266
23479 -97442 -139246 263169 -81476 -330081 -80872 3367 -67220 83237 145154 -93952 -21539
23467 -121205 8493 -90379 -178829 54100 -178667 51024 32982 -16921 -30330 111753 62301
23456 62301 543893 160301 -24539 12760 -104428 282126 376416 4489 1920 46201 5404
23444 269592 -303493 -209743 -63945 210418 54010 -300764 -329188 7736 -284587 38394 -50961
23432 -159747 -111011 -199862 -102332 170933 -167687 -134823 -186273 -720 -99318 -138052 9960 220477
23420 220477 54934 -314220 -69010 353482 -34407 -476634 -29443 280133 14329 -299894
23409 -80807 -78094 -99836 261345 -121102 153662 -217912 -178999 79195 177683 131716 -214471
23397 -22835 -192260 -263345 115386 165339 -66880 185186 -99351 -78523 51080 -319307 -102283
23385 -160635 221139 -177694 -174385 176440 -37788 -128515 257676 -29593 135764 -8704 -157179
23374 -157179 -177101 38536 -3248 106590 119200 151839 -20456 27514 -149247 298846 -123210
23362 -220363 20873 237329 -63981 56983 -115656 -163988 79407 87050 -155783 34839 168742
23351 168742 33989 -253650 -331814 -211322 173339 -100593 148348 -29087 65773 -397724
23340 -113659 -6731 -20166 41543 10443 -162656 286608 127673 -195791 147349 -48050 109938
23328 182348 -339581 -412389 106548 -126597 -140588 11858 -244128 -18964 -206785 154281
23317 -141231 166016 46043 228945 -95862 11018 -403655 61499 -321938 192319 -354479
23306 -288753 62731 109214 -71047 -178745 -72260 132752 -635 -159770 141688 88196 -4187
23294 533413 6740 -119163 200534 -138525 -129337 -7281 20326 -234463 -111314 -124 -336169
23283 -336169 -177460 15467 12027 5931 -212089 87147 167900 328461 -257127 -141487 44034
23271 -34282 221377 89553 -154754 -166675 188041 189956 270481 -298466 -250221 318148 -281904
23259 235540 -140350 -87573 5792 194161 -27951 167501 -278394 -148863 118955 -227073
23248 159884 193611 -76341 21316 -193631 -217373 -106271 216008 -229307 310051 -49778
23237 27389 89811 412197 -91020 145335 -66970 -138063 -73024 62753 -49089 281116 101231
23225 5663 -164458 -245976 -275512 -72107 -20042 -59198 -191226 26731 137763 -58314 -155249
23214 -155249 -115593 271709 10961 290709 -421831 130302 251267 -138454 -56144 -47733
23204 -47733 29341 -271543 -598918 162769 -305558 -2276 -95407 -24018 -93865 140896 15296
23192 -184037 -196270 23821 -222040 -84717 -92311 -103770 14516 -89293 133191 85491 34230
23180 129418 -142620 -137428 -9824 110476 -84048 -63420 -94069 72745 220945 10639 -235969
23168 64040 -290661 185225 111001 1390 -223494 139065 16198 69775 354255 -136354 -42828
23156 164489 68077 -73180 70006 -265207 160958 -376358 89131 270914 -129246 -85756
23146 -85756 -44921 299136 26155 34336 -22089 -339047 30271 13581 116464 248883 232540
23135 232540 136557 -117428 102798 497174 -158740 154170 -69368 -77113 -54104 -72062 -81923
23124 -81923 -1530 94808 166956 197505 49827 3931 -295370 -81859 57217 66525 10516 -387267
23111 -71725 206684 89838 -65898 203385 -492509 55879 -323009 -3629 37322 -45109 84379
23099 62766 92974 -97351 4431 13289 -97987 28445 146276 327486 176302 262335 -53309
23087 346809 -9810 -97564 -223177 259821 -76664 82684 297565 -32813 -412835 -124341 50042
23075 -23370 37663 256072 272061 -134804 -124136 167008 41654 -49677 11446 -114392 -188862
23064 -188862 -13218 35181 -225153 -31815 21236 309062 217525 -110958 -7038 -71326 46279
23052 78519 -69306 -124027 415366 29603 261289 -146719 91740 1102 -278429 191859 151490
23041 151490 -349404 -88703 -60232 22422 40317 305322 104306 -199351 261683 43553
23030 84321 -309199 24682 -34780 33029 -256094 124351 110309 119814 -222214 75937 49528
23019 49528 182659 26193 -178913 164820 92941 -101679 71156 -179737 -334372 150962
23008 -379236 -32116 173478 -122133 -295607 42471 -175599 -64582 -120696 156687 -3990 190148
22996 -259929 32471 -83539 -164230 -97828 -244204 -98892 -267172 140115 32940 -157281 -5637
22984 141581 41691 -53732 -255368 -51145 -51630 -42459 42236 81125 58350 18066 182100 -82670
22971 -69321 -242248 346859 -106575 189851 -3527 -79082 155010 -219376 80816 -473890
22960 170047 -79989 -111971 -73175 -433 22403 102213 114764 -83413 -119167 86333 -121711 -51884
22947 -45027 11863 -22454 60261 -53747 53854 -27137 -30403 -35289 51842 106678 36307 122375
22935 122375 -208649 -234593 -210471 -401632 -138885 -449260 282684 293622 -113106 48694
22924 148588 -307768 52676 -136925 -256256 362513 -80291 298624 -173258 168185 84345
22914 84345 21541 126642 -33127 46436 -80962 266592 15113 -6319 72875 45807 -229237
22902 28630 73946 -219510 -496861 98448 -84457 57341 98560 186293 -99609 15796 24753
22891 24753 -222700 63754 -204782 -34888 -112166 23617 -211090 40601 -156190 -238154 -156579
22880 -156579 -163946 -219654 340959 230156 36181 96558 -11985 1725 -263874 -71081 -265401
22869 -265401 -121849 -105737 -32836 -171157 -60196 -209618 -182805 21873 -42574 56896 23873
22857 53766 -34591 863 -87143 29978 -97408 80303 7282 -225900 -89884 102772 193657 -159260
22844 -60673 -179355 -19555 151352 -233479 -185284 67938 206005 -92220 76012 47178 66632
22833 66632 -250968 -180205 209713 -39839 190972 -18590 247191 -173970 -3940 121336 -142137
22821 -135077 -108574 -37234 16335 96550 66047 -358068 -138906 -65767 -131538 -30613 -177795
22810 -177795 57985 228042 -67899 331730 22836 -19298 -103949 -173174 -60328 -112217 218702
22798 -15060 85739 -4988 167211 -211968 229 -163464 -112526 -445422 37708 106365 -31518
22786 -106249 -43381 138298 27860 107878 -85149 -184685 -173487 -127360 30629 -295856 -290733
22775 -290733 -65106 -154851 108119 406138 -293853 116297 -196320 -26241 -196585 16124
22764 -104676 122923 -278427 83167 25538 171016 -185182 -182226 -21237 55905 -282470 97053
22752 94419 196229 -258680 -185901 82369 21106 298791 99704 -145728 -37994 -33538 -49749
22741 -49749 -80189 149526 75472 32650 3836 32245 -83185 -58127 165780 64761 -141770
22729 -29169 -125889 -285652 -94984 -59371 76347 140120 39611 -111873 -51090 -57942 -29466
22718 -29466 -190291 -169347 134015 263201 -38360 65223 46537 239461 14743 -21929 -143185
22707 -143185 -72322 -187600 169328 91948 -178519 19503 8344 -231764 496153 -221958
22696 -229916 -162848 -256520 -11849 -11267 71588 -203677 99566 144029 -31966 109537 -79768
22684 177618 -61093 -197424 -292717 184050 -61460 5239 76693 57755 -89641 5684 -75386
22672 -44203 77762 -252773 -178022 -15444 40913 -328007 -239690 -201564 -239532 -131447 -324096
22661 -324096 -117600 -273442 265856 289502 -14876 -352519 146430 98171 -427285 311406
22650 167485 191012 -165551 221759 -166408 -33434 -91892 -119324 -190726 207968 -192431
22639 286267 65168 72582 -60292 336215 -233792 276933 78154 -112394 -212361 -47686 72573
22627 145281 -325708 150634 84213 -195984 308957 -158737 164962 19067 -144326 128035
22616 -51939 381861 336308 -19793 -235459 -431718 -233779 59691 -209648 -75556 -109634 49517
22604 175843 -6986 181568 39835 -57335 -210246 -27506 -222349 -65686 -179360 69830 217451
22593 217451 23174 -57552 -47305 -381042 97278 -59862 162739 51936 -123720 -165281 -235939
22582 -235939 295689 -60990 -14171 -70647 -112179 -404296 317005 -165687 -72162 7298 -333346
22570 263657 -313035 -70068 22531 102344 59436 398758 -22406 -65625 -121341 -116405 -219451
22559 -219451 249941 -221781 30975 69802 -155609 -124018 -243851 119940 103272 42613
22548 47159 137021 -105355 -252837 -80046 60826 157850 -91214 -243210 -296670 -140785 -266456
22537 -266456 -386960 137142 20951 107358 204631 83062 -37218 -42702 -127681 100545 -119453
22525 44391 42217 30111 -44490 28343 -57356 -191417 182584 -140110 -26814 124278 94486
22514 94486 -113412 -184784 -47256 -134235 -156924 -104988 333396 57543 7468 -139819 -163624
22503 -163624 55256 -383276 150373 -22703 158041 -240300 -170847 -17559 23561 1515 -194025
22491 -258810 -199221 -33832 -214946 184335 -210022 50918 -259474 -192320 -271779 -81931 -140287
22480 -140287 -157466 -109413 146027 -141839 55386 -340599 47712 -195305 19574 71199 -157951
22468 -197293 -196584 419590 -133418 141145 23242 -45965 213524 17715 44083 -253591 279606
22456 129871 35975 -250284 38012 -39430 -440751 218926 98527 -72176 178838 153366 -72383
22444 175583 225528 -170080 99380 -53922 -66215 126978 -299810 -313499 -14309 -116218 -75392
22433 -75392 -4987 255677 -297305 -62537 167310 -22002 -223916 -67529 273772 -449714 -179729
22421 -32656 -93353 195762 -143071 -192674 8314 276058 -29772 -49338 242382 -245415 -243103
22410 -243103 -177583 23705 9803 84759 160264 -385647 -46374 -139807 -262159 38877 -370602
22398 132608 39152 45996 36541 101631 -111552 -26901 -14279 185046 162162 -138342 91340
22386 -67727 301141 157761 -188708 262261 120932 -235090 172365 -17988 -120198 157436
22375 -171326 -319544 -102092 -186987 -191343 298728 -428636 -142200 148563 146881 -94023 -293153
22364 -293153 53522 -192902 -143265 5177 116235 -81995 -170329 210550 -371626 -185665 95979
22352 -373317 256053 129714 42424 -51927 -9974 96970 215730 218122 -16882 142272 276045
22341 276045 84811 -96888 -117429 157972 66254 -51880 184838 -219479 201639 -128172
22330 -379735 98391 -313963 25718 -24200 71302 -128806 -97420 145239 -147959 141441
22319 128565 4336 -91156 -19188 61505 105499 -146134 170250 -130464 -74391 25938 -47856
22307 109018 -272226 147066 12040 -83164 109056 34694 -207887 229377 218944 -183791
22296 26159 168002 -98521 18204 252123 16414 -43328 -50638 -38565 29378 -54179 -54163 -52687
22284 -52687 -337187 88166 -164292 34681 -67244 13846 7155 -250984 -111438 24040 191530
22273 191530 -276645 127286 -96187 -3916 139147 -166698 -184477 -273223 162183 152971 241903
22262 241903 -6225 -111967 -197230 -145 -100684 224754 120318 -123530 -316460 -217107 -32176
22250 -5375 156149 -47427 208646 -50137 -16819 227635 -358273 53077 -119627 -915 3338
22238 135822 -135590 -20202 -199674 -95424 83162 -165358 -88949 -135304 101222 -148834
22227 -9020 -45670 -135463 40856 -289677 287040 -62707 28931 -173877 -241957 74241 -20105
22215 -14111 114790 -107868 26564 -51633 -189823 -254729 240966 -2880 184613 189891 188283
22204 188283 147929 -138883 155891 63067 15484 -10827 283638 15660 -197616 163686
22193 -320363 -174031 -76798 -5024 -153035 -80237 -89488 136625 -24425 23259 -82755 10723
22181 -76185 -414971 -102171 -61311 133817 6332 61301 -193683 250034 191686 -108408 -87649
22170 -87649 208264 52723 67747 -90130 -271553 259632 134687 -225866 57573 -293312
22159 -566691 -241755 55897 -209389 -41932 -42252 164455 150045 48885 -171971 123302 -101232
22147 -220091 122518 -112061 60212 -357963 90290 548011 -445479 -45686 -94510 -59917
22137 -59917 112358 48823 -164054 60365 14982 -99210 -223723 111552 -178798 -155223 145863
22125 349052 -193323 -257353 233330 -52014 -135066 9403 -218909 191492 57906 -38745 -146277
22114 -146277 438699 219839 -119828 43562 -182818 -62377 -26055 -90963 148354 11388
22103 -164275 -141282 -48139 -318406 -191942 -280702 -221743 199232 -358407 173641 -123165
22092 120966 -16301 172384 -8686 -36593 90995 -433761 -54739 53434 -422642 -402757 132654
22080 -257147 -456154 -156420 -68551 18699 -65918 -73579 -183967 -155544 -105450 -340559 -102494
22068 -84683 79309 -371481 -217459 -14277 289603 143187 -189063 -83818 -150341 -13806 -190493
22057 -190493 103889 60800 19377 77308 46702 133392 -133307 -29823 -316722 -128344 194606
22045 -163387 7663 157214 -129484 131641 46028 -359269 -34795 128159 -49041 42786 22987
22034 22987 -50445 -21228 115651 2274 259751 -138812 -45982 -53184 -81740 -358243 93106
22022 -67519 86828 -31128 17880 -140892 -108852 -237930 -130997 -71967 -336356 -273793 -449466
22011 -449466 -285938 40226 350326 -14613 -201665 -200839 82674 152205 1146 198281 -224474
21999 -210804 101107 241170 76949 108246 60820 65969 -150951 59724 267161 71520 60637
21988 60637 244314 -188397 -18608 -143858 17548 59558 -168558 184944 34456 99106 -4686
21976 10828 308342 -171564 96089 -168171 -158790 9215 -283175 -416845 -130877 187449 -146716
21964 18259 200439 168086 -203840 -108687 -134296 92092 -160020 -50414 -278701 -219776 -51502
21952 -23736 -253360 -29201 -200122 36650 -154088 -55986 -228919 204380 -98203 -234919
21942 -234919 -127286 -29030 236615 -117218 -33504 -150903 -42532 238434 -75333 182807
21931 1488 172880 193714 91535 -127167 -343610 -95253 -225117 -156187 -98325 123247 -54675
21919 -332489 -46331 -142010 92551 32649 -116864 39338 -193217 13327 214759 163425 -56839
21907 -557744 -301776 -246972 -151030 252020 39069 214015 118991 -47884 -118533 -97093 85223
21895 -266747 -177040 -259210 -140357 25942 -83600 185350 -166460 -49107 -96183 -175520 135109
21883 -379880 33233 -376589 -145577 -58944 -4622 -158942 -76741 119506 36102 -187520 -249015
21872 -249015 -27630 -179382 -15338 270529 -194149 -130145 2037 -34382 -16571 -223110 201768
21860 -168190 -82307 31096 -74869 162944 -218500 109696 8162 -275573 -31460 265878 -71064
21848 117530 -177879 -178690 229618 -210681 57708 197832 -158239 37838 -83778 93693 130176
21837 130176 112555 174882 -191615 -140835 112274 7413 126278 116335 284609 112637 188009
21826 188009 -68492 -180240 -270656 -46040 -355068 219893 -11312 -141316 392010 -16113
21815 -47451 37233 99708 -104022 10906 -139849 -262989 179919 -2541 39237 -250890 -434652
21804 -434652 73698 -83851 -145786 -228799 154370 -245905 178386 -119526 -71070 130320
21793 -22248 -249332 -203106 -112793 -38290 45071 -160887 -29344 -98112 -278259 -61418 -14516
21781 -135847 65977 -242145 -175834 85754 245178 -32765 117116 -64767 -4689 187540 -10253
21769 41493 65553 -122450 103488 -173817 18253 -485477 -318589 -85584 176101 -207231
21758 204396 5144 -257112 -140308 -291192 19179 10405 61178 32263 236762 145729 -49869
21746 -82634 -131668 186312 -207260 -58647 180354 -31336 -154088 -185340 215543 34470 19440
21735 19440 -54042 -201699 -63406 52492 214041 86017 -125831 -84779 45033 98008 -52675
21723 65996 235854 -124284 104713 242563 32196 -133233 -432601 -180975 108584 -409354
21712 35585 -114055 280805 145350 153395 -60527 -24188 -115283 -389649 -49809 263532 13197
21700 149351 -124057 284719 -17563 162406 253233 85640 30494 -101544 199430 -70108
21689 -32852 35056 -99238 -11872 -123635 -314234 294858 250058 169658 -178597 -92891 44915
21677 407594 -347663 -83230 -71949 -62057 -69261 -196724 117128 -89760 -194127 397292 -304816
21665 -124812 39218 218770 -277895 -173455 -170200 -215441 -405964 154328 103140 115378 -132865
21653 -93741 272693 -7914 32919 295117 95733 -140881 132288 -275167 -222247 40754 -67687
21641 -170965 -197779 -314817 90878 -82944 -144909 54923 -159228 -70858 -85037 -137263 214834
21629 -193951 -260828 9363 -30535 45268 112257 -238654 -71345 204811 8010 -94747 -92872 -91056
21617 -91056 89522 156882 13212 38301 -13101 -205644 -47889 201000 -189067 -11388 -320345
21606 -320345 -37414 -185132 -64352 -294923 -169323 244891 -107989 -4910 115716 157884
21596 157884 74181 31096 132884 -298145 119490 38598 -31686 -15335 -24938 -165653 216257
21584 -85020 109335 -240782 -194705 -36314 -275894 -188973 -317149 -91754 -135177 -37724 -166240
21573 -166240 -240607 -89007 -23843 -367910 -120588 31618 -174565 85772 -166371 9870 68974
21562 68974 -268958 -143457 40848 -46732 -6118 40048 -415046 -9354 -806 -214057 -224928 -6343
21549 242923 94844 -235056 19870 -33036 75360 18258 -545764 -159785 -83278 -189076 124793
21537 -316737 -117819 -106770 62201 -154040 -121170 -84237 8602 65318 2750 128707 -92046
21525 -269534 -90749 387429 74627 -148101 -78727 -181272 61768 118707 -111290 -108159 283638
21513 -176061 39041 -152190 12116 -64858 -72720 115521 5953 -46942 -81923 143537 -261980
21501 -155003 -268599 -229863 231454 283732 12631 114548 98234 -74558 114744 -120421
21490 -168685 77529 -168117 204219 -182777 -97550 -109416 -119744 -198830 171649 129679 -68638
21478 -124064 235402 -275436 -79614 103051 10771 27462 -324874 54251 158439 -85701
21467 31011 -122940 99634 -220488 131214 103060 -22008 -199682 -352941 -357060 -198834 -21683
21455 40264 -223037 -1543 203399 -204217 301041 -58292 42555 -115639 -108392 85253 143204
21444 143204 -265493 -178743 -20708 32022 292466 274694 302532 611155 154257 362180
21434 362180 -56943 143395 -199876 -10163 73033 294495 154860 -93633 168830 -227051
21423 89246 -160894 214981 -129213 -41743 113730 -12239 -31533 -154311 31150 -227755
21412 -80102 -287018 -15077 179414 -114836 -40621 -67438 13938 -13517 -204811 238438 34339
21400 350065 -82890 -121748 -42176 -57633 -41246 148768 49689 13750 -139950 27312 -195173
21388 -95303 -148631 166203 52369 3413 43595 100652 -62450 -254253 -298538 -118429 193951
21376 -118859 -51595 -116945 26023 -195666 -173639 -157926 25852 -228150 22765 -77856 -101656
21365 -101656 -31363 -143916 -285516 201146 -363595 -449486 149005 209688 -227786 162057
21354 333780 -70675 -108977 -18346 -133982 -106079 113050 96792 67501 128050 -154716 -19581
21342 -139366 98229 74639 -67690 -70636 -275642 162563 -45303 -205011 -119804 -148981 -99954
21331 -99954 89179 14539 136356 -148275 -113922 -136013 -191069 66091 -22484 81915 -31585
21319 38559 95956 34896 20259 -149436 -116177 293588 49839 -283389 74272 66477 -287798
21307 115164 262029 -168837 -3345 18590 101552 -392843 -246012 20087 106279 -193400 -278854
21296 -278854 71609 -223508 -190244 140622 123460 135548 -156421 260420 136415 100317
21286 100317 109941 -21423 20393 27120 -131433 85312 96458 -156275 -236378 43643 -144807
21274 -105799 346798 203035 -133680 115887 79448 189086 -142756 59529 42737 -221662
21263 -79611 -45177 -27738 -272684 -133729 226389 -268979 -179807 -39525 -64961 -127730 -52667
21251 -279888 58732 139061 225734 -263477 217610 -155719 -22591 -30060 86965 -36200 -96010
21240 -96010 -248864 6409 3731 1541 -41795 -458214 -4485 -210645 150219 40469 -133793
21228 -277145 -179415 25434 242865 -107717 60012 34719 -111333 79796 -299601 173925
21217 93178 31039 -234136 29416 -67878 -280486 17851 294907 -273608 53872 171937 -130515
21205 -85042 -11622 -28038 224879 -148874 242703 192266 119876 -200010 -58761 -142897 173289
21193 -26277 -435848 139896 210994 199879 -381466 -27256 -8454 120874 80499 -283934 267103
21181 -67429 -264209 -20922 185722 268820 -325943 69886 -45338 64892 -133664 169097 -242926
21169 -377753 -254618 -232688 -145908 -164172 385268 99077 -406021 -341831 -322096 -147824 92445
21157 153578 -55039 231780 -117849 -169063 -43134 -154967 -27144 -287258 20130 -356201
21146 288582 -118002 54461 75296 -120608 134087 -171421 25028 -490214 -113326 -147088
21136 -147088 49946 -56758 145012 -247896 -115051 -257572 -182339 -326700 17874 -189361
21125 13259 417 -327088 77430 26431 -214686 -176601 -235426 107666 -293153 76549 221851
21114 221851 -72143 -74025 -178534 -259941 -247645 211027 -105153 284930 -295346 37571 127169
21103 127169 192289 -89253 48783 -35560 147774 49980 -52746 41483 -148238 -39203 -70571
21092 -70571 -63015 -152590 449 -101606 328198 -120438 -8208 68591 51788 74198 -203285 74638
21079 -191595 -95440 -11322 94219 -172001 49272 5432 -427356 20511 2763 -208659 28894
21067 -213261 -115527 -78586 46304 226752 -298295 28350 268724 -131081 86961 -116055
21056 -34645 181069 90206 35879 47498 -109279 60915 -101486 152099 49087 173488 215997
21045 215997 -35977 -116962 -137918 -14380 -28480 -28938 -174766 -68962 146716 -52092 25697
21033 -101304 27203 -271072 -354792 40037 -260461 -90578 -134637 35877 -80498 -77969 33826
21021 -215768 191360 30972 110251 -216536 -356658 -5576 -273745 -85203 -59380 -34499 7640
21009 -432391 -12344 221096 -335766 -212276 -102982 76805 157645 116952 -5814 -12857 78059
20997 6233 -106037 -7232 87663 149230 -196020 331625 -293520 -61952 39369 -180602 -50348
20985 -63388 238740 -367323 70363 -85540 -121820 -139351 170068 53433 18567 -145588 -6146
20973 296177 -203331 209300 197177 122157 -94309 -235522 198511 -74959 -226299 -108838
20962 34307 18435 -261668 -10683 127970 -210814 6459 -173402 -152648 -99949 230804 -409062
20950 -25612 -236222 194852 -340822 26451 -91458 -165515 -207393 -251017 -57695 79556 -64154
20938 -77927 225813 -95729 123492 222284 -143609 25873 -36191 71511 -153974 223955 -184126
20926 -38126 139329 -268591 4408 203092 -5769 151615 275797 213652 -345420 163693 -93350
20914 -66147 -78490 -75179 -126566 204485 -86651 -60407 92418 -97747 -151032 -44292 -189871
20903 -189871 -77463 -155171 -42153 184270 -285135 -24468 61383 131280 -169590 -68681 156534
20891 -168404 -158884 -124933 -6266 -102068 -226065 48266 -202284 -211100 -213608 -235704 -267584 181919
20878 -166416 -54092 -98568 172734 -297231 -30798 -146998 -110017 -78383 -226094 29978 -92710
20866 -104916 -60472 -141994 -29605 -106893 136547 -12969 32824 450757 -335215 94728 248565
20855 248565 -30041 -248908 332296 -132047 -55805 -178668 -32634 -196754 -115063 -287145
20845 -287145 -33046 -525466 -180185 -328695 -194979 71877 54154 -4968 57523 -61935 -142854
20834 -142854 216748 -203252 -31493 -146796 66743 50749 -54903 14107 165984 -277047
20823 -94132 21171 -224573 -58559 60420 -264137 -96799 91950 -113970 216415 -137742 -325177
20812 -325177 -32231 -61040 -167029 341400 6797 36942 -21106 -240693 -97452 -172578 -106442
20801 -106442 176551 -103828 -87796 -264998 34309 180709 177801 -282118 14478 -311771
20790 -265013 -22409 182345 -183203 114791 22014 -213443 44115 -356258 -261232 -46867
20779 15741 -33155 98237 -117566 271555 -62747 -80679 -47333 130640 -69887 -45726 -190684
20768 -190684 -78840 -13615 27884 186182 -318504 -384672 -34048 150492 -9323 -55428 -96217
20757 -96217 282653 -83246 52098 222873 136242 -13644 -289936 -204278 -156757 -94268 -165480
20746 -165480 2427 10883 29851 -105541 15321 -82721 -241452 118751 -159527 59078 236983
20735 236983 -128689 -14431 13584 53011 320377 -33049 -191189 -35047 -69707 -123474 -79749
20724 -79749 33339 -58867 -104946 174738 -144459 -132094 -66379 -79706 -208078 53643 -353468
20712 202776 64327 -310171 111195 -64523 -74494 263265 303884 -251231 17025 126817 27634
20700 -542321 -146931 58960 -41485 124786 316085 -183494 -66611 -141974 8583 50376 121748
20689 121748 -120803 -83392 -171187 -94427 -174491 33981 -44232 -246390 -401088 -226701 -128044
20678 -128044 85343 -201260 -360025 58647 -87163 -51812 -325924 -215037 -260215 -7356 -158464
20667 -158464 -60980 -138560 51055 -264641 -288091 -26718 55549 -448494 -150136 86983 -70233
20655 139781 48530 -39930 -158932 -359674 -159097 -340619 -25269 114357 -116258 96270
20644 183123 -164422 -104943 50301 -41159 -6396 -89661 -46236 -82756 -80778 29533 116342 2294
20631 93447 -78739 -226705 -149965 181933 41253 -209019 241301 -7133 232905 -10446 -756
20619 -53039 -241475 -149729 -32590 -282579 -88695 -30330 142858 -12835 -139990 5606 -185752
20607 -241882 -81268 59250 -311893 -277987 47320 80715 -92309 346199 -187917 -52187 -107865
20596 -107865 296761 172574 -75448 -427983 45546 30752 -413355 4746 -202796 -87534 57843
20584 117243 -163351 352486 -7762 -111733 -203701 -176265 27568 -257562 56798 283456 -76759
20572 331896 142051 -21481 -241061 -301863 -386992 -85842 -125186 143123 12164 -105674 -97397
20561 -97397 -136856 68265 8567 198394 152286 -280149 71778 -240456 9363 164933 109570
20550 109570 -117076 158847 -90325 92206 -181293 -74448 -222036 -192322 22237 -116161
20539 -110526 -252848 -8214 -209505 -67283 -55077 -94015 46376 145747 -211269 227658 155507
20528 155507 -102482 -89499 97987 -161029 -31080 -142520 -192061 -96151 53858 -108459 113726
20516 -118580 -95259 152880 -65991 -138000 -9934 -255782 34428 -96460 -563527 -95186 -25826
20504 -25921 64902 -128922 -120602 22316 249684 80882 57015 46099 -211333 -332956 -70215
20492 170352 97436 -66626 89320 67493 -174146 -18968 -44709 159371 -29034 45553 23818
20481 23818 302457 71467 80007 -130627 63983 344893 -195366 -393923 -103966 -171658 123603
20469 58717 122675 23655 221241 -158245 -314005 85788 -123011 171863 35823 22186 -23243
20457 176274 -151424 49861 -3840 -207897 -52165 105209 -151151 134711 -207448 -89582
20446 -316277 -67063 -202134 61504 -55624 -220134 76616 -4051 194252 -150544 236174 4006
20434 -78328 253737 -105321 152213 -252822 -104119 -273717 -69639 -216277 -26751 73813
20423 -255802 43574 -56898 -155850 -300775 -317657 -157466 -64316 -104773 -38032 -180353 136932
20411 -69383 115734 112862 -60939 51297 -160852 -144296 98924 -205567 69789 -60009 -123829
20400 -123829 -80344 -197575 -30377 -84838 421401 -354121 -60931 474617 -44947 -261635
20390 -261635 79116 47012 -187058 -219604 -180012 -82529 263 -13167 -244494 -393486 -390183
20379 -390183 -268313 -143217 151492 71339 206813 -94981 -323793 -19107 -53666 46796
20368 -76743 -247005 206002 -124603 -22828 -280462 -197270 98289 -273872 -117749 -118505 31427
20356 -121332 117069 -36882 -134589 -59565 -21767 126802 -269411 -214995 -165277 -181211 -351317
20345 -351317 -267345 -26468 -34877 227043 61555 -319588 -60735 -32763 139677 -130198 -358918
20334 -358918 -337888 -252260 -144847 -218155 -111986 -118468 44445 -52659 -128457 267088 -285442
20322 14915 -90070 143637 -233245 108172 -10080 -155118 -37200 -415745 -166565 -292323
20312 -292323 -68992 -67998 -86101 221785 149561 152607 -200510 -290413 -28086 43548 55738 -14873
20299 25604 -1978 556145 -189979 48242 -42443 212412 -178089 -93310 37809 -299173 92336
20287 -311817 -199017 45829 93783 104168 162781 248909 -365750 -296469 -234922 276970 96248
20275 64025 -34674 -198213 111918 61032 -315972 92921 -235378 -98772 -86442 -231233 -184086
20264 -184086 -110650 56155 -78315 -41016 157093 -199504 4593 260258 123731 -111095 -126217
20253 -126217 312214 -212175 203633 248448 -129736 203059 -333705 -149705 59628 -217194
20242 -153816 -329929 -298618 19899 -6349 -11016 104215 81456 285245 -122080 -323497 -315992
20231 -315992 -334868 -533611 -98684 -131431 413560 -218939 -101520 -478253 179027 36742
20220 43148 -126114 -500979 -238906 -301323 -107337 -29426 -57384 -97140 14259 -330027 -303705
20209 -303705 110517 -204238 -10420 -332630 90591 97220 -168545 -26917 -14341 -41758 30292
20197 -115610 88432 -246043 -62477 229082 195478 -267529 45115 -9387 181046 17199 -98773
20185 -120003 -88183 -197992 -4674 -181814 -87130 -89095 124201 -160528 24557 34240 2942
20173 -194667 -205386 -329801 130951 -38712 47825 23091 86723 -25588 -152164 180806 -43786
20161 -156243 -206190 -265 5495 89604 134714 211953 -64267 9400 -63093 -180987 -309445 457062
20148 73468 -18391 559711 -346623 262517 280295 -130782 -21875 -21571 138965 -334542 -95902
20136 148148 58315 -89383 17408 -82264 -180009 -300204 -168748 -138883 -130628 -56440 -127717
20125 -127717 120275 150504 -119426 -130829 -330383 -35037 -145481 249415 -52358 -73417
20115 -73417 35353 80687 -110646 -292363 -150193 53680 -125815 -72829 -298781 -192122
20105 -192122 -154927 -123550 123164 -211068 -108731 65759 -8907 122656 -15593 162919 -102019
20093 82049 -68897 96890 -307766 -389 -123153 -251278 16172 44862 -263592 -121940 29108
20081 -160296 65591 15328 -72913 -191661 5425 43982 -84173 254292 -241499 -115676 -199644
20070 -199644 6510 -172075 127387 -22568 -149677 -21071 -85367 80901 -281830 24393 -46104
20058 17013 -143437 -39794 -35560 -24263 -265480 17288 -210777 -34739 -145139 213411 209994
20047 209994 -232252 -44054 190535 -26689 -101397 -5965 -139320 28404 -160385 -273192 50250
20035 -59813 -85571 -43520 -131892 -20252 47818 3325 -216831 -56622 -18027 87569 11980 -150865
20022 44831 -68904 -36322 -235199 -169476 120269 -147361 135165 -334119 187986 18287
20011 -15678 20528 -454184 -184564 -364643 -2412 -42602 127669 -109805 88877 -73068 -164710
20000 -164710 143725 -114503 43282 40902 35559 -313732 46147 -111484 -39862 69269 -291371
19988 146145 11262 74451 -227917 -149396 35446 -244771 -234416 -175253 82088 81753 -259782
19976 -121483 -157442 21017 292645 -207546 224336 8137 83927 -43083 -226534 -92268 29834
19964 -17971 -224695 -101376 -287188 24102 -294108 11562 91715 -159708 -98194 46032 -74740
19952 -358502 -114548 -31621 -306245 -361946 -338457 -335343 -20426 264819 -2286 -192556 -227261
19941 -227261 -156709 214183 -68180 -451366 -141474 -427526 -99191 -37253 149626 59333
19930 227514 -106666 29440 -168159 199217 55498 88075 -55402 35473 -305109 -11334 4528
19918 -90545 -118588 -49246 -62933 58999 112511 -23458 -179701 89307 7711 21885 153993
19907 153993 224854 31601 -161291 135118 -136684 299993 203689 -5127 213496 -213440
19896 142388 49189 226996 91224 -94553 -305598 -92564 -24301 -112427 12838 -137921 21231
19884 143894 146389 97211 7708 -244604 -14900 71329 -87547 -28665 -134563 -243247 36498
19872 -130287 -299651 -339946 -352537 -35825 40087 -36765 -171059 -384466 131921 -219327
19861 -60942 -94236 -91516 -291617 26663 -147563 -96798 -46273 -121016 139849 -56464 -153287
19850 -153287 201266 -57982 337309 -183564 6207 68196 -25748 141036 67809 -133035 -172365
19839 -172365 -113456 -27550 -178610 -91014 69894 67339 -191249 -430394 -168028 -245184 -203380
19828 -203380 67200 -261983 -66002 81256 184043 -238591 -324384 -480742 134772 -60167
19817 -263366 -160786 -156810 -88216 154443 79187 53049 109195 -115106 -249728 -83657 -98618
19806 -98618 215475 26395 -51696 47842 82322 -125298 46281 -193571 -60481 320172 4774
19794 439750 -148647 -171829 23971 -382070 166150 -92582 -163106 -13516 -320357 25030 -186203
19782 -80989 -527819 83816 -58585 -110261 -82485 -165539 -24965 -217191 -149154 222336 -299599
19770 -324267 -186833 38853 185993 -117516 17586 -51036 51143 -75343 -29666 -123430 -75967
19759 -75967 -42770 52704 -243891 -112730 20663 -4442 -105547 33301 -168897 -206266 6284
19747 177965 -135181 17340 -18278 37529 187666 27050 30332 220701 -285756 24100 63918
19736 63918 -45841 -251010 25803 -158192 440423 226696 -56885 -33247 -92773 -404839 -3006
19724 -1365 1882 28701 -295694 130002 -57453 1760 -349102 67474 28356 -12932 -237774
19713 -237774 -301357 -407021 -104851 -48912 -205413 -187532 -213785 -75649 37329 -500157 -156370
19701 76237 -186916 2920 31815 -141280 33011 -258081 27401 134793 -73919 -54250 104366
19689 12715 -120535 -73457 -23679 139917 110350 130227 -105352 -47804 70615 -238929 -254089
19678 -254089 -22595 -108544 -8566 150915 40612 -24987 47386 196431 -25253 256689 -52714
19666 231994 26736 149047 -42711 -92142 -186728 -26561 -160446 -102308 15965 19062 -89938
19654 40210 34715 -213974 -87941 -115405 276374 -55 -53755 -15976 -268636 -115392 -164884 235324
19641 -14728 -23209 -18953 -113641 -200381 -59763 -252771 -37804 262967 -56057 66799 2309 -193037
19628 121279 -485051 -95418 -47789 -345456 2736 39164 -252498 75390 145124 -269040 204655
19616 -128175 -142278 -29689 -278219 -86515 -178070 -196974 -93062 -94669 8047 114675 48781
19604 -92630 -153052 432308 225988 178155 247115 -228743 -79679 70969 -270361 124977 -18390
19592 106683 -94414 -158061 -217190 -180980 154438 -410888 -168152 -530457 -48542 157904
19581 334742 -126161 -45355 199297 -38599 -105391 8424 42726 129582 126193 150130 -132955
19569 -19907 -6162 -232257 48645 -249486 167953 -187449 -534860 179516 -323905 -409649
19559 -409649 -75841 -57041 -90367 -273388 117260 286662 138925 -80057 -447120 253248
19548 64840 -162935 180974 13156 -180359 -460156 307399 -73588 -283317 25544 319908
19538 319908 77760 -355785 142823 13048 -245416 75556 140521 204707 -119995 20822 -274912
19526 3231 -207701 77048 73950 -432199 37638 -240250 -218823 -71045 -188888 -344479 -195732
19515 -195732 -408133 132216 -200588 -127086 -54870 19053 -5613 -142268 -109940 -265811 -64812
19503 29308 -306874 -172743 -107860 -41041 94276 -85524 -92078 -236546 112850 -150286 385000
19491 3665 -130928 -57368 86046 -8322 -145867 -154860 12995 -14024 -135529 -239873 -230555 63163
19478 -194048 155732 -170194 -362422 -211022 7154 -300162 117749 -151526 219943 24135
19467 -100143 445668 212416 40161 -250153 -355118 -73647 78354 57842 -37881 136471
19456 -5111 -179136 146686 -200068 43020 -57130 -7075 264157 -201384 -13161 65719 -61530
19444 -488578 -70891 -152808 108520 -314140 -280815 -187284 76355 -173035 -237697 276039 104413
19432 -110132 162704 -205525 -73717 16947 90614 10459 -55363 -146037 10860 48454 -29947
19420 -55677 -154188 -153530 5042 -361016 -265 -244217 54876 -24254 1198 29473 -252152 -72071
19407 -274984 -165526 -101863 256621 -83532 -157383 79344 -301897 -3100 -59216 -250171 -380621
19396 -380621 -115810 69998 -176922 94031 -178668 -44448 236512 -52109 2964 -195587 -114294
19385 -114294 113603 152417 -297394 232681 -85668 -75563 -159644 -167350 -118029 -39690 -366315
19374 -366315 -171544 -55952 -373132 -22698 -87929 45645 -110620 -21949 113925 -54164 86618
19362 -412069 -142104 270493 -743 107609 -368182 19151 -85203 -285391 -74511 -270781 -164992
19351 -164992 -390886 -76462 -66798 383062 229197 7791 -53212 142186 -207277 -188655 -30900
19339 -58058 28741 14507 -93573 -148427 -161552 -16166 11648 115850 -102778 -250969 -376679
19328 -376679 284958 -199728 49076 78996 -265245 -285023 -7448 -231729 -272272 153349 -111707
19316 50607 -118687 -164567 46527 7360 180503 -206973 104286 303789 -302054 107694
19305 117452 -290511 -104638 -442149 -67114 -188770 99183 -261344 -20482 146797 13317
19294 73184 184400 69139 -41037 191650 -113021 207939 7250 -91369 -415987 51172 -132528
19282 29714 -104654 -13317 197901 17632 104538 -463785 -99006 -268061 334323 -189365
19271 -373227 79926 -303298 245786 1655 -137354 152832 -406648 35789 -199190 -333370
19261 -333370 -51045 19609 -233563 -14811 1680 69467 58028 179782 3121 4563 -16081 -39253
19249 -39253 -211757 -86701 -187512 50997 -205647 -368268 19092 6579 -189814 -246802 -150952
19238 -150952 151630 -171565 78348 -190363 -114995 -227042 138343 -58508 107300 -85626
19227 399371 330445 -171446 -47981 -41234 -73613 183592 -440533 209572 -236185 -243009 -174976
19216 -174976 292806 -337702 113853 95035 -418042 -128996 87515 -245794 42360 -208741
19205 73063 -35532 32454 -84294 -46165 189718 -202476 -24382 98890 -475445 72990 -174587
19193 -136004 129930 -351532 -242828 -110606 -224326 -178430 11273 435263 -38583 -203271
19183 -203271 -144122 175376 -95260 175098 272019 425645 -6106 -109433 -136028 -155335 -144478
19172 -144478 -89991 -14896 -264237 -263336 -307487 -33450 -178846 -34640 158599 -209515 -20827
19160 -222471 -93314 197130 391094 -28016 -47609 73808 134033 -13545 -164260 2499 -53907
19148 -366370 219259 -203498 -143998 -225220 -207875 58850 -86101 -157758 -172577 -109802 -106148
19137 -106148 -6602 -94245 -252962 147199 -113761 87170 -309922 -67941 -80158 -241826 -290331
19126 -290331 -101346 -249497 -55050 67449 -131380 -105042 -92743 303891 106211 -24001
19115 -24499 -123264 -213189 93072 -95776 -146190 -278672 -126425 63366 -207976 34971 151894
19104 151894 -183776 -341887 -98235 -25977 -92887 -326960 67116 82948 -299550 -143572
19093 -65553 -54333 -4616 -164062 -136737 114252 556 -322347 -6546 -27515 83009 -331089 41473
19080 112925 -238240 -34546 -236714 -42851 -94002 -245436 -125511 63013 15737 -171378
19069 -42276 25646 154069 66797 -103919 -7708 -331866 -86802 150693 154781 -209258 128632
19057 -144343 -78473 -252215 -271213 -121864 -41426 -96228 -110441 -73731 -110267 -244680 131724
19045 52675 19854 -118263 -224453 -361752 -50234 61109 171565 -105186 -48014 -64872 94776
19033 -14487 139498 -43281 -44678 -71050 -175508 42710 128236 -179970 -23004 -3098 81164
19021 -202159 157472 102730 -6958 34567 -12076 165121 -39108 -48301 87578 -142071 190021
19009 -199780 -204996 -97732 14788 -142217 122216 96681 -66824 6146 155787 75529 -198902
18997 -159873 -349644 -52746 -30947 954 -158068 216359 47518 -276381 123853 -86973 16059
18985 21323 -190510 316192 155708 -243763 -121363 -120846 173062 -163175 95312 -108927
18974 -326496 -79640 295856 88074 -99035 121551 -269032 -216459 150058 61087 -264663
18963 -172454 -162594 -30819 -8712 226317 233514 144740 81320 -32753 -175465 -106312 -21825 -189527
18951 -189527 -133291 146587 63516 -35571 -299263 135498 -220341 -34927 51913 349322
18941 349322 180944 -354137 41353 -80219 101169 -244733 -278453 82537 33046 168166
18931 168166 -108331 -31455 -266086 217182 48682 -103047 64914 -39260 57053 -383459
18920 -121392 -95314 -45117 -242841 -119130 -309275 -145786 -213367 -13076 253029 120502
18909 69879 -101967 -55825 -142900 133122 41358 -208926 237946 4104 230025 -101445 31702
18897 102643 45557 48134 -35870 124710 -127932 7049 -33726 -69498 -103934 -262975 -8519
18885 -211099 173675 -29514 -104669 183200 -90904 -16835 144443 -8277 -166285 -100894 107391
18873 -397174 -105257 143285 59556 -23902 -218982 114431 -294854 -160264 19351 -164023
18862 59918 126932 208191 -22898 -281814 117737 -109998 -161410 -69944 105728 33469 -13420
18850 -575705 -165765 -210772 30281 -114204 -37473 -12169 -344925 -144918 -315801 -1583 -62321
18839 -62321 -353030 256077 101819 -186394 -45996 -141799 311336 -330049 -17316 -198040
18829 -198040 -195638 -68987 -362644 152864 189444 -354412 227881 -152592 -127653 89434 -37822
18817 115250 297859 -112714 98383 131792 116694 -223915 105824 85391 405988 -242933
18806 -1648 116469 -151862 191855 -132315 50032 -123318 -266583 -122141 85358 -161758
18795 -233030 -298926 35933 -20961 51018 10964 82173 45168 -75002 -44950 61224 -68765
18783 364285 -286965 299967 115590 -127914 102646 -281845 -237980 -163047 -91407 -84466
18773 -84466 -42644 183944 -18344 239990 -141248 -76517 19333 -127470 5019 -288525 -72562
18761 195463 -378405 -128688 215576 -85529 115868 147329 263304 -371767 -155416 -160007
18751 -160007 -30141 -152086 108877 241952 -56287 33483 -324792 -44 2442 -408672 -206541
18740 -206541 58730 66268 -175168 -245166 -261284 -114074 -327094 -432738 257089 27316 -326170
18728 -118651 91332 225836 -247918 -14439 82128 -92081 34303 -11866 -126266 220921 -184934
18716 18063 -86102 148514 87419 -96986 -243017 -8102 169090 -159808 87550 68799 -216373
18704 -136155 135782 -134150 -159975 176591 -80106 267434 183960 134893 -125799 40386
18693 420489 90241 26948 -132356 -165658 -41911 15602 -337538 222622 240804 27240 -358386
18681 246850 -61322 -212176 176772 -427870 -197550 21680 19638 -126078 53262 60699 -175166
18669 99120 -13266 -184676 -192014 -106029 108719 4065 -98764 63163 405572 -151968 -1459
18657 -14320 -200365 -106319 -136697 -239143 -165515 129362 -129021 -87752 -275274 -384885
18647 -384885 -375802 160703 -52736 -299374 -46673 -32660 -62129 12193 77506 216500 157735
18636 157735 -62426 101146 63227 108380 225797 -145354 -191410 115798 -86149 214517
18625 -185207 143134 155345 -176466 -43958 168809 -73308 49030 37525 99567 5404 113166
18614 113166 325878 -210821 -68299 116911 -63562 49227 -89614 110900 188349 -520000
18603 91953 112470 -61754 -72616 151884 169117 57183 -20697 -118302 -209179 -36147 -295263
18592 -295263 -308395 -44080 -68386 -96970 -164513 67877 -125818 -421997 -30207 -84535 251787
18580 139722 -151519 -10356 -25394 -140152 -119471 28672 100258 7367 -238315 100524 -150465
18568 30965 -57689 -31826 -123088 -293236 29790 -239921 -200090 345040 48006 253221 41946
18556 -104497 117093 -233114 -81302 -160271 -245180 -289026 331629 198509 -245164 55786
18545 -66047 -136443 77360 -269834 112260 30752 142528 -398565 -30215 -217145 -204189 61339
18533 -132056 -24133 -105883 187009 -168649 -189945 -150964 -145941 232663 -245968 -260999 -27626
18521 -81003 111170 -106602 177017 26633 198691 33842 162242 11483 -65599 -113777 -213541
18510 -213541 -77488 -117929 -243196 58195 -126543 -52900 -105699 -241340 191063 -236450
18499 -81243 -21115 -194364 -169280 -73813 -24663 -159514 -4406 45744 81454 296239 199941
18488 199941 126143 -121821 -181202 93051 90801 -360607 -164472 -252691 175148 -167582 -191735
18477 -191735 -75641 93018 33710 -146497 -2566 -13112 -106451 -158766 324512 171796 -124844
18465 37614 -324794 2244 -46933 39252 -210179 -83483 17916 -358367 -57893 -101027 -62332
18454 -62332 6534 -41294 -179062 91914 -184845 29960 143338 234869 217573 -95386 -39981
18442 238226 -12984 -311240 426901 4139 -112612 51747 -294369 -45871 -187533 -77215 -107872
18431 -107872 -26842 -198758 31067 -265181 -97929 125510 50581 -178844 59626 -55021 -210880
18420 -210880 -206669 -92438 -135408 -32537 -32997 -212648 35574 -139008 -21563 59447 -69699 -141653
18408 -141653 -258516 -294632 -93714 152352 -19407 135088 287421 -38424 -153071 -77821
18398 -77821 -135488 -55539 184347 83646 -325709 41695 159 -88786 -219761 79612 -266528
18386 48503 -218706 149249 -243629 -67405 -176294 -147091 -111895 36844 492949 52496 75888
18375 75888 -27503 157540 -42762 31378 77372 -88984 -159140 -213825 -179293 108735 75113
18364 75113 192956 178532 106280 -119034 278807 -310020 303435 -155490 96570 -46627
18353 -153246 -9362 -362381 -45690 36915 -342617 113870 62587 -164857 -32937 -50456 393717
18341 -321746 -133028 -50664 -118173 4105 13645 -129201 218313 -185617 -64062 315534 -64000
18329 107318 -27570 167549 -280195 -237733 130820 -90830 -85904 -73615 -116175 -8499 1389
18317 -117769 -270033 -266329 -144859 -132606 132508 115948 -23200 -28360 -150956 328059 143403
18305 -6648 -360876 -63299 182953 2364 -119539 147661 -8832 46956 -180565 -103000 9616
18293 260792 280650 225508 111721 123811 -188225 -113091 48579 86575 9223 215917 -116713
18281 115677 -53178 -85206 -155823 -163858 186083 -211988 -216105 -71243 -33730 -63387 109007
18269 156790 -261578 19615 -212828 4505 313103 -133361 -25342 -98024 131565 153854 -104037
18257 -238563 -85449 -32732 81492 -463835 42181 -28116 108602 110305 -102692 -116498 283742
18245 139576 66525 -8957 -252096 84019 -202746 -58313 -249365 -219705 -100485 -227851 -222347
18234 -222347 -243211 -95136 -432090 -80530 -141383 -65734 57663 -257202 -165741 -342041 -290777
18223 -290777 -55383 -118862 -190450 -30953 -204626 183411 -108163 -19406 127634 177011 43432
18211 -435279 -8298 -104199 75324 -26070 -51710 -99743 160549 -63918 94323 78666 122705
18200 122705 -85739 -98705 129239 172105 -7259 192945 -36956 159714 -346825 264313 -42075
18188 -219134 -39137 142958 -184634 327948 502 -128129 45590 -167460 -44200 -94058 -37822
18176 -4790 -207005 50917 -151812 -11380 -250346 140551 76518 338708 214521 162291 -63971
18164 -309900 -248291 -178052 -168391 -20661 273088 -55019 -389131 -56850 171847 -327726 181913
18152 173998 187387 -73756 143897 -315316 74264 12222 191257 -313675 -108944 168252
18141 48574 104751 -222684 -124513 -97103 30884 -104369 91313 -45420 -80797 -66076 -294087
18130 -294087 203678 -78739 -67841 -55342 -75430 31335 -64400 55298 -13964 68240 -422443
18118 -19980 -23148 -553378 -41586 -7899 -13068 -49293 -44363 -302720 129297 -302628 -286513 -12350
18105 -104578 141643 -267859 187845 -184253 287495 -446273 -107880 115231 -244980 -98358
18094 -232832 -352567 -29603 -55464 286720 -198890 -15754 47215 156721 147951 -96258 -70999
18083 -70999 -346348 215123 -82053 -102404 -37133 -24226 -32057 91207 -236822 -269406 15254
18071 137876 -112721 -168599 -495374 64586 -7206 -187816 -24599 -42196 -182509 85792 91426
18060 91426 -63244 129955 -273588 68087 -23819 -163545 106569 -77873 47158 -199907 -10937
18048 308661 124114 17295 -70202 -61542 -122870 -81527 111463 -53124 -252105 136103 101148
18037 101148 27574 129879 -10251 70558 -233351 -125023 -85282 35059 -123455 162789
18026 -49943 -281271 -60195 -277020 -78465 56855 -111120 31163 124778 176526 55772 21652
18014 -292410 307284 -85931 -63785 480240 -167842 52980 -287064 -160830 53539 94279
18004 94279 -213415 266189 -133354 -110798 -73602 -68746 -48767 19369 -132645 -125081 -51022
17992 -156510 4185 252608 120702 175328 -112773 -108370 -43226 -109069 -132219 -147469 14280
17980 43859 61706 -27207 -196242 39844 11390 -267248 -290314 117576 -135758 189343 -22099
17968 -163159 -220493 18004 -32 106312 261310 66079 115948 112890 20557 118655 -52890 70508
17955 129205 -51069 -9145 52533 49034 -150626 -166506 -168617 -3931 110211 -147389 -18560 -18842
17943 -18842 -97822 -118357 -183189 -56218 -189029 -226221 -154685 127966 73130 116362 46273
17931 -192836 -267497 -225076 67074 -24569 38436 -118475 -317308 -196951 149771 216816 551088
17920 551088 -16552 45906 -58105 35290 61852 6480 142136 23644 58374 -113966 162033
17908 -225833 -70592 100018 -89619 -213997 98622 -82241 -317668 -55177 382886 -84779 329721
17896 -157893 269414 59644 10613 228100 64893 19844 182948 -125420 67154 86469 -175047
17884 -123401 -260775 92043 327778 -111636 149511 -31941 173958 -379462 177091 -73882
17873 -315378 -27988 -4510 -193326 66162 223292 119495 -228173 -15635 -42712 432658 55173
17861 -290394 -145539 79687 98231 206714 -87970 121272 -351629 95586 -163416 -256513
17851 -256513 -112106 81707 -73863 -89140 -369669 -43679 -84762 -335541 -147464 75613 258798
17840 258798 -142809 -118175 -14899 130370 433492 3085 -310498 -398574 -302247 -144539 92413
17828 -173271 -29224 -95293 -108643 96929 -180803 -70042 164241 316688 -186485 -270860 -201262
17817 -201262 -5897 4391 -76225 -21913 93401 176156 366846 208865 101076 -141086 343975
17805 -43943 -136958 -162883 244690 122180 15347 -75927 175138 -195531 282631 20532 -177886
17793 300308 189079 -113404 243529 297120 -416014 -53571 -151058 -119793 -61094 14914 105536
17782 105536 -34261 51009 -135967 195309 200798 57803 -81925 -161718 100850 46165 -195343
17770 -23879 -648 -73528 102900 178750 -37315 39029 230944 -222901 62116 -157321 -117506
17759 -117506 3254 147306 -225428 -25330 -66193 190308 -126150 -81956 -50629 -88124 126874
17747 -78912 -183497 -198732 90293 -260990 8523 -73502 25300 23854 -86454 41281 77437 286256
17735 286256 -14532 -1145 -222249 147183 189071 -78586 -162856 150363 66783 184279 -87951
17723 -83384 121076 216512 -121244 200482 18789 35297 647 109453 -223113 464333 241766
17712 241766 210977 -153071 142710 298829 -231549 -35844 -296980 254833 -184647 109174
17701 -124089 -33292 -113282 171362 409409 312855 -155336 -96014 575 207600 279114 -234719
17689 99878 70860 465386 106728 270017 -203427 246660 -250130 104979 15719 -5385
17678 22075 13911 62080 -13992 -26715 265162 -51357 -17465 -279640 121438 -435824 -145887
17666 -69870 125966 -107742 4684 317537 133474 35898 -488070 294601 -38530 -81876 -6905
17654 454556 56519 215885 -24153 -227079 -27986 52279 98386 83122 98733 103502 -32781
17642 -146919 382740 106990 308876 154648 -28683 130396 -51253 -71870 263625 148917
17632 148917 -357918 -146936 147200 5432 -87554 238169 141968 -55754 188313 116491 80185
17621 80185 -40600 -64017 -40580 -169889 -151473 81338 75874 77020 -106936 69183 129989 126375
17609 126375 -257614 246343 278551 328283 -267028 -16067 -28017 159611 171102 133780 -10937
17597 69434 -78792 9878 127990 72256 329442 227762 18185 -44078 -93035 82309 435329
17586 435329 -218999 350729 44827 3693 62298 27685 -143665 229243 -17120 -22976 84905
17574 22706 -54096 72011 30626 222628 364241 212544 -241949 -233887 -84845 205385 286570
17563 286570 240135 88667 110479 167669 247153 76361 29133 80385 259085 187754 28463
17551 252491 -32904 -206449 197911 54207 147579 57825 -192094 264805 30499 30817 -70523
17539 -38601 311705 -20525 21658 229099 48156 176350 24570 -193386 -21413 -115673 -132779
17528 -132779 137063 158964 75991 195822 256474 -271474 53079 26097 203379 135084 -355871
17516 4902 414479 180277 -73470 3247 -109220 -17714 118273 -244427 -117789 122760 198225
17505 198225 147938 -12364 50591 118090 -2206 -37478 107391 -98981 140158 157392 176032
17494 176032 111442 119427 60007 42689 25937 -256933 193016 22438 128964 242377 -127952
17482 280520 125052 -15653 7165 -17317 416970 335324 117732 42986 143655 233081 -133791
17470 -217154 82749 15918 111190 235208 227867 183006 349933 231200 25077 143313 174441
17459 174441 96777 -24494 39000 377608 115372 187921 163345 230306 -119282 163908 50328
17447 170551 279505 132159 373371 45440 250267 225798 263841 102102 9280 418255
17437 418255 -97355 201266 289537 161682 428549 343533 378901 342879 239705 153620 246211
17426 246211 -138697 517468 256054 172424 219758 347978 315750 -67077 -2284 219076 251653
17415 251653 -37086 -111849 373246 221078 39635 192533 -13941 168227 -57249 263564
17404 52614 217954 164430 415409 -181181 281724 201590 -58745 62422 227328 -47593 -90059
17393 -90059 266400 249472 -8748 -213384 384865 -14844 272873 260207 88552 87156 147711
17382 147711 186306 -27777 93668 16348 -56721 96074 -92591 17729 450634 253004 215766
17371 215766 240338 289357 217285 -42403 159438 224994 -126347 -37760 -36496 489517 -49625
17359 25848 -50851 201884 251716 476743 324284 46394 84130 162045 307861 62903 366441
17348 366441 -41245 -122173 277879 218780 234501 -59546 231720 251397 230814 281650 311482
17337 311482 273884 280964 232104 -17762 312117 427157 36940 135906 346685 86290 251201
17326 251201 -98974 512861 175760 132207 348787 81028 206159 -5379 395593 104861
17315 196999 -42595 -20998 453354 -145841 144361 -227400 -62896 136025 438982 415797
17305 415797 365881 -37202 232908 262304 218908 263111 128574 94958 132631 6012 337755
17294 337755 307102 -113528 54066 613585 181199 551091 264083 325394 297570 188146
17284 188146 -24382 224401 92 204250 303389 241137 220173 453014 303826 83115 343639
17273 343639 259745 307780 399687 268072 246696 282788 97486 267484 -133577 98479 253112
17262 253112 214502 -79816 306095 111468 150360 100976 177929 147167 128857 351673 142243
17250 485827 229994 485582 307705 169839 -4584 -65551 568382 134896 90561 248924
17240 248924 432803 54869 161829 8952 92713 167753 313250 352561 290360 -12617 -80443
17229 -80443 150721 126885 209520 -261682 227819 181401 272010 -222606 214987 167353 -11367
17217 279955 98124 444104 -340 144381 -83948 -61388 488722 154568 323224 98317 475267
17206 475267 171206 265206 177853 366942 5142 311153 224247 491859 -160438 379455
17195 396487 207305 318228 365384 216879 537931 637667 213465 197057 536042 348786
17185 348786 126093 266212 261735 508570 669116 300962 537542 59353 420381 -40860
17174 -46378 16983 168759 137846 1136 207489 561605 149651 468290 58306 297525 38328
17162 573180 266129 75645 372910 634875 401134 484453 323793 442792 313560 599340
17152 599340 343174 261577 220429 49732 227849 463463 137902 421319 441678 473764
17142 473764 278019 583069 147437 494283 464848 44110 -112956 47822 287794 -86831
17131 309310 327683 244682 275687 340082 246608 456570 514233 189790 -18858 338982 62972
17119 99936 586370 386116 397869 377413 230687 240363 433567 466508 115753 122890 557171
17108 557171 422019 224785 420035 213063 76217 471032 323418 486884 497226 338375
17098 338375 557318 527192 405752 495691 285627 469366 580387 801591 504403 431621
17088 431621 548742 275229 420863 216227 718227 881875 422706 443506 525483 651857
17078 651857 682873 737710 428755 614162 361005 429610 476741 660889 670297 585861 815639
17067 815639 757194 623517 510982 385558 196892 513127 252666 304948 276272 351377
17057 351377 716963 480765 269984 139603 522756 547955 560775 570689 535510 287446
17047 287446 888681 618553 418627 701930 699014 804724 725711 1022589 397450 449611
17037 449611 410862 864990 514647 411919 594887 676296 299253 666470 812808 633338
17027 633338 683897 834066 647612 803890 527263 656780 757591 605710 853589 566257
17017 566257 931017 853672 734794 805235 704445 557017 530815 698283 804618 943441
17007 943441 723343 1038852 547057 869286 639573 975694 789382 627564 1084699 802609
16997 802609 944675 697004 1106329 760075 725742 753097 1118699 808070 686860 677470
16987 677470 1250781 825480 581193 1151291 1036414 783100 829675 952957 892479 1003859
16977 1003859 886088 948590 1106326 800288 928347 1065828 1022532 825325 910921 841179
16967 841179 903573 985330 1317784 1034781 1154907 1190718 1206398 923063 1255691 1178056
16957 1178056 1047243 1331658 947028 976178 1075253 1289794 1084204 1208163 1107876 1131849
16947 1131849 1191698 1166029 1146901 1413290 1238745 1344917 1187553 1263370 1457916 1406286
16937 1406286 1279540 1273679 1051338 1582891 1284884 1672159 1102178 1722771 1587929 1355598
16927 1355598 1595993 1818252 1614438 1489341 1587209 1167712 1539138 1574424 1551620 1378897
16917 1378897 1571497 1521776 1676183 1709755 1588945 1746472 1480401 1932128 1514038 1905324
16907 1905324 1640117 1996790 1731848 1827282 1627677 1712763 1751221 2071274 1835109 1887617
16897 1887617 2083875 2191730 1370993 2294548 1998634 2254001 1822582 2219762 2364364
16888 2364364 2387772 2573460 2229210 2059780 2396544 2487414 2119077 2255653 2184701 2417090
16878 2417090 2461840 2574117 2486260 2820076 2425328 2809602 2642266 2841668 2769779 2969377
16868 2969377 3084658 2805180 3087784 3092917 3145235 3093727 3094296 3173128 2883169 3231710 3112492
16857 3112492 3486414 3259569 3447776 3228641 3691068 3421033 3339898 3876626 3351871 3669831
16847 3669831 3834759 3692341 3965586 4237795 4130413 4365843 4225971 3648154 4278025
16838 4278025 4595436 4591798 4658909 4731636 4679101 4320356 4775600 4783040 4919143 5035471 5157047
16827 5157047 5350903 5279851 5461640 5498299 5450773 5946730 5904809 5802859 5941157 6261963
16817 6261963 6005922 6612947 6548329 6714976 6570227 6764227 7113601 7088773 7338596 7152139
16807 7152139 7708721 7816311 7829309 8039259 8182426 8171045 8852344 8720171 9247903 9169772
16797 9169772 9240635 9722124 10148410 10189677 10581247 11101098 10881686 11226626 11435480 11972142
16787 11972142 12276506 12336110 13022419 13291027 13777495 13863016 14335858 14867025 15097093 15797248
16777 15797248 15844979 16540516 17335836 17729649 18515021 18791312 19437283 20125388 20884573
16768 20884573 21484059 22271736 23146239 23814488 24802509 25664370 26869493 28089602 28658790
16759 28658790 30218951 31421294 32665011 33868280 35396469 37006973 38342920 39989175
16751 39989175 41817669 43911180 45662894 47883431 50081071 52504832 55049752 57965855
16743 57965855 60395743 63970637 67071713 70306167 74164311 77777709 82182532 86442912
16735 86442912 90578615 95511398 100877449 105686732 111748137 116704399 122417875 128091385
16727 128091385 134007533 139653375 145431589 150687910 155547477 160334849 164383337 167813382
16719 167813382 170415791 172197078 173051526 173397239 172676794 170682878 167838267 164403530
16711 164403530 160713790 156257343 150965663 145470999 139715775 133894392 127875439 122390831
16703 122390831 116463363 110863821 105046142 99928324 94486364 89666004 85291643 80705674
16695 80705674 76462733 72775188 69030823 65347253 62375555 59220502 56571175 53512038
16687 53512038 51112876 48593836 46367430 44369479 42165680 40218276 38409454 36738478
16679 36738478 35323261 33739779 32715949 30864700 29997796 28552276 27751927 26416693
16671 26416693 25527371 24463896 23719518 22944867 21965470 21542997 20718036 20143719 19336629
16662 19336629 18682723 17954067 17436829 17066864 16256554 15517313 15467792 14690824 14470681
16653 14470681 13887524 13673854 13305653 12807827 12264722 12217826 11832337 11277453 11161163
16644 11161163 10985521 10896668 10361796 10174463 9585100 9674883 9277759 9111763 8708652 8530169
16634 8530169 8458712 8267921 7925394 7872484 7702785 7632831 7456348 7398917 7177488 6911741
16624 6911741 6491092 6749730 6416367 5885754 6057862 6393825 5767298 5894187 5461580
16615 5461580 5748254 5540078 5096080 5487944 4916699 4953672 4797108 4862046 4831103 4857164
16605 4857164 4725319 4713120 4354892 4238943 4507687 4300579 4080799 3819127 4331690 4197692
16595 4197692 3856768 3824313 3443738 3665929 3773562 3626229 3165922 3392265 3153493 3506754
16585 3506754 3107898 3529890 3478423 3066682 2781565 2926695 2936228 2927342 2655427 2726327
16575 2726327 2956527 2575095 2887618 2735128 2540324 2611021 2585882 2606863 2358430 2553567
16565 2553567 2404302 2499484 2449162 2411802 2346362 2422954 2277960 2086909 2492721 2140459
16555 2140459 2019554 2001132 2011291 1902805 1890846 2149369 1962120 2003944 1816503 1710299
16545 1710299 1825257 1742242 1528249 1670057 1885115 1912429 1716625 2005268 1648453 1642410
16535 1642410 2054141 1697216 1767363 1595469 1515891 1657547 1481218 1794568 1898231 1469424
16525 1469424 1336336 1630468 1103535 1314241 1224996 1349278 1249265 1495405 1406223 1273854
16515 1273854 1303648 1419398 1161040 1329820 1342003 1239787 1493185 1333862 958341 1151906
16505 1151906 983669 903194 1094439 1299105 1342356 1128660 987017 1018529 1361894 1302051
16495 1302051 931434 1103652 1150852 795576 702248 1154384 1042961 784206 869105 1020130
16485 1020130 1154191 670803 1141214 863855 705113 937307 793173 751503 997145 767080
16475 767080 922244 747108 523018 1063231 432070 863393 1107199 969849 981977 938003
16465 938003 868414 466100 752912 679513 951564 789706 748801 949426 716494 680728
16455 680728 839851 1198502 861735 465500 953549 977965 647034 1020492 587515 1111699
16445 1111699 729511 474763 525691 734073 664765 542633 600622 648962 729618 619245
16435 619245 583728 423350 447056 548809 575789 475991 296324 700466 470264 573056
16425 573056 510802 555755 244650 710352 728267 359358 642159 378985 244924 717702
16415 717702 523485 512081 562358 587605 366857 533102 589627 376216 491585 263018
16405 263018 220191 330949 711583 199352 749295 212499 513841 623266 473898 630685
16395 630685 478439 473724 320245 499566 676872 268650 750963 229653 514026 171133
16384 673042 598510 491439 375858 525025 228546 471894 291570 806024 303173 347892
16374 347892 543399 447150 268614 167075 327055 276546 389250 227617 179833 464694
16364 464694 628134 320826 206882 508993 258659 487819 82457 613542 422735 391587
16354 391587 337392 135791 -32883 431837 156858 391206 412729 564891 200711 191062
16344 191062 178138 303845 789867 393375 187406 109125 213858 202715 291770 449617
16334 449617 86710 401271 233186 438823 224337 -787 345560 181374 371063 131261
16323 63249 329515 314598 89838 392415 177739 237953 423564 293010 262255 432949
16313 432949 41329 462868 176069 333991 193699 417214 246481 102466 268068 335305
16303 335305 234788 330308 336204 294628 -96675 394564 339870 265815 146337 242541 546245
16292 546245 277958 105369 282246 297365 95606 139354 487797 284955 204011 386988
16282 386988 -45880 158265 376379 118369 292574 401025 9812 306211 412030 122206
16271 251655 361968 143353 160182 12232 12165 184732 230392 -74806 99849 212747 488828
16260 488828 276627 239093 473953 135701 146880 77994 277931 -185349 117253 79629
16250 79629 210579 152078 -230893 -13164 -8738 -73969 151723 239216 85549 130948 87626
16239 87626 -109846 132691 -148246 -12837 -183333 336686 178695 368484 508294 -89312
16228 284983 -112112 400035 201832 -398126 -221532 196088 305995 -30901 184164 307375
16218 307375 116466 7135 70800 -104363 268683 239861 69315 87983 318174 2339 131039
16207 131039 239997 81829 -74116 3239 -1241 166765 -163741 -64753 330492 -49405 207767
16195 -56933 452018 260321 171672 -17663 -15291 -110706 -87713 83070 135466 92912 62115
16184 62115 194134 297314 300848 -248307 32767 69866 48291 -11946 29395 -105388 163901
16172 108009 -69182 296405 77568 172341 -101715 329135 -125739 -193366 -205181 221821
16161 -192748 45067 278236 -84917 153643 482086 230231 149043 269569 -127830 279942
16150 -7793 296285 295721 -336599 -145139 -121837 163284 104524 -53457 -62183 69046 -54042 -56117
16138 -56117 48639 204971 9693 -41310 -62765 -40798 158509 65798 -54032 -115421 -81317
16127 -81317 -65320 -230606 -14224 -46666 -60047 248363 285065 321535 122511 -215278 -10203
16115 387761 4655 -293956 -352248 103259 -264934 -29744 -110636 -38612 -50614 79031 377661
16104 377661 225812 28032 32749 -27962 59717 -16786 -119203 26500 -318507 87311 -181680
16092 144146 7283 6315 -192757 153846 -175827 -56809 291005 4756 14375 -343909 253938
16080 38970 -96126 1840 -23429 -102574 177601 -65585 186570 85450 188851 13183 -358506
16068 146036 -146230 -216268 -227573 240224 -78303 -419415 -121762 39369 274166 266610 -214927
16056 165837 18260 -244580 -90596 -115436 -63792 87613 29521 262661 -315730 162630 192237
16045 192237 -77524 -71333 121852 155653 243888 -139373 -172544 -322944 55679 -80199 35096
16033 105061 102205 184016 92438 48318 66728 93279 -358130 203525 168824 144654 -156193
16021 -23046 168007 -241258 -103467 171916 -102482 -74036 217889 2054 84371 151907 479894
16010 479894 59462 -1355 115414 -155763 -166521 -65816 152289 -43284 335125 -71524 -29766
15998 -69599 -43876 -72655 -28657 -66608 55384 -139863 138873 365516 65843 152919 473434
15987 473434 55693 157946 184051 47900 97219 260813 6187 -132695 113771 -8816 238747
15975 50674 -246748 80703 75741 -75632 -181873 29783 -100980 27240 8110 -187488 -90896
15963 21572 192820 82260 89103 -193999 -16025 -172048 87497 -88675 26368 362514 -191575
15951 140354 -208577 -17019 -122155 -11228 23649 -222325 82148 -125695 -12343 218145
15940 73958 -77096 -272183 -239891 30324 -139135 -142443 94461 81030 -49564 -261041 110594
15928 34033 1408 -188708 -375758 -26698 124967 2170 210590 -61307 267841 70860 265
15916 34333 -209011 112603 -98197 -334901 -34478 -119565 157507 -43026 -90928 261409 30496
15904 -7637 34420 -42174 161000 -240803 -262827 -200614 -98892 188239 279946 -128790 -73853
15893 -73853 -35745 -240007 -14697 232589 -437858 258729 49495 -65577 -118408 56641 -50207
15881 -407937 47124 87253 422436 99707 -52747 111733 -98121 -64389 -20229 86901 96256
15870 96256 -115045 115489 -334662 -387729 -222996 5230 83065 -267487 -168885 -368566 -17613
15858 57354 95769 168677 -280344 333496 -139847 -26728 169816 92722 79255 -17197 -330876
15847 -330876 193645 -120623 -241833 258825 57417 -28053 161961 34528 156059 -149499
15836 -312832 5754 -252470 285395 -215020 9384 13964 16634 -93374 21567 -245815 136782
15824 -378999 -186040 186556 43873 107788 110295 -100134 39462 44527 88198 -63671 -41094
15813 -41094 -66157 -259007 130611 -182296 -342262 93403 12177 49239 226323 -84658 236989
15801 207769 -82499 11549 21990 53039 -84357 -33775 -158475 -57166 -76285 173526 -44043
15789 -140185 -44767 103951 213785 -171573 42863 104134 -38926 -18018 89285 -45255 20766
15777 100165 3819 75235 2570 105067 -153967 23626 15782 -85985 95861 -320282 167421
15765 37045 33594 34581 -154117 -21146 -229079 -158586 -68292 243133 109686 252630 -106640
15753 -98579 131656 -73426 270163 175447 -321047 122190 -387873 52112 -135856 120704
15742 -75978 -173248 30303 168630 -146424 -29839 -131661 -7306 232040 -116589 -28206 -66598
15731 -66598 52305 -77344 19260 -234905 29331 -70247 -209746 -125639 53317 -95933 144559
15719 -4944 -152036 180636 -140001 -58134 -327341 -26949 128097 -34159 -141073 112863
15708 -155306 196318 46317 -308179 -140644 -76881 -26493 -153693 -73581 -68598 95552 -137551
15696 -325012 -243947 -211601 95748 -178950 -32518 -31343 -433343 147332 40783 63152 -102957
15684 -18208 32056 -1009 5971 -19432 -224044 -242845 187565 140976 -409097 124513 110065
15673 110065 139236 142103 223437 172351 -56947 95932 -78265 93117 -37421 -34513 -153973 243556
15660 23219 -85972 -379729 172631 -203165 171458 -310251 281332 65048 -94190 119639
15649 -47950 91890 224061 -131111 14019 -165259 -17202 -20973 -177287 124655 -43134 -132522
15638 -132522 14287 304268 43784 -39568 -74726 -29549 -189624 13871 -114880 207069 6124
15626 -82228 214117 126370 296150 200352 -19396 -170182 108145 61750 -276634 117123
15615 -241740 -178125 -87954 -72200 -120487 -321817 -128210 -149632 26394 -115014 -88920 43652
15603 -16015 -36971 167914 -24400 -138274 -196458 3847 -247097 -250948 87335 -447735 167819
15591 158917 110966 131679 219831 71178 -98517 33479 -296886 -113169 23333 -231622 331468
15579 -397417 -29592 -338910 132521 220178 61013 91018 -73360 -245736 -227297 -417097 -26035
15567 121739 -114899 -49553 25111 285455 145379 225054 143112 -38216 -193517 -464550
15557 -464550 -53413 303130 -320544 134009 -89227 -3026 -80117 42505 134486 -57289 183112
15545 340260 29323 -86431 -51574 32246 -177459 -139793 44504 98592 -72632 11940 44176
15534 44176 157324 -157584 -75389 17688 -141810 -34204 -95460 -310612 -172530 168710
15523 -241821 6924 143068 -108508 -545591 174819 -271033 120773 -67099 453514 137554
15512 -182542 11937 -163530 -4406 9308 55089 56812 149701 153360 -111456 -113332 -321685 -181279
15500 -181279 201749 37872 -135276 37353 291202 130651 213145 -231963 -26023 -97814
15490 -97814 -174023 29255 13132 -293580 -48859 -63168 -264206 119091 175815 163183 303778
15479 303778 31965 170134 136350 -195677 -68435 -42245 -127644 -48086 74116 99998 186481
15468 186481 -188368 157 107682 152617 161951 -22900 -137833 44390 10913 -80895 -64265
15457 -64265 -9271 78028 78151 26390 -117590 -105467 285699 -81765 -59760 -247795 296794
15445 17947 -155675 144056 187431 74981 113720 -238702 88724 205860 -65782 135404 170454
15434 170454 387448 103181 174330 215441 -11533 239255 -79722 -398786 -105517 -117014
15424 -117014 -222679 65113 -317309 -130469 -55199 162624 -278901 -256338 145604 112290
15414 112290 -57050 -250991 -122319 -371348 271704 97036 -117131 309378 19778 29489
15404 29489 63325 -86795 -147391 13818 -249038 193569 -395236 270766 -136405 -244866
15394 -244866 -422185 70865 239651 -199705 -58202 -59695 -157251 11626 148970 -327319 -102546
15382 -155522 7637 -257332 64829 -125617 41607 -109304 108830 -188497 -136805 183347
15371 16085 -10005 -63370 -279601 -48821 -71999 98412 221093 -78089 268784 -10910 -178930
15360 -178930 139281 120596 138216 -322310 -72215 238857 41845 -162910 43476 149201
15350 149201 -72107 -123119 239727 135720 55203 -169101 -169966 389063 72723 105430 186548
15339 186548 301253 -197807 16377 -73747 80009 -162317 -163150 41359 199361 105611 -17513
15327 -32 -22813 -138006 155364 12158 103787 -63389 -126820 130637 281880 467251 -12307
15315 -18398 133883 93361 -131403 2538 41765 -142830 121868 -134611 341393 29577 -72319
15303 54563 175102 87156 38650 -100256 -45913 -91087 192661 -51450 419662 21337 37891
15292 37891 9326 173307 -54413 76052 57685 233920 -214266 21122 -83817 145249 64904
15280 255377 218267 262988 57489 -41547 202715 -249308 -179674 -304655 1252 -32925 -91917
15269 -91917 42109 155581 72349 -109805 102219 -79488 258424 173008 75265 -93322 223023
15257 115921 165299 243599 92181 55767 -25321 106268 101242 408874 1061065 1472646 1007357
15246 1007357 1409923 1144453 122608 -14800 -105258 -184912 80924 -268873 234920 20060
15235 111010 106125 -178857 215866 -42288 53763 -26444 48329 201215 153649 -26454 -15642
15224 -15642 -340162 179351 -91328 162387 117373 -115635 8474 91317 78426 -151744 37441
15212 14328 258011 -13810 206080 -35778 125698 -186788 246009 352803 193369 44145
15201 329787 131828 192701 205686 -428990 88131 154037 39040 192940 105226 -197791 268181
15189 95802 353056 -91010 180802 151254 302651 -134300 95747 158340 297921 60937 -148932
15177 -31392 56351 -111567 80394 121893 4164 320327 292624 33449 1791 208580 222291
15166 222291 -13846 225624 -203144 503829 156350 128875 -28877 -13117 92596 -209441
15155 90823 108922 229988 65148 317242 52426 269799 143025 -119283 227757 -103559
15144 18479 -396542 247626 -103881 245593 48587 379345 217084 99938 -62439 446923
15133 130968 -86493 -103086 162577 162098 168242 27717 229273 -88494 101184 61582 -96400
15121 100752 252741 157283 81490 -150347 162509 -231547 -21542 -64642 325262 81551
15110 150783 -184433 46613 303398 -4032 130744 183313 249896 327924 115944 46243 -188188
15098 -17687 90373 102054 273002 -166368 303187 94528 209806 -96591 -214939 371815
15087 326828 362722 -195407 -276259 318105 82291 -96197 156996 -25455 209804 84148 304270
15076 304270 86565 432092 413130 364954 327599 60880 378958 77607 339166 486519 345246
15065 345246 108787 -60658 36897 -16992 85622 -94175 90222 256832 553098 219149 36628
15053 31553 178314 120531 172711 74 195161 422538 21654 26357 184879 131049 275396
15042 275396 513258 374680 186560 307514 215951 300660 49040 151923 306788 -28569
15031 -304068 77666 -39028 74858 169049 191040 308982 316383 280197 291703 362816 342207
15020 342207 383950 498035 2027 158120 87045 548855 213690 337593 302628 89976 238976
15009 238976 -140984 66068 239247 234827 222180 -84839 261462 140082 223236 278441 -76936
14997 105444 47542 34340 -174670 -173437 -55871 144620 584000 400455 499843 50225 57340
14986 57340 183141 236024 230924 117579 291998 283779 449318 384734 180413 394966 219410
14975 219410 -84652 -51600 303263 171730 511701 158921 502792 278982 8761 389953
14965 389953 429700 303624 212628 -26521 128229 638296 362121 285886 41239 376945
14955 376945 338612 331975 105938 237669 551522 295488 162606 282392 404974 140346
14944 255319 283924 196113 416843 126512 99013 337772 61821 470637 53503 -129837
14933 100931 143616 371165 290982 30760 245197 315816 427524 132161 233732 337538
14923 337538 224848 497089 187710 125424 -38742 229803 67510 221605 601824 174114
14912 975054 161710 200113 457928 239195 169737 432647 -19977 160817 51219 267175
14902 267175 269292 316638 268334 338706 202725 284982 173265 472902 614893 286347 276121
14891 276121 128617 331308 116286 388487 119337 642953 349164 345238 262904 331767
14881 331767 128982 252413 132371 281393 523101 536185 -29200 187707 254626 314417
14871 314417 290845 266834 352335 279683 138278 478403 218181 206272 750465 406884
14861 406884 395473 658289 327391 512394 455447 179748 478541 476254 682176 145177
14850 410748 320170 621843 328103 475699 326924 486380 689833 329375 437663 617789
14840 617789 462452 496328 289148 514323 278074 275474 645224 616429 467871 560320
14830 560320 389710 317559 409638 383513 411036 626046 240359 539888 465861 311629
14820 311629 297608 554825 566071 435625 629779 625503 295725 749044 472329 547811
14810 547811 591350 503412 567666 528960 823395 538008 361580 571708 499788 441646 776117
14799 776117 258521 481975 668552 358747 548074 335087 306060 688692 443199 779715
14789 779715 857021 346549 762409 619328 549313 557953 563028 517625 644307 412549 626185
14778 626185 659926 533418 374985 666517 284010 427880 766863 385932 653350 731948
14768 731948 597468 793448 504388 553400 934337 848040 715255 453109 642236 596250
14758 596250 814616 736506 794547 879852 348056 421676 446318 781716 757094 754998 729627
14747 729627 592111 774810 696169 447813 475400 719293 864722 638073 771420 569255
14737 569255 834120 634573 434107 457023 981913 675141 568098 851734 632848 1057405
14727 1057405 560490 721783 648822 569207 715614 917216 616038 726309 820613 816726
14717 816726 850670 1003002 690070 848637 942351 877245 792093 544771 874573 831879
14707 831879 771917 687888 837429 682144 1055659 1065203 828102 890321 756499 649264
14697 649264 1215587 858049 615980 995548 972759 934043 685107 683505 878263 1074386
14687 1074386 529175 900225 1007277 1017382 1058009 809048 1037239 947746 1015800 857663
14677 857663 930103 961028 853357 973769 878616 1031857 767511 1180808 1202097 1108532
14667 1108532 869312 737812 995952 1234140 1153233 783883 1213001 1009880 1086364 788833
14657 788833 1018872 1300938 919366 1058858 844585 1235258 928755 1248729 880463 1410423
14647 1410423 1432094 1106293 1274600 1016412 1203031 1314200 1412684 1195288 1544682 1184906
14637 1184906 1105305 1659814 1396519 1178647 1434513 1329540 1657865 1292249 1362233 1230771
14627 1230771 1419124 1503329 1510418 1275795 1419453 1550714 1343687 1201568 1318416 1524581
14617 1524581 1630751 1695415 1393234 1528704 1361196 1490008 1377691 1505863 1969952 1405819
14607 1405819 1615088 1799257 1196523 1500232 1765042 1631906 1736597 1813894 1656082 1550345
14597 1550345 1805414 1701287 1574866 1508002 1733196 1425510 1980748 1831264 2018337 1592725
14587 1592725 1827460 1687440 2040427 2069883 2347822 1680521 1856085 2034196 1998664 2249294
14577 2249294 2168908 1853565 2108189 1986599 2086147 1907264 2332960 2322534 2091871 2722279
14567 2722279 2463265 2431117 2316976 2275164 2430246 2467144 2904553 2831946 2752011 2915728
14557 2915728 2960388 3052198 3470035 3531328 4080972 4375885 5031490 5757935 7214811 11375814
14547 11375814 20433793 36558704 47281404 23890469 9948940 4511664 3025754 2630600
14539 2630600 2073779 2305159 1966257 2303662 2049428 2190097 2232471 2099660 2175308 2270668
14529 2270668 2172299 2431080 2003565 2294165 2000871 2188637 2277505 2385469 2690717 2372771
14519 2372771 2581454 2424758 2634598 2781450 2968794 2621602 3149823 2778539 2840708 2771237
14509 2771237 3258827 3062678 3030132 3401791 2760260 3041236 2657492 2901770 2817831 3083235
14499 3083235 3319421 3266894 3217583 2916332 3650989 3636993 3567596 3282502 3336635 3755738
14489 3755738 3633141 3717222 3783450 3716157 3703021 3679837 3798932 3722160 3748735 3966209 4055159
14478 4055159 4222418 3953345 3928723 4169187 4250974 4382286 4395983 4692566 4617355 4667744
14468 4667744 4557071 4777629 4471124 4752827 4431481 4795898 4945254 4830013 5113095
14459 5113095 4693664 4994923 5261634 5239200 5434016 5336740 5296580 5368330 5641698 5185437
14449 5185437 5692987 5593490 5788587 6123486 5831068 5779182 6273460 6213374 6099943 6488914
14439 6488914 6489175 6410837 6317755 6546965 6795319 6620725 7026475 6763707 7008531 6934598
14429 6934598 7165634 7346409 7148799 7609294 7348182 7668667 7974071 7888347 7857867 8090133
14419 8090133 8107808 8295785 8533810 8817752 8607813 8672243 8816442 8842413 8947939 9380047
14409 9380047 9326804 9888854 9733200 9877899 10097291 10263665 10261658 10581487 10583586 10663380
14399 10663380 10848787 11090216 11326587 11702443 11315619 11940845 12331982 12248641 12309874 12653751
14389 12653751 13101842 13376180 13244255 13683614 13622465 13647905 14267115 14647800 15244727 15194277
14379 15194277 15187786 15815469 15899155 15959305 16254012 16809457 16931937 17395859 17882497 18184167
14369 18184167 18067097 18745719 19348047 19355224 20041744 20668130 21181306 21349067 21537162 22296002
14359 22296002 23018852 23413510 23663820 24458251 24952622 25808529 26370923 26956574 27376107
14350 27376107 28071337 28931601 29531852 30300562 30875230 31679604 32556478 33513037 34427261
14341 34427261 35165568 36108676 37249610 38442739 39138141 40647035 41645359 42632439 43961317
14332 43961317 45335750 46910635 48298013 49574484 51197679 52914549 54513901 56744682
14324 56744682 58505019 59952282 62690054 64682951 66816497 69332161 72055824 74026577
14316 74026577 77554423 80052122 83185122 86592790 89456847 93535342 97368193 101286190
14308 101286190 105684679 110067560 115132889 120115210 125488485 130598009 136587944 143028668
14300 143028668 149450072 156645694 163669001 171868659 180180901 188895639 197967615 207791593
14292 207791593 218353521 228381558 240110038 251915560 264295463 277029220 290274549
14285 290274549 303903980 317810260 332056279 346400579 360386912 374791437 388721672
14278 388721672 401930315 414670611 426411559 436939714 445738958 452105750 454192774
14271 454192774 453525300 453843757 455375520 453171266 449570234 445033400 436916791 426094023
14263 426094023 414161323 401078414 387014395 372540638 357155214 342119399 326603675
14256 326603675 311652571 298070591 284050834 270240089 257458512 244679509 232790407
14249 232790407 221458155 210513096 200404593 190995940 181915071 173385099 165405269
14242 165405269 157661959 150232044 143484817 136783955 131416821 126010349 120386686 115128388
14234 115128388 110425186 105882423 101614769 97977853 94057665 90260141 86775609 83127253
14226 83127253 80276282 77373724 74519146 71804720 68983750 67127137 65010381 62565478
14218 62565478 60398116 58277853 56684164 54736743 53221566 51809135 50004753 48557727
14210 48557727 46627122 45738234 44594883 43798467 42500372 41365569 39985155 38689191
14202 38689191 37660549 36697399 36075971 35149287 34148984 32838831 32143577 31066494 30683732
14193 30683732 30016870 29332996 28454801 27736940 26962278 26711672 25738446 25393628 24607146
14184 24607146 23888879 23835845 23389847 22452762 21669697 21778229 21246110 20649541 20212004
14175 20212004 19603180 19516990 19181626 18825229 18249784 17762111 17411447 17349941 16878225 16635431
14165 16635431 16609201 16396184 15836494 15675990 15415995 15029129 14764286 14466135 14257585
14156 14257585 13988995 13718661 13348380 13136074 12986350 12700847 12371548 12335799 12374708 12125694
14146 12125694 12083810 11708332 11503220 10852779 10960966 10907810 10558281 10536736 10600436 10243366
14136 10243366 10020878 10014286 9707384 9767408 9586815 9102519 9177083 9173870 8969227 8862637
14126 8862637 8581456 8783312 8541291 8550651 8019160 8025305 7989902 8089523 7858552 7765401 7492833
14115 7492833 7466660 7344936 6931427 7212273 7121121 6871062 6861555 7011264 6866274 7035485
14105 7035485 6771415 6817404 6378229 6355123 6483933 6217455 6336744 6037874 6129248 6135825
14095 6135825 6127445 5926948 5798385 5750603 5566842 5694752 5631927 5624979 5396215 5344649 5388132
14084 5388132 5231247 5244371 5037484 5186725 5151604 5020064 4651903 4688088 4872878 4677894
14074 4677894 4611764 4737404 4676464 4672807 4508120 4395130 4339481 4478701 4347458 4394791
14064 4394791 4285699 4177739 4171016 4140133 4256907 4173234 4315689 4176054 3668026 3930976
14054 3930976 3716523 3792611 3605330 3846694 4106112 3352821 3766886 3828274 3749095 3266704
14044 3266704 3588944 3315598 3339324 3598881 3311094 3376775 3236567 3339456 3232702 3018843
14034 3018843 3231372 3250154 3233594 3290496 3077627 3349552 3122424 3027683 3235473 2841822
14024 2841822 3260422 3130395 2525658 3012862 2672000 3025735 2901474 2377611 2912972
14015 2912972 2662118 2412845 2613440 2686597 2508923 2123523 2466985 2688172 2516012 2639341
14005 2639341 2517806 2274809 2338860 2442120 2223081 2075200 2056548 2286606 2576016 2527277
13995 2527277 2286072 2274853 2138713 2415916 2402421 2692044 3509253 6328624 13357937
13986 13357937 28474350 46511007 29175707 14871846 9027513 6305601 4886175
13979 4886175 4233532 3980307 3493888 3267439 3313003 3127362 2871981 2515143 2883027 2739985
13969 2739985 2311075 2330030 2343874 2280649 2253067 2390125 2466958 2259483 2174250 2008770
13959 2008770 2153311 2158210 2168243 2109421 2381051 2046983 2184840 2097351 2183291 2162637 1876275
13948 1876275 1980954 1905027 2552329 1810965 1563294 1941313 1878822 1820912 1829960 1734907
13938 1734907 2001656 1555690 1877316 1786163 1544332 1638505 1738543 1531824 1966616 1743984
13928 1743984 1950602 1657032 1598449 1490387 1548987 1633679 1697102 1214687 1659203 1550789
13918 1550789 1865192 1712936 1476668 1608685 1673469 1631312 1597948 1579939 1471120 1424533
13908 1424533 1485330 1549424 1760511 1531664 1580845 1370927 1246659 1477334 1694066 1539057
13898 1539057 1301565 1269751 1240627 1570499 1777418 1507937 1246160 1385706 1226606 1296924
13888 1296924 1130596 1253173 1360533 1006251 1497578 1157366 1093837 1277437 1196770 1181665
13878 1181665 952241 964827 1211863 1205231 971444 1528570 1347838 1485211 1476519 1222527
13868 1222527 999684 1197827 929596 1299680 1448108 1254218 1239847 1086684 1017664 1085284
13858 1085284 979222 1346629 1110493 951169 1420935 1065341 1122821 1000107 816428 1156919
13848 1156919 933086 1225785 1006876 1205785 917926 1303329 1002029 1192749 1025230
13839 1025230 1014937 930584 1197867 980381 1102033 789451 944039 1064062 1107503 707419
13829 707419 971228 1222688 972502 757391 1028270 801401 681054 604062 900612 905480
13819 905480 962250 1025562 861578 896551 897423 665495 772308 844520 948172 690535 747330
13808 747330 624996 886945 1334979 792732 759645 1045862 977423 880315 1012343 1023544
13798 1023544 830525 764991 692364 967499 579505 657764 626788 1009040 896646 959935
13788 959935 722843 680021 948597 663331 496675 963304 759422 820860 642624 924670
13778 924670 794073 681235 549163 707539 841139 776257 617228 758459 620231 744563
13768 744563 680143 499195 774775 676813 742802 814128 381495 522741 783505 701955
13758 701955 792671 831136 507292 801952 504303 755751 737830 816488 620518 511471
13748 511471 799233 635626 614616 644270 765429 420514 675355 379661 602474 760771
13738 760771 837016 637111 714717 999751 624401 699173 515065 409776 529224 943196
13728 943196 431837 692198 502986 790010 722871 848332 528182 606603 566041 618875
13718 618875 479541 712801 813957 569958 614663 865158 406588 638108 655203 505706
13708 505706 311884 714087 566930 826391 417794 654310 814619 744471 657477 447809
13698 447809 656717 327403 700729 454401 288590 793661 818589 523593 517229 395972
13688 395972 410103 134323 529543 501946 411669 444976 288739 246860 416776 310679
13678 310679 501293 549216 549900 442804 305463 387891 584425 485355 514035 323318 62189
13666 454358 343001 373940 286307 599905 705148 291904 372680 249699 733688 413959
13656 413959 287469 187817 272324 499550 465542 178298 361163 284265 484289 523824
13646 523824 530720 344367 644499 287183 388000 221935 128009 619878 343178 53587
13635 411221 333026 658015 480973 681371 411655 347399 614738 140820 -46090 188837
13624 559956 484482 410498 721828 425537 473763 552937 420725 722588 213413 684076
13614 684076 288924 513065 336648 392433 496691 527041 243289 49629 312257 312457 102302
13602 835814 759231 285242 553631 711777 573165 476742 237465 192036 289453 655103
13592 655103 114058 365110 545889 498185 574970 404765 379784 336001 417410 216868
13582 216868 722539 302376 77669 134827 568178 319568 449980 560206 198670 26119
13571 275802 208964 335890 708160 184503 382737 145581 136788 199979 78192 194177
13561 194177 409105 149157 414239 368911 258788 70117 336552 263542 133359 495512
13551 495512 407172 550771 416831 235562 370229 335493 134939 332758 422398 727499
13541 727499 387326 77672 290558 648298 356012 436603 196918 115129 351731 163548
13530 565456 229636 201945 -18483 191729 221045 212820 286863 503513 290292 7481 437853
13519 437853 233816 447575 376979 580591 118444 190393 349421 232855 398546 367777
13509 367777 218257 310298 486202 122772 305083 131501 298488 165876 -102057 22068
13498 231894 298528 183483 210249 413158 568246 197400 310591 120600 311609 150141
13487 228261 373285 309994 197200 156686 -60961 377651 207633 291180 242592 -59673 358848
13475 446427 244222 175109 237784 335411 354462 718253 269916 119154 159449 -1541 127070
13463 355934 473474 182278 99290 221679 -15017 466605 177465 346885 287838 71938
13452 23488 44784 115151 164469 370952 414339 72893 221448 328005 447115 306554 260041
13441 260041 -47144 247501 290047 159018 652464 206767 317394 434935 545558 256091
13430 369954 475075 272824 99790 279118 304018 95781 -209941 509890 118444 161367
13420 161367 300767 229910 667561 299322 419888 205987 154507 426474 84332 -145187
13409 397175 123629 467767 258374 -168741 518386 64307 102462 273668 244990 523815
13399 523815 390032 95577 301399 198596 271196 257377 -97721 484096 -330482 -104430
13388 367987 232997 223260 308382 368951 83073 39927 209796 241129 196626 106601 492455
13377 492455 39610 340871 -46738 346823 75927 325234 321623 376922 137707 12578 592836
13366 592836 78681 292060 256926 142015 55826 -82648 34336 67320 180662 200199 185101
13355 185101 317635 323951 192226 -68124 530674 4737 315094 306315 751017 150513 253202
13344 253202 89414 99521 295667 230774 99943 48153 406445 491437 104107 340579 257078
13333 257078 555271 480529 -165801 -126792 -136068 162204 191733 -76891 193685 380150 38916
13321 333644 320847 -60604 400085 552092 -19189 294961 271407 366386 298000 277842 -37883
13309 -50403 332868 -83284 171074 168535 331945 271162 241518 87587 310239 249656 180706
13298 180706 136516 350801 -92625 52515 393423 -102835 186759 286996 72462 326185
13288 326185 -94999 185993 72682 66528 311221 72658 232037 447124 300396 255708 182347
13277 182347 -78870 118231 -86306 348322 -65967 46854 94535 -162117 -189742 119525 -37861
13265 6751 300490 132729 296532 179512 -45713 400289 18535 212519 100798 176174
13255 176174 131219 278905 -189604 -15044 210895 143480 170407 -43531 -37325 -49103 72455
13243 359489 -49673 -131760 143325 9680 284071 -437227 301796 129875 184587 291467
13233 291467 35789 136085 441101 -31038 420717 156885 45636 -60338 -101389 181629
13222 18650 172968 66253 183579 -61617 51035 118474 78970 167250 195074 175098 -43584
13210 114921 -205308 200500 156175 -48877 -26470 128342 119015 341618 -160631 5421 -60094
13198 123517 -40903 -60630 127588 -95690 -8012 -75114 42799 240392 174332 -139830 189367
13186 -152927 -92253 585235 202393 -3375 98451 3284 -253782 314506 -106820 239459 3943
13174 -37893 -130585 117536 86769 80176 248086 374667 329792 219096 20708 107648 78474
13163 78474 272063 230802 344056 454624 -344195 269722 -122320 -48692 183445 269489
13153 269489 37894 174547 -279692 308423 98453 92403 268712 175210 382300 -23967 266780
13141 -128541 4509 437451 202626 -113765 -210985 9023 46995 31477 237910 -144712 55169
13129 261046 -108168 -90367 434191 34041 151064 -233011 163764 -74365 -94730 575948
13118 303260 -257371 159171 548365 -86986 106209 101414 -2296 161272 425462 126258
13107 90998 181904 121094 -2333 128199 308267 -79865 19747 124795 282911 51706 -204627
13095 8474 80149 289650 -152373 -288667 -71062 -187729 5096 22163 164595 314589 13041
13083 378943 54336 -207373 -57142 -183533 67195 206989 135667 154890 346132 285400 -93407
13071 -114481 14841 120308 2354 210361 44049 103070 26345 335001 197217 31243 -374023
13059 -72481 218354 111713 154532 174300 168586 -229684 169244 317532 42777 28547 110705
13048 110705 60351 114155 92818 84955 169681 278173 213441 -96466 -67222 506598 -91297
13036 82933 68490 144071 -307953 100163 55133 28119 48791 14929 -23049 110353 172112
13025 172112 244030 18522 152932 157184 245056 97318 69863 -121927 -36672 -118915 96862
13013 -58273 430393 159673 160220 201224 -56210 61923 180470 -5352 57442 123396 91858 -21656
13000 9246 21871 -173195 -87802 399167 -105849 321784 72043 734140 192761 -8127 74070
12988 340963 18990 13866 107390 250412 70698 89484 159195 -13792 180683 298083 214395
12977 214395 25242 76545 -48604 221841 -102724 327228 103127 212832 164940 -115802
12966 -167025 65809 73905 291301 129940 -4463 201899 138747 130069 79238 172037 25459
12954 -227782 43308 -35896 -95818 81544 25753 27937 -98854 -110589 -288073 -120546 -61257
12943 -61257 268581 12173 167181 125207 209054 348885 173307 -33415 -20723 232006 12361
12931 -29435 160143 405046 8361 94746 71906 -263282 225703 49142 186351 -154623 169638
12919 -21787 21844 234867 -77759 -55623 -220528 112217 -10232 126967 -105024 -173131 26291
12907 29467 35124 6450 174785 -128201 195205 -225416 158175 27202 -4320 -261312 10235
12895 74249 27481 69596 101732 -154688 218001 79482 121026 330019 107326 -114834 159231
12883 254380 26515 -48526 106085 302387 93979 -248787 196512 190976 -53157 176063 -255331
12871 54361 42120 -90958 444061 -112528 234386 -184947 -211136 -277671 -90700 -33231 -429526
12860 -429526 -65027 67916 -209083 297855 -22707 2400 177637 -97184 -228041 97634 31895
12848 33832 -218336 -77981 -138939 199635 286726 101609 219926 276358 -131263 -137333 176761
12836 -260615 60337 -70967 209209 -69547 220333 79232 240033 -27488 -138035 69493 186894
12825 186894 -117930 -17170 202375 -339967 -39636 55076 -49265 -148140 -209547 -138857 232243
12813 150798 131097 -163129 -325298 79197 238321 37094 185704 -280230 -155720 34264
12802 52560 138477 -257466 -112155 -54005 172302 -36568 -30328 74080 -182488 -24796 46648
12790 -96997 -340661 -107645 77811 143295 -18017 -287317 349904 -15308 -265380 -70857 -30519
12778 -274994 65598 -223787 3609 392366 -4143 186329 199134 85599 -74539 193446 -212272
12766 -183535 229845 -114201 88068 35399 143471 -43022 -33926 34051 -131007 -86005 147740
12754 263333 -122309 1999 -223661 319047 -453287 114812 -52219 218925 -98868 -67373
12744 -67373 -192909 -8935 -40020 226312 147979 27229 76396 213330 178156 113778 192531
12733 192531 383517 44539 -38887 -100641 190169 -146979 104917 218826 -171430 43748
12722 14417 293 106480 -23388 239529 -373189 170981 229241 79501 -169585 153447 229160
12711 229160 204980 398836 355620 503830 139917 117427 389899 -84886 108554 329355
12701 329355 73078 127464 321257 213934 131203 -19584 381643 -15239 160290 -74726 -107624
12690 -107624 281200 55549 42091 -231520 38827 27440 118193 -7982 81254 119285 -133134
12678 123617 -121567 147050 15040 -44609 114830 352973 56987 333042 -240545 475920
12667 184375 -191593 -158617 -28704 27020 213519 96350 79886 38277 48572 286232 74241
12655 172455 323502 56171 452371 370526 -6773 -3250 167474 228472 119853 105523 116948
12644 116948 188844 -52859 141322 191241 57209 302790 215118 -137308 -177554 171513 -29628
12632 -62644 161810 46478 332425 152152 355140 95972 328784 145763 282735 316626
12622 316626 417262 164310 245235 180846 -123719 174698 102780 -35760 121292 -43316
12611 -5260 133021 113418 -127303 -249350 242279 -73150 259778 77167 169038 -137323 126479
12599 265158 250513 112992 -7855 -226040 -288098 127496 343307 58589 238222 42989 -43386
12587 -405540 136521 93382 63759 -12763 -108840 226531 -25431 -118913 -120201 -15850 188626
12575 -91692 362082 -103677 -21900 343035 -198797 189621 -22107 -303073 27971 25154 -23658
12563 -116823 147056 -39474 79205 233895 34327 -95834 10223 -134560 -190402 188069 34002
12551 -150888 12857 65501 -119701 -196460 189545 -56921 -88428 -17346 86994 200048 11127
12539 114680 -153130 84728 162726 307159 227218 -60231 163809 21013 -141826 77111 -65139
12527 -363586 73189 424956 -139108 13911 211174 54162 116785 115724 104718 292392 -171299
12515 -14476 66473 237735 -100463 -178190 227643 -284024 122458 61025 92390 -137477
12504 242008 -115985 12515 -27786 299266 328610 -191947 36649 44169 -114411 54704 -230012
12492 -238414 -7280 33616 -66284 -12665 356753 -350035 -99762 -120069 117892 -162724 -174017
12481 -174017 92664 80379 131793 -47093 -123516 1456 81711 -215425 183033 91364 -220239
12469 109063 -200270 4655 -57980 92715 -82138 -107688 15331 -24533 60977 -80368 -277874
12458 -277874 -102959 -236852 -480450 -43654 152976 -37596 180827 -44114 -220570 -140857
12448 -140857 -151367 -75746 -63230 97241 308437 295291 -340412 -391575 82551 -12480 -123154
12437 -123154 -88295 -35682 161794 -251257 -84405 -93551 264189 -203582 24242 -60518 -196733
12426 -196733 51772 186074 -429491 -32680 -196634 239252 97853 -59774 426 -232422 -304509
12415 -304509 -133001 19686 -10700 71592 -205993 140585 -56442 143670 -65178 -69173 97442
12403 5512 224021 -16084 73682 52417 -50283 -18866 121044 240890 -53994 251807 -41416
12391 141323 -86794 106687 103018 -63677 -18150 -125733 55944 259859 -40792 -282992 26105
12379 -153935 132801 -26365 -100750 -308199 -80444 140915 9432 188551 266122 -178687 119713
12367 -91901 196736 -49721 -215070 -239040 -94574 42095 153919 -138541 -356477 213927
12356 -140436 249123 83106 -13360 216454 -95508 -71526 250104 -32167 209870 131805 278685
12345 278685 -43365 127657 -218618 -104777 47352 107952 55282 -284806 33829 152074
12335 152074 -59709 297395 -22666 34983 -111169 -39983 -36641 11182 -149610 -143942 68781
12323 281965 -38260 39827 118992 -49863 346077 19796 -196169 60964 47707 117508 190647
12312 190647 47284 -389720 24185 -153933 160761 -258818 225449 -53524 -58719 1047 -321927
12300 128338 215164 -203747 -122639 -102142 5409 -127620 -62498 155552 326040 -39508 150909
12288 -23546 202803 -249132 -43071 -25530 72190 -25895 114047 -360864 -37021 -46206 -44315
12277 -44315 183201 369259 83941 350656 283302 -88458 -212041 -40760 152152 82717 -164109
12265 -21351 86437 -68976 50167 238941 -4454 -49924 173513 300911 -157972 116109 51376
12253 121675 -43090 268972 47594 -26618 102485 40995 88683 312852 15811 114699 42247
12241 126982 362978 272975 -125769 -15718 154069 73345 -209838 -89530 235467 -36391
12230 377382 186622 -68095 59128 177956 337830 38537 203659 344123 -9883 46227 73843
12219 73843 215955 232798 260977 -83816 -258474 362272 129436 122397 95042 -194437 201596
12207 88294 180609 239386 226736 586514 -149175 74419 268542 137905 207045 257380 337714
12196 337714 70255 321617 185670 204719 -28047 315865 232100 49546 258340 123196
12185 164535 -113796 162265 98645 -3830 162503 76746 45958 -81497 168864 -15377 51364
12173 123316 175686 -320614 174239 -120860 84191 131013 102318 209639 230457 75251 157003
12162 157003 19344 141809 178180 -82126 22942 152860 -92229 93670 82502 55594 23806
12150 50444 25699 334623 -124914 -139697 -12499 -44017 -226897 24580 58487 331746 -39274
12138 411467 -20452 -72594 -9891 -94799 -68876 35416 -60628 -16699 241681 -179424 -55176
12126 74963 234065 2076 -351536 -177129 28566 452119 235106 -20740 -85527 -98833 178703
12114 49926 -113441 48493 -156931 73680 455699 119316 -289742 -72308 211788 59224
12103 110045 -82804 -2840 182600 2164 187499 126274 -252049 149680 27213 -148874 36398
12091 -168169 19085 109813 25415 -337796 -289473 66427 -52838 -151287 -128557 318995 -136645
12079 306860 -31803 198303 355585 841250 1485220 863408 175884 8145 64797 -17176
12068 -145298 -27960 -73363 -1591 159745 -235351 7246 -173040 92540 46679 240816 152140
12057 152140 72525 -257745 156890 -88081 7229 -18915 -154167 -50237 239853 -67591 -18571
12045 74818 41243 127782 -130847 28499 -259130 -32342 -164630 -102916 440426 40953 190827
12034 190827 291037 90740 -35833 126594 -93597 -184286 -202286 -67417 -108736 258474 -148587
12022 -327978 9929 103442 229697 -305516 3980 -60252 -131210 310546 -179202 297512 335124
12011 335124 -183501 -183325 37627 -194990 -122223 -198702 88419 -181448 -60581 -171671 -184075
12000 -184075 153542 -193583 -65458 -650303 -133713 -10526 -24302 -211499 -12916 -139490
11990 -139490 49616 87899 -37089 -360503 -56863 -139275 265435 132910 -132254 -145565 55922
11978 -65468 90729 -1346 -33054 -168804 95321 92690 376373 -272949 -206630 -103738 89602
11966 -161916 167866 -157122 318599 -145358 -163059 -76821 -142605 31427 77732 -139188
11955 167931 -345539 244925 98995 -117268 -41892 240231 -173145 14799 42074 85395
11945 85395 -46505 -27642 199537 -18831 111268 129014 220849 -227242 -146573 -153017 -157938
11934 -157938 3316 16360 119197 -229594 102286 -54346 97820 -49277 30964 -57657 -29742
11923 -29742 364978 -220166 74014 -74653 -237480 15143 -75879 -153482 144337 -18835 240682
11911 -210054 125397 -73381 -76964 62166 208508 238200 -200473 430518 -127871 326900
11900 350852 -154645 -38307 -47771 -3998 8032 94367 -48692 93566 104069 -185638 -197854 -238673
11888 -238673 -152932 44143 -5185 56154 144419 52156 -97127 -331657 -196734 -195485 -338046
11877 -338046 -223370 66700 94895 41803 14644 17441 142235 107934 -86367 75181 188406
11866 188406 125591 -53521 -220250 84222 -135540 -231219 29577 -96278 -25578 -41928 -127937
11855 -127937 -12011 48354 20830 173042 -104522 -87671 152858 75374 194777 -99496 158588
11843 -122092 -121344 -371871 -66046 -503757 -37986 72700 -245797 -954 -28015 6868 -58288 43951
11830 -34944 123513 151942 -156000 199778 -129540 -173611 27261 348220 235874 173283
11820 173283 138104 -83746 112025 -186263 -81953 -285586 -251201 53310 239089 -304145
11809 -194084 119522 -83592 -15912 -420134 -31442 -384361 -101053 -118680 107856 -58049
11798 -70053 188006 -321260 98060 -161286 -14072 -243744 -30016 -53138 -264509 -161838
11788 -161838 17086 -119834 47173 -375801 33521 112855 6105 -138848 -163364 200458 -371601
11776 -96425 -24184 80687 174376 -29989 108122 194724 -208094 377651 -72650 -192584 213068
11764 -166849 277675 29610 81864 -45238 86102 153613 -116568 -363085 -302668 77400 183787
11753 183787 -457661 94885 -253100 63274 152895 47311 -52035 -103147 46748 -17770 243479
11741 -108133 107117 -82804 6147 -113239 -255087 311032 8296 -170996 18746 191219 41514
11729 168348 184544 -109266 -74378 111972 173537 -20287 126724 -21524 -92 278327 372714
11718 372714 -411225 25417 122553 -135066 402385 75766 -84372 1253 139849 109755 -87303
11706 627609 166910 -117327 162240 24575 49190 114936 20557 -24466 150337 163532 28885
11694 143184 136998 1280 -229659 324922 -145847 147445 291962 100499 -89953 255567
11683 186254 -58148 70327 64742 -34573 -83392 112195 283642 -31180 149413 264936 -68824
11671 131268 245696 -144338 102716 27279 176141 80641 160792 113824 -84199 137650
11660 164022 25564 -306448 103110 -115009 -288874 -74713 30699 -83397 -26002 52761 138068
11649 138068 235839 -148968 -45590 -176913 -27298 -67007 176265 -86742 285671 -115656
11638 78878 20282 181159 -152659 34749 111628 -245755 66761 55380 189870 210093 78432
11626 99801 73685 53749 125311 -40807 -49346 178244 37673 -130679 23942 -28931 -19531 31227
11613 22852 -33959 26780 183640 -338741 -24860 156184 68554 -54066 -198923 -75967 -40148
11602 -40148 40098 -349129 -214313 99515 -47528 410918 147483 83284 342659 -22132 99785
11590 -34721 331562 177880 274981 -116507 81435 5508 224049 -213694 164037 6771 -88394
11578 -196253 503974 28528 125567 -77464 -93392 -6685 -68762 -70219 257452 -301231 263846
11566 180598 431860 9643 314043 262835 -53836 -60124 159725 59951 90191 177874 -102189
11554 -21486 -142491 386447 251790 15659 -9407 238791 -50197 -5399 56901 77453 -6935
11542 127920 84045 71665 255411 56309 200790 -37722 227491 -6680 -99757 -211280 49743
11530 126212 235714 196531 51822 -110884 -258195 195458 490305 49094 61514 162014
11520 162014 42116 -153953 -86660 134748 239188 -213752 -196989 -23176 81833 393259
11510 393259 3887 16207 439060 190823 177941 320341 177892 290426 170096 16348
11499 485332 129600 -39124 -97364 22542 5471 -133083 43968 276781 499681 254077 -44588
11487 -20780 284434 76931 398684 209923 223181 112878 95539 -214135 -235415 77067 41826
11476 41826 173592 -201861 116305 43095 169439 -12293 48516 396988 346621 -20466 346344
11464 385019 155456 112125 206589 -82705 82373 -31596 199452 -128206 85179 -170412 248968
11452 165639 16242 -44303 46551 177178 233364 307028 272812 -73112 253254 337028 15447
11440 -246961 46026 396209 134987 298863 45483 -124093 -33310 -14765 -220426 60841
11429 -152722 120895 -129689 65304 109045 -75133 21870 258412 181536 -80017 5636 5132
11418 5132 -304054 -68843 48099 -157562 119475 163275 -85150 -44307 -55943 -53937 -144772
11407 -144772 70525 -73065 17274 249618 5967 108687 -130934 11917 400097 4827 427626
11396 427626 -292541 -51663 -65843 10302 48201 -46816 107798 181156 -91552 -241864 95554
11384 -50989 -92233 630452 28965 3842 -113461 7420 74911 101180 -166430 -119082 -40365
11372 -165055 -191362 150238 -25913 273255 57467 29152 36678 -127481 -347240 4269 -19549
11360 -237011 20699 25531 354841 74768 573724 -135747 -165325 -114222 -103771 -90945 -50728
11349 -50728 -79149 73859 -247119 58083 -103663 -63287 -165092 -189160 129489 -228222 -4421
11337 80232 82326 -66834 -14095 1080 -61444 -105637 -21616 -206918 -215250 -151269 221901 114015
11325 114015 -127053 338097 -297039 -179311 1033 91411 -22526 29234 74870 -34565 127597
11313 -176997 -109803 -206905 76418 -29250 -126643 39145 -15837 -85279 304136 81508 -285212
11301 -30961 176948 -198014 78964 -166008 -171570 155233 -291225 -66638 -55796 131116 19215
11289 -158185 -193015 106793 -165764 -229907 -169413 -26548 -161408 -315237 -58348 -148855 -169715
11278 -169715 -116865 -96480 24028 -261804 -351964 -193788 -86798 55160 142035 -366894 -251367
11267 -251367 -129804 140912 -169393 -223313 183987 -84735 287154 -174614 -101234 251228
11256 670530 -21433 -8748 -215029 128001 -228127 -63088 -21785 -15423 -172997 250743 71617
11244 32533 127207 236991 37611 -153782 103791 -218765 -20641 -167577 286309 227640
11234 227640 -435299 -100450 -25230 -141399 120375 7268 -295594 49294 82240 -320524
11223 -14072 -56871 171866 -73410 -105675 -411021 69888 -382497 -79826 -79213 12824 56268
11212 56268 -52910 135826 83772 -182032 -137165 220680 -2794 33051 -172559 -208819 -203294
11201 -203294 19500 54408 267275 -54120 114963 -511 138455 295152 -124063 7417 105698
11190 105698 43094 75769 -156988 267299 -137876 -351443 103806 -49491 -138005 -280981
11180 -280981 180377 346999 88789 -118389 63958 -179748 -25148 24129 105917 87549 -92443
11168 5475 -190771 80803 -191578 29302 -71995 49780 185923 -6859 313317 -218972 209485
11156 173868 102978 417936 -79211 306197 207446 -118256 12148 238064 -331947 10632
11145 -32889 52406 -77689 231604 132558 -68582 -242265 50752 -31925 318129 -221488 98938
11133 164471 205744 73013 -290328 257788 63822 110842 127373 230008 103701 66859 128803
11122 128803 88079 78310 36713 -42245 167588 -103666 -99707 127752 280180 76395 102713
11111 102713 99238 73029 6784 142940 59991 95193 113092 -163577 71949 472635 -4611
11099 134497 -186097 247415 195344 387369 26159 25087 496518 226190 112177 55912
11088 172250 490406 -145584 234107 -44610 -43905 -11263 -228200 327891 260754 320114 187411
11077 187411 470396 28622 72903 390091 73769 340926 216081 555737 570161 406435
11067 406435 355908 586920 426236 230195 570628 611176 249399 613690 371704 483499
11057 483499 445061 245843 549328 836400 547935 526234 777350 878660 790793 860067
11047 860067 840630 523662 597281 576867 566699 437796 852469 233826 718591 571828
11037 571828 696211 791501 448076 631748 265514 616192 701804 826413 670698 771174
11027 771174 837872 906343 668020 662912 390191 404595 554528 537502 426473 464719 357492
11016 357492 284251 719203 560626 372536 973408 473361 601265 418765 531640 592573
11006 592573 478983 638642 757701 852720 598662 670858 780508 864162 742405 514554
10996 514554 783399 907568 492910 431905 736482 565266 569489 825445 724507 573938
10986 573938 863099 991748 813502 1024032 1203215 1000732 1316785 1068402 1249455 1562830
10976 1562830 1597463 2046897 2376560 2241390 2400878 2545669 2607986 2714205 2367016 2358081
10966 2358081 1892178 1792537 1744025 1706298 1546139 1557159 1529815 1352804 1514727 1578904
10956 1578904 1558729 1769328 1316129 1378134 1132179 956616 956677 744471 581898 525814 333829
10945 333829 474253 314831 274353 349304 116625 180359 145116 174811 245150 338174 160176
10933 217811 -23079 300017 246096 36902 -77761 25840 -26791 -46088 75337 -126636 -214768
10922 -214768 -94654 -54130 299994 143445 -5282 299971 45542 237526 39770 -70741 37904
10910 -200814 -28219 -154245 -22284 -53984 -233949 -3476 54481 -177185 317 -75012 -65962 -123104
10898 -123104 129730 -78243 109882 194788 448556 -119975 -5685 89049 57837 37972 225558
10887 225558 22302 33921 181685 146573 202936 113087 -803 150277 -219314 -170001 20778
10875 -91192 17960 170595 118172 -183512 103510 -200885 42054 -211989 -35341 -50120 -46200
10864 -46200 256183 -515394 -354414 31646 95349 -72132 408094 -8672 98095 -273936 -194038
10853 -194038 132498 34246 179035 -247348 90077 -324494 71802 110081 140672 9417 -519461
10841 -54161 17395 -81040 -129940 115232 -13904 120999 -224558 166646 78301 -176280 -222366
10830 -222366 309325 172667 39305 15911 -107139 -123583 -141657 -158525 137799 -89853 203604
10818 -48333 202834 -174274 -360238 272430 -217086 -224610 -36106 -91162 -34206 142565 -119267
10806 -288707 12508 -161298 71249 11618 -95034 113394 -155784 -282405 74301 -207397
10795 -196748 -76761 124673 -218502 -122701 28868 30166 -322984 -177183 -149851 280816 -172346
10783 168181 23544 -216314 356894 -323928 -73451 397967 147852 -284744 -39878 -121105
10773 -121105 54346 -229354 -23131 -51263 -138039 -59114 57255 -79876 -187065 -245158 -1505
10761 -123107 -144308 -884 -119723 -173312 -29742 -25202 -230068 -195454 122374 -73184 -185825
10750 -185825 -51629 -98753 -147005 71414 -140335 -112286 104406 261241 49262 66285 -280457
10738 -42101 -259262 -16332 311543 86166 -33309 -125159 6525 240512 45078 -6959 75575
10726 -2813 -46426 -1612 93602 -217503 172601 -32801 -170761 -472581 -326477 189467 -489620
10714 -324635 -121622 -185541 -300102 -35594 -79587 -15917 -178789 -310615 288161 31822
10703 -202023 17988 -323326 -386284 20241 -120083 139533 57249 43304 197712 -97362 -180475
10692 -180475 -288308 -119047 21787 -392745 -36443 212090 45801 -198529 20743 -128439
10681 -88620 -80557 61120 -334895 -472910 34218 -123530 104139 -94577 -86894 -97870 295476
10669 7965 51186 -159848 -63783 159208 115239 317348 130230 -193565 -110474 -319722 -179386
10658 -179386 -313511 -56427 -63153 -46884 -59984 -64860 -173021 -321511 -91815 -54839 -157780
10647 -157780 -208501 -145825 -129010 87410 139867 24508 111929 126085 6156 -7187 72372 256683
10635 256683 174015 49171 -134719 -82830 -264175 9819 -187199 40267 -32990 327310 16935
10623 -239028 270085 -111318 -175823 359087 -103118 345771 -146973 266237 -199262 -514043
10613 -514043 43435 -105158 358426 13907 316837 -346244 -69060 -109169 138793 -376893
10602 -261759 102718 15726 -143490 -124207 50420 3800 -29360 -301591 197340 -140565 -262713
10591 -262713 105916 -229969 -367041 222156 27380 40720 55177 318740 -261700 -414997
10581 -414997 229633 253937 177926 143611 114799 146025 -281521 -31931 177653 -148158 53362
10569 -138790 -25686 40423 -152856 -524933 36915 79845 -87635 -177472 235288 21359 -299081
10557 152989 -65182 -200141 -230756 60799 -202923 10025 -174753 195200 -31643 -244805
10547 -244805 236104 -133086 131863 -50066 110370 57532 39950 -128534 -4408 -127 -297753
10536 -297753 -306534 -44004 -50430 -152915 -201230 -96336 -189570 47825 -190055 -152611 -218082
10525 -218082 11352 -210106 352882 105922 12228 -89207 -221043 -296989 -166535 -234161
10515 -234161 -198038 43885 83122 398111 -357078 -217065 -206158 -135066 100460 145784 -309499
10503 190407 -36280 97483 -95602 -172286 -259092 -229549 202692 48390 -204137 350964 2263
10491 19247 -58196 25652 -154360 -82498 277320 317668 147627 227240 304277 434665 625252
10480 625252 335535 455857 364518 126727 297810 113514 114677 99833 151362 -121596
10469 111797 -54689 95075 44499 104292 322484 109634 221040 150482 157023 20930 -252643
10457 -148450 -6190 234415 -91449 -224976 -248957 -73502 128450 -41503 -46085 -115394 28369
10445 18500 -81395 67737 42892 65188 -98513 228223 -103006 264460 -9165 -12985 163435
10433 -199693 -135627 87361 213711 -62037 238556 -233442 128324 -316945 -279772 -399606
10423 -399606 -48114 -263145 -112250 -25028 88028 -118654 -51884 -296153 180750 -144801
10412 -68174 17726 -182825 -76888 128427 66508 35071 -27589 -82775 -390332 -456180 52059
10400 85787 -147559 187784 -622041 -14769 39617 -106430 244135 51229 214794 175429
10390 175429 75521 -178383 123570 349212 200786 -32875 54164 424899 -179879 -88052
10379 130116 -9530 37510 413977 274349 570016 391050 701287 113335 308001 268178
10369 268178 206553 250842 390209 526626 486843 338316 248618 103552 -80628 71260 -140364
10357 227549 187177 320998 186938 494932 -40226 235602 309657 558152 499225 161002
10346 411035 206395 421155 366478 595098 528311 435451 93452 18012 578578 -7915 -134937
10335 -134937 465488 300335 -25239 -26005 54102 -47252 152843 -177610 -308670 1613 -142629
10323 -149328 199661 265043 485452 249919 -39134 328928 175206 -43552 117174 264902
10313 264902 -115314 225143 -309196 -120525 11097 104286 147018 35164 -244412 40562
10302 48097 -20682 163833 -75484 -238491 -285762 95930 -131214 -85040 57054 -94489 -218288
10291 -218288 -192740 -110010 -122708 -122901 147355 321083 -115170 -192097 170513 -130065 -19893
10279 -187127 -14357 12060 113167 58302 274889 128136 -69665 -310364 249399 -158993
10268 -62310 172252 217218 -123250 -239782 -47297 -384063 238782 79900 373481 235752
10258 235752 405404 294944 136131 376550 40001 75573 -234242 122222 126156 495647
10248 495647 118068 -204135 185077 -345374 -84014 72463 179652 -1414 47169 377321
10238 377321 107602 191110 -1261 -132471 -74850 -346178 144503 217595 396041 140929
10227 -21441 -21985 64265 -73501 3444 -122295 -217363 131833 -26483 26078 -12681 -190046 -43661
10214 116584 -127554 -183992 -104279 7177 332215 284300 -67189 -15291 180463 -138334 218431
10202 7959 216535 140955 -25432 111527 -162870 -66402 -86167 -236472 79947 -253421 -77853
10190 -81936 -367927 75380 109517 -238455 -203412 12164 -94595 -129273 -98700 -357662 -334289
10179 -334289 -321173 -85614 145265 6530 -129164 47752 137243 -240738 -293223 159746 -183067
10167 308882 12616 -249230 -94097 43835 287632 -51733 -270519 -56183 -184023 -69927 -246142
10156 -246142 32464 -215042 220628 -136485 83709 -171490 138859 -146135 -194795 82865
10145 -176733 -290870 -118209 94930 -44821 -270222 -188615 -184063 311573 30868 -312607 218257
10133 57630 133495 64012 -206305 -165247 309016 -93224 -67599 -78408 -83774 -123911 42308
10121 -115990 1948 -18565 210671 -57606 -177762 -203700 -180660 109357 78405 6813 28950
10110 28950 -140760 -138523 -224933 -419595 58774 -531730 -346865 -340349 91955 74 325367 12188
10097 -133522 31444 -71834 -76361 147214 -78649 -92603 -50558 12396 -165450 -238977 19566
10085 81382 1239 -35082 -9057 -215697 -535595 -83697 9770 -112722 190180 -114738 71161
10073 -5827 132772 56136 29255 112068 103421 -78977 306447 -62596 -163962 -130033 -66820
10062 -66820 -98938 -86760 -46850 -125173 -305221 33237 1793 -188223 -112446 127121 32054
10050 -43358 24703 -235842 46687 43722 -42523 -355909 43636 -269286 205993 -126302 72826
10038 -72780 -73437 -62906 -128106 -167448 22923 -320000 -131433 119128 3179 -80409 -487801
10027 -487801 315837 -168143 -175684 -400158 -145107 206368 -5752 -101916 -375474 -58745 104728
10015 -56196 85507 -525893 67339 -537732 129389 219425 -7439 -30836 -325391 -181422 -84075
10003 107318 -161115 -186284 27411 -226811 -93808 -290314 209518 184242 -84356 -10056 77561
9991 1488 30649 163509 -91781 300672 -31555 -118283 -62008 -109810 -114848 -256036 -83644 25745
9978 35374 -249285 88121 147964 -20620 173640 -289751 -294857 -375184 95831 -94909 5943 -113341
9965 284388 -147714 -31374 -163357 60774 -140728 77625 -90094 139960 -223247 -263019 -89234
9953 332892 31372 -37747 103011 -340265 336827 -86397 -105381 -100715 76099 -195381 -219080
9942 -219080 105044 -384946 155754 -245858 155761 313644 -288002 -121496 -22484 -160053
9932 -160053 -15570 -268816 -31485 260158 -83912 66556 -82430 -363014 -139692 58104 133343
9921 133343 -256173 93055 -8553 -141045 -363942 113700 75196 36770 -172049 -194458 -262660
9910 -262660 -144705 -206358 196394 121190 25303 2056 12966 -161487 -22621 22119 -114599
9898 -7772 113313 56417 -118606 60910 -141435 -245100 -231914 -33840 -211770 -332086 -285534
9887 -285534 88621 -219556 -7690 374541 -14856 -164212 90749 -184218 -270682 -3475 -268073
9876 -268073 -11391 -45371 248389 -53385 193240 -100806 -171228 -175140 131393 4157 106634
9865 106634 -69698 28087 -21348 -195425 -147151 70244 -12989 -13280 -12725 -162929 201874 -366758
9852 -21850 -29094 -11756 32494 -131361 -34428 164600 -99402 205288 311198 -62717 -228631
9841 -228631 -139470 144117 -33599 -77246 -75088 -345538 -412919 -121962 -204861 72377 467748
9830 467748 -153278 52634 -72385 -49333 -51083 26488 -326935 -205626 4948 -132280 56601
9818 -87530 269824 -74756 -39567 55347 -183240 -168812 397557 -458013 154670 94177 85108
9807 85108 -400882 -27462 -303789 -125329 46300 -301145 -77894 243427 19910 672 -296281
9795 -263653 -177936 -3572 -137443 -220723 69446 -449841 -178602 48532 -230468 -180800 24255
9783 -262213 -10164 -250621 -40254 -251573 123219 -72101 -361871 -82213 48649 239195 -35836
9771 5969 -65825 23649 -148712 56571 -105620 -407059 -93866 -195599 372030 43196 65427
9760 65427 -95640 -56145 59256 -75330 96506 -92933 42398 -302375 -129193 -97460 -360 -226011
9748 -226011 -134056 -145854 -251567 -19230 -92395 -79077 -93351 79064 11207 -228669 10174
9736 -118304 -251904 -307347 -165056 -245035 -354071 11385 -63750 -118366 -196512 -226082 -66334
9724 -116321 -24432 -26433 182298 57886 -25938 -322036 -117120 146976 -235171 89906 -171498
9712 85280 -201547 168534 158913 39089 -157800 -159126 -188640 -39939 -156412 115576 54379
9700 -21204 -216368 -284107 -70666 -86688 -10670 10662 90685 16521 -135574 -29717 -222105
9689 -222105 -409274 117694 -167981 255831 -154461 -29936 -229110 38363 -47697 32877
9678 -394405 -305738 -131057 -151783 -213985 54309 -39401 2847 -374132 -60586 -179539 119206
9666 18059 -56468 163955 -90951 106559 -86523 -98652 -229995 -30654 -241115 -162580 -24962
9654 -40414 76381 -86310 144758 -68127 -31958 69550 -48059 232322 -146037 -293869 26118
9642 -32229 -32647 -94708 207199 235401 41506 10828 -26539 -398383 299595 -4624 -68228 148128
9629 -140095 109675 -222943 135870 -177339 83244 -845 108833 -278378 -356590 -225363 40087
9617 -186608 36290 -124708 -32959 66759 -181662 73772 -28643 182758 -77736 -143165 -62108
9605 -92314 -430296 -148932 -45479 -152083 -86317 -127549 -119291 104622 -163718 308462 -53756
9593 -222222 -98513 3112 153377 -78123 372120 -142964 -236211 95645 -43669 162739 -188344
9581 -182090 13133 -23142 -202551 -245678 -63436 -113457 -126562 50536 16065 -68486 -384617
9570 -384617 -437653 5307 46842 18113 -344507 -150577 261332 -118410 -327006 93696 -230813
9558 -257858 -120241 238374 -147917 329370 -122967 -196833 -228047 -52746 298091 -103021
9547 -154688 -69958 -57074 234458 25237 66112 -121583 -28903 -63286 -510739 -1018 130605
9535 60885 -222235 81676 229771 -181989 -160172 -173096 223766 -113887 9649 71472 -109191
9523 -223536 -61230 -107715 -41516 -158847 128727 116801 107245 149694 -69394 -62040 -493609
9512 -493609 -108993 -232478 -289447 -156648 -133903 -84186 -123236 -254206 50179 239986 6464
9500 -109466 -180596 -258267 -148226 598 19412 -15054 7757 89128 -292283 22219 -90004 61764
9487 178239 150221 79729 -87465 165972 -177428 -206585 1318 -73935 -68824 127924 -119603
9475 245685 -134010 -241313 12575 -7576 -198203 -28561 18733 6051 161468 -62809 -66172
9464 -66172 -193394 3507 -345089 -343363 -257510 -37558 -325110 224935 -107393 58124 -252925
9452 -141360 -122277 427797 -66432 -168127 289147 46381 262382 -125363 -223844 -132624 -198406
9441 -198406 4773 -421375 -231462 -174947 36825 -123410 184920 261064 -114792 35043 3725
9429 -156281 -54048 141740 -99921 -262533 -336881 -190440 -181543 -121394 -24473 158554 197111
9418 197111 49678 261590 247903 -89734 -131214 -100413 183838 35187 211379 -131990 -192329
9407 -192329 -30282 69817 -113849 72553 -105350 -197693 -98040 -160688 198048 -37296 -40196
9396 -40196 -177454 -244285 120333 -55073 -239973 -360549 -80624 -148179 165221 -177663 -413964
9385 -413964 298839 -171295 27754 241575 -93211 183355 26756 -80816 -58717 583 3755
9374 3755 24939 140936 29355 -82256 -106131 -216979 -373048 -323603 -123542 31043 -273995
9362 -162899 -261031 -110516 54006 -140480 19214 3527 163469 -126885 -351731 -83027 -237110
9351 -237110 -101810 -278116 -61104 -405793 -162219 -154700 -145224 242794 38576 122937 79940
9340 79940 5583 -356341 -146993 -248325 102787 -202645 -76862 14042 27076 -236885 95947
9328 -91795 7989 244733 -49498 -403273 -198689 29945 8131 -117515 55680 -252153 -11412
9316 15950 3386 -259460 -111393 -47758 -205471 -46509 74 -119315 -234563 22476 -181924
9304 61337 -99636 -200400 64725 -162116 133148 -202813 -148232 -129493 -23328 188129 -137569
9292 -191687 -42744 101899 -7829 -319492 46013 -18939 -128098 -251431 -59064 -45153 -91086
9281 -91086 -93728 -140246 -127917 -240597 -265659 282179 407783 208915 131695 73445 -51867
9269 140509 135895 -167218 -82606 -211757 -55935 76690 148004 -126164 -40475 215 139398
9258 139398 52571 4885 -18376 74104 -59241 35399 130188 344054 146133 -132329 -423929
9247 -423929 107723 346600 94673 31906 -316702 32915 -153222 252772 102720 -172115
9236 -72179 83680 -357684 48240 26273 -38219 15215 -436541 -132190 -89066 -202930 12899
9224 -156198 -241754 16512 -53978 66008 -88852 14971 -110669 -129680 -347533 150097 -63643
9212 -73737 111094 -140946 52484 -23423 -183603 -279545 -86858 -158164 -224483 124339 -83173
9200 114767 15928 -341533 120184 254701 -117111 -267068 -278422 -92994 -72627 -98084 -21214
9188 -204733 234512 -194119 50861 -211860 -74628 133089 -205158 -17873 -63457 -13301 78815
9176 12019 229045 156446 195766 68015 -68334 -187469 -53439 -206174 -175407 -374410 86883
9164 28619 138128 -139457 69089 -305661 -2149 -148486 -98238 37455 154136 -247672 -134378
9153 -134378 103694 7115 173604 -255372 -34471 36880 -117690 150003 -206066 163378
9142 -289669 -20192 -154491 126941 20718 181352 -213300 159185 2045 -470454 -87525 -234511
9131 -234511 -104774 -68837 2299 -311677 52289 -137726 -95032 292506 -63350 150061 -308896
9119 -50381 22888 -271360 31498 -231112 -71440 -47382 -86656 119856 -357503 -206682 -166262
9108 -166262 -253030 96443 233680 79298 168639 59855 -84329 -143858 -262866 -178683 -72900
9096 -114537 -39953 93371 -92275 -240728 -269513 99772 -191471 -30962 -344889 -165890 176374
9084 56099 -308948 107687 -1471 371714 30608 -250494 -123131 -42232 106788 81946 -180596
9072 199456 -200499 35417 -148445 170676 38836 -132673 -231186 35591 -208872 123627
9061 255771 13693 50101 -40480 -266990 13158 126526 -76865 -30231 -109881 295035 62427
9049 59019 -163563 -256289 -209726 28436 111655 -274347 -184048 -429188 -667187 -426977 -285649
9038 -285649 -207871 -140838 264110 113640 141945 -56881 83555 270870 51032 -237618 -221039
9027 -221039 139106 -267106 -347540 306478 -507580 -156174 -110047 280117 28299 73733
9017 73733 2166 156980 -193407 204862 101597 -171666 -141973 142745 -29824 -84961 15280
9005 -319108 95060 -51164 -199503 85113 -259828 -43956 141514 -222404 142280 7920 -171833
8993 -9377 -44090 -262406 -3827 -58082 106319 -55865 50605 -125620 -136324 -64207 -156230 291111
8980 68785 -319189 -367743 -29062 140938 -120571 55691 -489419 225270 -20537 102799 151756
8969 151756 136361 -33918 -78557 152611 -310144 29462 -206840 -240168 -195200 -46941 -6353
8957 193978 -147954 -153087 155693 -340422 -39664 -42672 106330 16828 -109826 272425 -148736
8945 -36416 -190114 -231653 59675 -277408 -5485 66835 -45750 56660 -71113 337489 47563
8933 519733 80210 -84779 80769 134974 83515 -129369 266390 409207 386883 567456 2629702
8922 2629702 6614604 16639835 6041066 1662634 753515 464801 248145 221590 -181431
8912 275148 -130607 124702 -41678 328306 199492 50317 265824 293164 80035 -201468
8901 -82117 287085 -209681 -1858 273585 -161604 -84953 86708 59871 86794 -291990 134112
8889 -37210 -113213 86437 268257 -154684 20133 -453195 -61113 -232265 199807 87382 -52116
8877 -136758 -122612 43083 -127897 183462 -167357 129985 -129048 -32195 51960 171716
8867 171716 -213360 263336 -130656 -423282 -144610 -10593 -54585 -21183 -5225 -88261 -143664
8856 -143664 39001 -7996 203940 -255276 105594 162672 -5241 -11736 -354651 106764 -55263
8844 -109458 20733 124226 95684 -2201 -4824 170943 -255891 25607 -208480 25807 -148009
8832 -152954 -25165 -250174 -244362 68794 182348 85153 58272 -128480 194807 -336981 -20295
8820 22893 -137543 62586 130285 -105643 20852 -173478 -179496 89248 -96473 -140603 -181153
8809 -181153 -172102 -199744 140097 -43564 -142334 -109501 20919 -62071 138993 -98358 95803
8797 -166331 -24864 -61884 51025 -44649 -115086 -110860 -131324 142592 158242 98556 -37934 -267282
8785 -267282 -329262 -54440 -71168 72744 -274540 178156 -148403 14948 141771 218549 161514
8774 161514 -135832 208542 -293753 -282230 -154734 236849 -246286 -65498 -317088 -116071
8763 -479642 -90836 20376 -13639 29029 -22710 -139169 -254595 -89821 62568 -58884 64330
8751 -119841 -37794 -436524 -132916 -151138 -138438 -429821 185665 30908 -273982 -27602 -78024
8740 -78024 -98333 -49820 82901 -157193 27938 -146890 170189 244693 -72567 -317152 -284326
8729 -284326 -216512 64731 -98639 -105811 -33484 -193336 -80552 68468 -236639 -119075 -28937
8717 -601574 -8973 -27781 -205715 -143102 -189372 -151222 -171418 96834 182429 -58116 -361881
8706 -361881 169483 -181445 -219106 109816 -145104 296637 -57469 -90764 -231098 13166
8695 -110802 -29131 -138037 -274889 124010 225995 -17282 86828 -120448 -267957 249682
8684 186194 122742 -132554 -343944 61565 -49543 -8346 25521 224955 -159484 -92023 106305
8672 2527 -52867 28198 164239 -176585 -55937 86117 140677 97420 -103909 16538 81901
8661 81901 -56245 -196565 70656 -37686 -200364 -298865 -156081 -322747 -156486 -193889 -60703
8649 262137 -314431 -18108 156079 -8458 1243 59084 94893 -74891 -18945 462221 164967
8637 25169 -86315 21620 8052 57009 81065 -93004 -120504 86944 224457 -205157 111080
8625 -49622 148556 53633 117193 -148832 157000 -221628 101267 66460 297457 -174416
8614 126834 63562 -227453 -54383 -75483 -298070 38585 -139143 -281751 84641 -17429 -49748
8603 -49748 268137 163806 -140977 -143093 186019 77646 201200 -128061 -189745 -305194 -281635
8592 -281635 179919 12265 -138498 -135491 -34081 47909 -71051 282202 86367 22233 11279
8581 11279 -81800 97493 3151 -9847 -272569 24234 -165033 -116708 43762 -219587 3001 -16419
8568 -117096 -128110 -120582 141242 297090 -23360 185540 -331694 -47735 -83665 182857 -44339
8556 264789 -89067 -186385 157287 -43682 24581 -181499 -270349 -203495 -168531 -50502 -317088
8545 -317088 -34156 -47487 -185725 -109780 -198814 71870 120543 -116582 -297732 -34143 378697
8533 -77904 85097 37463 -142130 29205 72987 -195494 121069 -82439 119161 -195045 -188755
8522 -188755 -154588 -50425 39967 -395614 -80472 63288 -12065 39318 -302361 363294 -126275
8510 -268766 -192662 204068 -42149 251500 -136530 -391009 54379 32702 2654 -172054 115085
8498 -365185 -201722 -33521 101821 -244633 -93739 159955 -127877 -154492 95699 -24174 222732
8486 -198289 -223927 337346 113986 -17623 -234893 93978 -3965 -300518 -102423 -163248 -53535
8474 -143868 -130523 -217986 -74152 66613 -410890 77981 156071 -34284 97071 -72293 114013
8462 -392871 -151720 195980 -197923 96637 -74783 -29373 -35601 -168080 -86098 -73533 27060
8450 -102816 -135781 183766 -46409 180287 105 -87461 -45810 -146689 -141457 -292548 28797
8438 -289381 -42537 -80854 100634 -136734 142216 19527 -18238 41970 391840 49949 60761
8427 60761 -212577 -244505 -37501 284927 -281081 -27776 -34859 -274540 -174898 -63715 -76073
8416 -76073 1360 -29777 375272 -755 37350 -207912 -31304 -184910 -159967 -19815 201901 -162126
8403 -235643 -91920 -156767 -66673 -343928 99382 -264778 86800 171779 -216529 -15664 86458
8391 211243 131362 -255815 202779 -127870 211956 -254681 -33999 32710 -269900 -132067
8380 -6667 -368561 -57818 133888 -282978 5696 -148673 191700 -99819 -39723 -53625 -418866
8369 -418866 -57233 -262630 32972 -128448 102959 -35752 -221430 -206111 -24055 -37233 154686
8357 -69664 -22891 -136402 -86671 53626 -23828 -194607 193201 84983 145256 -1136 -185707
8346 -185707 -10669 31733 -153752 111209 195666 -54526 78228 -205389 4974 151168 -355530
8334 166031 -77138 -106502 232883 -99322 -252856 106596 56928 27998 39935 -6682 29913
8322 7935 -17157 106552 -273195 65491 10987 -246077 -26655 -141715 145000 288146 -157758
8310 166589 -175378 197073 -92996 41824 50575 -147051 -195172 -38544 -46379 -85742 -239240
8299 -239240 -219459 -295998 245950 -26469 37010 282750 -144050 -204579 -125105 5578 95375
8288 95375 56240 -229191 -211603 -174025 -23962 -465000 25660 -11273 283755 196967 215350
8277 215350 -2922 81760 162146 -101564 -188687 -195438 -35048 132939 -32799 18639 17985 28968
8265 28968 187500 1173 -25083 -165273 130688 -40902 -10009 -22245 -134675 -370415 230937
8253 -77719 49457 -184581 -101297 250175 -174083 -90018 148969 43414 26640 -272577 -508350
8242 -508350 -53105 -328852 24522 282262 -302242 -256557 142876 -8003 32401 60574 94067
8231 94067 24441 115958 57338 -152475 126246 -105719 314927 -21684 -27579 167267 -6558
8219 138049 -340585 -116911 -49293 178652 -135086 -31611 107788 -74935 158155 57562
8208 -260938 119444 -50214 -334269 -162589 416093 306551 -156479 2486 104479 68706
8198 68706 -221826 -31527 125031 69708 30901 -45517 123392 -88399 -254659 55588 -40243
8186 93258 -127563 -247038 -239347 -253592 31169 97561 136381 -139348 25967 75751 -75656
8174 -104602 -185371 -66652 -40349 59552 -229808 136701 -99087 -36054 112926 -332009 179971
8162 81575 290822 -76043 9573 268742 -290098 -78594 -2353 -281551 -26226 103270 64975
8151 64975 -7380 -206375 -179345 270493 -357686 -458370 85482 -205979 182860 -56865 -46914
8140 -46914 -259922 -73567 -4728 -337263 -149392 92770 -515875 -145327 -72240 -434776 -219924
8129 -219924 -22055 -175218 -192953 138600 -238942 34107 -147575 -297229 231211 -73015
8118 395209 -67926 150536 -35481 -208379 -151860 18451 -158087 -100512 -92231 -40482 -115192
8107 -115192 -515004 387246 265033 13178 55302 92694 26320 -19093 -51663 48626 -84712
8095 -100038 -151096 -251912 59247 16148 -343754 -165056 -194786 -59932 -139959 -86642 -3774
8083 -50970 147213 -167872 -209946 463518 -165629 -139228 -194889 -87491 -156308 -218645 -141529
8072 -141529 308945 -292089 376261 -396286 128454 23535 172833 -142415 88921 -65022
8061 -53661 126969 -358483 240076 128236 -48900 15964 44894 -98874 -104122 -54470 101921
8049 134069 -291386 -204473 150735 -428955 34759 -367098 -291474 94262 72903 -134277 212917
8037 67011 -7555 -52409 -50403 -54447 -76011 -56212 81049 26072 -85046 172865 -247293 -149055
8025 -149055 284746 -69349 -82301 26265 228552 -54173 -191265 197540 -298558 -166959
8015 -166959 8452 307503 31058 -393723 -141680 73637 100678 -68725 -256799 -70962 -155026
8004 -155026 -362 -172753 -60976 -263135 -8950 -61510 -338886 -421471 58298 34140 222052
7993 222052 -220730 43180 -93043 -60452 39054 -76316 -74412 -52621 -105040 5567 -191121 -131032
7981 -131032 -336855 -140722 36956 314051 98341 6927 -181743 -304769 31541 242703 48420
7969 -46019 -91761 -110841 -303417 -106441 43530 44157 -35917 -123213 64457 51181 94900 52408
7957 52408 -106599 -108942 246460 -203773 -68409 378995 -63805 -284079 -67263 -140051 -19015
7945 -127229 -186967 -110700 42548 151665 224317 -55070 -19192 177211 151221 -145089 226796
7933 -114221 -114007 -48336 -24696 -29073 65719 -348447 77756 2939 -170387 -280522 69786 133144
7921 133144 80164 -43055 -239616 -8604 -31840 121201 23624 193949 -187388 -177846 -202504
7910 -202504 -54626 -298705 132232 93143 91752 -278212 -47140 -219988 -191108 -61373 140810
7898 -303501 -21650 61148 35328 -241531 107850 7852 172205 5401 -221093 25726 -275781
7886 189389 -88295 -130815 53588 207474 -62612 34432 36939 -132171 101104 199770 -136721
7874 63685 221475 -14237 -119133 32458 174459 -5244 -49698 -320332 12593 -48820 155443
7862 67609 -242524 -259804 274139 -261964 -278728 -114065 302244 -566195 -35401 -55637 -302570
7851 -302570 -338543 -12044 245983 137453 200238 -30704 185678 -37339 -39139 2053 22233
7840 22233 -188559 -376486 3522 -83251 203327 -99998 -321150 33380 1009 -167323 -285081
7829 -285081 89735 122812 -45139 55575 -674 307049 13880 -87175 -61798 -60627 -173191 155805
7816 -151133 -73899 209347 -53456 120345 69518 192543 -153705 -192170 -181207 39348 -279490
7804 -95122 -209792 -232980 -357986 -156522 298618 -287872 -38952 -2185 231285 150795 -289952
7792 19538 220297 -61754 5344 51263 17953 10508 -203119 -183035 -213365 -352473 -151838
7780 -159194 83911 113530 -32455 -306284 136117 9802 148282 -122411 121909 27112 -127560
7768 -183157 -143867 -196964 227816 -112298 -23798 85991 -93230 -455794 -84930 162753 -241829
7756 -6231 89348 29891 101275 -328074 -468158 50502 -69683 64043 -24273 87884 56652 -98097
7743 62253 163146 -93409 93211 -307068 -35508 -200516 -269199 21074 182820 50306 109025
7732 109025 3833 25275 -73981 33100 -140919 -75388 -12929 11900 79847 -403938 1640 27607
7720 27607 -189527 -68375 -141713 -136171 -222729 137621 -142857 243863 19155 193254 193793
7709 193793 -133460 -54391 -236745 -130922 -312950 32446 15176 -44390 -178650 -101595 121696
7697 -125340 -2315 -55274 -193946 221821 180808 101063 37401 -121870 295625 -77159 -174077
7686 -174077 136160 34164 -181958 -324588 60907 -83495 -375241 -18653 30706 62135 -156802
7674 -248306 -21209 -175932 -95197 2159 -110123 -224735 -2067 250776 -129748 -211555 -371490
7663 -371490 139517 -153214 -103994 -89866 -147844 29665 92706 239561 -12784 44670 5789
7651 68231 -10891 48952 94669 138486 181395 -350280 -372399 94460 -222388 -40845 -318934
7640 -318934 73949 208695 -146282 1743 -50744 57776 38770 102909 -224125 137857 -72713
7628 164577 121154 -199203 74261 -25 43841 -286378 -34512 78650 -266242 -79724 -244849
7617 -244849 295 -62614 -85074 -13781 54119 55161 168756 -174951 -64800 -185107 -155870 -34357
7604 80447 493525 52941 220324 32921 206353 -9125 -53822 -148377 -64315 -135957 -138115 32857
7591 -26124 121531 -68000 291623 -73998 -115049 -18313 -128763 -39444 -300643 -48021 151968
7579 16271 -394548 -315340 -13484 -88395 -221093 -326235 88545 -199143 1243 63421 -279396
7567 131242 115336 194964 -36379 -137634 -216872 -53262 29591 -147972 -101689 -357954 276
7555 195441 -197913 -113385 -133934 -259555 200883 168093 6466 -201713 3924 17262 -153502
7543 50085 -56908 -510930 105019 394052 102806 -25025 257985 135854 -309433 -140164
7532 -228928 -146099 32922 1979 -99440 -22088 30868 19972 68263 5828 -124799 -98893 -159015
7520 -159015 -49589 56148 -25748 179177 247462 227184 -316833 -253890 117718 89677 4567
7508 -64835 -280629 43716 -114366 14406 -167260 75140 -191512 -182649 16766 -205550 165152
7496 186092 227574 184493 -245267 -85193 -16499 -58811 91966 74140 4137 -179326 -106288
7485 -106288 -341459 24466 -128471 -195933 -62020 50690 -146670 92614 -249126 -346725 24924
7473 -2453 67858 5600 -23719 261670 -59174 198142 -186176 557403 13635 59224 45196
7462 45196 -128303 -199089 -296247 97060 -196479 -321864 -111865 158288 -186671 -25784 -30016
7451 -30016 53728 70076 -67947 -47936 -260404 179242 112865 -92182 -135621 291426 -17151
7439 9925 18356 -210432 -80568 186998 -196143 -129542 -271920 57001 -167612 121247 164501
7428 164501 -44167 -39241 11769 146503 134714 -158897 -41598 -206548 58494 20660 -268080
7416 159137 -301569 75767 45956 89331 -54202 -52647 -174750 -240846 197926 -80846 76250
7404 -51598 -135794 110024 42337 -286785 -205329 -215077 -226161 84019 -273627 -63589 234700
7392 -221711 -74801 27902 -24762 -284360 -360423 -255901 33086 196014 175436 10673 47741
7381 47741 -144116 -269176 38641 -70752 117293 -80720 -993 -48935 -71060 -89542 -209872
7370 -209872 -150880 186157 -193533 137535 -382143 124848 -262119 -564973 116593 -154596
7359 -73090 -384905 262242 -829 -156608 -341870 74697 -132790 193690 -70590 -255000 -60181
7347 8529 -103072 -362420 -344570 -77847 -124 -96672 -58149 -39025 48440 7634 -233689 -105704
7334 -296976 36616 -24796 -413356 -96252 115654 130974 14149 112952 -102432 -76008 -1700
7322 -304606 100206 4011 -36463 145414 569345 109393 178292 -211453 28768 14193 95889
7311 95889 14257 -75087 -182458 -189040 3349 154089 219242 -2645 -32572 -179745 251190 -99817
7298 -99982 -78030 24428 -215181 -358678 -36535 -308904 28071 172878 78292 -177853 5917
7286 -112365 41210 -23093 164833 143923 -100004 -206887 -139638 -258910 86288 115804 -109136
7274 131506 -258932 -420736 -60025 -30782 84816 -204150 134718 -152481 -29673 -124873 169206
7262 -32264 -152670 29887 -179247 10672 169502 -8226 51680 -45934 -31350 -129397 -81961
7251 -81961 -276 -26549 -296497 17594 -142517 -178737 -18045 55418 -64351 267933 -30533 570976
7238 29120 23877 -84663 -306274 -237860 -49570 263791 -109014 -248212 79071 -324679 42536
7226 -254183 65584 46780 -118620 22915 340298 -19977 -162686 -73585 -357992 -84788 87797
7214 81337 250253 130943 -102309 22646 155908 140102 -109813 -124823 204006 -116467
7203 -147948 265318 -127106 -23454 -77156 41856 16479 -195397 61401 -326005 -100182 134844
7191 -263164 -67200 -45665 -86014 47439 -82537 -101572 -21021 -234306 -305575 -192890 -231210
7180 -231210 204275 133579 -390174 -116791 7948 -306138 -269008 -98228 215899 86733 -321688
7168 -19684 159408 254971 -183395 252729 -239542 -124808 -171895 -15501 -73862 -191831 -142463
7157 -142463 -61147 29457 129390 -158662 -301057 246963 210796 -7554 -318990 206271 -30581
7145 22674 -110648 -109823 -11343 90955 86310 -134314 213592 -17758 322682 30856 -39145 160241
7132 -54583 -52340 129360 -49802 106208 176419 181982 -231109 -94211 -182740 178926 303233
7121 303233 391991 110140 8212 -81262 344209 39112 -146193 24395 -118401 152252 -326315
7109 -21343 19160 -88811 130071 -147872 -89400 367310 -34019 -7663 -211764 86828 -338828
7097 21314 56645 116578 64195 15668 -234508 -26108 -91917 96081 -182915 -174169 104551
7085 -48273 -76411 -203161 267709 -107643 221543 25669 -399808 -217376 269392 -28989
7074 -123170 11824 173848 343204 -81836 317777 -40836 35471 47168 2688 -137320 -129019
7063 -129019 104068 -124219 -86368 57245 -292186 61782 22611 191728 89183 1081 111128
7052 111128 63562 -129246 -32533 50572 -86000 -168382 -194810 96017 97353 230657 -184349
7040 -149644 106512 -225062 -279981 378402 -42871 176214 -34759 -67324 161333 241648 -59496
7028 -31576 -8314 -203962 144272 -134565 189858 126486 -88535 359894 79943 -26462 144468
7016 108756 -158634 -276394 -105651 29066 10696 93381 -181507 -84766 -294206 364355
7005 327068 -362589 119585 -43358 -25475 180839 -114619 101714 -401239 -178843 -10379
6994 -244578 259365 -277926 240629 212050 304876 -415223 -92493 152739 92010 -26330 188093
6982 -56232 349600 -20172 24427 22635 -89298 -63877 53801 -283863 151055 44062 -137037
6970 140961 -35091 -263556 -70541 -15645 -271011 -148651 241383 126253 279065 389188
6960 389188 -186853 202409 -25919 218046 32601 86301 -128909 -152316 -286198 5094 -18249
6948 -240563 54850 84304 -202629 -156359 85126 -377786 -55698 119445 39149 -248134 -481481
6937 -481481 -63482 74751 -398485 -69865 -412080 -218052 -54512 201643 -172122 96150 45647
6925 78237 31695 -258347 25118 86963 -137384 -227806 -152955 -17388 -164560 70339 -136103
6913 -48421 -72015 -184647 -135229 -38882 55254 -68697 -180907 -182824 -184677 -63076 376123 65687
6900 -252880 -171556 332223 -56014 200104 417924 -65084 9886 -135299 -61172 -3995 200322
6888 178109 -95388 140125 -344685 -68484 86585 158404 -189447 46424 -70335 -54419 -252712
6877 -252712 -275014 -22609 -80702 171036 -8777 -1218 27004 -167978 -60248 -78609 14766 226262
6865 226262 21649 -28120 14736 -21468 184236 -185338 -342982 179182 -82781 -85649 137532
6853 131006 83994 110838 193273 -338667 -19000 -169584 -73921 129392 -345656 -65688 66131
6841 -329842 42176 30435 -86148 -69493 200102 281199 78241 -58017 101076 25775 361654
6830 361654 50808 -207391 -180752 -253886 79708 64347 -104592 -59572 -167366 35930 -10807
6818 -120954 91916 -8739 -227936 -150417 459881 37434 -101794 96153 315306 179725 17099
6806 7483 -365124 -18256 98302 34640 230060 9951 -20814 127568 212458 -127586 -385321
6795 -385321 -197365 102168 -12374 -106293 -11134 121659 -153864 215166 64073 -196725
6784 79059 142393 -154491 20250 105185 -2609 111347 -69638 230217 -37333 97391 -149729
6772 -85915 -183104 77529 -62140 -181969 10876 -179781 -259523 -79697 -28192 -64152 -62360 -107692
6760 -107692 37499 -281308 -37969 -296479 -284452 -73939 -66820 -185118 -269585 324446 208786
6749 208786 -264076 60963 -57164 101269 99036 47177 260975 -95498 -241351 -409157 111363
6737 -31028 78004 -73590 -140053 -208818 -231288 -237882 -72070 -74360 -106017 42205 -262678 -159975
6725 -159975 -228580 20709 214049 347832 -197107 118105 -30796 114952 139989 2111 22079
6714 22079 11673 -75370 -54229 84231 12045 110520 102480 -272569 -209904 -101882 149575
6702 214109 -187318 -75724 -79002 -26427 63456 76662 90176 -256215 -114365 50092 45317
6691 45317 175133 182679 -89352 11760 135465 140811 -34319 58438 -62747 87190 -209494 -46566
6678 40475 -18679 -154102 -13214 35374 -328687 20611 -46284 -70224 -50787 -3207 -85805 -29649
6665 30028 -134694 135378 150658 180172 -54934 -22369 -129269 212619 -47680 -89159 -54441
6654 -54441 -321704 118882 -514280 111459 -310931 -6123 -326099 -188344 18665 -18206 -109958
6643 -109958 15378 208838 38741 -98227 162201 75669 57075 -137830 35011 -89082 -231007
6632 -231007 -48588 53679 79354 -163413 182690 170807 280754 45079 312717 -174544 10198
6620 -68621 -185462 -21367 178562 80699 143171 -93208 -270444 -137832 -54374 -995 79681
6608 73681 69529 226590 -152041 -29915 99156 -14902 233209 -222277 8432 228743 32534
6596 -413863 -136173 445123 -28285 -317264 -167342 33537 -417379 -11562 -114285 -165091
6586 -165091 37429 261642 203603 -83370 204957 -88667 -222181 160940 -250211 71597 26009
6574 -155871 -149092 117291 -77130 68381 -118289 286416 67482 113667 106195 -218315 -174395
6563 -174395 -284564 143179 -229260 26108 -358463 285545 -74927 73075 183750 -170259
6552 -44583 -480633 190848 76101 123679 176312 -35636 -67736 -51826 -201270 -125086 56027
6540 22984 98411 111161 175916 -108108 -262643 -106324 -97664 219803 198501 224355 -38546
6528 21543 -19680 29368 48575 -82279 178185 -128040 -310277 239016 -139279 -16544 84693
6516 71702 -318942 -83263 204316 72412 -26653 99385 -294330 -139288 21549 -114339 -68879
6505 -68879 -145117 192916 258545 -262836 18251 -77001 -97033 224707 7912 -53570 173360
6493 244386 -47814 51719 -128191 1316 -229077 117445 10880 269551 54120 -37457 170521
6481 85750 -191303 225301 390697 -43589 179108 119006 -59324 127153 144950 -189257 -225684
6470 -225684 -190602 -93745 -89908 -63434 236281 -467508 -33302 334081 145434 586068 201513
6458 -169264 -115557 -481819 -79943 63676 54245 364519 267527 89766 -67733 202712 327052
6447 327052 -77624 -116752 -91444 12697 -123529 -174175 -68776 -3627 3530 -148665 87764 -26205
6434 -32973 -47019 16825 70881 -59639 112715 -246957 -110143 -18825 -38762 11890 -244380
6422 95595 -81186 -305052 174426 49406 -143450 324065 -30582 -70687 59997 114992 -370807
6410 160136 -55541 -322280 -87440 -69104 -20614 240667 -7062 -190955 -70312 -117575 231805
6398 -120631 -17476 227582 -34779 -30101 -98663 -163196 -58670 19671 165406 139956 30696
6386 -88341 -54595 -227008 -63338 413006 -251901 -265894 36033 113004 -173817 47791 339308
6375 339308 -21583 -122870 -204301 84753 -156317 260699 163349 -41385 151490 -11378 85049
6363 75316 -189372 -40869 -123675 266599 -182266 43080 -202064 -136422 142315 -137490 154401
6351 259388 -115651 -56452 -355181 -193301 -6542 -71362 -105506 25884 -290239 130818 24392
6339 -40821 -257109 -95745 -175625 68584 149776 -73493 -4947 243972 104935 44029 156673
6328 156673 91470 -124217 -145011 -236937 -107525 -90188 -49963 150792 -156503 -45656 -338070
6317 -338070 -21455 72950 60788 67556 -95193 -132995 187837 88759 -162232 117015 -10687
6305 -107546 264604 163610 -10123 -88431 -47914 138055 -130382 19519 40615 -88048 -90491
6294 -90491 252344 206069 68143 -161369 -13752 -128615 206289 -83544 88489 284623 -27238
6282 59910 -93002 58866 -62986 -116708 -126241 -219880 172323 -338095 -71061 -50676 -302490
6271 -302490 100086 67621 163036 -119558 35589 713 -258707 -78458 -233275 202623 25624
6259 -295731 299045 139654 -76753 159579 -263175 -198304 134278 -153713 -104261 -127364
6249 -127364 176434 244641 92834 261222 300903 82788 -119727 103129 31378 67019 258703
6238 258703 86860 31000 -21571 104715 180545 -22024 186348 46575 -22652 -5769 -32294
6227 -32294 -343092 86959 -24743 81552 13057 -260240 -77544 210108 78399 -134467 -127939
6216 -127939 -366008 11380 50097 226417 -169121 156728 209079 -7713 -180913 -57781 115847
6204 -167440 126098 55507 71993 249823 -98823 136795 21043 -36819 -124435 -312436 211196
6192 56724 107276 -354379 -226570 -134817 -20357 363153 -40891 -114395 114823 -188867 -54180
6180 -140844 -29132 267287 27850 -256822 137283 -50017 -76254 38987 -180762 -285323 55627
6168 166320 -584938 25165 223989 91410 313536 -154441 210055 -54065 -36132 276369
6157 -261573 -89432 119552 -183394 -170906 111784 -141998 17605 201582 2518 -33215 184923
6145 2368 188219 29566 -21262 -6326 48585 3878 76986 17024 4313 -79514 -64298 -79306
6133 -79306 230676 -26077 100748 -85407 -37614 182193 -102311 113313 8263 -36625 -430456
6122 -430456 -252866 -54380 -148154 -76286 100123 -47487 150442 135563 14552 54292 -108191
6110 25474 -374459 -92248 -157841 28322 -174721 17902 -64405 218167 -282564 2736 146664
6099 146664 -208275 161771 -95113 -154032 -377632 177789 30062 -37130 -358591 -256906
6089 -256906 -72744 -61869 564447 156 -187468 -188056 45758 62812 -88875 -297941 -73371 22329
6076 -36486 178941 178169 105822 -243004 -40592 -52601 -19212 -183157 279812 -159242 -265556
6065 -265556 366467 14139 97379 -59687 -274520 82754 94898 -61027 15167 -32816 -507378
6054 -507378 -159778 226662 -231675 44154 -230578 -125081 -39289 99863 -210227 61889
6043 25592 -280563 -243698 27286 -196635 -128173 -46890 -101469 245549 273669 -37180 165768
6031 147011 127808 234750 22125 176519 -100676 75509 -231100 -328350 -95388 86167 239194
6020 239194 209400 54490 26398 -215977 -305213 108229 -161618 -129008 7530 -202573 -189540
6009 -189540 14221 283072 112555 24193 -139465 144481 19976 153800 26679 38478 -34421
5997 -280245 -61799 -92372 81571 240872 -175305 8309 -58193 79251 -95061 286465 189020
5986 189020 -246565 -113602 -395191 441820 6755 -106399 -36753 -75658 103426 -120510
5975 60091 199621 -15230 -82660 254527 -196274 -123181 -79719 -124780 4445 116853 72170
5964 72170 19663 86601 -103143 -275623 187161 152495 73204 8498 -62259 -331301 137713
5952 -82869 228604 -218739 48550 120271 -285678 226034 -397698 5804 142083 218218 70056
5940 -9744 -239465 -342245 6506 171449 -5399 57581 297671 158674 -218420 49964 -17097
5928 82599 -418984 -113686 -186143 -216012 29109 -52410 303545 160741 87276 -193289 85633
5916 125235 -60352 -348266 56827 271248 -155698 88865 139855 3150 123012 -63094 -15113
5904 -115186 45005 -35622 29199 192335 239347 54735 -186647 2576 -118102 119855 -392801
5892 -81040 -24433 -272999 -117578 98968 -354314 55470 77966 149381 -42819 170538 181285
5881 181285 299888 152576 -82706 -84705 140934 -11351 52959 -182715 210145 87685 -81489
5869 -279542 148339 64297 272861 -97821 49358 132391 84499 24338 165355 59996 -20405
5857 99617 91580 39620 114446 244856 -11545 -129676 -281743 296665 -40706 365576 -72964
5845 -169247 -369972 246072 -110212 51304 -104387 -19795 51656 8693 14756 143235 -39785
5833 107909 -214603 204223 115578 308934 182807 -130020 32356 133977 81547 -49269
5822 7467 -166213 -216347 -134687 -285320 -21066 197444 -289954 -4881 163919 -20287 -462259
5811 -462259 -187826 53144 48487 -89689 -81655 -161976 -182067 -208414 -14964 -37241 112461 82040
5799 82040 -25650 95544 -185660 174176 231345 610 22580 334543 26354 120747 63005 4908
5786 234540 162027 -128053 139464 -219332 7120 -170511 -100257 137944 -152417 -135081 114807
5774 55035 -154569 13830 28326 -188610 -26977 -94167 227478 188644 43593 -89716 -372920
5763 -372920 212679 -135283 -58390 -159931 76569 50269 -422084 -182015 88672 -233160
5752 71183 -155539 161186 44345 -62592 -50608 -330442 -77859 -84042 -84305 64671 72206 103671
5740 103671 -86117 10181 -403347 243794 34393 82685 61241 -139071 -105901 -222413 -56564
5728 -263998 76287 -198471 -36645 94341 160464 -250348 28080 -462288 -107230 320467 -112964
5716 208145 -124861 106284 41361 114658 127630 -200822 -140133 -114752 173071 -27747 -16702
5705 -16702 -70882 2880 -52847 -48216 -126223 -30039 -26693 278857 -310023 28942 -8368 164125
5692 133207 -11214 117924 274211 -54324 -187029 -288610 233559 -392821 11652 75120
5682 75120 15169 225362 36590 17971 -91743 -36128 168801 -84154 22807 -155914 -267807
5671 -267807 -211373 134878 201985 270756 -36903 204784 -2806 -24811 51734 -72629 298815
5659 306273 26491 153875 -193847 25907 83838 200739 22685 -1643 -27244 -136203 -193914
5648 -193914 -137813 -192167 -21591 150228 -143682 -256875 -73982 -42571 187422 -11460 59039
5636 -70655 -113955 -130840 -380325 209869 -108273 82539 -225951 200148 -183631 -206085 -248166
5625 -248166 -138837 118100 -86235 246448 -186978 -350167 113346 -102984 -8332 58828
5614 -63815 -61676 59158 -176099 -189476 17870 282572 -36069 35554 -212887 235549 -32985
5602 -125276 25764 164559 -17122 -338933 23796 -3789 110295 115102 -74216 156217 -76824
5590 115779 -81136 -39359 -120409 -41992 141631 -16368 -353531 53546 147608 -104972 191694
5578 223691 156851 -156660 -79475 -881 178088 24315 -9306 -212354 -175897 -47485 128810
5566 -723 14971 106511 131314 79850 -212620 -148549 -40999 162462 30981 25356 161166 -253674
5553 -70486 7330 20049 45674 180788 230656 102854 -197315 202594 150616 282824 -36047
5541 -339829 228051 -181899 223915 -317146 21101 -68542 275439 -153528 -180434 160555
5530 -248597 68075 -92476 -75247 -132068 224767 -420939 -135559 117378 -32051 36668 -84807
5518 -188134 -16188 48724 87634 -62216 24790 61248 112176 -113315 90191 108785 102066 -111168
5505 67669 -106342 -47418 -84677 -90786 154678 8882 -48741 -139444 95684 -80258 -160611 -53659
5492 56078 55647 -68934 -267225 -67927 -39111 170177 207448 268566 -118566 -158559 -97208 -316094
5480 -316094 182843 -52983 -228973 -80588 -3619 68471 239954 110642 18375 119485 152786
5469 152786 -36224 -126489 -187875 199010 203568 -26651 108973 -174939 163881 -180577 26649
5457 -32832 4392 -132640 127164 -111512 -120653 -105150 23639 83989 103912 -141813 10828
5445 157825 50068 -288517 -136441 361744 -106432 -160653 -9786 -118596 -107561 -212752 -194922
5434 -194922 -78800 -157964 -380698 -116818 -145163 -104878 -246147 -49077 36885 46626 -90825
5422 174664 86010 -21480 221727 -76379 154030 292994 -332820 190832 -95387 67230 222785
5411 222785 167821 378709 -64061 -363003 -153332 308843 58191 73627 252352 26063 12839
5399 69327 -71638 -211873 119081 46788 253589 188975 -56263 121250 -71512 86199 -228057
5387 169358 232489 159623 -129035 33621 -168125 148709 20648 103673 204773 -213051 164070
5375 -46087 -186862 -72591 95334 197893 -399574 -324774 -76737 -116014 36011 -297228 119388
5363 -36450 270795 -126606 198575 89277 8744 158240 -139969 -270452 -152273 -348277
5353 -348277 90430 -18270 -309654 165002 -279173 -203952 19212 -127623 -48427 158438 -137109
5341 124216 -101369 -84431 -177016 -86308 183561 -154476 -91484 -129526 301390 -122414 5825
5329 -165030 83178 77779 164056 -328747 -305283 109738 -34672 13349 203598 -138814 -32977
5317 -205462 189695 109040 206901 -24542 -332871 225049 -222623 257651 129353 -82150
5306 31690 4675 187505 -534221 198128 -166388 235132 -131235 -115895 -179145 267655 -27442
5294 -107966 -85077 322679 -242303 101852 220276 -14529 186761 147882 -137230 -205167
5284 -205167 -30379 -539081 138496 64591 304175 144581 -72425 -12019 -95755 -41449 -274802
5273 -274802 319958 113845 241220 187253 -200189 12563 -128813 21538 -216033 -37506
5262 92745 88727 -123482 -252294 167312 -37655 52363 -210565 -255124 218442 50845 -116921
5250 25786 -55067 22148 9855 -22869 -108807 407710 -165105 -230020 223360 -125313 7363
5238 161251 57731 22942 66008 152194 -143375 -68474 -96956 212943 92515 125230 277482
5227 277482 -89479 131446 197915 85427 9636 -127414 38779 101944 -39031 58532 25051
5215 197009 35868 -144836 36613 -71511 -118392 -34728 -177853 33937 -21074 -164352 82257
5203 -34299 370626 -362776 -7421 16596 111668 54431 111447 -160385 -241762 52613 111826
5192 111826 -167736 -113748 -283836 -89865 94650 88950 -264954 43085 37174 -222429 130193
5180 -97837 -151500 -102517 195243 -205610 -19346 183007 41056 -57354 -133336 89063 -23809
5168 170030 327638 55331 122931 -153693 66933 -301901 -24653 417566 -335863 144098
5157 47311 -267504 373116 17726 -118964 -310566 162949 197825 179813 -38729 297570 286077
5146 286077 56449 150283 224897 -151902 397687 -30630 -157773 344902 -265587 161828
5135 -11078 120016 -81297 -73524 -105158 -220692 287098 -62378 285191 29257 42507 -256322
5123 -77485 -59163 -299906 -128036 -20340 -108745 -18958 23586 -388284 259133 -199017 -127748
5112 -127748 181949 -206345 -30522 -60255 253287 73488 2783 -212677 -106985 460827 312800
5101 312800 -281 2867 -266856 -590974 -119336 -148158 -163349 -23415 -248747 70268 -32911
5089 215565 26196 -16903 -9315 -126536 3130 110229 -43497 -329493 -35741 -178702 -237630
5078 -237630 296544 232768 203253 -143183 -50054 51837 196752 327022 -307933 191850
5067 233954 -64916 27160 -44068 90257 66091 -233579 135291 336229 365958 26750 39199
5056 39199 232377 -231925 205941 -197784 -95867 297071 -125617 57320 -51728 42370 -242805
5044 2416 50316 220880 42680 -14015 -67536 139452 -123470 152333 -231715 -67982 36220
5032 -65597 215730 179529 -170957 -163448 187266 122323 204630 407685 -245553 77772 111125
5021 111125 328411 329817 90754 351603 60246 -209084 -26242 -25541 259192 186813 169774
5010 169774 -17599 310149 -37554 136372 99990 -312948 277476 76657 -224123 318088
4999 -154599 47036 -9703 -73501 191272 195507 105163 -115423 202277 31390 -197152 176106
4987 -4931 128567 -111869 31015 110890 29710 250302 57630 138612 158186 -70824 28398
4975 110393 -155469 116620 -96523 405965 -93689 25718 263425 -12053 71946 -25104 -6526
4963 144070 -76912 -269769 -113616 -265889 232950 -22708 -274054 241006 -406353 -46144
4952 -98586 -287000 -200452 246508 121162 -126203 111311 -91487 11854 -56597 -385157 132137
4940 56585 156935 -53877 -198993 141769 -196242 217555 31654 117774 -147180 -35118 89055
4928 75108 -15767 -125119 -23461 -117267 143973 -88513 -68021 193809 -169042 -226771 136157
4916 312322 -136144 -313562 -51087 -202760 -111328 -45668 -42432 -108021 -60488 12589 271944
4905 271944 183833 -293960 90898 55054 194175 -228626 8688 -126958 49003 151452 -114836
4893 89856 -54732 132461 335594 -215835 196449 -269288 -152148 95556 306974 -93379
4882 25120 71445 350727 -101292 81453 85363 -45690 -33143 78905 -41596 -12865 -61315 -82670
4870 -82670 -36222 367902 -288739 -102774 65331 -73622 275362 22312 -58023 259830 71897
4858 48748 -246072 -129519 -40781 -404784 -247881 -73858 -100313 141650 -6702 72585 105458
4847 105458 215075 63953 49298 -59852 24611 -154303 204415 228139 -190525 101673 117863
4836 117863 26596 -148079 196700 148876 352482 -252396 -119766 120289 386063 -61970
4825 17493 -38525 119694 328202 184373 36969 -367752 171240 21728 -92908 18191 -207270
4813 98178 283951 18362 163032 57763 173526 80307 -254084 80758 529162 -169702 -283417
4802 -283417 -209 165844 -88086 30549 -114326 -66374 411058 91522 -34380 154148 19216
4790 97075 -146793 -41317 -110936 -149563 24161 -94122 168995 62364 -34320 -93929 35923
4778 28882 282218 -44093 71667 203546 -27476 35469 118718 17771 260510 -174504 34903
4766 92663 -463944 64726 239004 -120956 125767 -283245 212812 -24604 -56942 135460
4755 -54929 -115622 269924 -26233 -119395 -175257 -2060 1104 204217 -200208 495076 308323
4744 308323 18959 172352 -100016 138690 114141 88050 87537 -368519 -103101 70438 96996
4733 96996 -894 -192132 -248600 -102656 285241 -369471 -116507 155334 150563 -85442 70999
4721 167932 12809 -105954 266772 19454 186805 -46279 -46128 102445 127490 125847 49646
4709 -112184 -84890 -42124 127087 -320655 143679 97750 -122075 232306 -174529 -213528
4699 -213528 -136570 219958 -18898 -181430 -5718 67271 213159 171250 129417 108142 -45146
4687 138348 -30227 90799 -135681 -110588 38783 60286 62802 -22333 40019 -62542 -93274 36374
4674 -11545 -31740 -107060 511323 51493 -7366 -162221 272925 95766 -148922 149175 100857
4663 100857 382287 5647 49216 -94419 170616 254006 188517 130858 38840 43047 -144462
4651 12788 111542 -285596 -98787 152840 -401658 -282913 166727 -5038 252896 -105346 138696
4639 -106205 64629 234847 -235975 288115 -155236 230713 -54129 -158203 -220955 92093
4628 372680 -262497 -279271 79081 303239 25152 95049 -103304 -131151 -225142 248390 187580
4617 187580 -247077 -97923 38828 172389 154497 182057 -799 398424 -102855 -22085 -242966
4606 -242966 -75458 -4417 52042 -2008 79639 -186963 -9532 -361 50941 -68983 157344 -93493
4593 36555 -107340 392991 137557 -33555 -57934 -165119 3943 -55572 -99872 147024 -120954
4581 -56996 -148865 32413 -36055 -96816 -108079 -5702 26193 189219 213893 267294 -44583 -127017
4569 -127017 77820 78087 164017 94076 78839 -163994 -206658 97354 -13533 -97752 248998 230477
4557 230477 -151373 228596 -193376 -32288 87361 -92890 133328 -74227 -25968 72905 -46978
4545 -91857 -53351 -25512 14212 -63847 -124166 -138273 -58568 160636 21685 39929 -255789
4533 104857 105371 134114 -238115 -182318 303713 197897 -17331 -100938 182823 -26273 -140939
4522 -140939 264330 175317 -12357 -140359 -80498 -143418 28074 -59796 136163 133415 186025
4511 186025 203601 -170632 -288601 142394 -146841 137337 333165 39038 -39014 -183800
4501 -183800 40348 89395 100985 237113 -237940 194445 -167023 5599 229132 26471 -182702
4489 -18008 68952 -114860 133430 358731 152729 140267 -87601 -141214 -265140 -97196 203351
$$ [...]
##END NTUPLES=NMR SPECTRUM
##END=
