
##TITLE=AC1302_PERAH12114_7525498_Bu7zzF2CVs
##JCAMPDX= 6.0         $$ Bruker NMR JCAMP-DX V2.0
##DATA TYPE= NMR SPECTRUM
##DATA CLASS= NTUPLES
##ORIGIN= BRUKER
##OWNER= Administrator
$$ 1.72 TOPSPIN		Version 2.1
$$ 2013-02-20 19:08:36.532 -0500  Administrator@X
$$ Compression mode = diff/dup
##.OBSERVE FREQUENCY= 400.02188249412
##.OBSERVE NUCLEUS= ^1H
##.ACQUISITION MODE= SIMULTANEOUS (DQD)
##.ACQUISITION SCHEME= undefined
##.AVERAGES= 8
##.DIGITISER RES= 22
##SPECTROMETER/DATA SYSTEM= spect
##.PULSE SEQUENCE= zg30
##.SOLVENT NAME= COFFEE_meoh
##.SHIFT REFERENCE= INTERNAL, COFFEE_meoh, 1, 14.98509
##AUDIT TRAIL= $$ (NUMBER, WHEN, WHO, WHERE, PROCESS, VERSION, WHAT)
$$ ##TITLE= Audit trail, TOPSPIN		Version 2.1
$$ ##JCAMPDX= 5.01
$$ ##ORIGIN= Bruker BioSpin GmbH
$$ ##OWNER= Administrator
$$ $$ E:\/data/COFFEE/nmr/AC1302_PERAH12114_7525498_Bu7zzF2CVs/30/pdata/1/auditp.txt
$$ ##AUDIT TRAIL=  $$ (NUMBER, WHEN, WHO, WHERE, PROCESS, VERSION, WHAT)
(   1,<2013-02-20 19:08:27.897 -0500>,<Administrator>,<X>,<go>,<TOPSPIN 2.1>,
      <created by zg
	started at 2013-02-20 19:07:21.897 -0500,
	POWCHK enabled, PULCHK disabled,
       configuration hash MD5:
       86 BA 57 50 F2 9D 5C 9B 26 00 A9 28 5F 66 2E 89
       data hash MD5: 64K
       7A E8 27 E7 D7 EE 14 61 3A 10 EB B7 AD 2D D1 13>)
(   2,<2013-02-20 19:08:31.053 -0500>,<Administrator>,<X>,<proc1d>,<TOPSPIN 2.1>,
      <Start of raw data processing
       efp LB = 0 FT_mod = 6 PKNL = 1 PHC0 = 0 PHC1 = 0 SI = 32K 
       data hash MD5: 32K
       7F 2F 8E 4F E9 6F E8 84 59 F8 96 86 76 79 A5 E1>)
(   3,<2013-02-20 19:08:31.553 -0500>,<Administrator>,<X>,<proc1d>,<TOPSPIN 2.1>,
      <pk PHC0 = 68.4668 PHC1 = 0 
       data hash MD5: 32K
       27 C3 AC D7 E2 7B FD 3E 4B 27 80 1B 1F 97 13 FE>)
(   4,<2013-02-20 19:08:31.788 -0500>,<Administrator>,<X>,<proc1d>,<TOPSPIN 2.1>,
      <abs ABSG = 1 
       data hash MD5: 32K
       F2 21 4A 57 C3 F8 D5 B2 66 9E 2E 80 46 7E BA BE>)
(   5,<2013-02-20 19:08:31.928 -0500>,<Administrator>,<X>,<proc1d>,<TOPSPIN 2.1>,
      <abs ABSG = 2 
       data hash MD5: 32K
       80 F5 BE AC 67 5D D3 84 C6 DF 16 B5 E9 EF 4F 1E>)
(   6,<2013-02-20 19:08:32.116 -0500>,<Administrator>,<X>,<proc1d>,<TOPSPIN 2.1>,
      <abs ABSG = 3 
       data hash MD5: 32K
       E3 93 DF E0 03 EC 01 5E EA CC D6 17 CE 76 53 91>)
(   7,<2013-02-20 19:08:32.272 -0500>,<Administrator>,<X>,<proc1d>,<TOPSPIN 2.1>,
      <abs ABSG = 4 
       data hash MD5: 32K
       41 DF 13 7B 72 77 06 90 F3 CA 43 77 AD 4B 25 C6>)
(   8,<2013-02-20 19:08:32.413 -0500>,<Administrator>,<X>,<proc1d>,<TOPSPIN 2.1>,
      <abs ABSG = 5 
       data hash MD5: 32K
       FD 30 F1 60 B5 B1 25 D2 D5 24 1D 36 FA 6A 25 5F>)
$$ ##END=
$$ 
$$ $$ hash MD5
$$ $$ 0D 05 B0 D4 59 B3 4C B6 50 AD D4 4F 1E FD 4C 33
##$RELAX= 
##$RELAX= 
##$RELAX= 
##$RELAX= 
##$RELAX= 
##$RELAX= 
##$RELAX= 
$$ Bruker specific parameters
$$ --------------------------
##$DU= <E:\>
##$EXPNO= 30
##$NAME= <AC1302_PERAH12114_7525498_Bu7zzF2CVs>
$$ [...]
##$TP= (0..7)
150 150 150 150 150 150 150 150
##$TP07= 0
##$TPNAME0= <>
##$TPNAME1= <>
##$TPNAME2= <>
##$TPNAME3= <>
##$TPNAME4= <>
##$TPNAME5= <>
##$TPNAME6= <>
##$TPNAME7= <>
##$TPOAL= (0..7)
0.5 0.5 0.5 0.5 0.5 0.5 0.5 0.5
##$TPOFFS= (0..7)
0 0 0 0 0 0 0 0
##$TUNHIN= 0
##$TUNHOUT= 0
##$TUNXOUT= 0
##$USERA1= <user>
##$USERA2= <user>
##$USERA3= <user>
##$USERA4= <user>
##$USERA5= <user>
##$V9= 5
##$VALIST= <valist>
##$VCLIST= <CCCCCCCCCCCCCCC>
##$VD= 0
##$VDLIST= <DDDDDDDDDDDDDDD>
##$VPLIST= <PPPPPPPPPPPPPPP>
##$VTLIST= <TTTTTTTTTTTTTTT>
##$WBST= 1024
##$WBSW= 4
##$XGAIN= (0..3)
0 0 0 0
##$XL= 0
##$YL= 0
##$YMAX_a= 558803
##$YMIN_a= -555697
##$ZGOPTNS= <>
##$ZL1= 120
##$ZL2= 120
##$ZL3= 120
##$ZL4= 120
##$ABSF1= 14.98509
##$ABSF2= -5.573092
##$ABSG= 5
##$ABSL= 3
##$ALPHA= 0
##$AQORDER= 0
##$ASSFAC= 0
##$ASSFACI= 0
##$ASSFACX= 0
##$ASSWID= 0
##$AUNMP= <proc_prof1d_extract_pilot.lims>
##$AXLEFT= 0
##$AXNAME= <>
##$AXNUC= <1H>
##$AXRIGHT= 0
##$AXTYPE= 0
##$AXUNIT= <>
##$AZFE= 0.1
##$AZFW= 0.1
##$BCFW= 0
##$BC_mod= 0
##$BYTORDP= 0
##$COROFFS= 0
##$CY= 15
##$DATMOD= 1
##$DC= 0
##$DFILT= <>
##$DTYPP= 0
##$F1P= 0
##$F2P= 0
##$FCOR= 0.5
##$FTSIZE= 32768
##$FT_mod= 6
##$GAMMA= 0
##$GB= 0
##$INTBC= 1
##$INTSCL= 1
##$ISEN= 128
##$LB= 0
##$LEV0= 0
##$LPBIN= 0
##$MAXI= 10000
##$MC2= 0
##$MEAN= 0
##$ME_mod= 0
##$MI= 0
##$NCOEF= 0
##$NC_proc= -8
##$NLEV= 6
##$NOISF1= 0
##$NOISF2= 0
##$NSP= 0
##$NTH_PI= 0
##$NZP= 0
##$OFFSET= 14.98509
##$PC= 1
##$PHC0= 68.4668
##$PHC1= 0
##$PH_mod= 1
##$PKNL= yes
##$PPARMOD= 0
##$PPDIAG= 0
##$PPIPTYP= 0
##$PPMPNUM= 2147483647
##$PPRESOL= 1
##$PSCAL= 4
##$PSIGN= 0
##$PYNMP= <proc.py>
##$REVERSE= no
##$SF= 400.02
##$SI= 32768
##$SIGF1= 0
##$SIGF2= 0
##$SINO= 400
##$SIOLD= 32768
##$SPECTYP= <>
##$SREGLST= <1H.CDCl3>
##$SSB= 0
##$STSI= 32768
##$STSR= 0
##$SW_p= 8223.68421052631
##$SYMM= 0
##$S_DEV= 0
##$TDeff= 65536
##$TDoff= 0
##$TI= <>
##$TILT= no
##$TM1= 0
##$TM2= 0
##$TOPLEV= 0
##$USERP1= <user>
##$USERP2= <user>
##$USERP3= <user>
##$USERP4= <user>
##$USERP5= <user>
##$WDW= 1
##$XDIM= 32768
##$YMAX_p= 459521627
##$YMIN_p= -702490
##$CURPLOT= <Network HP LaserJet P1505>
##$CURPRIN= <$Network HP LaserJet P1505>
##$DFORMAT= <normdp>
##$LAYOUT= <+/1D_H.xwp>
##$LFORMAT= <normlp>
##$PFORMAT= <normpl>
##$SURQMSG= 1
$$ End of Bruker specific parameters
$$ ---------------------------------
##NTUPLES= NMR SPECTRUM
##VAR_NAME=  FREQUENCY,     SPECTRUM/REAL,   SPECTRUM/IMAG
##SYMBOL=    X,             R,               I
##VAR_TYPE=  INDEPENDENT,   DEPENDENT,       DEPENDENT
##VAR_FORM=  AFFN,          ASDF,            ASDF
##VAR_DIM=   32768,         32768,           32768
##UNITS=     HZ,            ARBITRARY UNITS, ARBITRARY UNITS
##FACTOR=    0.250966925370066, 1,           1
##FIRST=     8223.43324360094, 37123,        -61566
##LAST=      0,             -67110,          -110425
##MIN=       0,             -702490,         0
##MAX=       8223.43324360094, 459521627,    0
$$ Real data points
##PAGE= N=1
##DATA TABLE= (X++(R..R)), XYDATA
$$ [...]
23813 -151369 -241040 -282407 -213557 248511 -124880 -164784 24981 -102963 81833 -210689 -149456
23802 -149456 -134539 -131597 224146 -104502 -186795 -54643 -31136 -48346 -156608 -120810 59164
23790 73139 -97103 127799 -160633 -234633 -175408 29290 67657 170122 -232626 -124710 -275214
23779 -275214 97223 -14432 248989 -164234 501870 -141987 205817 -24094 62866 21670
23768 -87733 -127048 215352 -128407 78862 -140983 -17622 175357 256059 -254768 -121910
23757 -239991 38044 73726 -309018 -11145 31969 -210291 -189749 63508 139468 60750 -194554
23745 -31951 300492 -22800 39078 -175497 329893 211348 818 70040 -364680 -125176 -108230
23734 -108230 -94072 59204 134035 -80234 184714 -86796 -111118 42644 214417 3973 20940
23723 20940 -220985 115658 -64111 -232308 10560 -303969 18578 233897 -14128 179614
23712 49547 -353318 -192660 -84321 136016 93791 -162301 -270995 234386 -213362 -358475
23702 -358475 217878 -228333 -302 155086 -63236 35359 -63964 206995 -163611 -34286 32202
23690 -170863 82583 -222397 66095 192058 -83495 -138837 189390 -131598 337341 -170491
23679 -277146 140467 -179320 254243 -192160 -341868 -97858 197380 -195454 942 -184380
23668 -157391 -390631 -203782 172891 -346995 156555 144514 -21493 43366 68012 -76774
23657 96811 164978 -61876 -78472 295603 -17548 328910 158686 -128765 -53991 -43217 -10112
23645 -160302 -79168 219076 209592 64361 -144315 -273849 62536 -189857 -145663 71054 50893
23634 50893 75226 -195832 146818 -258618 204347 405484 -176175 -224632 35576 161770
23624 161770 43143 -150236 -79609 -60506 -128965 -97718 -117796 102619 -116736 -267578 110317
23612 32122 -156714 -155182 -128280 -165187 -228233 -48392 -24353 117377 -230209 -131992 84056
23600 -157196 -196271 111850 29723 -125164 -76534 -104722 -51679 211987 142179 -38664 -68439
23589 -68439 -311098 165466 163641 182510 -192243 376199 161162 -111257 5011 76881 141186
23578 141186 54395 52827 175306 111346 -13585 64886 -86022 110062 134855 -97786 -52874
23567 -52874 87999 58295 204665 82040 -128024 -185563 375100 -74222 -62769 -20497 -68519
23556 -68519 158373 -94665 121457 109403 -338848 -31723 -141189 -147956 -19988 79613 -136528
23544 -348223 -14958 40642 -90601 -82784 166932 201920 143794 -1562 -99258 -131063 14613 -103834
23531 108497 15989 137601 -213689 -220795 9804 -133979 29849 327849 19898 -21196 64921
23519 -107254 188142 276867 -93118 -261795 -122850 -94698 75396 215183 146101 -281658
23508 -99672 -48528 -9957 -24828 61484 89319 -7212 44569 1037 175813 100730 -213412 -224981
23496 -224981 138546 -181828 11009 -222909 233013 -265931 132635 -47623 116817 -102940
23485 85953 17758 119109 -1336 13482 -176614 2418 91435 41745 -377885 -131620 -197196
23474 -197196 66009 252675 -278822 -28893 94068 84493 87721 3512 -47115 36033 -275034
23462 383100 -5914 -58191 -32813 101797 196996 -325125 -64777 220444 -113214 302840 -265165
23450 -279113 -54199 -108758 -64091 -54942 22555 38785 -132033 -342072 74075 -41782 51712
23438 -19009 -323330 -172858 219323 204714 -382263 -168719 121665 -50555 -143333 -35666
23427 166021 -202152 -351039 -135667 -140593 347495 43489 -205527 -211250 -240555 26614 -83296
23415 -39497 28560 159358 139897 16549 67266 -74596 -103162 -338901 171941 -227415 -398558
23404 -398558 -354223 71362 -168433 192166 -113182 102885 -45190 31080 -225287 103449
23393 -142842 -26882 -48811 9223 -294703 243297 -630 -22818 -173308 349036 91743 -13959
23381 -349018 -65420 215954 77452 109868 86574 21371 -151399 -21562 95184 125761 291196
23370 291196 -61540 -385894 -200235 -296299 164317 -62707 78369 -145207 -2710 -168852 -82841
23358 220317 170675 -96709 148197 -47815 -52326 -84544 214420 -122769 46762 138417 -52861
23346 -32844 -209702 86488 -62204 -93812 -196086 -7234 -79347 377646 11504 111970 33989
23334 -97382 -174195 19386 -147613 62167 -130023 -71611 149909 236000 210371 -115714 -9042
23322 -147655 55647 272218 189516 170677 149627 -2752 -89552 8277 235099 -105909 9117
23310 294145 -274926 -155041 231420 -43961 29759 -109668 -3564 -44163 -227631 -8806 -348538
23299 -348538 23362 189020 -107410 -103646 -1569 111548 -110663 -311116 -162113 -20459 -159818
23288 -159818 -115517 -153771 25169 -14090 -47412 -174447 139214 -80328 -81454 30612 360587
23277 360587 289273 209555 66926 -142483 -124325 109067 147035 60273 -78505 25937 -37930
23265 -64710 -485985 -66684 80179 -146597 -406533 114383 -263188 -202934 -40687 172182
23254 50084 -20909 239992 161861 -144122 -316092 274200 -161686 342494 -50265 69252
23243 2610 -107764 108212 41966 77022 -112998 -219411 -134669 45745 47232 -117538 -76782
23232 -76782 272788 -171855 -72478 -82970 -96415 321992 -243925 68407 33102 107462 -139039
23220 -66606 -188540 -120876 68746 106748 7520 -129195 -284473 -472416 -1191 133765 -153459
23208 110719 133375 -306281 -40909 36016 205209 261831 155604 -140790 341077 147765
23197 -49242 -293507 -54889 -71339 -249205 37852 52289 145933 -82918 147687 73189 -148913
23185 304286 -213521 119274 -101566 76215 -16721 -131797 -23720 -453308 -283723 214459
23174 178624 9461 99488 34652 -96302 173705 -140609 -144207 24467 94420 143307 167300
23163 167300 -174989 -101392 -335027 296867 -134226 159026 -32402 -42369 -243854 106655
23152 115864 40395 68985 135569 -12897 211246 -95417 6589 -90578 -90273 114695 25211 -208381
23139 -89851 -137359 121368 159145 -125743 341297 233130 45206 -386603 78732 -213010
23128 -184303 -140474 259188 176754 137596 251286 -97562 256822 -134511 -33279 -60173 199076
23116 4683 1076 -387738 94538 -127925 -92401 -42111 -48593 -269338 -240448 -234000 -72988 -248414
23104 -248414 -129879 -115787 -67470 10553 178061 -248953 257998 322576 -37574 68642 -62372
23092 581491 -428369 75367 117678 95414 -174297 -83110 -136578 -136615 -351717 5439 -42184 -177983
23080 -177983 178788 494610 -228211 5692 -277447 -131210 144364 -155234 59515 250063
23070 250063 71877 -105180 -116335 -72620 -95474 -68883 -46522 5132 -175775 558265 -18153
23058 -359267 -29843 -6042 -79962 172295 -166971 -14058 197047 151293 -209051 -386295 -75968
23046 135263 4822 -118344 -153452 -132573 101994 -70237 -21086 4290 149901 291253 19982
23034 274681 -30220 23425 167533 76392 -187513 39133 -109545 -10362 -255189 -358041
23024 -358041 -142366 51842 295021 -133835 -26943 367666 96485 134339 -128466 -30991
23013 -202080 194622 -265887 46061 -370075 -206521 35956 257190 -193978 -44608 -123630
23003 -123630 156170 -21471 -44991 -24443 -238556 -96255 -72937 157366 306662 -84050 279506
22991 101610 -66295 70886 52175 -229038 236924 -33822 -15044 -141415 159457 87465 -199124
22979 -172206 220137 42002 98828 82133 40708 190624 42627 106021 2442 256781 161989
22968 161989 135014 6230 101781 422005 -84557 -261326 -310886 -221184 -335302 82137 113203
22957 113203 -110073 -199547 138543 -65698 41782 -42643 -125538 -117454 11866 100156 -237635
22945 60585 -107862 268628 -384957 -112269 -59482 -134809 -161913 -20394 -59950 146832 176775
22934 176775 -106500 -155283 18456 -101591 -513814 10276 147848 202347 3385 211099 2128
22922 -107682 -137089 -73403 -223838 -188091 73616 298909 -1929 109529 -159576 94456 -143703
22910 1123 52064 -85642 48292 -280093 181906 68067 38091 73660 -259067 100154 -143680
22898 -203 67610 -94041 177329 143529 -277513 30944 -236573 157195 154830 6788 -445280
22886 -156706 -71390 -146758 -261508 -104008 -22671 11525 -27387 -121628 -85223 218832 291044
22875 291044 -207023 124727 -250395 124735 -17897 25215 -144308 386183 72673 -147325
22864 -289152 104016 -130250 -161074 -409513 -164877 -71243 -212102 90361 35663 84816
22854 84816 1392 -169777 53130 -108368 94057 196877 93661 134654 91279 -143494 147152
22842 -110193 102032 227217 172854 -164384 23218 -1739 -114453 -206594 -203813 -310409 83462
22830 -80154 -247020 251828 168040 144331 -54743 50565 -103770 -148644 -254114 -39447 39420
22818 -82820 16039 -186865 -73794 -231377 260417 -53357 -279277 -73527 220200 -60363 -126452
22807 -126452 -106105 70898 16147 -144781 -100067 85771 -51165 -120376 -126540 225497 -78463
22795 -46476 49200 3874 -163931 -35144 -345262 225179 -455095 138201 -245029 54915 -319785
22783 79246 335621 104183 505 71264 -94114 60731 49161 -59042 105544 -72230 246806
22771 132753 102018 -10480 -62560 69938 159176 98397 -231789 -197353 28451 263756 106843
22759 -305020 -198021 -157164 240521 -17796 -117692 122516 -72253 138659 251637 52536
22748 -162856 -226829 3510 -5519 -250806 149283 373975 -165889 112379 -121122 -197914 -492273
22737 -492273 -175355 -90827 -54528 84628 312835 -195797 243 -67998 -47715 77852 -38873
22725 -227224 -121181 -289616 294162 20898 -147448 335426 79051 40137 -198993 -35535
22714 54719 48310 -48660 106589 13688 26393 25837 56243 -152943 64078 102556 -90195 20071
22701 -50128 -167761 3657 -105477 -178637 -4622 268581 87495 -103916 -195634 -151552 -232969
22690 -232969 101899 -31672 18919 250647 -169601 98397 -216106 241602 -38873 -79192
22680 -79192 -91505 150729 104930 15878 -5369 119015 -36870 232160 -144455 134696 -179276
22668 -247677 66274 381790 -311931 145430 -191819 113178 40920 -303085 -206929 -152425
22658 -152425 145589 -155005 -162323 188156 21728 -82764 -300229 2405 -146492 10618 -28988
22646 -43314 -188933 -17490 216812 25768 5944 63734 -95630 75987 28366 184895 -155016
22634 277367 -159791 -317766 -18274 -66739 214633 -514140 -100987 -106135 -94796 -157637 -210580
22623 -210580 114083 77571 -256603 -144296 -26840 -81110 82203 221868 18857 228689
22613 228689 25485 -71045 -74196 144648 -283282 -50317 -244408 -127303 -81992 -326658 44073
22601 -108660 -367785 -258750 226526 -315971 195588 244526 -29615 71737 -18367 296665
22590 17727 -58874 93591 88000 -90923 -54072 165294 136635 -169901 -298532 142852 318932
22579 318932 -259723 216315 -130676 19040 108602 -9973 30116 -121725 -111705 114142 -46302
22567 37676 -69519 45667 298361 136164 219401 -46675 -64369 111805 -43430 -52913 -196678
22556 -196678 -62581 -70492 -226650 -109235 158404 -92848 116160 -35079 -61938 21255 127035
22545 127035 174023 -34174 -206379 169699 5734 -191204 -130924 -56641 37778 -237823 -42543
22533 -31386 107898 -91958 22349 221836 165997 70622 -38862 63835 153322 -120433 101133
22521 262456 -245690 82272 -123510 -54506 67890 -247736 82372 -161078 -140099 31883 -337559
22509 49023 351917 -62156 -30077 -135614 13490 152847 -84665 -117159 -382557 -97570 387768
22497 -139510 -96329 34163 147082 -67314 -84655 349379 -48725 63958 -174373 54420 374519
22486 374519 157324 67825 -157248 -510054 163167 228903 244174 -251951 78992 -304597
22475 -20636 165493 130046 293101 -235369 -6282 -281270 288134 171374 122470 -21926 3455
22463 -82510 -129819 -403855 27759 -36835 13979 25993 -279356 -499 59426 -315594 -206896
22452 -206896 -279576 -115318 12763 310802 -92626 13132 97305 -105616 93199 -56474 3125
22440 -56478 -344519 -181121 -155192 34656 142195 42913 -168954 141672 -289846 -104239
22429 32369 124625 -75687 -145251 -249888 -240861 110 30967 52659 -187264 15361 -314398 188737
22416 -124398 -255771 -430762 -100885 71694 -87358 -166885 -151326 50834 -122901 -48948 78445
22404 67333 160123 -42218 90914 -215547 64917 -93922 -94193 18425 144571 17291 211423
22393 211423 108045 -16043 -39519 -235525 191 25035 68366 39371 -50964 -85992 -8580 -57544
22381 -57544 -224030 7645 -49869 25386 -200339 -188548 -262798 159233 149298 -33908 149894
22369 -34256 -68084 219362 -204859 7988 206139 -51280 -149786 -159178 -284246 43512 -16592
22357 96495 126040 88829 33231 -141002 50239 -39295 59276 -138202 185841 -1289 27220
22345 177656 -216741 -2157 -376044 -46594 87115 -95977 -182261 140917 252265 -53908 -30384
22334 -30384 -503858 -9087 -163116 -134228 -85673 -151876 -180659 -108455 -149783 -8862 591395
22322 -99095 -161862 251809 -95242 -135400 269854 47206 -453003 -264338 -100529 -375591
22312 -375591 -140908 -250410 -43395 78667 -105705 392729 -200966 -67690 -63885 -96621 -166548
22301 -166548 98728 103545 34258 40330 69926 -258375 534091 107395 5859 -158363 170803
22289 44918 325799 -288328 -53704 -615 32729 -37898 -225082 -148923 -66805 246014 257689
22278 257689 -44097 -107353 15883 -64150 -285471 -50675 166068 -231979 49261 -175023 264254
22266 -168497 188477 -39874 -44580 -167035 169227 -87458 -128844 -188537 106216 -172851 323951
22254 -70389 147335 -116103 150075 157636 -40385 309429 27031 -156719 -154536 -191854 -214631
22243 -214631 -105965 56598 -22504 -264171 -197729 11287 -67225 -110134 -152017 202131 45759
22231 226956 189149 375477 108134 -163804 -229391 -3297 275674 -141020 -180775 -27007 99577
22219 -62994 -90731 41863 -72783 -280266 126645 -366486 -2222 20687 95064 -248454 -103989
22207 26538 -255340 -82535 -91259 211912 51428 -79600 -170163 -40736 -179331 -178841 327950
22195 68349 -67072 -178759 46857 -64758 -3356 -235146 -78377 -127298 -101280 -418298 174836
22183 -159730 -126195 327245 78799 -94417 291863 138447 124428 -53999 -104621 -41973 -101536
22172 -101536 73882 56921 -96183 96125 -167980 -291817 -85101 249779 179784 -12930 213972
22160 6883 -321618 -14747 -163287 -72120 -122129 -132331 -142506 213061 -327562 -88623 -45573
22149 -45573 -43459 -281756 139005 -162756 -347532 56994 29861 159101 -288635 -143686
22138 -131112 -115356 -14032 -355138 -56381 -113754 -45108 77949 -65003 -178151 1925 -56525
22126 -111926 314903 -143913 -133991 -27609 -36246 63553 -146620 -68844 -18363 -25976 -111257
22115 -111257 -45620 279372 -197088 -94600 -131005 174322 -67798 120923 -202 -61029 -53372
22104 -53372 -97054 -393129 71073 72440 -91709 86608 -81727 233144 -365188 -397331 295590
22092 -136856 411812 -17613 15143 -158929 90741 52450 27445 263022 186450 -231698 -49684
22080 -122337 11852 -7537 -147492 142212 136190 -39989 -126363 86725 35661 -156766 -424538
22069 -424538 -189972 -28182 -163448 171061 63198 -303883 -224542 191 -118058 9568 -191472
22057 51833 -21339 -60483 -187827 -158434 -132300 -236209 -114266 -17956 62940 -264556 295412
22045 126664 128579 46383 -131644 436440 -116408 22986 -127740 -149680 -85999 -317130 -201592
22034 -201592 -110484 77381 71001 -22444 419403 320901 96157 -82057 -117436 -107789 -16290 105435
22021 -122799 -218362 -371598 -158096 -301926 -16507 66718 3792 244067 -178409 68023 -272530
22009 180202 -199366 -86869 -186747 93246 -73674 -183377 -87886 -341107 80578 -190947 167755
21997 -109270 -97936 -81378 -138401 -49786 142205 139880 231803 -352143 288741 179779 87530
21985 165162 138892 49188 45127 143611 30207 -128899 32031 -26425 -11156 -72936 -90944
21974 -90944 71421 -63617 -44110 -333106 -20864 -177142 36964 -137963 -80945 -160495 90801
21962 480325 -64732 -61944 -38903 -155066 -161771 309406 12898 51886 125687 -126847 340 -138073
21949 59024 -156675 -447535 7958 74358 85731 8154 -4463 184280 -20588 229182 -54648
21937 -127356 186147 -47103 -39557 91988 -43278 87672 -284926 67329 -156271 77308 -264355
21925 -29640 32862 -217737 123725 -7143 1018 243859 66038 -240562 51892 -224275 -123362
21914 -123362 -255146 -230466 425126 -5523 92762 -63032 -259753 -117800 -295936 -165400
21904 -165400 230632 132352 16594 12592 -90688 -30239 33422 -233527 -79382 -58436 -63804
21893 -63804 -261146 27688 -86266 -280062 301426 31181 -221527 54680 216781 37836 -41285
21881 -193751 30260 -334951 -159473 -49015 -130635 142110 -24001 -112131 -12494 -79325 -52533
21870 -52533 -95958 -164350 100740 -98791 -81161 70130 -32653 60224 -202846 26480 -25887
21858 12737 56055 13253 -41383 25383 -264646 -148246 -192968 167624 -425418 -208957 -36206
21846 -31173 37674 69882 180324 83385 -262169 24944 190569 119524 -251835 -295436 41218
21834 83426 88654 -223865 -38694 -343540 127811 -45373 -103490 322399 94226 -39187 -20359
21823 -20359 34047 2157 41001 72871 -341450 -147821 194106 138870 31092 -216373 127276
21811 -107078 23496 41850 -239675 41404 90716 144617 -152513 -94502 -284518 259114 70855
21799 -63334 169900 15160 -323212 -177285 -102554 365774 -186394 12134 51599 99613 -206083
21787 -181979 -114315 110462 43098 235255 -138212 313303 209835 129754 142411 -70878
21776 -150338 18613 -193137 -103588 -292001 141890 -4476 110685 -220049 194319 -75013
21765 -37287 -57925 -200543 -3191 225866 158264 -207522 293961 -200995 -122559 246958 -308793
21753 -11582 72316 -189595 -208072 -163846 -177029 -103052 -55511 -106388 108505 241452 -231719
21741 -86192 -81270 -204191 147362 -37018 -94125 -186817 -24548 -80833 -241643 121136 151169
21730 151169 -95795 -67290 -256455 18142 -85305 106306 -62243 -64046 -130704 -205052 -238338
21719 -238338 129437 95054 -35323 179968 181754 10410 39684 -61382 -77406 -104764 293516
21707 75848 -244086 -311641 -19410 58905 290482 62039 -154461 -64831 -269458 57783 -45542
21695 -397559 13440 -190252 -190725 -150067 -135920 -150984 244999 -120793 -217800 -99378 -65259
21684 -65259 154787 -176377 -167690 74038 -306318 3631 5346 12106 58386 -4120 -119603 -44734
21671 -376343 190569 69587 -366988 -1193 58100 -154293 18395 -43763 -364088 207040 91869
21659 -98092 -234591 -162938 -10613 168135 -321208 75305 63389 -102150 -95294 -197835 -166551
21648 -166551 105985 99499 -46388 136022 -125993 27445 311927 67220 -41874 80930 27257
21636 -118925 -220563 -61640 -147738 52957 117211 -41197 -356484 102349 63417 -87858 -6667
21624 -110623 227782 23289 -191829 91005 -209417 -101602 9190 -40077 39778 272411 -44998
21612 -230901 -355846 25692 266396 -188408 -400336 85211 55974 -271239 115014 118496
21602 118496 -243914 -103864 270974 -70968 101102 9472 93317 -98709 -15554 -397789 -39276
21590 80698 159825 102800 178065 -75670 258856 -8541 228079 163437 -10097 246264 269601
21579 269601 -92058 202580 124784 10307 137920 309446 -13196 -39169 -147154 145121
21568 50738 -177108 -121826 61320 -59331 220377 -119968 238092 -37605 -150480 -44605 830
21556 -73691 -332231 -136026 -232899 -175088 58777 203035 282138 -67146 9991 -370720 -87950
21544 -269358 -68547 -120763 -48026 237589 -138858 74326 -237547 -120046 20255 -208189
21533 -37466 108827 -197448 342227 -177336 -184029 106429 -86565 -283160 70355 -83566 -219673
21522 -219673 -86271 -54725 -165365 -137299 -241548 -149180 157225 -354596 44790 205519
21512 205519 -176522 -209717 48156 5141 -58693 -68019 -108966 92181 -302382 19549 157738
21501 157738 -471684 147882 -280786 10920 53178 43248 24321 -64643 -177832 -63783 -38246
21490 -38246 54515 -9305 -35080 30801 309678 -159842 -70428 95458 92494 -443448 -247432
21479 -247432 -99370 -230112 105160 -410453 -139775 309970 56201 -67929 41373 108830
21469 108830 -261071 -77086 280481 -211168 19709 43384 -164027 -4686 -74977 -144019 289160
21457 110349 74175 72838 142941 72817 -101555 -114088 42503 -61417 -304628 -196316 18050
21445 -305347 21662 34957 120972 76766 379432 403421 297152 64955 441830 246308 -81524
21433 135675 516076 -34424 44135 122023 83700 -14874 -92892 -90195 -50689 -157735 -10090
21421 -132070 236429 -51082 164983 -62396 -52090 -332676 -680609 159566 -27165 68897
21410 -176455 -87381 -76313 -148671 -83820 -87574 60899 -60709 -128308 -304463 -226582 -62690
21398 58898 31057 -133792 -332845 -226799 -307378 42332 89909 -12180 -86986 96925 208114
21387 208114 107092 116740 -294027 69179 200486 -123074 -153819 -308022 -105275 178244
21376 -233447 -331211 72324 8818 53087 140644 40333 15800 114918 379290 -127431 -104105
21365 -104105 319507 98421 41816 183135 87949 247345 -452222 -246127 -68063 -9448 -178140
21354 -178140 38810 243466 91438 44685 315628 137255 -263333 -261811 -445676 -155248
21343 26946 13296 92004 -233351 -103434 102237 13029 -91017 332783 -21137 -178396 -166253
21332 -166253 -149955 89548 -85167 -73383 -230272 -178482 64574 168377 -232517 -138488 -212230
21321 -212230 -162621 66120 -180255 -210149 -175084 -134783 185105 34534 -70694 -192377 72157
21309 -126876 215795 -25249 73012 -309930 -35388 20525 -179319 26390 -47422 -67715 97598
21297 -84191 134208 -239280 86723 84375 -26100 -494456 -222969 -260705 73577 296534 147402
21285 -44696 11729 2373 -64383 -159723 -195841 -27103 -222502 -31397 -196768 71511 -109787
21273 -12826 182822 -162026 -139561 30434 2365 -223414 -48100 -47860 -68215 -133173 -185932 339388
21260 -175890 130939 -305730 -114498 -238395 -38775 17023 -184672 -104442 -84148 -52145
21250 -52145 -40705 -283788 123929 -270588 -30782 -60249 -119575 -467434 -43037 84554 -198579
21238 -207549 59278 -154767 103991 -98660 151573 68732 273361 4085 182442 55904 -92199
21226 51093 -181203 136651 -298076 181136 60630 281130 105927 -97904 142710 -81329
21215 -148283 -35620 -142067 -144007 -212341 -162811 -14996 -74582 131116 -53987 -187548 -121504
21204 -121504 132017 -21753 184534 -48173 -73756 71368 -14269 -127843 -62266 -154377 -182111
21193 -182111 -57422 -74583 -88642 -109657 -221566 -149842 -158429 -278499 157202 237705 -143687
21181 -134056 136083 -38684 -151835 -179458 -190796 130078 -78291 -74473 150817 -35850 -129017
21170 -129017 -131432 21062 317276 186638 -158048 4555 20110 171091 117055 105319 -122151
21158 153392 -82284 -136607 66256 -152647 -267207 -62098 -110126 -59983 -114656 17194 -261547
21146 81233 -171711 -50534 87298 -82019 -130230 40622 208757 -71156 -10975 42572 104520
21135 104520 26532 -186816 8781 130228 -65932 211514 165268 270187 69889 -88569 -73986
21124 -73986 52793 36064 -109200 31866 69793 -64512 -183819 -282279 -31391 187611 -182275
21112 -73203 376278 -196629 -208332 153049 -29306 10727 163012 76741 -166530 -100447 -72935
21101 -72935 -90730 3 63149 72531 121235 -201946 102352 -211528 -207158 -188714 -44691 -63648
21089 -63648 45703 124508 -55231 153671 -355909 -155338 -220300 -184924 -145042 -204853 -133467
21078 -133467 -80629 -26422 16458 -145317 -48772 -223536 286985 -182609 -320788 -46645
21067 -42314 -39373 98415 64723 -267842 180350 68979 -240329 66837 -171025 -416526 124992
21055 80855 144766 5537 -168902 70748 124444 204477 -21626 -28683 -205564 -272680 -94355 -82524
21043 -82524 46478 -164050 40728 -29671 32481 -322184 294725 -250569 113076 26784 -302964
21031 19254 -22212 79922 192290 60976 -62656 169492 -179176 -114095 220869 -280117 -562388
21020 -562388 -145841 -159904 -117227 -194332 -179449 -243846 110351 -162051 89662 308020 -58187
21008 -15271 125062 -33692 65018 89356 -192646 97792 -125782 94385 114897 33499 -190504
20996 187270 145230 76700 77166 -398441 -55994 -101426 -100445 70925 -38827 -96203 -93867 -80711
20984 -80711 96491 -220836 -298478 -60959 -26447 -565680 297603 -1918 -240208 42223 49639
20973 49639 -88644 -73188 -308355 -314068 92952 112041 135031 -228740 160534 21091 -55510
20961 -421312 33522 -98776 -236820 -305726 -206011 65805 -71218 149226 293073 -230116 147012
20949 -174973 39269 -473501 -59074 -263155 -225587 172165 -86759 -516440 35946 -52124 39866
20937 -101390 67020 164007 -64583 -75297 -304649 128342 -73375 -85379 -103835 -267031 -52310
20925 -162569 128431 -55174 -79856 291056 -157801 -62813 274918 -53327 -371036 111733
20914 -14790 -158126 -266437 120547 -26829 -91522 92675 95729 -189691 185519 44120 -123376
20902 -420690 163751 -35281 -211499 322736 -34241 154358 107251 95775 -8070 -108440 174595
20890 -198349 110226 -89955 -78891 -52252 -264434 -128207 -28381 159865 -352367 121074
20879 405142 -320694 -45081 -236406 -288495 -102206 157350 -112525 249207 187998 -34603
20868 -126832 -194849 -58212 -103046 -128784 -147693 14026 -297508 225527 -151526 -68550 319023
20856 -86761 -70667 226151 116822 -199797 -370460 328630 -104808 57304 -142456 -102438
20846 -102438 -284346 -132618 -197955 -166494 80689 143480 151666 -26549 -180666 -212873 -194784
20835 -194784 107046 290160 34049 -81304 73905 144132 82192 115436 23108 -288192 -95506
20823 34665 -350885 -91027 79450 199346 150805 127937 -48844 -89748 -188567 138230 35729
20811 -145257 36391 80367 40064 -175501 -20573 -275052 -265732 256258 131640 -41574 -130235
20800 -130235 229767 -405271 -94320 -49262 -250995 40401 -281861 -185137 -193953 -340599 108190
20788 144472 -231210 -162550 -93757 -370805 88969 -178828 -164004 -38804 -97857 -310540 70928
20776 -482005 -106794 410820 -57401 234893 104664 -116516 -102201 130566 -38938 131575
20765 -29438 -16049 257497 -40728 -358335 -113254 213175 -42441 75751 -344346 -231014
20755 -231014 -223303 -90965 146852 -197509 -85489 -258943 -170624 76962 222730 -166360 -83509
20744 -83509 -81004 60861 -14080 36197 -119266 142508 94924 451585 -166468 -66552 -341424
20733 -341424 -152042 152575 8575 -382398 183532 86095 -90914 407065 -171236 -45775
20722 190227 250623 -110723 -145469 -84110 32236 43010 -30602 -99470 -90669 -83067 -164637 156665
20709 -260635 -53954 -54393 -156504 -179440 28178 -262235 65917 -292093 -124504 -211635 -30327
20697 -104146 -164945 -256074 -278172 -303870 53513 -127414 -157298 -49560 -25647 -30173 -173353
20686 -173353 -171988 -97221 10122 -189801 41237 -4619 -295918 -326851 -275026 144539 -24700
20674 138518 199391 -217473 -45396 129182 -220678 -416104 59769 -152137 -185641 -37024
20663 -10219 -313176 280619 -33158 -195103 -222738 63290 -154496 -192547 327840 -134999
20652 145504 -234638 -12369 -85576 -253840 -336248 133406 46262 -72612 91401 -1655 197118
20640 -50222 -208588 -423872 111645 267 -229431 -360310 -135731 251467 -186296 -208442
20630 -208442 -423195 498531 202243 -154658 104859 -274340 328728 338151 -229667 -335148
20620 -335148 -127273 -272854 -125140 230514 -174856 -316354 85184 18258 34191 10054
20609 -48173 101714 -59849 -1082 -357515 41741 151141 -225668 -44714 -191020 -109915 -109580
20598 -109580 -327568 -162009 -88146 -118232 39444 142646 -138507 -31332 -101946 -168400 103254
20586 -241243 208736 206335 201124 5680 95344 159107 233325 -189609 -113336 53556 206284
20575 206284 267938 34996 -93532 40680 -384406 -277388 -142299 -211041 -91152 -155674 -106184
20564 -106184 152838 55739 -156552 -55264 134595 -123711 80833 100805 -194533 -190213 18138
20552 -168201 -85841 -236150 -162602 19296 -138422 -66171 80810 -233066 264649 65523 -371629
20540 -181942 -54766 -3516 -389 -133795 -123369 -97259 4190 273005 -107635 189595 -162040
20528 -132259 -69184 -225740 -70831 -547120 345818 88550 -193595 -134808 102948 168346
20518 168346 -153115 -45417 125847 -102670 -159088 -7867 151972 117071 -87465 117989 119629
20507 119629 -61877 40805 -133504 19442 71512 11228 49413 141832 -7056 -153784 92477
20495 -271732 -136852 -240399 54150 -267587 68873 113934 -191783 -220945 -93565 -438938
20485 -438938 -20573 -114668 -97353 -256232 22920 259536 -96325 54362 -34333 125645 9769
20473 -291386 98566 -199673 -151517 -140869 -208154 34542 -212176 -259988 -45639 -6130 -76768
20462 -76768 96019 -19686 -38442 123324 -213225 39580 117436 351263 -70984 37727 109935
20451 109935 15417 -308842 152320 -510853 71551 -42936 143938 -104045 12152 14780 -163611
20439 19087 76470 -63727 -179014 170918 -229901 112657 -3755 -499100 -92695 -75096 -17304
20427 -139851 -146318 -112117 -163427 -64360 75697 -259743 -223059 95584 75082 -149243 26249
20415 -32984 -28023 -24106 77257 -57026 -115277 61377 -403496 -128266 -9298 246029 -57317 98565
20402 28136 -133656 165771 64777 -352359 -37574 71190 -55747 -281704 -17917 -217226 -184027
20391 -184027 -120535 194702 -167989 95497 167095 -170379 -104861 -5001 -39127 -63021 -248935
20380 -248935 -125997 -46020 -61846 42148 316030 -105463 -160354 30067 -61923 -116199 -108496
20369 -108496 41093 45187 -35050 -361139 -196873 -302535 -175496 -252600 -133513 102194
20358 166961 -375355 14912 70517 -398791 -50443 -197223 215199 -18699 84514 233974
20348 233974 183076 -74889 138388 -9940 -200801 -277732 284 14790 154184 -143974 -225876
20337 -225876 188440 -319073 -31067 -117157 115925 -90504 -217341 66529 -43107 -203248
20327 -203248 -27559 -64137 -483476 148131 -163880 136197 -83631 -186541 -140799 -212182
20317 -212182 -259055 -170843 -143485 -122728 158404 -48379 -56768 112670 157603 -344693 37441
20305 -79628 -4669 -328070 -53392 170298 4484 -189813 -97877 -442924 -346059 169081 -128190
20293 -120335 14897 189517 113272 -58546 -97413 -123084 170940 -109725 -85309 -40181 5978
20281 -159784 -82677 86459 90567 31807 -287980 131749 -165017 -26033 54818 271259 -19154
20269 -108131 114363 -25390 150287 -311 23523 213653 -316970 60440 -28840 43996 -106491
20257 -259715 -56334 -144539 -145678 21549 -218744 62395 -144810 -444894 85063 -96484 148868
20245 394407 60659 -218027 -296183 -268300 -72294 -58171 -231248 -128027 -76862 149449 -111980
20233 -115710 -84991 127566 -54394 210126 98229 15466 -77636 20197 -12048 4575 204561
20222 204561 56751 108163 -118547 68907 -145104 55223 288440 129059 -46806 -80197 -70775
20211 -70775 -344841 198889 -294096 -53470 -196776 33145 -344565 -261762 -147220 140445
20200 -246586 167954 -34219 -109744 200765 -225303 -50404 -3584 -139659 -217108 -317169 140007
20188 -259208 22076 -836 -280336 -246200 -295262 47056 55155 -17132 -106513 327786 65589 1224
20175 -283609 -169305 29962 -198467 -128132 -15915 -66428 31968 -97721 -107615 6187 -92578
20163 -192407 103530 -91057 82201 29354 -162762 317375 -148313 -363674 -80725 18773
20152 49692 -305199 88053 -93159 30800 -239090 -96689 8135 -178235 -13663 77339 -57817
20140 89833 107303 -280391 -265412 194632 -229628 -309419 -131966 305251 -121851 81320
20129 -119934 -23405 -350724 -202054 73863 148082 60850 190107 -56153 -473099 317815
20118 115665 389955 63354 441768 -349820 86194 7609 230786 75660 12970 135998 -57572
20106 144956 17871 139910 40780 -129185 -52931 -61622 95741 7905 135717 126935 -70533
20094 39083 -314692 -46493 -18629 109751 -53957 -267300 -352685 -338165 -132413 -291283 130366
20082 24235 -55821 -148007 160666 -8889 -289130 -132664 -122001 -329245 -343371 95261 -206217
20070 -151921 -244806 -194665 279773 136105 -155245 -58444 185779 -107620 -245058 -35242
20059 2882 -288363 -492302 269309 -31789 22005 -98316 -287704 56595 177120 -278596 -263357
20048 -263357 7508 372000 -261930 -7853 -291342 42215 -378647 -103550 24440 -161440 63491
20036 -75849 115431 32684 -70155 -404604 63914 -151356 148968 -418094 324587 -316705
20025 248566 -268798 -65184 -76423 50926 -154583 -79189 134921 67197 97552 -6604 -350569
20014 -350569 -55213 209608 82631 52606 -351427 -90088 108562 -236496 162124 93728
20004 93728 -234923 -261581 -18064 -47807 -249519 -44989 -163792 159065 79556 -221752 145980
19992 228068 -355327 -18112 -2003 -196023 -261637 166178 -63741 -93479 25755 35053 8190
19980 37413 12483 349009 -297449 -20920 408815 -152152 -184963 57580 80535 -210665 -59119
19968 -11305 -199344 -272981 -72956 190702 344682 -32324 50662 -117736 81496 -298902 -42404
19956 34626 41933 -19312 -57396 -73548 40019 -176993 -288495 22930 -165137 -147137 9027
19944 39514 65029 -118637 -215519 60001 -230211 183029 135436 -359208 71456 72460 54176
19933 54176 -183641 -154155 -86948 -19114 63587 -37011 -145925 -131957 -26678 -311346 -98090
19921 155824 -182120 -195716 -314582 -126839 -311487 -166947 -328053 -73454 51286 -66926
19910 -32777 -29744 89988 151830 -2314 -21244 -303133 -36079 -204851 -314474 -28122 34222
19898 108606 109750 -797 -333990 -234772 109289 -144222 -171178 -107316 -285523 35170 64274
19887 64274 -110476 -158179 157661 -267128 204430 -71779 189147 236389 52623 -493255
19876 -5089 -191852 -43754 87286 -194927 210117 -568974 60905 -35722 -85684 -64676 -84203
19865 -84203 -269386 -150473 -8795 -102847 137271 112096 61511 -42305 -86854 -135085 -178557
19854 -178557 -14302 -79630 86228 -191807 -140188 -312622 -335321 -7125 -197302 32986 -44398
19842 -54252 6537 83293 -237254 -124605 -26683 -234236 48314 -165501 -75055 -51539 -96080
19831 -96080 372577 -18623 74254 -351535 -203635 128802 -418903 87794 -251524 -106396
19820 224085 -66780 -87737 -11204 -66868 102649 -39258 -14074 5834 -46343 -209718 -202551
19809 -202551 128175 49251 -253482 -71279 195186 -91429 -16575 209076 -159979 142284
19798 -248193 -22556 -210489 -504675 -239000 144787 -77733 -218624 -154027 -280455 175019
19787 -179831 101257 -340784 -156353 -176308 79848 -228224 13279 -75754 177082 -356079
19776 -194138 -1121 -235178 -264253 56758 132539 357658 38211 -171077 -36707 -56145 -209796
19765 -209796 -310946 108478 -320434 -35243 55890 92970 -84569 189841 -81748 -47837 -22459
19753 -24528 -360155 24644 50739 -163017 -272730 39219 56072 -40234 -260014 -91906 55996
19741 -45275 75159 -201302 -201555 19168 64179 -225080 6425 222497 185926 91027 -268286
19729 39014 -253935 -37183 -363530 311142 50787 -155633 -192584 -181773 105963 255 272884
19718 272884 -89952 223834 -308810 -57200 25997 -271772 -199565 68190 -191752 -148854 -185945
19707 -185945 41572 77811 132692 308587 199300 115317 -171727 -273006 39056 -207064
19696 -220240 62101 -329482 119514 160558 -28405 30571 294738 -182558 91164 -296034
19685 -176141 60211 -20152 -77916 87691 39146 28972 -58332 10172 99643 -82600 -688861
19674 -688861 -334892 -283994 -440867 100819 11499 152353 -93916 85003 -122129 70121
19663 114617 -437721 -71656 -335673 -18190 -499515 216223 56824 -71051 -2398 242457 -129210
19651 332540 234379 227563 76955 -14769 26043 -300051 -70352 -102057 -118968 -216269 -152517
19640 -152517 -198874 -171081 755 -93945 -331520 9142 89406 -287436 120813 -280048 15943
19628 -165030 -85501 -225488 -8843 181969 -231589 -362908 -342406 -195478 -77282 -80056 -180335
19617 -180335 46509 79806 -272299 38302 4772 -102077 -64611 -76448 76329 64481 -77927
19605 63684 -120208 189688 -259248 97580 -85759 -27731 171564 -142611 41884 -83475 53875
19593 -129930 -165287 -163063 -220250 11807 -50802 -189578 -152042 -3004 281216 -147821 -22950
19581 -75977 74527 29049 -187419 164859 23179 104311 153385 -92999 151124 -64439 -78224
19570 -78224 -150844 310259 -157370 128703 -104819 -16426 132805 -47188 153644 -75404
19559 226693 -122833 -412504 15014 -137124 -166653 101507 -113447 -4466 -22075 11920 -174241
19547 -181167 -128005 -377544 -49000 -19687 -108867 116297 -297297 123993 -51731 422 -315842
19535 -59403 -44780 -222965 -211582 45327 -169830 -294494 115702 53271 -76552 -116024 -227668
19524 -227668 707 -136523 -146968 63553 167241 -54049 -243956 -383364 114841 69216 -183926
19512 -210786 30042 -46800 -62599 -327131 -49293 -132268 -63030 -430115 268336 -142964 -85524
19501 -85524 131306 -5200 -44193 40558 -210629 -14904 -97076 23080 -310547 -24090 -1131
19489 -3744 76006 -4351 16882 209246 -25404 234894 -216755 -140071 -32070 537 36319 -121524
19476 411242 67998 -162708 61812 -105124 -31275 -324914 -144319 10637 56017 -126134
19465 46476 147155 -200184 -158144 29081 -134340 282575 378063 207923 -90076 -56827 100402
19453 81570 -31795 -511085 121597 157739 157532 -265784 -179094 7182 62022 53234 -123167 -477390
19441 -477390 -20781 -88691 -157002 39631 371975 347904 15875 12681 -511655 129634 169831
19430 169831 173483 -83790 99204 79480 57663 -172238 -282870 -132814 -248452 -144102 204685
19418 44975 292514 -207191 81564 -17045 -25908 -267753 -287992 -223323 134592 92357 -76796
19406 121257 -156511 96175 -330510 -103982 -241872 -132961 -202895 -292805 144175 -150572
19395 -133319 -468573 -18515 -483635 -216186 -65293 -110485 -81283 102756 67577 51370 -186516
19383 66272 71340 -167586 76898 -257921 29875 68108 180250 -32936 67381 -231296 -5195
19371 -24739 16602 -91929 -93583 76936 -134237 -132090 192037 -13224 -155922 -332849 -143356
19359 -152605 -47236 88214 -21008 211803 20514 185665 -224812 107036 -197388 -121632
19349 -121632 -16037 21453 -51158 -109039 -58311 -33788 -43400 38441 -252346 -276507 -103661
19337 -240619 -208171 -220069 86231 -214874 29922 -159745 -57907 -360461 -143120 3242 -176572
19325 -92804 -128724 -209670 -295868 -332580 289827 -89118 -177157 120794 -157899 83641 -195641
19313 -167572 154860 124312 255934 -283935 117247 -286181 9350 -317864 245104 -33387
19302 137112 -56135 222452 56056 14253 -125600 -200146 -17076 -129612 -338457 -36941 147171
19290 -117771 -272885 355656 -63646 -12758 37405 -222983 -66177 -129001 -62378 -55451 -69050
19279 -69050 -92810 -150135 -314270 228173 73705 58451 -348063 -244841 -191905 7492 166891
19268 166891 9736 -148788 -89308 127663 91586 -260573 60087 131604 -166493 -48727 -39466
19257 -39466 -47003 -231812 116172 -127587 -37286 337840 203949 403 108615 8611 20044
19246 20044 -41214 -108156 101979 51760 -260550 -120097 28159 -127033 56976 45601 69017
19235 69017 -167776 -23257 -325105 -165264 30106 -53751 -82514 180491 -87258 -319568 77222
19223 -140157 -148890 -332263 252470 10532 -359733 -180730 236677 -77914 66154 24063 -241256
19211 86750 41831 7150 66987 -68010 -34980 21373 -266266 37892 -222326 -204415 -23577
19199 -338321 -303252 -213828 -288304 65773 -390267 118450 -274766 -63206 -126857 -263761 -195312
19188 -195312 95342 80113 -122571 -138798 28224 319693 -53032 -232163 119643 -291908
19177 -127189 -126656 47590 15724 -56047 -184627 -30292 -147511 -56433 124504 -293279 137395
19165 69550 -107924 -418 -319791 -63211 -226394 125766 -25229 126178 -8057 -8204 -161700
19154 -161700 -179533 175603 -95701 -139913 44549 -62120 -41667 13822 43480 -80980 -226712
19143 -226712 -142755 107218 -72598 -296656 81182 83641 -37761 164414 -132209 -33034 -224503
19132 -224503 256053 -59452 -165256 -80610 -257112 130482 -244843 3228 162977 26963
19121 -115219 -21756 26506 182021 -381753 -42800 241703 -154814 -345 108626 -36513 -102466
19110 -102466 57510 -55908 -231658 130042 -16331 223929 -164521 -266817 227762 -398115
19099 118891 124701 217693 13817 184402 -210794 -177110 -122774 -23657 -179234 -318205 -294001
19088 -294001 115949 -199315 -35248 -58443 160939 65035 -210293 -34291 -7785 -376039 -76050
19076 -52271 -394888 -129324 35219 -197625 199000 -211728 -272232 -76644 -118662 -273746
19066 -273746 -230433 -32451 233674 106131 88436 -85088 -142517 137603 -147901 234411
19055 -282759 -8734 -198335 -225635 214589 -59272 -154559 -180676 -686539 -193399 -184973 -182392
19044 -182392 -73300 365951 -309281 -148354 -193214 115331 13678 -170118 22467 -78664
19033 -140267 256197 153269 325700 91988 269493 96684 -272999 -9165 -146219 169794
19022 337744 105933 38114 331491 -157874 201389 179876 -17967 -375695 92451 -86086
19011 44364 5256 161092 -25121 -73847 -28669 -63155 -245497 23559 33762 183918 127390
19000 127390 -35997 -60118 -30371 -105550 -114856 -74150 -31199 -100356 -194552 -26815 42752 -208759
18987 -413213 -76492 -50603 391834 -159672 151268 174970 -353733 -118144 94315 23307
18976 192326 -364960 -146363 -185884 -75040 59074 205556 -215556 -213838 44860 -108577 69910
18964 -96326 -28352 169892 -78593 -31320 72682 -216109 -62435 91642 -138 208024 107223
18953 107223 -46819 -2240 -76976 58456 -148559 343084 119542 -467452 242537 -81531 62138
18941 11598 154932 -49216 -244 -7372 -80309 71553 234387 -222160 176109 -50722 -380045
18930 -380045 -115450 -95399 -175966 333511 162444 -142853 -74697 -205860 -100245 2538
18919 -182665 -103015 877 179934 -111763 -34305 -9438 182561 -172520 -198389 -90093 8321
18907 144357 -331578 -79558 -513067 -71720 7894 202796 -74562 -140099 157262 -243141 137753
18895 -26164 480504 -160840 116892 -270182 -154042 27029 -169871 -51822 192216 -64717
18884 26815 -96330 125681 -144174 -4971 -186012 -67822 -276618 201865 -112043 -54657 -20498
18872 -65458 -108666 -300761 -176425 -242586 -49039 -70917 263637 -169311 42124 -116162 -177396
18861 -177396 -119498 -212355 -279268 -388098 -260924 75361 116745 -238995 -10784 165094 -204078
18849 -93562 -53995 50324 82376 -381417 201554 60330 -274396 -12169 61926 53245 -309410
18837 22016 24570 -566632 -199317 106755 -49293 -39681 -24484 -166897 164107 -87699 -232127
18826 -232127 318326 -331015 -383642 163339 -5118 107237 -357581 -151331 69471 -51795
18815 223439 154057 199569 -119353 -21399 -97825 190839 127882 18047 -42057 98797 -194508
18803 131689 109211 -129646 -125739 227482 98534 230657 -28778 -59393 -3975 -251853 -80612
18791 126457 -99851 -147205 -132555 32061 -135506 95150 -359304 -66263 179054 146821 -3105
18779 68094 -117096 -90985 79925 -276393 -97829 -33367 11449 235919 -116693 -82535 12926
18767 -39563 -349929 68042 74272 51486 -219786 -266984 -272986 -196386 -101867 -106611 -198761 129334
18754 339291 -336073 101455 -328823 -31044 28907 231752 -60413 -15425 -11509 -85018 -98575
18743 -98575 58814 -303955 -18488 -60858 225048 164524 85505 93725 111415 -235609 84947
18731 -145023 -37630 386051 -141038 8612 -136710 -151845 -159305 -277104 13030 62626 -277041
18719 -27229 4704 76283 -159656 -204442 -28250 251590 326370 116521 -136477 107743 -92624
18707 -221990 -522516 -385837 -53537 -130520 -175546 -75911 94786 -237251 -42531 -144131 -138615
18696 -138615 -1867 -178917 -6442 21814 28912 -250999 -206322 23020 113312 -122893 -41930
18684 -321617 212263 -80212 167759 -70401 -98870 -163940 -156321 128984 -255239 -139679 54361
18672 103716 357246 -70744 -464221 428 -28184 -220360 18014 -258678 -21136 -102294 203428
18660 -78830 -44298 38843 -30560 160504 62801 141575 122173 106046 -111299 283892 161331
18649 161331 -280690 52922 164734 -240925 -61818 -179692 -279764 -277366 253183 103276
18638 412287 -51575 29792 -135003 -131347 39982 -104601 46945 -355874 -196879 220907 -30714
18626 24076 -116879 -153700 17576 159073 43454 -285590 238370 210391 252652 -154463 69171
18614 81639 -35159 14925 -159037 -102211 -212650 -188282 139204 171111 42183 -232180 -19677
18602 -23973 128999 -292207 -25747 -22425 -181886 -83606 101290 -174770 62181 -149710 -164916
18591 -164916 14224 -9911 -311688 -215120 -35093 205028 -459547 -57003 161 355095 -168087
18579 61141 123990 -210162 40453 -109279 -57779 -120045 -72641 84182 -391888 -91620 21903
18567 191543 83806 -197346 -50824 -321637 -78236 -142205 -27056 251099 -186079 -404760
18557 -404760 73409 -14516 19016 47122 13534 -253091 -151618 131500 -172776 -339728
18547 -339728 -477899 -200404 -162259 23937 -225147 -60347 -99820 -251625 40672 157768
18537 157768 -151371 128836 69670 -259941 -16163 130297 167376 72007 13260 -223555
18526 247672 91934 80458 8529 8336 -230690 -177359 134885 -111590 46716 -200110 -210605
18515 -210605 -139579 -224750 285494 115092 -143013 24497 -57003 -106183 147172 14353 155857
18504 155857 -152770 66419 -306948 -70612 -42602 -309991 -242256 77426 103323 -86229 -15061
18492 -274903 145995 44777 -94979 -98743 -148744 202048 69368 143662 119144 -46093 -293648
18481 -293648 -87266 -185604 -241979 100418 -185844 -86894 -169541 50987 -150807 -107952 30166
18469 273099 38888 150591 -150668 -253572 -90294 139591 2670 253599 -2397 -151532 -91665
18458 -91665 -305713 -123438 -188678 -86698 -154233 -391063 133985 -141767 139524 -395189
18447 -171521 -213927 13889 -254840 -95397 -218920 152851 -118175 -21039 327833 -99099
18436 140065 -152698 -351779 151306 -112731 -178909 -26998 12099 -1921 22538 -112580 189035
18424 -28874 -367900 -38009 -252990 -24799 -57695 -326568 -133116 109241 -336068 97546
18413 -78906 123949 -196548 -215344 41635 -6767 -318567 26061 18826 -36712 55617 51412 138834
18401 138834 125541 306950 78667 26558 35629 6231 121271 -17895 -463 -36031 -91004 -248996
18389 -248996 -145000 91534 -115801 -200276 11964 -60101 -81482 48391 114156 -344931 15010
18377 -138028 117188 301589 119317 -173868 -248854 -101315 -236082 -91820 170132 235356
18367 235356 -136633 279334 -62065 -105607 -47463 37911 44277 11677 -378971 97101 -63848
18355 197960 -43418 -412518 108558 70224 55513 -129443 -51547 70982 148505 -354465 41178
18343 10118 94619 -22906 -86856 -383788 -37756 -252495 167702 -209325 -82217 103708 52685
18332 52685 318550 200933 -224219 -329409 -108014 20455 95408 54152 -70060 -223233
18322 -223233 -19718 -444609 183555 112724 43710 105215 -281151 -159835 32672 -235996
18311 4213 -26735 -118596 22697 198728 -478898 -114264 -121081 -72454 -109014 -399137 -166071
18299 197500 -177853 -97949 66554 -95554 -112068 -290820 -134036 155343 68214 -195939
18288 65977 172038 32607 -162452 -129819 -113081 29838 -171085 264328 -205727 -171138 -208038
18277 -208038 -16283 -196215 46662 -93209 148108 -159394 208500 -110622 72724 137198
18267 137198 -296556 147236 -3940 -181940 381774 266822 83572 97632 -308378 -188468
18257 -188468 -96567 -186607 -103778 132834 37880 29924 -299527 -148985 -102643 -88278 120634
18245 -119368 -175712 -217419 155575 20436 15434 -105608 -145821 -182135 -32943 -85993 -250851
18234 -250851 -159612 -378644 -477376 -117028 -80055 108513 291448 -11325 -94538 -140365 150082
18222 -213177 37491 59202 -104720 236712 -73406 -122081 122224 151368 -40117 -103197 947
18210 -99961 -39322 -102238 93355 -344912 -125903 -99764 24184 -288265 -223498 147303 -201270
18198 53842 225587 -245802 112427 -14377 -12863 8493 70195 3093 -30029 67126 13216 15199
18186 15199 -89047 69700 87010 -123927 25577 -294752 36627 -40183 -26081 115545 40622
18174 36099 48083 -93632 17734 82632 17296 315780 -6088 15740 -132159 122246 -47969
18162 268531 195088 130092 -388721 -12166 226938 -235211 66347 212571 -305891 77218
18151 19003 -9818 -339527 34191 248529 -131421 52228 32057 20062 -650 -303617 -184007
18140 -184007 164308 -26067 23634 33743 -15266 -101998 -317297 -21522 -158841 -268504 -259053
18129 -259053 -288772 70540 -108257 -293740 58610 -577271 48740 -220400 -255925 -151733
18119 -151733 145855 -47482 58374 30850 -380183 -47159 -279087 -105354 336263 -76123
18108 162 18004 -105535 102981 -1894 417376 105048 -122312 -75066 52914 -17855 19159
18096 -70526 -166640 -197119 -283834 -2138 146171 106055 23804 -60990 240397 -46745 -78201
18085 -78201 69808 307389 -145165 -341277 85001 107613 231373 -125005 -81807 135533
18074 -41272 -15612 -33792 82878 -10783 -55473 13625 -164570 156766 243259 -59370 -97411
18063 -97411 -127005 -59098 -177359 123023 -40588 -32325 40011 167212 -133329 176801 255984
18052 255984 -387004 46147 -85041 224922 209623 -139562 -182029 -5636 93151 23939 -233892
18040 115652 -86976 9201 325608 -178046 -350806 -73811 -262701 157201 -165232 -226261
18030 -226261 140908 -360279 -114577 -234613 -48611 -134599 137159 30912 16101 108315
18020 108315 106818 143378 -65908 58580 -212605 -119627 -358619 -161718 295541 -232115 -111422
18008 37987 135314 -10174 -182870 -316648 -197463 -55866 261032 -224724 139261 -412785
17997 -64936 78898 38604 -292990 76853 284052 95519 45372 -171278 -362196 -240459 112565
17985 172701 122609 56959 -157153 -399869 -188585 -51601 7390 -152983 -172443 -414368 -160368
17973 147040 -159779 127788 -117420 174873 139602 86253 -178030 -46527 -115715 49300
17962 316560 -60131 -14928 94793 6873 -46283 317783 59655 63606 108064 -131122 -15296
17950 -419426 322605 -207268 -11444 -56398 306942 -108165 124363 -62927 108560 214147
17940 214147 77603 -161146 -61352 -107679 245165 129165 121387 147022 -138454 269546 -201398
17928 -10010 65528 -88228 234418 193926 -128608 -107075 2488 174802 -74322 98763 131117
17917 131117 160221 18513 58167 -231061 -4856 106455 -273571 87809 22973 -154333 139863
17905 71340 -293901 -394537 -225142 -193411 383506 193461 93725 191851 182891 -177625 143264
17893 -225412 -135742 -152738 42246 123686 138034 -124849 153303 -31118 -129897 -17549 -78553
17882 -78553 -155290 -169428 -190426 -71347 -14615 -100748 132137 -53702 -225683 83447 47755
17871 47755 291527 474565 -293907 119388 -100895 295449 -146666 -282579 16209 84579
17861 84579 -3798 173243 -18807 28845 102570 -104565 215997 -285738 103333 -186364 135955
17849 -135215 -305970 -27517 -80082 -11335 -270527 370015 -172302 -292968 -124335 249936
17838 15430 200140 24134 111887 166524 -44335 -4335 -39473 -96220 125028 -188750 106920
17826 -16040 -154414 -38834 -353539 319664 -155961 -65354 50642 85064 399034 41542 190328
17815 190328 112359 378244 -245280 238218 152874 249467 -187401 231330 -99988 -207585
17805 -207585 -38782 -23709 48888 58290 359671 -109353 -52584 119056 -198856 -184373 -294782
17794 -294782 55489 344597 74659 214158 -20768 -130820 -30343 142139 9067 -208060 115188
17782 -176752 188173 -120753 236155 213552 -66789 -15112 -90611 -90913 -212003 -106618 136965
17770 -196397 143209 112049 -29506 -110941 306649 -67810 44501 -36102 -33494 -31345 253636
17758 -37368 -74532 185584 90364 231784 -299437 57540 -283731 -258584 -211633 -287779 60515
17746 -148810 73252 -6798 351062 -129950 -112587 -341316 -187292 159444 -123528 257478
17735 233209 77929 319024 -140354 14074 188569 17391 -340376 -9396 113292 -15684 98711
17723 125655 -136484 222429 -282430 -67269 204719 -81922 129059 119989 138893 -124003
17712 -68920 306732 -100540 -293503 408261 137310 49244 300496 -165296 312021 371471
17702 371471 116 -299134 18053 122472 111003 -207341 84298 152143 48553 -89377 -392756
17691 -392756 -341578 -92730 177116 -5337 76040 -18050 309598 55835 5095 -273581 -68594
17679 -35820 109612 -67290 12012 203237 334329 195194 361640 304974 150192 92360
17669 92360 55649 -136899 135681 -290050 47758 114410 51309 -287458 -281228 -305333 -178397
17658 -178397 376237 153523 -160727 -182957 -154107 -274545 -51872 -25053 108174 103959 -46193
17646 102741 108045 99040 -98192 89867 17297 221489 47293 -41589 111921 -91978 -256638
17635 -256638 -167608 67407 -24622 91372 -19501 -242485 347555 219595 -104216 304292
17624 97244 37174 -31237 -162593 40513 286475 16370 387667 -68835 30816 -23784 167864
17612 -94301 -167244 -58016 -221583 -28174 -5254 -125150 -169633 -131291 -93975 164817 -69051
17600 129388 -144806 -52544 -36613 65759 132057 223201 222894 53781 -18565 136398 -2418 -159382
17588 -159382 -119032 205901 -54757 122796 38887 63078 -40336 -46479 -152009 -20815 -316017
17577 -316017 -28249 -119417 16466 65933 211375 757 36131 92464 -70421 122891 229341
17566 229341 324273 89023 -90539 -12687 -121351 -76750 -138795 198760 123813 -220138 -22491
17554 -232403 -19950 98228 28120 17187 62912 195810 169425 -47779 -218514 498373 178060
17542 -56157 197201 485756 305797 -193462 -248009 43135 -193509 27500 -8587 22706 117491
17531 117491 2779 99415 541764 -393932 13075 121465 141956 87351 -96704 335394 382579
17520 382579 414627 30122 239671 22647 165290 141873 137353 -11929 98693 57338 149149
17509 149149 207188 332513 105494 -202978 119482 -162289 2722 107708 -76077 -47563
17499 -47563 182416 58792 -54454 -26821 102038 305418 163455 131219 -52027 125338 83298
17488 83298 44345 -42465 301931 83913 298645 -325630 98202 33108 231947 248072 290015
17477 290015 50209 243831 217349 141884 174105 517866 169122 -92001 243252 216829 -71397
17465 193458 316977 -48399 404028 244197 90395 -147460 273152 -20795 254888 -93774
17454 477849 247550 334406 -58934 68800 372557 173585 277828 309429 223250 275175 -34077
17442 12491 121745 317184 108256 259099 310042 350182 229376 289967 252130 142765
17432 142765 8455 403999 202270 454828 -124740 47564 422802 113648 19314 -95240
17421 226544 239598 359130 124125 341979 306183 -40534 229275 277391 166491 -203128
17410 555913 -6017 129832 128553 536245 167165 173948 -32944 -12769 286026 41191 235304
17399 235304 -185294 -16813 386083 -208036 195267 -55298 139017 -19746 86311 124787
17389 124787 457113 277940 139471 -120775 149657 258026 -45071 -253554 2647 364694
17379 364694 20964 -67555 -114383 83192 254081 309159 182582 324830 66748 104815 349901
17368 349901 16881 -20009 77626 236795 206764 243302 322353 206642 239164 -47287 440920
17356 -121409 -183302 310054 181669 126275 250363 -297370 -789 61554 331844 148269 -178037
17344 320487 427138 211190 -29422 8408 277762 279567 -41525 24110 526852 420320 406748
17333 406748 270122 51757 364369 197789 -166637 317799 1274 393279 267095 139305
17323 139305 -130088 73771 -108814 -6187 240064 149959 168307 176825 137909 65214 154987
17312 154987 224835 222763 179039 -24598 10759 299202 38603 175168 -78566 423474 448787
17301 448787 136830 211629 121744 162443 5535 77555 137987 126148 51188 213401 247915
17290 247915 225166 392360 432253 -28220 211489 147426 54895 -276221 85454 225072 216564
17279 216564 112522 104137 100991 71140 373684 67647 285949 34045 198994 154779 426594
17268 426594 52870 171547 -5404 -120920 156461 318788 -266863 -62559 265094 306677
17258 306677 52460 173220 197456 131214 271775 655905 75210 212890 132209 348039
17248 348039 391171 200508 421753 270053 203565 120867 -63243 27203 75294 86851 142120
17237 142120 80082 343817 557081 187781 157257 270734 431558 231388 338691 198034
17227 198034 263476 373942 351438 144196 116958 746827 142671 518485 336675 -28916
17216 571670 252708 379622 27335 213485 220701 484827 413161 505898 187554 234116 -88161
17204 403224 27225 -10151 387408 231752 78030 108269 290021 275530 71933 309600 425610
17193 425610 299671 425568 272958 264738 249833 219858 399547 -85768 327822 194776
17183 194776 267491 438194 115207 343517 74455 67779 -65274 537338 -37230 295956 -135088
17171 124397 279681 281155 338433 310369 383662 -98513 187528 551094 204954 371251 557034
17160 557034 310528 229209 379491 322523 371287 373095 241181 -142008 254663 382637
17150 382637 341734 255531 222752 317182 687827 368355 290703 23610 447213 155521 493065
17139 493065 323615 419201 298532 138736 488408 302610 379928 581630 314588 229761
17129 229761 288871 446253 442660 337780 374582 462937 450934 299330 359738 245440 173172
17118 173172 507529 382785 502300 143328 358081 323199 458362 581097 698268 562736
17108 562736 512721 541253 406331 342193 204630 422236 222228 271998 596503 174129
17097 644317 861150 487900 145286 667156 458206 314257 567987 511896 745711 74642
17086 481309 198501 384289 490929 239786 471333 759188 347995 489486 463495 274995
17076 274995 612178 642390 446615 674094 703331 776417 512191 251722 281423 670831
17066 670831 633839 279350 818817 535825 481060 486769 342830 754766 645161 556156
17056 556156 498132 898 772465 237019 440500 489592 561129 768094 366936 695362 896761
17045 896761 401543 431371 450194 684815 655471 603028 939728 797958 776706 644954
17035 644954 489289 594976 478660 827737 580519 361731 632354 504397 745602 541662
17025 541662 458002 666261 513182 765395 688037 876633 764285 638157 714602 730111
17015 730111 619473 614626 668993 618285 778051 818824 890611 836222 801382 512519 670846
17004 670846 434408 563395 534565 580333 727594 639123 539688 1098340 797855 638099
16994 638099 991663 801371 784572 958382 1240835 422371 986972 1015429 834749 895218
16984 895218 597952 1159408 577480 896021 1064104 694633 790178 845975 1439118 798800
16974 798800 932020 1027481 890340 1141874 1285018 867163 901145 1297940 1176700 1046253
16964 1046253 1171018 1114425 1094715 1204583 937631 902049 1177434 1263686 1149251 1129806
16954 1129806 1022138 1159214 962349 1449537 1214221 1104537 944058 1138785 1208155 937790
16944 937790 1145305 1155935 1367626 1609865 1626081 1020161 1414838 1413640 1412493 1165902 1445310
16933 1445310 1722185 1605478 1395959 1441733 1352801 1460237 1643173 1409224 1919296 1324151
16923 1324151 1934449 1803866 1544661 1459692 1682012 1622498 1654005 1417884 1752913 1939534
16913 1939534 2091952 1654836 1712754 1904862 1641154 1884184 1916655 1801679 2197681 1807713
16903 1807713 1926407 1857112 2076365 2036784 2137793 2279436 2075033 1766833 2022965 1825110
16893 1825110 2294680 2059952 2052533 2274412 2209877 2590213 2222060 2136125 2448307 2138731
16883 2138731 2491157 2511128 2695535 2421812 2388047 2462975 2473334 2401953 2795135 2202848
16873 2202848 2309106 2442231 2659348 2943678 2704763 2832954 2859528 2700163 3115839 3005712
16863 3005712 2976629 2832991 3175936 3218732 3126878 3725579 3508977 3505001 3357880 3150286
16853 3150286 3937245 3768285 3682944 3619185 3820713 3868704 3669251 3863232 3971408 3939954
16843 3939954 4341121 4271772 4501243 4046086 4386863 4390282 4731502 4761707 4751371 4602201
16833 4602201 4791741 5324133 4896101 4871152 5410130 5280202 5639383 5289535 5639829 5709807
16823 5709807 5827947 5936989 6089716 6282534 6146974 6489100 6469572 6994266 6859318 6990689
16813 6990689 6872671 7289691 7419751 7816916 7591047 7886619 7766321 8252362 8503658
16804 8503658 8685298 8888011 9061792 9136225 9616085 9970361 9725286 9930522 10388065 10862916
16794 10862916 11061648 11034138 11546020 11623627 12040949 12459263 12692606 12870293 13304256 13683776
16784 13683776 14195414 14515329 14588859 15588156 15885035 16439168 16866563 17243809 18288367
16775 18288367 18194429 18941047 19656557 20420578 21190862 21705836 22400984 23592500 24185494
16766 24185494 25021384 25612258 26641599 27965666 28957209 30128148 31247392 32246868 33879146
16757 33879146 35198755 36233873 38000506 39996002 41866314 43666205 45450971 47628468
16749 47628468 49715214 52322804 54986424 57461367 60197760 63639281 66797061 69848782
16741 69848782 73420948 77416740 81342560 85779552 90030194 94786347 99972038 105137447
16733 105137447 110389349 116135046 121884507 127630100 133053662 139456658 144978171 150704819
16725 150704819 155795558 160753258 165109236 169113341 171906826 174560257 175974228 176666102
16717 176666102 176150876 174847087 172902215 169695852 166285259 161615293 156986094 151500335
16709 151500335 145964598 140303726 134026811 127992691 122035330 116075976 110325547 104758879
16701 104758879 99739828 94200635 89432738 84905298 80362645 75910804 72113655 68273358
16693 68273358 65088331 61843804 58647904 55651489 53350478 50738095 48335723 46123210
16685 46123210 43820226 41885408 40146603 38335447 36944550 35235859 33751805 32332913
16677 32332913 31051769 29944401 28633338 27400146 26616228 25541987 24529066 23531831
16669 23531831 22596960 22209302 21425714 20218270 19809509 18949575 18643245 17995966 17286313
16660 17286313 16677638 16321628 16020987 15298910 14988597 14499873 13869995 13235821 13185991
16651 13185991 12856367 12691247 12103430 11898291 11511450 11074197 10688815 10648701 10109326
16642 10109326 9757655 9980299 9525427 9312604 9219053 9183789 8371917 8398639 8391897 8075399
16632 8075399 7678108 7348786 7666223 7438557 7132920 7340062 6786691 6843318 6581740 6400860
16622 6400860 6328796 6046406 6115352 6041642 5886472 5772160 5461918 5731218 5414909 5360943
16612 5360943 5299402 5448036 4918806 4974720 5171928 4717614 4612188 4535591 4523505 4631920
16602 4631920 4583050 4171033 4388875 4172465 4102102 4220633 3682458 4096109 3956002 3702201
16592 3702201 3625067 3725220 3697885 3590321 3649612 3337277 2923574 3276988 3156922 3164221
16582 3164221 2856662 2852699 3017661 3281662 2890113 2684664 2698467 2995593 2640914 3045750
16572 3045750 2714637 2734122 2499073 2501391 2723018 2679968 2375002 2634104 2838342 2566046
16562 2566046 2203978 2319841 2340711 2528354 2062721 2251028 2394177 2178395 2191186 2138015
16552 2138015 2237973 2094366 2034080 1974671 1823921 1970782 2022418 2084019 1869594 1592518
16542 1592518 1614243 1642096 1675413 2142329 1522618 1843397 1684406 2093592 1669386 1488059
16532 1488059 1512177 1409283 1734335 1534647 1487780 1553415 1526999 1063323 1578853 1115194
16522 1115194 1452373 1161754 1429357 1344087 1181906 1543302 1265063 1601014 1457794 1819556
16512 1819556 1222941 1315005 1286034 1159697 1205866 1564669 1087601 1316119 1100628 1278377
16502 1278377 1209476 1151337 1262447 1028265 1014819 1106995 1047688 1271687 708400 1225009
16492 1225009 1305999 1047096 874878 967861 1057082 874444 926483 1073338 1183602 1348786
16482 1348786 1025992 980804 1037694 1028984 903259 995460 800239 1223550 748644 1137919
16472 1137919 922815 636567 992429 816516 955649 1012569 804511 871666 780060 741701
16462 741701 445052 999483 608545 693189 551547 615559 786896 734181 710633 908531
16452 908531 953500 718860 758846 577756 621063 358091 715504 696490 632177 885737
16442 885737 719586 473372 208571 717240 675370 428071 392563 948623 785771 700629
16432 700629 495178 574066 598372 694566 751097 579991 473942 717050 748558 530391
16422 530391 379159 559975 696660 400519 535569 341038 418197 322999 613622 656849
16412 656849 336169 490116 531586 708922 178758 455910 660669 587126 460329 217701
16401 856469 457450 644445 504143 487813 272151 635120 661660 617077 327802 697132
16391 697132 436457 552997 366609 378548 558044 305794 448568 10963 473899 340050
16381 340050 69295 526653 421233 530070 306380 205469 203595 332482 115873 576408
16371 576408 531281 265452 554341 -4973 284389 420827 366585 481738 259958 302915
16361 302915 438759 294242 628079 524538 287713 652617 644282 -32056 70108 535520
16351 535520 155418 151182 189388 173721 399766 189751 345691 654106 400012 276208
16341 276208 281962 697942 209434 188022 330554 497443 -222110 337572 492710 138771
16330 169557 155990 292249 -8508 224301 426306 482706 80580 347616 330541 72526 221298
16319 221298 -19192 450213 -60456 287543 381834 315394 499929 221459 218927 511211 464083
16308 464083 278406 225127 383580 560417 268126 -57222 473129 249388 343556 548594
16298 548594 239035 368314 286244 162902 -28301 522828 280117 33614 453149 413164
16288 413164 246812 227845 559684 147392 160187 201563 203698 -113269 205411 303805 143009
16276 78028 431685 73874 394040 8113 510 378711 -63844 75088 191032 352384 140954
16264 243541 505671 191357 491477 -10069 17478 239339 -17586 179883 -19308 143172
16253 75278 196482 148296 409299 390759 427865 10106 242911 431569 9873 55927 146370
16242 146370 326283 292053 -53879 276970 142941 -28453 145222 106367 -129658 610615
16231 88897 226004 129082 172098 389615 310782 265183 -15237 -14423 130531 109771 248222
16220 248222 407334 -208968 179277 43999 66874 43108 136846 180228 171062 174521 185352
16209 185352 80386 -315320 28517 304856 64621 30972 205678 177230 -241484 167607
16198 123675 -117747 161387 29640 250936 61942 281387 317355 93325 228192 215014
16188 215014 114951 -26040 167212 5385 56048 -341030 -312914 -376940 355432 -5897 -83138
16177 -83138 -1576 -37922 198179 -87755 105892 175002 -767 142641 -126781 325930 268820
16166 268820 127054 33798 29218 101424 82930 189736 117736 195000 -77718 368811 254378
16155 254378 75907 -187316 -31375 -133535 178872 428654 72047 293929 -1568 212971
16144 11484 236082 -152562 26632 -106617 121615 486636 -364184 -240704 157679 39521
16133 58989 225753 210290 -33657 -470205 292228 -13600 74836 42544 92363 -43824 15248
16121 158518 126249 73750 -48586 46370 196247 48329 89772 -123071 -47711 -33453 -41917
16110 -41917 195033 196654 -119050 119883 191164 -70192 137054 64004 -70987 65707 212975
16099 212975 576544 107273 126523 13074 -248453 265193 102818 -215692 392304 182446
16088 -103186 -135076 276695 115860 296328 140109 54871 -15493 19576 -46851 -182297
16078 -182297 -10602 186836 80448 -252702 38083 100065 215727 -376 23489 -30222 70286
16066 -64996 -131773 274685 -135861 -123160 -15559 -217694 -104853 80834 46952 114074 58105
16055 58105 -116786 58658 -157849 -6723 163236 -334847 -60673 89619 129623 96072 -3444
16043 36847 -37812 -39782 -160058 -48116 211006 -277130 -146803 12529 115700 213948 -53302
16031 176647 -41857 -376517 42429 -219311 -123034 195979 -315710 -27714 -27426 -191162 -138062
16020 -138062 -368951 -424461 315064 -250430 36258 -34954 121188 -190865 -190442 37653 15861
16008 304560 14941 -79486 -185440 145079 209896 205503 106291 -41437 208681 -76147 230266
15996 -76952 178458 110256 -93577 -68044 -240463 312718 390524 -49772 66106 -34097 -81889
15985 -81889 107300 48527 576393 106574 439864 369300 83529 56736 121539 -132436 -200638
15974 -200638 -112752 333134 95946 76856 285064 -30752 39705 204810 -110981 123479
15963 -179333 156808 201385 78746 144266 -138701 -75951 10060 -131832 12133 -145692 58158
15951 -151138 -53792 -114315 149978 58289 -198465 149354 -358403 -305354 104291 -359581
15940 -123364 -52712 -92384 221401 -276146 -151544 -480193 158407 158750 225414 -108730 374348
15928 95831 -14129 -203191 -22502 368817 105568 173981 -58789 -233598 -231040 -12688 128446
15916 330329 -16318 147886 98307 -521078 -325230 -407031 6450 -218360 240432 -125161
15905 38438 179443 111399 -323643 74729 420687 -19822 113556 83426 268740 153869
15895 153869 -130984 -43885 -374613 -218365 -104274 -59376 68655 70854 234639 -79026 152034
15883 -11069 -72773 -77054 120798 251912 16045 -123149 134377 122848 -165338 -348334 187540
15871 -99896 -238949 4782 234652 -181848 89446 -92243 -565595 142943 142227 132804 -212584
15859 -114889 -44211 -85762 287493 328082 -112376 170836 103800 41825 172686 -101045
15848 -191323 194072 2210 130484 79024 287685 -308966 358551 -237679 -133398 -129476
15838 -129476 208326 101302 82229 279598 28109 59190 -95213 182794 149792 -13680 -208096
15827 -208096 290331 282786 -378073 -65825 -305927 -256899 194399 -124297 -96463 -233245
15817 -233245 -276851 -102904 -26483 103258 -6964 245596 -139891 -405640 -233946 -92462
15806 -67764 15089 45636 339809 -26329 28517 -108073 15218 -10359 -29480 374350 -7373
15794 -237119 -105987 -111351 129428 12546 -198922 -7012 6689 -252338 -135379 -409377 -113593
15782 115501 -60072 -321644 10813 -25712 -8448 540480 -435677 343723 255024 -237238 127245
15770 123789 81375 105699 -154697 234311 179128 -115263 138146 182388 -82748 174433
15759 88580 57254 -44577 -19837 74678 -10514 68900 191688 -34291 -53832 -36096 102649
15747 43483 26096 -47501 -282844 179079 34960 -199084 -260534 -77603 -119781 45830 65121
15736 65121 105365 -409288 -200344 113021 15404 -268679 65028 128547 328514 -98340 280688
15724 -35935 -12713 -128551 368808 54745 67037 -210265 218609 -91653 70095 -56339 147437
15712 -156202 -98473 -991 -67645 -259761 63659 -17455 -121191 -67985 8104 -128418 113021
15700 171821 -50926 -130300 -269826 -92278 -188106 -190261 -147778 193920 -33241 109487 -31109
15688 -122533 -87538 225073 -410813 7502 -413837 282325 217715 -420158 22576 -32094 143500
15676 190268 -34558 -113135 34929 7608 153335 219890 -33648 -54144 220086 -32269 -317523
15665 -317523 337334 128684 313477 -41422 -16309 -174838 -263094 27356 255823 -101036
15654 -183424 72703 -84511 -187648 8993 -80647 -163244 -51593 -268484 118625 316345 -112245
15642 134943 -269579 48994 -130803 -24000 -100985 -105696 164370 -70702 -44770 -298997 69867
15630 -133702 -127331 66117 -131918 -69459 -8364 -24417 3796 60899 87871 -91541 -162125 90133
15617 79410 146025 -54330 63523 -64742 -17583 -49288 -13958 -73528 -391126 -352423 -76580
15605 -311999 24279 -277591 -214169 260743 -412211 -44391 -166576 28705 -630174 -131389
15594 -266229 -178288 -215872 -237036 -36484 198548 80910 -58074 105420 305874 10222 -49541
15582 127564 -96350 51027 -124340 -228427 -78813 418511 -3902 78722 -304692 939 25974
15571 25974 -257390 203004 30056 21478 168572 -85152 26539 -36022 -228234 -138507 -12806
15559 -154906 -40534 -121116 80059 235570 -56829 -366571 -56659 136296 111850 -19695 345130
15547 186314 -190686 -84616 -201869 -100274 -47350 27229 79119 -143735 19542 -179466
15536 300531 250936 -102683 73629 -67299 15956 196322 -256751 -85853 49498 -145098 -199721
15525 -199721 18933 -13883 69467 38246 13796 168971 -78205 66922 73696 -7635 243926
15513 289777 -91707 114462 -21453 5205 -304292 10647 128196 -140263 76422 -102962 -77558
15502 -77558 -17060 173332 138838 73676 64688 41251 -57202 197051 41072 245717 -191574
15490 257591 155444 64748 -100402 -68652 -275030 -238761 124991 -49746 -88588 154905
15479 -113477 -151969 -54923 146180 202785 -179252 -152984 93355 7783 -136033 -332147 -39549
15467 -182241 165549 -57718 -88131 -161308 50364 48385 176251 328787 93743 -130630 -109473
15456 -109473 177000 159924 25944 214855 -179179 37925 -132331 178233 -396735 167660
15445 -295224 78478 34724 111131 -306026 37126 -20068 392656 -30027 79654 88202 -210154
15433 265025 -83291 34588 162122 -68824 -155357 -97488 -12023 237340 -115025 -221332 -37062
15421 -42432 -67002 -254397 -4767 -88887 -20991 166183 90136 203877 420381 -353896 56856
15409 -131517 88960 66184 190901 -23886 -492079 347043 -144838 301305 335070 -213033
15398 -266510 -44867 -27534 -26924 73800 -61583 -35863 33642 127196 -6705 -103779 -12319 170553
15385 331174 29763 85517 -131181 -249488 -152747 100391 -193038 -199606 37485 -129955 -231293
15374 -231293 -46111 223671 -62321 -144152 56009 76962 186605 160005 39765 -30622 73413
15362 -102948 -161757 -128512 18972 -44068 169406 -158112 -262660 -21839 -58411 -2464 47511
15350 -273257 103142 90214 -11605 25820 81653 -346307 201988 -60750 -119160 325733 201980
15339 201980 -206275 -19735 102657 -5639 155141 171493 48045 -38217 -47483 88070 -97447
15327 -84916 -54712 212707 129493 64308 8485 269665 -458193 208563 -32561 -60747 70968
15315 149253 76083 303802 224288 -41503 198797 -74345 116899 100327 27342 -6136 -59224
15304 -59224 211057 -26112 -42032 -99292 273897 -284974 96897 279009 -88436 -233450 133316
15292 252855 489347 -5486 -84072 -333623 -74682 243848 -133204 -169147 109413 237434
15282 237434 -35187 -128794 240505 436237 56553 -1356 376953 180681 251574 445985 115569
15270 51582 222806 53119 12481 28096 -49412 -201701 -197518 -181575 68718 281641 107488
15258 5905 151214 -12662 -35274 8440 279151 244344 10103 470485 366418 1161300 1841655
15247 1841655 886237 1455337 1084238 319745 318135 234994 -50393 27073 39914 255223
15237 255223 -133535 86035 61421 44701 -82700 209954 -25211 -58166 -304069 140289 -10206
15225 -23404 -4328 51355 241758 -168633 -170409 162031 -11447 339707 -48007 137549 222591
15214 222591 280500 15464 -78425 -18923 -72969 71525 94908 -21100 -299789 -164610 28401
15202 67572 64353 100123 -142077 -24927 330317 309622 197716 8201 267878 195285 65302
15190 -127096 104645 230730 336525 83308 -38052 306721 41850 -351266 -79351 134843
15179 167315 245804 -121490 249289 180400 126633 196600 -50934 3224 129532 -50193 215172
15167 582420 52404 117393 -214580 157992 -70054 252343 313928 147224 229100 70098 105044
15156 105044 120146 -24385 363325 -148537 -78275 24770 25595 626283 12569 166041 131715
15145 131715 40192 63124 -4712 255835 20983 256752 265675 129930 233652 56002 217941
15134 217941 14386 -5645 82214 -45304 387545 21354 -246878 145328 -130508 94082 393416
15123 393416 -72523 36481 434137 385479 -112529 -27945 136761 124207 312922 23839 -230145
15111 370697 58669 131216 237412 420094 133508 124956 214654 -61834 -91593 8896 120312
15100 120312 92839 1668 -109783 423017 26911 18252 22001 -146460 230898 267604 19185
15088 78694 87730 266521 106178 -127954 176637 94220 152564 29443 179858 370698 -62750
15076 210348 414951 291389 150650 536617 405132 48331 71725 191910 131414 -14790
15065 245094 134403 358125 170256 279391 236325 265470 222797 -137541 197884 415618
15055 415618 93040 487910 42879 278473 733494 137763 161479 338877 31846 69769
15045 69769 433132 167610 259359 287385 14233 445320 208941 203 -10850 282215 1427
15033 159215 319830 54101 -57352 -34232 270845 259742 101158 40687 -18033 73216 199422
15022 199422 217776 318694 131560 155349 291903 273003 441496 -86559 125461 306320
15012 306320 249030 -209661 148036 382609 154812 424748 521497 439162 169179 94016
15002 94016 223278 532876 253701 -46273 212244 195978 71879 123564 360701 283747 368695
14991 368695 138843 -32849 40317 446889 177042 330184 200053 229354 223647 309361 -121314
14979 135032 -39909 174219 -79598 206532 182157 69056 398612 286419 227898 75882 358770
14968 358770 170743 284728 482321 51918 167474 187298 162983 325391 418867 320075
14958 320075 175190 412439 556956 306796 -110366 433062 394431 301935 217975 310399
14948 310399 413456 417502 413009 413703 20258 59945 431804 412659 174162 67098 31705 197791
14936 197791 4070 477905 131098 449455 417756 369490 218237 323466 463263 327740
14926 327740 144797 334232 585 232433 322664 586845 176859 185921 514915 211025 461272
14915 461272 318900 727387 193801 373161 285680 46498 385115 368727 569851 380598
14905 380598 23711 267223 220213 292925 216409 614347 235183 396903 382041 270879
14895 270879 453621 284258 458699 155577 435662 620635 -57952 407244 98823 377693
14885 377693 541990 794158 477842 158427 216764 495629 527964 259352 539185 127072
14874 165272 118310 307023 246688 309977 416432 150583 374148 380682 587612 396791
14864 396791 392529 864154 323874 587838 385515 172615 328473 25259 449254 268983
14854 268983 364029 326102 378680 481442 889842 461014 404386 350578 297160 280516 630436
14843 630436 461049 305458 438446 382055 269267 119585 142166 401013 601980 449270
14833 449270 452258 406154 649892 344602 411545 382535 905660 435651 227957 539682
14823 539682 356496 455455 846186 503687 562022 445204 477664 420036 169598 292392
14813 292392 483633 360195 536496 735999 446617 567979 602437 577877 375541 36758
14802 263930 633217 500362 803465 409125 483918 514707 469439 456405 774602 572985
14792 572985 287307 634318 913136 583051 300679 444354 385868 808538 391055 473873
14782 473873 458471 456540 606682 616995 608398 446603 290659 618493 543185 441325 612879
14771 612879 462915 593043 768294 964073 736607 607387 390587 687370 831223 325356
14760 436724 973925 641139 684218 498767 756616 224571 675226 541843 728780 682028
14750 682028 481809 615573 510089 867844 551712 775242 910936 703999 726551 513713
14740 513713 574861 677577 761398 958818 872085 638638 548748 945013 632389 566123
14730 566123 859742 654173 753640 645342 780526 875555 723953 791052 717831 776424
14720 776424 891652 945420 781974 680617 894795 800960 737674 916001 578966 801933
14710 801933 820197 990551 801516 812053 914799 793123 884873 1106176 921437 1142052
14700 1142052 815991 1304009 848708 888432 983715 725452 983299 716987 934604 1188329
14690 1188329 804596 932676 1015868 1028490 1054508 1361714 1058171 1103678 1203642 933216
14680 933216 957412 857422 1146395 1083576 1175734 1209526 1094924 879731 859521 925123 1301314
14669 1301314 1215113 1098593 1198544 866668 1126045 1111329 957098 928918 1126092 1151517
14659 1151517 877339 1503303 1228454 1088581 1264518 1232536 1291847 1235935 1167949 1318408
14649 1318408 1111179 1368207 1186925 1125078 1040207 1037495 1452499 1475012 928968 1163027
14639 1163027 1514397 1233308 1269742 1406459 1102797 1236466 1225713 1248746 1273846 1306710
14629 1306710 1473330 1116302 1116970 1771602 1294861 1537922 1711448 1865817 1433315 1781050
14619 1781050 1203712 1448010 1264279 1263294 1271566 1652544 1369549 1661955 1584237 1398987
14609 1398987 1624337 1513480 1858539 1862404 1568783 1812758 1848472 1741954 1572245 1508157
14599 1508157 1973943 1592117 1931292 1647481 1743975 1884734 1931253 1535580 1786988 1700211
14589 1700211 2110053 1779475 2057679 1781360 1568590 2124244 2185974 1926491 2063871 1961582
14579 1961582 2301644 1995008 1973648 1980603 2011813 2179786 2121111 2242397 2418305 2030819
14569 2030819 1842798 2395286 2525669 2465620 2494650 2744104 2695174 2870044 2905977 2801871
14559 2801871 2840775 3093227 3002755 3549567 3504161 3959654 4031517 4529096 4684099 6004140
14549 6004140 8394580 12772996 21255923 37728009 48743442 23298333 9724543 4603177
14540 2852749 1975112 2310448 2197199 1983257 2140909 1843133 2097992 2270469 2037906
14531 2037906 2116710 2019679 1945479 2088910 2387154 2491349 2164584 2541949 2692067 2402894
14521 2402894 2641333 2376513 2542252 2752023 2695011 2434159 2819987 2836111 2934979 2754451
14511 2754451 2771713 2880030 3025310 3171824 2966269 3152174 2956749 3140417 3389254 3109492
14501 3109492 3471530 3292946 3491709 3234688 3450106 3214136 3378010 3561934 3140510
14492 3140510 3554906 3794179 3487395 3759267 3579972 3549475 3480151 3658607 4039459 3660397
14482 3660397 4145313 4233683 4175920 4198240 4275055 4114091 4026997 4563818 4232984 4345764
14472 4345764 4303154 4439603 4551139 4510522 4836897 4647143 4875855 4508229 4734055 4746986
14462 4746986 4816953 4770031 4843593 5502671 5260390 5262751 5337723 5379645 5456254 5285795 5339386
14451 5339386 5422234 5547216 5834899 5700587 5913177 5640302 5998134 6377053 6046073 6233326
14441 6233326 6033022 6721300 6639309 6706001 6557090 6466686 6916857 6781496 7103261 7216287
14431 7216287 6902472 7119248 7415687 7389960 7152455 7418878 7729977 7857825 7913801 7956547
14421 7956547 8131905 8323781 8315788 8770198 8529792 8978032 8709144 8940885 9046583 9523245
14411 9523245 8936116 9783479 9484916 10111122 9810530 9829072 10170405 10463517 10556268 10860133
14401 10860133 10968730 10908696 11149772 11451804 11675653 11794021 11769006 12380412 12407727 12611511
14391 12611511 12808973 12885354 13467845 13571665 13347866 13905560 13896481 14671109 14842405 14582829
14381 14582829 15303039 15410753 15809453 16140235 16164577 16762760 17007088 17390349 17571585
14372 17571585 18035267 18234098 19120231 19048441 19961017 20133052 20484975 20683127 21172000
14363 21172000 21518915 22157102 22738518 23082898 23391309 24286324 24969228 25341555 26080174
14354 26080174 26771191 27414309 27944393 28573462 28964401 29970351 30727572 31387622 32227887
14345 32227887 33029207 33751793 34708362 35621599 36672288 37731537 38852868 39607105 40709762
14336 40709762 41926226 43177284 44438768 46026709 46887413 48712044 50273321 51527495
14328 51527495 52977690 54891911 56694315 58624339 60396770 62621264 64510076 67151305
14320 67151305 69545555 71532416 74517634 77321912 80153956 83258818 86178325 89874720
14312 89874720 93332839 97281144 101153270 105434939 109899795 114293872 119728639 124963457
14304 124963457 130285654 136104228 142211869 148778623 155744598 163213162 170844502 179085461
14296 179085461 187609926 196851943 206806106 216612347 227321017 238774747 250386793
14289 250386793 262860201 275683255 289069198 302427188 316543111 330942602 345514025
14282 345514025 359969634 374446880 388873080 402285221 415554355 427647912 438908389
14275 438908389 448449274 456235454 459159547 459125769 458863902 458405853 459521627 456102348
14267 456102348 451980736 446444343 437547809 426697088 414397516 400636274 386713484
14260 386713484 371477102 356301238 340991661 325636474 310823083 296672082 282586576
14253 282586576 269018958 256063742 243632941 231731215 220169206 209767670 199720241
14246 199720241 189790996 181127267 172779625 164625967 157097455 149797979 142841696 136643302
14238 136643302 131107483 125741525 120056302 114936423 109804899 105417236 101394339 97963505
14230 97963505 93919157 90356567 86742474 83131795 80549488 77251292 74681904 71953920
14222 71953920 69366545 66830810 64776827 62437521 60550502 58663081 56522050 54912421
14214 54912421 53377974 51860130 50269101 48474410 47078690 45491087 44638403 43701118
14206 43701118 42502864 41204245 39706457 38669697 37531834 36929176 36020097 35090470
14198 35090470 34194099 33086378 32057481 31437768 30974504 30169985 29148083 28529498 27847882
14189 27847882 27035316 26599784 26049266 25548650 24770605 24074620 23920577 23156713 22536963
14180 22536963 22021270 21469512 21155103 20815259 20248169 20378250 19559907 19184553 18983080
14171 18983080 18641181 18091505 17645998 17644622 17270372 17159574 16169516 16150958 15866328 15831031
14161 15831031 15464928 15405331 15263367 14774166 14314671 14363573 14041089 13985429 13706009 13101170
14151 13101170 13176412 12749390 12850011 12609094 12226113 12113623 11900570 11507639 11711740
14142 11711740 11154119 11304436 10814922 10656729 10893043 10724162 10571794 9945623 9664406
14133 9664406 10075533 9780248 9903486 9647078 9151869 9183272 9368878 9164319 8448769 8347216
14123 8347216 8560410 8412440 8424828 8011243 8162083 8167870 7850999 7712432 7826761 7688205
14113 7688205 7381260 7724215 7660189 7009725 7357477 6888197 7101442 6941991 6668475 6687210
14103 6687210 6531125 6745004 6499436 6668382 6579985 6348638 5846416 6452371 5956054 5821600
14093 5821600 5905654 5437179 5701504 6080704 5727701 5531224 5275971 5556654 5204636 5189140
14083 5189140 5347678 5004775 5545000 5197963 5065391 5065828 5021823 4915037 4887252 4630960
14073 4630960 4820517 4690247 4803307 4771496 4546053 4117137 4405146 4669704 4382547 4346533
14063 4346533 4212607 4549129 4184416 4470195 4154795 3825627 4532378 4233892 4205290 3837702
14053 3837702 3770285 3868936 3419978 4230524 3657406 3622879 3929706 3991507 3779703 3857719
14043 3857719 3662646 3692725 3379207 3475814 3534882 3317930 3496654 3288082 3163733 3112430
14033 3112430 3526649 3125045 3449348 3026723 3166571 3114224 3333629 3112009 2887295 3010165
14023 3010165 2840435 3104096 2824134 2955283 2806225 2596990 2649144 2891432 2779234 2839653
14013 2839653 2641267 2597150 2678482 2352660 2494791 2508024 2483750 2516930 2432041 2485550 2455907
14002 2455907 1811538 2497744 2587738 2572551 1915748 2254124 2389082 2028945 2140262 2377782
13992 2377782 2506644 2550430 2960759 4303451 7145265 13981511 29501305 47818017
13984 47818017 28991996 14811583 8937782 6212857 5216397 3880100 3767211 3479943
13976 3479943 3594780 3287557 3137836 2829659 3273085 2674844 2592420 2512178 2330375 2635709
13966 2635709 2252107 2105393 2549613 2579488 2325654 2209615 2104128 2123810 2206577 2285693
13956 2285693 2323403 1806036 2195012 2111588 2006526 2182402 1831953 1986644 1956023 2009925
13946 2009925 1767695 2099459 2045810 1933376 1793313 1930724 2003887 1959282 1853830 1792796
13936 1792796 1810578 1977943 1876358 1777087 1856916 1706889 1542428 1451002 1615200 1568815
13926 1568815 1613156 1875011 1672031 1759994 1551710 1801904 1720317 1768090 1763696 1574623
13916 1574623 1268085 1634197 1591132 1522015 1686382 1536851 1530395 1628237 1830789 1404735
13906 1404735 1295045 1617625 1435719 1568714 1271102 1228898 1067223 1442278 1040816 1408058
13896 1408058 1263360 1229697 1401686 1527569 1168025 1427651 1281341 1342365 1294577 1437806
13886 1437806 1135837 1186615 1370496 1338773 1450631 1208618 1046204 1326202 1440237 1357713
13876 1357713 1151689 1161290 1229849 1204654 1012271 999112 1166475 1285969 1241903 1281439 1216703
13865 1216703 1326183 1165264 1222014 1108731 965831 1189603 1245530 972395 952454 1081045
13855 1081045 1193133 1336067 1230455 1056201 1015736 1003046 1138346 1061096 1106524 991478
13845 991478 820752 907189 1060794 924130 1377314 1290130 1216999 1128855 950151 949145 1130138
13834 1130138 1258636 1049114 905641 716909 1082376 1076299 894082 933680 948275 860756
13824 860756 961751 899155 1046271 840725 829349 1074209 956338 803537 996331 964448
13814 964448 802271 1075271 1112431 962735 790493 1077976 960492 809652 1042817 1080953
13804 1080953 763337 966819 972382 973657 1161134 703134 896870 694901 682681 654436
13794 654436 825801 1060173 786827 599674 1059146 909545 1146685 817870 1025117 554575
13784 554575 934825 747940 863489 850866 784442 838253 992476 486479 674585 861832
13774 861832 767870 742358 913397 897246 754126 521885 1050172 435612 652834 617323
13764 617323 847939 740944 646592 410621 1051981 1008837 747039 620222 658026 603319
13754 603319 643165 818954 641741 887016 710316 501763 484430 707177 481168 662439
13744 662439 688401 511329 521990 748070 707853 673421 741034 521349 1010219 800569
13734 800569 763401 889452 411781 520330 754964 569490 706936 394211 672554 598913
13724 598913 723511 643006 638748 524265 858740 673317 704834 545141 812997 591765
13714 591765 504192 479852 270628 732183 721276 527820 757876 560984 608334 351536
13704 351536 255015 380534 722938 629950 511172 511520 777643 706162 446225 659248 719145
13693 719145 505016 513648 728643 324682 647911 477591 445328 198063 327776 681187
13683 681187 518177 835023 290964 260583 400477 794118 375294 766358 331522 422764
13673 422764 539141 595263 446269 531637 357353 669088 302978 625089 586657 546023
13663 546023 580651 489152 184755 558481 472513 433562 73760 342558 444688 348973 301685
13652 301685 235329 553325 596408 330607 445569 352512 630039 490912 507922 538726
13642 538726 347179 731184 633238 462674 530265 446325 598680 351641 687003 477211
13632 477211 459274 67910 255913 400050 359160 467136 472914 287335 831941 452657
13622 452657 525570 685469 247344 478734 360076 439622 461104 411812 384681 372835 174182
13610 574161 162821 390794 409245 760000 472223 484405 756253 472254 326337 442247
13600 442247 399293 322207 484877 402158 847168 469057 118671 539914 304523 294410
13590 294410 648362 249806 273927 325576 352106 212394 503726 356176 516659 764789
13580 764789 345985 532518 312698 296535 510233 141478 153571 192717 143615 321280
13570 321280 514958 370341 432132 362484 197239 374540 483333 248342 479776 22993
13559 490483 266187 121061 57907 78688 492351 158416 209070 387013 139574 36656
13548 583005 127424 548981 248417 243673 78612 393491 371888 284547 -155399 363837
13537 307433 109098 256607 595985 524184 222406 403892 526707 256688 464276 345832
13527 345832 280433 141395 371925 321576 170135 158832 247966 232889 339307 248181 53077
13515 289331 417419 463940 4496 350037 102447 433333 362174 272442 388270 327439 236697
13504 236697 345798 373610 370298 200594 474317 220167 481280 349332 227344 529006
13494 529006 18098 496601 268513 48170 263700 283594 214133 419560 470751 387121 242664
13483 242664 294949 250481 135688 356563 125476 128940 451862 16601 368746 211213
13473 211213 188908 228066 287085 194529 251095 333533 187935 239733 307158 326158 407332
13462 407332 205488 138538 281953 134322 350546 59201 304238 140971 562148 301748
13452 301748 103959 243816 -3542 493451 483437 206440 289032 150269 87135 309602
13442 309602 -68202 36087 230788 332471 288412 148373 303448 629572 305856 188812
13432 188812 335305 203136 148551 284719 17184 51038 189023 82495 208153 -36488
13421 357231 59225 202143 194289 148111 136436 50924 522153 67287 231145 244940 -35464
13409 365409 222886 627262 176814 140004 266054 422889 189637 -25215 251785 212072
13399 212072 63870 56678 214702 246431 315384 87997 230213 446117 194438 21464 195934
13388 195934 6344 111617 623379 325559 35149 357258 124116 225879 182507 334923
13378 334923 562807 416942 64753 510382 194821 287415 186605 78327 148464 -115307
13367 156740 247417 175831 45080 107741 658290 314245 92142 250176 247878 33419 228585
13356 228585 213706 174628 148397 169850 135406 155905 130222 33705 184469 102353 107251
13345 107251 193003 347910 51879 469219 472930 390662 99092 -99355 72111 153321 324200
13334 324200 123785 545914 60031 55817 322347 -58399 171640 192512 146311 156185 493471
13323 493471 410559 381224 133885 228195 243924 363851 57793 166481 320288 245519 373081
13312 373081 159817 448735 9089 238604 152107 230657 203409 79612 338857 178395 29974
13300 298078 256045 158822 586521 24533 332616 183180 417144 91812 229207 168589
13290 168589 54966 855628 250289 135262 172896 651217 276582 50646 118994 -11710
13279 -16192 157549 -400882 -20279 53604 -228231 284277 127473 270312 335499 140023
13268 -83548 34384 -38513 -209073 115980 -94627 443243 265222 290042 144643 79041 141569
13257 141569 160032 219299 373263 201657 496424 101482 213359 346276 265108 -119185
13246 330300 1924 201863 134603 127232 22643 114473 -369113 -39309 84031 168497 -87511
13234 137329 -35415 -2286 172088 -186637 75439 151468 39629 103201 147533 285012 252763
13223 252763 136823 61221 -295007 167162 -359367 -50315 69377 212238 180261 103446
13213 103446 -42131 229537 -211286 -127078 365892 142270 115981 252733 -185687 177935
13202 47725 31610 139779 72334 271320 35252 376284 -98151 152956 -131106 -470354
13192 -470354 274833 41601 -25744 94382 87046 -15765 456398 134931 -110950 -97367 267451
13180 1045 191109 -146281 158152 -43727 368415 248482 -136410 3151 245699 268982 147636
13169 147636 -40685 -65354 -85506 -382568 38199 38466 -66691 -51571 93884 204147 28198
13157 -40670 69404 124623 132878 -17680 105179 186724 133205 262114 -190159 358103 181051
13146 181051 150867 -49223 462448 -63049 -93803 133030 -51743 -57094 89893 191580 104167
13135 104167 -30709 152756 243485 110818 332926 141476 209809 157292 -224504 -143953
13125 -143953 74536 231504 111059 453454 282145 -30052 -175955 23407 378319 -157331
13114 -71929 -416050 160212 60460 427170 172214 12725 150781 124536 -51059 185550
13103 -4914 -104535 -138116 247312 343761 -216618 47764 122337 176770 313948 -114847 -126379
13092 -126379 17055 114837 -6176 193694 145891 -137509 -36697 278415 16268 -165416 -40819
13080 22000 29436 249388 430244 62483 20915 322709 270214 132135 125303 -239703 97898
13068 148790 134659 64045 378111 446666 449476 229226 169108 159531 -34070 192218 252928
13057 252928 154829 -3103 236108 17677 334319 255488 127227 312441 -308275 75277 267937
13046 267937 -4612 169722 132619 105014 -79152 135206 -6620 98322 93123 433161 400984
13035 400984 18623 154419 -96375 110097 -125563 216085 9852 187618 29465 238862
13025 238862 -66468 -194362 -20046 232672 -14023 40650 -165182 -16875 -302674 16351 -200287
13013 -67980 153313 -31903 339665 241623 144052 165420 68658 412970 212587 180985 271306
13002 271306 324585 40968 59541 9627 -30977 124528 -19725 -355950 78035 -77134 -149835
12991 -149835 126314 -71593 222691 107243 65420 -118841 218087 25922 -255048 334735
12980 157897 -148814 152396 -127800 -100685 -29542 67336 80579 214280 233074 -100645
12969 67411 -160444 -72976 77714 -169262 406689 194548 220327 20022 125819 154996 108495
12958 108495 -98836 103601 -12261 -19732 -32915 92906 -69881 -127112 91518 -71447 142705
12946 261721 524276 -137318 -21703 307196 453373 110511 -291944 132989 89484 332168
12936 332168 180861 -248660 -184372 -101437 145034 311721 229519 -160547 141829 -46964
12925 426216 31554 -254937 -164810 98120 144974 -50208 42478 286677 -118085 -190432 41005
12913 619174 91864 28473 -353967 -59124 -390499 169544 -16492 11523 -23910 208455 -172048
12901 120060 5685 -33343 -51438 151963 9520 -103012 -243735 -195924 125472 -271385 37505
12889 133278 144475 -24020 259389 302376 31265 121606 -84666 -259975 219729 261186 -1312
12877 241621 -279171 -273633 30623 -94172 93165 298481 -72129 -246945 249886 129886 -84930
12865 -37757 290033 -216996 19726 196890 -9279 20289 200750 158474 -107975 95677 95661
12854 95661 54051 15662 42537 -564 97583 94032 178361 -200497 -219030 162314 219411 -281110
12841 152393 449678 380733 59698 302701 38147 -125441 -282790 110826 9948 312292
12831 312292 -391585 329786 44925 -62161 -279419 -88441 14458 -232093 126255 22173
12820 -32935 -70650 141794 -158152 -229006 238382 284720 -11708 105477 140587 -221559 -54624
12808 85394 160110 40778 105848 -55906 -267732 48990 -136014 63024 -21771 197257 18378
12796 -75886 -30729 21333 -120013 -60515 177144 -202935 96403 97596 207696 78595 -34752
12784 -14096 39028 -2192 12347 60428 -37741 17514 -43729 -242478 84764 102211 -210747
12772 -176351 24746 -20697 12578 -233247 170360 435542 -129744 -18817 -131250 221077
12761 -148716 77427 160623 258885 -173807 1120 -34989 66143 -122124 -36108 126648 74818
12750 74818 -5145 -156781 211975 -62365 62981 9539 440824 18566 -271734 108647 30347
12738 -134668 28266 69449 86838 587507 -72928 -301607 -60331 92933 90708 233085 48966
12726 -57006 -99333 271260 -330517 147787 -416074 9518 229979 -113251 208218 -39474
12715 249688 -160331 -1276 128584 318777 71662 220052 60698 16222 175648 231331 168376
12704 168376 306699 340173 341696 20357 359818 -96391 169699 256756 304401 132536 -65246
12692 -217204 37607 -97075 -23988 167033 232107 -84311 340871 59635 -225168 236967 424835
12681 424835 259884 66827 479739 19174 298321 297283 273980 219741 142028 254824 57319
12669 -234429 14214 -8363 75840 24694 -129628 170880 34473 -180208 178903 176152 73694
12657 -85284 108672 -252772 48281 34980 147623 -201230 278160 -20660 416924 -7786 329715
12645 59236 -406189 -11113 33960 203113 -153186 -26518 259923 159592 -48396 -141456 123735
12633 -120416 41068 302969 347569 126708 188847 -86473 343997 156881 255346 258884 32753
12621 -112901 225888 14485 259705 -19223 -75004 -29089 114733 -30460 -7046 46365 -227915
12609 42911 -28829 189215 155905 181366 120912 -106686 218177 39247 49884 101463 130662
12598 130662 115075 48493 100699 -221094 -233275 -364129 40254 -34524 145512 -330269 -49524
12586 140625 -10337 -280356 2150 140789 35710 39014 454743 220523 -150770 141143 146766
12575 146766 -328978 188001 -246389 187806 -244738 60478 -56942 72188 -120181 103013
12564 351884 70078 330832 79677 153980 179886 -113028 24963 126530 169332 119218 5845
12552 -88122 -210123 -49978 -16228 -60111 61177 170925 46909 37197 32724 -278012 -84683
12540 -52404 117448 -180163 -84479 -45266 365026 -3009 180836 -111095 58839 23500 132781
12529 132781 77629 49646 -208797 147619 37582 49060 -121836 -231708 -153686 138640
12518 94695 -118981 71850 -199157 217529 144815 75043 -259800 -101862 31122 59676 309859
12507 309859 64999 159142 19724 16596 1308 -21614 -4557 -4698 -43412 -80894 -132221 -59992
12494 15844 -1223 -196994 -143792 -105924 -98348 -57733 279732 -8777 164873 -169573 274286
12482 -158815 271170 -103810 47544 43112 197389 290291 216779 193422 -128610 12151 -43072
12470 -164686 -36846 222733 -3769 227574 -95359 -196351 -152018 118283 14942 43502 319212
12459 319212 -46166 -160412 -424309 50651 198938 202971 48171 -338090 122317 -201008
12448 -127372 -90211 -427603 -163007 126534 -173145 27978 271739 -103124 31262 -2154
12437 434246 7357 -155036 -177815 -86880 138868 100558 41655 -355038 -126952 -113130 -110042
12426 -110042 308057 84986 -130669 -135947 207483 -249856 15600 -51328 104761 450698
12416 450698 10090 -69059 64108 -195250 -119444 574 -454739 26780 -215355 -195787 -210811
12405 -210811 318336 373678 -26178 42576 -19057 163244 -21944 62037 -117601 135025 -68409
12393 -146021 208413 14490 308960 -412825 -157837 -20514 -31565 197342 -55854 -115573
12383 -115573 104893 -98488 -10363 129807 -45628 -103081 51862 -58516 -250959 -230398 28227
12371 28256 -135947 -20336 -17720 -491467 89756 48599 -134890 -131604 -211851 252650 -163023
12359 -213102 -145690 -214024 2951 -37225 234913 -46785 33743 308868 146558 129338 5140
12347 297154 -157253 174692 241238 -155352 18716 34877 159041 131873 32769 297509
12337 297509 205262 50962 -292210 210863 5626 1047 -154209 -187332 -26563 102067 -253045
12325 39521 94694 190040 -229737 -268996 15845 -314745 176883 176231 58447 -12151 62197
12313 -238218 263210 -4014 116025 -26607 -365295 237406 164838 122789 -7921 43918 -239378
12301 249221 -81519 25560 -24691 121841 -186273 -47575 44343 35968 -58505 -51356 -4536 353916
12288 272732 30741 291823 -86927 -175956 339600 -1495 44659 89269 120621 -47468 269192
12276 230334 45416 133700 146569 97602 288734 -198139 93990 189298 -412350 86424 -111857
12264 -574 -155358 -217491 -82883 158661 312299 -29927 111176 -151293 222422 -62689 -36951
12253 -36951 116152 158851 343412 320041 -28265 254278 86244 89413 203778 -38818 -212238
12242 -212238 193204 -84364 151164 156779 -109126 293480 344886 75733 217504 47784 256573
12231 256573 65970 129245 -593 155501 191357 201113 538896 167563 107634 114830 263518
12220 263518 314897 440997 52877 281708 443881 63932 22663 119845 456581 108035
12209 331010 -13204 -168855 441896 50734 10935 250667 27821 -99403 117563 -134816
12198 47076 47040 37497 62509 15412 139552 195791 -22146 425996 219715 402542 344401 127296
12185 -9960 323121 68116 153344 234752 51555 98319 123409 -14074 240216 67271 292643
12174 292643 126284 107809 139660 -142443 -122279 101131 311542 325019 40979 397965
12164 397965 473373 189605 -99695 100715 35636 -42416 312576 77942 -273490 -134357
12153 84197 169552 11627 -278918 -890 -417096 336047 28935 -113416 316528 49652 158706
12142 158706 17165 -241540 -45225 -301613 -51411 -248479 129949 -45622 -228338 88478
12131 38357 39203 77675 -14165 11432 -83559 113690 164332 -68200 148591 -381716 172116
12119 -230413 -163203 -53510 -36943 63816 -170253 -14954 89506 -212024 -160933 109435 -92088
12107 332776 13935 135116 7982 20289 102967 -124724 271530 -162020 273753 -102555
12096 289346 -93674 -23384 54087 147798 33872 -18339 90601 -28880 -50026 -25827 -273012
12085 -273012 97357 174893 233185 -171988 57011 189379 82226 158601 902735 830184 1949673
12074 1949673 811904 191959 94504 6852 -43565 -36618 160103 179837 -49970 245047 -121569
12062 -190914 201913 202887 -71803 56596 -153515 166029 26685 -94351 173058 20014 322924
12051 322924 247526 -369630 -32805 -80366 -169048 6095 123985 152150 143026 -134292 -276867
12040 -276867 -7714 -151274 105820 -175732 228652 123605 129865 -63039 64329 -379802 77066
12028 114366 3065 129502 151695 -111295 2844 176642 -110486 48915 -84209 117188 49558
12016 215411 -100026 -329829 -11476 -531360 56730 -88865 252274 -155627 -145106 -79424
12006 -79424 85441 71109 39266 -108728 -314897 380016 190182 -370042 117571 87030
11996 87030 -46408 279991 10757 -52921 -74129 -138010 -91297 -200967 -164571 -47565 -87270
11985 -87270 -77207 -86035 -219590 -89760 -321207 185046 -4022 60862 91374 184200 -103014
11973 115959 276538 -450436 10907 1280 -187635 -75 -171903 -230265 166644 -164301 -62575
11961 157320 87319 -109128 -46015 59801 225089 35158 -37881 -261906 389959 35592 -25389
11949 -71643 14341 -17458 -28980 141947 147864 -239623 -9892 131893 -79484 -117225 119663
11937 80877 -61898 -250076 -235887 24680 74670 257557 30919 -142208 166853 -34520 34794
11925 -275859 -259086 -170572 -474640 -284978 13841 3857 -127217 -80365 91242 -1115 -17222
11914 -17222 27085 129808 -85042 -393783 -40520 234696 -317595 -168658 21273 -29254 35916
11902 27554 -127148 56244 -37360 -25656 -95948 -188836 70722 -322061 -260903 107123 30528
11890 25257 -101024 147229 442707 -63099 -62379 195430 -150397 -160665 103932 87973 51784
11879 51784 -204623 -112790 271685 -174821 100544 49817 -98826 -51025 -30895 -252316 267168
11867 118616 -61094 126072 -79954 108508 -84529 106827 30050 -51718 221305 -12299 207028
11855 -228417 -335787 53584 12320 12916 -192572 159134 12578 -80367 136904 -147570 229812
11843 -246525 -161874 202143 33439 -9802 907 -257493 307429 -44594 -18883 3219 -155391
11831 -96817 -90330 -36464 -177459 276122 213883 -77854 -113897 -8964 -356624 30735 109076
11820 109076 236721 -107607 -147949 -29570 -173261 68792 -38934 -171745 -321064 -264799
11810 -264799 -214645 -204493 195006 196436 224491 78373 4075 -218790 20593 15604 -213584
11798 10985 -3674 -64889 -102155 68786 60744 157446 -24805 -84367 -59335 193463 -99827 207325
11785 300734 60894 -161847 -203216 150308 -143248 30834 282155 -88070 405212 121155
11774 -25844 179383 -101810 -72908 -127397 2673 -50690 -15363 -339 -30097 -214246 8164 -6475
11761 87294 -232652 21391 -71730 -152560 -78365 117472 34494 -144417 112278 -39882 11264
11749 -70492 146541 -158120 94578 43123 24123 -133971 160213 175607 126779 -315340 296759
11737 130412 14875 -81667 -193581 40526 141515 96372 -106074 513865 328219 -110963
11726 -46148 154633 -68240 78546 -108598 84001 155670 147664 -14954 281755 212210 182473
11715 182473 -174316 -189880 -188398 -283522 -40867 110408 88032 253841 -372159 -161691 27553
11703 103358 245831 -103983 -13245 95298 171306 190849 110586 -252611 174972 59959 -368899
11691 279726 -285515 33314 110983 132149 -18109 -344160 -195331 -170722 18676 1249 -211877
11679 -160506 28983 77392 -53675 130374 360136 40253 -45862 89954 -46918 132535 -76274
11667 132065 -59255 77720 104210 -95567 -27163 -79012 161180 249907 -286788 343102 215688
11656 215688 71847 236500 16517 -41711 -228043 93362 -140753 89733 76301 204020 150661
11645 150661 -135412 -64513 261798 -230069 -147934 168818 220595 17360 -122321 45051
11634 -218230 379739 -333827 -122428 111562 -219670 164015 -35270 461386 189174 -197811
11623 138230 281837 -24519 264744 81134 -114707 43096 67293 166036 -87763 -254910 292053
11611 177372 -203896 367752 -68350 -250977 -156043 -205602 280848 111601 -48010 220025
11600 -278549 -51197 193403 100688 438688 -110201 -103744 95168 -30914 -342164 -140251 385721
11588 27449 95735 -126833 299267 164673 182394 -77809 71347 -88112 544061 24790 -138534
11576 4025 39601 142621 334996 -168072 -262302 -192206 -9820 -35842 376355 -31251 287381
11564 306123 48656 53111 96362 354987 -128416 -64745 461104 -193425 -128662 252209 62390
11552 208949 98973 154206 -87586 -3499 34485 310995 335043 -50648 116123 -93701 -56220
11541 -56220 343410 -94475 150307 280385 46273 -10363 35159 182188 230151 215460 149259
11530 149259 -296292 30027 -59416 120649 333905 87258 165152 16529 180277 266762 450191
11519 450191 183720 31697 66561 202926 90581 21205 -140869 -170825 26834 -14449 113034
11507 64574 -151 -311 174598 -9315 -28523 156717 166272 150768 206382 -5434 -28833 74813 -76672
11493 -131093 233296 153012 244894 378444 7856 502602 296721 208316 199899 79279 214941
11482 214941 -318869 407517 -14425 196864 -207802 194189 388593 285552 106953 381145
11472 381145 -13135 592710 -73329 69355 296878 53440 431114 -31886 114617 105510 -93671
11460 -82456 -4079 -22258 -164355 -116790 -267189 -4079 241517 -8976 222739 511574 201869
11448 -67720 217679 65312 292001 69022 389470 -11245 273748 -225439 12732 39317 90454
11437 90454 179299 73099 321440 -67679 254358 -37213 -12806 63599 183928 168038 -145930
11425 -90232 182761 34596 -32356 76126 18276 -274330 73051 249613 68106 192479 48583
11413 128561 88466 -50986 -151801 -116010 220429 163615 -94350 -211016 831 286970 -21629
11401 -123312 -62489 111241 -18615 9932 135703 -8236 263622 100405 253341 76428 -48405
11389 29187 -239592 11068 -123451 -306411 103764 216907 -235734 -272919 -392520 -58897
11378 106955 299687 92304 45050 -211388 -91004 -183247 -74308 161596 -114494 -232667
11368 -232667 123661 -124131 -17128 349356 -189581 234814 -37969 45944 -93027 -169229
11358 -169229 -130281 15782 -376358 80183 -5484 -150834 -7743 896 81156 29042 21016 -75484
11345 151450 -60411 84670 169498 97782 -15617 47755 233842 -85653 -250693 270994 -120155
11333 282184 -203307 210118 91496 -19940 -88686 -119870 48952 -105746 146990 287917
11323 287917 -215399 -127252 188866 162889 -135057 -29747 -3081 9300 -73892 -154117 -163846
11312 -163846 -216996 361508 -67960 -214505 110212 50590 -349391 -222342 149273 78777
11302 78777 59670 44251 101599 -9167 -63810 352234 -184466 210644 -109037 349294 58762
11290 17350 -59130 -61043 148072 -137430 -21646 -14990 220313 30428 136835 -23484 -5142
11278 -159119 11843 -5923 -505 -60243 -97831 -198329 58564 -117441 72889 -98689 -227756
11267 -227756 -72601 -308267 67070 -81939 14280 -91686 88114 156101 -54954 -90481 224569
11255 -31766 130775 -8707 -38620 -155694 -144249 -267641 -138184 -135592 55959 -6325 152290
11243 131555 79434 119311 -78491 -628243 93189 -181856 57299 160118 -16563 79571 212681
11232 212681 -93273 19903 76075 -226225 90782 -126127 -179290 -502985 136462 -4508 -127625
11221 -127625 -137985 -240293 -42381 65239 -156600 52259 -214936 -336362 247104 -184995
11210 133547 74924 80250 275742 -223315 61986 -395075 -86429 33666 394089 34730 158269
11199 158269 325691 -173454 162883 -178232 -328384 124097 -37062 -129876 -244070 -319873
11189 -319873 -51003 -201023 -229705 135231 31141 74421 -27029 17972 343775 -224840 -66287
11177 202266 79842 -195739 112597 198907 -122340 -343792 75365 26637 261563 110141
11166 -127247 -286260 -3162 -83364 -104686 196132 -366972 -114387 -26788 144922 -130568
11155 122999 181488 -203231 -361013 -59937 18256 121897 -144255 -224201 -101228 377199
11144 106911 -211896 14349 -2118 -73174 140553 36992 333711 257560 -199651 -112020 -46300
11132 -234562 262889 151788 260952 258643 59525 -304523 52544 316275 -201593 69876
11121 40284 103963 -231466 276733 249838 117519 -223018 -39546 -5184 124913 174490 -71678
11109 68812 184641 287018 123688 325643 397133 121670 -129855 316799 249341 -78052
11098 -34446 377887 -315176 137884 54834 355435 87752 36760 122947 5428 236800 469490
11087 469490 28356 -112202 175445 295970 58468 214509 360153 70482 244673 117141
11076 36102 217361 505038 -187342 600739 423520 210345 625799 302039 524537 411812
11066 411812 530085 417436 601469 515333 363670 763395 796959 870500 447206 664536
11056 664536 437477 462318 630913 713907 735720 895377 1166118 520848 728620 612190
11046 612190 482366 206240 629251 398109 777893 732150 564716 668159 767519 449232
11036 449232 475811 799109 465708 695103 616869 631388 672547 477551 412109 701519
11026 701519 799940 928277 512209 634097 434225 549825 832225 664439 480932 243305
11016 243305 802560 621361 648602 714923 435254 456135 444873 486167 534125 591201 534111
11005 534111 556875 596750 579530 606918 756842 732274 742150 1093190 1020193 466364 724510
10994 724510 666023 767253 423938 786923 754426 812702 714128 639863 457694 717390
10984 717390 903922 1174969 1204551 1119269 1187667 1073769 1519588 1400473 1470579 2003445
10974 2003445 2325015 2699036 2579201 2809613 2946261 2509448 2826399 2758724 1993954 2009776
10964 2009776 1583974 1199157 1571864 1611159 1642473 1698817 1742074 1657235 1751647 1555798
10954 1555798 1402042 1135261 1380761 885444 826093 863120 373801 45730 428407 191256
10943 381037 271696 276292 260996 60216 2525 268009 8837 180550 324320 -37132 302653
10931 351342 276799 -242876 -38288 159549 -127352 269145 176642 23341 8493 75996 10691
10919 -297643 161517 52454 43623 -240702 -226977 269789 -229903 141536 50747 72464 -170302
10907 -166780 -68169 43216 -144603 26107 -182822 192885 -267964 153966 10020 -183167
10896 -296538 99095 -219115 -33114 -70493 184681 52286 266679 179544 56635 100850 103694
10885 103694 -86535 148495 -116335 -252873 48976 -154552 -114739 -135179 16576 -125479
10874 125285 -167531 -140056 69276 255775 141795 49719 250447 198334 80196 -290537
10863 -9860 -191686 -145811 9190 83133 -193814 -58653 -32256 178662 -153686 -96681 -31619
10851 -15989 -245407 -54143 -163408 76210 -208347 81633 -221551 209211 -303124 67230
10840 -43819 -10556 -17802 -125424 57403 260699 -51826 -32970 -190003 175407 -172118 61372
10828 -20300 18089 37017 5974 -41313 -3316 39030 -217977 -181225 -114751 -131123 65355 26832
10815 -102617 -94716 -166672 -104543 -223733 222129 122745 302620 -136331 -50673 -308966 -219519
10804 -219519 -120357 -214884 -43162 94059 -195256 -78365 7305 -164376 34496 113946 -203481
10792 92839 130683 -164321 24201 -137997 -281758 -48577 86127 177813 243323 191501 -137045
10780 418422 -210463 -187379 7286 -451414 -77007 44094 -140421 125536 41505 31507 117655
10769 117655 222773 -427652 89035 -180351 -36974 -124875 -46135 -120372 -221953 -43064 -240406
10758 -240406 113440 -240521 -533 94393 216106 -272965 -32897 -27888 -34755 -125896 189194
10746 205421 67504 -20910 9913 50399 113608 -248313 19634 -32845 35467 35264 -126525 4823
10733 -444149 -157195 6908 -102681 113170 266517 -116805 -35351 -277959 138278 -133198
10722 25322 -354097 -121873 -337872 60987 -516478 -32345 -130150 70357 -269863 -240807 3929
10710 -190044 -67411 -39384 94374 45554 -229321 -83194 87246 261708 -136466 -71499 -58826
10699 -58826 -275100 48652 -239991 -88432 171067 -47129 47524 -36195 315897 -40144 -64877
10688 -64877 -129222 194560 -108164 -110524 -20559 37742 -190885 -115612 34257 -168539 -184226
10677 -184226 -260447 8486 -223448 -128479 15120 104333 243035 -232037 -314493 -42280 -269245
10666 -269245 25157 -158404 -88694 237863 -306723 -26424 -161137 -11519 -59948 125997
10655 -197068 -37019 -15940 -262063 68210 -157587 -303511 78996 -14432 79505 103903 -125307
10643 -104078 -23115 -29319 -173940 17797 -105429 -143628 -156579 -16424 98525 -38617 99861
10631 3396 -62078 -16799 -263074 -74492 64378 28442 -161700 14142 -109409 45490 143739
10620 143739 179827 124889 -77672 -117472 -380566 183542 -87304 -69162 5920 266210 73428
10608 264080 29115 -202031 -302178 -37723 -331123 -149282 110135 184662 -173280 306620
10597 115769 291697 -171278 -21489 -5259 14466 -356008 33477 -192281 -75073 -190927 -49922
10585 66580 -331075 -65995 -27357 61013 -89459 -156630 135828 -145484 -32404 113867 -135457
10573 160684 23082 81031 134813 -145956 -197072 -357657 -72933 58245 -82578 128811 -420079
10561 -65570 211323 -184867 167851 80096 45754 -208526 64386 -105885 -153385 -3296 4414
10549 189867 165174 -21669 234648 -198323 -111406 334976 -31889 -41763 -140080 49371 106027
10538 106027 -312582 -74825 -126254 7743 -87280 -508709 -301737 468566 -215745 270030
10527 223134 -55208 -327220 179423 -154509 -31136 55778 -112827 56407 -47223 -263575
10517 -263575 -144161 -15516 -53669 -136191 103858 -114921 -148433 -355989 -142538 21634
10506 -56462 45885 -896 135501 205289 -151688 17620 144152 -164218 10960 54864 -373771
10494 -85476 -39607 14727 97945 165201 122490 -154158 -177818 6135 -179034 -75486 305601
10482 254351 629877 301360 657170 499529 163544 192676 402094 111494 -230370 66814
10471 9960 -22977 14966 -140723 159219 153531 155262 111063 135995 98973 -55849 -45744 -15384
10458 -53607 20323 -8633 -121367 329817 97772 -103664 108208 -13452 -110186 22074 95101
10447 95101 -251933 -246551 36341 253219 -91640 -8347 -38474 -227943 -109756 -17854 -279181
10436 -279181 -364645 81322 -69073 172484 -175110 -25678 -128777 58294 -176994 -213792 291182
10424 -31401 154256 -116723 -104232 -623459 -399172 57767 -235827 247833 -39484 -384326
10414 -384326 -128112 -217903 -335339 10414 50451 145249 160458 57372 12030 136638 69987
10403 69987 -369642 -95594 -343698 227131 24506 215873 -257935 30748 -85610 -91619 -40375
10391 202539 359628 187624 185154 -33073 273183 10886 -81182 284077 103366 72126 -119300
10379 282368 264261 202417 153963 -38919 236369 53706 -174241 265294 81290 338708 408091
10368 408091 349881 323362 265491 535060 252638 -66048 484010 81532 287924 200026 96023
10356 275309 201807 303609 241128 125611 620971 484197 274651 623558 182579 367587
10346 367587 186038 -36170 671471 890075 609757 440236 285242 238098 195335 249751
10336 249751 176002 -8154 121369 270601 -49824 144492 217880 -260815 26194 -22843 68435
10324 -85691 109138 -301209 264780 -179143 229424 284990 32360 160922 45660 237478
10314 237478 -130106 300901 79044 -21524 -126251 23555 -13387 -37244 175971 -15452 -181194
10303 -181194 60792 -158575 -160902 173116 -93461 61731 145055 -205715 419789 77001 -152647
10291 -6614 -92732 83926 -257793 -77055 -234882 204979 -13314 -165420 232217 18694 -144366
10279 125728 -132479 -155860 -246710 -78885 221738 -220678 -103568 -81011 19310 83438 126214
10268 126214 197195 -79223 74771 -224595 59966 257112 -76065 588847 121054 465450
10258 465450 -918 616816 63617 214878 425279 186059 152645 -283423 149607 -336797
10247 -53272 -210367 -49336 120434 -172358 -49819 46906 -85109 -64184 144915 -312 238712
10235 -144145 -8780 25124 84749 -712 -158306 288482 218585 20075 60789 219511 190424
10224 190424 52274 -156408 -168250 114229 -26780 -386465 -98957 -202174 -137658 -58448 -159878
10213 -159878 -56355 -95129 -564516 9602 -323506 158455 -37821 252093 -160246 -423940
10203 -423940 -28706 -14604 -155639 13631 194652 -129009 -32048 307111 -191096 -79934
10192 -171436 32301 -185785 126154 -64927 3384 -419376 90731 -51313 99471 -179593 -3897
10180 -104113 -84288 45137 -240787 166619 -137360 -271798 -198368 335777 94502 -381382
10169 64222 -252802 171710 118055 -92383 -105 -194477 -223906 -104944 -149560 -181079 -177159
10158 -177159 -98167 22503 110334 -12112 68141 -219989 47161 -194452 202158 -114550 -146556
10147 -146556 56697 68493 92863 -329223 -281039 -107494 -101567 50623 -39855 -18060 71920
10135 8804 217280 269499 -272028 67508 -38544 -456044 -275990 18602 -419399 -139495 -146970
10124 -146970 20173 153728 -521871 -136715 -200589 -123708 -158805 -43504 251510 -128190
10113 -6297 -8458 -233851 178765 379800 101705 27365 -107935 -19378 -134071 138158 -361548
10101 -107555 32582 108463 -129526 -297082 -114081 -260719 -46148 70711 -144183 -82003
10091 -82003 -87305 142093 -133274 -127000 133895 -77182 201320 -56509 67619 -141709 -63147
10079 -78861 12292 -33544 -33217 -34111 244995 -26122 -204169 -61135 232987 -194773 87477 -71982
10066 -57120 -1591 -8461 -199835 -364861 -24728 14440 -169500 -297429 34856 132742 28264
10054 256742 159461 14253 -65691 -137143 46981 -157265 98101 -66498 87884 176551 -17347
10042 -146476 -335780 -184806 253674 -456639 47617 -170329 217187 -21184 -285928 -372302
10032 -372302 82906 -62756 -185907 -94347 -103791 -266047 -58144 -242360 223023 -2768 -241342
10021 -241342 -117554 -281402 -367578 -154378 124832 50042 -265794 -96334 -61026 -276658
10011 -276658 -183488 -296266 -20580 -77767 -113380 7592 -54600 -198429 -24932 -106703 -180745
10000 -180745 -136821 -75964 12849 -95715 -95138 -201336 -390650 53849 -110471 -211998 -155251
9989 -155251 -434004 -12448 93312 77320 41726 -248391 -88185 -294719 142213 186955 33790
9977 -243032 46585 -320047 -106821 118495 -149642 41130 44861 -335344 -79337 -265622 -140479
9966 -140479 -112711 170661 -30107 -346724 11694 -224263 -212616 103183 -200013 -42501 10389
9954 42985 -176502 -110226 -364010 142688 -38153 125837 -33377 -84858 -154716 -176840 -316421
9943 -316421 132033 -167178 -70663 -186895 20024 78598 -261765 60675 2064 -122906 -157535
9932 -157535 -2075 -244674 230943 -146361 -9000 -59588 -282502 126087 35477 -212133 22111
9920 -69299 -139649 332416 -188648 -161176 -164656 131108 43498 -127188 -473561 -84259 97592
9908 -11208 90319 146448 63908 -56702 -91705 -385645 -199525 107550 241544 -504605 -120965
9896 171955 83828 -36593 -184279 272378 197915 -125559 207497 -229630 -194737 -36143 -314334
9885 -314334 -63389 279441 -75202 -74551 -1178 107065 -32604 -167088 104649 -167380 -203975
9874 -203975 -588710 -67119 -295325 204290 -124952 -54502 105041 -22551 -8843 32834 181700
9863 181700 -265651 19547 2615 37927 64378 19326 -5846 -52403 -419583 94844 373 143849
9851 143849 -342133 -69936 155689 3913 -31107 10886 397931 -315356 -5240 -20532 256777
9839 -293236 119956 -88642 70779 125958 -109654 9238 -234453 13255 -63498 -126442 74717
9827 -174504 -133509 366456 -72333 -68138 -74886 -18136 188198 -166652 -38743 -7896 24290 -51750
9814 -97626 -86717 -331637 -163491 94826 -166557 -139661 282966 -170957 218203 -155294
9803 -67579 -188019 -230313 -79960 -6145 -242910 -236565 21829 -64959 -34352 -115529 28350 -75943
9790 24027 -68817 -254982 -41222 -62350 119829 -244978 51424 -225779 -397092 -178507 -77128
9778 134524 -149627 -36851 -235617 46715 66686 -54894 -361391 -302099 -13604 -146224 -237070
9767 -237070 -222357 42733 75497 -55956 96896 131965 109626 20274 -148443 -245784 -24626
9755 79907 -215043 -206047 -113042 -78450 -100699 -96142 135312 -131536 -130693 201126 41982 -266917
9742 238207 -52611 -56617 -107720 -334202 126748 72541 -118338 -119760 12099 -22167 -285759
9731 -285759 -263361 -227251 -167778 -145680 -75147 -31474 -3551 207771 84650 86378 -70083 -143023
9719 -143023 319314 -74809 -333217 -100577 -94035 121000 -194403 48979 128480 -4907 -130899
9708 -130899 -151157 290370 -170170 332731 192985 -242241 14471 -142271 191385 -90041
9697 -57394 30348 -166382 -149614 -106958 -84276 112744 -86034 -357781 -191954 -68239 52972
9685 -62299 18796 -85529 -141182 -110135 -181931 -47848 -217973 -32809 -167983 73974 50056
9674 50056 145340 102326 -82401 -92057 -138211 136222 -13814 263667 296462 -120905 82240
9662 -36748 92996 -205185 -124871 -61030 -212948 9445 36023 -4819 2123 -293622 -58469 118702
9649 -255867 -164738 63421 -106486 -58825 -169540 55346 126670 -78737 15990 -64172 -238477
9638 -238477 -193214 -13159 -414080 69471 -193481 -152330 -200084 -204784 116461 -16624 -38971
9627 -38971 -323242 195679 -188446 29459 148171 150150 352007 -93743 29035 -67163 -228608
9616 -228608 -186591 -149073 58814 158117 -211185 54482 -138280 284339 15390 -133960 68255
9604 -148129 -175377 -80864 69126 -240641 -105806 -107105 -41197 -251672 -191726 -53410 -72023
9593 -72023 -314263 -167275 -328379 35691 107989 -95975 -112632 -101609 157252 224723 172303
9582 172303 -237204 -235843 -31128 -218064 -56517 -129767 286619 -153113 -115190 -89128 -392
9570 -104606 -366615 -434139 -145223 207949 -37795 116013 -100754 20899 -56503 -214692
9560 -214692 300005 -169769 -145636 -145894 9827 208126 -239618 -490539 -182508 -41356 -199776
9549 -199776 313270 -60625 -269992 -91600 146128 155565 92359 -168770 -307909 -273808 230276
9537 -168458 -80129 -3005 -204345 -218647 292047 -450782 18215 36522 263626 -245953 127619
9525 32175 137558 -247069 -102596 -87274 -134729 -160991 221853 -61730 -215937 -38222 -79248
9514 -79248 -197131 -191614 109708 -231537 -59813 -235530 -29735 57906 -75431 -79516 111263
9502 -62439 230094 218850 -9147 -168578 -130281 222205 136108 130789 220269 13394 -46168 32899
9489 91158 -346441 -98643 28203 -151588 -139238 -152391 191235 -22281 -19506 -119063 -99584
9478 -99584 -226368 -64454 126020 -124057 -234200 -11583 -241621 -2887 -31478 -26366 -122665
9467 -122665 138566 -6830 3218 -29595 83089 -336823 -195110 -150062 158194 197233 124953
9456 124953 141072 157228 -48432 19697 -195476 301778 -373405 -77903 183857 -318464 -186867
9445 -186867 -169418 -192383 106754 16950 9191 -100318 -249593 -167773 -162008 -158827 132267
9433 -163860 -290582 -16856 25928 61671 156148 4834 14386 92072 -259951 87982 -145519
9421 251671 -338005 -126598 96765 -109718 27020 -123615 72197 -96257 -53178 -174851 -340369
9410 -340369 -104323 165245 -177014 83572 110027 -57588 4235 294734 -65292 42519 510
9398 -220467 235726 156812 5544 -30392 -282748 9566 -341622 -33426 17724 73847 39069
9387 39069 193398 -46987 -250981 73670 -48146 -63751 9740 -291107 25199 260549 -103976
9375 316597 -59557 -49176 -242030 251436 -355224 -139171 -106752 -142998 133479 -429299
9364 101442 -241243 131543 -109749 167722 -25787 78991 -155685 35758 76654 75040 18595
9352 111616 -20939 1795 -367135 64931 -96809 -94260 16535 -29855 -92432 -65331 203532 -76560
9339 282620 -81182 91163 -43597 -176968 -179164 -186154 44396 72588 -66037 23396 114481 -263275
9326 -207794 -91878 27008 -344316 -231330 94778 -94248 -62872 -103038 56253 176358 -48453
9314 -23574 -154734 29316 11602 -7926 -97922 -415856 -40556 -146797 -391248 -261072 -225416
9303 -225416 22594 286160 -236648 -239845 -123647 -59812 -2520 -32506 -87310 201157 -41315
9291 -126354 -125359 121286 -89340 76768 65014 -92066 255504 -133807 -284372 -329926 -340042
9280 -340042 51742 45304 -169637 -271829 -340337 -109051 103905 99196 -162801 -96681 33226
9268 187119 -55555 -23611 -2682 19804 -69658 -29487 -101618 -21743 -300934 216547 -135568
9256 -23830 31786 138708 -184740 -19217 -247801 -204760 -38304 112373 -159734 -247075 31447
9244 -143024 -171016 -762 174299 -383500 -35939 -30686 -320704 -216822 316877 -39949 76755
9232 -474164 11210 -66698 -116361 -116699 137757 -100223 -162253 -200410 232024 -39698 -162299
9221 -162299 -21235 47410 164665 -131071 75502 302174 -14518 149068 -291413 -143749
9210 125660 -54415 148232 -335250 -252356 -77634 13791 -123435 267520 -3715 10790 -51229
9198 -44428 452 -356204 163491 -165835 -238643 390737 -120438 38424 -265299 -265801 134252
9186 -39921 -125073 142048 -6289 -207468 -196701 74513 -133562 -209054 36569 146368 252448
9175 252448 108698 102728 -19661 -253352 6018 92024 47164 -95860 77763 -167859 -234169
9164 -234169 22805 -250207 -103956 -332492 -255754 -267968 -226646 92858 40483 -70308 227842
9152 -58464 -206783 231928 -229375 -26118 77707 213280 209130 -169822 53410 82129 122799
9141 122799 65719 293326 72398 32933 -128751 117365 69899 -191951 -87120 -89398 -40578
9129 27131 389386 -202508 397074 117005 -110583 301033 -503172 -23190 -192294 79930
9118 277069 -139691 -132932 146424 -288786 -24969 -182966 50589 -233762 -30302 -153138 153837
9106 -27658 162683 62666 103386 -22181 26306 -130733 -264405 -173786 -11695 -58872 162914
9094 24575 22476 -165806 78684 -37158 -432289 -71322 44263 3999 221035 230910 -225451 -53082
9081 -53185 74167 -237922 49734 -324288 6987 -153784 178384 -67983 -315359 -476741 68197
9069 84600 -47355 -19582 166753 -184942 -76092 146878 -77602 -122920 169990 26571 -317830
9057 65109 52672 -146250 105001 233127 -329138 31356 93865 519903 94405 -55832 -216832
9046 -216832 -202376 27470 -245058 43839 354971 76325 -197162 -200545 147162 -143561 -150326
9035 -150326 -274399 -157385 22110 -239110 -420323 -139319 -75167 36469 36378 -71565 -177795
9024 -177795 -179518 -36257 -255610 -62390 -70080 -6537 -157263 -114525 252972 157746 4577 148562
9012 148562 -356791 32226 -327131 -8690 -44263 -195005 37621 150444 179694 277545 123619
9000 194189 -64113 -64592 -254092 166489 -127516 -164882 3693 -71688 132681 130065 -183767
8988 -36502 141793 -75948 -79020 -168171 -115733 154518 143933 -67118 241458 -342822 100435
8976 -154557 -128371 132246 3616 -96460 -139833 -109082 33549 -68339 -184157 -203155 -9759 116436
8963 -303196 -84299 -306490 116900 -266672 -40774 -100624 -247629 26785 -141935 -19048 -121917
8952 -121917 -383914 183034 10118 -95093 242829 104795 8754 216801 -226488 -173353 -19662
8940 14451 110756 24170 129577 196234 47213 48234 382644 50095 -49660 -162311 -224721
8929 -224721 -217229 -114782 95483 187529 622435 1237401 2495578 6459549 15319532 4707094
8918 1470899 527051 354222 59422 -43925 -364392 -110381 105613 208580 24500 124360
8908 124360 387168 383899 -209188 -41702 -237629 -206517 -64296 -86487 -379038 83787 -360221
8896 49151 13005 257257 80081 -48483 -36252 -166340 -56901 -234443 19731 298728 150851
8885 150851 4940 -506555 209399 -257880 -18932 -62643 -390260 -373175 82341 -219886 144914
8873 42401 66086 225369 455 -286907 -98507 -181908 278231 28792 -232023 98440 -1613 -108557
8861 -108557 -131049 120599 41939 -32557 -41949 -340221 -367122 317615 -127945 441310 -109284
8849 -9263 -279016 -74080 -302140 89959 99040 34786 -293882 -227750 190374 -5846 -262363
8838 -262363 -188173 -213019 -253938 -233249 17010 -120143 82641 176069 93177 -300061 36828
8826 68107 -48945 68515 -309188 308628 123284 513187 -122322 -95295 -63619 -39548 227065
8814 -21840 131798 178117 86562 -238336 57716 -622740 -75959 -166398 -22554 -15782 -102871
8803 -102871 -21609 -97325 -183525 -20782 28220 297503 -6690 -361702 -191218 128642 -106888
8791 -15898 81589 -64026 -337145 -11729 257106 -134553 155439 -146292 -41765 -56350 -277101
8780 -277101 -438395 -592434 -175465 -234601 175840 192688 237051 56406 -37267 -230024 -134562
8769 -134562 -6401 -136632 -414728 -67371 -73578 228364 -8655 255558 -148905 -519139 45604
8757 132780 24999 103206 -42478 -401896 -165061 43268 49289 -48262 102659 134948 -52845
8745 46213 -78243 -35724 -65285 -57694 -80098 25944 -94067 -143700 5860 -151058 11953 -260424
8732 -30331 -15075 -159395 17428 -49065 -11023 2195 83415 -32322 -94026 122557 -233595
8720 -154800 -141435 -240875 34340 18716 -160806 24552 -36905 13615 60493 -345301 -208335
8709 -208335 166270 -90398 -13950 -128745 200936 222105 -20899 -276086 58827 -228074 -3176
8697 -269835 -9815 -52697 -17189 76041 -2538 -125449 -297148 -106816 -453644 -46456 -119291
8686 -119291 -69891 -57500 135385 -121930 50201 -191490 68859 18202 -258611 -219304 -101493
8674 -57231 104096 -44220 -232760 72205 -100096 -509513 2273 -9937 -341464 545 431335
8663 431335 31868 -31181 -150622 -84708 354143 68676 -190797 -275614 -158085 -80046 440668
8651 -83915 -24 3825 198332 116254 -303736 -251398 -118845 72192 -35583 33331 84308 -83492
8638 -126449 -35029 48116 -99858 -313712 -103678 -91030 183738 -428355 -118087 -131388 116153
8626 -69276 82785 -203268 -57403 -78252 -43110 -78794 -101451 -231791 -142296 -35830 -92165
8615 -92165 -104845 -13460 97645 -247592 -94701 -483553 -137889 83587 -81224 72355 -296213
8603 121805 43265 85837 110519 95688 -204003 47496 -109006 111795 3271 -125141 -249404
8592 -249404 47655 20672 -4600 188569 -311937 158545 -52778 -11804 -45534 71633 119901
8581 119901 16705 3417 98942 -49943 11183 -367574 -174244 -392175 -73784 -20042 134880
8569 -229376 -157970 60112 -170955 71169 -156619 -203015 11517 16388 -37370 -62434 141418
8557 -138855 69672 -208918 12081 -168748 -90114 5121 -119355 125817 9264 55395 -44826
8545 -90066 -70755 -176150 -151691 65494 15838 -176389 77980 208563 24018 -9144 148589
8533 -295593 -120251 67071 128549 166522 16726 226148 32424 -360832 311483 306097 -445311
8521 -55892 -6198 136410 -88157 23437 -280168 -38338 -82497 12562 -204668 -329190 -104633
8509 184567 27805 167358 -37418 -169513 317448 -136032 29686 454256 -471174 -97390
8498 11898 49791 -203775 111965 -116060 -289798 -25265 30226 27285 195588 -93247 -16487
8486 -218962 -368275 92822 -89720 181772 -81484 -142899 270457 42270 -181197 -19272 309829
8474 287726 -370922 -419053 54649 64493 -5760 6655 -131531 -94815 -5895 -145132 -52432 -220841
8462 -220841 -79966 -108240 -147167 198566 -51489 11300 -37984 -138140 -11164 -62818 -165826
8451 -165826 -279998 -161117 -135943 -152740 -46959 190509 -225803 -65706 -105440 38548 -61374
8439 121947 40791 163528 -150111 -289064 45396 401524 153818 -207591 214404 -94623
8428 97419 -199194 -151960 -215195 -193909 -114122 -81132 116147 -298465 104005 -186106 -25018
8416 -360883 -17180 58834 15271 275128 -283717 65647 47270 -124023 110274 -159046 63739
8404 -5357 -255667 -413795 -57427 18608 138315 169939 -382517 -107446 53881 -6016 53147
8392 -107041 146274 33985 -18506 -107103 104805 -96673 -70156 46897 -83011 -187172 322557
8380 -54275 -74989 180623 -228436 -313589 108910 -10346 -233533 362292 89212 84439 -21252
8368 -118043 17902 -204762 12007 -48773 -117048 -416448 11707 -246401 92788 -86955 86452
8356 -1891 148709 39872 -120520 -211783 -65875 -191407 77653 169344 51860 119360 93178
8345 93178 -203117 28809 128276 -7740 -28722 -139456 373940 -197337 -56502 -97157 18774
8333 -36714 -62077 142806 188563 -293135 139269 31353 112381 -206761 -141624 -38813 -19916
8322 -19916 355243 108691 -31605 138843 168794 -23970 -102461 134957 -245711 160986 140469
8311 140469 99136 -139655 67624 102334 -24080 43397 227082 -190272 154730 212507 -115546
8299 -359697 74948 131002 -86640 534 -235867 272152 -27211 -23295 20260 27943 -28308 250494
8286 69413 -31716 131785 -214939 -112479 -247000 -73099 -165792 -138024 -481573 -135153 -458206
8275 -458206 370656 37383 -441022 -565360 -203039 -132695 -57922 -100503 -181493 -216949 -2673
8263 350974 -86057 -98020 -181493 -64333 -113989 -516070 -103033 427355 10490 -12834 -111974
8252 -111974 56348 153770 -7066 -217827 -13177 44391 -431316 407127 -196416 -100915 -148146
8241 -148146 -159407 70073 -237800 -94813 34986 94380 83937 4373 -350161 46768 463779
8230 463779 -80978 -147256 -51519 -84090 -228200 210781 -180305 -88315 80280 -191461 -186881
8219 -186881 89657 -67626 55562 -146137 -194359 -68135 100996 -74921 106534 -231817 -144875
8208 -144875 1127 286423 -71909 10843 -2853 13513 89471 -181600 91058 -93119 18647 244870
8196 244870 -40357 17585 -189079 -128854 -41234 -48181 239612 -66822 127166 59941 110812
8185 110812 42317 -43749 132670 -121708 -143866 -4833 20829 48279 -79647 -138921 55462
8173 -115701 -239160 28711 133217 -317187 -116841 110826 -81449 -299721 62256 -56310
8162 79277 40231 133848 244093 -89983 -84107 -226856 128514 -188954 -63708 310957 -133798
8150 62465 15753 83633 167814 -168961 169655 -181304 191925 -282606 -44280 80598 71284
8139 71284 -170592 -61998 -236797 -169828 -48330 59158 -385295 -26288 -289305 93059 -162137
8127 -29440 -114977 -54765 -155096 -210326 132876 146893 -224869 -91507 85796 -24401 16200
8115 -92964 -252530 115604 -66275 -98636 25996 -130001 377904 -17494 -79224 -184234 222523
8103 -49243 -196375 -86717 -95223 -12173 -101067 -342510 -172736 -110158 -250671 -122057 -23980
8091 -217032 9778 -57611 -253871 -153822 1199 -346768 -325020 19782 -300382 367369 -282288
8079 -206957 63108 149662 -128852 123864 -234467 213547 228169 -141258 -72634 -510078
8069 -510078 -14280 -294682 -343346 -282903 -20114 -347832 63053 -69733 -138435 -66815 -183362
8058 -183362 -134326 -273827 -11054 -222752 137802 -107829 40483 83423 -85018 5200 58700
8047 58700 -119484 -108080 88961 201017 24177 7052 -58142 -170281 -349308 173320 167027
8036 167027 -45489 133135 11697 -37297 -209369 -43421 -133143 -50738 11940 -34800 -97667
8025 -97667 165475 -39296 280432 142840 -8981 -105582 -34567 -194501 -274953 147872 -60918
8013 -37873 -121586 58601 148793 -263512 -505204 -16942 389848 -161575 -204110 273549 -55169
8001 166830 -28958 142053 -116219 -126220 267734 -146327 165748 -85040 240315 -90517
7990 -323555 -335043 -179108 -150539 -56405 -13812 7672 216981 -220514 47880 206336 125807
7979 125807 186490 118571 -26240 32984 -94386 72798 -12195 -48950 -332015 209520 21087
7967 -196693 93980 131050 -70572 -17229 487614 -194691 -89511 -24731 194492 -208365 -152051
7956 -152051 -165310 -60474 78479 -245946 -73408 -135325 30211 286632 -203433 -297468 -469455
7945 -469455 -220192 197286 24920 -119126 -8596 -248877 -53667 -36882 -73711 -178115 91615
7933 -13189 151925 -47767 -446394 -253178 -22681 -73639 207407 -46369 301350 248262 131143
7922 131143 170936 -7776 -81554 153469 -61129 201132 -82872 199597 82873 133405 7590
7910 -203959 -145152 -155959 84906 -89184 -164018 1789 -140272 80193 -43683 166225 -85364
7898 -38712 24972 115416 167979 74671 -101138 131607 4063 -93233 -303089 227824 -54068
7886 -178840 33953 -169257 -183418 -176182 -128450 -187042 232007 82133 -55885 8709 -200267
7874 -329305 68103 217891 -185586 -44369 -136656 -40487 36376 -133420 -98874 -77569 -7574
7862 -225709 -103736 -40039 -22026 137178 -236106 -274948 221604 -262153 -77844 -111285 -228699
7851 -228699 -171121 41875 183028 250371 13778 -155564 -205717 131759 -252539 -140681 -313318
7840 -313318 -151417 94062 24100 -287384 -269947 -140732 -63166 -101811 -99508 45356 -186908
7828 -91424 229876 53500 -159961 233739 -58170 -162181 -4997 146528 -172187 -138638 -343959
7817 -343959 456254 -126538 57070 -465681 -190904 152546 -541751 168752 181978 -260825
7806 -194146 -246422 -330758 -34015 89253 8002 70310 109345 -91699 -68259 -20323 198457 37928
7793 -163376 -326699 -155921 113003 -160151 -187413 -365791 32458 -82243 -341291 193899
7782 -136257 -112048 92463 -281528 -319300 -56770 10753 -8641 -277202 -59193 -68498 -31737 -244892
7770 -244892 78388 -184833 21319 -158163 -198614 -149106 -15204 -55763 -351236 238919 -139938
7758 -70565 47431 220319 144778 -22297 -212446 -174327 44135 -113407 -111888 -123345 19015
7746 -207189 20936 -177942 60081 -471386 314668 145907 -210198 236465 107669 177439
7736 177439 -262540 -107202 -554592 -149211 78170 -217857 72070 61437 12726 -247069
7725 -24767 -63005 -73749 38651 -123425 75392 -23420 -122641 -153096 25283 -229131 -66217
7713 155554 138393 80401 -143777 -155546 -82201 -36294 118678 -374252 -311012 227490 299960
7702 299960 91755 169819 -74432 -121031 -156788 -306442 67291 -238747 -13389 -6821 -232172
7691 -232172 -6332 1381 -188914 18382 -77847 56317 -25718 -25413 -96596 40903 -11544 79232
7678 -280097 -78446 -77550 -221823 6121 -142206 195090 -99862 -47305 -172452 -2911 146796
7666 -408488 29119 -15755 102038 -16961 -68362 -177935 177669 -187246 27354 109708 -23422
7654 -71653 56149 -126294 -317798 119501 -206024 -269638 75545 62590 194143 124807 197550
7643 197550 226583 -548684 1150 419694 -378305 279933 -228321 106125 213945 -93288
7632 175725 207266 -34671 34618 -93901 32941 -7037 -249556 -83348 227238 -212591 -135933
7621 -135933 -18875 -30144 -83251 -1991 52944 203504 -76229 158117 62736 265805 104503
7609 37097 -129375 236004 8622 224813 135629 -246018 36997 -30887 349482 119971 -341652
7597 -82372 7497 -107206 -120906 -154108 109211 99663 -40196 -346425 -404679 -3576 -121301 -192148
7585 -192148 156005 -22290 -50769 204435 -63510 -3132 -247604 -54651 -83925 57913 19214
7573 -235393 132461 -10073 -59603 -213343 109198 -42166 65923 -11730 24666 -173082 -416181
7562 -416181 -59819 -67497 -156364 223993 -9461 -42101 -306419 148669 -260054 89128 -70969
7550 -182716 -183488 -99207 37952 -384592 -14337 -191793 -94123 -188652 -141877 -249183 -384679
7539 -384679 209200 -116034 75548 -162902 8166 -139747 200328 -251164 -61767 -67145 41075
7527 -182819 -113011 -269545 -77476 -265755 -167200 165636 351472 97017 -10294 82634 -198297
7515 111163 -79380 -248218 256245 345871 -77917 -107028 -64610 -145889 -92511 -55525 -94960
7504 -94960 -448499 37473 252960 260911 -65093 -246662 -4564 -148319 -187901 -117087 -171273
7493 -171273 256798 -179425 50493 136489 -189691 -82609 -91849 -45777 -61101 -9988 89599
7481 55630 120910 -134629 66905 14396 -62446 -180713 -229498 -140183 -188562 -284092 -186026
7470 -186026 33201 -292740 248098 -156808 -56146 -74476 -164235 -123121 -9881 -139007 20483
7458 -17778 -79515 143186 6379 -171437 184302 -259318 -42156 12128 77764 196280 69319
7446 -75296 79975 -258707 43910 -413924 -307325 164911 221018 95600 375230 70408 197461
7435 197461 169130 -156931 -118356 -200395 -52967 323 -256772 -76628 -59574 -40811 -34453 -23422
7423 -23422 137157 351224 -124225 -292457 232972 -149886 -302229 4509 300953 -110957
7412 -26640 114178 215768 37946 66291 -205676 -33088 -38165 -110710 185736 45502 -185587
7400 153383 -380282 -63588 211355 102424 -86656 241460 83284 -3015 -23186 -231817 251758
7388 -175022 -258937 -218506 12737 9097 209309 28894 24479 142153 -114447 -96570 37010
7376 -127844 -273227 -204333 -60322 284603 113736 183581 60119 179808 -263282 -47268 -47456
7365 -47456 -234451 15818 -74145 154310 127238 62206 10429 -134408 2795 13124 109164
7354 109164 16218 -120820 -147479 21098 12515 4186 -180412 -40443 -280056 173876 -105396
7342 -143016 224552 153761 -143167 -148020 249794 -121511 61985 -58759 39069 21917 -235992
7330 -133027 50269 -26899 -161597 91786 131045 108473 -163880 291906 -194325 -151165 280041
7318 -148292 166080 168404 -94091 -227424 186319 -206388 -56408 296089 172938 -350572
7307 188535 175161 -297507 -145905 -163265 47785 -291342 337072 225725 196034 35057 -212706
7295 -280612 152556 21383 -146371 -123480 72869 221606 6331 -309991 79227 222561 -1789
7283 258590 48383 -215143 -64918 20975 -64494 -74151 205316 -13803 127274 -110818 -33944
7271 273055 -77332 -197634 164505 252764 -10902 183570 -201623 -73965 -149343 53066 -8177
7259 -383455 70390 29584 -189400 -203507 -344696 -328554 59735 49170 215098 -35646 -206355
7248 -206355 -1525 26095 -65633 90785 230947 -26249 36598 81492 142714 -351491 -275721
7237 -275721 67880 -58042 -103508 45235 -184134 77124 -36769 33005 6633 -230829 -197107
7226 -197107 -179385 -38117 -35114 23195 -245339 -205330 299623 121671 30857 -216894 -153771
7215 -153771 -68413 280817 338659 -79151 -330324 -286105 -109748 -53738 299237 -59789 -279711
7204 -279711 121780 233546 117527 -265252 -182906 -29527 -167661 84970 -44764 -143843 -90342
7193 -90342 -11247 180977 -398769 -102322 -127701 275926 -52953 25156 47299 -90413 -426553
7182 -426553 51003 -43909 -27605 -162257 -120858 198102 -279711 -7426 248055 49847 24360
7170 -125110 48722 400926 246863 -31721 -224830 -204478 -35312 222533 -11379 -316447 64965
7158 -357760 -156214 -172304 70298 323064 255588 -26371 118123 -160637 -136995 2617 -4128
7146 79866 -21471 53567 -100846 -72564 262024 -5573 -193346 35037 -196702 65373 26818
7134 153892 87912 68643 74059 -62703 9772 31758 -155068 -420536 33436 -75500 -46371 21748
7121 -8886 380795 303647 17614 59274 -229426 32703 -27453 34208 -160629 -258368 -41626
7109 54738 -358431 -208607 51529 -101218 -140753 -68386 -229801 -213970 205542 69821 -32155
7097 186726 38171 -278905 -182772 -158896 105336 27266 -90118 236306 162443 158343 -249623
7085 28744 -107617 127866 85242 -19864 -74308 172850 -112291 -109327 -222818 11218 -54545
7073 50173 -207162 227739 131257 33219 -401803 -107529 4878 204744 56520 39752 -3010
7061 -135542 -200138 131742 152558 -22413 -88476 -97418 -208120 -65265 51314 188664 -137969
7049 209821 -60406 35953 82709 144297 92470 189201 26704 -213984 -172022 -174177 5881 -64565
7036 -118277 305467 -80045 -130029 -31138 25919 -104017 -88193 -355474 -64814 -364695 155736
7024 75235 -151531 -5963 -66702 -256663 172980 -134008 -214228 23129 -122907 47438 -134505
7012 218950 182381 268209 -75155 62899 -213944 -43273 -43507 257947 -322769 -22386 -259301
7001 -259301 -71103 182490 -866 -55024 96973 -181521 -235717 17092 85065 53002 4386 -185339
6988 -252801 243601 29994 197291 -538464 -3423 20968 15579 -84712 10039 -4048 -58303 101107
6975 73534 161494 -65140 29935 6648 215883 75643 237780 55065 16207 83345 181113 -184684
6962 99216 202586 320909 80143 -240080 -110861 -164995 102726 -200687 45281 -35879 -65952
6951 -65952 -161848 -105590 61767 -246425 -11631 110651 -122786 -240354 199896 -213046 183509
6939 -156293 -179459 -208665 -229345 -97700 -160641 123035 -109351 -171364 -63850 10317 -193735
6927 80693 -50936 79507 -260224 68083 -22165 -218175 -283925 213145 -123586 18369 -128981
6915 77127 -98306 -222104 246992 98453 43670 -180089 -220268 -150675 113455 11215 -122465
6903 -95790 222414 -77059 17612 164830 23245 133071 107717 -31728 -38510 -284434 -157056
6892 -157056 32628 268195 -184596 136439 69114 -263049 -24636 95139 -45816 188086 -42015
6880 -162211 -28022 18431 -78940 1399 57448 201202 -27235 -271577 -10354 70725 -41644
6868 -129455 -45638 -66131 -101900 -52551 -183494 115501 -128117 121890 -66760 -480576 79968
6856 39727 154697 -101194 -78187 -355997 -142067 221476 230390 289414 -133344 68242 200441
6845 200441 -96526 -11270 -339153 -88187 214535 34823 108622 17596 54787 -96152 -20367
6833 -185798 77893 208161 11509 -51176 -338237 348334 -355715 11080 -5229 9058 -240589
6821 142849 82383 19660 340127 54767 -149433 201995 -11675 -51153 222401 -90945 54451
6809 1410 -455383 142506 -41593 -131487 60143 229084 161303 90477 142239 -59761 -60746 161826
6796 -83872 -163491 -236052 -214079 21408 -65489 -319227 162862 44841 155929 -211383 2353
6784 166828 -73561 164614 -77529 -86673 54511 -121211 60512 -192266 156608 103076 -437998
6772 -188318 89430 -64286 -146694 120837 -101058 -169013 8510 70136 -209110 -224446 -139468
6761 -139468 -213784 33710 -62554 33617 224485 -339635 71851 -219438 83401 -100996 88448
6749 -178519 -177185 -171206 -115900 -34608 11594 113626 62558 10751 -137384 114542 -106957
6737 -175204 136565 223789 -87979 -149168 164562 177514 74395 -25712 323986 31819 37659
6726 37659 -255175 269721 -314792 185289 189025 105168 -165901 -141318 34896 -147099 -248566
6715 -248566 -285984 -66005 106119 236368 309933 -4972 48122 -13606 68077 -37138 122445
6703 -120897 -47612 20965 -101770 -99834 -221621 93149 253495 -139727 -397083 105793 57552
6692 57552 -44096 -127999 148767 -201075 -70818 -142702 -49203 -273091 82834 133442 190451
6681 190451 -235327 48219 56730 -209486 -172410 56106 -29832 -474805 -203308 -117847 72960
6669 -221397 -87188 102576 115064 -99973 -220272 374433 42297 15394 45151 172752 -194686
6657 91235 125491 -219955 -245882 -183426 -373947 -18240 123067 -154168 -62825 -244037 138324
6645 -81862 96320 -27304 303157 86604 -15431 -222312 -157346 52869 -503 -177742 -130504 -71079
6633 -71079 104639 37713 276358 -216352 -150590 118012 98201 95318 194755 -44417 72692
6621 156902 356478 194305 -339544 -138676 -51160 -232580 89147 -14396 -350206 -149102
6610 111319 -80559 86873 -160977 -202328 39401 24339 -174089 19936 -242391 173540 -45678
6598 -14097 282036 -45173 41677 -22360 -37653 138288 122445 169408 183555 -37550 -419347
6587 -419347 486339 -59881 -183355 40723 -292249 37730 -193685 -217934 286952 -343834
6576 -32624 -294697 -118424 63098 -160308 -62381 133919 258531 77983 -612978 25833 -389258
6564 -86425 -87360 -134764 -198285 54116 -2514 -86047 -119558 84281 -84751 289574 -60774 141848
6551 2267 -101251 50068 -214257 162137 130690 189882 86425 109884 -111891 54341 34458
6540 34458 86708 -22445 147367 14535 203764 85693 -172165 37430 -68861 -46825 -193344
6529 -193344 281102 327477 167833 27570 223517 61237 84005 -140203 -314498 -1390 -373416
6518 -373416 -103858 60147 -76796 -124004 74439 -262687 255968 32001 -264153 -250579 -69943
6506 45889 107378 125429 102000 19898 13260 20187 387537 -45238 141928 -131531 -176117 -88289
6494 -88289 -186301 -98332 -73804 -13914 -211742 49560 -72106 -5712 202389 220889 -44663 -241419
6482 -241419 -22665 -318498 -335085 72928 23777 -3989 119358 93762 -14577 104276 -178010
6470 33198 -260219 -40080 -351006 -57992 147100 -325403 -147065 58588 -83460 28141 240097
6459 240097 -12065 54571 -31170 41140 -183875 -162072 -64258 -203549 -26005 141074 -145783
6447 299570 57483 69986 113488 -85336 -71922 376431 17807 219824 -424850 181223 90233
6435 75318 -223579 377435 -109755 339061 157065 97084 -299489 52643 128296 -190436
6424 -40885 -288437 146217 -346312 -136604 -2979 -83944 98183 -95187 365988 20456 -61116
6412 223912 -69920 -316610 65833 -51468 -70724 97308 -482495 -2064 -157677 -118373 -64322
6401 -64322 -72569 -439909 -226131 78125 73504 -43564 -12600 -98050 70702 -1364 -173908 -213703
6389 -213703 13493 275855 -127904 -166479 14270 472511 65356 28343 -197562 132779 -248933
6377 80011 -179291 41071 -356167 -313485 171692 -196205 39396 -112244 -246035 38706 -157568
6365 -89505 -33985 -166529 -288264 26181 -84037 -143575 66005 -29771 287931 172118 77791
6353 4766 1504 61444 175378 39676 273646 -57115 -289 233208 155498 52785 237686 215186
6341 215186 -154179 148133 170355 228242 -295342 -207264 275311 -158148 -97797 -101257 216710
6329 -149700 -89247 -14442 -86845 242716 -1079 -42142 166855 1056 -371920 -120128 -259566
6318 -259566 -141557 -78781 -221008 -9209 -46298 148545 198833 111366 -105395 -115240 54707
6306 -4138 159424 101053 80880 42750 -275246 98619 125331 -236978 -32787 -151556 -19292
6294 38387 76818 174436 198272 45311 -75983 -294206 64500 -306644 -2750 48410 162152
6283 162152 138445 -353112 -363845 -141592 96803 -81516 -8868 -213036 249197 5658 36383
6272 36383 -198131 -123745 275430 62272 -30286 -114324 -135712 335320 -331244 249270 -310809
6260 -115471 -57827 1806 -92869 -192552 73461 150837 86327 285558 282133 600207 -7067 -546
6247 -188714 -225706 391808 -98286 167341 -108030 121382 75878 179280 165126 25191 109369
6236 109369 106631 -98355 -117753 -396962 -122240 -93762 119713 -230623 -138393 192502 95035
6224 -198802 -14627 70315 -39631 -206535 230413 65591 -129777 -104471 158456 12363 68035
6213 68035 -77768 264294 -49035 -109975 -275635 184020 109437 -27539 103174 -146778 -160982
6202 -160982 219793 -248244 -199340 186639 -304870 -136445 122436 -66418 123654 -116039
6191 433037 169662 -74709 -229794 -318319 -61868 194505 24594 14836 83956 -89509 -451083
6180 -451083 -114959 217398 -138703 239548 199338 160690 -1220 213978 -30366 75530 206954
6169 206954 63792 -101399 -41630 -195181 302488 -143241 -144144 -279971 -6450 -42817 -97443
6158 -97443 -87901 -180454 -131778 155119 341940 360310 -135029 -251931 37055 -144665 -150002
6147 -150002 -212029 47186 119873 183684 -289604 53992 -60775 35549 359647 10731 -154519
6135 -152519 168091 53376 121700 98922 43112 -41656 -36583 -246745 -210532 -52375 -113104
6124 -113104 30953 304242 -304255 182653 -207004 126011 -214178 -19187 -93702 189414
6113 343908 143874 -27239 -159449 -39912 -28156 -44005 -85604 -62061 -241509 169950 -29074
6101 -8798 -178906 121214 -296604 -249620 -42338 20279 206065 -8383 -187699 187279 59083
6089 -92699 -219502 41176 -226120 -31884 112708 -488817 124687 -87448 197983 -16542 89139
6077 19073 52541 -164457 139497 -13863 -83794 109626 128143 -281699 -114457 -53318 -158774
6066 -158774 -79817 278376 -25805 17779 -236869 116471 -175796 -197526 -110786 31968 114114
6055 114114 -178449 48249 -145227 -79319 158767 150103 -122237 -136886 241530 -148049 36507
6043 317114 -86504 -22704 -257959 -223021 296510 -134217 -134399 -241053 -27670 260636 -76701
6031 168410 30789 -38210 77351 147137 23534 148849 56259 -336159 42323 -203790 -134406
6020 -134406 19573 81700 -341163 -88264 181216 -86473 39982 -209104 380241 169718 -39066
6008 -217707 -130861 -88629 16567 79103 -33465 376967 -220029 96520 -243490 -362380 180013
5996 179582 53580 -186904 260003 403270 95301 189250 58577 257702 166670 127651 62058
5984 262583 -9815 140749 -4114 -169826 200127 -142476 -40578 281612 -387924 -104441 194311
5972 -215350 -215584 -169274 -49357 98657 274065 -17413 163337 -39295 276134 -101748 49060
5960 -22601 -82473 242064 -58782 343746 251875 -85022 58678 137821 -298577 94262 -173466
5948 -215479 -86028 -184283 295735 47536 -190383 -256059 144971 -50780 -358122 135476 -168873
5936 -91504 -184610 -995 146747 120545 187829 -302333 73783 129558 -183644 67003 42252 154522
5924 154522 -43831 -25463 -287168 -239329 62463 -114712 6779 -292088 19370 -117595 137303
5912 6499 9634 -189857 -82167 -97175 76126 5614 -164789 -533719 -63386 71710 199058 -19490
5899 -193263 61559 58560 222090 -133930 -221599 265286 41928 -69899 74634 -68029 -17811
5887 -218207 -52368 102738 100038 -113752 -204075 -203973 -245330 -20151 246392 86163 130168 228609
5875 228609 -203817 -216170 110024 271488 52676 -157000 1180 -67963 -99188 58325 916
5863 110124 104384 -99116 298624 -207470 209720 27996 90432 -123188 -162668 556892 -288390
5851 -12617 106784 60119 -129127 -177233 30831 280675 -33490 -82653 -115969 -94475 -227693
5840 -227693 -27968 -146134 38435 -102105 61960 -369167 180918 74972 -21464 71053 -94669
5828 -149726 -14362 -268263 158804 -16049 40436 -167626 -228207 163954 -8296 128125 258084
5817 258084 66673 -186785 -7818 -71295 94072 192838 -8878 -319872 -16405 82410 -178779
5805 151792 -160583 14074 47005 -323362 -165741 51382 17813 276767 -140144 493830
5794 -127875 341848 215351 -173 38815 -15227 -163527 318427 128890 210067 -9943 -32422
5783 -32422 225144 -262109 -14063 219250 -100761 11638 101793 -152786 -62111 267016 -25115
5771 207979 -143204 -204112 4629 223484 139654 304181 86672 53892 -88933 36905 -110709
5759 -95753 168549 -191260 126706 -304040 -19286 -42120 -48100 120894 261905 -57921 -65252
5748 -65252 361986 79987 -154660 52658 -323021 70517 -426172 235680 165118 -91628 -249523
5737 -249523 -138401 -139813 119803 -109143 133127 -4328 222068 -205466 -59465 54039 234665
5726 234665 -278205 -228828 96327 49756 118391 -17800 130708 16585 79246 161491 165103
5715 165103 197125 -11513 102087 375503 312209 -3387 103103 59161 28617 -18300 -247588
5704 -247588 -135990 -84050 40079 50380 -98033 -276704 171840 -363200 -100692 -20069 -21192
5693 -21192 23017 -114952 -64313 182048 248442 146713 -13507 -4220 140731 325446 17453
5681 -87702 -192903 -15626 -69252 6642 -43766 -53857 -360559 -63804 138861 244303 128901
5670 128901 -37849 123660 173661 136250 -190975 29501 203046 73908 49091 -492200 136395
5658 95130 -176754 107275 -257200 77379 -188560 -189270 63462 130947 193741 25849 6785 21516
5646 21516 -210160 -352840 -296456 -410101 -93741 498 -289252 38072 373383 254833 22144
5634 -162242 -24645 -203438 89416 -202440 -185674 -219388 141187 58812 -166286 -5362 -84490
5623 -84490 -129323 131263 69312 5215 179468 -114636 40352 148272 53163 89305 -99480
5611 7771 84298 302868 39299 79386 8690 123763 -242068 311621 12411 -188770 28637
5599 -70501 -73503 4777 -17591 -64301 -82136 111848 163925 -13057 -28001 -76446 41961 -233997
5586 177973 -463 48212 88928 -21529 -177091 -92568 91752 275984 56174 358885 13392
5574 130875 113816 -195185 103798 -113569 -33923 -41255 102010 -18659 -70939 -200040 -65882
5562 -10615 72686 -204745 22691 -225808 18963 363639 140839 -151586 49105 99003 -81343
5550 85352 -110298 65764 341564 -78228 19746 -49194 37904 -221701 -109785 -58340 -125580
5539 -125580 -88964 91105 82405 174625 -210858 -335558 -176746 118365 67897 191199 -165597
5527 -37141 18478 -141160 -84466 -79026 378262 235454 -35544 29122 -165754 -18933 -290628
5516 -290628 -233422 124103 -150048 -131946 -178247 238562 -86436 -322692 -69165 46463 -43784
5504 194414 121040 -204661 326195 57808 -112377 -204436 -79797 37509 145608 7936 39503
5493 39503 -229447 -314673 191895 199975 -111701 139470 -36283 19942 32952 46247 -207270
5481 -93354 164037 -44964 -126584 -133281 -10736 267094 5796 67242 -31569 121549 -7103 -204926
5469 -204926 49024 98849 36306 34630 46653 -30333 177878 -171300 -178662 -52269 271581
5457 -81301 44398 87543 -77453 -222524 175732 231265 -41005 -363062 121538 190303 191794
5446 191794 -50511 83084 -246850 41631 128756 131560 161545 -237122 120379 62296 344429
5435 344429 -52054 234601 127522 -121976 6518 151851 99114 181280 151656 -258085 -42446
5423 -157048 -124841 -289616 -116869 -43561 97516 -132416 127772 -75544 73491 185224 -64748
5411 -65803 -77352 139366 -149111 -221650 -184974 -3502 -11558 -164057 157221 179246 288754
5400 288754 -57699 -27563 -94782 -303901 269415 -91261 -64032 -304697 -132504 -47335 -103320
5389 -103320 -78475 -186185 57876 253174 22128 -135008 -305376 25476 -207447 16761 -140686
5377 -1058 -150155 -226204 -22136 429540 29115 139376 -23228 -118173 -157655 229903 -116917
5365 -153196 291211 -109214 214580 243334 343767 63055 84946 114374 -165993 4434 49382
5354 49382 117224 37035 26692 307740 -221192 -87711 -227997 -154015 113146 -73929 387433
5342 96726 -343939 -62925 95461 -236909 -36971 -223461 346543 370169 -42316 -93375 71334
5330 27226 124561 116500 23413 -73891 -185482 -56199 -59016 -67102 128369 81555 63596 221359
5318 221359 -78388 -189495 -72671 -182629 89751 74812 453215 274281 -41206 -150032 -59146
5306 -151919 278753 -174148 151641 134367 -78864 -851 -50285 10112 -64735 26112 137733
5295 137733 155251 115665 -85473 162245 -17772 97679 -124712 -208848 -146371 66529 -211124
5283 299892 144196 1687 162856 -125163 217165 84141 -106277 134642 105224 190384 248778
5272 248778 -9774 -172474 -161275 -205151 70392 92833 -166815 11748 9683 121646 -96211
5260 71444 92889 57292 -146353 103298 -242208 -14868 186990 -164992 92713 175628 118725
5249 118725 -47551 34376 -198956 25874 -23199 -295193 30300 -72554 -48684 -78283 108445
5237 156875 44650 -169505 30285 -34811 18726 62141 -172488 115308 -38983 -18360 166795
5225 5655 -147223 -169683 -197567 -36987 124453 -146100 -108167 299105 -169371 40358 -609
5213 -303937 -93949 53250 -73031 58653 -24944 162637 228142 -94880 119328 144958 64591
5201 7435 196144 312741 -309729 171336 -78307 10246 16894 -79923 -53790 -43657 187761
5189 217463 -42527 -105157 -119251 155225 -60127 61068 29275 -90932 -116093 -25539 -188415
5178 -188415 -100171 180934 -45762 -134113 -91523 35429 272106 7541 34373 43459 89240 -133415
5165 108007 122193 -71597 187233 -77087 179909 -16019 -275627 -51475 90059 -323810 -402230
5154 -402230 8956 149411 31021 -35274 14332 202185 208745 -163622 -149990 -63830 187523
5142 26666 -188262 -34896 -34944 -166071 -32163 -12705 105624 98291 -388300 51102 41448 124054
5130 124054 -281607 160933 171651 73888 158915 4603 -135348 3555 -34342 494398 -71975
5118 -127914 -11995 -68124 -97590 -98562 77956 155689 44509 47276 101305 42440 -153157 -271089
5106 -271089 -128728 320047 -214837 155391 -65461 228101 -64605 -129145 158019 -25199
5095 -256553 188283 89215 244521 4103 508781 307636 54574 152705 96827 50875 62441
5084 62441 -38548 61011 37166 -268837 299544 -181204 135261 128824 34488 -111183 116755
5072 111518 187137 -21125 78623 88543 77982 -208389 169359 -302978 -92919 -197147 19075
5060 -92461 135412 -320352 65541 -73290 126009 -44029 384043 119527 63800 9762 -482023
5048 280527 -155220 180244 189696 -10013 -23477 -126866 -60073 -117137 96333 -193021 -90125
5036 135081 -75164 -143255 156262 -54620 -271721 -79777 16628 -52499 47631 278709 -66609
5024 -181782 207866 105990 108239 -287230 -76575 263248 53741 -339541 -99870 225066 8462
5012 -118558 -123601 331903 -116290 26825 -27672 -33473 -134544 -43660 -14728 17725 -39394
5000 -208983 -354568 -179445 -285481 39808 -151132 -48518 53122 127824 -96075 -231337 -11949
4988 105731 329906 44650 30498 131412 105380 23288 116180 -147702 100858 -99919 -2503
4976 10825 -268680 297227 52948 -114915 -52991 -41416 -152971 -226584 359941 378636 -7876
4964 162874 125475 123761 291520 -88809 42678 -310290 -244596 99748 285615 -105276 185345
4952 188489 3798 42372 -153553 136110 19995 125408 269911 273995 196221 -32599 93150
4940 95391 -199503 76636 127619 87205 -94480 -46180 92644 175672 624776 195178 -95310
4928 -287917 110996 113640 -75472 89541 -42173 44392 47792 -109922 -163791 -206037 18072 57756
4916 57756 408392 15434 25360 -101178 51928 97426 -121911 48259 -133003 17352 24437
4905 24437 -176995 -186524 -79016 148823 34401 196667 115311 164030 -157196 -28736 201165
4893 107641 -426134 71406 169219 254183 224313 -4117 76642 -8687 -37035 23882 223706 -423366
4880 -386381 -176758 194528 162794 -45722 -78593 343893 112349 -199351 -177448 279331
4869 -189432 131245 -208115 120880 22190 -54775 -140589 184736 33944 -173172 -141911 -206947
4858 -206947 -19415 135612 -242668 252279 -279734 -75248 -159030 -228043 32664 -74654 -6755
4846 199876 -47458 -79362 18559 11990 -105384 -129095 164836 133499 214091 -174200 127297
4834 -127302 148475 174751 -431694 47818 146952 -192266 -85925 -40344 6908 44527 76144
4823 76144 -148271 -117028 123987 -220548 -265462 -244183 148925 -160127 -58379 161398 -352662
4811 155225 83002 -40912 94553 -220555 -66807 144388 23800 -83883 310146 73371 -25618
4799 -6233 -74341 -165315 -9733 341730 173332 17546 -227469 174969 33320 -88384 53094
4787 -321236 -17996 423011 46450 333884 -194855 130594 -157863 52463 -71667 -17877 -437490
4776 -437490 -91587 -122135 65344 -244530 86462 -387168 -76829 -91689 -18883 79281 170803
4765 170803 254194 -321594 95905 46840 432964 4629 -59560 242707 158880 234205 -216438
4753 -167272 287569 71722 101749 -42735 14075 -34678 -262087 260772 93216 -134507 -99336
4742 -99336 16483 19317 181666 -104405 -90916 113468 68490 59986 14215 -76918 154415
4730 -374178 132670 -9636 -67049 237355 -64775 -14420 71584 19373 -75185 46725 -326301
4718 -170245 356245 42558 -20110 123702 1047 75637 25895 -138508 -183632 11147 -43459
4706 -56137 85029 301293 228030 -162707 -107906 5334 -29856 -50821 -198029 319881 -118457
4694 325566 -12132 107803 -48118 198860 107177 -5768 203183 187248 109712 -99747 124609
4682 311780 286025 -23819 90299 175371 -52196 185988 134667 -28156 253 39892 -86641 144498
4669 -274037 -2592 208324 -91478 54033 -108664 15772 -216043 -184790 72375 -36076 604 -11636
4656 -74689 -171488 348843 127054 42669 147822 -14614 -24819 30490 -95187 50357 116276
4645 116276 -353177 169797 141943 357572 13370 -61360 3002 167854 -154543 -56506 -195854
4634 -195854 -46547 -366346 316785 -41540 20744 -142620 115024 -8163 -78527 -271309 -246059
4623 -246059 83266 22510 -114892 3445 -100140 -27484 29407 -35573 210102 -204165 -121569
4612 -121569 138207 101640 25708 40042 266001 50552 119417 -233607 -46031 365773 257786
4601 257786 142490 -313099 -205531 81020 -169066 -19305 98082 141706 146735 -158963 -99541
4590 -99541 -67451 -30514 213521 -169068 88694 -351063 -7719 12590 67314 57049 -111089
4578 -279207 -48690 -111938 121927 3022 21696 49553 -9922 -85661 -48724 85607 104006 159067
4566 159067 97861 21235 -262333 30790 82068 -139453 160323 71971 145769 -108454 45397
4554 161452 44470 198353 48536 -28813 -106871 291563 -178804 -221488 -222678 197036 -100066
4542 57511 115887 -41353 144316 338632 -81137 141764 -193191 -205949 10817 116376 351173
4531 351173 -302284 -81577 62061 -84068 57447 -249226 -148873 -95890 -103682 90098 256527
4520 256527 49164 -7307 195593 -181082 6109 -290345 75258 102722 270744 -270051 230328
4508 -43229 6205 47970 -23501 -89778 197379 56 -112105 62142 -69806 -170524 -300951 -74640
4495 -13355 87995 128407 169508 201617 -34379 -53510 73963 -40986 -74371 108941 42519 4068
4482 -62957 103437 -89126 -66419 -77447 164217 -307118 307306 162587 125548 -180070 151351
$$ [...]
##END NTUPLES=NMR SPECTRUM
##END=
