
##TITLE=AC1302_PERAH12114_7525498_Bu7zzF2CVs
##JCAMPDX= 6.0         $$ Bruker NMR JCAMP-DX V2.0
##DATA TYPE= NMR SPECTRUM
##DATA CLASS= NTUPLES
##ORIGIN= BRUKER
##OWNER= Administrator
$$ 1.72 TOPSPIN		Version 2.1
$$ 2013-02-20 19:21:40.557 -0500  Administrator@X
$$ Compression mode = diff/dup
##.OBSERVE FREQUENCY= 400.02188249412
##.OBSERVE NUCLEUS= ^1H
##.ACQUISITION MODE= SIMULTANEOUS (DQD)
##.ACQUISITION SCHEME= undefined
##.AVERAGES= 64
##.DIGITISER RES= 22
##SPECTROMETER/DATA SYSTEM= spect
##.PULSE SEQUENCE= noesygpps1d.comp
##.SOLVENT NAME= COFFEE_meoh
##.SHIFT REFERENCE= INTERNAL, COFFEE_meoh, 1, 14.96114
##AUDIT TRAIL= $$ (NUMBER, WHEN, WHO, WHERE, PROCESS, VERSION, WHAT)
$$ ##TITLE= Audit trail, TOPSPIN		Version 2.1
$$ ##JCAMPDX= 5.01
$$ ##ORIGIN= Bruker BioSpin GmbH
$$ ##OWNER= Administrator
$$ $$ E:\/data/COFFEE/nmr/AC1302_PERAH12114_7525498_Bu7zzF2CVs/32/pdata/1/auditp.txt
$$ ##AUDIT TRAIL=  $$ (NUMBER, WHEN, WHO, WHERE, PROCESS, VERSION, WHAT)
(   1,<2013-02-20 19:21:34.432 -0500>,<Administrator>,<X>,<go>,<TOPSPIN 2.1>,
      <created by zg
	started at 2013-02-20 19:10:03.633 -0500,
	POWCHK enabled, PULCHK disabled,
       configuration hash MD5:
       86 BA 57 50 F2 9D 5C 9B 26 00 A9 28 5F 66 2E 89
       data hash MD5: 64K
       B2 87 41 CB BE 1A 1D 55 B7 A4 90 87 6C D6 91 C7>)
(   2,<2013-02-20 19:21:37.573 -0500>,<Administrator>,<X>,<proc1d>,<TOPSPIN 2.1>,
      <Start of raw data processing
       efp LB = 0.3 FT_mod = 6 PKNL = 1 PHC0 = 0 PHC1 = 0 SI = 128K 
       data hash MD5: 128K
       42 2A A1 B1 3E 97 D2 C3 A4 D3 13 9B 16 2A 2B 71>)
(   3,<2013-02-20 19:21:38.807 -0500>,<Administrator>,<X>,<proc1d>,<TOPSPIN 2.1>,
      <pk PHC0 = 250.4828 PHC1 = 0 
       data hash MD5: 128K
       02 B1 F5 68 5D 5C 98 AC A7 BA EA 7A 5B D6 65 53>)
(   4,<2013-02-20 19:21:39.463 -0500>,<Administrator>,<X>,<proc1d>,<TOPSPIN 2.1>,
      <abs ABSG = 1 
       data hash MD5: 128K
       2A 5F 5D 32 41 0A 82 E8 76 A9 87 FF BA 43 1C B0>)
(   5,<2013-02-20 19:21:39.651 -0500>,<Administrator>,<X>,<proc1d>,<TOPSPIN 2.1>,
      <abs ABSG = 2 
       data hash MD5: 128K
       B2 6C 3D 92 97 FA D6 EE 2C 37 4D E9 57 7C 96 94>)
(   6,<2013-02-20 19:21:39.823 -0500>,<Administrator>,<X>,<proc1d>,<TOPSPIN 2.1>,
      <abs ABSG = 3 
       data hash MD5: 128K
       E8 E0 90 91 B6 61 84 A7 58 1C D2 EA CE AB A3 04>)
(   7,<2013-02-20 19:21:40.010 -0500>,<Administrator>,<X>,<proc1d>,<TOPSPIN 2.1>,
      <abs ABSG = 4 
       data hash MD5: 128K
       A8 B8 6E CD 2C 3E 60 72 3A AE F8 06 BC F1 6C 88>)
(   8,<2013-02-20 19:21:40.182 -0500>,<Administrator>,<X>,<proc1d>,<TOPSPIN 2.1>,
      <abs ABSG = 5 
       data hash MD5: 128K
       08 F7 EE FF B3 FB 79 82 A4 B2 0A 73 0C 38 B8 49>)
$$ ##END=
$$ 
$$ $$ hash MD5
$$ $$ 38 A1 78 99 1B 87 0A F3 0E BC 53 97 AF 89 58 90
##$RELAX= 
##$RELAX= 
##$RELAX= 
##$RELAX= 
##$RELAX= 
##$RELAX= 
##$RELAX= 
##$RELAX= 
$$ Bruker specific parameters
$$ --------------------------
##$DU= <E:\>
##$EXPNO= 32
$$ [...]
150 150 150 150 150 150 150 150
##$TP07= 0
##$TPNAME0= <>
##$TPNAME1= <>
##$TPNAME2= <>
##$TPNAME3= <>
##$TPNAME4= <>
##$TPNAME5= <>
##$TPNAME6= <>
##$TPNAME7= <>
##$TPOAL= (0..7)
0.5 0.5 0.5 0.5 0.5 0.5 0.5 0.5
##$TPOFFS= (0..7)
0 0 0 0 0 0 0 0
##$TUNHIN= 0
##$TUNHOUT= 0
##$TUNXOUT= 0
##$USERA1= <user>
##$USERA2= <user>
##$USERA3= <user>
##$USERA4= <user>
##$USERA5= <user>
##$V9= 5
##$VALIST= <valist>
##$VCLIST= <CCCCCCCCCCCCCCC>
##$VD= 0
##$VDLIST= <DDDDDDDDDDDDDDD>
##$VPLIST= <PPPPPPPPPPPPPPP>
##$VTLIST= <TTTTTTTTTTTTTTT>
##$WBST= 1024
##$WBSW= 4
##$XGAIN= (0..3)
0 0 0 0
##$XL= 0
##$YL= 0
##$YMAX_a= 6195200
##$YMIN_a= -10739262
##$ZGOPTNS= <>
##$ZL1= 120
##$ZL2= 120
##$ZL3= 120
##$ZL4= 120
##$ABSF1= 14.96114
##$ABSF2= -5.597042
##$ABSG= 5
##$ABSL= 3
##$ALPHA= 0
##$AQORDER= 0
##$ASSFAC= 0
##$ASSFACI= 0
##$ASSFACX= 0
##$ASSWID= 0
##$AUNMP= <proc_prof1d_extract.lims>
##$AXLEFT= 0
##$AXNAME= <>
##$AXNUC= <1H>
##$AXRIGHT= 0
##$AXTYPE= 0
##$AXUNIT= <>
##$AZFE= 0.1
##$AZFW= 0.1
##$BCFW= 0
##$BC_mod= 0
##$BYTORDP= 0
##$COROFFS= 0
##$CY= 15
##$DATMOD= 1
##$DC= 0
##$DFILT= <>
##$DTYPP= 0
##$F1P= 0
##$F2P= 0
##$FCOR= 0.5
##$FTSIZE= 131072
##$FT_mod= 6
##$GAMMA= 0
##$GB= 0
##$INTBC= 1
##$INTSCL= 1
##$ISEN= 128
##$LB= 0.3
##$LEV0= 0
##$LPBIN= 0
##$MAXI= 10000
##$MC2= 0
##$MEAN= 0
##$ME_mod= 0
##$MI= 0
##$NCOEF= 0
##$NC_proc= -2
##$NLEV= 6
##$NOISF1= 0
##$NOISF2= 0
##$NSP= 0
##$NTH_PI= 0
##$NZP= 0
##$OFFSET= 14.96114
##$PC= 1
##$PHC0= 250.4828
##$PHC1= 0
##$PH_mod= 1
##$PKNL= yes
##$PPARMOD= 0
##$PPDIAG= 0
##$PPIPTYP= 0
##$PPMPNUM= 2147483647
##$PPRESOL= 1
##$PSCAL= 4
##$PSIGN= 0
##$PYNMP= <proc.py>
##$REVERSE= no
##$SF= 400.020009580855
##$SI= 131072
##$SIGF1= 0
##$SIGF2= 0
##$SINO= 400
##$SIOLD= 131072
##$SPECTYP= <>
##$SREGLST= <1H.CDCl3>
##$SSB= 0
##$STSI= 131072
##$STSR= 0
##$SW_p= 8223.68421052631
##$SYMM= 0
##$S_DEV= 0
##$TDeff= 65536
##$TDoff= 0
##$TI= <>
##$TILT= no
##$TM1= 0
##$TM2= 0
##$TOPLEV= 0
##$USERP1= <user>
##$USERP2= <user>
##$USERP3= <user>
##$USERP4= <user>
##$USERP5= <user>
##$WDW= 1
##$XDIM= 131072
##$YMAX_p= 428435116
##$YMIN_p= -19002
##$CURPLOT= <Network HP LaserJet P1505>
##$CURPRIN= <$Network HP LaserJet P1505>
##$DFORMAT= <normdp>
##$LAYOUT= <+/1D_H.xwp>
##$LFORMAT= <normlp>
##$PFORMAT= <normpl>
##$SURQMSG= 1
$$ End of Bruker specific parameters
$$ ---------------------------------
##NTUPLES= NMR SPECTRUM
##VAR_NAME=  FREQUENCY,     SPECTRUM/REAL,   SPECTRUM/IMAG
##SYMBOL=    X,             R,               I
##VAR_TYPE=  INDEPENDENT,   DEPENDENT,       DEPENDENT
##VAR_FORM=  AFFN,          ASDF,            ASDF
##VAR_DIM=   131072,        131072,          131072
##UNITS=     HZ,            ARBITRARY UNITS, ARBITRARY UNITS
##FACTOR=    0.0627417313425164, 1,          1
##FIRST=     8223.62146879497, 118,          -60796
##LAST=      0,             981,             -60886
##MIN=       0,             -19002,          0
##MAX=       8223.62146879497, 428435116,    0
$$ Real data points
##PAGE= N=1
##DATA TABLE= (X++(R..R)), XYDATA
$$ [...]
$$ plain form
63966 441353 455286 469919 484702 500096 517473 537559 559700 583183 608598 637183 669465
63955 669465 705513 746271 793612 849002 912977 986101 1069666 1165059 1273070 1394255 1529356
63944 1529356 1678598 1840808 2013932 2196413 2387486 2585967 2789376 2994569 3198690
63935 3198690 3398705 3590135 3767049 3923837 4056770 4163663 4242598 4291627 4309526 4296093
63925 4296093 4251541 4176181 4071046 3938528 3782201 3606408 3416192 3217023 3013873 2810514
63915 2810514 2609928 2415056 2228628 2052448 1887494 1734794 1595687 1470957 1360075
63906 1360075 1261595 1174110 1096686 1028606 969055 917138 872106 833381 800238 771470 745720
63895 745720 722322 701523 683521 667544 652357 637507 623437 610414 598073 586181 575114
$$ packed form
63966D41353J3933J4633J4783J5394J7377K0086K2141K3483K5415K8585L2282
63955F69465L6048M0758M7341N5390O3975P3124Q3565R5393J08011J21185J35101
63944A529356J49242J62210J73124J82481J91073J98481K03409K05193K04121
63935C198690K00015J91430J76914J56788J32933J06893P8935M9029J7899j3433
63925D296093m4552p5360j05135j32518j56327j75793j90216j99169k03150k03359
63915B810514k00586j94872j86428j76180j64954j52700j39107j24730j10882
63906A360075r8480q7485p7424o8080n9551n1917m5032l8725l3143k8768k5750
63895G45720k3398k0799j8002j5977j5187j4850j4070j3023j2341j1892j1067
$$ plain form
63884 575114 565159 556063 547860 541591 538410 538241 540150 543868 550098 559221 570521 583036 596636 611902
63870 611902 629414 649467 672028 696502 721855 747351 772980 798872 824592 849438 873154
63859 873154 895799 917061 936203 952715 966495 977320 984566 987676 986591 981610 973093 961418
63847 961418 946924 929741 909890 887636 863404 837252 808829 778184 746300 714515 683588
63836 683588 653598 624485 596203 568507 541130 514290 488686 464914 443108 423219 405270
63825 405270 389220 374826 361837 350190 339890 330854 322915 315800 309042 302129 294917 287791 281341
63812 281341 275998 271926 268971 266584 264144 261612 259620 258561 257793 256176 253315 249838 246430 243116
63798 243116 239701 236495 234130 232837 232274 231970 231551 230539 228473 225552 222794 221099 220205 219059 217252
$$ packed form
63884E75114r955r096q203o269l181j69J909L718O230R123J1300J2515J3600J5266
63870F11902J7512K0053K2561K4474K5353K5496K5629K5892K5720K4846K3716
63859H73154K2645K1262J9142J6512J3780J0825P246L110j085m981q517j1675
63847I61418j4494j7183j9851k2254k4232k6152k8423l0645l1884l1785l0927
63836F83588k9990k9113k8282k7696k7377k6840k5604k3772k1806j9889j7949
63825D05270j6050j4394j2989j1647j0300r036p939p115o758o913p212p126o450
63812B81341n343m072k955k387k440k532j992j059p68j617k861l477l408l314
63798B43116l415l206k365j293n63l04m19j012k066k921k758j695q94j146j807
$$ plain form
63783 217252 215647 215233 215780 216122 215629 214790 214243 213786 212761 211066 209330 208163 207697 207871 208766 210409 212408
63766 212408 213985 214453 213711 212354 211181 210471 209801 208739 207538 206777 206406 205689 204264 202781 202097 202216
63750 202216 202541 202961 204048 206104 208649 211097 213521 216302 219312 221895 223651 224903 226266 228023 229998
63735 229998 231868 233450 234730 235834 237019 238640 240951 243838 246830 249513 251997 254810 258334 262445
63721 262445 266770 271069 275207 278905 281825 283892 285337 286374 286944 286849 286020 284622 282955 281261 279559
63706 279559 277701 275568 273141 270409 267513 265138 264380 265733 268333 270762 272637 274826 277966 281432
63692 281432 284273 286603 289314 292605 295609 297656 299214 301206 303785 306263 308042 309154 309867 310183 309966
63677 309966 309358 308755 308366 307995 307409 306797 306618 306996 307549 307960 308493 309619 311210 312450 312678 312093 311410 310998
$$ packed form
63783B17252j605m14N47L42m93q39n47m57j025j695j736j167m66J74Q95J643J999
63766B12408J577M68p42j357j173p10o70j062j201p61l71p17j425j483o84J19
63750B02216L25M20J087K056K545K448K424K781L010K583J756J252J363J757J975
63735B29998J870J582J280J104J185J621K311K887K992K683K484K813L524M111
63721B62445M325M299M138L698K920K067J445J037N70r5q29j398j667j694j702
63706B79559j858k133k427k732k896k375p58J353K600K429J875K189L140L466
63692B81432K841K330K711L291L004K047J558J992K579K478J779J112P13L16k17
63677C09966o08o03l89l71n86o12j79L78N53M11N33J126J591J240K28n85o83m12
$$ plain form
63659 310998 310538 309454 307410 304357 300370 295650 290627 285839 281637 278071 275019 272322 269801 267348
63645 267348 265095 263310 262034 261023 260194 259915 260615 262315 264846 268320 272894 278170 283405 288422 293788
63630 293788 299930 306587 313413 320546 328237 336349 344777 353961 364435 376125 388637 402037 416784
63617 416784 433101 450975 470601 492108 514921 538177 561947 587384 615395 645610 676748
63606 676748 707383 736146 761765 783358 800355 811998 817485 816961 811943 804392 795715 786829 778510
63593 778510 771060 763969 756404 747722 737168 723622 706380 685972 663632 640226 616310 592870
63581 592870 571011 550941 532084 514333 498465 485117 474095 465053 458151 453604 451151 450508 451895
63568 451895 455503 460731 466645 473076 480682 489858 500135 510825 521806 533367 545599 558336 571624
$$ packed form
63659C10998m60j084k044l053l987m720n023m788m202l566l052k697k521k453
63645B67348k253j785j276j011q29k79P00J700K531L474M574N276N235N017N366
63630B93788O142O657O826P133P691Q112Q428R184J0474J1690J2512J3400J4747
63617D16784J6317J7874J9626K1507K2813K3256K3770K5437K8011L0215L1138
63606F76748L0635K8763K5619K1593J6997J1643N487n24n018p551q677q886q319
63593G78510p450p091p565q682j0554j3546j7242k0408k2340k3406k3916k3440
63581E92870k1859k0070j8857j7751j5868j3348j1022r042o902m547k453o43J387
63568D51895L608N228N914O431P606R176J0277J0690J0981J1561J2232J2737J3288
$$ plain form
63555 571624 585902 601631 619022 638297 660057 685126 713966 746376 781675 818789 855866
63544 855866 890034 918056 937592 947923 949648 944036 932780 918015 902076 886955 873840 863018
63532 863018 854026 845969 837993 829643 820690 810455 797386 779735 756887 729957 700892 671110
63520 671110 641179 611569 583090 556417 531602 508385 486718 466710 448383 431864 417630
63509 417630 406081 396882 389091 381923 375064 368307 361423 354591 348569 344052 340956 338478 335793 332629
63495 332629 329346 326541 324479 322841 321126 319289 317830 317269 317746 319139 321246 323736 326201 328459 330678
63480 330678 333064 335648 338476 341790 345783 350231 354523 357965 360021 360485 359612 357942 355764 352871 348951
63465 348951 344209 339402 335330 332312 330029 327810 325274 322808 321204 320703 320675 320470 320342 321170 323449 326990
$$ packed form
63555E71624J4278J5729J7391J9275K1760K5069K8840L2410L5299L7114L7077
63544H55866L4168K8022J9536J0331J725n612j1256j4765j5939j5121j3115j0822
63532H63018q992q057p976q350q953j0235j3069j7651k2848k6930k9065k9782
63520F71110k9931k9610k8479k6673k4815k3217k1667k0008j8327j6519j4234
63509D17630j1549r199p791p168o859o757o884o832o022m517l096k478k685l164
63495C32629l283k805k062j638j715j837j459n61M77J393K107K490K465K258K219
63480C30678K386K584K828L314L993M448M292L442K056M64q73j670k178k893l920
63465C48951m742m807m072l018k283k219k536k466j604n01k8k05j28Q28K279L541
$$ plain form
63449 326990 331508 337035 343640 351153 359382 368406 378538 390200 403888 419996 438506 459018 481293
63436 481293 505573 532189 560779 589898 617251 640396 657704 669118 676095 680684 684584 688978
63424 688978 694903 703426 715430 731398 751405 775209 802425 832740 865880 901145 936945 970925
63412 970925 1000591 1023832 1039163 1046027 1045174 1038555 1028531 1017020 1005214 993706 982617 971700
63400 971700 960535 948604 935016 918396 897454 871856 842415 810361 776643 742013 707509
63389 707509 674478 643981 616329 591288 568791 549322 533519 521286 511459 502616 494355 487575
63377 487575 483429 482132 482969 485248 488889 494135 501120 509948 520899 534197 549606 566524 584614
63364 584614 604117 625459 648672 673387 699412 727133 757193 789828 824565 860477 896482
$$ packed form
63449C26990M518N527O605P513Q229R024J0132J1662J3688J6108J8510K0512K2275
63436D81293K4280K6616K8590K9119K7353K3145J7308J1414O977M589L900M394
63424F88978N925Q523J2004J5968K0007K3804K7216L0315L3140L5265L5800L3980
63412I70925K9666K3241J5331O864q53o619j0024j1511j1806j1508j1089j0917
63400I71700j1165j1931j3588j6620k0942k5598k9441l2054l3718l4630l4504
63389G07509l3031l0497k7652k5041k2497j9469j5803j2233r827q843q261o780
63377D87575m146j297Q37K279L641N246O985Q828J0951J3298J5409J6918J8090
63364E84614J9503K1342K3213K4715K6025K7721L0060L2635L4737L5912L6005
$$ plain form
63353 896482 931152 962393 987759 1005599 1016010 1020450 1020235 1015567 1006219 993049 978401 964749
63341 964749 953087 942636 931763 918933 903162 884248 862720 839171 813495 785167 754432
63330 754432 722825 692232 663743 637755 614805 595636 580519 569056 560776 555430 552369 549925
63318 549925 545754 537846 525350 508856 490124 471232 453534 437317 422459 409151 397753 388194
63306 388194 379937 372556 366006 360268 355071 350185 345762 342111 339202 336648 334135 331695 329494 327544
63292 327544 325677 323653 321216 318239 314985 312101 310082 308713 307256 305282 303148 301555 300774 300472 300169
63277 300169 299687 299202 299044 299463 300431 301558 302263 302142 301223 299918 298731 297970 297697 297903 298645 299931 301552
63260 301552 303222 304935 306986 309574 312597 315923 319627 323719 327815 331409 334428 337321 340625 344625
$$ packed form
63353H96482L4670L1241K5366J7840J0411M440k15m668r348j3170j4648j3652
63341I64749j1662j0451j0873j2830j5771j8914k1528k3549k5676k8328l0735
63330G54432l1607l0593k8489k5988k2950j9169j5117j1463q280n346l061k444
63318E49925m171p908j2496j6494j8732j8892j7698j6217j4858j3308j1398r559
63306C88194q257p381o550n738n197m886m423l651k909k554k513k440k201j950
63292C27544j867k024k437k977l254k884k019j369j457j974k134j593p81l02l03
63277C00169m82m85j58M19R68J127P05j21r19j305j187p61k73K06P42J286J621
63260C01552J670J713K051K588L023L326L704M092M096L594L019K893L304M000
$$ plain form
63246 344625 349411 355021 361553 369260 378478 389221 400989 413259 426111 439954 454700 469755
63234 469755 485023 501420 519974 540661 562565 584979 607929 631620 655780 679716 702754
63223 702754 724519 745012 764650 784167 804233 825033 846224 867379 888450 909701 931050
63212 931050 951496 969354 983139 992226 996669 996540 991558 981295 965648 945130 920789 893828
63200 893828 865227 835644 805635 775971 747748 722126 699843 680994 665399 653191 644767 640063
63188 640063 638248 638577 641337 647474 657255 669753 683731 698559 714185 730730 748462 767682 788134
63175 788134 808814 828857 848432 868238 888273 907710 925997 943418 960261 975912 989198
63164 989198 999317 1005940 1008540 1006195 998293 985135 967561 946098 920745 891613 859520 825780
$$ packed form
63246C44625M786N610O532P707R218J0743J1768J2270J2852J3843J4746J5055
63234D69755J5268J6397J8554K0687K1904K2414K2950K3691K4160K3936K3038
63223G02754K1765K0493J9638J9517K0066K0800K1191K1155K1071K1251K1349
63212I31050K0446J7858J3785R087M443j29m982j0263j5647k0518k4341k6961
63200H93828k8601k9583l0009k9664k8223k5622k2283j8849j5595j2208q424m704
63188F40063j815L29K760O137R781J2498J3978J4828J5626J6545J7732J9220K0452
63175G88134K0680K0043J9575J9806K0035J9437J8287J7421J6843J5651J3286
63164I89198J0119O623K600k345p902j3158j7574k1463k5353k9132l2093l3740
$$ plain form
63152 825780 791549 757583 724555 693247 664298 637944 614221 593268 575167 559540 545591
63141 545591 532690 520816 510339 501480 494082 487820 482445 477749 473412 469155 465143 462119 460830
63128 460830 461211 462316 463200 463746 464454 465575 466852 468097 469606 471692 474106 476363 478560 481392 485198
63113 485198 489449 493456 497253 501254 505249 508373 510170 511160 512106 513140 513891 514132 513898 513287 512548 512139
63097 512139 512261 512504 512374 511993 511774 511566 510794 509489 508546 508723 509922 511671 513818 516374 519090 521601
63081 521601 523797 525782 527736 529976 532862 536391 540161 544018 548392 553743 560026 566994 574711 583337
63067 583337 592728 602724 613666 626147 640367 656119 673295 692004 712257 733976 757317 782649
63055 782649 810262 840383 873365 909521 948795 990913 1035727 1083108 1132618 1183752 1236379
$$ packed form
63152H25780l4231l3966l3028l1308k8949k6354k3723k0953j8101j5627j3949
63141E45591j2901j1874j0477q859p398o262n375m696m337m257m012l024j289
63128D60830L81J105Q84N46P08J121J277J245J509K086K414K257K197K832L806
63113D85198M251M007L797M001L995L124J797R90R46J034P51K41k34o11p39m09
63097E12139J22K43j30l81k19k08p72j305r43J77J199J749K147K556K716K511
63081E21601K196J985J954K240K886L529L770L857M374N351O283O968P717Q626
63067E83337R391R996J0942J2481J4220J5752J7176J8709K0253K1719K3341K5332
63055G82649K7613L0121L2982L6156L9274M2118M4814M7381M9510N1134N2627
$$ plain form
63044 1236379 1290482 1345461 1400164 1453723 1505937 1556861 1606537 1655329 1704059 1753422 1803455
63033 1803455 1853670 1903331 1951349 1996252 2036593 2071358 2099752 2120612 2132155 2132365 2119841 2094634
63021 2094634 2058295 2012851 1959619 1899278 1833058 1763424 1693319 1625012 1559931 1499249 1444105
63010 1444105 1395200 1352611 1316223 1286259 1263205 1247316 1238440 1236409 1241341 1253173 1270904 1292764
62998 1292764 1317422 1344744 1375077 1408066 1442607 1477768 1513205 1548746 1584132 1619311 1654458
62987 1654458 1689416 1723388 1755381 1784653 1810523 1832037 1848124 1857917 1860617 1855176 1840456 1815900
62975 1815900 1782001 1740054 1691419 1637047 1577760 1514836 1450011 1384812 1320268 1257442 1197793
62964 1197793 1142497 1091648 1044634 1001114 961127 924476 890712 859695 831484 805608 781222
$$ packed form
63044A236379N4103N4979N4703N3559N2214N0924M9676M8792M8730M9363N0033
63033A803455N0215M9661M8018M4903M0341L4765K8394K0860J1543K10j2524k5207
63021B094634l6339m5444n3232o0341o6220o9634p0105o8307o5081o0682n5144
63010A444105m8905m2589l6388k9964k3054j5889q876k031M932J1832J7731K1860
62998A292764K4658K7322L0333L2989L4541L5161L5437L5541L5386L5179L5147
62987A654458L4958L3972L1993K9272K5870K1514J6087R793K700n441j4720k4556
62975A815900l3899m1947m8635n4372n9287o2924o4825o5199o4544o2826n9649
62964A197793n5296n0849m7014m3520l9987l6651l3764l1017k8211k5876k4386
$$ plain form
62953 781222 758121 736842 717417 698790 679990 661338 643914 628216 613857 600298 587325
62942 587325 574970 563326 552419 542079 532240 523368 516077 510030 503874 496757 489406 483116 478180
62929 478180 474001 470302 467330 465029 462939 460954 459451 458498 457600 456416 455157 454121 453303 452657 452210
62914 452210 451686 450527 448611 446512 444668 442652 439731 435942 432115 428859 425965 422964 419956 417537
62900 417537 416030 415083 414165 413188 412445 412104 412040 412050 411912 411320 410209 409136 408796 409062 409126 408787 408906 410088
62882 410088 411601 412327 412271 412278 412582 412628 412247 412057 412525 413425 414442 415563 416544 416681 415585 413779 412104 410849
62864 410849 409731 408410 406771 405057 403983 404336 406152 408534 410533 411969 413195 414444 415726 417050
62850 417050 418399 419647 420833 422291 424174 426015 427055 426999 426232 425385 424790 424222 423045 420865 418217 416305
$$ packed form
62953G81222k3101k1279j9425j8627j8800j8652j7424j5698j4359j3559j2973
62942E87325j2355j1644j0907j0340r839q872p291o047o156p117p351o290m936
62929D78180m179l699k972k301k090j985j503r53q98j184j259j036q18o46m47
62914D52210n24j159j916k099j844k016k921l789l827l256k894l001l008k419
62900D17537j507r47r18r77p43l41o4J0j38n92j111j073l40K66O4l39J19J182
62882D10088J513P26n6PL04M6l81j90M68R00J017J121R81J37j096j806j675j255
62864D10849j118j321j639j714j074L53J816K382J999J436J226J249J282J324
62850D17050J349J248J186J458J883J841J040n6p67q47n95n68j177k180k648j912
$$ plain form
62834 416305 415822 416200 416310 415686 414725 413891 413208 412536 411965 411747 412035 412839 414198 416318 419416 423322 427268
62817 427268 430381 432549 434616 437485 441207 445128 448811 452487 456619 461305 466223 471049 475792 480772
62803 480772 486296 492459 499290 506958 515690 525528 536344 548071 560665 573944 587824 602827 619926
62790 619926 639724 662067 686670 713799 744126 778240 816586 859585 907421 959847 1016565
62779 1016565 1077721 1143794 1215088 1291467 1372298 1456334 1541899 1627483 1711899 1793511 1869559
62768 1869559 1936808 1992836 2036297 2066185 2081523 2081886 2067721 2039948 1999547 1947563 1885187 1813858
62756 1813858 1735670 1653597 1570656 1488635 1408040 1329359 1253712 1182094 1114706 1051517 992920
62745 992920 939227 890008 844665 803354 766552 733899 704348 677526 654089 634426 617775
$$ packed form
62834D16305m83L78J10o24r61q34o83o72n71k18K88Q04J359K120L098L906L946
62817D27268L113K168K067K869L722L921L683L676M132M686M918M826M743M980
62803D80772N524O163O831P668Q732R838J0816J1727J2594J3279J3880J5003J7099
62790F19926J9798K2343K4603K7129L0327L4114L8346M2999M7836N2426N6718
62779A016565O1156O6073P1294P6379Q0831Q4036Q5565Q5584Q4416Q1612P6048
62768A869559O7249N6028M3461K9888J5338L63j4165k7773m0401n1984o2376p1329
62756A813858p8188q2073q2941q2021q0595p8681p5647p1618o7388o3189n8597
62745I92920n3693m9219m5343m1311l6802l2653k9551k6822k3437j9663j6651
$$ plain form
62734 617775 603111 590253 579439 570231 561707 553633 546664 541214 536829 532993 530021 528606 528793 529957
62720 529957 531697 534241 537888 542511 547850 554069 561726 571386 583394 597861 614603 633116 652928
62707 652928 674114 697400 723690 753480 786749 823386 863616 907928 956599 1009478 1066313
62696 1066313 1127090 1191842 1260239 1331616 1405216 1479989 1554093 1625066 1690656 1749123 1798586
62685 1798586 1836616 1860986 1870637 1865592 1846300 1813601 1769110 1714905 1652720 1583884 1510064 1433515
62673 1433515 1356335 1279913 1205360 1134081 1067475 1006142 949681 897343 848849 804637 765341
62662 765341 730937 700458 672691 647055 623620 602531 583805 567529 553604 541212 529173
62651 529173 517120 505779 495788 486802 478189 470053 462880 456562 450538 444833 440187 437056 434982 433079
$$ packed form
62734F17775j4664j2858j0814r208q524q074o969n450m385l836k972j415J87J164
62720E29957J740K544L647M623N339O219P657R660J2008J4467J6742J8513J9812
62707F52928K1186K3286K6290K9790L3269L6637M0230M4312M8671N2879N6835
62696A066313O0777O4752O8397P1377P3600P4773P4104P0973O5590N8467M9463
62685A798586L8030K4370R651n045j9292l2699m4491n4205o2185o8836p3820p6549
62673A433515p7180p6422p4553p1279o6606o1333n6461n2338m8494m4212l9296
62662G65341l4404l0479k7767k5636k3435k1089j8726j6276j3925j2392j2039
62651E29173j2053j1341r991q986q613q136p173o318o024n705m646l131k074j903
$$ plain form
62637 433079 430780 428066 425377 423358 422304 421789 421111 420091 419040 418067 416974 415873 415268 415298 415467 415412
62621 415412 415446 415950 416699 417226 417562 418204 419684 422472 426898 432584 438319 443148 447459 452426 458498 465082
62605 465082 471717 478895 487582 498420 511537 526693 543503 561974 582975 607649 636159 667527
62593 667527 700946 736682 775276 816288 858303 899797 939512 976367 1009594 1038781 1063247
62582 1063247 1081617 1092539 1095725 1091680 1080563 1062081 1036642 1005866 971605 934876 896120 856064
62570 856064 815940 777049 740339 706223 674545 644882 617083 591383 567979 546817 527927
62559 527927 511569 497735 485782 474915 464853 455773 447810 440927 435078 430103 425574 421151 417112
62546 417112 414200 412867 412827 413290 413518 413256 412874 412930 413418 413654 413173 412466 412340 412771 413012 412884 413315 415399
$$ packed form
62637D33079k299k714k689k019j054n15o78j020j051r73j093j101o05L0J69n5
62621D15412L4N04P49N27L36O42J480K788M426N686N735M829M311M967O072O584
62605D65082O635P178Q687J0838J3117J5156J6810J8471K1001K4674K8510L1368
62593F67527L3419L5736L8594M1012M2015M1494L9715L6855L3227K9187K4466
62582A063247J8370J0922L186m045j1117j8482k5439l0776l4261l6729l8756m0056
62570H56064m0124l8891l6710l4116l1678k9663k7799k5700k3404k1162j8890
62559E27927j6358j3834j1953j0867j0062r080p963o883n849m975m529m423m039
62546D17112k912j333m0M63K28k62l82N6M88K36m81p07j26M31K41j28M31K084
$$ plain form
62528 415399 419391 424849 431275 438342 445945 454470 464741 477277 491845 508080 526345 547536 572118
62515 572118 599765 629979 662717 698308 736939 778234 821153 864277 906374 946686 984635
62504 984635 1019337 1049591 1074236 1092357 1103278 1106675 1102699 1091844 1074698 1052029 1025100 995626
62492 995626 965346 935650 907457 881240 857194 835642 817270 802752 792222 785303 781624 780974
62480 780974 782957 786794 791518 796126 799536 800831 799724 796492 791288 783783 773546 760453 744546
62467 744546 725868 704762 682087 658802 635528 612701 590811 570110 550391 531571 514275
62456 514275 499282 486479 475019 464586 455869 449523 445232 442214 440180 439244 439158 439272 439361 440048 442212
62441 442212 446165 451487 457430 463300 468639 473318 477541 481579 485337 488202 489403 488575 485827 481295
$$ packed form
62528D15399L992N458O426P067P603Q525J0271J2536J4568J6235J8265K1191K4582
62515E72118K7647L0214L2738L5591L8631M1295M2919M3124M2097M0312L7949
62504I84635L4702L0254K4645J8121J0921L397l976j0855j7146k2669k6929k9474
62492I95626l0280k9696k8193k6217k4046k1552j8372j4518j0530o919l679o50
62480G80974J983L837M724M608L410J295j107l232n204p505j0237j3093j5907
62467G44546j8678k1106k2675k3285k3274k2827k1890k0701j9719j8820j7296
62456E14275j4993j2803j1460j0433q717o346m291l018k034r36q6J14Q9O87K164
62441D42212L953N322N943N870N339M679M223M038L758K865J201q28k748m532
$$ plain form
62427 481295 474896 466727 457498 448203 439387 431089 423487 417099 412090 407745 403014 397525 391791 386564
62413 386564 382212 378694 375816 373471 371743 370761 370406 370260 369991 369605 369165 368519 367611 366855 366770 367304 367967
62396 367967 368685 370000 372283 375175 378096 380946 383945 387071 390101 393069 396279 399886 403807 408083
62382 408083 412942 418406 424072 429519 434838 440624 447487 455602 464663 474191 483974 494226 505363 517640
62368 517640 531106 545837 562007 579711 598958 620036 643725 670856 701672 735879 773432
62357 773432 814970 861183 911836 965709 1021484 1078264 1134962 1189441 1238731 1280284 1312902
62346 1312902 1336482 1351253 1357486 1355751 1347038 1332458 1312838 1288562 1259665 1226114 1188235 1147067
62334 1147067 1104265 1061494 1019862 979898 941962 906490 873846 844152 817422 793738 773008
$$ packed form
62427D81295o399q169r229r295q816q298p602o388n009m345m731n489n734n227
62413C86564m352l518k878k345j728r82l55j46k69l86m40o46r08p56q5N34O63
62396C67967P18J315K283K892K921K850K999L126L030K968L210L607L921M276
62382D08083M859N464N666N447N319N786O863Q115R061R528R783J0252J1137J2277
62368E17640J3466J4731J6170J7704J9247K1078K3689K7131L0816L4207L7553
62357G73432M1538M6213N0653N3873N5775N6780N6698N4479M9290M1553L2618
62346A312902K3580J4771O233j735q713j4580j9620k4276k8897l3551l7879m1168
62334A147067m2802m2771m1632l9964l7936l5472l2644k9694k6730k3684k0730
$$ plain form
62323 773008 754542 737149 719865 702468 685179 667951 650331 632001 613261 594869 577463
62312 577463 561184 545787 531148 517610 505695 495419 486110 477124 468577 461120 455113 450426 446920
62299 446920 444616 443246 442177 441083 440356 440497 441391 442535 443773 445376 447579 450441 454076 458602 463839
62284 463839 469404 475149 481181 487525 494122 501218 509281 518397 528093 537947 548050 558705 570087
62271 570087 582499 596545 612614 630367 649198 669044 690314 713106 737104 762395 789802
62260 789802 820076 853151 888645 926857 968712 1014722 1064397 1116695 1170510 1224444 1276483
62249 1276483 1324371 1366237 1400635 1426222 1441990 1447963 1445280 1435327 1418878 1396087 1366890 1331192
62237 1331192 1289014 1240945 1188411 1133160 1076537 1019471 963089 908845 857947 810982 768234
$$ packed form
62323G73008j8466j7393j7284j7397j7289j7228j7620j8330j8740j8392j7406
62312E77463j6279j5397j4639j3538j1915j0276r309q986q547p457o007m687l506
62299D46920k304j370j069j094p27J41Q94J144J238J603K203K862L635M526N237
62284D63839N565N745O032O344O597P096Q063R116R696R854J0103J0655J1382
62271E70087J2412J4046J6069J7753J8831J9846K1270K2792K3998K5291K7407
62260G89802L0274L3075L5494L8212M1855M6010M9675N2298N3815N3934N2039
62249A276483M7888M1866L4398K5587J5768N973k683r953j6449k2791k9197l5698
62237A331192m2178m8069n2534n5251n6623n7066n6382n4244n0898m6965m2748
$$ plain form
62226 768234 730023 696434 666976 640847 617602 597341 580240 566073 554183 543808 534352 525458
62214 525458 516984 508925 501357 494394 488183 482944 478949 476322 474809 473853 473034 472347 472009 472082 472501 473365
62198 473365 474956 477418 480661 484658 489643 495839 503094 510900 518839 526936 535596 545095 555152 565131
62184 565131 574767 584490 594780 605393 615560 624915 633825 642731 651598 660191 668544 676973 685927
62171 685927 696108 708466 723791 742503 765011 791921 823496 859095 897614 938363 981039
62160 981039 1024830 1067932 1108048 1143108 1171539 1192395 1205601 1211996 1212858 1209252 1201628 1189774
62148 1189774 1173139 1151406 1124904 1094485 1061174 1026126 990736 956349 923768 893334 865519
62137 865519 841053 820313 802939 788323 776221 766590 759038 752822 747389 742626 738589 735228 732510
$$ packed form
62226G68234l8211l3589k9458k6129k3245k0261j7101j4167j1890j0375r456q894
62214E25458q474q059p568o963o211n239l995k627j513r56q19o87l38P3M19Q64
62198D73365J591K462L243L997M985O196P255P806P939Q097Q660R499J0057R979
62184E65131R636R723J0290J0613J0167R355Q910Q906Q867Q593Q353Q429Q954
62171F85927J0181J2358J5325J8712K2508K6910L1575L5599L8519M0749M2676
62160I81039M3791M3102M0116L5060K8431K0856J3206O395Q62l606p624j1854
62148A189774j6635k1733k6502l0419l3311l5048l5390l4387l2581l0434k7815
62137H65519k4466k0740j7374j4616j2102r631p552o216n433m763m037l361k718
$$ plain form
62124 732510 730647 730069 731205 734290 739335 746198 754665 764363 774539 783966 791194 795065 795223 792361
62110 792361 787987 783668 780173 777186 773802 769184 762799 754347 743845 731886 719565 707996 697914
62097 697914 689781 684077 681223 681155 683159 686347 690308 695190 701168 708003 715215 722534 730052 738025 746666
62082 746666 756068 766163 776817 788111 800491 814466 830184 847463 866173 886308 907699 929933
62070 929933 952717 976187 1000715 1026496 1053336 1080777 1108418 1136202 1164370 1192993 1221645
62059 1221645 1249606 1276041 1299596 1318100 1329536 1333611 1331849 1325911 1316392 1303507 1287989 1270332
62047 1270332 1249504 1223538 1191617 1154903 1115195 1073526 1030450 987074 944986 905179 867460
62036 867460 831048 795672 762028 731162 703443 678304 655112 634003 615510 599582 585513
$$ packed form
62124G32510j863n78J136L085N045O863Q467R698J0176R427P228L871J58k862
62110G92361m374m319l495k987l384m618o385q452j0502j1959j2321j1569j0082
62097F97914q133n704k854o8K004L188L961M882N978O835P212P319P518P973Q641
62082G46666R402J0095J0654J1294J2380J3975J5718J7279J8710K0135K1391K2234
62070I29933K2784K3470K4528K5781K6840K7441K7641K7784K8168K8623K8652
62059A221645K7961K6435K3555J8504J1436M075j762n938r519j2885j5518j7657
62047A270332k0828k5966l1921l6714l9708m1669m3076m3376m2088l9807l7719
62036H67460l6412l5376l3644l0866k7719k5139k3192k1109j8493j5928j4069
$$ plain form
62025 585513 572787 561382 551119 541348 531678 522486 514205 506466 498513 490247 482326 475280 469079
62012 469079 463587 458925 455220 452388 450357 449248 449113 449726 450867 452690 455566 459551 464112 468409 471843
61997 471843 474350 476233 477751 478910 479619 479877 479654 478726 476838 473988 470325 465745 459914 452795 444944
61982 444944 437088 429567 422363 415546 409342 403788 398617 393687 389296 385860 383388 381549 380230 379649
61968 379649 379779 379919 379147 377096 374168 371190 369099 368694 370119 372570 375004 377296 380294 384478 389023
61953 389023 392672 395291 398075 402260 408051 414829 421991 429413 437359 446249 456566 468864 483640
61940 483640 500911 519878 539318 558503 577597 596913 616146 634657 652327 669617 686815
61929 686815 703637 719568 734176 747034 757765 766277 772599 776400 777099 774619 769641 762925 754799
$$ packed form
62025E85513j2726j1405j0263r771r670r192q281p739p953q266p921p046o201
62012D69079n492m662l705k832k031j109j35O13J141J823K876L985M561M297L434
61997D71843K507J883J518J159P09K58k23r28j888k850l663m580n831p119p851
61982D44944p856p521p204o817o204n554n171m930m391l436k472j839j319n81
61968C79649J30J40p72k051k928k978k091m05J425K451K434K292K998M184M545
61953C89023L649K619K784M185N791O778P162P422P946Q890J0317J2298J4776
61940D83640J7271J8967J9440J9185J9094J9316J9233J8511J7670J7290J7198
61929F86815J6822J5931J4608J2858J0731Q512O322L801O99k480m978o716q126
$$ plain form
61916 754799 745634 736405 728327 722161 718265 717089 719154 724582 733040 744146 757581 772730 788518
61903 788518 803688 817158 828104 835888 839971 839893 835522 827382 816418 803190 787581 769643 750452
61890 750452 731482 713264 695301 677416 660493 645461 632067 619202 606137 592922 579784
61879 579784 566751 553957 541789 530489 519958 510131 501270 493634 487088 481386 476717 473588 472174
61866 472174 472088 472923 474749 477966 482878 489641 498343 508796 520394 532650 545942 561383 579775
61853 579775 600988 624504 650192 678203 708344 740054 772915 806764 841172 875189 907752
61842 907752 938079 965457 988866 1007116 1019328 1025175 1024822 1018909 1008594 995405 980973 966923
61830 966923 954857 946071 941095 939687 941464 946451 954815 966111 979029 991976 1003684 1013173 1019321
$$ packed form
61916G54799r165r229q078o166l896j176K065N428Q458J1106J3435J5149J5788
61903G88518J5170J3470J0946P784M083p8m371q140j0964j3228j5609j7938j9191
61890G50452j8970j8218j7963j7885j6923j5032j3394j2865j3065j3215j3138
61879E79784j3033j2794j2168j1300j0531r827q861p636o546n702m669l129j414
61866D72174q6Q35J826L217M912O763Q702J0453J1598J2256J3292J5441J8392
61853E79775K1213K3516K5688K8011L0141L1710L2861L3849L4408L4017L2563
61842I07752L0327K7378K3409J8250J2212N847l53n913j0315j3189j4432j4050
61830I66923j2066q786m976j408J777M987Q364J1296J2918J2947J1708R489O148
$$ plain form
61817 1019321 1020851 1016820 1006973 991586 971128 946139 917305 885512 851825 817416 783346 750323
61805 750323 718691 688751 660966 635782 613288 593228 575322 559492 545734 533911 523737
61794 523737 514906 507180 500357 494247 488706 483659 479059 474856 471135 468210 466337 465255 464237 462789
61780 462789 461121 459686 458490 457232 455990 455244 455079 454850 453862 452121 450239 448883 448432 448831 449498 449714
61764 449714 449441 449506 450681 452835 455319 457915 460943 464578 468478 472084 474959 476961 478347 479563 480601
61749 480601 480747 479366 476755 473805 470991 468226 465515 463091 460942 458918 457335 456710 456711 456192 454715 453358
61733 453358 453446 454962 456813 458229 459228 459942 460249 460161 460076 460478 461617 463451 465664 467821 469745 471673 473826
61716 473826 475974 477737 479195 480780 482563 483987 484425 483765 482373 480688 478987 477424 476104 474955 473480
$$ packed form
61817A019321J530m031r847j5387k0458k4989k8834l1793l3687l4409l4070l3023
61805G50323l1632k9940k7785k5184k2494k0060j7906j5830j3758j1823j0174
61794E23737q831p726o823o110n541n047m600m203l721k925j873j082j018j448
61780D62789j668j435j196j258j242p46j65k29r88j741j882j356m51L99O67K16
61764D49714k73O5J175K154K484K596L028L635L900L606K875K002J386J216J038
61749D80601J46j381k611k950k814k765k711k424k149k024j583o25Jn19j477j357
61733D53358Q8J516J851J416R99P14L07q8q5M02J139J834K213K157J924J928K153
61716D73826K148J763J458J585J783J424M38o60j392j685j701j563j320j149j475
$$ plain form
61701 473480 470816 466452 460981 455811 451915 449134 446853 444917 443478 442297 440828 438940 436969 435063
61687 435063 432988 430690 428559 426892 425410 423568 421115 418171 415005 411963 409394 407346 405420 403205
61673 403205 400867 399099 398323 398083 397438 395984 394250 392875 391648 389762 386998 384117 381926 380553 379950
61658 379950 380505 382444 384979 386846 387627 387892 388100 388222 388541 389902 392713 396346 400064 403984 408523 413317
61642 413317 417487 420848 424212 428341 433011 437157 439676 440077 438691 436339 433609 430413 426344 421384
61628 421384 416078 411114 406908 403502 400627 397918 395249 392816 390753 388853 386859 384913 383430 382624
61614 382624 382351 382219 381586 379751 376626 373081 370104 367639 364767 360969 356570 351848 346569 340805 335527
61599 335527 331638 328780 325800 322280 318906 316331 314295 312146 309802 307851 306822 306540 306195 305033 303047
$$ packed form
61701D73480k664m364n471n170l896k781k281j936j439j181j469j888j971j906
61687D35063k075k298k131j667j482j842k453k944l166l042k569k048j926k215
61673D03205k338j768p76k40o45j454j734j375j227j886k764k881k191j373o03
61658C79950N55J939K535J867P81K65K08J22L19J361K811L633L718L920M539M794
61642D13317M170L361L364M129M670M146K519M01j386k352k730l196m069m960
61628D21384n306m964m206l406k875k709k669k433k063j900j994j946j483q06
61614C82624k73j32o33j835l125l545k977k465k872l798m399m722n279n764n278
61599C35527l889k858k980l520l374k575k036k149k344j951j029k82l45j162j986
$$ plain form
61584 303047 300906 299190 297887 296813 296143 296080 296179 295646 294399 293244 292814 292822 292638 292170 291794 291756 292038 292557
61566 292557 293081 293183 292721 292176 292095 292338 292382 292243 292471 293195 293799 293811 293623 293937 294839 295773 296263 296352 296461 297055
61546 297055 298312 299905 301195 301835 302076 302315 302556 302577 302512 302905 304154 306091 308162 309898 311176 312180
61530 312180 313175 314194 314966 315179 314832 314288 314005 314176 314561 314662 314186 313408 312901 312873 312966 312805 312487 312269 311996
61511 311996 311247 310001 308833 308364 308725 309579 310464 311004 310999 310430 309384 307990 306527 305491 305309 305946 306909
61494 306909 307672 308021 308023 307861 307695 307556 307396 307379 308040 309837 312473 314949 316442 316957 317014 316978 316926 316975 317336 317962
61474 317962 318462 318573 318608 319237 320820 323073 325416 327463 329100 330293 331088 331754 332538 333269 333482 333128 332809
61457 332809 333072 333780 334463 334942 335181 334874 333860 332853 332962 334328 335854 336593 336827 337393 338456 339519 340303
$$ packed form
61584C03047k141j716j303j074o70o3R9n33j247j155m30Qj84m68l76l8K82N19
61566B92557N24J02m62n45q1K43M4j39K28P24O04J2j88L14R02R34M90Q9J09N94
61546B97055J257J593J290O40K41K39K41K1o5L93J249J937K071J736J278J004
61530C12180R95J019P72K13l47n44k83J71L85J01m76p78n07k8R3j61l18k18k73
61511C11996p49j246j168m69L61Q54Q85N40nn69j046j394j463j036j82O37R63
61494C06909P63L49Kj62j66j39j60j7O61J797K636K476J493N15N7l6n2M9L61O26
61474C17962N00J11L5O29J583K253K343K047J637J193P95O66P84P31K13l54l19
61457C32809K63P08O83M79K39l07j014j007J09J366J526P39K34N66J063J063P84
$$ plain form
61440 340303 340996 341743 342520 343472 344885 346649 348146 348917 349231 349841 351302 353613 356342 358960 361144 362904
61424 362904 364500 366241 368288 370482 372365 373589 374396 375433 376943 378409 379251 379574 379820 379968 379648 378938
61408 378938 378350 377944 377132 375678 374235 373435 372931 371917 370232 368276 366157 363685 361169 359390 358577 358073
61392 358073 357329 356605 356351 356445 356562 356826 357449 358065 358168 358072 358744 360554 362859 364926 366703 368395 369889
61375 369889 371038 372160 373774 376022 378672 381471 384190 386530 388410 390230 392512 395335 398355 401274
61361 401274 403953 406250 408199 410318 413305 417382 422232 427613 433587 440074 446675 453198 460014 467516
61347 467516 475364 482546 488122 491788 493912 495246 496541 498191 500221 502586 505322 508307 511092 513206
61333 513206 514532 515156 514906 513340 510237 505967 501276 496805 492837 489353 486171 483030 479713 476197 472753
$$ packed form
61440C40303O93P47P77R52J413J764J497P71L14O10J461K311K729K618K184J760
61424C62904J596J741K047K194J883J224Q07J037J510J466Q42L23K46J48l20p10
61408C78938n88m06q12j454j443q00n04j014j685j956k119k472k516j779q13n04
61392C58073p44p24k54R4J17K64O23O16J03r6O72J810K305K067J777J692J494
61375C69889J149J122J614K248K650K799K719K340J880J820K282K823L020K919
61361D01274K679K297J949K119K987M077M850N381N974O487O601O523O816P502
61347D67516P848P182N576L666K124J334J295J650K030K365K736K985K785K114
61333E13206J326O24k50j566l103m270m691m471l968l484l182l141l317l516l444
$$ plain form
61318 472753 469859 467951 467197 467423 468215 469252 470667 473103 477181 482857 489470 496538 504281 513218 523479
61303 523479 534780 546783 559027 570507 579844 586177 589762 591576 592465 592663 591915 589866 586438 581966
61289 581966 576961 571724 566249 560411 554159 547651 541321 535661 530780 526330 522078 518318 515446 513407
61275 513407 512031 511658 512780 515079 517514 519482 521345 523636 526370 529384 532726 536387 540178 544296
61261 544296 549526 556474 564980 574609 585149 596192 606766 615965 623498 629131 632236 632690 631726 630883
61247 630883 630312 629024 626505 623032 618476 612143 604175 596059 589101 583160 577422 571692 566218 560868
61233 560868 555349 549976 545470 542071 539509 537842 537727 539644 543171 547242 551009 554352 557665 561277
61219 561277 565166 569216 573492 578001 582385 586335 590286 595107 600918 606722 611487 615107 617992 620296
$$ packed form
61318D72753k894j908p54K26P92J037J415K436M078N676O613P068P743Q937J0261
61303E23479J1301J2003J2244J1480R337O333L585J814Q89J98p48k049l428m472
61289E81966n005n237n475n838o252o508o330n660m881m450m252l760k872k039
61275E13407j376l73J122K299K435J968J863K291K734L014L342L661L791M118
61261E44296N230O948Q506R629J0540J1043J0574R199P533N633L105M54r64q43
61247F30883n71j288k519l473m556o333p968q116o958n941n738n730n474n350
61233E60868n519n373m506l399k562j667j15J917L527M071L767L343L313L612
61219E61277L889M050M276M509M384L950L951M821N811N804M765L620K885K304
$$ plain form
61205 620296 622133 624105 626897 630621 635164 640990 648774 658253 668225 677922 687858 699128 712419 727809
61191 727809 744746 761715 776496 787495 794804 799706 803384 806368 808726 810188 810271 808852 806508 803755
61177 803755 800098 794500 786812 778079 769263 760290 750646 740258 729346 717949 706148 694388 682958
61164 682958 671405 659097 646237 633724 622090 611162 600759 590975 581685 572541 563891 557092
61152 557092 553312 552300 552793 553827 555181 556692 557728 557400 555034 550479 544271 537463 530959 524900 518877
61137 518877 512695 506809 502014 498899 497544 497626 498831 501267 505326 511100 518166 526150 535173 545473
61123 545473 556847 568915 581699 595478 610214 625665 642024 659852 679272 699679 720369
61112 720369 740994 761326 781076 800174 818779 836771 853601 868834 882381 893997 903035 909100
$$ packed form
61205F20296J837J972K792L724M543N826P784R479R972R697R936J1270J3291J5390
61191G27809J6937J6969J4781J0999P309M902L678K984K358J462Q3j419k344k753
61177H03755l657n598p688q733q816q973r644j0388j0912j1397j1801j1760j1430
61164F82958j1553j2308j2860j2513j1634j0928j0403r784r290r144q650o799
61152E57092l780j012M93J034J354J511J036l28k366m555o208o808o504o059o023
61137E18877o182n886m795l115j355Q2J205K436M059N774P066P984R023J0300
61123E45473J1374J2068J2784J3779J4736J5451J6359J7828J9420K0407K0690
61112G20369K0625K0332J9750J9098J8605J7992J6830J5233J3547J1616R038O065
$$ plain form
61100 909100 912459 913381 911493 906329 898192 887833 875594 861544 846219 830364 813906 796065 776797
61087 776797 757388 739152 722142 705691 689828 675400 662956 652164 642415 633514 625605 618753
61075 618753 612821 607662 603300 599978 597931 596984 596558 596386 597117 599756 604431 610153 615953 621819 628251
61060 628251 635397 643119 651613 661321 672240 683846 695803 708388 722145 737499 754772 774176
61048 774176 795536 818314 842071 866733 892327 918834 946438 975606 1006644 1039371 1073422
61037 1073422 1108628 1144879 1181963 1219894 1259224 1300693 1344683 1391255 1440513 1492522 1546901
61026 1546901 1602783 1659286 1716080 1773881 1834679 1901219 1975844 2059777 2153535 2257683 2372954
61015 2372954 2500202 2640962 2798237 2976682 3182467 3423338 3708217 4045786 4443449
$$ packed form
61100I09100L359R22j888n164q137j0359j2239j4050j5325j5855j6458j7841j9268
61087G76797j9409j8236j7010j6451j5863j4428j2444j0792r749q901p909o852
61075F18753n932n159m362l322k047r47m26j72P31K639M675N722N800N866O432
61060F28251P146P722Q494R708J0919J1606J1957J2585J3757J5354J7273J9404
61048G74176K1360K2778K3757K4662K5594K6507K7604K9168L1038L2727L4051
61037A073422L5206L6251L7084L7931L9330M1469M3990M6572M9258N2009N4379
61026A546901N5882N6503N6794N7801O0798O6540P4625Q3933R3758J04148J15271
61015B372954J27248J40760J57275J78445K05785K40871K84879L37569L97663
$$ plain form
61006 4443449 4908552 5451452 6088225 6841477 7738976 8810363 10083336 11579681 13305067
60997 13305067 15223046 17219061 19088250 20584421 21522769 21871515 21764170 21428023 21089163
60988 21089163 20910949 20967501 21223615 21522017 21615689 21262671 20337418 18882937 17071902
60979 17071902 15116379 13192308 11411441 9828581 8458740 7292431 6308619 5484244
60971 5484244 4797909 4229464 3759848 3372249 3052365 2787194 2564449 2373653 2207294
60962 2207294 2060539 1930088 1813394 1708480 1613953 1529044 1453472 1387003 1328962 1278225
60952 1278225 1233571 1193754 1157272 1122445 1088049 1053808 1020093 987218 955239 924405 895539
60941 895539 869584 846680 825837 805660 785315 764727 744151 723953 704707 686981 670825
$$ packed form
61006D443449M65103N42900O36773P53252Q97499J071387J272973J496345J725386
60997A3305067J917979J996015J869189J496171R38348L48746j07345l36147l38860
60988B1089163j78214N6552K56114K98402R3672l53018r25253j454481j811035
60979A7071902j955523j924071j780867j582860j369841j166309r83812q24375
60971E484244o86335n68445m69616l87599l19884k65171k22745j90796j66359
60962B207294j46755j30451j16694j04914r4527q4909p5572o6469n8041n0737
60952A278225m4654l9817l6482l4827l4396l4241l3715l2875l1979l0834k8866
60941H95539k5955k2904k0843k0177k0345k0588k0576k0198j9246j7726j6156
$$ plain form
60930 670825 655810 641682 628665 616921 606130 595948 586677 579050 573367 569088 565266 561276 557182
60917 557182 553553 550906 549213 548009 546940 546035 545424 545086 544972 545116 545489 545984 546688 547836 549328 550623
60901 550623 551330 551621 551764 551624 550955 549917 548800 547469 545498 542766 539525 535932 531900 527349 522276
60886 522276 516600 510255 503428 496460 489590 482990 476801 470790 464205 456500 448153 440318 433640 427824
60872 427824 422380 417350 413186 410242 408499 407569 406945 406475 406497 407275 408505 409792 411454 414175 417869 421479
60856 421479 424102 425736 426790 427539 428422 430255 433471 437447 441138 444195 447003 449771 452166 453923 455343
60841 455343 456960 458900 460677 461495 460721 458261 454612 450529 446605 443169 440358 438113 436099 433852 431157
60826 431157 428280 425810 424199 423336 422503 420860 418123 414775 411539 408702 406029 403231 400288 397240 393867
$$ packed form
60930F70825j5015j4128j3017j1744j0791j0182r271p627n683m279l822l990m094
60917E57182l629k647j693j204j069r05o11l38j14J44L73M95P04J148J492J295
60901E50623P07K91J43j40o69j038j117j331j971k732l241l593m032m551n073
60886E22276n676o345o827o968o870o600o189o011o585p705q347p835o678n816
60872D27824n444n030m164k944j743r30o24m70K2P78J230J287J662K721L694L610
60856D21479K623J634J054P49Q83J833L216L976L691L057K808K768K395J757J420
60841D55343J617J940J777Q18p74k460l649m083l924l436k811k245k014k247k695
60826D31157k877k470j611q63q33j643k737l348l236k837k673k798k943l048l373
$$ plain form
60811 393867 389857 385275 380646 376453 372633 368741 364523 360170 356024 352246 348806 345692 343000 340882
60797 340882 339411 338401 337409 336101 334629 333494 333026 333161 333676 334318 334715 334615 334353 334672 335729 336735
60781 336735 336941 336605 336576 337270 338662 341000 344661 349221 353397 356277 358192 360108 362504 365119 367531
60766 367531 369658 371760 374076 376406 378090 378637 378385 378222 378614 379231 379562 379523 379228 378522 377083 374820 371936
60749 371936 368762 365776 363640 362837 363152 363687 363518 362379 360727 359091 357315 354586 350326 344954 339473
60734 339473 334386 329366 324087 318984 314904 312183 310375 308868 307545 306755 306724 307127 307329 307068 306753 306924
60718 306924 307595 308364 309096 310116 311640 313284 314356 314551 314258 314220 314903 316142 317435 318631 320157 322409
60702 322409 325122 327665 329794 331752 333723 335726 338056 341245 345339 349636 353498 357022 360533 363710
$$ packed form
60811C93867m010m582m629m193l820l892m218m353m146l778l440l114k692k118
60797C40882j471j010r92j308j472j135m68J35N15O42L97j00k62L19J057J006
60781C36735K06l36k9O94J392K338L661M560M176K880J915J916K396K615K412
60766C67531K127K102K316K330J684N47k52j63L92O17L31l9k95p06j439k263k884
60749C71936l174k986k136q03L15N35j69j139j652j636j776k729m260n372n481
60734C39473n087n020n279n103m080k721j808j507j323p90l1M03K02k61l15J71
60718C06924O71P69P32J020J524J644J072J95k93l8O83J239J293J196J526K252
60702C22409K713K543K129J958J971K003K330L189M094M297L862L524L511L177
$$ plain form
60688 363710 365757 366426 366383 366387 366400 365782 364312 362746 362205 363089 364800 366509 367842 368675 368659 367485 365523 363700
60670 363700 362593 361936 361081 359623 357510 354860 351860 348648 345243 341751 338585 336162 334355 332597 330643
60655 330643 328913 327963 327932 328656 329995 331865 334180 336909 340006 343202 346080 348381 349958 350439 349434
60640 349434 347165 344479 342033 339850 337856 336351 335555 335005 333886 331852 329297 326971 325480 324964 325064
60625 325064 325323 325705 326528 327860 329348 330724 332021 333159 333796 333858 333739 333682 333431 332868 332527 332945 333892 334750
60607 334750 335365 336018 336778 337440 337900 338149 338044 337578 337185 337314 337792 338109 338206 338512 339280 340424 342021 344435
60589 344435 347773 351494 354631 356278 356091 354673 353402 353428 354739 356405 357621 358238 358440 358349 358058 357840
60573 357840 358303 360296 364342 369950 375897 381541 387497 394629 402871 411661 421038 431342 441992 451503
$$ packed form
60688C63710K047O69m3MJ3o18j470j566n41Q84J711J709J333Q33j6j174j962j823
60670C63700j107o57q55j458k113k650l000l212l405l492l166k423j807j758j954
60655C30643j730r50l1P24J339J870K315K729L097L196K878K301J577M81j005
60640C49434k269k686k446k183j994j505p96n50j119k034k555k326j491n16J00
60625C25064K59L82Q23J332J488J376J297J138O37O2j19n7k51n63l41M18R47Q58
60607C34750O15O53P60O62M60K49j05m66l93J29M78L17R7L06P68J144J597K414
60589C44435L338L721L137J647j87j418j271K6J311J666J216O17K02r1k91k18
60573C57840M63J993M046N608N947N644N956P132Q242Q790R377J0304J0650R511
$$ plain form
60559 451503 458806 463835 466758 467548 466495 464298 461280 457241 452539 448566 446545 446352 447083 448424 450813
60544 450813 454592 459646 465828 473233 482033 492354 504263 517618 532001 547047 562645 578485
60532 578485 593518 606244 615571 621174 623173 621842 617768 611878 604947 597146 588363 579039 570457 563887
60518 563887 559466 556171 553017 550057 548026 547317 547672 548679 550105 551774 553639 556115 559929 565446 572489
60503 572489 581045 591812 605730 623236 644278 668903 697455 730150 766677 806197 847582 889672
60491 889672 931389 971693 1009387 1042987 1070705 1090527 1100511 1099443 1087363 1065305 1034490 995984
60479 995984 951219 902460 852463 803672 757804 715821 677919 643637 612415 584212 559448
60468 559448 538287 520187 504329 490396 478694 469365 461635 454150 446158 438167 431250 425830 421367
$$ packed form
60559D51503P303N029K923P90j053k197l018m039m702l973k021j93P31J341K389
60544D50813L779N054O182P405Q800J0321J1909J3355J4383J5046J5598J5840
60532E78485J5033J2726R327N603J999j331m074n890o931p801q783r324q582o570
60518E63887m421l295l154k960k031p09L55J007J426J669J865K476L814N517P043
60503E72489Q556J0767J3918J7506K1042K4625K8552L2695L6527L9520M1385M2090
60491H89672M1717M0304L7694L3600K7718J9822R984j068j2080k2058l0815l8506
60479I95984m4765m8759m9997m8791m5868m1983l7902l4282l1222k8203k4764
60468E59448k1161j8100j5858j3933j1702r329p730p485p992p991o917n420m463
$$ plain form
60455 421367 417125 412913 408985 405520 402413 399481 396730 394386 392698 391627 390752 389574 387946 386161
60441 386161 384650 383610 382838 381829 380161 377948 375854 374497 373889 373572 373165 372602 371992 371575 371709 372571
60425 372571 373827 374863 375368 375464 375342 375048 374607 374057 373369 372671 372517 373495 375453 377525 379065 380216 381365
60408 381365 382487 383327 383936 384557 385169 385529 385692 386123 387237 388993 391011 392939 394652 396230 397861 399780
60392 399780 402161 404925 407679 410002 411895 413813 416169 418995 422146 425537 428876 431527 433109 434126
60378 434126 435529 437695 440233 442724 445110 447360 449376 451375 453797 456532 458704 459588 459446 459167 459390
60363 459390 460247 461616 463247 464877 466568 468733 471592 474885 478530 483252 490023 498871 508708 518372
60349 518372 527477 536073 543812 549828 553507 555103 555374 554577 552131 547479 541056 534077 527427 521172 515059
$$ packed form
60455D21367m242m212l928l465l107k932k751k344j688j071q75j178j628j785
60441C86161j511j040p72j009j668k213k094j357o08l17m07n63o10m17J34Q62
60425C72571J256J036N05R6j22k94m41n50o88o98j54R78J958K072J540J151J149
60408C81365J122Q40O09O21O12L60J63M31J114J756K018J928J713J578J631J919
60392C99780K381K764K754K323J893J918K356K826L151L391L339K651J582J017
60378D34126J403K166K538K491K386K250K016J999K422K735K172Q84j42k79K23
60363D59390Q57J369J631J630J691K165K859L293L645M722O771Q848R837R664
60349E18372R105Q596P739O016L679J596K71p97k446m652o423o979o650o255o113
$$ plain form
60334 515059 509022 503019 496947 491012 485833 481801 478565 475408 471923 468126 464192 460444 457411 455606
60320 455606 455260 456341 458562 461202 463335 464667 465982 468438 472560 478217 485339 494117 504422 515442
60306 515442 526154 536099 545606 555275 565211 574784 583171 589997 595212 598461 599037 596512 590966 582469
60292 582469 570934 556917 542102 528345 516375 505815 496232 487667 480268 473986 468718 464333 460512
60279 460512 456848 453229 449861 446863 444043 441111 437954 434692 431628 429112 427313 426135 425367 424804 424145
60264 424145 423017 421328 419433 417820 416781 416482 416985 417975 418788 419119 419413 420188 421195 421757 421754 421775 422314 423247
60246 423247 424112 424482 424081 422974 421731 421059 421106 421364 421345 421099 421009 421288 421810 422294 422609 422921 423560 424664 426121
60227 426121 427854 429910 432150 434206 436018 438096 440893 444193 447490 450710 454069 457500 460845 464442
$$ packed form
60334E15059o037o003o072n935n179m032l236l157l485l797l934l748l033j805
60320D55606l46J081K221K640K133J332J315K456M122N657P122Q778J0305J1020
60306E15442J0712R945R507R669R936R573Q387O826N215L249N76k525n546q497
60292E82469j1535j4017j4815j3757j1970j0560r583q565p399o282n268m385l821
60279D60512l664l619l368k998k820k932l157l262l064k516j799j178p68n63o59
60264D24145j128j689j895j613j039k99N03R90Q13L31K94P75J007N62lK1N39R33
60246D23247Q65L70m01j107j243o72M7K58j9k46r0K79N22M84L15L12O39J104J457
60227D26121J733K056K240K056J812K078K797L300L297L220L359L431L345L597
$$ plain form
60213 464442 468903 474280 479989 485589 491109 496556 501687 506413 510929 515267 519205 522733 526156 529509
60199 529509 532352 534422 536072 537795 539674 541541 543245 544446 544558 543431 541865 540956 540957 541123 540608 539162
60183 539162 536972 534233 531078 527750 524544 521537 518491 515219 512021 509576 508243 507644 507145 506582 506168
60168 506168 505772 504773 502831 500493 498703 497834 497452 496989 496382 495933 495689 495301 494601 494034 494114 494596 494758 494607
60150 494607 495098 496765 498671 499418 498798 497753 496960 496322 495786 495777 496587 498040 500027 502773 506283 510097 513927
60133 513927 517986 522311 526321 529494 532150 534998 538183 541154 543300 544427 544783 544991 545753 547359 549570
60118 549570 552104 554859 557487 559221 559641 559367 559452 560208 561031 561293 560966 560328 559463 558173 556211 553534 550407
60101 550407 547233 544226 541401 538929 537270 536714 537026 537753 538702 539899 541341 543108 545507 548622 551813
$$ packed form
60213D64442M461N377N709N600N520N447N131M726M516M338L938L528L423L353
60199E29509K843K070J650J723J879J867J704J201J12j127j566r09JJ66n15j446
60183E39162k190k739l155l328l206l007l046l272l198k445j333n99m99n63m14
60168E06168l96r99j942k338j790q69l82m63o07m49k44l88p00n67Q0M82J62j51
60150D94607M91J667J906P47o20j045p93o38n36rQ10J453J987K746L510L814L830
60133E13927M059M325M010L173K656K848L185K971K146J127L56K08P62J606K211
60118E49570K534K755K628J734M20k74Q5P56Q23K62l27o38q65j290j962k677l127
60101E50407l174l007k825k472j659n56L12P27R49J197J442J767K399L115L191
$$ plain form
60086 551813 554178 555606 557001 559245 562072 564144 564215 562225 559298 556691 554701 552643 549769 545932 541246
60071 541246 535525 528509 520516 512451 505063 498427 492158 485912 479652 473614 468122 463273 458821 454475
60057 454475 450377 447072 444957 443867 443270 442800 442496 442578 443094 443873 444844 446260 448476 451516 455024 458648
60041 458648 462270 465807 469046 471880 474532 477241 479699 481039 480564 478512 476019 474206 473185 472037
60027 472037 469838 466608 463061 459653 456265 452792 449525 446638 443680 439938 435236 430114 425330 421317
60013 421317 417938 414614 410848 406781 403065 400067 397454 394811 392348 390603 389660 389060 388429 387814 387439
59998 387439 387449 387890 388618 389205 389272 388987 389020 389890 391560 393643 395738 397525 398860 399942 401223 402973 405034
59981 405034 407047 408763 410068 410870 411173 411141 410949 410556 409741 408383 406684 405099 404068 403704 403725 403679 403289
$$ packed form
60086E51813K365J428J395K244K827K072P1j990k927k607j990k058k874l837m686
60071E41246n721p016p993q065p388o636o269o246o260o038n492m849m452m346
60057D54475m098l305k115j090n97m70l04Q2N16P79R71J416K216L040L508L624
60041D58648L622L537L239K834K652K709K458J340m75k052k493j813j021j148
60027D72037k199l230l547l408l388l473l267k887k958l742m702n122m784m013
60013D21317l379l324l766m067l716k998k613k643k463j745r43o00o31o15l75
59998C87439J0M41P28N87O7k85L3Q70J670K083K095J787J335J082J281J750K061
59981D05034K013J716J305Q02L03l2j92l93q15j358j699j585j031l64K1m6l90
$$ plain form
59964 403289 402567 401633 400528 399358 398588 398926 400618 402942 404732 405544 405971 406628 407213 407085 406467 406363 407181
59947 407181 408108 408182 407404 406372 405272 403902 402405 401249 400417 399225 397239 394934 393131 392012 391122 390245
59931 390245 389867 390530 391999 393491 394816 396894 400804 406480 412746 418545 423718 428551 433040 436786 439266
59916 439266 440025 439008 436957 435111 434148 433693 433161 432753 433180 434725 437032 439650 442250 444455 445971 446957
59900 446957 447873 448939 450005 450853 451337 451445 451592 452634 455016 457981 460217 461386 462500 464759 468574
59885 468574 473768 480020 486775 493303 499340 505402 512083 519306 526539 533439 539925 545855 550988 555154
59871 555154 558176 559822 560099 559399 558058 555960 552894 549132 545300 541808 538774 536378 534829 533937 533164
59856 533164 532266 531621 531774 532906 534923 537849 541910 547375 554385 562725 571506 579207 584426 586743 586818
$$ packed form
59964D03289p22r34j105j170p70L38J692K324J790Q12M27O57N85j28o18j04Q18
59947D07181R27P4p78j032j100j370j497j156q32j192j986k305j803j119q90q77
59931C90245l78O63J469J492J325K078L910N676O266N799N173M833M489L746K480
59916D39266P59j017k051j846r63m55n32m08M27J545K307K618K600K205J516R86
59900D46957R16J066J066Q48M84J08J47J042K382K965K236J169J114K259L815
59885D68574N194O252O755O528O037O062O681P223P233O900O486N930N133M166
59871E55154L022J646K77p00j341k098l066l762l832l492l034k396j549q92p73
59856E33164q98o45J53J132K017K926M061N465P010Q340Q781P701N219K317P5
$$ plain form
59841 586818 585698 584197 582871 582204 582437 583253 583853 583512 582022 579627 576624 573111 569092 564730 560403
59826 560403 556477 553056 550047 547398 545083 542835 540148 536748 532909 529079 525352 521493 517371 512990
59812 512990 508286 503295 498478 494349 490735 486962 482934 479458 477192 475821 474663 473573 472656 471619
59798 471619 470104 468385 466929 465497 463484 461085 459210 458192 457461 456740 456617 457395 458157 457741 456164 454426
59782 454426 453243 452653 452568 452965 453602 454219 455074 456732 459264 462115 464845 467538 470405 473437 476573 479755
59766 479755 482644 484756 486138 487518 489429 491555 493316 494771 496458 498548 500748 503024 505866 509646
59752 509646 514061 518408 522240 525610 528909 532544 536601 540731 544549 548108 551670 555028 557537 559056
59738 559056 560389 562436 565255 568320 571344 574258 576692 578199 578999 579896 581360 583218 585275 587598 589968
$$ packed form
59841E86818j120j501j326o67K33Q16O00l41j490k395l003l513m019m362m327
59826E60403l926l421l009k649k315k248k687l400l839l830l727l859m122m381
59812E12990m704m991m817m129l614l773m028l476k266j371j158j090r17j037
59798D71619j515j719j456j432k013k399j875j018p31p21j23P78P62m16j577j738
59782D54426j183n90q5L97O37O17Q55J658K532K851K730K693K867L032L136L182
59766D79755K889K112J382J380J911K126J761J455J687K090K200K276K842L780
59752E09646M415M347L832L370L299L635M057M130L818L559L562L358K509J519
59738E59056J333K047K819L065L024K914K434J507Q00Q97J464J858K057K323K370
$$ plain form
59723 589968 591705 592464 592763 593261 593858 593930 593163 591726 589849 587704 585594 583831 582425 581191 580098 579258
59707 579258 578664 578193 577814 577602 577627 578001 578780 579638 579916 579325 578370 577665 577102 576173 574937 574116 574204 574997 575999
59688 575999 576811 577031 576305 574664 572490 569990 567112 564101 561675 560221 559133 557330 554351 550663 546916
59673 546916 543171 539003 534194 529136 524497 520576 517141 513825 510497 507243 504265 501930 500594 500166
59659 500166 500214 500713 502329 505468 509398 512858 515348 517246 518830 519966 520765 521767 523120 524163 524141 522895
59643 522895 520597 517272 513000 508199 503308 498444 493656 489275 485670 482959 481221 480658 481109 481641 481231
59628 481231 479805 478126 476605 474687 471611 467439 463030 459179 456024 453245 450470 447423 443938 440134
59614 440134 436499 433539 431245 429136 426857 424555 422625 421379 421023 421599 422729 423786 424613 425736 427548
$$ packed form
59723E89968J737P59K99M98N97P2p67j437j877k145k110j763j406j234j093q40
59707E79258n94m71l79k12K5L74P79Q58K78n91r55p05n63r29j236q21Q8P93J002
59688E75999Q12K20p26j641k174k500k878l011k426j454j088j803k979l688l747
59673E46916l745m168m809n058m639l921l435l316l328l254k978k335j336m28
59659E00166M8M99J616L139L930L460K490J898J584J136P99J002J353J043k2j246
59643E22895k298l325m272m801m891m864m788m381l605k711j738n63M51N32m10
59628D81231j426j679j521j918l076m172m409l851l155k779k775l047l485l804
59614D40134l635k960k294k109k279k302j930j246l56N76J130J057Q27J123J812
$$ plain form
59599 427548 429652 431521 433414 435980 439115 441945 443950 445511 447222 449211 451189 452675 453138 452481 451461
59584 451461 451121 451719 452724 453770 454832 455423 454655 452570 450601 450006 450365 450262 448993 447001 444953 443098
59568 443098 441390 439676 437713 435334 432612 429786 427151 425087 423833 423153 422586 422177 422429 423357 424255 424762
59552 424762 425554 427447 430322 433510 436780 440295 443972 447566 451226 455468 460792 467720 476821 488253
59538 488253 501775 517667 536783 558528 579232 593911 599957 598485 592340 583975 575245 567670 561898
59525 561898 557530 554143 552033 551471 551806 551943 551427 550524 549467 548091 546019 542819 538137 532059 525233
59510 525233 518326 511457 504405 497184 490107 483411 477175 471545 466690 462514 458745 455370 452650 450597
59496 450597 448817 447144 446092 446100 446456 445702 443397 440853 439594 439531 439467 439085 439456 441422 444412 447354 449941
$$ packed form
59599D27548K104J869J893K566L135K830K005J561J711J989J978J486M63o57j020
59584D51461l40N98J005J046J062N91p68k085j969n95L59j03j269j992k048j855
59568D43098j708j714j963k379k722k826k635k064j254o80n67m09K52R28Q98N07
59552D24762P92J893K875L188L270L515L677L594L660M242N324O928R101J1432
59538D88253J3522J5892J9116K1745K0704J4679O046j472o145q365q730p575n772
59525E61898m368l387k110n62L35J37n16r03j057j376k072l200m682o078o826
59510E25233o907o869p052p221p077o696o236n630m855m176l769l375k720k053
59496D50597j780j673j052QL56p54k305k544j259o3o4l82L71J966K990K942K587
$$ plain form
59479 449941 452404 454585 456102 457114 458220 459696 461406 463348 465678 468205 470367 471770 472376 472273 471739
59464 471739 471442 472072 473701 475887 478359 481218 484540 488266 492498 497465 503143 509235 515511 521815 527847
59449 527847 533370 538496 543287 547173 549368 549841 549286 548079 545922 542655 538700 534463 529831 524655 519246
59434 519246 514111 509624 506237 504491 504368 504989 505449 505807 506959 509727 514358 520739 528729 538286 549431
59419 549431 562051 575726 589987 604838 620855 638704 658771 681218 705840 731369 754925
59408 754925 772494 780487 777551 765539 748712 731465 716541 705291 699020 699090 705478 715792 725938
59395 725938 731501 728915 716714 696597 672837 649759 629584 612587 598573 587560 579391 573517
59383 573517 569318 566374 564469 563619 563962 565444 567661 570146 572607 574848 576781 578695 581109 584123 587185
$$ packed form
59479D49941K463K181J517J012J106J476J710J942K330K527K162J403O06j03n34
59464D71739k97O30J629K186K472K859L322L726M232M967N678O092O276O304O032
59449E27847N523N126M791L886K195M73n55j207k157l267l955m237m632n176n409
59434E19246n135m487l387j746j23O21M60L58J152K768M631O381P990R557J1145
59419E49431J2620J3675J4261J4851J6017J7849K0067K2447K4622K5529K3556
59408G54925J7569P993k936j2012j6827j7247j4924j1250o271P0O388J0314J0146
59395G25938N563k586j2201k0117k3760k3078k0175j6997j4014j1013q169n874
59383E73517m199k944j905q50L43J482K217K485K461K241J933J914K414L014L062
$$ plain form
59368 587185 589725 591653 593101 594176 595283 597097 599670 602087 603625 604885 607102 610649 614979 619811
59354 619811 625504 632291 639973 648551 658468 669921 682450 695428 708559 721714 734732 747564
59342 747564 760113 771720 781321 788463 793734 797781 800285 800430 798096 793972 788569 781708 773208 763580
59328 763580 753639 743614 733049 721646 709941 698933 689110 680068 671104 662028 653232 645072 637501
59315 637501 630372 623887 618466 614179 610549 607017 603483 600261 597683 596021 595770 597579 601692 607714
59301 607714 615172 624045 634208 644376 652002 654488 650527 640511 626140 609721 593371 578423
59289 578423 565424 554560 545812 538784 532810 527483 522916 519455 517350 516704 517364 518804 520576 523064
59275 523064 527372 534174 542946 552570 562294 571829 580942 589518 597865 606454 615339 624081 632108 638859
$$ packed form
59368E87185K540J928J448J075J107J814K573K417J538J260K217L547M330M832
59354F19811N693O787P682Q578R917J1453J2529J2978J3131J3155J3018J2832
59342G47564J2549J1607R601P142N271M047K504J45k334m124n403o861q500r628
59328G63580r941j0025j0565j1403j1705j1008r823r042q964r076q796q160p571
59315F37501p129o485n421m287l630l532l534l222k578j662k51J809M113O022
59301F07714P458Q873J0163J0168P626K486l961j0016j4371j6419j6350j4948
59289E78423j2999j0864q748p028n974n327m567l461k105o46O60J440J772K488
59275E23064M308O802Q772R624R724R535R113Q576Q347Q589Q885Q742Q027O751
$$ plain form
59261 638859 643683 645993 645648 643121 639321 635159 630964 626235 620335 613605 607366 602578 598968 595785
59247 595785 592860 590440 588584 587453 587754 589945 593277 596561 599834 604251 610226 616667 622392 627423
59233 627423 632287 636770 640075 641840 642327 641781 640139 637281 633256 628330 623004 617792 612764 607495 601684
59218 601684 595613 589770 584313 579151 574271 569583 564705 559292 553536 547993 543060 538885 535636 533365
59204 533365 531639 529718 527217 524327 521423 518795 516816 515914 516189 517298 518872 520787 522894 524920 526908
59189 526908 529394 532666 536106 538848 541021 543765 547878 553049 558580 564294 570267 576184 581621 586686
59175 586686 591752 596658 600852 604298 607576 611002 614363 617791 622126 627867 634187 639592 643241 645207
59161 645207 645814 645360 644258 642723 640312 636318 630727 624359 617999 611784 605429 598642 591223 583226 575206
$$ packed form
59261F38859M824K310l45k527l800m162m195m729n900o730o239m788l610l183
59247E95785k925k420j856j131L01K191L332L284L273M417N975O441N725N031
59233F27423M864M483L305J765M87n46j642k858m025m926n326n212n028n269n811
59218F01684o071n843n457n162m880m688m878n413n756n543m933m175l249k271
59204E33365j726j921k501k890k904k628j979r02K75J109J574J915K107K026J988
59189E26908K486L272L440K742K173K744M113N171N531N714N973N917N437N065
59175E86686N066M906M194L446L278L426L361L428M335N741O320N405L649J966
59161F45207O07m54j102j535k411l994n591o368o360o215o355o787p419p997q020
$$ plain form
59146 575206 567950 561730 556065 550367 544557 538899 533456 527922 521964 515694 509805 505100 501689 498825
59132 498825 495817 492900 490773 489517 488605 487952 488180 489561 491459 493259 495314 498370 502495 507197 512372
59117 512372 518422 525466 533050 540800 548927 557846 567576 577670 587543 596781 605316 613423 621406 629182
59103 629182 636273 642190 646824 650454 653463 656051 658094 659295 659519 658979 658030 656871 655542 654122 652742
59088 652742 651467 650335 649471 648940 648360 646856 643588 638395 631920 625105 618588 612472 606563 600686 594814
59073 594814 588967 583150 577317 571341 565082 558674 552674 547707 543863 540642 537565 534594 531831 529105
59059 529105 526185 523253 520767 518849 517048 514809 511917 508489 504779 501206 498345 496636 496048 496091 496170
59044 496170 495944 495536 495437 496025 497028 497610 497222 496323 496001 496866 498532 500213 501535 502649 503897 505694 508613
$$ packed form
59146E75206p256o220n665n698n810n658n443n534n958o270n889m705l411k864
59132D98825l008k917k127j256r12o53K28J381J898J800K055L056M125M702N175
59117E12372O050P044P584P750Q127Q919R730J0094R873R238Q535Q107P983P776
59103F29182P091N917M634L630L009K588K043J201K24n40r49j159j329j420j380
59088F52742j275j132q64n31n80j504l268n193o475o815o517o116n909n877n872
59073E94814n847n817n833n976o259o408o000m967l844l221l077k971k763k726
59059E29105k920k932k486j918j801k239k892l428l710l573k861j709n88M3P9
59044D96170k26m08r9N88J003N82l88q99l22Q65J666J681J322J114J248J797K919
$$ plain form
59027 508613 513158 519355 526778 535008 543933 553608 564039 575098 586411 597317 607204 615970 623863
59014 623863 630753 635916 638783 639557 638794 636678 633194 628851 624725 621728 620154 619895 620668 622044 623718
58999 623718 625935 629274 633788 638635 642736 645522 646948 647166 646527 645607 644808 644008 642838 641151 638936
58984 638936 636018 632266 628069 624168 620982 618461 616711 616367 618032 621604 626508 632496 639862 648815
58970 648815 658955 669612 680509 691767 703233 714130 723652 731840 739555 747502 755393 762203 767155
58957 767155 770308 772214 773114 772583 769878 764528 756561 746359 734553 722005 709536 697409 685260
58944 685260 672835 660652 649635 640162 631831 624198 617327 611485 606621 602492 599061 596485 594738
58931 594738 593499 592432 591443 590665 590221 589942 589336 588019 586229 584577 583157 581244 578248 574705 571847
$$ packed form
59027E08613M545O197P423Q230Q925R675J0431J1059J1313J0906R887Q766P893
59014F23863O890N163K867P74p63k116l484m343m126k997j574k59P73J376J674
58999F23718K217L339M514M847M101K786J426K18o39r20p99q00j170j687k215
58984F38936k918l752m197l901l186k521j750l44J665L572M904N988P366Q953
58970F48815J0140J0657J0897J1258J1466J0897R522Q188P715P947P891O810M952
58957G67155L153J906R00n31k705n350p967j0202j1806j2548j2469j2127j2149
58944F85260j2425j2183j1017r473q331p633o871n842m864m129l431k576j747
58931E94738j239j067r89p78m44k79o06j317j790j652j420j913k996l543k858
$$ plain form
58916 571847 570285 569572 569052 568609 568454 568674 569349 570793 573320 576870 581097 585714 590636 596044 602542 610922
58900 610922 621337 632839 644148 654824 665282 675817 686202 696423 707231 719537 733540
58889 733540 748727 764472 780380 796328 812455 828872 844957 859250 870501 878703 884603 888367
58877 888367 889368 887259 882545 875884 867488 857531 846583 835199 823525 811808 800888 791591 783808
58864 783808 776734 769901 763471 757601 752085 746657 741155 735261 728543 720919 712785 704511 696102 687438
58850 687438 678498 669181 659300 649075 639359 631024 624163 618135 612280 606369 600393 594210 587593 580608
58836 580608 573822 568005 563518 560015 556804 553440 549892 546295 542836 539892 537980 537407 538035 539465 541326
58821 541326 543379 545532 547857 550484 553407 556484 559667 563061 566722 570464 573922 576688 578502 579544
$$ packed form
58916E71847j562p13n20m43j55K20O75J444K527L550M227M617M922N408O498Q380
58900F10922J0415J1502J1309J0676J0458J0535J0385J0221J0808J2306J4003
58889G33540J5187J5745J5908J5948J6127J6417J6085J4293J1251Q202N900L764
58877H88367J001k109m714o661q396r957j0948j1384j1674j1717j0920r297p783
58864G83808p074o833o430n870n516n428n502n894o718p624q134q274q409q664
58850F87438q940r317r881j0225r716q335o861o028n855n911n976o183o617o985
58836E80608o786n817m487l503l211l364l548l597l459k944j912n73O28J430J861
58821E41326K053K153K325K627K923L077L183L394L661L742L458K766J814J042
$$ plain form
58807 579544 580519 582115 584166 585605 585434 583555 580510 576706 572305 567712 563630 560410 557586 554295 550071
58792 550071 545126 539976 535035 530564 526798 523975 522240 521555 521683 522232 522926 523932 525831 528990 533006
58777 533006 537014 540553 543842 547097 549917 551585 551767 550643 548506 545483 541575 536723 530964 524730
58763 524730 518869 514109 510585 508106 506637 506124 506004 505400 503961 502121 500492 499328 498682 498654 499261 500311
58747 500311 501619 503144 504744 506072 507016 508037 509802 512499 515780 519405 523663 529011 535398 542205
58733 542205 548913 555578 562410 569136 575198 580575 585879 591464 596907 601650 605646 609044 611777 614049
58719 614049 616792 620930 626390 632477 638903 645741 652605 658802 664244 669316 673850 677042 678451 678122
58705 678122 675700 670547 663046 654614 645843 635666 623104 608864 594294 579598 564227 548495
$$ packed form
58807E79544R75J596K051J439j71j879l045l804m401m593m082l220k824l291m224
58792E50071m945n150m941m471l766k823j735o85J28N49O94J006J899L159M016
58777E33006M008L539L289L255K820J668J82j124k137l023l908m852n759o234
58763E24730n861m760l524k479j469n13j20o04j439j840j629j164o46k8O07J050
58747E00311J308J525J600J328R44J021J765K697L281L625M258N348O387O807
58733E42205O708O665O832O726O062N377N304N585N443M743L996L398K733K272
58719F14049K743M138N460O087O426O838O864O197N442N072M534L192J409l29
58705F78122k422n153p501q432q771j0177j2562j4240j4570j4696j5371j5732
$$ plain form
58693 548495 533634 520476 509066 499378 491427 484716 478525 472856 468304 464900 461805 458368 454807
58680 454807 451615 448871 446459 444536 443404 443096 443318 443755 444463 445990 448920 453124 457794 462566 468316
58665 468316 476328 486873 499110 512090 525261 538054 549699 559544 566995 571251 571773 569196 565128
58652 565128 560805 556379 551585 546430 540968 535021 528532 521766 514965 508320 502554 498783 497164 496237
58638 496237 494331 491368 488592 486771 485525 484379 483580 483479 483701 483479 482517 481132 479718 478438 477330
58623 477330 476358 475413 474564 474241 474851 476221 477794 479460 481857 485596 490578 496270 502278 508209 513300
58608 513300 516851 519060 520902 523075 525476 527749 529792 531520 532639 532972 532750 532275 531615 530770 529791 528508
58592 528508 526604 524337 522761 522792 524294 526517 529146 532482 536823 542201 548590 555863 563552 571082 578256
$$ packed form
58693E48495j4861j3158j1410r688p951o711o191n669m552l404l095l437l561
58680D54807l192k744k412j923j132l08K22M37P08J527K930M204M670M772N750
58665D68316Q012J0545J2237J2980J3171J2793J1645R845P451M256N22k577m068
58652E65128m323m426m794n155n462n947o489o766o801o645n766l771j619r27
58638D96237j906k963k776j821j246j146p99j01K22k22r62j385j414j280j108
58623D77330r72r45q49l23O10J370J573J666K397L739M982N692O008N931N091
58608E13300L551K209J842K173K401K273K043J728J119L33k22m75o60q45r79j283
58592E28508j904k267j576L1J502K223K629L336M341N378O389P273P689P530P174
$$ plain form
58577 578256 585242 592189 599144 606178 613180 619644 625103 629812 634752 641046 649612 661071 675447 691949
58563 691949 709543 727848 747179 767780 789324 811127 832402 852211 869516 883477 893628
58552 893628 899881 902594 902521 900427 896798 892039 886687 881149 875422 869344 862829 855448 846108 833794
58538 833794 818590 801551 783724 765703 747930 730814 714642 699891 687482 678079 671198 665642
58526 665642 660792 656873 653986 651658 649517 647660 646111 644530 642758 641115 639803 638462 636634 634348
58512 634348 631983 629827 627923 626086 623986 621513 619009 616739 614300 611174 607861 605697 605266 605672 605614
58497 605614 604651 603124 601487 600127 599345 599093 599120 599597 601097 603662 606552 609374 612864 617971 624678 632371
58481 632371 640953 650835 662033 674028 686436 699154 711752 723332 733148 740975 746619 749447 748796
$$ packed form
58577E78256O986O947O955P034P002O464N459M709M940O294Q566J1459J4376J6502
58563F91949J7594J8305J9331K0601K1544K1803K1275J9809J7305J3961J0151
58552H93628O253K713p3k094l629m759n352n538n727o078o515p381r340j2314
58538H33794j5204j7039j7827j8021j7773j7116j6172j4751j2409r403o881n556
58526F65642m850l919k887k328k141j857j549j581j772j643j312j341j828k286
58512F34348k365k156j904j837k100k473k504k270k439l126l313k164m31M06n8
58497F05614r63j527j637j360p82k52K7M77J500K565K890K822L490N107O707P693
58481F32371Q582R882J1198J1995J2408J2718J2598J1580R816P827N644K828o51
$$ plain form
58468 748796 744804 738612 731563 724219 716369 708116 700687 695739 693873 694236 695623 697642 700705 705339
58454 705339 711721 719520 727908 735926 743085 749437 755002 759330 761728 761759 759485 755475 750533 745136 739291
58439 739291 733304 728355 725539 724430 723545 722374 721977 723156 725113 726659 727997 730322 734130 738842 743901
58424 743901 749394 755577 762381 769345 775553 779823 781518 781106 779414 776430 771464 764450 756488 748861
58410 748861 741908 735098 727985 720898 714744 710165 706903 704157 701584 699604 698551 698003 697423 697183 698323
58395 698323 701284 705383 709625 713670 717815 722294 726805 730725 733658 735797 737673 739660 741869 744527
58381 744527 748129 753119 759711 768196 779132 792892 809063 826437 843517 859045 872406 883748
58369 883748 893610 902261 909582 915601 920838 925943 931280 937014 943280 950001 956862 963737 970870 978315
$$ packed form
58468G48796l992o192p049p344p850q253p429m948j866L63J387K019L063M634
58454G05339O382P799Q388Q018P159O352N565M328K398L1k274m010m942n397n845
58439G39291n987m949k816j109q85j171l97J179J957J546J338K325L808M712N059
58424G43901N493O183O804O964O208M270J695m12j692k984m966p014p962p627
58410G48861o953o810p113p087o154m579l262k746k573j980j053n48n80k40J140
58395F98323K961M099M242M045M145M479M511L920K933K139J876J987K209K658
58381G44527L602M990O592Q485J0936J3760J6171J7374J7080J5528J3361J1342
58369H83748R862Q651P321O019N237N105N337N734O266O721O861O875P133P445
$$ plain form
58355 978315 985437 991308 995525 998393 1000511 1002457 1004710 1007463 1010447 1013234 1015844 1018979 1023530 1029841
58341 1029841 1037529 1046087 1055540 1066274 1078243 1090842 1103766 1117464 1132335 1147864 1163099 1177567
58329 1177567 1191149 1203494 1214427 1224570 1234551 1243746 1250891 1255997 1260505 1265368 1270099 1274072 1277722
58316 1277722 1281900 1286929 1292825 1299707 1307488 1315885 1325117 1335845 1348006 1360556 1372841 1385364 1398736
58303 1398736 1412767 1427214 1442500 1458905 1475787 1492450 1509112 1526299 1543861 1561373 1578962
58292 1578962 1597075 1615890 1635542 1656335 1678214 1700637 1723525 1747617 1773340 1800130 1827469
58281 1827469 1855765 1885442 1916060 1947134 1979049 2012268 2046456 2081279 2117329 2155278 2194805
58270 2194805 2235309 2276974 2320257 2365104 2411736 2461418 2515233 2572639 2632380 2694280 2759101
$$ packed form
58355I78315P122N871M217K868K118J946K253K753K984K787K610L135M551O311
58341A029841P688Q558R453J0734J1969J2599J2924J3698J4871J5529J5235J4468
58329A177567J3582J2345J0933J0143R981R195P145N106M508M863M731L973L650
58316A277722M178N029N896O882P781Q397R232J0728J2161J2550J2285J2523J3372
58303A398736J4031J4447J5286J6405J6882J6663J6662J7187J7562J7512J7589
58292A578962J8113J8815J9652K0793K1879K2423K2888K4092K5723K6790K7339
58281A827469K8296K9677L0618L1074L1915L3219L4188L4823L6050L7949L9527
58270B194805M0504M1665M3283M4847M6632M9682N3815N7406N9741O1900O4821
$$ plain form
58259 2759101 2827140 2898010 2971305 3046444 3122367 3198367 3274766 3352029 3429948 3508587 3589173
58248 3589173 3672964 3760049 3850361 3945055 4045566 4152059 4264028 4381762 4506021 4637036
58238 4637036 4775076 4921313 5076901 5241964 5416647 5602305 5800441 6011498 6236046
58229 6236046 6476132 6733986 7010396 7305798 7621994 7961336 8325434 8716219 9137117
58220 9137117 9591602 10082018 10611670 11186806 11814758 12501590 13253588 14079685 14990654
58211 14990654 15997838 17115162 18361084 19756968 21326160 23097732 25110118 27410506
58203 27410506 30056150 33122799 36713143 40956673 46003628 52017684 59165416 67607931
58195 67607931 77512802 89090934 102634244 118530050 137251527 159324666 185256918
$$ packed form
58259B759101O8039P0870P3295P5139P5923P6000P6399P7263P7919P8639Q0586
58248C589173Q3791Q7085R0312R4694J00511J06493J11969J17734J24259J31015
58238D637036J38040J46237J55588J65063J74683J85658J98136K11057K24548
58229F236046K40086K57854K76410K95402L16196L39342L64098L90785M20898
58220I137117M54485M90416N29652N75136O27952O86832P51998Q26097R10969
58211A4990654J007184J117324J245922J395884J569192J771572K012386K300388
58203B7410506K645644L066649L590344M243530N046955O014056P147732Q442515
58195F7607931R904871J1578132J3543310J5895806J8721477K2073139K5932252
$$ plain form
58188 185256918 215421061 249883821 288103737 328425495 367563730 400639876 422267527
58181 422267527 428435116 418119018 393580072 359239901 319991401 279918988 241802471
58174 241802471 207195654 176734689 150470678 128140665 109341528 93619253 80518026
58167 80518026 69614928 60536710 52960029 46610186 41262542 36737373 32888094 29593640
58159 29593640 26756685 24299668 22158084 20277952 18616620 17140194 15819101 14628509
58151 14628509 13551507 12577461 11696786 10899603 10177952 9525342 8934206 8396807 7908246
58142 7908246 7465423 7063200 6694233 6352282 6033102 5732694 5447714 5177638 4923840
58133 4923840 4686323 4463424 4254415 4059836 3879158 3710408 3552249 3404356 3265655
$$ packed form
58188A85256918L0164143L4462760L8219916M0321758L9138235L3076146K1627651
58181D22267527O167589j0316098k4538946l4340171l9248500m0072413l8116517
58174B41802471l4606817l0460965k6264011k2330013j8799137j5722275j3101227
58167H0518026j0903098r078218p576681o349843n347644m525169l849279l294454
58159B9593640k836955k457017k141584j880132j661332j476426j321093j190592
58151A4628509j077002r74046q80675p97183p21651o52610n91136n37399m88561
58142G908246m42823m02223l68967l41951l19180l00408k84980k70076k53798
58133D923840k37517k22899k09009j94579j80678j68750j58159j47893j38701
$$ plain form
58124 3265655 3134238 3009255 2891117 2779799 2674624 2575680 2483645 2398153 2317989 2242800
58114 2242800 2172875 2107362 2044665 1984743 1929039 1877746 1828902 1780726 1733292 1687406 1643240
58103 1643240 1600723 1560047 1521101 1483287 1446282 1410183 1374814 1339874 1305901 1274052 1244754
58092 1244754 1217447 1191712 1167638 1145059 1123475 1102894 1083751 1065843 1048311 1030781 1013578
58081 1013578 996683 979495 961775 943864 925785 907086 887848 868900 850762 833155 815807
58070 815807 798908 782527 766390 750564 735670 722075 709418 697209 685419 674355 664435 656080
58058 656080 649268 643146 636639 629470 622065 614621 606916 598911 590826 582658 574350 566336 559194 552849
58044 552849 546845 541257 536385 531649 525894 518958 511905 505423 499008 492201 485703 480504 476455 472321
$$ packed form
58124C265655j31417j24983j18138j11318j05175r8944r2035q5492q0164p5189
58114B242800o9925o5513o2697n9922n5704n1293m8844m8176m7434m5886m4166
58103A643240m2517m0676l8946l7814l7005l6099l5369l4940l3973l1849k9298
58092A244754k7307k5735k4074k2579k1584k0581j9143j7908j7532j7530j7203
58081A013578j6895j7188j7720j7911j8079j8699j9238j8948j8138j7607j7348
58070H15807j6899j6381j6137j5826j4894j3595j2657j2209j1790j1064r920q355
58058F56080o812o122o507p169p405p444p705q005q085q168q308q014p142o345
58044E52849o004n588m872m736n755o936p053o482o415o807o498n199m049m134
$$ plain form
58030 472321 467054 460592 453614 446713 439717 431905 423115 414401 407058 401178 395803 390394 385375 381240
58016 381240 377899 375061 372547 370043 367189 364098 361224 358587 355739 352610 349693 347203 344786 342331
58002 342331 340373 339273 338547 337454 335896 334418 333680 334159 336025 339078 343085 348207 354632 361752 368254
57987 368254 373251 376786 379082 379865 378779 375968 371852 366678 360662 354296 348168 342598 337640 333286
57973 333286 329507 326286 323682 321678 320024 318465 317057 315960 315016 313897 312567 311158 309531 307582
57959 307582 305939 305625 306815 308485 309501 309567 308929 307669 305689 303030 299922 296651 293456 290301 286845
57944 286845 283060 279820 278338 278915 280792 283317 286665 291222 296849 303131 309913 317250 325126 333451
57930 333451 342011 350214 357211 362383 365456 366113 364014 359382 353059 345762 337626 328712 319484 310528
$$ packed form
58030D72321n267o462o978o901o996p812q790q714p343n880n375n409n019m135
58016C81240l341k838k514k504k854l091k874k637k848l129k917k490k417k455
58002C42331j958j100p26j093j558j478p38M79J866L053M007N122O425P120O502
57987C68254M997L535K296P83j086k811m116n174o016o366o128n570m958m354
57973C33286l779l221k604k004j654j559j408j097r44j119j330j409j627j949
57959C07582j643l14J190J670J016O6o38j260j980k659l108l271l195l155l456
57944B86845l785l240j482N77J877K525L348M557N627O282O782P337P876Q325
57930C33451Q560Q203O997N172L073O57k099m632o323p297q136q914r228q956
$$ plain form
57916 310528 302080 294134 286721 279899 273726 268401 264153 260893 258362 256672 256321 257510 259834 262777
57902 262777 266122 269664 272936 275525 277473 279208 281280 284095 287572 291031 293786 295891 297957 300330
57888 300330 302909 305633 308545 311351 313565 315164 316477 317407 317501 316807 315842 314522 312102 308435 304347
57873 304347 300237 295339 289066 282264 276211 271020 265942 260764 255958 251816 248439 246416 246552 248817
57859 248817 252257 256038 260015 264243 268560 272861 277305 282046 286976 291796 296186 299933 303099 305953
57845 305953 308551 310513 311469 311532 311108 310416 309442 308175 306608 304714 302701 301052 299981 299097 297966 296788
57829 296788 296105 295959 295762 294921 293273 290989 288393 285886 283757 282019 280474 278892 277083 275141 273672
57814 273672 273293 273532 272647 269072 262874 255376 247605 239663 231483 223493 216293 210071 204604 199682 195380
$$ packed form
57916C10528q448p946p413o822o173n325m248l260k531j690l51J189K324K943
57902B62777L345L542L272K589J948J735K072K815L477L459K755K105K066K373
57888C00330K579K724K912K806K214J599J313R30R4o94r65j320k420l667m088
57873C04347m110m898o273o802o053n191n078n178m806m142l377k023J36K265
57859B48817L440L781L977M228M317M301M444M741M930M820M390L747L166K854
57845C05953K598J962R56O3m24o92r74j267j567j894k013j649j071q84j131j178
57829B96788o83j46j97q41j648k284k596k507k129j738j545j582j809j942j469
57814B73672l79K39q85l575o198p498p771p942q180p990p200o222n467m922m302
$$ plain form
57799 195380 191942 189391 187271 184976 182427 180257 179117 178972 179258 179616 180263 181665 183982 186797 189468
57784 189468 191902 194775 198612 202816 206279 208977 212171 216726 222019 226966 231439 235883 240139 243583
57770 243583 246202 248714 251598 254643 257408 259543 260724 260818 260206 259485 258855 258115 257198 256329 255834 256112 257480
57753 257480 259537 260965 260755 259504 258818 259369 260258 260331 259372 257734 255502 252568 249128 245678 242559 239715
57737 239715 236832 233646 230274 227162 224540 222113 219548 217081 215177 213789 212497 211286 210526 210148 209531
57722 209531 208484 207678 207766 208578 209636 211047 213372 216793 220834 224789 228075 230271 231220 231193 230750 230313
57706 230313 229844 228906 227001 223965 220139 216178 212653 209781 207348 204849 201878 198552 195415 192727 190030
57691 190030 186689 182675 178492 174511 170854 167874 166179 165910 166404 166866 167226 168124 170238 173771 178533
$$ packed form
57799A95380l438k551k120k295k549k170j140j45K86L58O47J402K317K815K671
57784A89468K434K873L837M204L463K698L194M555N293M947M473M444M256L444
57770B43583K619K512K884L045K765K135J181R4o12p21o30p40r17q69m95K78J368
57753B57480K057J428k10j251o86N51Q89P3r59j638k232k934l440l450l119k844
57737B39715k883l186l372l112k622k427k565k467j904j388j292j211p60l78o17
57722B09531j047q06Q8Q12J058J411K325L421M041L955L286K196R49k7m43m37
57706B30313m69r38j905l036l826l961l525k872k433k499k971l326l137k688k697
57691A90030l341m014m183l981l657k980j695k69M94M62L60Q98K114L533M762
$$ plain form
57676 178533 184366 191485 200422 211613 225206 241414 260918 284681 313418 347467 386959 431398
57664 431398 478571 523779 560366 581552 582887 564169 529648 486099 440018 395814 355680 320381
57652 320381 290054 264612 243721 226629 212388 200477 190934 183630 177747 172458 167803 164315 161957
57639 161957 160188 159035 159246 161108 163720 165847 167036 167547 167659 167503 167234 166892 166305 165474 164838 164687 164418
57622 164418 162834 159317 154507 149788 146236 144020 142538 140966 138776 135910 132645 129386 126566 124529
57608 124529 123350 122798 122618 122936 124320 127178 130942 134066 135244 134691 133873 133880 134443 134638 134065 132937 131512
57591 131512 130044 128999 128710 128851 128737 128113 127174 125953 124234 122073 119903 118051 116552 115418 114601 113613
57575 113613 111760 108948 105869 103249 101208 99439 97679 95899 94288 93095 92295 91522 90623 90025 90088 90392
$$ packed form
57676A78533N833P119Q937J1191J3593J6208J9504K3763K8737L4049L9492M4439
57664D31398M7173M5208L6587K1186J335j8718l4521m3549m6081m4204m0134l5299
57652C20381l0327k5442k0891j7092j4241j1911r543p304n883n289m655l488k358
57639A61957j769j153K11J862K612K127J189N11J12j56k69l42n87q31o36j51k69
57622A64418j584l517m810m719l552k216j482j572k190k866l265l259k820k037
57608A24529j179n52j80L18J384K858L764L124J178n53q18PN63J95n73j128j425
57591A31512j468j045k89J41j14o24r39j221j719k161k170j852j499j134q17r88
57575A13613j853k812l079k620k041j769j760j780j611j193q00p73q99n98O3L04
$$ plain form
57559 90392 90238 89676 89263 88988 88322 87353 86850 87003 87041 86484 85898 85942 86536 87452 88855 90528 91403 90829 89730
57540 89730 89531 90405 91606 93159 95952 100072 104178 107050 108958 110972 113457 115868 117840 119810 122373
57525 122373 125378 128000 129765 131190 133221 136182 139550 142691 145434 147952 150420 152849 154913 155959
57511 155959 155550 154120 152670 151756 151207 150792 150556 150374 149810 148708 147346 145832 144001 142107 140770 139861
57495 139861 138328 135715 132977 130998 129126 126223 122565 119519 117704 116579 115648 114912 114132 112752 110730
57480 110730 108511 106068 102888 99132 95919 93999 92880 91638 89980 88149 86348 84701 83335 82132
57466 82132 80775 79344 78484 78646 79506 80393 80961 81181 81046 80688 80523 80896 81652 82300 82515 82382 82260 82494
57448 82494 83112 83760 84102 84259 84595 85126 85478 85483 85380 85310 85072 84578 84168 84133 84210 83869 82971 81879 81051 80791
$$ packed form
57559I0392j54n62m13k75o66r69n03J53L8n57n86M4N94R16J403J673Q75n74j099
57540H9730j99Q74J201J553K793M120M106K872J908K014K485K411J972J970K563
57525A22373L005K622J765J425K031K961L368L141K743K518K468K429K064J046
57511A55959m09j430j450r14n49m15k36j82n64j102j362j514j831j894j337r09
57495A39861j533k613k738j979j872k903l658l046j815j125r31p36p80j380k022
57480A10730k219k443l180l756l213j920j119j242j658j831j801j647j366j203
57466H2132j357j431q60J62Q60Q87N68K20j35l58j65L73P56O48K15j33j22K34
57448H2494O18O48L42J57L36N31L52Nj03p0k38m94m10l5P7l41q98j092q28k60
$$ plain form
57428 80791 81227 82234 83330 83899 83701 83162 83030 83590 84242 84107 83169 82499 83012 84299 85197 85402 85823 87199
57410 87199 88994 90110 90328 90554 91749 93971 96451 98367 99445 99962 100294 100533 100575 100454 100370 100461 100793 101563
57392 101563 103008 104976 106833 108018 108590 109106 109968 110943 111317 110565 108921 107233 106136 105516 104890 104116
57376 104116 103497 103300 103521 104056 104797 105547 106146 106662 107213 107641 107799 108117 109399 111817 114434 116027 116284
57359 116284 116077 116670 118693 121628 124195 125414 125446 125296 125698 126480 127025 127143 127320 128206 129967 132139 134135
57342 134135 135855 137637 139671 141835 144179 147009 150173 152793 154316 155434 157191 159480 161290 162294
57328 162294 163188 164374 165390 165949 166614 167835 169088 169675 169778 170028 170511 170962 171629 173174 175764 178849
57312 178849 181845 184577 187072 189382 191680 194244 197240 200661 204370 208074 211375 214053 216256 218359
$$ packed form
57428H0791M36J007J096N69j98n39j32N60O52j35r38o70N13J287Q98K05M21J376
57410H7199J795J116K18K26J195K222K480J916J078N17L32K39M2j21q4R1L32P70
57392A01563J445J968J857J185N72N16Q62R75L74p52j644j688j097o20o26p74
57376A04116o19j97K21N35P41P50N99N16N51M28J58L18J282K418K617J593K57
57359A16284k07N93K023K935K567J219L2j50M02P82N45J18J77Q86J761K172J996
57342A34135J720J782K034K164K344K830L164K620J523J118J757K289J810J004
57328A62294Q94J186J016N59O65J221J253N87J03K50M83M51O67J545K590L085
57312A78849K996K732K495K310K298K564K996L421L709L704L301K678K203K103
$$ plain form
57298 218359 220799 224008 228081 232347 235726 237854 239563 241970 245400 249387 253330 256773 259531 262049
57284 262049 265303 269852 275271 281013 287389 295030 303771 312936 322567 333361 345276 357196 368421
57271 368421 379717 392294 406225 420501 434335 447776 461105 474184 486622 498281 509420
57260 509420 520408 531414 542427 553500 564839 576560 588538 600665 613108 626012 638994
57249 638994 651393 663214 675538 689708 706235 724687 744498 765437 787275 809358 830931
57238 830931 851848 872765 894525 917530 941743 966998 993021 1019304 1045322 1070930 1096363
57227 1096363 1121818 1147250 1172471 1197100 1220484 1242225 1262986 1284252 1306910 1330414 1353675
57216 1353675 1376426 1399248 1422564 1446272 1470293 1494889 1520285 1546390 1573034 1600166 1627729
$$ packed form
57298B18359K440L209M073M266L379K128J709K407L430L987L943L443K758K518
57284B62049L254M549N419N742O376P641Q741R165R631J0794J1915J1920J1225
57271C68421J1296J2577J3931J4276J3834J3441J3329J3079J2438J1659J1139
57260E09420J0988J1006J1013J1073J1339J1721J1978J2127J2443J2904J2982
57249F38994J2399J1821J2324J4170J6527J8452J9811K0939K1838K2083K1573
57238H30931K0917K0917K1760K3005K4213K5255K6023K6283K6018K5608K5433
57227A096363K5455K5432K5221K4629K3384K1741K0761K1266K2658K3504K3261
57216A353675K2751K2822K3316K3708K4021K4596K5396K6105K6644K7132K7563
$$ plain form
57205 1627729 1655598 1683747 1712203 1740801 1769201 1797243 1825090 1852975 1881078 1909683 1939119
57194 1939119 1969378 1999977 2030452 2060837 2091524 2122773 2154563 2186850 2219696 2253069 2286693
57183 2286693 2320285 2353960 2388186 2423237 2458772 2494164 2529164 2563944 2598556 2632689 2666180
57172 2666180 2699374 2732672 2765929 2798654 2830655 2862056 2892779 2922415 2950756 2978142 3005191
57161 3005191 3032449 3060375 3089313 3119203 3149488 3179662 3209914 3241025 3273538 3307260 3341775
57150 3341775 3377306 3414685 3454339 3495617 3537428 3579309 3621412 3663547 3704887 3744818 3783595
57139 3783595 3821768 3859363 3896007 3931562 3966083 3999221 4030153 4058200 4083232 4105557 4125836
57128 4125836 4145297 4165819 4189540 4218301 4253307 4295120 4343838 4399269 4460910 4527936 4599398
$$ packed form
57205A627729K7869K8149K8456K8598K8400K8042K7847K7885K8103K8605K9436
57194A939119L0259L0599L0475L0385L0687L1249L1790L2287L2846L3373L3624
57183B286693L3592L3675L4226L5051L5535L5392L5000L4780L4612L4133L3491
57172B666180L3194L3298L3257L2725L2001L1401L0723K9636K8341K7386K7049
57161C005191K7258K7926K8938K9890L0285L0174L0252L1111L2513L3722L4515
57150C341775L5531L7379L9654M1278M1811M1881M2103M2135M1340L9931L8777
57139C783595L8173L7595L6644L5555L4521L3138L0932K8047K5032K2325K0279
57128D125836J9461K0522K3721K8761L5006M1813M8718N5431O1641O7026P1462
$$ plain form
57117 4599398 4674453 4752280 4832045 4913530 4998050 5088430 5188038 5300207 5428600 5577409 5750902
57106 5750902 5953425 6190489 6469744 6800992 7196398 7671773 8247759 8949838 9808302
57097 9808302 10858986 12143066 13704461 15586822 17832431 20481608 23569903 27123708
57089 27123708 31156346 35663806 40618858 45966867 51626730 57492202 63425630 69248568
57081 69248568 74747287 79702928 83930837 87301211 89729677 91153148 91515829 90777665
57073 90777665 88938374 86059570 82269589 77747153 72692924 67303118 61753974 56196869
57065 56196869 50759167 45546241 40642155 36108677 31984291 28285158 25008129 22134530
57057 22134530 19634202 17470108 15602938 13994372 12608723 11413753 10381004 9485356
$$ packed form
57117D599398P5055P7827P9765Q1485Q4520R0380R9608J12169J28393J48809J73493
57106E750902K02523K37064K79255L31248L95406M75375N75986P02079Q58464
57097I808302J050684J284080J561395J882361K245609K649177L088295L553805
57089B7123708M032638M507460M955052N348009N659863N865472N933428N822938
57081F9248568N498719M955641M227909L370374K428466J423471L62681p38164
57073I0777665j839291k878804l789981m522436n054229n389806n549144n557105
57065E6196869n437702n212926m904086m533478m124386l699133l277029k873599
57057B2134530k500328k164094j867170j608566j385649j194970j032749q95648
$$ plain form
57049 9485356 8704348 8018287 7410915 6869460 6383896 5946425 5551380 5194676 4872758
57040 4872758 4582070 4319384 4082105 3868044 3675324 3502616 3349090 3214016 3096825
57031 3096825 2997636 2917145 2855737 2813069 2788123 2777989 2774998 2765616 2734382 2671072 2575388 2455673
57019 2455673 2323697 2189950 2061731 1943292 1836559 1741791 1658211 1584568 1519460 1461480
57009 1461480 1409389 1362284 1319513 1280391 1244161 1210352 1178947 1149901 1122566 1095917 1069379
56998 1069379 1043172 1017786 993469 970354 948698 928714 910380 893748 879302 867650 858947
56987 858947 852947 849681 849712 853504 860640 869810 879387 887725 892901 892582 884816 869313 847964 823815
56973 823815 799403 776029 754342 735034 718747 705620 695336 687614 682403 679655 679222 681078 685468
$$ packed form
57049I485356p81008o86061o07372n41455m85564m37471l95045l56704l21918
57040D872758k90688k62686k37279k14061j92720j72708j53526j35074j17191
57031C096825r9189q0491o1408m2668k4946j0134k991r382l1234o3310r5684j19715
57019B455673j31976j33747j28219j18439j06733r4768q3580p3643o5108n7980
57009A461480n2091m7105m2771l9122l6230l3809l1405k9046k7335k6649k6538
56998A069379k6207k5386k4317k3115k1656j9984j8334j6632j4446j1652q703
56987H58947o000l266L1L792P136R170R577Q338N176l19p766j5503k1349k4149
56973H23815k4412k3374k1687j9308j6287j3127j0284p722n211k748m33J856M390
$$ plain form
56960 685468 692780 703387 717582 735396 756150 778044 798149 812930 819240 815399 801791 780505
56948 780505 754415 726376 698817 673474 651242 632359 616802 604445 595081 588693 585764 586966
56936 586966 592410 601617 614453 631660 654029 681208 711598 742919 772207 795425 808111 807198
56924 807198 792377 765918 731542 693247 654321 616763 581644 550019 523087 501292 483768
56913 483768 469132 456555 445722 436116 427005 418138 409975 403097 397605 393132 389239 385777 382988
56900 382988 381220 380514 380675 381870 384777 389832 396701 404959 414991 427611 442910 460258 479471
56887 479471 501258 526197 553717 582237 609607 633023 649228 655812 652555 641348 624987 606253
56875 606253 587645 571132 557765 547666 540532 536108 534438 536072 542120 553769 571547 595131
$$ packed form
56960F85468P312J0607J4195J7814K0754K1894K0105J4781O310l841j3608k1286
56948G80505k6090k8039k7559k5343k2232j8883j5557j2357r364o388k929J202
56936E86966N444R207J2836J7207K2369K7179L0390L1321K9288K3218J2686r13
56924H07198j4821k6459l4376l8295l8926l7558l5119l1625k6932k1795j7524
56913D83768j4636j2577j0833r606r111q867q163o878n492m473l893l462k789
56900C82988j768p06J61J195K907N055O869Q258J0032J2620J5299J7348J9213
56887D79471K1787K4939K7520K8520K7370K3416J6205O584l257j1207j6361j8734
56875F06253j8608j6513j3367j0099p134m424j670J634O048J1649J7778K3584
$$ plain form
56863 595131 624021 658364 699024 746762 801151 859831 918242 969785 1006788 1022733 1015100 986795
56851 986795 944694 896377 847644 802075 761682 727485 700075 680213 668901 666725 673466 688723
56839 688723 712703 746035 789097 842035 905435 980327 1066838 1162266 1259771 1348519 1415743
56828 1415743 1450386 1446810 1406584 1337453 1250390 1156385 1064277 980009 906890 846117 797322
56817 797322 759336 731093 712062 701989 700636 708054 724909 752126 790191 838882 897368 963794
56805 963794 1034079 1100915 1154288 1184113 1184019 1154073 1100376 1031824 956718 881424 810640 747546
56793 747546 693469 648143 610770 580825 558021 542054 532712 529945 533606 543330 558869 580318
56781 580318 607693 640160 675496 709926 738359 755345 756819 741674 712074 672348 627345 581203
$$ packed form
56863E95131K8890L4343M0660M7738N4389N8680N8411N1543L7003J5945p633k8305
56851I86795m2101m8317m8733m5569m0393l4197k7410j9862j1312k176O741J5257
56839F88723K3980L3332M3062N2938O3400P4892Q6511R5428R7505Q8748O7224
56828A415743L4643l576m0226o9131q7063r4005r2108q4268p3119o0773m8795
56817G97322l7986k8243j9031j0073j353P418J6855K7217L8065M8691N8486O6426
56805I63794P0285O6836N3373K9825r4k9946n3697o8552p5106p5294p0784o3094
56793G47546n4077m5326l7373k9945k2804j5967r342k767L661R724J5539K1449
56781E80318K7375L2467L5336L4430K8433J6986J474j5145k9600l9726m5003m6142
$$ plain form
56769 581203 536821 495879 459196 427148 399889 377295 358773 343278 329649 317109 305546
56758 305546 295394 287142 280784 275631 270772 265845 261238 257379 254045 250676 247254 244373 242305 240526
56744 240526 238462 236307 234670 233681 232900 232018 231125 230309 229404 228265 227028 226002 225472 225556 225990 226143 225515
56727 225515 224275 223036 222147 221502 220913 220315 219604 218810 218448 219140 220638 221732 221520 220368 219261 218582 218049
56710 218049 217560 217476 218059 219166 220594 222280 224020 225372 226137 226694 227626 229097 230750 232123 233004 233425
56694 233425 233477 233208 232684 232098 231761 231889 232396 232955 233252 233173 232835 232585 232867 233872 235282 236544 237466 238329
56676 238329 239351 240326 240898 241002 240751 240102 238940 237351 235533 233483 231124 228743 226934 226002 225728 225823
56660 225823 226248 226968 227727 228401 229263 230569 232061 233252 234057 234826 235804 236924 238078 239274 240507 241805
$$ packed form
56769E81203m4382m0942l6683l2048k7259k2594j8522j5495j3629j2540j1563
56758C05546j0152q252o358n153m859m927m607l859l334l369l422k881k068j779
56744B40526k064k155j637r89p81q82q93q16r05j139j237j026n30Q4M34J53o28
56727B25515j240j239q89o45n89n98p11p94l62O92J498J094k12j152j107o79n33
56710B18049m89q4N83J107J428J686J740J352P65N57R32J471J653J373Q81M21
56694B33425N2k69n24n86l37J28N07N59K97p9l38k50K82J005J410J262R22Q63
56676B38329J022R75N72J04k51o49j162j589j818k050k359k381j809r32k74R5
56660B25823M25P20P59O74Q62J306J492J191Q05P69R78J120J154J196J233J298
$$ plain form
56644 241805 243391 245553 248268 251174 253901 256198 257810 258555 258596 258379 258219 258138 258023 257730 257123 256372 256172
56627 256172 257207 259327 261613 263349 264520 265307 265535 264926 263597 262102 261103 261041 261829 262855 263594 264179
56611 264179 264982 265702 265553 264443 263267 262760 262700 262645 262748 263344 264179 264656 264447 263475 261784 259891 258702 258479
56593 258479 258373 257606 256570 255975 255488 254257 252456 251155 250716 250360 249448 248236 247199 246501 246358 247128 248682
56576 248682 250412 252124 254219 256677 258647 259553 259998 261010 262837 265008 267246 269796 273024 277047 281605
56561 281605 286198 290622 295447 301539 308936 316736 324207 331394 338374 344727 350329 355975 362320 368582
56547 368582 373195 375618 376775 377753 378838 379878 380795 381336 380862 378901 375758 372224 368802 365428 361881
56532 361881 358145 354228 349823 344466 338194 331830 326296 321677 317344 313028 309329 306854 305198 303212
$$ packed form
56644B41805J586K162K715K906K727K297J612P45M1k17j60q1j15k93o07p51k00
56627B56172J035K120K286J736J171P87K28o09j329j495r99o2P88J026P39N85
56611B64179Q03P20j49j110j176n07o0n5J03N96Q35M77k09r72j691j893j189k23
56593B58479j06p67j036n95m87j231j801j301m39l56r12j212j037o98j43P70J554
56576B48682J730J712K095K458J970R06M45J012J827K171K238K550L228M023M558
56561B81605M593M424M825O092P397P800P471P187O980O353N602N646O345O262
56547C68582M613K423J157R78J085J040R17N41m74j961l143l534l422l374l547
56532C61881l736l917m405n357o272o364n534m619m333m316l699k475j656j986
$$ plain form
56518 303212 300166 296282 292201 288316 284665 281102 277417 273504 269603 266252 263833 262220 260980 259867
56504 259867 258985 258436 257969 257149 255864 254530 253709 253641 254173 254981 255719 256097 256113 256206 256990 258757 261221 263695
56486 263695 265428 265995 265576 264891 264678 265247 266567 268540 270956 273341 275202 276374 276927 276869 276285 275663 275700
56469 275700 276736 278593 280823 282809 283794 283326 281686 279579 277448 275496 274110 273621 273628 273297 272530 272200
56453 272200 272974 274490 276012 277259 278171 278401 277726 276659 276064 276246 276838 277465 278126 278997 280203 281747 283341
56436 283341 284370 284339 283411 282323 281688 281527 281466 281232 280855 280400 279687 278520 277190 276417 276552 277181 277874 278967
56418 278967 281020 283714 286022 287487 288600 289788 290745 291123 291218 291531 292088 292619 292995 293125 292824 292198 291848
56401 291848 292229 293034 293583 293652 293659 294202 295577 297441 298767 298531 296746 294545 293007 292276 292000 292111 292699 293525
$$ packed form
56518C03212l046l884m081l885l651l563l685l913l901l351k419j613j240j113
56504B59867q82n49m67q20j285j334q21o8N32Q08P38L78J6R3P84J767K464K474
56486B63695J733N67m19o85k13N69J320J973K416K385J861J172N53n8n84o22L7
56469B75700J036J857K230J986R85m68j640k107k131j952j386m89Pl31p67l30
56453B72200P74J516J522J247R12K30o75j067n95J82N92O27O61Q71J206J544J594
56436B83341J029l1r28j088o35j61o1k34l77m55p13j167j330p73J35O29O93J093
56418B78967K053K694K308J465J113J188R57L78R5L13N57N31L76J30l01o26l50
56401B91848L81Q05N49O9PN43J375J864J326k36j785k201j538p31k76J11N88Q26
$$ plain form
56383 293525 294172 294471 294436 294091 293732 294047 295446 297500 299471 301297 303601 306800 310566 314164 317099 319465
56367 319465 321802 324504 327330 329718 331611 333627 336253 339303 342325 345101 347443 348935 349282 348787 348189
56352 348189 348150 348866 349822 349943 348511 346016 343630 341828 340198 338593 337530 337207 337143 337215 338070 339885 341704
56335 341704 342783 343673 345081 346525 347240 347725 349165 351777 354850 358049 361522 365007 368052 370976 374450
56320 374450 378145 380902 382327 383163 384032 384810 385427 386316 387679 389132 390427 391970 394270 397313 400649
56305 400649 403698 405966 407412 408659 410455 412975 415952 419184 422442 425326 427872 430987 435464 440819
56291 440819 445908 450386 454709 459045 463262 467820 473472 480026 486537 492792 499499 506869 514244 521470
56277 521470 529430 538671 548470 557899 567072 576792 587644 599897 613628 628429 643572 658933 675253
$$ packed form
56383B93525O47K99l5l45l59L15J399K054J971J826K304L199L766L598K935K366
56367C19465K337K702K826K388J893K016K626L050L022K776K342J492L47m95n98
56352C48189l9P16R56J21j432k495k386j802j630j605j063l23o4P2Q55J815J819
56335C41704J079Q90J408J444P15M85J440K612L073L199L473L485L045K924L474
56320C74450L695K757J425Q36Q69P78O17Q89J363J453J295J543K300L043L336
56305D00649L049K268J446J247J796K520K977L232L258K884K546L115M477N355
56291D40819N089M478M323M336M217M558N652O554O511O255O707P370P375P226
56277E21470P960R241R799R429R173R720J0852J2253J3731J4801J5143J5361J6320
$$ plain form
56264 675253 693197 712762 733939 757274 783295 811950 843095 877158 914988 957477 1005568
56253 1005568 1060079 1121221 1188791 1263114 1345236 1435983 1535267 1642492 1756901 1877225 2001630
56242 2001630 2128401 2256125 2382840 2505612 2621279 2727066 2820141 2897327 2955870 2994169
56232 2994169 3011439 3007279 2982023 2937099 2874550 2796555 2705669 2605009 2497654 2386086 2272451
56221 2272451 2158889 2047230 1938707 1834267 1734818 1640901 1552519 1469575 1392200 1320453
56211 1320453 1254089 1192819 1136511 1085042 1038197 995703 957011 921301 888251 858577 833001
56200 833001 810850 790616 771867 755505 741969 730330 719529 709518 700688 693078 686565 680983
56188 680983 675622 669596 663187 657824 654182 651263 647937 644363 641195 638484 636300 635412 636245 637890 639231
$$ packed form
56264F75253J7944J9565K1177K3335K6021K8655L1145L4063L7830M2489M8091
56253A005568N4511O1142O7570P4323Q2122R0747R9284J07225J14409J20324J24405
56242B001630J26771J27724J26715J22772J15667J05787R3075P7186N8543L8299
56232B994169J7270m160k5256m4924o2549p7995r0886j00660j07355j11568j13635
56221B272451j13562j11659j08523j04440r9449r3917q8382q2944p7375p1747
56211A320453o6364o1270n6308n1469m6845m2494l8692l5710l3050k9674k5576
56200H33001k2151k0234j8749j6362j3536j1639j0801j0011q830p610o513n582
56188F80983n361o026o409n363l642k919l326l574l168k711k184q88Q33J645J341
$$ plain form
56173 639231 640447 642369 645028 647883 650932 654387 657712 660234 662479 665700 670156 674948 679564 684577
56159 684577 690662 697805 705731 714430 723948 734199 745256 757591 771861 788550 807716 828956
56147 828956 851932 877157 905991 939729 979108 1024936 1078606 1141520 1214427 1297546 1390576
56136 1390576 1491800 1597540 1703019 1803515 1894628 1972687 2036259 2087189 2129383 2166430
56126 2166430 2200307 2231278 2257882 2277302 2286960 2286145 2275928 2257991 2234144 2206425 2176310 2143283
56114 2143283 2104533 2056333 1995952 1922990 1839779 1750620 1660221 1572587 1490999 1418078 1355170
56103 1355170 1301982 1257360 1220295 1190000 1165526 1145847 1130130 1117667 1107859 1100517 1095729 1093196
56091 1093196 1092120 1092011 1093037 1095369 1098757 1103053 1108452 1114890 1121907 1129482 1138247 1148374 1158951 1168986
$$ packed form
56173F39231J216J922K659K855L049L455L325K522K245L221M456M792M616N013
56159F84577O085P143P926Q699R518J0251J1057J2335J4270J6689J9166K1240
56147H28956K2976K5225K8834L3738L9379M5828N3670O2914P2907Q3119R3030
56136A390576J01224J05740J05479J00496R1113P8059O3572N0930M2194L7047
56126B166430L3877L0971K6604J9420R658q15j0217j7937k3847k7719l0115l3027
56114B143283l8750m8200o0381p2962q3211q9159r0399q7634q1588p2921o2908
56103A355170n3188m4622l7065l0295k4474j9679j5717j2463r808p342m788k533
56091A093196j076j09J026K332L388M296N399O438P017P575Q765J0127J0577J0035
$$ plain form
56077 1168986 1178497 1188187 1198653 1210151 1222493 1234906 1246863 1259189 1273307 1289176 1305251 1320822
56065 1320822 1336915 1354253 1371909 1388980 1406025 1423591 1440689 1456300 1471350 1487549 1504965
56054 1504965 1522253 1538791 1555288 1572659 1591347 1611322 1631843 1651823 1671223 1691449 1713624
56043 1713624 1737343 1761838 1787210 1813583 1840302 1867214 1895592 1926463 1959067 1992237 2026193
56032 2026193 2061605 2098100 2135252 2174000 2215398 2258907 2303467 2349308 2397112 2446453 2496841
56021 2496841 2549354 2605448 2664960 2726953 2791640 2859689 2930578 3003405 3078491 3156509 3237027
56010 3237027 3319726 3405928 3496965 3592047 3689636 3789824 3893438 4000138 4109725 4224197
56000 4224197 4346124 4475983 4613236 4758698 4913432 5076698 5247703 5428155 5620406
$$ packed form
56077A168986R511R690J0466J1498J2342J2413J1957J2326J4118J5869J6075J5571
56065A320822J6093J7338J7656J7071J7045J7566J7098J5611J5050J6199J7416
56054A504965J7288J6538J6497J7371J8688J9975K0521J9980J9400K0226K2175
56043A713624K3719K4495K5372K6373K6719K6912K8378L0871L2604L3170L3956
56032B026193L5412L6495L7152L8748M1398M3509M4560M5841M7804M9341N0388
56021B496841N2513N6094N9512O1993O4687O8049P0889P2827P5086P8018Q0518
56010C237027Q2699Q6202R1037R5082R7589J00188J03614J06700J09587J14472
56000D224197J21927J29859J37253J45462J54734J63266J71005J80452J92251
$$ plain form
55991 5620406 5824439 6039600 6267947 6512765 6775043 7054679 7353916 7676144 8022459
55982 8022459 8392990 8790569 9219557 9682241 10180333 10719159 11306608 11948969 12651580
55973 12651580 13422533 14271996 15209455 16245989 17398133 18685892 20129694 21755005
55965 21755005 23599164 25710309 28144206 30970684 34284010 38203578 42867247 48426834
55957 48426834 55041369 62865088 72050142 82780149 95311928 109991456 127243900
55950 127243900 147549873 171392824 199162134 231013211 266623652 304725461 342508627
55943 342508627 375443995 398168953 406366214 398572846 376688700 344921429 308044140
55936 308044140 270061664 233711562 200550633 171247387 145892605 124264174 106001789
$$ packed form
55991E620406K04033K15161K28347K44818K62278K79636K99237L22228L46315
55982H022459L70531L97579M28988M62684M98092N38826N87449O42361P02611
55973A2651580P70953Q49463R37459J036534J152144J287759J443802J625311
55965B1755005J844159K111145K433897K826478L313326L919568M663669N559587
55957D8426834O614535P823719R185054J0730007J2531779J4679528J7252444
55950A27243900K0305973K3842951K7769310L1851077L5610441L8101809L7783166
55943C42508627L2935368K2724958Q197261p793368k1884146l1767271l6877289
55936C08044140l7982476l6350102l3160929k9303246k5354782k1628431j8262385
$$ plain form
55929 106001789 90690757 77905787 67248183 58365772 50950528 44735333 39499475
55922 39499475 35067570 31296726 28067773 25286240 22879955 20789028 18960547 17351785
55914 17351785 15930652 14669674 13543376 12531936 11622019 10802093 10060382 9387525 8776738
55905 8776738 8220467 7710578 7242194 6813465 6421131 6059974 5726785 5420840 5139866
55896 5139866 4879350 4636567 4411692 4204001 4010412 3828945 3660500 3505851 3363374
55887 3363374 3230957 3107996 2994370 2889217 2791305 2698887 2608875 2518042 2425545 2332907
55877 2332907 2241746 2153289 2069577 1992616 1922150 1856281 1794164 1735917 1680200 1624741 1569673
55866 1569673 1517825 1470998 1428115 1387567 1349105 1312674 1277496 1243276 1210526 1178937 1147171
$$ packed form
55929A06001789j5311032j2784970j0657604q882411p415244o215195n235858
55922C9499475m431905l770844l228953k781533k406285k090927j828481j608762
55914A7351785j421133j260978j126298j011440r09917q19926p41711o72857o10787
55905H776738n56271n09889m68384m28729l92334l61157l33189l05945k80974
55896E139866k60516k42783k24875k07691j93589j81467j68445j54649j42477
55887C363374j32417j22961j13626j05153r7912r2418r0012r0833r2497r2638
55877B332907r1161q8457q3712p6961p0466o5869o2117n8247n5717n5459n5068
55866A569673n1848m6827m2883m0548l8462l6431l5178l4220l2750l1589l1766
$$ plain form
55855 1147171 1115052 1084296 1056278 1030564 1006390 984007 963658 944542 925679 906689 887094
55844 887094 866047 843422 820200 797281 774973 753952 735350 719225 704139 688960 674083
55833 674083 660216 647020 633786 620663 608361 597067 586303 575609 565066 555304 546964 539781
55821 539781 532456 523919 514401 504744 495224 485939 477690 471177 465676 459782 453280 447136 441959 437787
55807 437787 435096 434448 435271 436531 438588 442716 448767 455086 460983 467383 474483 480557 483938 484673 483333
55792 483333 479610 473228 465189 456992 449324 442225 435793 429960 424240 418197 411552 403524 393135 380655
55778 380655 367834 356197 346001 337203 330319 325627 322632 321045 321305 323294 325464 326090 324663 321302
55764 321302 315766 308041 299155 290284 281556 272656 264122 257088 252083 248967 247737 248508 250882 254090
$$ packed form
55855A147171l2119l0756k8018k5714k4174k2383k0349j9116j8863j8990j9595
55844H87094k1047k2625k3222k2919k2308k1021j8602j6125j5086j5179j4877
55833F74083j3867j3196j3234j3123j2302j1294j0764j0694j0543r762q340p183
55821E39781p325q537r518r657r520r285q249o513n501n894o502o144n177m172
55807D37787k691o48Q23J260K057M128O051O319N897O400P100O074L381P35j340
55792D83333l723o382q039q197p668p099o432n833n720o043o645q028j0389j2480
55778C80655j2821j1637j0196q798o884m692k995j587K60J989K170O26j427l361
55764C21302n536p725q886q871q728q900q534p034n005l116j230P71K374L208
$$ plain form
55750 254090 257610 261011 263437 264002 262641 260058 256867 253248 249296 245167 240921 236650 232729 229635
55736 229635 227461 225809 224074 221780 218854 215761 213264 211898 211698 212210 212489 211328 208097 203429 198606
55721 198606 194321 190506 187214 184845 183414 182420 181670 181523 182085 182922 183892 185514 188094 191077 193650 195440
55705 195440 196364 196466 196203 196180 196147 194996 192190 188504 184847 181150 177001 172670 168699 165072 161564 158449
55689 158449 156115 154390 153009 152370 153046 154768 156690 158530 160796 163977 168034 172654 177480 182129 186359
55674 186359 190088 193010 194448 194048 192358 190324 188426 186635 184930 183373 181917 180618 179906 180247 181642
55659 181642 183680 185824 187498 188365 188924 190311 192994 196096 198542 200385 202274 204017 204620 203579 201296
55644 201296 198231 194474 190255 186064 181971 177460 172245 166706 161180 155361 148929 142471 137145 133407
$$ packed form
55750B54090L520L401K426N65j361k583l191l619l952m129m246m271l921l094
55736B29635k174j652j735k294k926l093k497j366k00N12K79j161l231m668m823
55721A98606m285l815l292k369j431r94p50j47N62Q37R70J622K580K983K573J790
55705A95440R24J02k63k3l3j151k806l686l657l697m149m331l971l627l508l115
55689A58449k334j725j381o39O76J722J922J840K266L181M057M620M826M649M230
55674A86359L729K922J438m00j690k034j898j791j705j557j456j299p12L41J395
55659A81642K038K144J674Q67N59J387K683L102K446J843J889J743O03j041k283
55644B01296l065l757m219m191m093m511n215n539n526n819o432o458n326l738
$$ plain form
55630 133407 130539 127631 124762 122855 122489 123197 124076 124626 124675 123828 121696 118710 116053 114514 113814 113224
55614 113224 112363 111139 109464 107482 105744 104730 104398 104418 104523 104359 103461 101851 100344 99782 100145 100738 100958
55597 100958 100520 99271 97347 95343 93833 92843 92100 91543 91178 90711 89884 89004 88591 88617 88612 88476 88614 89276
55579 89276 90190 90977 91562 92165 93160 94895 97289 99637 101207 102015 102726 103839 105325 106985 108681 110197
55563 110197 111267 111896 112330 112610 112458 111707 110620 109591 108677 107535 105812 103605 101559 100352 100019 99950
55547 99950 99646 99261 99200 99485 99792 99905 99824 99618 99503 99832 100636 101279 100924 99358 97099 94898 93410 93043
55529 93043 93630 94348 94494 94310 94542 95245 95578 94946 93819 93120 93158 93463 93442 92920 92098 91243 90496 89973 89947 90720
55509 90720 92182 93658 94388 94113 93092 91781 90671 90173 90273 90387 89924 88903 87719 86490 85079 83662
$$ packed form
55630A33407k868k908k869j907l66P08Q79N50M9q47k132k986k657j539p00n90
55614A13224q61j224j675j982j738j014l32K0J05j64q98j610j507n62L63N93K20
55597A00958m38j249j924k004j510r90p43n57l65m67q27q80m13K6nj36J38O62
55579H9276R14P87N85O03R95J735K394K348J570Q08P11J113J486J660J696J516
55563A10197J070O29M34K80j52p51j087j029r14j142j723k207k046j207l33o9
55547I9950l04l85o1K85L07J13q1k06j15L29Q04O43l55j566k259k201j488l67
55529I3043N87P18J46j84K32P03L33o32j127o99L8L05k1n22q22q55p47n23k6P73
55509I0720J462J476P30k75j021j311j110m98J00J14m63j021j184j229j411j417
$$ plain form
55493 83662 82701 82161 81239 79181 76196 73375 71761 71538 71939 71854 70673 68618 66300 64117 62212 60733
55477 60733 59769 59157 58795 59092 60633 63185 65461 66201 65372 64043 63152 62640 61883 60765 60065 60612 62305
55460 62305 64242 65789 67050 68209 68926 68791 68038 67329 67023 67117 67725 69107 71104 72982 73973 73863 73079
55443 73079 72389 72363 72891 73317 73233 72900 72672 72417 71955 71674 72005 72533 72424 71706 71303 71701 72344 72591 72563 72684
55423 72684 73024 73519 74309 75410 76463 77253 78118 79393 80815 81886 82513 82830 82754 82255 81831 82067 82790 83208
55405 83208 82920 82340 82079 82326 82891 83448 83610 83148 82266 81404 80649 79712 78575 77796 77798 78136 77867 76603 74912
55386 74912 73671 73311 73717 74582 75693 76948 78269 79443 80052 79672 78254 76238 74250 72768 72031 72030 72366
55369 72366 72318 71434 70100 69283 69607 70847 72310 73517 74429 75264 76239 77361 78346 78824 78708 78225 77618 77026
$$ packed form
55493H3662r61n40r22k058k985k821j614k23M01q5j181k055k318k183j905j479
55477F0733r64o12l62K97J541K552K276P40q29j329q91n12p57j118p00N47J693
55460F2305J937J547J261J159P17j35p53p09l06R4O08J382J997J878R91j10p84
55443G3079o90k6N28M26q4l33k28k55m62k81L31N28j09p18m03L98O43K47k8J21
55423G2684L40M95P90J101J053P90Q65J275J422J071O27L17p6m99m24K36P23M18
55405H3208k88n80k61K47N65N57J62m62q82q62p55r37j137p79KL38k69j264j691
55386G4912j241l60M06Q65J111J255J321J174O09l80j418k016j988j482p37jL36
55369G2366m8q84j334q17L24J240J463J207R12Q35R75J122R85M78j16m83o07n92
$$ plain form
55351 77026 76647 76679 77008 77258 77332 77592 78268 78991 79189 78700 77774 76779 76241 76793 78512 80455 81397 81122 80548
55332 80548 80609 81382 82365 83135 83546 83635 83500 83154 82452 81385 80425 80253 81061 82373 83605 84485 84880 84647 83878
55313 83878 83035 82481 82049 81345 80455 80024 80572 81846 82976 83260 82708 81812 80998 80465 80410 80988 81954 82691 82881
55294 82881 82845 82982 83173 83091 82828 82770 82997 83289 83593 83995 84271 84032 83405 83008 83089 83159 82737 82091 81847 82080 82132
55273 82132 81323 79727 78216 77698 78238 79046 79460 79713 80416 81546 82505 83066 83679 84719 85977 87003 87495
55256 87495 87220 86150 84898 84491 85321 86768 88146 89512 91152 92768 93751 93972 93731 93166 92274 91328 90690
55239 90690 90220 89419 88218 87147 86612 86395 86080 85708 85698 86245 86952 87161 86686 86164 86509 87864 89267 89535
55221 89535 88413 86700 85404 84997 85352 86013 86499 86600 86512 86594 86932 87249 87205 86674 85797 84922 84507 84843 85743
$$ packed form
55351G7026l79L2L29K50P4K60O76P23J98m89r26r95n38N52J719J943R42k75n74
55332H0548O1P73R83P70M11Q9j35l46p02j067r60j72Q08J312J232Q80L95k33p69
55313H3878q43n54m32p04q90m31N48J274J130K84n52q96q14n33n5N78R66P37J90
55294H2881l6J37J91q2k63n8K27K92L04M02K76k39o27l97Q1P0m22o46k44K33N2
55273H2132q09j596j511n18N40Q08M14K53P03J130R59N61O13J040J258J026M92
55256H7495k75j070j252m07Q30J447J378J366J640J616R83K21k41n65q92r46o38
55239I0690m70q01j201j071n35k17l15l72j0N47P07K09m75n22L45J355J403K68
55221H9535j122j713j296m07L55O61M86J01q8Q2L38L17m4n31q77q75m15L36R00
$$ plain form
55202 85743 86573 86693 85977 84961 84472 84934 85974 86813 87132 87388 88176 89491 90790 91628 91971 91978 91837 91749 91829
55183 91829 91928 91825 91636 91762 92306 92788 92645 91862 90920 90232 89867 89749 89826 89946 89840 89431 89009 88834 88656 87930
55163 87930 86621 85459 85194 85744 86394 86729 87024 87676 88641 89633 90619 91768 93062 94277 95369 96579 98023
55146 98023 99394 100194 100155 99329 97947 96418 95278 94799 94635 94148 93199 92265 91637 90879 89513 87962 87231
55129 87231 87657 88533 89113 89507 90272 91471 92565 93115 93228 93336 93685 94077 94041 93372 92455 91882 91778 91792 91753
55110 91753 91893 92347 92939 93623 94601 95753 96544 96923 97654 99152 100564 100821 100194 99916 100502 101332 101816 102034
55092 102034 102196 102336 102696 103677 105155 106517 107514 108396 109064 108908 107784 106419 105496 104959 104559 104419 104623
55075 104623 104940 105397 106508 108385 110236 111309 111836 112411 112892 112641 111546 110145 108932 108092 107641 107303
$$ packed form
55202H5743Q30J20p16j016m89M62J040Q39L19K56P88J315J299Q38L43Pj41q8Q0
55183I1829R9j03j89J26N44M82j43p83r42o88l65j18P7J20j06m09m22j75j78p26
55163H7930j309j162k65N50O50L35K95O52R65R92R86J149J294J215J092J210J444
55146I8023J371Q00l9q26j382j529j140m79j64m87r49r34o28p58j366j551p31
55129H7231M26Q76N80L94P65J199J094N50J13J08L49L92l6o69r17n73j04J4l9
55110I1753J40M54N92O84R78J152P91L79P31J498J412K57o27k78N86Q30M84K18
55092A02034J62J40L60R81J478J362R97Q82O68j56j124j365r23n37m00j40K04
55075A04623L17M57J111J877J851J073N27N75M81k51j095j401j213q40m51l38
$$ plain form
55059 107303 106506 105086 103780 103388 103601 103368 102364 101429 101431 102228 102929 102828 101905 100712 99859 99452 99012 98064
55041 98064 96706 95480 94874 95138 96272 97892 99367 100415 101357 102435 103194 103056 102307 101883 102209 102771 102963
55024 102963 102862 102983 103574 104389 105024 105328 105465 105531 105247 104340 103264 103013 103874 104833 104728 103685 102818 102691
55006 102691 102748 102245 101155 99986 99112 98506 97928 97314 97021 97493 98528 99196 98890 98192 98195 99204 100619 101906
54988 101906 103050 104069 104723 104887 104757 104626 104773 105533 106972 108521 109425 109588 109558 109688 109837 109872 109904 110007
54970 110007 110242 110944 112349 113902 114676 114655 114862 115948 117382 118426 119094 119612 119664 118971 118129 117978 118380 118412
54952 118412 117682 116688 115836 114827 113335 111743 110833 110944 111721 112562 113109 113372 113538 113730 113956 114216 114558 114954
54934 114954 115277 115484 115725 116136 116631 117055 117517 118406 120051 122483 125527 129029 132873 136897 140905 144858
$$ packed form
55059A07303p97j420j306l92K13k33j004r35KP97P01j01r23j193q53m07m40r48
55041I8064j358j226o06K64J134J620J475J048R42J078P59j38p49m24L26N62J92
55024A02963j01J21N91Q15O35L04J37O6k84r07j076k51Q61R59j05j043q67j27
55006A02691N7n03j090j169q74o06n78o14k93M72J035O68l06o98LJ009J415J287
54988A01906J144J019O54J64j30j31J47P60J439J549R04J63l0J30J49L5L2J03
54970A10007K35P02J405J553P74k1K07J086J434J044O68N18N2o93q42j51M02L2
54952A18412p30r94q52j009j492j592r10J11P77Q41N47K63J66J92K26K60L42L96
54934A14954L23K07K41M11M95M24M62Q89J645K432L044L502L844M024M008L953
$$ plain form
54918 144858 148950 153353 157943 162406 166502 169912 171881 171539 168892 165079 161242 157434 153088 148252
54904 148252 143659 139687 135977 132240 128793 126040 123920 122178 120803 119825 119031 118219 117549 117316 117546 118022
54888 118022 118560 119064 119520 120147 121381 123457 126107 128815 131320 133760 136474 139763 143743 148294 153200
54873 153200 158254 163117 167169 169754 170575 169697 167325 163934 160387 157294 154231 150214 145133 140116 136286
54858 136286 133771 132151 131140 130313 128896 126638 124482 123549 123646 123525 122473 120865 119151 117189 114864
54843 114864 112741 111560 111385 111620 111694 111489 111182 110897 110574 110125 109626 109224 108864 108368 107890 107943 108670 109410 109466
54824 109466 109103 109244 110243 111541 112561 113302 113856 113985 113610 113261 113509 114213 114823 115258 115970 117189 118595
54807 118595 119855 120995 122033 122611 122364 121510 120708 120339 120237 120155 120204 120665 121534 122520 123443 124430 125612 126738
$$ packed form
54918A44858M092M403M590M463M096L410J969l42k647l813l837l808m346m836
54904A48252m593l972l710l737l447k753k120j742j375r78p94q12o70k33K30M76
54888A18022N38N04M56O27J234K076K650K708K505K440K714L289L980M551M906
54873A53200N054M863M052K585Q21q78k372l391l547l093l063m017n081n017l830
54858A36286k515j620j011q27j417k258k156r33R7j21j052j608j714j962k325
54843A14864k123j181j75K35P4k05l07k85l23m49m99m02l60m96m78N3P27P40N6
54824A09466l63J41R99J298J020P41N54J29l75l49K48P04O10M35P12J219J406
54807A18595J260J140J038N78k47q54q02l69j02q2M9M61Q69R86R23R87J182J126
$$ plain form
54789 126738 127223 126628 125112 123405 122277 122037 122573 123772 125702 128282 131010 133247 134673 135347 135513 135603
54773 135603 136266 137972 140533 143341 146148 149263 152940 156921 160817 164614 168494 172359 175852 178746
54759 178746 180993 182448 182794 181825 179601 176309 172128 167339 162396 157777 153715 150158 146999 144290 142134
54744 142134 140401 138767 137125 135764 134954 134510 134102 133843 134134 134926 135609 135849 136106 137013 138537 140130 141548
54727 141548 143140 145349 148235 151524 154933 158373 161911 165622 169394 172901 175750 177609 178256 177656 175966
54712 175966 173328 169694 165132 160251 155973 152716 150075 147426 144660 142172 140356 139305 138800 138442 138005
54697 138005 137743 138058 138715 138788 137703 136054 135008 135019 135467 135448 134630 133404 132441 132062 131943 131535 130830 130406
54679 130406 130542 130668 130028 128574 126835 125211 123853 123020 122984 123654 124693 125928 127222 128148 128293 127778 126950
$$ packed form
54789A26738M85n95j516j707j128k40N36J199J930K580K728K237J426O74J66R0
54773A35603O63J706K561K808K807L115L677L981L896L797L880L865L493K894
54759A78746K247J455L46r69k224l292m181m789m943m619m062l557l159k709k156
54744A42134j733j634j642j361q10m44m08k59K91P92O83K40K57R07J524J593J418
54727A41548J592K209K886L289L409L440L538L711L772L507K849J859O47o00j690
54712A75966k638l634m562m881m278l257k641k649k766k488j816j051n05l58m37
54697A38005k62L15O57P3j085j649j046J1M48j9q18j226r63l79j19m08p05m24
54679A30406J36J26o40j454j739j624j358q33l6O70J039J235J294R26J45n15q28
$$ plain form
54662 126950 125724 123852 121820 120696 120858 121555 121975 122086 122081 121690 120655 119440 118808 118902 119279 119721 120439 121555
54644 121555 122879 124244 125624 126866 127702 128130 128367 128305 127425 125598 123674 122821 123329 124370 124921 124601 123620
54627 123620 122310 121003 120046 119563 119289 119005 119077 120122 122040 123820 124583 124466 124130 123734 123003 122139 121989
54610 121989 123022 124637 125854 126439 126933 127756 128695 129308 129460 129309 129031 128730 128460 128080 127240 125811 124304
54593 124304 123551 123847 124671 125425 126141 127156 128358 129267 129824 130562 131753 132826 132945 131968 130559 129507 129167
54576 129167 129405 129802 129996 129998 130140 130598 131109 131322 131245 131144 131153 131278 131698 132692 134190 135599 136222 135853 134984 134437
54556 134437 134682 135469 136208 136682 137124 137593 137722 137380 137223 138078 139861 141534 142226 142162 142396 143736 145933 147853
54538 147853 148507 147942 147012 146395 146195 146473 147429 148740 149371 148772 147842 147893 148825 149112 147659 145020 142675 141648
$$ packed form
54662A26950j226j872k032j124J62O97M20J11nl91j035j215o32R4L77M42P18J116
54644A21555J324J365J380J242Q36M28K37o2q80j827j924q53N08J041N51l20r81
54627A23620j310j307r57m83k74k84P2J045J918J780P63j17l36l96p31q64j50
54610A21989J033J615J217N85M94Q23R39O13J52j51k78l01k70l80q40j429j507
54593A24304p53K96Q24P54P16J015J202R09N57P38J191J073J19r77j409j052l40
54576A29167K38L97J94KJ42M58N11K13p7j01RJ25M20R94J498J409O23l69q69n47
54556A34437K45P87P39M74M42M69J29l42j57Q55J783J673O92o4K34J340K197J920
54538A47853O54n65r30o17k00K78R56J311O31n99r30N1R32K87j453k639k345j027
$$ plain form
54520 141648 141941 142734 142986 142326 141465 141304 141655 141433 140220 138893 138497 139123 140262 141515 142420 142182 140404
54503 140404 137829 135716 134575 134018 133672 133618 133978 134649 135584 136868 138326 139423 139801 139722 139747 140113 140589 140927
54485 140927 141289 142122 143627 145374 146560 146713 146111 145557 145761 146864 148350 149426 149683 149530 149827 151062
54469 151062 152957 154833 156161 156713 156560 156131 156064 156655 157496 157845 157363 156397 155625 155510 155971 156451 156401 155836
54451 155836 155330 155279 155252 154367 152355 150019 148492 148126 148334 148452 148391 148345 148191 147657 146971 146777 147275 147917 148190
54432 148190 148262 148497 148805 149001 149383 150247 151060 150946 150007 149380 149810 150806 151462 151495 151215 151030 151360 152503 154168
54413 154168 155520 156082 156212 156373 156387 155875 155081 154746 155361 156941 159231 161611 163095 163051 161921 160822 160496
54396 160496 160925 161797 162835 163786 164495 165058 165620 166089 166239 165907 164877 162909 160350 158334 157784 158310 158754
$$ packed form
54520A41648K93P93K52o60q61j61L51k22j213j327l96O26J139J253R05k38j778
54503A40404k575k113j141n57l46n4L60O71R35J284J458J097L78p9K5L66M76L38
54485A40927L62Q33J505J747J186J53o02n54K04J103J486J076K57j53K97J235
54469A51062J895J876J328N52j53m29o7N91Q41L49m82r66p72j15M61M80n0n65
54451A55836n06n1k7q85k012k336j527l66K08J18o1m6j54n34o86j94M98O42K73
54432A48190P2K35L08J96L82Q64Q13j14r39o27M30R96O56L3k80j85L30J143J665
54413A54168J352N62J30J61J4n12p94l35O15J580K290K380J484m4j130j099l26
54396A60496M29Q72J038R51P09N63N62M69J50l32j030j968k559k016n50N26M44
$$ plain form
54379 158754 158709 158778 159367 160007 160184 160170 160607 161737 163405 165428 167587 169552 171238 172994 175097 177303 179313
54362 179313 181482 184554 188659 192935 196270 198222 199091 199309 198924 197662 195440 192693 190092 187893 185691
54347 185691 182909 179444 175749 172410 169775 167816 166161 164299 162044 159840 158429 158112 158469 158824 158813
54332 158813 158446 157902 157495 157609 158263 158812 158481 157328 156335 156373 157335 158473 159267 159631 159531 158924 158013 157171
54314 157171 156523 155943 155446 155260 155438 155662 155521 154719 153116 150956 149092 148482 149200 150310 150926 151078 151344
54297 151344 151996 152774 153241 153093 152427 151897 152303 153717 155278 156107 156111 155640 154855 153909 153355 153709 154751 155781
54279 155781 156452 156883 157148 157258 157579 158567 160000 161032 161164 160764 160456 160453 160638 160913 161239 161602 162089 162787 163561
54260 163561 164246 165067 166454 168334 170024 171050 171696 172465 173287 173615 173130 172096 171031 170226 169563 168791 167964
$$ packed form
54379A58754m5O9N89O40J77j4M37J130J668K023K159J965J686J756K103K206K010
54362A79313K169L072M105M276L335J952Q69K18l85j262k222k747k601k199k202
54347A85691k782l465l695l339k635j959j655j862k255k204j411l17L57L55j1
54332A58813l67n44m07J14O54N49l31j153r93L8R62J138P94L64j00o07r11q42
54314A57171o48n80m97j86J78K24j41q02j603k160j864o10P18J110O16J52K66
54297A51344O52P78M67j48o66n30M06J414J561Q29Mm71p85r46n54L54J042J030
54279A55781O71M31K65J10L21R88J433J032J32m00l08lJ85K75L26L63M87O98P74
54260A63561O85Q21J387J880J690J026O46P69Q22L28m85j034j065q05o63p72q27
$$ plain form
54243 167964 167476 167512 167635 167257 166389 165551 164947 164244 163213 162073 161057 160100 159229 158792 159002 159634 160500 161759
54225 161759 163354 164539 164597 163870 163450 163834 164380 164165 163009 161520 160452 160145 160399 160690 160551 159862 158826
54208 158826 157748 156856 156168 155442 154477 153498 153024 153159 153355 153158 152879 153093 153748 154315 154703 155343 156350 157254
54190 157254 157800 158380 159285 160010 159843 158823 157574 156418 155217 154040 153421 153843 155317 157564 160212 162724
54174 162724 164544 165584 166300 167124 168032 168850 169636 170449 171029 171123 170955 170963 171069 170619 169143 166910 164709 163305
54156 163305 163099 163899 164905 165230 164695 163905 163469 163408 163506 163830 164541 165314 165398 164344 162508 160746 159755 159628
54138 159628 159886 159926 159533 159005 158796 159093 159755 160513 161175 161683 162039 162111 161675 160896 160664 161943 164601 167283
54120 167283 168752 169043 169030 169275 169765 170491 171646 173229 174901 176327 177348 177894 178045 178141 178470 178856 178963
$$ packed form
54243A67964m88L6J23l78q68q38o04p03j031j140j016r57q71m37K10O32Q66J259
54225A61759J595J185N8p27m20L84N46k15j156j489j068l07K54K91j39o89j036
54208A58826j078q92o88p26r65r79m74J35J96j97k79K14O55N67L88O40J007R04
54190A57254N46N80R05P25j67j020j249j156j201j177o19M22J474K247K648K512
54174A62724J820J040P16Q24R08Q18P86Q13N80R4j68QJ06m50j476k233k201j404
54156A63305k06Q00J006L25n35p90m36o1R8L24P11P73Q4j054j836j762r91j27
54138A59628K58M0l93n28k09K97O62P58O62N08L56P2m36p79k32J279K658K682
54120A67283J469K91j3K45M90P26J155J583J672J426J021N46J51R6L29L86J07
$$ plain form
54103 178963 178982 179552 180879 182376 183460 184398 186124 189376 194201 200122 206565 213080 219230 224279 227254
54088 227254 227519 225228 221036 215541 209310 203269 198433 195138 192907 191203 189927 189077 188382 187657 187179
54073 187179 187365 188254 189590 191279 193451 196122 199044 201950 204866 208026 211369 214087 214953 213468 210560
54058 210560 207765 205686 203671 201072 198284 196218 195138 194496 193739 192907 192475 192867 194125 195871 197584
54043 197584 199093 200811 203396 207125 211581 215961 219819 223543 227906 233026 238040 242117 245506 249073
54029 249073 252957 256356 258676 260225 261622 263150 264996 267423 270221 272466 273433 273420 273166 272795 271904 270404
54013 270404 268544 266198 262832 258331 253373 248779 244832 241348 238078 234848 231538 228172 224972 222214
53999 222214 220002 218162 216343 214323 212292 210652 209499 208487 207334 206190 205350 204790 204254 203583 202757
$$ packed form
54103A78963J9N70J327J497J084R38J726L252M825N921O443O515O150N049K975
54088B27254K65k291m192n495o231o041m836l295k231j704j276q50o95p25m78
54073A87179J86Q89J336J689K172K671K922K906K916L160L343K718Q66j485k908
54058B10560k795k079k015k599k788k066j080o42p57q32m32L92J258J746J713
54043A97584J509J718K585L729M456M380L858L724M363N120N014M077L389L567
54029B49073L884L399K320J549J397J528J846K427K798K245R67j3k54l71q91j500
54013B70404j860k346l366m501m958m594l947l484l270l230l310l366l200k758
53999B22214k212j840j819k020k031j640j153j012j153j144q40n60n36o71q26
$$ plain form
53984 202757 201777 200781 200062 199734 199554 199306 199174 199381 199681 199578 198965 198181 197538 197128 197003 197204 197662 198397 199747
53965 199747 202060 205205 208743 212605 217272 223250 230545 238643 246849 254875 263379 273619 286000 298973
53951 298973 309865 316737 319049 316854 310374 300711 290145 280936 273991 268985 265415 263064 261752 261284
53937 261284 261717 263305 266038 269447 272896 275894 278196 279827 281098 282403 283875 285289 286383 287208 288151
53922 288151 289602 291733 294565 298143 302504 307509 312874 318361 323848 329215 334409 339631 345145 350680
53908 350680 355277 358036 358958 358868 358641 358703 359066 359439 359279 358098 355836 352845 349537 346161 342794 339276
53892 339276 335228 330344 324627 318206 311138 303654 296361 289756 283640 277518 271564 266670 263368 261099
53878 261099 258759 255709 252105 248528 245451 242890 240455 237858 235331 233279 231629 229955 228230 226844
$$ packed form
53984B02757r80r96p19l28j80k48j32K07L00j03o13p84o43m10j25K01M58P35J350
53965A99747K313L145L538L862M667N978P295Q098Q206Q026Q504J0240J2381J2973
53951B98973J0892O872K312k195o480r663j0566r209o945n006l570k351j312m68
53937B61284M33J588K733L409L449K998K302J631J271J305J472J414J094Q25R43
53922B88151J451K131K832L578M361N005N365N487N487N367N194N222N514N535
53908C50680M597K759R22r0k27O2L63L73j60j181k262k991l308l376l367l518
53892C39276m048m884n717o421p068p484p293o605o116o122n954m894l302k269
53878B61099k340l050l604l577l077k561k435k597k527k052j650j674j725j386
$$ plain form
53864 226844 225698 223871 220673 216721 213485 211847 211466 211453 211297 211096 211165 211573 212034 212204 212070 211951 212096
53847 212096 212380 212400 211760 210274 208143 205920 204118 202740 201410 199992 198853 198434 198773 199551 200389 201036
53831 201036 201512 202169 203388 205085 206762 208096 209185 210049 210281 209557 208306 207507 207818 209044 210418 211228
53815 211228 211276 210933 210813 211372 212772 214972 217742 220669 223451 226183 229070 231913 234288 236285 238622
53800 238622 241859 245881 250317 255021 259861 264467 268567 272285 275792 278992 281844 284641 287508 289936
53786 289936 291353 291932 292306 292579 292143 290469 287623 284004 279934 275580 270992 266205 261497 257324 253732
53771 253732 250122 246108 242367 239978 238932 237995 236165 233647 231194 229100 227263 225718 224577 223625 222410
53756 222410 220676 218509 216212 214223 212912 212227 211711 211104 210719 210934 211530 211867 211649 211125 210660 210452 210692
$$ packed form
53864B26844j146j827l198l952l236j638l81j3j56k01O9M08M61J70j34j19J45
53847B12096K84K0o40j486k131k223j802j378j330j418j139m19L39P78Q38O47
53831B01036M76O57J219J697J677J334J089Q64K32p24j251p99L11J226J374Q10
53815B11228M8l43j20N59J400K200K770K927K782K732K887K843K375J997K337
53800B38622L237M022M436M704M840M606M100L718L507L200K852K797K867K428
53786B89936J417N79L74K73m36j674k846l619m070m354m588m787m708m173l592
53771B53732l610m014l741k389j046r37j830k518k453k094j837j545j141r52j215
53756B22410j734k167k297j989j311o85n16o07l85K15N96L37k18n24m65k08K40
$$ plain form
53739 210692 211507 212558 213069 212626 211815 211725 212847 214683 216427 217786 218990 220261 221549 222750 223912 225101
53723 225101 226256 227334 228549 230194 232144 233697 234151 233579 232896 233041 234141 235575 236772 237841 239425
53708 239425 242116 245988 250464 254526 257342 258975 260388 262570 265679 269086 272065 274282 275942 277832
53694 277832 280910 285317 289891 293220 295138 296573 297978 298739 298391 297539 296979 296534 295545 294108 292982 292440
53678 292440 291962 291107 290058 289158 288448 287807 287176 286497 285694 284809 283958 283231 282876 283366 284846 286587 287553 287520
53660 287520 287211 287299 287748 288199 288423 288231 287489 286500 285879 285738 285440 284559 283668 283697 284798 286344 287878 289545
53642 289545 291631 294120 296756 299192 300989 301848 302075 302597 304233 306871 309468 310975 311328 311539 312796
53627 312796 315461 318944 322453 325726 329093 333039 337767 343037 348367 353449 358356 363247 367999 372309
$$ packed form
53739B10692Q15J051N11m43q11r0J122J836J744J359J204J271J288J201J162J189
53723B25101J155J078J215J645J950J553M54n72o83J45J100J434J197J069J584
53708B39425K691L872M476M062K816J633J413K182L109L407K979K217J660J890
53694B77832L078M407M574L329J918J435J405P61l48q52n60m45r89j437j126n42
53678B92440m78q55j049r00p10o41o31o79q03q85q51p27l55M90J480J741R66l3
53660B87520l09Q8M49M51K24j92p42r89o21j41k98q81q91K9J101J546J534J667
53642B89545K086K489K636K436J797Q59K27N22J636K638K597J507L53K11J257
53627C12796K665L483L509L273L367L946M728N270N330N082M907M891M752M310
$$ plain form
53613 372309 376126 379608 382675 384932 386228 387061 388263 390420 393596 397387 401098 404174 406631 408937
53599 408937 411375 413724 415626 416984 417850 418254 418380 418632 419283 420196 421081 421789 422139 421736 420304 418022 415278
53582 415278 412256 409026 405831 402939 400333 397873 395632 393760 392159 390624 389204 388049 387001 385740
53568 385740 384303 383062 382102 380999 379342 377235 375227 373912 373598 374129 375027 375993 377147 378566 379805
53553 379805 380338 380334 380414 380672 380610 380201 380322 381667 383762 385613 386964 388367 390225 392394 394705 397355 400630
53536 400630 404610 409253 414530 420339 426460 432657 438766 444776 451013 458117 466510 475927 485753 495882
53522 495882 506904 519336 532997 547287 561830 576607 591662 607024 622850 639425 657036
53511 657036 675983 696599 718963 742585 766652 790726 815004 839772 864806 889508 913503
$$ packed form
53613C72309L817L482L067K257J296Q33J202K157L176L791L711L076K457K306
53599D08937K438K349J902J358Q66M04J26K52O51R13Q85P08L50m03j432k282k744
53582D15278l022l230l195k892k606k460k241j872j601j535j420j155j048j261
53568C85740j437j241r60j103j657k107k008j315l14N31Q98R66J154J419J239
53553C79805N33mQ0K58o2m09J21J345K095J851J351J403J858K169K311K650L275
53536D00630L980M643N277N809O121O197O109O010O237P104Q393R417R826J0129
53522D95882J1022J2432J3661J4290J4543J4777J5055J5362J5826J6575J7611
53511F57036J8947K0616K2364K3622K4067K4074K4278K4768K5034K4702K3995
$$ plain form
53500 913503 936818 959550 981651 1003158 1024359 1045567 1066820 1087947 1108765 1129062 1148567
53489 1148567 1167272 1185705 1204510 1223678 1242512 1260540 1278149 1295990 1314009 1331518 1348184
53478 1348184 1364475 1380915 1397254 1412726 1426954 1440139 1452298 1462677 1470286 1474902 1477254 1478094
53466 1478094 1477302 1474054 1467714 1458369 1446513 1432623 1417206 1401072 1385131 1369780 1354629 1338912
53454 1338912 1322090 1304013 1284673 1264041 1242210 1219589 1196889 1174877 1154045 1134340 1115176
53443 1115176 1095942 1076659 1058101 1041108 1025857 1012078 999898 990030 982855 977656 973261 969324
53431 969324 966528 965506 966058 967647 970144 973667 978070 983213 989614 998150 1008913 1020861 1032936 1045262
53417 1045262 1058952 1074954 1093373 1113699 1135342 1157970 1181626 1206574 1232895 1260297 1288485
$$ packed form
53500I13503K3315K2732K2101K1507K1201K1208K1253K1127K0818K0297J9505
53489A148567J8705J8433J8805J9168J8834J8028J7609J7841J8019J7509J6666
53478A348184J6291J6440J6339J5472J4228J3185J2159J0379P609M616K352Q40
53466A478094p92l248o340r345j1856j3890j5417j6134j5941j5351j5151j5717
53454A338912j6822j8077j9340k0632k1831k2621k2700k2012k0832j9705j9164
53443A115176j9234j9283j8558j6993j5251j3779j2180r868p175n199m395l937
53431I69324k796j022N52J589K497L523M403N143O401Q536J0763J1948J2075J2326
53417A045262J3690J6002J8419K0326K1643K2628K3656K4948K6321K7402K8188
$$ plain form
53406 1288485 1317619 1348158 1380325 1414030 1449298 1486441 1525751 1567386 1611677 1659083 1709477
53395 1709477 1761749 1814652 1868005 1922592 1978887 2036282 2093796 2151096 2208460 2265923 2322895
53384 2322895 2378568 2432295 2483544 2531939 2577641 2621430 2663915 2704647 2742254 2775470 2803820
53373 2803820 2827339 2846045 2859961 2869350 2874493 2875216 2870889 2860861 2844651 2821806 2792022 2755605
53361 2755605 2713512 2666757 2616027 2562135 2506494 2450603 2395115 2339867 2284923 2231052 2178880
53350 2178880 2128054 2077861 2028512 1981176 1936519 1893704 1851198 1808291 1765438 1723349 1682324
53339 1682324 1642565 1604538 1568610 1534612 1502149 1471260 1442478 1416332 1393052 1372649 1354873
53328 1354873 1339090 1324591 1311144 1298890 1287591 1276356 1264419 1251796 1238874 1225645 1211913
$$ packed form
53406A288485K9134L0539L2167L3705L5268L7143L9310M1635M4291M7406N0394
53395A709477N2272N2903N3353N4587N6295N7395N7514N7300N7364N7463N6972
53384B322895N5673N3727N1249M8395M5702M3789M2485M0732L7607L3216K8350
53373B803820K3519J8706J3916R389N143P23m327j0028j6210k2845k9784l6417
53361B755605m2093m6755n0730n3892n5641n5891n5488n5248n4944n3871n2172
53350B178880n0826n0193m9349m7336m4657m2815m2506m2907m2853m2089m1025
53339A682324l9759l8027l5928l3998l2463l0889k8782k6146k3280k0403j7776
53328A354873j5783j4499j3447j2254j1299j1235j1937j2623j2922j3229j3732
$$ plain form
53317 1211913 1198169 1185636 1175203 1166618 1158947 1151665 1145117 1140045 1136932 1135739 1136131 1137785 1140492
53304 1140492 1144048 1148247 1153101 1158968 1166342 1175538 1186643 1199591 1214130 1229908 1246897 1265668
53292 1265668 1286862 1310361 1335323 1361094 1387671 1415079 1442690 1469545 1495141 1519486 1542445
53281 1542445 1563467 1582103 1598501 1613161 1626249 1637302 1645579 1650627 1652498 1651407 1647312 1639917
53269 1639917 1629210 1615828 1600729 1584399 1566478 1546193 1523143 1497583 1470069 1441012 1410760
53258 1410760 1379962 1349478 1319754 1290476 1261056 1231326 1201529 1171869 1142477 1113799 1086452
53247 1086452 1060444 1034888 1008841 982262 955887 930311 905502 881150 857211 834059 812205
53236 812205 791852 772616 753832 735255 717342 700720 685574 671765 659303 648344 638744 629963
$$ packed form
53317A211913j3744j2533j0433q585p671p282o548n072l113j193L92J654K707
53304A140492L556M199M854N867P374R196J1105J2948J4539J5778J6989J8771
53292A265668K1194K3499K4962K5771K6577K7408K7611K6855K5596K4345K2959
53281A542445K1022J8636J6398J4660J3088J1053Q277N048J871j091m095p395
53269A639917j0707j3382j5099j6330j7921k0285k3050k5560k7514k9057l0252
53258A410760l0798l0484k9724k9278k9420k9730k9797k9660k9392k8678k7347
53247A086452k6008k5556k6047k6579k6375k5576k4809k4352k3939k3152k1854
53236H12205k0353j9236j8784j8577j7913j6622j5146j3809j2462j0959r600q781
$$ plain form
53224 629963 621484 613152 605034 597125 589112 580348 570209 558764 546938 535623 524648 513048 500392
53211 500392 487409 475177 464125 454121 445074 436961 429388 421721 413804 406305 400133 395488 391522
53198 391522 386919 380871 373555 365696 357767 349736 341464 333108 325074 317783 311547 306483 302438 299146
53184 299146 296464 294233 291947 289003 285457 282130 279690 277952 276379 274855 273480 271926 269704 266999
53170 266999 264583 262827 261419 260213 259658 259974 260441 260073 258788 257344 256298 255516 254709 253925 253291 252663
53154 252663 251831 250878 250057 249329 248290 246592 244337 241962 239882 238377 237730 238167 239484 240941 241837 242134
53138 242134 242275 242505 242697 242887 243477 244658 246017 247062 247890 248926 250164 251176 251859 252681 254068 255856
53122 255856 257538 258752 259392 259479 259162 258681 258166 257586 257001 256626 256481 256201 255428 254242 252976 251748 250540
$$ packed form
53224F29963q479q332q118p909q013q764j0139j1445j1826j1315j0975j1600j2656
53211E00392j2983j2232j1052j0004r047q113p573p667p917p499o172m645l966
53198C91522m603o048p316p859p929q031q272q356q034p291o236n064m045l292
53184B99146k682k231k286k944l546l327k440j738j573j524j375j554k222k705
53170B66999k416j756j408j206n55L16M67l68j285j444j046p82q07p84o34o28
53154B52663q32r53q21p28j039j698k255k375k080j505o47M37J317J457Q96K97
53138B42134J41K30J92J90N90J181J359J045Q28J036J238J012O83Q22J387J788
53122B55856J682J214O40Q7l17m81n15n80n85l75j45k80p73j186j266j228j208
$$ plain form
53105 250540 249563 249114 248986 248485 247287 245952 245238 245065 244587 243306 241783 241036 241453 242536 243582 244350 245060
53088 245060 245961 247035 247971 248352 247985 247157 246417 245947 245331 244154 242681 241632 241334 241517 241952 242836 244231
53071 244231 245470 245560 244168 241935 239867 238585 238096 237985 237764 237177 236267 235187 234076 233205 233012 233713 234894
53054 234894 235711 235546 234458 233127 232512 233308 235382 237790 239616 240767 241704 242561 243020 243009 242884 242720 242000
53037 242000 240442 238753 237975 238274 238857 239101 239213 239659 240351 240721 240410 239620 238820 238319 238187 238431 239101 240145
53019 240145 241328 242462 243717 245489 247826 250126 251623 252179 252441 253108 254124 254680 254066 252486 250965
53004 250965 250399 250798 251499 251952 252101 252091 252007 251927 251928 251846 251293 250163 248925 248171 247990 248061 248228 248672 249546 250708
52984 250708 251832 252572 252620 251936 250990 250567 251097 252312 253656 254911 256243 257701 258954 259681 260112 260949 262625
$$ packed form
53105B50540r77m49j28n01j198j335p14j73m78j281j523p47M17J083J046P68P10
53088B45060R01J074R36L81l67q28p40m70o16j177j473j049k98J83M35Q84J395
53071B44231J239R0j392k233k068j282m89j11k21n87r10j080j111q71j93P01J181
53054B34894Q17j65j088j331o15P96K074K408J826J151R37Q57M59j1j25j64p20
53037B42000j558j689p78K99N83K44J12M46O92L70l11p90q00n01j32K44O70J044
53019B40145J183J134J255J772K337K300J497N56K62O67J016N56o14j580j521
53004B50965n66L99P01M53J49j0q4q0Jq2n53j130j238p54j81P1J67M44Q74J162
52984B50708J124P40M8o84r46m23N30J215J344J255J332J458J253P27M31Q37J676
$$ plain form
52967 262625 264767 266546 267509 267876 268045 268057 267684 266827 265618 264244 262825 261439 260167 259107 258356 257898
52951 257898 257525 257017 256420 255921 255455 254721 253674 252592 251511 250049 248128 246490 245980 246558 247441 248052 248350
52934 248350 248447 248518 249006 250246 251800 252716 252620 252069 251681 251431 250974 250176 249068 247707 246355 245376 244753 244079
52916 244079 243304 242980 243431 244173 244659 245136 246175 247571 248375 247976 246692 245275 244294 243988 244298 244874 245266
52899 245266 245221 244751 244073 243637 243964 245155 246663 247807 248435 248823 249263 250060 251662 254208 257014 259022 259811
52882 259811 259790 259441 258865 258095 257304 256511 255496 254184 252867 251941 251706 252395 254027 256194 258394 260536 262656
52865 262656 264203 264356 263242 262099 261838 262078 262046 261726 261399 260637 258731 255986 253612 252222 251121 249299
52849 249299 246564 243477 240627 238279 236411 234843 233432 232287 231559 231095 230594 230094 229898 229949 229718 228955
$$ packed form
52967B62625K142J779R63L67J69J2l73q57j209j374j419j386j272j060p51m58
52951B57898l73n08n97m99m66p34j047j082j081j462j921j638n10N78Q83O11K98
52934B48350R7P1M88J240J554R16r6n51l88k50m57p98j108j361j352r79o23o74
52916B44079p75l24M51P42M86M77J039J396Q04l99j284j417r81l06L10N76L92
52899B45266m5m70o78m36L27J191J508J144O28L88M40P97J602K546K806K008P89
52882B59811k1l49n76p70p91p93j015j312j317r26k35O89J632K167K200K142K120
52865B62656J547J53j114j143k61K40l2l20l27p62j906k745k374j390j101j822
52849B49299k735l087k850k348j868j568j411j145p28m64n01n00j96N1k31p63
$$ plain form
52833 228955 228125 227764 227753 227630 227417 227655 228596 229756 230455 230526 230353 230303 230339 230248 230116 230373 231277 232567 233821
52814 233821 235029 236495 238166 239531 240336 241030 242210 243814 245138 245515 244709 242827 240207 237360 234764
52799 234764 232642 231046 229991 229282 228443 227163 225752 224735 224054 223087 221525 219818 218615 218165 218374 219050
52783 219050 219828 220298 220558 221295 222946 225054 226834 228085 229046 229606 229383 228605 228171 228526 228980 228507 226934
52766 226934 225010 223595 223063 223302 223848 224169 224108 224046 224450 225371 226630 228257 230329 232406 233664 233778 233360
52749 233360 233271 233699 234174 234337 234441 235079 236592 238735 240883 242580 243963 245571 247722 250169 252412 254158
52733 254158 255370 256066 256327 256409 256529 256549 256152 255347 254474 253660 252618 251264 250179 249994 250465 250630 249927 248779
52715 248779 247981 247881 248315 248894 249077 248346 246750 245079 244057 243538 242948 242385 242540 243437 244054 243637 242827 242802
$$ packed form
52833B28955q30l61j1j23k13K38R41J160O99P1j73n0L6r1j32K57R04J290J254
52814B33821J208J466J671J365Q05O94J180J604J324L77q06j882k620k847k596
52799B34764k122j596j055p09q39j280j411j017o81r67j562j707j203m50K09O76
52783B19050P78M70K60P37J651K108J780J251R61N60k23p78m34L55M54m73j573
52766B26934j924j415n32K39N46L21o1o2M04R21J259J627K072K077J258J14m18
52749B33360q9M28M75J63J04O38J513K143K148J697J383J608K151K447K243J746
52733B54158J212O96K61Q2J20K0l97q05q73q14j042j354j085j85M71J65p03j148
52715B48779p98j00M34N79J83p31j596j671j022n19n90n63J55Q97O17m17q10k5
$$ plain form
52697 242802 243621 244170 243722 242834 242523 243109 244164 245192 245946 246320 246384 246449 246820 247452 248005 248162 247737 246658
52679 246658 245162 243955 243782 244672 245890 246778 247423 248238 249092 249252 248285 246723 245606 245514 246256 247375 248625
52662 248625 249891 250967 251706 252275 252989 253963 255173 256786 259021 261550 263470 264183 264101 264106 264446 264547 263858
52645 263858 262441 260674 258792 256963 255454 254419 253702 253166 253014 253473 254255 254739 254743 254787 255463 256742 258109
52628 258109 259203 260148 261273 262704 264268 265655 266545 266607 265600 263687 261521 259736 258232 256328 253836
52613 253836 251657 250905 251545 252437 252720 252674 252982 253627 253924 253442 252494 251768 251786 252663 254137 255737 257065 257994
52595 257994 258607 259041 259459 260018 260672 261140 261234 261158 261295 261768 262396 263035 263751 264591 265312 265446 264677 263226 261914
52576 261914 261641 262660 264381 265912 266683 266616 265991 265344 265148 265306 265180 264308 262882 261306 259666 258018 256793
$$ packed form
52697B42802Q19N49m48q88l11N86J055J028P54L74O4O5L71O32N53J57m25j079
52679B46658j496j207j73Q90J218Q88O45Q15Q54J60r67j562j117r2P42J119J250
52662B48625J266J076P39N69P14R74J210J613K235K529J920P13q2NL40J01o89
52645B63858j417j767j882j829j509j035p17n36j52M59P82M84MM4O76J279J367
52628B58109J094R45J125J431J564J387Q90O2j007j913k166j785j504j904k492
52613B53836k179p52O40Q92K83m6L08O45K97m82r48p26J8Q77J474J600J328R29
52595B57994O13M34M18N59O54M68R4p6J37M73O28O39P16Q40P21J34p69j451j312
52576B61914k73J019J721J531P71o7o25o47j96J58j26q72j426j576j640j648j225
$$ plain form
52559 256793 256280 255956 255060 253761 253030 253310 253980 254318 254308 254260 254261 254358 254759 255454 256092 256495 256845 257120 256953 256455
52539 256455 256488 257517 258761 259201 258985 259068 259788 260634 261247 261770 262241 262422 262322 262253 262256 262076 261717 261433 261129 260451
52519 260451 259592 259339 260120 261590 263358 265448 267759 269737 271054 272081 273255 274452 275403 276292 277362
52504 277362 278325 278726 278671 278664 278836 278752 277850 275762 272518 268813 265853 264415 264149 264137 263896 263451 262799 261950 261340
52485 261340 261461 262107 262647 263109 264230 266244 268343 269716 270517 271357 272356 273253 274034 274787 275213 274956 274313
52468 274313 273981 274101 274185 274127 274562 275932 277816 279648 281597 284049 286517 287889 287778 286909 286012 284985 283470
52451 283470 281666 280065 278736 277438 276195 275202 274310 273144 271687 270245 268876 267378 265900 264951 264637
52436 264637 264394 263790 263112 262855 263009 263217 263267 263041 262231 260654 258770 257483 257417 258582 260599 262991 265339
$$ packed form
52559B56793n13l24q96j299p31K80O70L38j0m8JR7M01O95O38M03L50K75j67m98
52539B56455L3J029J244M40k16Q3P20Q46O13N23M71J81j00o9Lj80l59k84l04o78
52519B60451q59k53P81J470J768K090K311J978J317J027J174J197R51Q89J070
52504B77362R63M01n5pJ72q4r02k088l244l705k960j438k66j2k41m45o52q49o10
52485B61340J21O46N40M62J121K014K099J373Q01Q40R99Q97P81P53M26k57o43
52468B74313l32J20Q4n8M35J370J884J832J949K452K468J372j11q69q97j027j515
52451B83470j804j601j329j298j243r93q92j166j457j442j369j498j478r49l14
52436B64637k43o04o78k57J54K08N0k26q10j577j884j287o6J165K017K392K348
$$ plain form
52419 265339 267448 269396 271322 273297 275461 277997 280768 283329 285622 288393 292492 298030 304636 312240
52405 312240 320995 330538 339927 348284 354907 358779 358757 354651 347620 339255 330640 322455 315327 309465 304352
52390 304352 299421 294917 291612 289686 288376 286891 285371 284706 285541 287575 289864 291761 293531 295973 299418
52375 299418 303271 306559 308882 310693 312802 315680 319219 323030 326892 330864 334923 338632 341308 342530
52361 342530 342419 341494 340375 339519 338989 338503 337931 337646 338148 339422 341014 342683 344534 346430 347845 348601
52345 348601 349339 350826 353051 355412 357635 360062 363056 366509 370124 373945 378473 384227 391210 398862
52331 398862 406701 414968 424398 435317 447296 459794 472772 486395 500525 514955 529972 546174
52319 546174 563738 582175 600784 619051 636677 653598 670055 686427 702982 719953 737644
$$ packed form
52419B65339K109J948J926J975K164K536K771K561K293K771M099N538O606P604
52405C12240Q755R543R389Q357O623L872k2m106p031q365q615q185p128n862n113
52390C04352m931m504l305j926j310j485j520o65Q35K034K289J897J770K442L445
52375B99418L853L288K323J811K109K878L539L811L862L972M059L709K676J222
52361C42530j11r25j119q56n30m86n72k85N02J274J592J669J851J896J415P56
52345C48601P38J487K225K361K223K427K994L453L615L821M528N754O983P652
52331C98862P839Q267R430J0919J1979J2498J2978J3623J4130J4430J5017J6202
52319E46174J7564J8437J8609J8267J7626J6921J6457J6372J6555J6971J7691
$$ plain form
52308 737644 756058 774484 791990 808391 824310 840165 855568 869989 883495 896392 908449
52297 908449 919099 928244 936279 943197 948159 950279 949549 946734 942579 937507 931951 926447 921182 915789
52283 915789 909901 903736 897858 892517 887665 883561 880880 880024 880711 882492 885374 889623 895218 901883 909469
52268 909469 917936 927078 936655 946705 957328 968260 979125 990111 1001885 1014700 1028065 1041486
52256 1041486 1055082 1069140 1083420 1097291 1110292 1122187 1132663 1141426 1148523 1154213 1158426 1160685
52244 1160685 1160624 1158364 1154361 1149055 1142748 1135572 1127511 1118612 1109239 1099861 1090455 1080331 1068878 1056449
52230 1056449 1044281 1033480 1024256 1016191 1008958 1002488 996602 990889 985154 979774 975390 972283 970199
52217 970199 968747 967840 967747 968834 971249 974805 979155 984057 989369 994808 999959 1004692 1009350 1014237 1019078
$$ packed form
52308G37644J8414J8426J7506J6401J5919J5855J5403J4421J3506J2897J2057
52297I08449J0650R145Q035O918M962K120p30k815m155n072n556n504n265n393
52283I15789n888o165n878n341m852m104k681q56O87J781K882M249N595O665P586
52268I09469Q467R142R577J0050J0623J0932J0865J0986J1774J2815J3365J3421
52256A041486J3596J4058J4280J3871J3001J1895J0476Q763P097N690M213K259
52244A160685o1k260m003n306o307p176q061q899r373r378r406j0124j1453j2429
52230A056449j2168j0801r224q065p233o470n886n713n735n380m384l107k084
52217I70199j452r07r3J087K415L556M350M902N312N439N151M733M658M887M841
$$ plain form
52202 1019078 1023323 1026946 1030547 1034646 1039252 1044171 1049366 1054747 1059927 1064471 1068256 1071403 1074074 1076497
52188 1076497 1078924 1081189 1082463 1081818 1079147 1075284 1071174 1067027 1062320 1056475 1049494 1041965 1034520 1027398
52174 1027398 1020561 1014073 1008067 1002446 997002 991943 987860 984972 982840 981194 980573 981561 983653 985579
52160 985579 986749 987734 989206 991030 992687 994075 995437 996822 998084 999280 1000671 1002272 1003724 1004721 1005423
52145 1005423 1006325 1007670 1009033 1009651 1009266 1008505 1008190 1008339 1008195 1007251 1005845 1004662 1004130 1004605 1006715 1011038
52129 1011038 1017604 1026155 1036780 1049852 1065413 1083104 1102710 1124232 1147259 1170799 1194104 1217332
52117 1217332 1241031 1265207 1289287 1312814 1335756 1358187 1380149 1401795 1423133 1443487 1461710
52106 1461710 1477293 1490881 1503357 1514724 1524363 1532078 1538236 1542995 1546074 1547406 1547297 1545595 1541326
$$ packed form
52202A019078M245L623L601M099M606M919N195N381N180M544L785L147K671K423
52188A076497K427K265J274o45k671l863m110m147m707n845o981p529p445p122
52174A027398o837o488o006n621n444n059m083k888k132j646o21R88K092J926
52160I85579J170R85J472J824J657J388J362J385J262J196J391J601J452R97P02
52145A005423R02J345J363O18l85p61l15J49j44r44j406j183n32M75K110M323
52129A011038O566Q551J0625J3072J5561J7691J9606K1522K3027K3540K3305K3228
52117A217332K3699K4176K4080K3527K2942K2431K1962K1646K1338K0354J8223
52106A461710J5583J3588J2476J1367R639P715O158M759L079J332j09j702m269
$$ plain form
52093 1541326 1533658 1522810 1509581 1494405 1477503 1459641 1441935 1424921 1408491 1392774 1378406
52082 1378406 1365781 1354622 1344593 1335847 1328748 1323472 1320121 1318763 1319147 1320871 1324172 1329983 1338672
52069 1338672 1349179 1360000 1370752 1382182 1394917 1408845 1423568 1438684 1453617 1467839 1481466
$$ packed form
52093A541326p668j0848j3229j5176j6902j7862j7706j7014j6430j5717j4368
52082A378406j2625j1159j0029q746p099n276l351j358L84J724L301N811Q689
52069A338672J0507J0821J0752J1430J2735J3928J4723J5116J4933J4222J3627
$$ [...]
##END NTUPLES=NMR SPECTRUM
##END=
