
##TITLE=AC1302_PERAH12114_7525498_Bu7zzF2CVs
##JCAMPDX= 6.0         $$ Bruker NMR JCAMP-DX V2.0
##DATA TYPE= NMR SPECTRUM
##DATA CLASS= NTUPLES
##ORIGIN= BRUKER
##OWNER= Administrator
$$ 1.72 TOPSPIN		Version 2.1
$$ 2013-02-20 21:47:09.765 -0500  Administrator@X
$$ Compression mode = diff/dup
##.OBSERVE FREQUENCY= 400.02188249412
##.OBSERVE NUCLEUS= ^1H
##.ACQUISITION MODE= SIMULTANEOUS (DQD)
##.ACQUISITION SCHEME= undefined
##.AVERAGES= 64
##.DIGITISER RES= 22
##SPECTROMETER/DATA SYSTEM= spect
##.PULSE SEQUENCE= noesygpps1d.comp
##.SOLVENT NAME= COFFEE_meoh
##.SHIFT REFERENCE= INTERNAL, COFFEE_meoh, 1, 14.96115
##AUDIT TRAIL= $$ (NUMBER, WHEN, WHO, WHERE, PROCESS, VERSION, WHAT)
$$ ##TITLE= Audit trail, TOPSPIN		Version 2.1
$$ ##JCAMPDX= 5.01
$$ ##ORIGIN= Bruker BioSpin GmbH
$$ ##OWNER= Administrator
$$ $$ E:\/data/COFFEE/nmr/AC1302_PERAH12114_7525498_Bu7zzF2CVs/42/pdata/1/auditp.txt
$$ ##AUDIT TRAIL=  $$ (NUMBER, WHEN, WHO, WHERE, PROCESS, VERSION, WHAT)
(   1,<2013-02-20 21:47:03.781 -0500>,<Administrator>,<X>,<go>,<TOPSPIN 2.1>,
      <created by zg
	started at 2013-02-20 21:35:33.672 -0500,
	POWCHK enabled, PULCHK disabled,
       configuration hash MD5:
       86 BA 57 50 F2 9D 5C 9B 26 00 A9 28 5F 66 2E 89
       data hash MD5: 64K
       C8 62 A9 28 6E B6 34 58 BA 8B E5 2E 6D 4C 1D 74>)
(   2,<2013-02-20 21:47:06.875 -0500>,<Administrator>,<X>,<proc1d>,<TOPSPIN 2.1>,
      <Start of raw data processing
       efp LB = 0.3 FT_mod = 6 PKNL = 1 PHC0 = 0 PHC1 = 0 SI = 128K 
       data hash MD5: 128K
       30 13 20 96 8F E8 62 FA 42 9E CC 95 B7 60 41 7C>)
(   3,<2013-02-20 21:47:07.953 -0500>,<Administrator>,<X>,<proc1d>,<TOPSPIN 2.1>,
      <pk PHC0 = 250.4553 PHC1 = 0 
       data hash MD5: 128K
       D0 CD 34 D2 0E 93 D0 8A D1 52 E2 C6 9D E7 ED A3>)
(   4,<2013-02-20 21:47:08.718 -0500>,<Administrator>,<X>,<proc1d>,<TOPSPIN 2.1>,
      <abs ABSG = 1 
       data hash MD5: 128K
       7B 49 C1 73 18 80 B2 30 C4 25 79 DB D9 A1 62 14>)
(   5,<2013-02-20 21:47:08.890 -0500>,<Administrator>,<X>,<proc1d>,<TOPSPIN 2.1>,
      <abs ABSG = 2 
       data hash MD5: 128K
       65 ED 44 EB 3F 1C F2 20 56 AE BD A7 10 9A C9 BC>)
(   6,<2013-02-20 21:47:09.047 -0500>,<Administrator>,<X>,<proc1d>,<TOPSPIN 2.1>,
      <abs ABSG = 3 
       data hash MD5: 128K
       EF 24 64 C6 E7 B5 6F 29 14 7D BB D9 6F F4 3C 4D>)
(   7,<2013-02-20 21:47:09.250 -0500>,<Administrator>,<X>,<proc1d>,<TOPSPIN 2.1>,
      <abs ABSG = 4 
       data hash MD5: 128K
       D2 29 49 FF 7A 3C 1F C2 AC C3 7A 14 34 56 A1 7D>)
(   8,<2013-02-20 21:47:09.422 -0500>,<Administrator>,<X>,<proc1d>,<TOPSPIN 2.1>,
      <abs ABSG = 5 
       data hash MD5: 128K
       B3 2A 4E 65 77 FD 59 F6 7B 21 17 50 88 7B AD 39>)
$$ ##END=
$$ 
$$ $$ hash MD5
$$ $$ 3E 8B 5A C5 97 99 50 32 18 3E 20 F5 53 54 B4 5A
##$RELAX= 
##$RELAX= 
##$RELAX= 
##$RELAX= 
##$RELAX= 
##$RELAX= 
##$RELAX= 
##$RELAX= 
$$ Bruker specific parameters
$$ --------------------------
##$DU= <E:\>
##$EXPNO= 42
$$ [...]
150 150 150 150 150 150 150 150
##$TP07= 0
##$TPNAME0= <>
##$TPNAME1= <>
##$TPNAME2= <>
##$TPNAME3= <>
##$TPNAME4= <>
##$TPNAME5= <>
##$TPNAME6= <>
##$TPNAME7= <>
##$TPOAL= (0..7)
0.5 0.5 0.5 0.5 0.5 0.5 0.5 0.5
##$TPOFFS= (0..7)
0 0 0 0 0 0 0 0
##$TUNHIN= 0
##$TUNHOUT= 0
##$TUNXOUT= 0
##$USERA1= <user>
##$USERA2= <user>
##$USERA3= <user>
##$USERA4= <user>
##$USERA5= <user>
##$V9= 5
##$VALIST= <valist>
##$VCLIST= <CCCCCCCCCCCCCCC>
##$VD= 0
##$VDLIST= <DDDDDDDDDDDDDDD>
##$VPLIST= <PPPPPPPPPPPPPPP>
##$VTLIST= <TTTTTTTTTTTTTTT>
##$WBST= 1024
##$WBSW= 4
##$XGAIN= (0..3)
0 0 0 0
##$XL= 0
##$YL= 0
##$YMAX_a= 6037873
##$YMIN_a= -10587614
##$ZGOPTNS= <>
##$ZL1= 120
##$ZL2= 120
##$ZL3= 120
##$ZL4= 120
##$ABSF1= 14.96115
##$ABSF2= -5.597032
##$ABSG= 5
##$ABSL= 3
##$ALPHA= 0
##$AQORDER= 0
##$ASSFAC= 0
##$ASSFACI= 0
##$ASSFACX= 0
##$ASSWID= 0
##$AUNMP= <proc_prof1d_extract.lims>
##$AXLEFT= 0
##$AXNAME= <>
##$AXNUC= <1H>
##$AXRIGHT= 0
##$AXTYPE= 0
##$AXUNIT= <>
##$AZFE= 0.1
##$AZFW= 0.1
##$BCFW= 0
##$BC_mod= 0
##$BYTORDP= 0
##$COROFFS= 0
##$CY= 15
##$DATMOD= 1
##$DC= 0
##$DFILT= <>
##$DTYPP= 0
##$F1P= 0
##$F2P= 0
##$FCOR= 0.5
##$FTSIZE= 131072
##$FT_mod= 6
##$GAMMA= 0
##$GB= 0
##$INTBC= 1
##$INTSCL= 1
##$ISEN= 128
##$LB= 0.3
##$LEV0= 0
##$LPBIN= 0
##$MAXI= 10000
##$MC2= 0
##$MEAN= 0
##$ME_mod= 0
##$MI= 0
##$NCOEF= 0
##$NC_proc= -2
##$NLEV= 6
##$NOISF1= 0
##$NOISF2= 0
##$NSP= 0
##$NTH_PI= 0
##$NZP= 0
##$OFFSET= 14.96115
##$PC= 1
##$PHC0= 250.4553
##$PHC1= 0
##$PH_mod= 1
##$PKNL= yes
##$PPARMOD= 0
##$PPDIAG= 0
##$PPIPTYP= 0
##$PPMPNUM= 2147483647
##$PPRESOL= 1
##$PSCAL= 4
##$PSIGN= 0
##$PYNMP= <proc.py>
##$REVERSE= no
##$SF= 400.020009574973
##$SI= 131072
##$SIGF1= 0
##$SIGF2= 0
##$SINO= 400
##$SIOLD= 131072
##$SPECTYP= <>
##$SREGLST= <1H.CDCl3>
##$SSB= 0
##$STSI= 131072
##$STSR= 0
##$SW_p= 8223.68421052631
##$SYMM= 0
##$S_DEV= 0
##$TDeff= 65536
##$TDoff= 0
##$TI= <>
##$TILT= no
##$TM1= 0
##$TM2= 0
##$TOPLEV= 0
##$USERP1= <user>
##$USERP2= <user>
##$USERP3= <user>
##$USERP4= <user>
##$USERP5= <user>
##$WDW= 1
##$XDIM= 131072
##$YMAX_p= 407616743
##$YMIN_p= -12116
##$CURPLOT= <Network HP LaserJet P1505>
##$CURPRIN= <$Network HP LaserJet P1505>
##$DFORMAT= <normdp>
##$LAYOUT= <+/1D_H.xwp>
##$LFORMAT= <normlp>
##$PFORMAT= <normpl>
##$SURQMSG= 1
$$ End of Bruker specific parameters
$$ ---------------------------------
##NTUPLES= NMR SPECTRUM
##VAR_NAME=  FREQUENCY,     SPECTRUM/REAL,   SPECTRUM/IMAG
##SYMBOL=    X,             R,               I
##VAR_TYPE=  INDEPENDENT,   DEPENDENT,       DEPENDENT
##VAR_FORM=  AFFN,          ASDF,            ASDF
##VAR_DIM=   131072,        131072,          131072
##UNITS=     HZ,            ARBITRARY UNITS, ARBITRARY UNITS
##FACTOR=    0.0627417313425164, 1,          1
##FIRST=     8223.62146879497, 1484,         -63156
##LAST=      0,             3449,            -62974
##MIN=       0,             -12116,          0
##MAX=       8223.62146879497, 407616743,    0
$$ Real data points
##PAGE= N=1
##DATA TABLE= (X++(R..R)), XYDATA
$$ [...]
67918 103122 102686 102191 101932 101585 100770 99484 97912 96085 93987 91843 90013 88632 87574 86757 86214 85833
67902 85833 85293 84475 83758 83693 84440 85706 87096 88311 89111 89408 89481 89773 90398 91077 91641 92303 93197 93979 94243
67883 94243 94194 94469 95303 96177 96378 95676 94422 93229 92649 92909 93799 94877 95818 96439 96527 95947 94968 94128 93601
67864 93601 92997 91974 90799 90002 89676 89477 89204 89025 89096 89303 89497 89715 89980 90029 89485 88285 86786 85421
67846 85421 84339 83423 82552 81718 80846 79716 78224 76739 75949 76246 77282 78225 78407 77770 76850 76434 77122
67829 77122 78956 81429 83874 85953 87760 89496 91134 92455 93356 93995 94526 94820 94655 94186 93935 94148
67813 94148 94382 94052 93205 92415 91926 91350 90311 89023 87932 87038 85878 84125 81977 79973 78514 77593
67797 77593 76969 76595 76724 77367 77824 77221 75626 74172 73791 74173 74325 73865 73316 73331 74061 75268 76579 77574
67779 77574 77945 77686 77002 76061 75101 74649 75191 76538 77841 78425 78428 78477 78975 79853 80861 81857 82851 83894 84996
67760 84996 86181 87572 89293 91216 92945 94208 95125 95923 96542 96798 96780 96711 96491 95783 94642 93616 93061
67743 93061 92702 92099 91251 90419 89610 88588 87321 86086 85062 84062 82786 81252 79840 78879 78211 77270
67727 77270 75675 73679 71933 70895 70604 70923 71678 72541 73026 72780 71832 70517 69284 68465 68038 67671 67266
67710 67266 67345 68490 70375 71813 72009 71333 70665 70455 70763 71742 73394 75066 75878 75720 75302 75139 74953 74284
67692 74284 73238 72272 71553 70898 70284 70024 70350 70977 71258 70763 69737 68970 69195 70568 72674 74949 76997
67675 76997 78562 79401 79411 78892 78531 78883 79800 80509 80375 79541 78638 78026 77565 77102 76783 76717 76674 76425 76144 76147
67655 76147 76357 76380 76013 75387 74604 73614 72526 71705 71389 71452 71666 71998 72457 72859 72986 72918 72960 73258 73685 74131
67635 74131 74714 75599 76698 77727 78539 79219 79833 80229 80290 80281 80681 81580 82455 82687 82248 81746 81825 82605 83645
67616 83645 84381 84633 84737 85139 85876 86589 87021 87263 87452 87573 87725 88186 88831 88807 87391 85085 83271 82659
67598 82659 82590 82075 81027 80055 79414 78668 77328 75441 73526 72147 71587 71696 72013 72150 72104 72174 72620 73482
67580 73482 74672 76160 78002 80181 82255 83321 82685 80726 78814 78075 78464 79192 79758 80085 79969 79100
67564 79100 77736 76706 76430 76415 76086 75689 75897 76793 77829 78665 79426 80035 79937 78807 77118 75613 74435
67547 74435 73236 71983 71213 71427 72508 73870 74922 75378 75326 75126 75141 75440 75839 76165 76348 76283 75855 75214
67529 75214 74708 74464 74231 73856 73640 73974 74792 75717 76595 77502 78279 78499 78017 77211 76494 75891 75257 74632 74045
67510 74045 73222 71888 70340 69341 69358 70157 71236 72385 73642 74951 76071 76736 76710 75857 74448 73308 73200
67493 73200 73948 74475 73996 72899 72209 72338 72774 72910 72753 72702 72940 73294 73523 73524 73306 72874 72176 71153 69919
67474 69919 68835 68252 68214 68576 69295 70338 71381 72041 72431 73097 74248 75458 76314 76860 77074 76494 74953
67457 74953 73321 72810 73698 75287 76956 78583 80027 80953 81349 81611 81912 82056 82081 82378 82976 83418 83692 84592
67439 84592 86549 88720 89980 90449 91212 92648 93868 93929 92954 91820 91180 90990 90685 89584 87455 84838
67423 84838 82681 81557 81399 81920 82938 84180 85181 85643 85699 85614 85399 84931 84264 83549 82732 81612 80242
67406 80242 79077 78608 78884 79501 80052 80509 81136 82048 83020 83765 84248 84540 84505 83959 83141 82709 83056 83846 84490
67387 84490 84909 85511 86433 87206 87376 87179 87285 87946 88675 88799 88089 86776 85309 84325 84572 86313 88743 90369
67369 90369 90263 88842 87297 86427 86176 86086 85878 85607 85540 86043 87373 89346 91178 91919 91284 90072 89494 89935
67351 89935 90603 90626 90234 90418 91493 92610 92861 92362 91925 92080 92841 94070 95515 96674 97249 97676 98731
67334 98731 100550 102541 104238 105715 107063 108056 108626 109162 109947 110660 110839 110487 109819 108785 107383 106190
67318 106190 105882 106203 106051 104782 102953 101580 101094 101315 102023 103079 104252 105383 106642 108203 109720 110570
67302 110570 110732 111026 112295 114549 117106 119281 120746 121434 121440 121004 120362 119618 118834 118106 117371 116319 114784
67285 114784 113153 112049 111632 111549 111516 111561 111663 111626 111575 112125 113658 115734 117631 119260 121119 123408 125666
67268 125666 127338 128307 128756 128794 128425 127737 126892 125968 124905 123658 122443 121732 121777 122161 122154 121649 121396 121968 122868
67249 122868 123159 122743 122390 122576 122987 123312 123747 124378 124639 123973 122716 121830 121923 122882 124226 125357 125643 124801
67231 124801 123277 121893 121118 120916 121271 122341 123968 125404 125854 125234 124233 123687 123920 124584 125023 124817 124076
67214 124076 123259 122842 123137 124233 125851 127367 128264 128625 129005 129824 131050 132433 133779 134910 135639 136021
67198 136021 136465 137340 138466 139167 138912 137865 136785 136385 136757 137417 137874 138073 138241 138475 138705 138976 139488 140240
67180 140240 140939 141444 142140 143574 145771 148104 149879 150928 151612 152377 153351 154302 154920 155130 155107 155021 154926 154914
67162 154914 155161 155631 155881 155444 154413 153451 153209 153928 155532 157771 160173 162195 163678 164971 166395 167724
67146 167724 168475 168628 168775 169539 170992 172644 173844 174194 173764 173015 172471 172477 173228 174839 177130 179482 181180
67129 181180 181960 182109 182082 182239 182875 184153 185909 187692 189120 190044 190445 190443 190427 190857 191840 193145 194658 196443
67111 196443 198254 199435 199677 199567 200018 201338 203178 205167 207203 209216 211044 212586 213850 214885 215888
67096 215888 217220 219000 220775 221941 222454 222816 223430 224311 225384 226620 227791 228582 229162 230315 232683 236014
67080 236014 239362 241916 243516 244532 245479 246678 248110 249524 250733 251775 252794 253844 254886 255985
67066 255985 257424 259493 262087 264611 266559 268148 270130 272866 275946 278799 281222 283081 284043 284157 284372
67051 284372 285826 288710 292338 296068 299578 302475 304509 306226 308554 311562 314380 316563 318747 321555
67037 321555 324654 327497 330311 333617 337184 340279 342790 345426 348752 352528 356083 359040 361615 364389
67023 364389 367768 371600 375426 379122 382980 387152 391403 395578 399792 403952 407656 410944 414610 419228
67009 419228 424290 428843 432630 436102 439632 443353 447470 452113 457078 462219 467784 473803 479530 484286
66995 484286 488553 493377 498872 504276 509412 515078 521766 528932 535864 542518 549169 555905 562836 570157
66981 570157 577602 584426 590352 596058 602337 609291 616731 624753 633395 642167 650567 658760 667239 676052
66967 676052 684870 693647 702728 712341 722364 732504 742470 752103 761623 771606 782501 794306 806858
66954 806858 820114 833874 847594 860870 873915 887167 900688 914312 928182 942660 957753
66943 957753 973072 988322 1003568 1019117 1035406 1052841 1071331 1090182 1108904 1128025 1148514
66932 1148514 1170372 1192432 1213778 1234827 1256557 1279049 1301358 1322833 1344067 1366330 1390249
66921 1390249 1415304 1440547 1465574 1490668 1516222 1542373 1569128 1596541 1624562 1653000 1681765
66910 1681765 1710959 1740564 1770288 1799976 1829992 1860887 1892733 1925015 1957083 1988544 2019373
66899 2019373 2049956 2080896 2112500 2144450 2176238 2207834 2239612 2271653 2303449 2334360 2364065
66888 2364065 2392549 2420002 2446855 2473619 2500443 2526909 2552406 2576593 2599464 2621080 2641359
66877 2641359 2660022 2676707 2691257 2703958 2715354 2725717 2734764 2741964 2747030 2750067 2751312 2750840 2748526
66864 2748526 2744205 2737884 2729762 2720070 2708930 2696400 2682505 2667135 2650017 2631020 2610441 2588778
66852 2588778 2566168 2542282 2516905 2490446 2463615 2436602 2408803 2379483 2348638 2317028 2285374
66841 2285374 2253737 2221784 2189375 2156651 2123683 2090448 2057104 2023938 1990967 1958005 1925202
66830 1925202 1893073 1861729 1830588 1799219 1768032 1737548 1707377 1676653 1645322 1614234 1583966
66819 1583966 1554343 1525281 1497287 1470679 1444948 1419408 1394016 1368955 1343896 1318437 1293096
66808 1293096 1269017 1246577 1224879 1202880 1180483 1158252 1136523 1115299 1094786 1075447 1057394
66797 1057394 1040013 1022394 1004071 985347 966990 949623 933325 917692 902284 886927 871649
66786 871649 856536 841791 827774 814594 801723 788400 774616 761342 749512 739006 728943
66775 728943 718677 708068 696992 685284 673239 661566 650568 639864 629153 618728 608855 599168
66763 599168 589267 579594 571059 563941 557716 551813 545965 539895 533315 526338 519317 512192 504561 496532
66749 496532 488905 482306 476608 471428 466630 462070 457397 452538 447830 443284 438213 432163 425709 419681
66735 419681 414034 408270 402634 397885 393950 389815 385023 380407 376861 374110 371207 367754 364013 360182
66721 360182 356234 352255 348339 344200 339469 334438 330033 326847 324502 322072 318881 314800 310117 305365
66707 305365 301091 297525 294529 291984 290036 288751 287663 286037 283627 280969 278787 277257 275919 274133
66693 274133 271513 268094 264338 260928 258324 256390 254579 252493 250186 247942 245954 244314 243097 242239
66679 242239 241414 240186 238313 235858 233087 230351 227898 225626 223115 220152 217174 214899 213449 212073
66665 212073 209901 206788 203324 200259 198117 197151 197251 197808 198001 197446 196538 195937 195727 195226 193756 191526
66649 191526 189496 188318 187622 186559 184874 183047 181497 180117 178761 177671 176963 176103 174478 172425 171100
66634 171100 171201 172251 173211 173335 172267 169934 166847 164145 162695 162173 161466 159966 158063 156364 154946
66619 154946 153614 152531 152156 152643 153556 154222 154211 153479 152227 150717 149166 147706 146379 145227 144417 144175
66603 144175 144512 145066 145403 145394 145094 144268 142476 139795 137146 135525 135107 135347 135717 135954 135804 135058 133846 132509
66585 132509 131157 129749 128569 128104 128357 128778 128986 129083 129073 128611 127646 126840 126824 127380 127824 127927 128008 128346 128934
66566 128934 129594 129930 129373 127819 126042 124997 124806 124904 125019 125316 125632 125312 124087 122534 121342 120540 119720
66549 119720 118687 117564 116529 115718 115149 114563 113607 112365 111463 111429 112203 113429 114819 116006 116398 115652 114112
66532 114112 112394 110725 109062 107619 106762 106425 106178 105953 106205 107129 108150 108549 108328 108077 108074 107917 107112 105705
66514 105705 104161 102809 101680 100809 100375 100392 100483 100207 99557 98932 98632 98549 98348 97729 96574 95148 94232 94679
66496 94679 96511 98634 99704 99188 97397 94807 91875 89455 88686 90003 92480 94594 95563 95613 95047 93643
66480 93643 91288 88832 87665 88344 90048 91534 92298 92601 92707 92642 92603 93041 94114 95392 96301 96669 96624 96179
66462 96179 95221 93854 92553 91910 92239 93328 94505 95076 94843 94197 93667 93473 93537 93720 93881 93852 93558 93147
66444 93147 92830 92611 92284 91645 90612 89192 87535 86086 85495 86175 87848 89601 90503 90321 89649 89361 89902
66427 89902 91047 92152 92570 92024 90857 89837 89478 89594 89740 89953 90608 91565 92001 91321 89792 87998 86141
66410 86141 84278 82886 82512 82984 83514 83625 83562 83724 84098 84411 84531 84527 84491 84441 84303 84027 83792 83982 84720 85537
66390 85537 85872 85829 86053 86810 87605 87895 87760 87561 87259 86520 85449 84848 85545 87522 89788 91202 91503 91490
66372 91490 92077 93264 94270 94543 94268 93802 93057 91749 89944 88014 86213 84660 83562 83087 83022 82935 82720
66355 82720 82666 82896 83062 82847 82521 82701 83569 84596 85125 85117 85201 85977 87326 88488 88743 87976 86583 85045 83690
66336 83690 82734 82269 82158 82139 82100 82141 82276 82251 81813 81086 80502 80370 80640 81091 81597 82133 82626 82953 83085 83174 83473
66315 83473 84154 85179 86311 87260 87857 88088 88000 87625 87037 86378 85802 85403 85232 85292 85454 85439 85001 84159 83168
66296 83168 82310 81752 81528 81549 81645 81721 81866 82181 82558 82776 82820 82872 82986 83005 82928 83144 83986 85124 85608 84644 82331
66275 82331 79594 77392 75965 74960 74321 74724 76739 79665 81816 82172 81345 80632 80602 81054 81884 83211 84727
66258 84727 85695 85765 85291 84660 83783 82501 81066 79927 79325 79286 79677 80038 79823 79144 78911 79772 81146 81826
66240 81826 81385 80499 79972 79987 80389 81152 82313 83789 85506 87467 89533 91315 92447 92805 92393 91268 89755
66223 89755 88518 88103 88428 88854 88754 87979 86895 86015 85508 85057 84302 83324 82463 81715 80830 80106 80482 82400
66205 82400 85030 87178 88667 90154 91747 92654 92315 91157 89895 88751 87751 87266 87652 88632 89538 90029
66189 90029 90205 90205 90121 90124 90268 90227 89651 88685 87771 87012 86131 85026 83977 83363 83490 84567 86352 87918 88394
66170 88394 88046 88071 89157 90761 91952 92389 92211 91560 90648 89850 89261 88587 87883 87921 89204 91003 92108 92281
66152 92281 92227 92252 91845 90717 89439 88686 88469 88493 88759 89250 89447 88821 87710 87145 87705 88930 89982 90564
66134 90564 90969 91458 91885 91934 91462 90578 89520 88619 88211 88413 89000 89633 90191 90733 91261 91697 92071 92402 92459
66115 92459 92031 91540 91894 93453 95484 96950 97538 97550 97163 96344 95307 94484 94082 94085 94625 95834 97375 98609
66097 98609 99307 99693 99806 99423 98751 98607 99496 100954 102133 102694 102846 102876 103038 103574 104431 105165 105515 105905 106930
66078 106930 108440 109585 109773 109223 108552 108166 108150 108402 108669 108611 108060 107176 106275 105544 104994 104649 104623 104927 105286
66059 105286 105353 105117 104959 105156 105500 105625 105576 105771 106414 107245 107866 108033 107622 106702 105750 105451 106018 106932 107549
66040 107549 107754 107834 108017 108436 109358 111076 113519 116123 118047 118508 117256 114943 112870 111990 112246 113016 113954
66023 113954 115131 116526 117844 118780 119181 119000 118444 118125 118653 119982 121487 122751 123927 125266 126693 128097
66007 128097 129674 131600 133577 135119 136331 138000 140791 144525 148405 151822 154818 157868 161327 165058
65993 165058 168470 170976 172522 173638 174823 175933 176368 175885 174895 173812 172428 170230 167182 163805 160585
65978 160585 157661 155059 152792 150640 148239 145580 143116 141138 139338 137236 134866 132773 131394 130594
65964 130594 129775 128412 126655 125346 125144 125590 125450 124185 122696 122321 123443 125433 127608 129758 131894
65949 131894 134042 136261 138522 140536 142067 143357 144959 147140 149708 152328 154667 156369 157347 158167 159695
65934 159695 162164 164911 167155 168765 170047 171080 171594 171482 171220 171667 173360 176014 178814 181260 183561
65919 183561 186091 188791 191449 194369 198176 202879 207585 211318 213835 215523 216797 217824 218607 219109 219353
65904 219353 219464 219493 219202 218298 216899 215517 214502 213729 212873 211650 209727 206792 202972 198862 194850 190707
65888 190707 186166 181599 177652 174371 171184 167733 164217 160865 157557 154222 151217 148874 146932 144857
65874 144857 142656 140897 139870 139166 138332 137610 137631 138515 139678 140508 140847 140764 140253 139416 138654 138355 138508 138834
65856 138834 139160 139430 139505 139221 138641 138071 137832 138098 138848 139823 140638 141120 141426 141738 142034 142336 142861 143583 143900
65837 143900 143280 142179 141820 142975 145360 148274 151363 154578 157833 161054 164318 167653 170862 173808 176784
65822 176784 180305 184489 188779 192345 194745 196139 196829 196680 195256 192606 189618 187280 185788 184617 183302
65807 183302 181756 180020 178129 176242 174509 172830 171097 169572 168547 167698 166321 164244 161995 160053
65793 160053 158532 157664 157850 158931 160055 160705 161365 162778 165062 167957 171436 175552 180069 184776 189826
65778 189826 195273 200598 205191 209018 212224 214385 214773 213252 210369 206694 202570 198329 194158 189839
65764 189839 185153 180507 176671 173974 172167 171007 170468 170575 171603 174328 179353 186253 194013 202327 211697
65749 211697 222221 233111 243733 254303 265146 275884 285802 294466 301511 306352 308709 309039 307813
65736 307813 304634 298657 289807 279089 267767 256612 245894 235566 225425 215367 205632 196629
65724 196629 188515 181113 174168 167581 161457 156017 151359 147229 143269 139594 136796 135163 134185 133173
65710 133173 132104 131433 131260 131084 130368 129050 127523 126387 126053 126333 126551 126388 126392 127223 128574 129394 129140 128276
65692 128276 127556 127405 128064 129668 131867 133924 135535 137157 139204 141438 143603 146216 150075 155221 161018
65677 161018 167146 173970 181879 190812 200569 211167 222677 235005 247956 261281 274570 287350
65665 287350 299381 310633 320953 330048 337901 344814 350837 355489 358340 359634 360067 360131 360025 360023 360464
65650 360464 361334 362189 362650 362768 362782 362586 361503 358578 353245 345854 337464 328880 319876 309517 297226
65635 297226 283322 268648 254019 240147 227607 216497 206268 196252 186387 177266 169485 163151
65623 163151 157966 153565 149710 146335 143552 141497 140074 138845 137341 135500 133785 132766 132522 132470 131856
65608 131856 130491 128956 128043 128018 128506 129033 129475 129963 130562 131236 132017 132907 133566 133430 132375 131130 130728 131542
65590 131542 133082 134736 136407 138333 140583 143049 145818 149197 153412 158504 164579 171887 180528 190208
65576 190208 200429 210890 221642 232876 244605 256518 268130 279046 289003 297612 304216 308247
65564 308247 309735 309285 307476 304339 299410 292185 282570 271105 258783 246501 234575 222824 211129
65551 211129 199804 189412 180311 172371 165065 157962 151374 146370 143810 143315 143518 143401 143028 142898 143075
65536 143075 143306 143622 144271 145188 145996 146510 146868 147093 146870 145886 144204 142221 140385 139002 138102 137434 136675
65519 136675 135686 134489 133108 131638 130395 129651 129175 128330 126858 125286 124332 124131 124339 124844 125893 127401
65503 127401 128592 128707 127888 127007 126626 126523 126297 126077 126339 127313 128915 131125 133986 137239 140369 143128
65487 143128 145683 148087 149941 150872 151133 151427 152211 153329 154192 154148 152880 150728 148543 146967 145898 144817
65471 144817 143455 141867 140006 137677 134952 132286 130077 128384 127145 126405 126143 126099 125988 125762 125538 125336
65455 125336 125098 124864 124753 124742 124572 123956 122888 121747 121088 121278 122268 123704 125222 126644 127977 129298 130633
65438 130633 131888 133006 134259 136194 139048 142238 144732 146062 146750 147592 148695 149432 149189 147863 145710
65423 145710 143089 140489 138447 137083 135856 134205 132420 131493 131948 133144 133973 133987 133634 133589 134257 135699
65407 135699 137627 139479 140920 142218 143794 145464 146677 147511 148729 150631 152426 153253 153377 153849 155255
65392 155255 157273 159227 160547 160879 160254 159203 158302 157601 156763 155709 154768 154319 154561 155529 156925 158073
65376 158073 158477 158434 158708 159654 161046 162658 164403 165905 166561 166349 166140 166881 168747 171326 174340 177904
65360 177904 182299 187714 194109 201200 208672 216427 224402 232172 239073 244833 249764 254200 258055 261012
65346 261012 262778 262981 261276 257934 254017 250444 247003 242645 236733 229705 222488 215598 208912 202096
65332 202096 194992 187670 180366 173571 168052 164440 162602 161640 160704 159625 158581 157470 156024 154327 152667
65317 152667 150964 148894 146631 144837 143735 142744 141265 139442 137876 136973 136799 137199 137756 137989 137851 137795
65301 137795 138218 139221 140949 143559 146592 149020 150398 151400 152750 154227 155322 156249 157427 158378 158165
65286 158165 156784 155236 154240 153741 153691 154320 155425 156241 156443 156557 157014 157470 157501 157303 157107 156431 154653 152040
65268 152040 149532 147623 146049 144479 142915 141391 139800 138188 136871 136107 135885 136061 136442 136731 136721 136604
65252 136604 136826 137537 138489 139564 140937 142512 143611 143692 143073 142495 142088 141337 139982 138404 137033 135909
65236 135909 135049 134651 134669 134668 134518 134740 135663 136678 136931 136419 135622 134381 132120 129187 126952 126249 126546 127032
65218 127032 127722 128916 130258 131088 131341 131416 131404 131051 130291 129316 128339 127742 128132 129612 131231 131841 131409 130882
65200 130882 130855 131072 131203 131359 131685 132075 132576 133488 134755 135715 135814 135240 134600 134246 134167 134304 134726 135659 137456
65181 137456 140256 143580 146538 148597 149849 150476 150365 149499 148322 147376 146781 146380 146138 146100 146194 146374 146863
65164 146863 147944 149629 151735 154081 156376 158196 159489 160931 163287 166380 169179 171043 172494 174565
65150 174565 177717 181715 186324 191689 197967 204957 212310 220001 228352 237478 246834 255515 263092 270093
65136 270093 277441 285398 293174 299722 304803 309072 313151 316906 319719 321169 321188 319773 316994 313245 309097
65121 309097 304757 299987 294678 289117 283481 277384 270297 262258 253854 245616 237690 229968 222273 214500
65107 214500 206879 199991 194229 189224 184150 178614 173069 168330 164818 162236 159810 156894 153514 150275
65093 150275 147656 145620 144050 143212 143382 144223 145082 145794 146731 148057 149448 150563 151309 151530 150987 149872
65077 149872 148940 148808 149356 149998 150302 150183 149749 149200 148777 148705 149211 150450 152141 153458 153780 153550 153889 155225
65059 155225 156783 157578 157419 156724 155854 155042 154598 154684 155028 155193 155006 154560 153986 153460 153213 153367 153873 154690 155685
65040 155685 156290 155683 153644 150909 148435 146559 145087 143827 142624 141196 139350 137243 135162 133219 131471
65025 131471 130056 128969 128018 127265 127172 127984 129280 130493 131481 132198 132275 131548 130686 130573 131207 131887 132425 133483
65007 133483 135638 138660 141868 144697 146830 148242 149322 150601 152200 153809 155259 156709 158148 159085
64993 159085 159010 158023 156877 156465 157273 159168 161617 164096 166181 167421 167602 167348 167871 169615 171521 172265
64977 172265 171886 171484 171550 171470 170710 169518 168236 166703 164807 162990 161701 160734 159541 157878 155804 153398
64961 153398 150904 148939 148129 148563 149714 150818 151309 151138 150709 150256 149359 147514 145167 143583 143490 144412 145473
64944 145473 146258 146562 146056 144833 143809 143852 144761 145639 146080 146429 147067 147986 148964 149690 149758 148961 147555 145964
64926 145964 144368 142911 141936 141519 141018 139713 137866 136553 136452 137247 138213 138846 138949 138667 138538 139031 139925
64909 139925 140613 140986 141494 142292 143064 143928 145788 149338 154189 159432 164594 169664 174638 179597 184850 190434
64893 190434 195756 200271 204241 208180 211824 214402 215902 217214 218858 220295 220858 220743 220531 220132 218806
64878 218806 216077 212193 207740 203188 198799 194664 190792 187387 184947 183815 183638 183607 183317 183046 183074 183042
64862 183042 182354 181016 179679 178776 177868 176049 172937 169112 165613 163084 161416 160062 158521 156522 154033
64847 154033 151364 149187 148071 147831 147615 146881 146055 145885 146271 146276 145411 144361 144105 144656 145211 145366 145628 146614
64829 146614 148215 149805 150884 151239 150801 149812 149012 149193 150518 152602 155271 158765 163044 167374 171031
64814 171031 174198 177686 181851 186256 190448 194642 199344 204568 209690 213968 217001 218738 219285 218759 217243
64799 217243 214862 211848 208464 204802 200800 196526 192281 188320 184632 181152 178067 175670 174003 172850
64785 172850 172043 171532 171217 171012 171081 171728 172929 174271 175482 176770 178448 180429 182374 184236 186412 189331
64769 189331 193049 197187 201174 204655 207868 211578 216370 221978 227486 232182 236086 239619 243072 246529
64755 246529 250057 253644 257041 259921 262233 264190 265875 267036 267353 266660 264805 261544 256867 251287 245446
64740 245446 239481 233130 226528 220365 215035 210062 204865 199877 196298 194743 194670 195227 196142 197486 199018
64725 199018 200235 200901 201175 201319 201607 202415 204044 206419 209204 212191 215342 218451 221059 222812 223778 224347
64709 224347 224934 225692 226325 226164 224660 221920 218584 215198 211826 208320 204686 201066 197517 194018 190617
64694 190617 187521 185071 183580 183015 182810 182279 181316 180487 180317 180710 181227 181680 182202 182980 184251 186432 189845
64677 189845 194271 199042 203620 207931 212187 216573 221068 225323 228780 231191 232914 234370 235253 234744 232582
64662 232582 229443 226128 222829 219432 216055 212864 209691 206337 203043 200225 197956 196178 195247 195614 196976
64647 196976 198377 199321 200302 202006 204513 207572 211223 215670 220831 226473 232655 239587 247102 254650 261847
64632 261847 268656 274960 280253 284058 286422 287774 288289 287579 285128 280959 275741 270171 264394 258178 251646
64617 251646 245503 240407 236307 232652 229098 225814 223183 221540 221140 222011 223606 224901 225148 224525 223871
64602 223871 223802 224300 225085 226072 227240 228288 228780 228587 227928 226903 225364 223425 221719 220740 220137 219198 218001
64585 218001 217537 218468 220226 221714 222597 223530 225270 227916 230962 233769 236035 238012 240178 242538 244358
64570 244358 244843 243940 242164 239838 236923 233490 229855 226122 222085 217785 213710 210126 206566 202437 198015
64555 198015 194364 192184 191028 189827 188093 186436 185841 186461 187267 186998 185454 183730 183210 184443 186919
64540 186919 189651 191875 193389 194452 195312 195866 195892 195528 195177 194808 193812 191899 189829 188723 188769 189133 189172
64523 189172 189146 189504 189968 189851 189039 188135 187607 187283 186816 186273 186002 186171 186750 187773 189299 191143 193012 195029
64505 195029 197816 201844 206870 212194 217426 222740 228406 234234 239637 244151 247737 250518 252327 252722
64491 252722 251515 249129 246265 243338 240367 237319 234253 231239 228434 226256 225110 224892 225035 225120 225079 224719
64475 224719 223538 221301 218395 215378 212516 210068 208499 207909 207678 207291 207162 207961 209416 210616 211418 212658
64459 212658 214812 217244 219043 219934 220088 219707 219179 219059 219391 219469 218746 217654 217185 217967 220010 222906 225907
64442 225907 228281 230121 232497 236274 241092 246043 251040 256835 263888 271953 280825 290816 302259 315067
64428 315067 329137 344920 363299 385047 410563 440071 473965 512975 557966 609484 667493
64417 667493 731544 800984 874941 952244 1031421 1110504 1186809 1257446 1320572 1375891 1423507
64406 1423507 1462550 1491383 1508873 1514732 1508725 1490420 1460117 1419395 1370238 1313733 1249996 1179248
64394 1179248 1102792 1023061 942894 864717 790261 720859 657746 601799 553023 510586 473387
64383 473387 440535 411410 385632 363097 343844 327829 314827 304428 295953 288556 281702 275445
64371 275445 269919 264656 258883 252529 246442 241402 237274 233376 229394 225622 222424 219744 217216 214629
64357 214629 212228 210518 209752 209711 210050 210735 211950 213711 215765 217821 219727 221501 223369 225551 227753
64342 227753 229078 228773 226923 224145 220854 217279 213955 211514 209989 208881 207963 207446 207297 207074 206640 206564
64326 206564 207549 209864 213373 217556 221394 223939 225340 226734 228757 230723 231638 231432 230699 229738 228434
64311 228434 226688 224466 221774 219007 216821 215100 212600 208389 203266 198888 195761 193040 190200 187830
64297 187830 186502 185767 184752 183272 181894 181221 181442 182354 183567 184808 186047 187253 188241 189112 190622 193490
64281 193490 197374 201196 204624 208524 213646 219477 224922 229603 233891 237943 241401 244041 246065 247573
64267 247573 248153 247415 245764 244355 244190 245303 246865 247988 248370 248269 248025 247720 247162 246070 244265 241729
64251 241729 238450 234297 229232 223643 218147 212976 207883 202833 198389 195103 192866 191285 190433 190644 191723
64236 191723 192973 194049 195243 196811 198445 199585 199955 199723 199426 199671 200538 201304 201219 200497 199955 199754 199194
64219 199194 197908 196457 195362 194323 192910 191422 190436 189978 189759 189817 190258 190673 190532 189981 189534 189090 188039
64202 188039 186369 184964 184627 185389 187036 189684 193381 197555 201433 204935 208778 213601 219272 225221 231333
64187 231333 238227 246442 255468 263901 270656 275715 279539 282019 282404 280104 275291 268822 261811 255113
64173 255113 248854 242467 235487 228241 221574 216024 211536 207809 204532 201450 198572 196283 194836 193836
64159 193836 192690 191482 190857 191041 191553 191974 192420 193052 193734 194529 196057 198834 202494 206006 208516 209805
64143 209805 210276 210776 212131 214409 216762 218239 218610 218305 217857 217655 217813 217925 217282 215828 214606 214766 216294
64126 216294 218232 219932 221465 222901 223985 224732 225733 227512 229980 232866 236340 240792 246172 251908
64112 251908 257416 262463 267119 271612 276231 281117 286035 290418 293820 296376 298826 301951 305928 310330
64098 310330 314746 319252 324134 329395 334736 339867 344416 347610 348489 346764 343231 339139 335173 331145
64084 331145 326539 321203 315512 309996 304891 300120 295594 291339 287268 283136 278915 274954 271473 268191
64070 268191 264918 262244 260952 260765 260415 259186 257685 256700 255990 254848 253399 252559 252887 254147 255955 258189
64054 258189 260687 263178 265706 268636 272002 275327 278435 282125 287614 295448 305189 315968 327051 338045
64040 338045 348951 360084 371657 383301 394077 403003 409601 414023 416796 418371 418709 417328 413912
64027 413912 408893 403280 397862 392750 387750 382886 378334 373984 369416 364348 358805 352813 346266 339326
64013 339326 332664 326921 322049 317542 313274 309675 306966 304704 302345 299903 297619 295298 292510 289438
63999 289438 286941 285653 285431 285877 286984 288869 291223 293562 295950 298962 302800 306862 310409 313423 316519
63984 316519 320199 324485 329238 334493 340400 346993 354108 361453 368782 376147 383968 392663 402171 412096
63970 412096 422328 433258 445251 458222 471970 486622 502397 519194 536920 556142 577890
63959 577890 602783 630816 662168 697714 738531 785304 838578 899290 968719 1048159 1138929
63948 1138929 1242435 1359632 1490477 1634273 1790595 1959547 2140990 2333675 2535171
63939 2535171 2742466 2952629 3162999 3370729 3572099 3762358 3936382 4089481 4217689
63930 4217689 4317826 4387813 4426803 4434624 4411035 4355904 4270125 4155984 4016581 3855205 3675449
63919 3675449 3481656 3278875 3072190 2865895 2663105 2466097 2277057 2098327 1931824
63910 1931824 1778508 1638713 1512737 1400564 1301135 1212595 1133590 1063927 1003694 952037
63900 952037 907161 867424 832195 801649 775738 753348 732689 712716 693935 677299 662502
63889 662502 648097 633356 619172 606746 596200 587067 579451 573810 570004 567581 566952 569284 574988
63876 574988 583056 592257 602489 614584 629229 646538 666369 688516 712536 737686 763175 788508
63864 788508 813681 839057 864867 890757 915904 939589 961411 980902 997242 1009588 1017562 1021261
63852 1021261 1020951 1016926 1009534 999067 985588 969014 949354 926846 901967 875381 847712 819171
63840 819171 789506 758577 726926 695522 664932 635049 605675 577056 549618 523456 498470
63829 498470 474912 453411 434376 417567 402363 388280 375129 362895 351631 341385 332025 323236
63817 323236 314816 306975 300162 294586 289987 285890 282010 278408 275340 272947 271050 269247 267212 264872
63803 264872 262332 259764 257384 255317 253351 251010 248040 244681 241347 238256 235534 233379 231752 230102
63789 230102 227909 225465 223698 223141 223444 223963 224413 224812 225125 225206 224869 223919 222334 220490 218934 217873 217154
63772 217154 216776 216969 217661 218320 218583 218643 218720 218501 217521 215865 214123 212796 212016 211702 211705 211910 212343 213047 213804
63753 213804 214282 214556 215033 215690 215937 215613 215580 216720 218754 220659 221941 222861 223644 224288 225081 226516 228559
63736 228559 230597 232298 233960 235868 237822 239540 241146 243012 245414 248461 252121 256185 260435 264826
63722 264826 269291 273567 277584 281815 286623 291338 294671 296124 296333 295947 294903 293060 290731 288153 285041
63707 285041 281260 277385 274041 271124 268304 265941 264781 264886 265510 266014 266468 267353 269132 272089 276146
63692 276146 280731 285149 289152 292949 296723 300375 303688 306471 308568 309991 310998 311754 311979 311292 309953
63677 309953 308844 308569 308846 309032 309001 309237 310139 311547 313013 314262 315185 315573 315220 314373 313729 313740 314128 314278
63659 314278 313910 313038 311517 309107 305962 302593 299286 296019 292901 290196 287777 285168 282323 279827 278005
63644 278005 276465 274992 274287 275122 277110 279093 280627 282350 284910 288191 291776 295618 299905 304589 309352
63629 309352 313997 318758 324268 331114 339346 348540 358471 369467 381885 395554 410104 425602 442383
63616 442383 460434 479538 499993 522579 547638 574634 602790 631732 661291 690957 719783
63605 719783 746542 769851 788493 801978 810735 815633 817368 816313 812729 806970 799622 791455 783026
63592 783026 774231 764416 752996 739782 724679 707406 687735 665930 642826 619574 597281 576644
63580 576644 557767 540433 524562 510372 498116 487898 479724 473529 469138 466399 465378 466196 468675
63567 468675 472443 477403 483750 491429 499951 508886 518225 528082 538375 549135 560898 574476 590426
63554 590426 608932 630036 653780 680213 709407 741306 775395 810691 846152 880667 912287
63543 912287 937915 954635 961624 960467 953537 942545 928723 913730 899580 887594 877834 869587
63531 869587 862067 854494 845871 835132 821488 804420 783498 758651 730789 701703 672953 644936
63519 644936 617245 589733 562896 537361 513471 491416 471454 453797 438451 425211 413658
63508 413658 403260 393708 385095 377504 370574 363912 357839 353123 349857 347159 344232 341112 338055 334893
63494 334893 331613 328988 327733 327263 326219 324285 322638 322359 323169 324208 325435 327513 330596 333995 337117
63479 337117 340166 343603 347309 350679 353411 355812 358260 360674 362626 363754 363849 362720 360342 357069 353428
63464 353428 349667 345794 342034 338867 336495 334663 333152 332100 331597 331406 331433 332113 333891 336545 339536
63449 339536 342825 346829 351793 357786 365244 374808 386534 399898 414778 431840 451642 473931 498176
63436 498176 524253 552008 580437 607819 632511 653290 669269 680236 687109 691592 695299 699552
63424 699552 705844 715801 730338 749236 771813 797714 826771 858404 891567 925157 958044 988693
63412 988693 1015119 1035508 1048907 1055373 1055680 1051048 1042999 1033102 1022544 1011854 1001023 989751 977441
63399 977441 963033 945283 923537 898202 870263 840419 808899 776038 742697 709993 678859
63388 678859 649977 623822 600528 579852 561516 545507 531855 520300 510432 502122 495595 491131
63376 491131 488916 489100 491636 496100 501973 509154 517899 528299 540306 554352 571306 591395 613604
63363 613604 636717 660690 686468 714665 745078 777369 811424 846735 882014 915777 946889
63352 946889 974264 996509 1012455 1021918 1025565 1024295 1019137 1011492 1002800 993783 984268 973795 962106
63339 962106 949043 934390 917899 899148 877319 851599 822164 790562 758888 728596 700242
63328 700242 674028 650300 629539 612150 598208 587279 578596 571557 565909 561160 555932 548296 536917
63315 536917 521805 504118 485537 467774 452003 438316 425862 413828 402258 391758 382675 374850
63303 374850 368026 362071 356785 351883 347371 343652 341022 339184 337395 334981 331694 327770 323822 320528
63289 320528 318192 316650 315671 315249 315377 315722 315755 315107 313662 311524 309148 307264 306250 305643 304701 303404
63273 303404 302528 302617 303358 304117 304678 305221 305877 306664 307649 308864 310204 311606 313192 315023 316835 318298 319478
63256 319478 320812 322720 325328 328472 331815 335134 338678 343011 348315 354067 359751 365630 372380 380136
63242 380136 388400 396868 405872 415940 427401 440524 455515 472084 489409 506898 524794 543779
63230 543779 564143 585605 607707 630092 652515 674910 697456 720357 743532 766603 789146
63219 789146 810947 832162 853319 874925 896833 918085 937575 954752 969505 981474 989741 993224
63207 993224 991243 983786 971421 954937 934878 911432 884884 856120 826531 797493 770069 745026
63195 745026 722794 703369 686569 672462 661362 653342 648068 645287 645229 648312 654557 663503 674632
63182 674632 687678 702536 719046 736900 755694 775047 794702 814536 834455 854322 874008
63171 874008 893419 912376 930492 947302 962505 975936 987304 996026 1001408 1002876 999901 991835
63159 991835 978141 958991 935576 909540 882016 853231 823004 791528 759627 728473 699140
63148 699140 672270 647854 625331 604115 584181 566106 550535 537650 527079 518161 510203 502638
63136 502638 495144 487747 480772 474657 469733 466120 463761 462478 461925 461622 461230 460891 461093 462080 463541 465040
63120 465040 466569 468467 470976 474165 478119 482801 487717 492173 495935 499290 502382 504978 507046 509006
63106 509006 511022 512538 513081 513184 513874 515391 517001 518000 518278 517906 516879 515498 514435 514033 513926 513634
63090 513634 513162 512805 512727 513044 513918 515199 516404 517435 518911 521274 523996 526356 528688 532007 536466 541159
63074 541159 545606 550531 556739 563980 571603 579758 589151 599882 611279 622843 634745 647387 661074
63061 661074 676230 693391 712747 734118 757591 783782 813160 845480 880303 917810 958580
63050 958580 1002616 1049055 1096920 1145847 1195918 1247095 1299035 1351317 1403679 1456145 1508979
63039 1508979 1562349 1615878 1668693 1720149 1770379 1819867 1868596 1915903 1961071 2003535 2042302
63028 2042302 2075536 2101152 2117691 2124432 2120886 2106650 2081731 2046604 2001894 1948401 1887645 1822053
63016 1822053 1754270 1686391 1620026 1556858 1498627 1446456 1400470 1360283 1325795 1297449 1275867
63005 1275867 1261454 1254306 1254171 1260342 1271764 1287546 1307413 1331387 1358961 1388915 1420210 1452757
62993 1452757 1486898 1522268 1557770 1592741 1627545 1662635 1697445 1730670 1761348 1789123 1813489
62982 1813489 1833353 1847479 1854994 1855255 1847520 1831055 1805573 1771465 1729713 1681589 1628296 1570783
62970 1570783 1509932 1446941 1383393 1320897 1260698 1203597 1150020 1100089 1053752 1010943 971594
62959 971594 935482 902195 871326 842649 816076 791496 768648 747122 726525 706783 688192
62948 688192 671003 655033 639845 625243 611301 597923 584751 571668 559148 547934 538505 530878
62936 530878 524578 518649 512119 504811 497517 491077 485509 480383 475791 472352 470267 468912 467609 466379
62922 466379 465637 465365 464951 463816 461994 460078 458646 457801 457185 456344 454992 452966 450196 446876 443481 440431
62906 440431 437837 435692 434052 432700 430914 428130 424851 422328 421175 420702 419879 418550 417400 417028 417470
62891 417470 418416 419454 420064 419712 418186 415881 413714 412617 412871 413923 414985 415773 416395 416735 416537 416156
62875 416156 416503 417868 419402 420210 420363 420206 419322 417194 414578 413062 413173 413894 414258 414432 414824 415075 414701
62858 414701 414089 414056 414751 415735 416867 418403 420305 422057 423257 423925 424215 424308 424617 425582 427062 428357 429062
62841 429062 429580 430481 431574 432038 431448 430303 429306 428403 426914 424624 422244 420503 419212 417790 416462 416135
62825 416135 417043 418333 419321 420376 422013 423825 425137 426308 428457 432043 436490 441160 445861 450415 454606
62810 454606 458801 463858 469965 476160 481440 485938 490619 496165 502595 509683 517346 525736 535177 545822
62796 545822 557281 568915 580708 593527 608356 625620 645446 668076 693642 721962 753054
62785 753054 787598 826459 869960 918083 971083 1029382 1092964 1161405 1234452 1311985 1393344
62774 1393344 1477121 1561667 1645463 1726936 1804218 1875185 1937570 1989146 2028217 2053904 2065772
62763 2065772 2063404 2046835 2017234 1976498 1926025 1866439 1798694 1724826 1647254 1567779 1487692
62752 1487692 1408410 1331410 1257634 1187410 1120961 1058627 1000633 947015 897912 853609 814090
62741 814090 778671 746325 716491 689523 666160 646473 629421 613709 599029 586190 575928
62730 575928 567882 560996 554655 549101 544855 542087 540610 540165 540520 541472 542923 544984 547954 552227 558172
62715 558172 565905 575079 585087 595702 607500 621511 638405 658169 680622 705962 734599 766580
62703 766580 801551 839321 880258 925032 974194 1028136 1087129 1151042 1219011 1289621 1361515
62692 1361515 1433796 1505864 1576832 1644952 1707504 1761482 1804605 1835704 1854236 1859812 1852389 1832478
62680 1832478 1800720 1757517 1703642 1641123 1572931 1501707 1429103 1356202 1283943 1213021 1144018
62669 1144018 1077922 1016000 958912 906467 858548 815670 778087 744877 714657 686971 662305
62658 662305 640849 621897 604490 588108 572642 558216 545113 533425 522638 511945 501089
62647 501089 490532 480787 472049 464541 458541 453787 449441 445088 441266 438486 436248 433751 431238 429746
62633 429746 429493 429368 428253 426181 423877 421755 419950 418776 418430 418360 417638 416092 414649 414457 415928 418689
62617 418689 422093 425596 428902 431965 434748 437021 438678 440340 443284 448461 455729 464202 473183 482546
62603 482546 492526 503541 516191 531061 548483 568649 591851 618285 647632 679268 712993 749246
62591 749246 788312 829446 870925 910907 948170 982242 1012967 1039901 1061964 1077736 1086204 1087206
62579 1087206 1081149 1068478 1049530 1024832 995383 962575 927824 892130 855898 819202 782261
62568 782261 745664 710266 676976 646539 619240 594762 572564 552454 534565 518743 504381
62557 504381 491079 479187 469310 461432 454889 449072 443819 439158 435090 431703 429124 427152 425204 422901
62543 422901 420590 419021 418536 418726 418944 419005 419321 420323 421836 423132 423669 423750 424283 425917 428569 431917 436115
62526 436115 441716 448956 457457 466903 477775 491043 507071 525147 544352 564769 587576 613965
62514 613965 644137 677384 712888 750260 789384 829930 871126 911913 951177 987788 1020560
62503 1020560 1048446 1070863 1087585 1098136 1101577 1097281 1085879 1069035 1048222 1024068 997000 968079
62491 968079 938869 910755 884657 861181 840650 823131 808804 798209 791733 788884 788463 789527
62479 789527 791817 795202 799094 802646 805154 805974 804368 799884 792783 783623 772365 758319 741138 721537
62465 721537 700732 679407 657644 635722 614413 594291 575142 556493 538526 522039 507570
62454 507570 494962 483905 474498 467017 461346 456938 453268 450194 448022 447322 448462 451053 454044 456704
62440 456704 459409 463093 467931 473000 477348 481012 484612 488225 491064 492257 491581 489326 485743 480890
62426 480890 474869 467892 460073 451458 442409 433740 426185 419745 413813 407952 402340 397412 393319 389839
62412 389839 386641 383448 380133 376888 374217 372535 371765 371431 371048 370345 369319 368391 368337 369689 372044 374299
62396 374299 375727 376688 378113 380472 383446 386504 389497 392618 395957 399304 402424 405412 408695 412639
62382 412639 417217 422095 427077 432404 438587 445917 454200 463037 472325 482284 493010 504223 515652
62369 515652 527480 540145 553889 568857 585530 604634 626569 651438 679699 712185 749154
62358 749154 789879 833629 880594 931167 984641 1039337 1093783 1146894 1196985 1241618 1278955
62347 1278955 1308703 1331304 1346707 1354421 1354302 1346725 1332265 1311791 1286539 1257393 1224171 1186382
62335 1186382 1144850 1101996 1060228 1020514 982751 946913 913294 882010 852941 826178 801964
62324 801964 780147 760058 741050 722745 704706 686350 667528 648855 631135 614630 599143
62313 599143 584505 570599 557130 543885 531151 519388 508512 498014 487900 478955 471843 466339
62301 466339 461730 457615 454051 451210 449213 448070 447569 447479 448048 449845 452798 455815 457900 459371 461441
62286 461441 464769 469013 473645 478573 483941 489891 496688 504589 513478 522984 533049 543935 555646
62273 555646 567900 580791 594882 610294 626237 641945 657789 674991 694470 716369 740583
62262 740583 767212 796458 828460 863427 901702 943437 988261 1035352 1083894 1133414 1183570
62251 1183570 1233525 1281569 1325509 1363482 1394357 1417504 1432474 1439027 1437311 1427849 1411286 1388105
62239 1388105 1358506 1322655 1281122 1234933 1185146 1132594 1078318 1023899 970886 919946 871096
62228 871096 824821 782411 744995 712584 684236 658837 635616 614342 595411 579453 566525
62217 566525 555732 545812 536013 526423 517703 510588 505245 500964 496719 492199 487968 484549 481807 479435
62203 479435 477544 476417 476060 476400 477616 479898 483166 487370 492687 498962 505347 511124 516696 523160 531039
62188 531039 540028 549839 560525 571822 582823 592660 601238 609125 617043 625555 634814 644372 653403
62175 653403 661386 668552 675807 684473 695957 711194 730238 752692 778527 808095 841303 877362
62163 877362 915614 956051 998478 1041394 1082298 1119048 1150544 1176164 1195190 1207177 1212570 1212475
62151 1212475 1207744 1198520 1184707 1166561 1144566 1118936 1089688 1057336 1023210 988901 955516 923643
62139 923643 893797 866585 842467 821578 803803 788916 776668 766856 759277 753566 749227 745895
62127 745895 743401 741475 739749 738397 738452 740919 745649 751534 757808 764565 771913 779179 785396 790186 793770
62112 793770 796222 797181 796340 793938 790595 786693 781982 775837 767850 758122 747031 735034 722838 711489
62098 711489 701879 694283 688653 685213 684254 685423 687853 691188 695927 702477 710337 718647 727150 736094
62084 736094 745493 755054 764760 775005 786120 798162 811208 825444 840898 857483 875408 895103
62072 895103 916534 938987 961895 985619 1010961 1038053 1066173 1094666 1123604 1153294 1183475
62061 1183475 1213254 1241665 1267946 1291324 1310846 1325599 1335063 1339230 1338468 1333234 1323869 1310645
62049 1310645 1293924 1274017 1250710 1223230 1191109 1154995 1116235 1075731 1033752 990945 948863
62038 948863 908991 871670 836463 803242 772326 743750 717108 692254 669642 649732 632336
62027 632336 616721 602175 588416 575630 564162 553937 544258 534410 524408 514854 506138 498194
62015 498194 490933 484385 478301 472242 466345 461497 458372 456669 455733 455537 456474 458410 460622 462744 465251
62000 465251 468741 473079 477504 481374 484551 487132 489076 490188 490290 489230 486761 482683 477265 471287
61986 471287 465374 459345 452587 445026 437396 430445 424275 418573 413130 407881 402806 398159 394478 391997
61972 391997 390216 388431 386519 384805 383369 382000 380752 379992 379826 379969 380326 381255 382999 385254 387523
61957 387523 389618 391584 393457 395387 397719 400624 403885 407489 412204 419008 427908 437764 447477 457094
61943 457094 467661 480250 495257 512304 530550 549250 568210 587622 607422 627070 646090
61932 646090 664487 682340 699251 714657 728448 740770 751286 759240 764423 767542 769354 769860 768667
61919 768667 765739 761348 755622 748773 741719 735916 732402 731281 732197 735033 739983 747207 756596 767828
61905 767828 780478 794015 807623 820085 830116 836992 840670 841164 838082 831105 820633 807512 792280
61892 792280 775173 756866 738548 721044 704278 687853 671828 656667 642592 629204 615637
61881 615637 601110 585665 570447 556884 545425 535332 525850 517063 509353 502576 496370 491023 487362
61868 487362 485687 485334 485461 485927 487252 489980 494327 500320 507972 517230 527959 540202 554438 571322
61854 571322 591008 612970 636725 662475 690634 720876 752251 784265 817105 850513 883088
61843 883088 913308 940772 965673 987265 1003705 1013634 1017385 1016386 1011846 1004401 994747 984077 973758
61830 973758 964803 957806 953266 951704 953381 958098 965494 975377 987325 999951 1011076 1018952 1023068
61817 1023068 1023443 1019479 1009988 994285 972849 946858 917479 885746 852721 819440 786643 754689
61805 754689 723774 694246 666659 641510 618999 599103 581730 566587 553066 540709 529777
61794 529777 520891 513934 507858 501931 496585 492532 489424 486134 482214 478301 475061 472354 469707 467130
61780 467130 465128 464117 463988 464102 463664 462357 460637 459204 458225 457357 456445 455787 455616 455795 456214 457094 458631
61763 458631 460575 462484 464241 466091 468232 470583 472921 475146 477404 479922 482615 484880 486037 486082 485740
61748 485740 485609 485425 484414 482308 479696 477256 474914 472062 468578 465242 462903 461513 460404 459352 458770
61733 458770 458777 458771 458284 457694 457605 457957 458341 458844 459876 461374 462941 464674 467103 470285 473654 476879 480122
61716 480122 483234 485440 486220 486020 485698 485705 486078 486717 487282 487165 485971 483726 480468 476159 471354 467332 464933
61699 464933 463609 462200 460349 458541 456997 455273 453046 450708 448914 447772 446644 444664 441526 437819
61685 437819 434461 431694 428934 425767 422674 420438 419183 418422 417744 416934 415632 413512 410765 407914 405209
61670 405209 402635 400346 398540 396907 394866 392456 390448 389347 388786 388208 387689 387778 388732 390226 391644 392521
61654 392521 392893 393370 394650 396793 399144 401072 402592 404172 406217 408896 412282 416356 420937 425684 430122
61639 430122 433713 436147 437623 438628 439272 439087 437575 434785 431222 427349 423326 419049 414380 409493 405061
61624 405061 401798 399621 397516 394569 391011 387924 386002 384886 383756 382294 380880 379962 379457 378858 377786
61609 377786 376245 374303 371794 368554 364740 360633 356185 351182 345817 340691 336177 332164 328617 325897
61595 325897 324213 323112 321931 320490 318892 316905 314150 310919 308227 306790 306239 305543 304014 301753 299340
61580 299340 297274 295675 294333 293081 292066 291622 291877 292636 293600 294504 295003 294728 293720 292647 292334 292937
61564 292937 293747 293914 293303 292506 292055 291883 291737 291848 292788 294629 296679 298252 299384 300490 301607 302433 302933
61547 302933 303412 303997 304532 305117 306316 308509 311306 313860 315613 316574 317105 317664 318592 319880 321203 322314
61531 322314 323271 324150 324775 324999 325048 325220 325353 324996 324115 323216 322649 322132 321206 319884 318534 317292 315995 314681
61513 314681 313738 313349 313024 312063 310457 308978 308241 307971 307499 306846 306872 308196 310302 311927 312251 311530 310680
61496 310680 310448 310897 311478 311548 310895 309760 308402 306892 305459 304722 305144 306373 307529 308213 308871 310042 311648
61479 311648 313279 314864 316633 318500 319916 320474 320436 320488 321035 321913 322747 323433 324136 324989 326025 327388 329261
61462 329261 331436 333239 334225 334747 335420 336161 336275 335583 334933 335292 336654 338188 339182 339488 339244 338614 337873
61445 337873 337443 337663 338569 339871 341142 342142 343028 344159 345676 347400 349173 351019 352880 354511 355843
61430 355843 357134 358514 359685 360465 361334 362974 365463 368363 371411 374553 377419 379503 381015 382908 385700
61415 385700 388661 390481 390443 388788 386363 384172 382858 382162 381117 379136 376700 374667 373189 371743 370043
61400 370043 368331 366828 365416 364016 362882 362265 362068 362014 362033 362317 363113 364529 366354 367938 368504 367880 366912
61383 366912 366815 367997 369662 370746 371102 371520 372665 374341 375946 377308 378674 380116 381461 382858 384862
61368 384862 387654 390591 392963 394960 397405 400571 403760 406204 407982 409782 412023 414568 417271 420479
61354 420479 424806 430500 437191 444346 451823 459813 468235 476405 483482 489164 493786 497830 501507 504797
61340 504797 507612 509870 511644 513352 515540 518230 520667 521969 521949 520941 518941 515488 510654 505594 501513
61325 501513 498299 494841 490691 486670 483624 481263 478795 476226 474337 473576 473681 474363 475744 477992 481091
61310 481091 485159 490491 497088 504556 512648 521533 531282 541505 551728 561680 570974 579008 585575 591075
61296 591075 595603 598326 598461 596565 594025 591369 587876 582909 576866 570565 564375 558289 552366 546702
61282 546702 541296 536335 532310 529586 528008 527128 526517 525786 524709 523682 523653 525168 527695 530289 532693
61267 532693 535333 538442 541793 545301 549330 554231 560039 566834 574956 584467 594610 604193 612486 619499
61253 619499 625492 630547 634637 637770 639815 640412 639271 636538 632623 627728 621790 614964 607855 601090
61239 601090 594845 588993 583591 578892 574974 571665 568832 566383 563942 560976 557512 554427 552642 552223
61225 552223 552627 553718 556004 559717 564045 567661 570000 571777 574236 578025 582895 588332 594148 600303
61211 600303 606425 611920 616616 620895 625040 628779 631743 634086 636318 638804 641882 646193 652289 659962
61197 659962 668667 678668 690983 705824 721801 737240 751724 765610 778471 789046 796750 802338
61185 802338 806802 810330 812684 813906 814079 812832 809695 804788 798728 791996 784775 777152 769023 759954
61171 759954 749734 738962 728562 718622 708313 697110 685559 674466 663815 652924 641451 629746
61159 629746 618342 607526 597452 588343 580442 573939 569007 565763 564127 563845 564643 566159 567721 568389
61145 568389 567434 564745 560720 555833 550413 544746 539154 533823 528659 523497 518465 514040 510765 509037
61131 509037 509148 511190 514821 519424 524837 531683 540582 551185 562482 574053 586382 599854 614100
61118 614100 628815 644621 662424 682098 702487 722685 742721 762844 782731 801695 819361
61107 819361 835787 851099 865328 878453 890330 900521 908361 913323 915269 914339 910613 904013 894651
61094 894651 883200 870596 857185 842444 825848 807903 789921 772782 756302 739938 723779
61083 723779 708538 694753 682271 670552 659355 649028 640117 632750 626578 621370 617416 615100 614330
61070 614330 614709 616089 618463 621384 624119 626550 629420 633471 638837 645471 653578 663134 673531 684270
61056 684270 695692 708394 722227 736594 751586 768046 786462 806515 827805 850318 873912
61045 873912 898081 922693 948496 976436 1006782 1039292 1073855 1110451 1148683 1187882 1227664
61034 1227664 1268216 1310132 1354176 1400880 1450083 1501076 1553514 1607918 1665010 1724915 1787481
61023 1787481 1853123 1922931 1998203 2080274 2170387 2269142 2376574 2493613 2623202 2769211
61013 2769211 2934905 3124033 3343341 3602478 3911449 4280156 4721277 5251989 5892590
61004 5892590 6665829 7597340 8709047 10002954 11450737 13005685 14625292 16270585
60996 16270585 17872603 19306859 20424850 21133454 21452812 21497968 21406517 21281756 21184609
60987 21184609 21141760 21129398 21047122 20733767 20040944 18914474 17420145 15702156 13917029
60978 13917029 12188676 10595860 9177896 7945114 6889669 5995062 5242247 4612317
60970 4612317 4087526 3651594 3289522 2987653 2734281 2519761 2335768 2175152 2032945
60961 2032945 1906635 1794550 1694355 1603727 1521771 1448631 1383899 1326301 1274766 1228772 1187484
60950 1187484 1149304 1112628 1076665 1041449 1007482 975370 945352 917067 890027 864234 839956
60939 839956 817111 795299 774413 754727 736440 719493 703732 688854 674345 659965 646145
60928 646145 633448 621770 610662 600232 591058 583263 576390 570225 564981 560555 556325 552037 548270
60915 548270 545677 544191 543254 542392 541395 540421 540136 541217 543376 545380 546373 546756 547394 548445 549460 550228
60899 550228 550955 551727 552342 552572 552244 551070 548759 545305 540981 536034 530501 524307 517446 510131 502834
60884 502834 496045 489920 484204 478428 472109 464961 457277 449939 443634 438074 432507 426984 422490 419622
60870 419622 417721 415679 413183 410745 408893 407794 407464 407910 409091 410925 413242 415681 417890 419928 422179
60855 422179 424755 427351 429807 432388 435325 438549 442102 446257 450856 455002 457892 459596 460592 460972 460669
60840 460669 460059 459634 459252 458339 456754 454918 453153 451409 449624 447850 446004 443947 441763 439590 437188
60825 437188 434189 430734 427402 424461 421677 418931 416501 414496 412456 409829 406651 403452 400621 398055
60811 398055 395345 392129 388350 384281 380309 376658 373251 369846 366299 362735 359472 356684 354182 351670
60797 351670 349166 346940 345050 343243 341366 339581 338102 337054 336651 337051 337838 338184 337815 337341 337221 336997
60781 336997 336185 335439 335971 337949 340320 342228 343909 346050 348907 352334 356181 360283 364313 367941 370984
60766 370984 373359 375036 376130 376924 377742 378829 380151 381246 381535 380977 380115 379229 377810 375274 371828 368177
60750 368177 364792 362035 360536 360543 361130 361000 360053 359255 358940 358264 356584 354323 351968 349139 345383 341182
60734 341182 337362 333943 330372 326604 323227 320555 318246 315850 313327 311018 309389 308752 308944 309342 309503
60719 309503 309705 310600 312367 314460 316166 317208 317885 318789 320359 322507 324724 326602 328242 330046 332240
60704 332240 334649 336842 338417 339368 340233 341706 343952 346494 348837 350986 353178 355378 357309 358843 360092
60689 360092 361155 362014 362695 363364 364205 365174 365957 366239 366127 366161 366707 367413 367555 366889 365855 364959 364283 363672
60671 363672 363063 362477 361946 361507 360961 359641 356869 352865 348830 345862 344071 342866 341639 339924 337480
60656 337480 334786 333091 333283 334811 336311 337295 338639 341271 344887 348293 350664 352077 352926 353263 352870
60641 352870 351781 350371 348877 347119 344936 342674 340843 339349 337528 335113 332783 331474 331403 332019 332680
60626 332680 333082 333190 333091 332933 332846 332929 333367 334361 335789 337119 337874 338069 338008 337794 337256 336283 335034 333843 333038
60607 333038 332811 333137 333830 334693 335538 336177 336564 336920 337454 338009 338342 338774 340037 342254 344519 345871 346384
60590 346384 346962 348322 350527 353274 356122 358501 359900 360179 359626 358814 358436 358937 360102 361270 362192 363397
60574 363397 365412 368001 370613 373247 376362 380173 384660 390223 397666 407291 418357 429539 439709
60561 439709 448309 455366 461180 465736 468435 468716 466895 464048 461083 458262 455579 453170 451259 450077
60547 450077 449990 451383 454323 458592 464127 471121 479607 489228 499596 510729 523037 536944 552401
60534 552401 568479 583598 596522 607087 615619 621792 624662 623886 620286 615037 608843 602133 595455
60521 595455 589165 583154 577338 572107 567832 564283 561084 558476 556991 556545 556475 556520 557158 558839 561506 565149
60505 565149 570340 577827 587892 600521 615987 634846 657420 683594 713101 745787 781558 820223
60493 820223 861261 903420 944623 982623 1015910 1043784 1065545 1079970 1085775 1082283 1069408 1047295
60481 1047295 1016463 978330 935204 889604 843638 798890 756472 716956 680408 646724 615991
60470 615991 588547 564709 544346 526693 510696 495752 482060 470143 460199 452070 445612 440677
60458 440677 436813 433359 429844 426049 421839 417405 413550 411057 409636 408068 405638 402916 400864 399681
60444 399681 398844 397765 395993 393260 389907 386960 385236 384512 383952 383097 382023 380814 379470 378181 377227
60429 377227 376667 376471 376779 377657 378754 379608 380095 380192 379675 378592 377696 377720 378341 378615 378369 378407 379314 380795 382390
60410 382390 384178 386475 389268 392151 394454 395489 395207 394586 394752 395649 396289 396368 396726 397931 399338 400201
60394 400201 400933 402502 405054 407922 410645 413269 415871 418568 421805 425943 430459 434191 436575 438216
60380 438216 440059 442358 444608 446224 447064 447472 447963 448910 450446 452579 455228 458194 461280 464484 467800
60365 467800 470805 472801 473590 473800 474256 475302 476995 479546 483142 487576 492531 498065 504383 511281 518357
60350 518357 525691 533725 542251 549999 555533 558321 558760 557420 554606 550510 545465 539886 534075 528178
60336 528178 522347 516854 511935 507535 503318 499021 494718 490683 487041 483622 480100 476239 472130 468207
60322 468207 464913 462332 460296 458900 458650 459939 462567 465956 469674 473653 478157 483761 491086 500162
60308 500162 510143 519993 529449 538980 548843 558539 567285 574688 580747 585440 588602 590154 590167 588541 584750
60293 584750 578149 568710 557345 545379 533708 522618 512259 502938 494877 488029 482302 477675 473888
60280 473888 470302 466357 462067 457830 453921 450367 447147 444223 441503 439009 436885 435018 432936 430474
60266 430474 428272 427108 426807 426400 425316 423905 422693 421750 421054 420947 421710 422970 423992 424470 424681 424921
60250 424921 425144 425190 425153 425350 426041 427134 428157 428547 428060 426962 425811 425110 425068 425486 425765 425248 423828 422245
60232 422245 421614 422577 424835 427501 429854 431831 433874 436308 438892 441028 442447 443618 445342 447958 451042
60217 451042 453993 456844 460332 465069 470803 476718 482391 488171 494526 501314 507947 514045 519578 524544
60203 524544 528896 532767 536325 539344 541370 542518 543722 545800 548517 550873 552177 552493 552197 551538 550682
60188 550682 549757 548693 547224 545131 542343 538883 535060 531649 529352 527851 525947 523068 520220 518797
60174 518797 518712 518450 516996 514906 513209 511965 510492 508548 506646 505315 504626 504388 504355 504183 503584 502609 501517
60157 501517 500391 499170 498062 497504 497673 498345 499317 500567 501923 502976 503576 504058 504723 505422 505928 506438 507323
60140 507323 508616 510161 512176 515167 519196 523492 526984 529204 530700 532584 535525 539069 542093 544047
60126 544047 545515 547360 549595 551538 552849 553843 554754 555287 555218 554995 555300 556200 557119 557607 557759 557820 557713 557201
60108 557201 556275 555101 553646 551677 549225 546785 544906 543769 543304 543436 543927 544172 543646 542598 541886 542112
60092 542112 543260 545245 548237 552195 556500 560455 563847 566676 568674 569602 569804 569957 570218 570022 568716
60077 568716 566129 562571 558574 554583 550504 545585 539080 531103 522629 514684 507781 501999 497131 492708
60063 492708 488262 483728 479318 475049 470703 466291 462181 458682 455839 453635 452033 450765 449556 448650
60049 448650 448609 449460 450608 451845 453785 456852 460357 463266 465517 467946 471117 474877 478844 482567 485248
60034 485248 486154 485569 484706 484317 483878 482483 480022 477005 473665 469918 465999 462448 459338 456016 451840
60019 451840 446852 441590 436492 431680 427102 422670 418393 414502 411277 408596 405928 403026 400395 398653
60005 398653 397609 396471 395008 393965 394036 394851 395398 395207 394713 394598 395166 396314 397701 398907 399790 400749 402305
59988 402305 404344 406101 407073 407633 408536 410111 412205 414654 417376 420004 421796 422079 420731 418270 415601
59973 415601 413501 412140 411073 409857 408621 407806 407485 407251 406838 406466 406439 406711 407111 407744 408802 410113 411253
59956 411253 412113 413031 414257 415604 416692 417242 416955 415477 412901 410103 408100 407043 406222 405086 403850
59941 403850 402921 402232 401542 400989 400828 400760 400178 399107 398344 398463 399212 400211 401811 404653 408636 412915 416936
59924 416936 420951 425320 429805 433840 437203 440066 442535 444449 445580 445785 445033 443582 442112 441382 441629
59909 441629 442463 443408 444338 445334 446352 447284 448227 449439 451014 452701 454120 455129 455986 457139 458778 460618
59893 460618 462246 463711 465586 468331 471776 475391 478938 482671 487013 492213 498222 504695 511138 517249
59879 517249 523088 528791 534287 539498 544642 549924 554904 558597 560370 560500 559773 558774 557681 556440 554937
59864 554937 553175 551415 550029 549121 548533 548271 548566 549342 549998 550129 550267 551511 554423 558597 563276 568110
59848 568110 573223 578706 584126 588537 591055 591575 590864 589849 588936 588110 587424 587034 586749 585902 583873 580667
59832 580667 576928 573406 570365 567465 564226 560658 557332 554804 553071 551679 550181 548366 546204 543790
59818 543790 541267 538597 535437 531427 526605 521452 516548 512221 508445 504988 501699 498701 496157 493933
59804 493933 491722 489517 487601 485943 484063 481719 479344 477380 475603 473643 471843 470916 470818 470683 469946
59789 469946 468956 468251 467782 467205 466522 466030 465829 465680 465323 464803 464570 465207 466851 468798 469994 470088 469818 470250
59771 470250 471813 474173 476787 479378 482034 485059 488648 492595 496382 499623 502353 504888 507553 510505
59757 510505 513611 516444 518646 520379 522229 524539 527071 529431 531625 534014 536880 540230 543951 547985
59743 547985 552318 556873 561404 565530 568982 571779 574052 575791 576996 578078 579783 582480 585707 588557
59729 588557 590520 591868 593290 595168 597149 598494 598945 599071 599517 600082 600045 599374 599022 599669 600653 600643 599102
59712 599102 596607 593899 591247 588822 587079 586352 586304 586257 586046 586244 587412 589359 591339 592854 594006 595071
59696 595071 595974 596333 595932 595030 594258 594214 594973 595883 595956 594651 592264 589603 587369 585803 584564 582817 579826
59679 579826 575770 571739 568620 566191 563610 560506 557137 553707 550115 546358 542619 538901 534978 530877
59665 530877 527035 523862 521432 519638 518377 517555 517196 517514 518629 520269 522102 524191 526638 528927 530242
59650 530242 530478 530310 530168 529832 529156 528462 527810 526568 524226 521146 518001 514904 511661 508485 505816 503521
59634 503521 500917 497619 493995 490749 488364 486877 485939 484987 483532 481342 478387 474808 470905 466954 463006
59619 463006 459122 455736 453377 451968 450838 449515 447983 446137 443658 440737 438337 437261 437481 438654
59605 438654 440665 443137 445131 446105 446712 447852 449312 450169 450252 450333 450985 452125 453622 455499 457404 458725
59589 458725 459483 460472 462236 464411 466311 467636 468357 468396 467782 466753 465406 463529 461048 458397 456195 454693
59573 454693 453638 452542 451020 449104 447267 445923 444888 443578 441732 439630 437652 435969 434710 433996
59559 433996 433663 433287 432723 432309 432451 433223 434509 436197 438070 439845 441549 443624 446447 450000 454204 459317
59543 459317 465705 473450 482517 493140 505606 519700 534759 550345 566375 582181 595698 604173
59531 604173 606064 602182 594971 586889 579532 573775 569996 568011 567233 567176 567592 568054 567849 566552 564405 561794
59515 561794 558605 554446 549280 543467 537316 530940 524436 517916 511449 505215 499506 494345 489366 484491
59501 484491 480352 477502 475395 472840 469449 465965 463126 460901 459101 458054 458160 459138 460265 461205 462260
59486 462260 463805 465717 467384 468212 468133 467638 467316 467434 468036 469181 470770 472322 473360 474069 475230 477399
59470 477399 480401 483568 486175 487708 488207 488395 489065 490235 491335 492296 493957 497084 501480 506409 511521
59455 511521 516891 522427 527803 532970 538302 544125 550352 556549 562158 566576 569337 570403 570206 569193
59441 569193 567293 563981 558951 552686 546246 540543 535920 532341 529651 527593 525923 524718 524345 524975 526414
59426 526414 528652 532166 537216 543225 549498 556444 565423 577332 591951 608764 627680 648513 670275
59413 670275 691644 712042 731745 750753 767690 779970 785172 782484 773185 760068 746499 735531
59401 735531 728952 726690 727450 730193 734517 739248 741419 737727 726958 710399 690238 668570 647697
59388 647697 629884 616056 605489 597236 591127 586965 583737 580552 577783 576362 576270 576558 576708 577098 578095
59373 578095 579438 580745 582127 584043 586793 590234 593813 596900 599293 601424 603785 606289 608479 610296
59359 610296 612289 614990 618433 622460 627255 633307 640898 649837 659741 670459 682021 694213 706430
59346 706430 718188 729641 741330 753441 765514 776838 786850 795133 801408 805668 808079 808631 807100
59333 807100 803468 798133 791540 783883 775286 766007 756266 746074 735472 724807 714563 704989 696019
59320 696019 687444 679027 670591 662126 653812 645900 638619 632160 626651 622157 618762 616500 615096 614128
59306 614128 613792 615210 619338 625679 632705 639532 646479 653732 660107 663503 662149 655262 643211 627645
59292 627645 611051 595535 581970 570376 560697 552830 546373 540886 536291 532733 530288 529092 529435
59279 529435 531284 533982 536892 540208 544744 550983 558715 567474 576978 587098 597689 608431 618746
59266 618746 627913 635463 641386 645959 649541 652488 654843 655993 655020 651686 646755 641235 635699 630498
59252 630498 626003 622147 618239 613836 609504 606202 604149 602883 602225 602575 604285 607243 611076 615407 619933
59237 619933 624615 629678 635130 640475 645224 649491 653610 657295 659725 660417 659561 657505 654390 650352 645654
59222 645654 640453 634753 628628 622272 615781 609157 602554 596254 590366 584775 579394 574256 569367 564741
59208 564741 560575 557150 554442 551970 549195 546050 543075 540978 539977 539584 539097 538249 537246 536406 536145
59193 536145 537154 539951 544072 548228 551502 554050 556492 559195 562388 566372 571132 576183 581211 586444
59179 586444 591990 597354 602092 606500 611083 615778 620304 624826 629592 634257 638319 641962 645760 649800
59165 649800 653778 657710 661694 665132 667039 667130 665886 663568 659947 655042 649371 643335 636972 630386 623760
59150 623760 616859 609158 600655 591958 583529 575453 568026 561831 556929 552583 548046 543131 537853 532144
59136 532144 526263 520927 516624 513163 510202 507801 506111 504842 503465 501843 500452 500063 501242 503901
59122 503901 507257 510432 513200 516039 519610 524433 530861 538871 547873 557150 566530 576301 586580 597196
59108 597196 607997 618718 628611 636865 643511 649348 654931 660148 664785 668837 672112 674188 674992 674864
59094 674864 673967 672225 670022 668202 667043 665863 664023 661773 659719 657988 656343 654624 652636 649991
59080 649991 646517 642474 637998 632713 626278 619024 611627 604426 597418 590657 584270 578270 572704 567846
59066 567846 563936 560821 558055 555239 552145 548699 544960 540987 536750 532387 528442 525453 523261 521211
59052 521211 518994 516819 514737 512518 510352 508968 508650 508758 508620 508407 508671 509487 510525 511622 512825 514144
59036 514144 515603 517274 519054 520759 522593 525024 527974 530798 533438 536906 542028 548401 555288 562977
59022 562977 572316 583259 594789 606146 617231 627857 637400 645351 651569 655902 658180 658664 657900
59009 657900 656020 652785 648567 644676 642352 641765 642320 643558 645418 647882 650825 654160 657788 661468 664957
58994 664957 668263 671447 674105 675361 674625 672253 669187 666039 662897 659964 657838 656739 655891 654235 651653
58979 651653 648993 646995 645822 645700 647340 651348 657563 665314 674051 683480 693349 703446 713698 724074
58965 724074 734404 744376 753648 762071 769906 777587 784990 791138 795152 797286 798400 798481 796446 791531
58951 791531 784138 775085 764746 753338 741381 729365 717375 705461 693935 683002 672591 662906
58939 662906 654575 647835 642099 636840 632387 629276 627225 625421 623474 621539 619781 618304 617350 616995 616857
58924 616857 616518 616021 615526 614887 613953 612893 611712 609944 607476 605214 604128 603978 603793 603313 603061 603253 603733
58907 603733 605008 608171 613452 619775 626242 633321 641966 652166 663012 673847 684699 695701 706680
58894 706680 717469 728259 739492 751538 764589 778722 793832 809406 824586 838733 851925
58883 851925 864601 876703 887444 895956 901808 904826 904936 902534 898542 893609 887465 879460 869526 858292
58869 858292 846517 834906 824262 815238 807862 801606 795900 790349 784599 778327 771362 763666 755386
58856 755386 747040 739270 732125 724871 716905 708478 700165 691971 683546 674988 666814 659231 651981 644853
58842 644853 637840 630844 623731 616680 610040 603770 597465 590993 584838 579675 575805 572992 570703 568555
58828 568555 566622 565169 564128 563242 562795 563578 565794 568584 571183 573998 577787 582174 585858 588218 589976
58813 589976 592214 595348 599084 602804 605856 607859 608840 608958 608257 606951 605544 604180 602136 598570 593571
58798 593571 588023 582668 577803 573522 569566 565186 559942 554495 549874 546141 542521 538742 535373 532870
58784 532870 531189 530492 531363 534024 537926 542340 546810 550968 554568 557877 561382 564935 567703 569086 569078
58769 569078 567651 564514 559752 554104 548339 542830 537858 533671 530066 526525 523078 520451 519120 518780
58755 518780 518970 519554 520321 520820 521084 521867 523647 525856 527679 529185 531078 533644 536573 539664 543074 546847
58739 546847 550659 554206 557594 561164 565035 569003 572988 577434 582931 589340 595699 601373 606890 613067
58725 613067 619587 625173 629129 631978 634468 636740 638802 641180 644579 649223 654835 661018 667368 673488
58711 673488 679125 684139 688232 690936 691959 691323 689152 685574 680728 674563 666700 656921 645665 633559
58697 633559 620600 606422 591327 576364 562237 548843 536094 524525 514705 506563 499643 493632
58685 493632 488383 483761 479755 476382 473375 470369 467534 465492 464447 463906 463465 463367 464012 465452 467719
58670 467719 471085 475603 480850 486640 493586 502405 512840 523757 534220 544028 553266 561675 568610
58657 568610 573457 575984 576338 574762 571469 566847 561553 556126 550664 545135 539820 535055 530690 526218
58643 526218 521441 516649 512252 508550 505705 503572 501714 499968 498721 498165 497660 496515 495144 494649 495359
58628 495359 496555 497555 498259 498651 498611 498305 498070 497862 497548 497637 498833 500951 503222 505724 509403 514556 520437
58611 520437 526590 533358 540543 546740 550755 552824 553839 554228 554234 554391 554828 554828 553912 552747 552142 551676 550251
58594 550251 547742 545235 543812 543715 544638 546280 548563 551624 555632 560564 566338 573071 580806 589023 597049
58579 597049 604973 613463 622540 631294 639057 646073 652727 658852 664275 669432 675020 681612 689846 700301
58565 700301 712815 726578 741279 757486 775599 795083 815055 834848 853699 870690 885455
58554 885455 898229 908855 916559 921045 922973 923024 921411 918595 915374 911707 906624 899824 892223 884247
58540 884247 874883 863334 850323 836720 822063 805765 788764 772595 757601 743444 730695 720404
58528 720404 712555 706256 701107 697156 693948 690953 688669 687987 688579 689012 688339 686523 683578 679537 675182
58513 675182 671587 668770 665753 662066 658275 654925 651802 648468 644878 641295 638120 635807 634470 633627
58499 633627 632687 631519 630174 628550 626874 626055 626786 628599 630550 632553 635298 639034 643225 647364 651563
58484 651563 656389 662447 669927 678315 686971 696219 707165 720021 733352 745600 756554 766564 775078
58471 775078 781004 783961 784234 781894 776925 769945 762032 754036 746582 740278 735334 731489 728799 727862 728724
58456 728724 730470 732611 736034 741687 749192 757589 766449 775156 782040 785635 786260 785284 783453 780915 778089
58441 778089 775268 772026 768115 764236 760918 757633 754219 752104 752591 754882 757406 760178 764141 769039
58427 769039 773956 779340 786470 795231 804200 812543 820071 825935 829210 830484 830942 830173 826863 821430 815879
58412 815879 811086 806163 800504 794502 788213 781351 774766 770013 767159 764802 762394 760716 759985 759516 759512
58397 759512 761142 764494 768332 772267 777186 783095 788626 793315 798329 804046 808831 811284 812129 812884 814027
58382 814027 815386 817014 818803 820344 821854 824209 827543 830973 834083 837486 841598 846170 851329 857702
58368 857702 865088 872429 879461 887060 895650 904761 914389 925184 936857 948035 958185 968149 978309
58355 978309 987815 996090 1003497 1009991 1014780 1017942 1020830 1024307 1028041 1032021 1037064 1043239 1049456 1055319
58341 1055319 1061915 1070134 1079725 1090511 1102876 1116503 1130276 1144010 1158630 1174096 1188942 1202494
58329 1202494 1215740 1229289 1242202 1253607 1263728 1272572 1279374 1284265 1288901 1294608 1301287 1308641 1316748
58316 1316748 1324944 1332076 1338589 1346566 1356976 1368599 1380162 1391682 1403255 1414660 1426759 1441115
58304 1441115 1457507 1473955 1489848 1506735 1525366 1544393 1562840 1581332 1600007 1617834 1635053
58293 1635053 1653585 1673788 1693516 1711733 1730335 1750965 1772755 1794906 1818755 1845315 1873239
58282 1873239 1901198 1930035 1960704 1992295 2024006 2056985 2092390 2129542 2167525 2206567 2246523
58271 2246523 2286347 2326483 2369282 2415674 2463985 2513373 2565448 2620987 2678215 2736231 2796906
58260 2796906 2861307 2927391 2993524 3061218 3132009 3204651 3277811 3352550 3429732 3508034 3586995
58249 3586995 3669015 3755906 3846575 3940476 4039918 4146423 4258270 4374419 4497344 4629191
58239 4629191 4768743 4914967 5069792 5234499 5407409 5588237 5780554 5986718 6204685
58230 6204685 6433190 6675570 6935032 7211091 7504480 7820391 8162618 8529704 8921271
58221 8921271 9342771 9799551 10292180 10822682 11399261 12029526 12715423 13460715 14277032
58212 14277032 15176967 16168701 17263972 18483704 19849437 21378433 23095364 25040232
58204 25040232 27258314 29795603 32716773 36119578 40125111 44870711 50526044 57301235
58196 57301235 65427240 75152227 86783577 100723242 117447719 137460795 161216015
58189 161216015 188909736 220162358 253880730 288531619 322529990 354166801 381067222
58182 381067222 399982521 407616743 402114221 384047595 356173951 322293461 286067733
58175 286067733 250334209 216926737 186801026 160290621 137361412 117782640 101219477
58168 101219477 87295565 75638888 65899129 57750712 50905953 45129343 40231879 36055472
58160 36055472 32469444 29373084 26687163 24342011 22278279 20452412 18831309 17383647
58152 17383647 16082308 14910224 13855616 12904033 12040947 11257970 10549288 9904851 9313417
58143 9313417 8769502 8271073 7812740 7386921 6989448 6618606 6270805 5942414 5633956
58134 5633956 5347570 5082010 4834287 4604107 4392282 4196718 4014182 3844161 3687038
58125 3687038 3540415 3401261 3269860 3147801 3033887 2925690 2823346 2728107 2638834 2553467
58115 2553467 2472294 2396419 2324737 2255766 2190583 2130489 2073580 2017071 1961366 1908440 1857925
58104 1857925 1808286 1760204 1715224 1672508 1630347 1589545 1551850 1516404 1481137 1446383 1413716
58093 1413716 1382445 1350790 1319484 1290729 1264464 1239043 1214775 1193415 1174827 1157332 1140694
58082 1140694 1125583 1110731 1093835 1074859 1055417 1035447 1013654 990754 969016 948743 928366
58071 928366 907914 889327 873143 857818 842667 828803 816775 805715 795226 785838 777299 768485
58059 768485 759283 750617 742518 734091 725384 717302 709687 701389 692244 683145 674321 665477 657357 651049
58045 651049 645829 639852 633003 626896 621904 616357 609077 600810 592673 584792 576977 569343 561998 555162
58031 555162 549441 544804 539776 533115 525736 519301 513478 506631 498753 491500 485454 479627 473805 469175
58017 469175 466253 464082 461929 460056 458478 456622 454552 453015 452025 450935 449966 450000 450727 450695 449460 448064
58001 448064 447202 446614 446492 447618 449657 450993 450877 450318 450336 450712 450787 450144 448184 444460 439798 435697 432280
57984 432280 428197 422872 417400 412871 409198 405959 403014 399860 395786 391078 386840 383297 379586 375466
57970 375466 371810 369075 366749 364729 363757 364001 364596 365055 365781 366790 367447 367947 369525 372532 375690 377931
57954 377931 379538 380812 381073 379816 377562 374709 370837 366048 361733 358966 357200 355573 354523 355093 357484
57939 357484 361237 366096 371892 378252 385143 392971 401558 409869 417348 424571 431773 437708 440885 441199
57925 441199 439468 436048 430859 424240 416842 408948 400546 391834 383169 374861 367331 361028 355925 351559
57911 351559 347796 344953 343078 341876 341433 342037 343098 343413 342949 343227 345242 348072 350303 351848 353470
57896 353470 355292 356813 357918 359022 360526 362696 365659 369051 372190 375021 378298 382365 386399 389340
57882 389340 391019 391868 392124 391784 390792 388859 385683 381684 377835 374424 370738 366327 361642 356980 351821
57867 351821 345956 340436 336575 334656 334264 335118 336824 338560 339841 341166 343199 345886 349026 353013 358223
57852 358223 364175 370000 375264 379733 383028 385302 387602 390647 393684 395339 395230 394027 392430 390913
57838 390913 390035 390112 390779 391498 392146 392549 392034 390238 387948 386294 385394 384518 383191 381345 378806 375565 372392
57821 372392 370317 369569 369622 370088 370878 371694 372124 372072 371382 369178 364349 356819 347814 338770 330287 322025 313305
57804 313305 303983 295016 287870 283041 279557 276253 272974 270062 267367 264630 262401 261647 262593 264655 267308
57789 267308 270275 273066 275155 276600 277864 279115 280355 282118 285224 289712 294686 299359 303793 308458
57775 308458 313541 318860 324121 329071 333567 337612 341288 344695 347889 350555 351784 350717 347654 344027
57761 344027 341005 338585 336343 334325 332651 330877 328584 326234 324725 324348 324788 325856 327480 329220 330498
57746 330498 331211 331543 331394 330614 329653 329200 329218 328941 327908 326494 325314 324496 323648 322343 320673 319328 318873
57729 318873 318933 318621 317907 317787 318683 319542 319270 318303 317842 318128 318567 319122 320357 322262 324170 325931 328142
57712 328142 331086 334246 337035 339210 340489 340549 339623 338408 337177 335585 333455 331108 328798 326414 323920
57697 323920 321474 318935 315875 312307 308854 305952 303341 300549 297424 294035 290558 287457 285336 284309
57683 284309 283829 283316 282723 282412 282851 284593 288191 293875 301480 310882 322488 337273 356391 380542
57669 380542 409498 442242 477627 514710 552309 588527 620782 645910 660233 660482 645670 618069
57657 618069 582053 542194 502438 465878 434031 406519 382310 361194 343565 329323 317988
57646 317988 309514 303885 300070 296558 292958 290079 288332 287119 285961 285131 284842 284779 284809 285299 286277 287057
57630 287057 287186 287038 287008 286828 286173 285306 284515 283434 281518 278889 276180 273858 272094 271021 270632 270552 270226
57613 270226 269334 267947 266467 265380 264794 264233 263208 261939 261098 260923 261108 261522 262428 263898 265546 266931
57597 266931 267711 267446 265957 263921 262312 261151 259584 257376 255436 254537 254404 254546 255058 255908 256237 255260
57581 255260 253479 252191 252045 252608 253112 253083 252494 251796 251546 251631 251224 249902 248402 247711 247836 248096 248275 248703
57563 248703 249321 249464 248739 247613 246903 247050 247883 248816 249242 249025 248670 248794 249450 250190 250734 251306 252234 253433
57545 253433 254373 254554 254028 253479 253710 255063 257365 260315 263652 266968 269789 271910 273436 274469 275053 275468
57529 275468 276102 276906 277421 277559 277948 279194 281138 283129 284726 285833 286530 287149 288271 290174 292404 294207
57513 294207 295344 296227 297346 298777 300267 301589 302815 304215 305841 307322 308307 308999 309878 310978 311902
57498 311902 312591 313490 314737 315725 315824 315117 314108 313072 312056 311130 310225 309060 307661 306722 306998 308485 310482
57481 310482 312217 313112 312739 311136 309137 307961 308371 310342 313325 316526 319105 320635 321516 322668 324678
57466 324678 327255 329539 330878 331417 331990 333359 335493 337702 339426 340669 341677 342570 343455 344583 346174
57451 346174 348231 350676 353415 356243 358938 361585 364505 367685 370561 372561 373646 374229 374853 376041 378038
57436 378038 380453 382519 383942 385211 386902 389032 391341 393779 396362 398883 401141 403236 405366 407575
57422 407575 409928 412599 415513 418261 420751 423575 427243 431295 434679 436921 438569 440545 443406 447122
57408 447122 451211 455073 458365 461109 463473 465715 468322 471730 475638 479052 481432 483509 486540 490952
57394 490952 496070 500961 505163 508783 512343 516474 521353 526391 530705 533855 536103 538157 540851 544763
57380 544763 549781 555167 560279 565164 570263 575769 581456 586932 591847 596017 599558 602787 605950 609231
57366 609231 612963 617411 622304 627051 631524 636156 641133 646108 650904 655917 661467 667389 673574 680223
57352 680223 687102 693289 698324 702983 708272 714167 720053 725856 731945 738393 745165 752647 761044 769571
57338 769571 777165 783805 790237 796652 802609 808204 814309 821553 829831 838835 848205 857140 864876 871738
57324 871738 878910 886924 895177 903135 911145 919660 928503 937419 946666 956476 966457 976097 985457 994844
57310 994844 1004205 1013435 1023058 1033928 1046188 1058940 1071068 1082232 1092991 1104126 1115969 1128420
57298 1128420 1141499 1155627 1171157 1187816 1204820 1221430 1237272 1252377 1267260 1282756 1299328
57287 1299328 1316665 1334322 1352563 1372038 1392712 1413733 1434407 1454776 1475087 1495232 1514944
57276 1514944 1534139 1552790 1570815 1588329 1605821 1623862 1642699 1662145 1681688 1700789 1719336
57265 1719336 1737816 1756849 1776672 1797350 1819250 1842835 1867933 1893637 1919041 1943877 1968509
57254 1968509 1993646 2020000 2047785 2076441 2105071 2133047 2160044 2185747 2210086 2233607 2257062
57243 2257062 2280651 2304165 2327805 2352243 2377766 2403984 2430604 2457968 2486547 2516207 2546178
57232 2546178 2575480 2603344 2629652 2655173 2681065 2707917 2735369 2762661 2789349 2815570 2841910
57221 2841910 2869035 2897210 2926281 2956316 2987935 3021546 3056547 3091890 3127326 3163463 3200689
57210 3200689 3238723 3277216 3316074 3355004 3393375 3430780 3467258 3502835 3537356 3570910 3603884
57199 3603884 3636467 3668651 3700925 3734406 3769931 3807336 3845775 3884377 3922585 3960345 3998112
57188 3998112 4036260 4074365 4111516 4147344 4182255 4216707 4250888 4285199 4320282 4356364 4393174
57177 4393174 4430715 4469453 4509523 4550405 4591671 4633356 4675298 4716854 4757694 4798207 4838569
57166 4838569 4878007 4915538 4950910 4984254 5015363 5043981 5070463 5095421 5118880 5140322 5159456
57155 5159456 5176508 5191875 5205875 5218714 5230436 5240924 5250042 5257497 5262600 5264703 5264148 5262331 5260483
57142 5260483 5258865 5257398 5256464 5256468 5257064 5257513 5257663 5257996 5258796 5259754 5260448 5260874 5261507 5262991 5265582 5268821 5272039
57125 5272039 5275517 5280829 5289723 5302793 5319563 5339630 5363290 5391083 5423118 5459056 5498782 5543235
57113 5543235 5594656 5655886 5729229 5815868 5916157 6030335 6159301 6305351 6472671 6667337
57103 6667337 6897153 7171782 7503006 7904813 8393512 8987920 9708940 10578435 11618300
57094 11618300 12849873 14292218 15959264 17858135 19989395 22346001 24909315 27646379
57086 27646379 30512646 33457143 36424374 39353132 42175431 44813497 47172789 49140626
57078 49140626 50603891 51480568 51739769 51394151 50478038 49035177 47121239 44807733 42178376
57069 42178376 39321736 36325072 33268861 30222495 27244406 24385655 21691039 19195732
57061 19195732 16922350 14881781 13075196 11494679 10124247 8943038 7928780 7059604
57053 7059604 6315104 5677369 5130870 4661290 4255475 3902856 3595789 3327924 3092986
57044 3092986 2885333 2700420 2534072 2382208 2241758 2110852 1987634 1869977 1757025
57035 1757025 1649945 1550402 1459191 1376988 1305083 1244078 1192658 1148983 1112663 1083707 1059419
57024 1059419 1033491 998797 951022 890246 820089 745538 670799 598560 530838 469702 416474
57013 416474 370613 330323 294448 263251 237258 215889 197615 181236 166720 154745 145530 138254
57001 138254 131746 125601 120310 116346 113544 111502 110127 109488 109440 109797 110705 112581 115749 120282 126056
56986 126056 132817 140394 148958 158785 169562 180139 189128 195493 198440 197220 191514 181890 169556
56973 169556 155782 141774 128855 118160 110058 104172 100089 97859 97764 99878 104119 110642 119921 132292
56959 132292 147400 164208 181604 198962 216038 232278 246160 255225 257032 250634 237459 220600
56947 220600 202966 186072 170430 156536 145023 136065 129231 124109 120911 120367 123220 129823 140145
56934 140145 154095 171713 192810 216467 241308 266260 290439 311924 327308 333278 328600 314365
56922 314365 292820 266631 238794 211994 187532 165261 144655 125683 108766 94479 83284
56911 83284 75038 68734 63175 58006 53679 50502 48208 46449 45152 44273 43722 43618 44228 45604 47684
56896 47684 50693 55002 60628 67424 75760 86448 99918 115944 134187 154388 175899 197661 218822
56883 218822 238854 256843 271169 280184 282965 279481 270666 258465 245241 232734 221810 213128
56871 213128 207484 205465 207324 213393 224096 239414 258961 282806 311711 346276 386199 430417
56859 430417 477370 524893 570322 610775 642914 662678 666542 653853 627715 593293 555549 518329
56847 518329 484362 455312 432118 415659 406752 405473 411373 424714 446808 478795 520837 572854
56835 572854 634869 705692 781905 859037 933118 1000038 1053887 1087429 1094933 1074663 1029400 965617
56823 965617 891805 816036 743826 677925 619751 570488 530935 501105 480543 469011 466807 474554
56811 474554 492666 520865 558072 602645 652534 705205 757609 806112 846158 872245 879297 864987
56799 864987 830961 781903 723697 662166 602259 547185 498140 455189 418489 388661 366321
56788 366321 351567 343725 341628 344542 352907 367580 388092 412158 437193 461670 484451 503347
56776 503347 515160 517120 508019 488333 459877 425303 387435 348841 311754 277883 247990 221989
56764 221989 199651 180904 165374 152260 140998 131520 123544 116231 108994 102096 95967 90493 85541
56751 85541 81584 79009 77187 75086 72583 70468 69179 68233 66942 65213 63510 62377 62048 62316 62799
56736 62799 63326 63837 64013 63528 62766 62622 63277 63842 63588 62865 62339 62053 61835 61920 62414 62775 62671 62784 63891
56717 63891 65570 66792 67364 67848 68419 68951 69941 72102 74991 77184 78047 78345 78845 79289 79111 78402 77667
56700 77667 77252 77355 78056 78965 79321 78843 78114 77799 77846 77780 77486 77285 77474 78156 79484 81622 84251 86345
56682 86345 86884 85980 85008 85274 86800 88788 90942 93439 95752 96654 95864 94750 94732 95743 96904 97909
56666 97909 98861 99431 99260 98804 98781 99062 99009 98619 98376 98237 97787 97246 97345 98196 99206 100045 100768 101044 100282 98681
56646 98681 97200 96282 95467 94472 93836 94119 95165 96498 97920 99429 100979 102536 104031 105245 106152 107212
56630 107212 108814 110533 111616 112059 112494 113098 113374 112992 112096 110816 109303 108170 107947 108025 107148 105159 103291
56613 103291 102497 102447 102532 102820 103437 103875 103618 102848 101973 100992 99867 98978 98633 98490 97977 97025 96039 95453 95554
56594 95554 96357 97383 97954 97984 98079 98723 99822 101219 103081 105471 108036 110380 112307 113506 113574 112704 111754
56577 111754 111324 111245 111333 111980 113520 115515 117261 118657 120066 121670 123505 125883 129169 133249 137689 142447
56561 142447 147975 154503 161511 168191 174428 181098 189039 197716 205381 210882 214885 218830 223128 227133
56547 227133 230585 234051 237896 241645 244572 246251 246429 245168 243282 241843 240971 239807 237882 235632 233226
56532 233226 229850 224835 218802 212988 207910 203327 199097 195390 192286 189677 187443 185430 183514 181907
56518 181907 181015 180693 180055 178401 176025 173838 172488 172027 171988 171540 170016 167662 165458 163964 162736 161169
56502 161169 159347 157659 156030 154093 151855 149761 148239 147412 147042 146567 145495 143906 142281 140833 139505
56487 139505 138616 138747 139688 140268 139738 138677 138006 137695 137133 136353 136093 136799 138210 139927 141911 144328 147153
56470 147153 149959 152066 153065 153290 153587 154526 155995 157417 158075 157415 155654 154018 153755 154822 156114 156937
56454 156937 157465 157784 157507 156709 156248 156580 157026 156763 155845 154702 153356 151846 150832 150993 152156 153593 154775
56437 154775 155401 155260 154702 154739 155967 157742 159033 159705 160337 161139 161757 161885 161445 160372 158821 157371 156541
56420 156541 156231 156076 156028 156141 156176 156017 156137 156930 157845 157894 157035 156360 156757 157956 159063 159635 159945 160386 160939
56401 160939 161287 161299 161175 161066 160890 160759 161235 162632 164338 165434 165866 166342 167204 168219 169440 171328 173830
56384 173830 176226 178183 180139 182376 184555 186494 188517 190682 192553 194142 196171 198889 201576 203788
56370 203788 206094 208868 211296 212477 212773 213178 214026 215126 216505 218136 219474 220177 220777 221818 222874
56355 222874 223298 223466 224290 225870 227518 228919 230394 232122 233857 235321 236426 237253 238136 239437 240886
56340 240886 241669 241581 241476 242121 243252 244317 245427 246882 248420 249678 250898 252429 254040 255385 256570
56325 256570 257718 258550 259028 259664 260541 260867 260237 259571 259927 261174 262697 264543 266847 269025 270718 272778
56309 272778 276021 279603 282004 283130 284240 286192 288954 292427 296491 300557 304226 308066 312664 317351
56295 317351 321019 323768 326509 329394 332020 334799 338607 343249 347718 351977 357113 363643 370888 378163
56281 378163 385429 392667 399702 406811 414608 423221 432359 442054 452453 463157 473791 485016 497870
56268 497870 512242 527056 541907 557449 574308 592629 612629 634557 658271 683904 712765
56257 712765 746491 785454 829114 877743 932562 994300 1062888 1138513 1221691 1312197 1409171
56246 1409171 1512461 1622653 1739449 1860867 1984191 2106854 2226403 2340526 2447260
56237 2447260 2544473 2629279 2698748 2750923 2784433 2797745 2790046 2762524 2717514 2656742 2581685
56226 2581685 2495180 2400975 2301615 2198153 2091954 1985323 1880184 1777473 1678059 1583110
56216 1583110 1493384 1409126 1330618 1257849 1189907 1125949 1066483 1012478 963511 918264 876561
56205 876561 839294 806480 777057 750580 727449 707309 688857 671421 655237 640115 625453
56194 625453 611755 600474 591986 585127 578969 573615 569122 565157 561872 559638 557721 554822 551029 547684
56180 547684 545193 542703 540090 538455 538283 538820 539663 541248 543418 545262 546793 549139 552612 556273 559803
56165 559803 564087 569509 575400 581595 588824 597129 605621 614176 623562 633554 643006 652246 663272 676902
56151 676902 691828 707299 724630 745127 768567 794821 825159 860853 902180 949682 1004613
56140 1004613 1067176 1136074 1210595 1291139 1376660 1463471 1547662 1626928 1699291 1762438 1815881
56129 1815881 1861846 1902571 1938333 1969209 1996505 2020667 2039526 2050447 2052888 2047460 2034170 2013261
56117 2013261 1986337 1954767 1917912 1874121 1822446 1762440 1693890 1618187 1538761 1459109 1381562
56106 1381562 1308546 1242968 1186066 1136661 1093821 1058416 1030719 1008574 989767 974523 963851
56095 963851 956984 952276 949299 948276 948641 949798 952217 956261 961022 965600 970400 976066 982371 989202
56081 989202 997201 1006392 1015702 1024845 1034981 1046583 1058490 1070091 1082410 1095929 1109491 1122595
56069 1122595 1136493 1151680 1166701 1180915 1195948 1212716 1229528 1245135 1261139 1279158 1297908
56058 1297908 1315436 1332144 1349310 1366579 1383163 1399666 1416585 1432875 1448017 1463553 1480743
56047 1480743 1498875 1517710 1538993 1563391 1588567 1612742 1637634 1665323 1694737 1723891 1753132
56036 1753132 1783397 1813773 1843673 1875043 1909521 1945722 1982174 2020350 2061833 2105104 2148388
56025 2148388 2193118 2241235 2291516 2341974 2393549 2448055 2504837 2562813 2623378 2687962 2755242
56014 2755242 2824097 2896532 2974166 3054801 3136206 3220361 3310097 3404590 3502115 3604073 3712016
56003 3712016 3823982 3938192 4057194 4183876 4316889 4454720 4600522 4757689 4924263
55994 4924263 5097200 5278537 5471746 5675825 5889056 6114924 6358031 6617760 6892358
55985 6892358 7185509 7502350 7842935 8206335 8596963 9019970 9475217 9963310 10492440
55976 10492440 11071251 11700577 12381140 13123593 13941540 14841350 15829985 16926757 18155889
55967 18155889 19534605 21082083 22834298 24837565 27136597 29786477 32871778 36501262
55959 36501262 40795959 45902611 52009358 59329460 68087030 78551179 91078460 106098735
55951 106098735 124067639 145415814 170404743 198837725 229855833 262112200 294160249
55944 294160249 324486393 351017424 370785737 380547728 378183271 363790231 339633778
55937 339633778 309146779 275794772 242369650 210755691 181994447 156502093 134315936
55930 134315936 115269350 99083090 85424783 73956999 64356903 56317262 49559456
55923 49559456 43853202 39014818 34889807 31348207 28290540 25641050 23332421 21304690
55915 21304690 19514208 17930642 16525017 15269132 14143671 13136111 12231020 11410692
55907 11410692 10663718 9984288 9363981 8792022 8262584 7774351 7323650 6904801 6516017
55898 6516017 6158155 5828440 5521700 5236673 4974941 4734685 4511548 4304682 4115929
55889 4115929 3943828 3784150 3635690 3499938 3375606 3258737 3147664 3042676 2941396
55880 2941396 2839783 2737623 2638276 2543179 2451057 2362206 2278816 2200960 2126368 2054184 1985178
55869 1985178 1918633 1852961 1789227 1730274 1676443 1625581 1576825 1530906 1487206 1444183 1402425
55858 1402425 1363804 1327947 1292879 1258673 1226966 1197306 1167506 1137410 1108962 1082746 1057669
55847 1057669 1033747 1011908 991220 969531 946700 924262 902306 879808 857611 837696 819707
55836 819707 801507 783013 766187 751275 736430 721227 707348 695489 684587 674343 665562 657775
55824 657775 649437 640721 633228 626714 619014 609496 599631 589809 578704 566387 555073 545882 537572
55811 537572 529327 522196 516809 512138 507643 504476 503503 504025 505353 507810 511407 515268 519057 523379 528175
55796 528175 532384 535550 538064 539436 538198 534089 528619 522998 517065 510671 504414 498521 492520 486376
55782 486376 480401 473851 465295 454730 443837 433942 425315 418609 415135 415195 417697 421788 427396 433889
55768 433889 439657 443276 443835 440264 432058 420701 408750 397372 386281 375807 366986 359604 352278
55755 352278 344777 338291 333085 327857 321821 315501 309008 301462 292725 283974 275954 268320 261186 255578
55741 255578 251822 249103 247026 245915 245163 243203 239733 236260 233759 231508 228824 226196 223994 221700
55727 221700 219151 216963 215035 212228 208210 204026 200297 196583 193122 191274 191327 191747 191677 192377 195000 198590
55711 198590 201649 204271 207267 210356 212633 213946 214676 214876 214512 213769 212448 210015 206743 203645 200712
55696 200712 196634 191042 185528 181453 178145 174419 170605 167796 166083 164831 163875 163388 163240 163453 164570
55681 164570 166792 169458 172070 174920 178127 181177 184115 187951 192855 197086 198817 198183 196504 194457
55667 194457 192068 189625 187435 185324 183329 182151 182053 182076 181304 180184 179670 179848 180347 181344 183079 185074
55651 185074 186832 188749 191362 194209 196350 197471 197669 196730 194505 191478 188168 184447 180111 175504 170879
55636 170879 165870 160317 154868 149959 144955 139271 133627 129266 126499 124889 124230 124404 124859 125150 125515
55621 125515 126081 126114 124944 122994 120946 118536 115243 111580 108549 106206 103889 101582 99913 98967 98117
55606 98117 97048 96078 95482 95152 94866 94384 93415 91986 90620 89701 89032 88383 88019 88184 88645 89196 89960 90632
55588 90632 90223 88357 86185 85084 84976 84777 83999 83018 82167 81486 81130 81282 81880 82924 84615 86684 88248
55571 88248 88993 89800 91490 93674 95659 97661 100048 102174 103149 103168 102838 101737 99079 95449 92425 90538
55555 90538 88934 87058 85402 84429 83871 83391 83095 83182 83710 84749 86142 87280 87786 88190 89204 90641 91912
55538 91912 93212 95141 97445 99257 100479 101702 102833 103136 102752 102835 103804 104613 104258 102966 101273 98891
55522 98891 95284 90782 86425 83051 80989 80217 80336 80636 80563 79975 78882 77374 75972 75610 76817 79079
55506 79079 81253 82502 82804 82700 82692 82843 82940 82914 82851 82583 81738 80371 79039 78008 76899 75522 74424 74042
55488 74042 73904 73369 72629 72191 71856 71079 69963 68895 67579 65549 63453 62603 63197 64092 64510 64848 65534
55471 65534 66142 66204 66075 66363 67021 67520 67589 67388 67201 67175 67161 66818 66120 65620 65784 66275 66433 66263 66242 66347 66115
55450 66115 65666 65689 66293 66740 66608 66358 66447 66640 66635 66656 66921 67126 66931 66463 65871 64917 63537 62379 62231 63103
55430 63103 64295 65150 65379 64903 63872 62816 62439 63114 64581 66055 66731 66432 65885 66168 67856 70718 74026
55413 74026 76850 78366 78464 78057 78278 79303 80347 80764 80608 80067 78959 77104 74781 72560 70942 70212
55397 70212 70334 70870 71360 71797 72433 73097 73163 72243 70526 68370 66077 64115 63067 63044 63513 63898 64067 64184
55379 64184 64404 64778 65106 64836 63503 61350 59160 57471 56337 55788 55987 56873 58132 59606 61242 62683
55363 62683 63525 64046 64979 66361 67321 67328 67042 67441 68643 70033 71078 71503 71058 69713 68012 66728 66128
55346 66128 65836 65363 64674 64264 64722 66094 67727 68894 69490 69842 70055 70063 70174 70887 72066 72978 73301 73438
55328 73438 73599 73281 72132 70646 69519 68783 68226 68190 69168 70792 71930 71905 71176 70728 71100 72060 72940 73210
55310 73210 72901 72530 72529 72733 72432 71002 68565 66092 64703 64651 65143 65320 65149 65020 64849 64299 63744 64152 65787
55291 65787 67671 68663 68525 67691 66626 65838 65946 67117 68718 69943 70521 70589 70241 69598 68910 68171 67009
55274 67009 65423 64231 64268 65398 66856 68207 69366 69923 69279 67556 65716 64528 63900 63419 63079 63155 63660
55257 63660 64337 65097 66129 67484 68780 69503 69605 69586 69900 70464 70937 71313 71864 72491 72531 71471 69615 67866
55239 67866 66967 67032 67594 67999 67933 67748 68117 69239 70550 71295 71230 70651 69952 69296 68608 67760 66838 66226 66278 66892
55219 66892 67602 68095 68433 68764 69077 69289 69352 69232 69017 68999 69409 70044 70433 70310 69691 68702 67766 67686 68852 70443
55199 70443 71178 70932 70833 71592 72647 73285 73650 74056 74135 73479 72520 71926 71575 70922 70018 69283 68629 67733 67012
55180 67012 67281 68414 69310 69466 69719 70997 72989 74552 75073 74952 74985 75600 76568 77232 77138 76517 75994 75819
55162 75819 75687 75392 75283 75796 76789 77632 77859 77517 76970 76521 76215 75893 75430 74998 74963 75428 75992 76104 75608
55143 75608 74796 74019 73488 73440 74126 75381 76450 76652 76167 75814 76045 76533 76818 76901 76952 76948 76968 77481 78745 80190
55123 80190 80954 80883 80453 79920 79217 78604 78571 78995 79148 78822 78744 79503 80670 81394 81349 80714 79736 78810 78528 79082
55103 79082 79869 80174 79954 79617 79375 79308 79677 80596 81566 81962 81880 82020 82703 83495 83821 83633 83357 83425 83933 84662
55083 84662 85450 86486 88005 89686 90819 91213 91496 92229 93135 93591 93437 92927 92269 91708 91664 92175 92520 91988
55065 91988 90828 89853 89337 88939 88564 88550 88967 89407 89596 89676 89752 89644 89267 88870 88706 88693 88516 87898 86833 85715
55045 85715 85116 85178 85435 85547 85879 86847 87966 88231 87413 86335 85824 85974 86517 87243 87844 87866 87225 86419 86025
55026 86025 86193 86774 87628 88693 89978 91540 93208 94353 94351 93332 92120 91380 91140 91142 91179 91027 90526 89890
55008 89890 89575 89693 89897 89929 89832 89546 88840 87894 87425 87883 88895 89797 90337 90550 90322 89535 88427 87388 86520
54989 86520 85720 85057 84744 84831 85173 85684 86390 87283 88248 89169 89981 90733 91522 92287 92769 92875 92986 93535 94352
54970 94352 94915 95290 96206 97960 99787 100770 100871 100665 100438 100120 99755 99443 99017 98386 98019 98437 99294 99713
54952 99713 99595 99791 100643 101168 100324 98587 97471 97639 98265 98334 97886 97649 97948 98447 98752 98801 98774 98968 99725
54933 99725 101107 102613 103596 104013 104456 105354 106567 107947 109802 112406 115411 118286 121207 124866 129397
54918 129397 133995 137752 140424 142193 143156 143420 143345 143206 142634 140807 137330 132800 128365 124774 121925 119318
54902 119318 116846 114885 113570 112291 110272 107563 105073 103580 103019 102876 102916 103261 103990 105015 106236 107565
54886 107565 108793 109645 110062 110339 110965 112330 114528 117415 120797 124503 128209 131378 133641 135256 136893
54871 136893 138881 140897 142474 143457 143720 142789 140317 136855 133613 131184 128899 125761 121789 118019 115211
54856 115211 113038 110731 108158 105849 104138 102743 101275 99762 98475 97496 96772 96432 96714 97521 98232 98080
54840 98080 96753 94719 92995 92395 92864 93629 94040 94121 94205 94362 94503 94811 95639 96940 98114 98559 98184 97355
54822 97355 96543 96044 95906 96030 96359 96931 97724 98588 99391 100059 100352 99909 98778 97655 97228 97440 97755 97968
54804 97968 98264 98619 98750 98763 99260 100554 102174 103466 104347 105187 106134 106866 106939 106231 105135 104357 104337 104785 105016
54785 105016 104780 104529 104799 105626 106724 107944 109285 110622 111708 112426 112949 113696 115124 117348 119956 122420
54769 122420 124764 127561 131193 135438 139894 144439 148998 153191 156576 159109 160974 162067 161966 160399
54755 160399 157485 153547 148989 144360 140227 136779 133685 130494 127157 124104 121823 120467 119825 119536 119213
54740 119213 118470 117155 115685 114838 114938 115430 115655 115939 117366 120339 123812 126294 127329 127719 128574 130546
54724 130546 133770 137966 142421 146252 149028 151063 152931 154751 156078 156414 155596 153675 150694 146853 142728
54709 142728 138964 135745 132805 129964 127285 124670 121833 118941 116793 115839 115445 114692 113626 112975 112767
54694 112767 112093 110397 108212 106310 104805 103500 102560 102221 102264 102360 102730 103847 105515 106750 106690 105353 103510
54677 103510 102096 101766 102658 104366 106211 107680 108594 108949 108749 108089 107327 106977 107271 107877 108218 108080 107740
54660 107740 107464 107206 106965 107045 107593 108205 108439 108446 108534 108344 107251 105567 104525 104829 105844 106502 106439 105929 105316
54641 105316 104942 105137 105779 106241 106153 105916 106117 106807 107714 108716 109665 110138 109889 109234 108552 107737 106663 105789
54623 105789 105661 106024 106092 105629 105139 105024 105155 105292 105405 105512 105634 106001 106866 108025 108880 109084 108845 108548 108327
54604 108327 108022 107290 105884 104083 102751 102581 103327 104138 104571 104914 105574 106662 108118 109772 111168 111842
54588 111842 111941 112166 112936 113947 114717 115156 115334 115045 114000 112338 110640 109444 108916 108949 109442 110370 111580
54571 111580 112621 112999 112725 112411 112607 113222 113840 114397 115127 115958 116456 116421 116141 115925 115736 115439 115089 114791 114587
54552 114587 114665 115413 116973 118940 120713 122049 123063 123850 124365 124676 125035 125583 126127 126373 126388 126642 127501 128734
54534 128734 129705 129975 129538 128532 127113 125677 124771 124437 124000 122891 121471 120638 120761 121399 121917 121964 121490
54517 121490 120828 120665 121400 122425 122609 121639 120383 119693 119374 118700 117550 116545 116233 116541 116942 116887 116091 114740
54499 114740 113463 112989 113680 115339 117381 119192 120483 121380 122157 122880 123432 123846 124395 125250 126182 126673 126289
54482 126289 124986 123221 121776 121297 121921 123354 125192 127079 128717 130014 131170 132380 133505 134239 134566
54467 134566 134763 134985 135124 135028 134640 134002 133368 133233 133819 134598 134742 134060 133155 132682 132925 134001 135779 137464
54449 137464 137983 137176 136021 135302 134680 133624 132591 132392 132733 132461 131262 130187 130142 130660 130710 130162 129776 130000
54431 130000 130487 130797 130968 131217 131522 131803 132190 132788 133412 133919 134585 135646 136576 136486 135398 134483 134650 135431
54413 135431 135781 135546 135395 135636 135913 136063 136470 137353 138426 139496 140815 142456 143907 144715 145103 145483 145768
54396 145768 145696 145525 145786 146416 146687 146063 144763 143457 142705 142724 143334 144014 144190 143622 142494 141187 140123 139690
54378 139690 140050 140922 141780 142348 142901 144004 145978 148589 151245 153495 155329 156977 158546 160010 161499
54363 161499 163281 165407 167625 169707 171608 173188 174125 174383 174517 175150 176132 176475 175197 172211 168451 165155
54347 165155 162880 161143 159124 156671 154362 152622 151227 149857 148708 148142 147990 147661 146830 145672 144453
54332 144453 143266 142187 141432 141228 141594 142247 142718 142695 142285 141748 140981 139655 137940 136642 136280 136456 136542 136561
54314 136561 136822 137026 136477 135104 133565 132336 131323 130451 130032 130328 131264 132711 134470 135851 135973 134875
54298 134875 133720 133383 133370 132733 131618 131112 131714 132718 133170 132792 131867 130812 130129 130288 131234 132310 133009
54281 133009 133611 134750 136503 138258 139397 139782 139539 138768 137662 136654 136093 135842 135444 134788 134342 134606 135468
54264 135468 136401 137257 138494 140417 142452 143532 143272 142395 141887 141934 141964 141578 141112 141243 142299 144063 146007
54247 146007 147533 148180 147890 147097 146360 145869 145380 144600 143517 142373 141495 141166 141462 142122 142749 143230 143839 144816
54229 144816 145976 146919 147457 147590 147191 146120 144727 143850 143974 144571 144602 143605 142064 140728 139881 139350 138888
54212 138888 138324 137597 136852 136373 136168 135799 134920 133855 133304 133512 134110 134766 135547 136505 137322 137677 137721 137902 138520
54193 138520 139635 141165 142735 143598 143125 141438 139363 137791 137109 137153 137544 138091 138923 140077 141078 141328
54177 141328 141008 141102 142225 143875 145170 145850 146134 146101 145904 146152 147237 148486 148825 148258 147848 148260 149103 149775
54159 149775 150070 149787 148696 147232 146375 146379 146307 145361 144020 143290 143434 143970 144442 144550 144004 142894 141922 141693
54141 141693 142006 142280 142282 142034 141493 140880 140873 141780 142926 143536 143855 144599 145676 146378 146629 147045 147782 148310 148442
54122 148442 148676 149270 149810 150020 150225 150606 150717 150306 150071 150957 152947 155038 156357 156952 157493 158346 158957 158280
54104 158280 156083 153718 153158 155200 158997 163336 167743 172230 176651 180872 185170 189911 194957 199710
54090 199710 203610 206273 207325 206437 203544 198950 193284 187401 182024 177357 173220 169647 167059 165695
54076 165695 165244 165279 165766 166909 168797 171532 175351 180165 185108 189029 191489 193001 194253 195392 196053
54061 196053 195824 194536 192277 189306 185953 182575 179608 177500 176491 176392 176636 176597 175997 175125 174601 174847 175812
54044 175812 177285 179273 181849 184816 187932 191379 195550 200354 205239 209987 214949 220248 225371 229926
54030 229926 234270 238860 243350 247030 249854 252318 254397 255380 254968 253918 253329 253632 254471 255146 254915 253301
54014 253301 250499 247279 244142 240739 236431 231268 226001 221209 216822 212612 208767 205681 203354 201340
54000 201340 199327 197523 196322 195697 195137 194193 192943 191746 190634 189255 187548 186221 186123 187134 188048 187776
53984 187776 186431 184938 183850 182980 182026 180983 179840 178466 177075 176330 176553 177193 177549 177730 178389 179653
53968 179653 180978 182036 183240 185285 188613 193409 199611 206753 214215 221895 230303 239858 250423 261626
53954 261626 273061 283778 292058 296322 296218 292525 286223 278048 268831 259680 251592 245029 239935 236040
53940 236040 233223 231687 231732 233226 235449 237704 240022 243003 246951 251325 255106 257626 259093 260334 262008
53925 262008 264092 266217 268444 271356 275252 279616 283633 286995 289964 292942 296357 300778 306574 313390
53911 313390 320255 326304 331228 335113 338166 340601 342488 343579 343487 342136 339928 337457 335161 333174 331269
53896 331269 328889 325434 320662 314843 308579 302479 296799 291289 285549 279672 274247 269508 264836 259515
53882 259515 253763 248444 243913 239759 235739 232301 229874 228133 226281 223763 220474 216634 212779 209595
53868 209595 207384 205770 204138 202222 200126 198045 196202 194846 194017 193421 192733 191825 190616 189038 187428
53853 187428 186536 186686 187148 186874 185723 184421 183409 182386 181097 179927 179346 179275 179374 179596 180007 180328 180209
53836 180209 179924 180231 181374 182661 183321 183589 184499 186589 189128 190828 191189 190903 190922 191433 191915 191966 191717 191481
53818 191481 191353 191347 191622 192336 193372 194451 195502 196734 198357 200369 202622 204991 207472 210200 213322 216733
53802 216733 220030 222906 225613 228823 232933 237640 242240 246218 249471 252144 254479 256714 258956 261077
53788 261077 262885 264390 265725 266747 266926 265889 263979 261961 260054 257571 253784 248990 244304 240431
53774 240431 237075 233660 230244 227342 225161 223398 221656 219605 216893 213390 209600 206420 204304 202973
53760 202973 201996 201207 200453 199416 198027 196690 195723 194898 193864 192767 192000 191539 190987 190161 189294 188752 188907
53743 188907 190083 192170 194379 195875 196634 197261 198005 198534 198703 198942 199602 200431 200997 201279 201489 201695 201944
53726 201944 202499 203588 205069 206582 207877 208788 209169 209136 209121 209369 209570 209388 209190 209793 211532 213964 216579
53709 216579 219428 222866 226926 231138 234943 238176 241141 244213 247364 250150 252215 253656 254845 256065
53695 256065 257437 259004 260678 262245 263628 265047 266727 268552 270226 271666 272951 274008 274646 274827 274609
53680 274609 273866 272473 270776 269473 268817 268285 267345 266350 266318 267861 270527 273212 275035 275804 275802 275315 274411
53663 274411 273093 271522 270001 268796 268021 267611 267354 267051 266834 267132 268066 268979 268987 268103 267393 267782 269049 270342
53645 270342 271382 272569 274010 275105 275380 275232 275435 276195 277156 278173 279495 281154 282710 283900 285162
53630 285162 287192 290228 294044 298392 303036 307552 311600 315406 319521 324006 328306 332102 335841 340043
53616 340043 344391 347962 350306 351877 353358 354904 356279 357554 359301 362004 365412 368710 371371 373644
53602 373644 376124 379009 382024 384921 387738 390535 393136 395222 396490 396758 396139 395143 394340 393912 393760 394009
53586 394009 394912 396188 396909 396328 394512 391931 388811 385301 381885 379150 377156 375376 373269 370726 368086
53571 368086 365901 364523 363738 363013 362176 361529 361155 360635 359848 359481 360106 361110 361350 360658 359889 359503 358988 357916
53553 357916 356783 356350 356683 357316 357980 358702 359454 360131 360836 361840 363237 364830 366431 368214 370676 374143
53537 374143 378280 382312 385913 389679 394423 400264 406787 413861 421712 430271 439136 448288 458226 469147
53523 469147 480558 492003 503664 515902 528682 541863 555633 570216 585466 601243 617930
53512 617930 636065 655614 676099 697315 719472 742644 766512 790668 814832 838725 862093
53501 862093 884917 907387 929578 951421 973025 994759 1016840 1038964 1060531 1081269 1101487
53490 1101487 1121618 1141509 1160435 1178003 1194875 1212220 1230467 1248986 1267055 1284653 1302066
53479 1302066 1319205 1335782 1351862 1367687 1383075 1397404 1410177 1421245 1430492 1437642 1442399 1444614
53467 1444614 1444302 1441686 1437077 1430494 1421565 1410062 1396397 1381346 1365535 1349573 1334304 1320163
53455 1320163 1306279 1290998 1273580 1254886 1236088 1217227 1197534 1176742 1155470 1134345 1113320
53444 1113320 1092054 1070718 1050215 1031588 1015257 1000842 987816 976215 966549 959063 953397 949079
53432 949079 946041 944422 944106 944790 946388 949073 952875 957533 962835 968946 976332 985410 996268 1008699
53418 1008699 1022520 1037826 1054823 1073392 1093034 1113430 1134837 1157693 1181988 1207394 1233936
53407 1233936 1262103 1292150 1323697 1356243 1389854 1425058 1462233 1501400 1542505 1585621 1630882
53396 1630882 1678447 1728456 1780797 1834924 1890155 1946142 2002774 2059712 2116402 2172652 2228726
53385 2228726 2284589 2339392 2392128 2442576 2491155 2537943 2582333 2623702 2661995 2697376 2729669
53374 2729669 2758430 2783420 2804626 2821743 2833853 2839804 2838951 2831547 2818353 2799840 2775786 2745672
53362 2745672 2709502 2668179 2623104 2575418 2525538 2473370 2418939 2362912 2306491 2250836 2196612
53351 2196612 2144004 2092953 2043344 1995182 1948733 1904218 1861285 1819084 1777151 1735889 1695836
53340 1695836 1656824 1618415 1580915 1545227 1511693 1479838 1449416 1421013 1395246 1371995 1350864
53329 1350864 1331944 1315491 1301125 1287894 1275002 1262090 1248983 1235662 1222405 1209538 1197021
53318 1197021 1184572 1172227 1160541 1150254 1141879 1135444 1130361 1125745 1121200 1117241 1114705 1113888 1114556
53305 1114556 1116596 1120169 1125227 1131355 1138252 1146144 1155617 1167175 1180942 1196653 1213933 1232732 1253320
53292 1253320 1275733 1299458 1323958 1349196 1375250 1401618 1427454 1452361 1476451 1499665 1521566
53281 1521566 1541805 1560255 1576693 1590908 1603078 1613378 1621083 1624885 1624432 1620879 1615458 1608117 1598110
53268 1598110 1585324 1570264 1553108 1533627 1511953 1488710 1464297 1438581 1411393 1382928 1353556
53257 1353556 1323671 1293775 1264284 1235141 1205906 1176429 1147143 1118576 1090799 1063478 1036319
53246 1036319 1009294 982527 956111 930080 904570 879909 856390 833896 811999 790546 769855
53235 769855 750133 731111 712670 695491 680405 667211 654842 642799 631740 622332 614176 606298
53223 606298 598283 590313 582363 573948 564644 554408 543396 531860 520188 508644 496953 484557
53211 484557 471456 458533 446801 436520 427244 418559 410536 403495 397554 392443 387597 382351 376209
53198 376209 369123 361521 353965 346754 339860 333206 326850 320811 314897 308914 302980 297435 292406 287662
53184 287662 282984 278443 274249 270491 267195 264403 262009 259610 256843 253815 251006 248757 247026 245593
53170 245593 244307 243129 242091 241241 240466 239463 238058 236487 235135 234109 233374 233157 233699 234556 234741 233875
53154 233875 232734 232282 232545 232882 233017 233175 233300 232843 231460 229505 227616 226228 225603 225989 227366 229195
53138 229195 230739 231651 232213 233018 234428 236210 237652 238191 237981 237780 238284 239631 241389 242815 243228 242515
53122 242515 241391 240848 241229 242062 242797 243410 244166 245170 246415 247901 249379 250190 249800 248446 247009 246199
53106 246199 246022 245928 245293 243835 241823 239870 238387 237270 236215 235190 234428 234059 233933 233748 233213 232212
53090 232212 231018 230226 230220 230776 231370 231758 232071 232415 232677 232643 232174 231335 230540 230300 230524 230305 228910 226876 225569
53071 225569 225605 226215 226309 225641 224737 224180 224294 225105 226141 226519 225689 224022 222355 221104 220128 219351 219056 219550
53053 219550 220805 222503 224217 225544 226282 226536 226525 226308 225925 225707 226104 227092 227987 228073 227264 226048 224933
53036 224933 224093 223432 222786 222083 221418 220937 220571 220029 219245 218683 218895 219763 220538 220751 220752 221123 221882 222714 223747
53017 223747 225504 227978 230333 231838 232734 233767 235134 236313 236802 236586 235885 234882 233838 233099 232770 232571
53001 232571 232175 231549 230851 230152 229438 228784 228377 228392 228902 229809 230811 231571 232029 232484 233227 234110 234598 234315 233482
52982 233482 232807 232840 233503 234289 234932 235678 236823 238197 239340 240076 240619 241146 241580 241880 242305 243234 244792 246631
52964 246631 248037 248400 247838 247200 247109 247110 246252 244478 242790 241839 241078 239750 238159 237254 237280 237557 237443 236852
52946 236852 235877 234631 233551 233135 233115 232512 230891 229050 228019 227824 227817 227859 228441 229726 231190 232394 233532
52929 233532 234870 236075 236539 236140 235274 234250 233062 231714 230413 229290 228235 227180 226380 226236 226941 228398
52913 228398 230297 232122 233242 233294 232473 231276 230053 228984 228347 228402 228943 229379 229470 229643 230288 231026 231137 230636
52895 230636 230406 231099 232321 233172 233360 233376 233651 233989 234032 233969 234372 235324 236101 235962 235062 234245 233986 233882 233324
52876 233324 232356 231622 231593 232189 233147 234476 236359 238711 241008 242673 243622 244397 245629 247327 248742 249050
52860 249050 248114 246502 244812 243180 241421 239432 237344 235353 233552 231851 229986 227695 225071 222688
52846 222688 221175 220512 219951 218776 217088 215608 214781 214337 213780 212992 212149 211339 210602 210192 210343 210749 210698 209893
52828 209893 208866 208377 208660 209423 210300 211012 211284 211049 210671 210685 211279 212210 213216 214272 215512 217159 219452
52811 219452 222317 225121 227140 228330 229236 229988 229833 228002 224735 221066 217774 214981 212624 210826 209725
52796 209725 209244 209188 209372 209610 209782 209931 210128 210229 210040 209729 209722 210084 210303 209914 209166 208847 209567 211322 213575
52777 213575 215577 216796 217248 217337 217225 216539 214897 212509 210064 208160 207041 206633 206501 205942 204580 202835
52761 202835 201473 200820 200783 201480 203237 205876 208615 210833 212490 213647 214147 214119 214275 215236 216870 218690
52745 218690 220551 222514 224357 225784 226935 228156 229364 230204 230794 231735 233292 235021 236384 237384 238415
52730 238415 239725 241167 242307 242666 242074 240832 239433 238154 237030 236023 234950 233418 231271 229024 227427
52715 227427 226619 226103 225598 225417 225865 226710 227456 227820 227733 227221 226487 225941 225915 226515 227741 229463 231234 232513
52697 232513 233189 233525 233525 232873 231735 231032 231402 232307 232704 232401 232185 232674 233567 234061 233658 232474 231026 229826
52679 229826 228983 228238 227425 226751 226402 226049 225167 223809 222700 222406 222703 222961 222997 223296 224357 225983 227375
52662 227375 228011 228263 229003 230628 232730 234693 236297 237642 238805 239840 240946 242270 243622 244574 244817
52647 244817 244276 242945 240919 238557 236449 235036 234304 233826 233157 232240 231432 231060 231056 231176 231479 232282 233656
52630 233656 235291 236932 238597 240273 241785 243160 244717 246493 247841 247976 246738 244636 242336 240325
52616 240325 238772 237450 236026 234704 234250 235029 236320 236993 236673 235812 234895 234139 233848 234431 235911 237787
52600 237787 239460 240605 241177 241360 241467 241644 241768 241848 242250 243121 243843 243611 242477 241275 240530 240030 239535 239346
52582 239346 240005 241778 244520 247591 249855 250356 249331 248154 248017 248887 249909 250361 249942 248554 246370 244028
52566 244028 242348 241748 241999 242473 242573 242061 241145 240272 239754 239666 239975 240570 241174 241404 241038 240147 239030 238138
52548 238138 237871 238187 238506 238317 237836 237735 238314 239313 240468 241718 242798 243166 242668 241843 241300 241028 240673 240277
52530 240277 240439 241703 243931 246282 247839 248323 248118 247529 246334 244422 242567 241913 242673 243941 244925 245745
52514 245745 246810 248020 249017 249791 250578 251405 252098 252542 252704 252633 252601 252933 253456 253521 252870 252112 251964 252324 252544
52495 252544 252278 251639 250738 249572 248261 246952 245588 244191 243223 243177 243835 244459 244752 245130 245863 246396 245936
52478 245936 244503 243047 242507 242993 243957 244910 245742 246412 246734 246673 246631 247124 248263 249818 251680 253855 256083
52461 256083 257928 259341 260675 262034 263063 263551 263711 263664 263155 262141 261174 260744 260577 260083 259172 258113 256909
52444 256909 255392 253811 252702 252161 251663 250718 249371 248076 247298 247163 247219 246678 245205 243409 242280 242268 243109
52427 243109 244317 245429 246021 246029 246013 246598 247603 248180 247894 247327 247528 249147 252140 255951 259877 263527 267119
52410 267119 271229 276244 282138 288715 295883 303759 312568 322110 331120 337475 339590 337578 332763 326309
52396 326309 318702 310303 301709 293503 286197 280451 276800 275036 274305 274014 274258 275228 276580 277619 277870
52381 277870 277437 276996 277426 279077 281404 283617 285600 287785 290278 292794 295407 298619 302404 305916 308533
52366 308533 310652 312962 315350 317102 317888 318092 318273 318682 319164 319271 318698 317833 317684 318957 321345 323927
52350 323927 326037 327500 328408 329117 330240 332154 334535 336729 338582 340563 343154 346480 350565 355571 361582
52335 361582 368295 375189 382062 389386 397961 408007 418643 428606 437627 446838 457657 470566 485140
52322 485140 500868 517491 534757 552341 570011 587596 604845 621635 638268 655231 672654
52311 672654 690275 707897 725524 742985 759818 775729 790925 805789 820322 834081 846652
52300 846652 858104 868923 879463 889525 898590 906423 913131 918561 922041 923118 922266 920309 917284
52287 917284 912460 905581 897523 889500 882106 875447 869724 865146 861521 858555 856502 856016 857275 859705
52273 859705 862794 866834 872583 880351 889658 899643 909574 919093 928291 937616 947546 958256 969715 982009
52259 982009 995270 1009175 1022845 1035575 1047585 1059690 1072154 1084219 1094894 1103956 1111879 1118941
52247 1118941 1124744 1128626 1130203 1129434 1126505 1121885 1116213 1109742 1101985 1092327 1081082 1069594 1059088
52234 1059088 1049679 1040659 1031462 1022022 1012388 1002461 992263 982239 973185 965921 960824 957445 954666
52221 954666 951631 948519 946143 944846 944207 943823 943851 944575 945943 947884 950671 954516 959085 963840 968623
52206 968623 973439 977868 981288 983662 985682 988099 991283 995362 1000314 1005793 1011264 1016438 1021322 1025845
52192 1025845 1029807 1033258 1036493 1039534 1041970 1043480 1044140 1043993 1042671 1039787 1035512 1030457 1025044 1019165
52178 1019165 1012482 1004982 997281 990315 984580 979721 975081 970563 966623 963513 961006 958977 957706 957340
52164 957340 957496 957785 958401 959766 961775 963808 965407 966642 967852 969294 970966 972541 973529 973751 973638 973923
52148 973923 975078 977105 979682 982265 984201 985029 984727 983617 982122 980684 979691 979266 979250 979542 980302 981727
52132 981727 983876 987032 991937 999215 1008637 1019396 1031149 1044454 1060091 1078253 1098546 1120460
52120 1120460 1143615 1167712 1192488 1217728 1243204 1268532 1293199 1316799 1339305 1361023 1382105
52109 1382105 1402091 1420152 1435919 1449922 1462937 1475003 1485310 1493105 1498495 1502298 1505257 1507503
52097 1507503 1508646 1508144 1505487 1500181 1491892 1480828 1467841 1453896 1439352 1423973 1407692 1391131
52085 1391131 1375264 1360735 1347603 1335583 1324397 1314046 1305005 1298071 1293852 1292336 1293023 1295442 1299527
52072 1299527 1305549 1313677 1323539 1334257 1345079 1355957 1367328 1379353 1391742 1404332 1417455 1431469
52060 1431469 1446139 1460776 1474838 1488179 1500724 1512020 1521155 1527235 1530187 1530979 1530686 1529262 1525623
52047 1525623 1518981 1509665 1498502 1485887 1471788 1456194 1439224 1421170 1402790 1385122 1368562 1352469
52035 1352469 1336159 1319850 1304108 1288704 1272839 1256325 1239834 1223927 1208450 1192954 1177213
52024 1177213 1161199 1145005 1128924 1113336 1098531 1084880 1072921 1062735 1053419 1043793 1033662 1023796
52012 1023796 1014630 1005645 996139 985963 975217 963745 951269 937702 923072 907535 891606 876001
52000 876001 861022 846423 832033 818095 804846 792224 780209 768985 758482 748167 737627
51989 737627 727002 716486 705758 694325 682198 669792 657281 644459 631164 617568 604076
51978 604076 591066 578648 566581 554604 542950 532374 523602 516947 512479 510124 509433 509623 510175
51965 510175 511161 512802 515023 517651 520703 524115 527411 529935 531211 530842 528456 524184 518999 514174 510384
51950 510384 507544 505286 503339 501678 500657 500936 503034 507110 513319 522021 533219 546113 559738 573970
51936 573970 589477 606729 625433 644827 664190 683047 701270 718904 735520 749687 759403 763104
51924 763104 760161 750633 734968 713916 688423 659658 629347 599807 573038 549692 529275 511278
51912 511278 495696 482493 471262 461704 453991 448335 444520 442129 440995 441112 442199 443536 444238 443649
51898 443649 441670 438689 435042 430466 424381 416767 408547 400935 394538 389164 384348 379951 376379 374276
51884 374276 373938 375081 377302 380633 385350 391323 397911 404548 411101 417557 423699 429179 433622 436596
51870 436596 437873 437867 437361 436588 434945 431924 427950 423957 420442 417405 414973 413514 413153 413598 414531 415847
51854 415847 417392 418743 419401 419122 417996 416285 414117 411276 407412 402567 397361 392475 388127 384258 380958
51839 380958 378362 376255 374293 372588 371622 371481 371633 371593 371407 371237 370926 370348 369863 369916 370317 370376 369789 368979
51821 368979 368473 368299 368128 367793 367436 367311 367559 368120 368774 369361 369969 370800 371836 372809 373512 373904 373804 372825
51803 372825 370891 368638 366983 366360 366592 367346 368306 369027 369098 368577 367858 366970 365470 363277 361166 359966 359520
51786 359520 358936 357745 356338 355285 354719 354573 354979 356163 358068 360284 362310 363883 365304 367468 371219
51771 371219 376464 382100 387102 391540 396266 401743 407476 412575 416494 419043 419996 419059 416188 411709 406078
51756 406078 399699 393055 386716 380945 375402 369592 363652 358421 354613 352085 350081 348018 345892 344120
51742 344120 343226 343496 344714 346350 348226 350799 354463 358752 362681 365790 368367 370694 372635 374087 375282
51727 375282 376364 377124 377463 377674 377866 377489 375999 373723 371546 369863 368399 367011 366099 366042 366620 367213 367401
51710 367401 367289 367410 368359 370276 372685 375020 377212 379496 381754 383506 384593 385446 386506 387723 388814
51695 388814 389654 390213 390473 390730 391572 393096 394308 393824 391187 387185 382871 378698 374682 370925 367601 364635
51679 364635 361839 359430 358092 358295 359634 361040 361671 361469 360931 360571 360732 361675 363530 366185 369425 373185
51663 373185 377478 382056 386318 389530 391024 390399 388020 385264 383790 384286 386225 388942 392506 397275 403070
51648 403070 409124 414459 417941 418420 415511 410036 403190 395490 387125 379002 372541 368302 365576 363485
51634 363485 361815 360615 359809 359674 360922 363592 366360 367621 367063 365593 363991 362297 360349 358261 356216
51619 356216 354224 352178 349891 347118 343830 340382 337154 334148 331274 328743 326743 324956 323042 321480
51605 321480 321237 322542 324684 327205 330602 335498 341722 348703 356334 364908 374439 384398 393897 401769
51591 401769 406743 408104 406182 402001 396581 390798 385635 381957 380044 379642 380563 382990 387254 393539 401748
51576 401748 411471 422152 433527 445730 458741 471921 484503 496359 507803 518668 528174 535934
51564 535934 542690 549801 558329 568858 581859 597790 616835 638739 662814 687920 712459 734611
51552 734611 752719 765654 773131 775747 774396 769365 760052 745779 726821 704472 680206 655010
51540 655010 629539 604580 581090 559781 540869 524331 510285 498905 489939 482604 476194 470628
51528 470628 466134 462453 458769 454525 449955 445521 441076 435962 429911 423527 417766 413062 409012 404814
51514 404814 399976 394663 389395 384437 379586 374641 369884 365850 362642 359756 356751 353904 351966 351259
51500 351259 351236 351026 350257 349218 348308 347597 346955 346383 345959 345579 345016 344306 343880 344253 345657 347957 350693 353170
51482 353170 354742 355228 354942 354178 352839 350712 347956 345040 342276 339698 337370 335513 334246 333429 332844
51467 332844 332317 331570 330224 328181 325882 323886 322276 320710 319025 317521 316524 315945 315485 315225 315794 317901
51451 317901 321730 326839 332604 338720 345275 352388 359928 367747 376099 385522 396139 407173 417291
51438 417291 425335 430686 433282 433693 433081 432506 431999 430563 427308 422344 416412 409954 402934 395376 387628
51423 387628 380132 373305 367627 363440 360515 358132 355733 353287 350969 348855 347078 345923 345474 345370 345206
51408 345206 345036 345227 345938 346994 348136 349155 349941 350652 351764 353676 356270 359067 361700 364028 365929
51393 365929 367447 369081 371607 375532 380973 387975 396489 406100 416389 427801 441645 458833 479026
51380 479026 501418 526048 553746 584946 619064 654966 691441 727087 760247 789458 813853
51369 813853 833003 846522 853923 854697 848432 835126 815538 791032 762830 731497 697385 661537
51357 661537 625883 592404 562072 534604 509154 485215 462968 442896 425326 410346 397952
51346 397952 387935 379625 372105 364893 358267 352782 348592 345422 343024 341390 340546 340429 340976 342088 343395
51331 343395 344281 344370 343846 343162 342520 341857 341197 340724 340459 340173 339808 339689 340009 340258 339574 337763 335617 334080
51313 334080 333325 332927 332661 332716 333157 333554 333331 332284 330674 328941 327399 326064 324703 323154 321611 320382
51297 320382 319397 318242 316810 315607 315220 315703 316710 317983 319396 320758 321998 323479 325682 328529 331406
51282 331406 333928 336334 338994 341912 344946 348166 351583 354686 356629 356983 356123 354878 353975 353817 354598
51267 354598 356398 359049 361928 364092 364890 364470 363471 362197 360332 357601 354390 351391 348835 346413 343904
51252 343904 341486 339414 337697 336220 334944 333831 332787 331778 330840 329912 328874 327950 327841 329083 331276
51237 331276 333256 334161 334217 334376 335346 337069 338969 340461 341214 341176 340564 339808 339305 339123 339009 338810 338799 339422
51219 339422 340689 342052 343026 343798 344944 346562 348047 348873 349326 350175 351736 353630 355428 357166 359028
51204 359028 360826 362118 362793 363300 364257 365873 367771 369361 370433 371381 372625 373840 374114 373111 371719
51189 371719 371126 371447 371767 371451 370781 370168 369353 367815 365608 363341 361519 360321 359911 360554 362278 364645
51173 364645 366907 368398 368912 368902 369147 369981 370943 371442 371631 372247 373620 375237 376443 377178 377693 377797 376816
51156 376816 374399 371086 367907 365530 363883 362454 360759 358549 355857 353053 350716 349197 348262 347324 346058
51141 346058 344661 343594 343271 343978 345758 348224 350681 352580 353771 354321 354439 354684 355804 358004 360593
51126 360593 362735 364328 365818 367303 368341 368669 368692 369133 370412 372417 374661 376675 378452 380485 383129
51111 383129 385986 388168 389159 389183 388830 388662 389072 390073 391157 391774 392061 392733 394147 395901 397461 398737
51095 398737 399808 400554 400902 401084 401262 401211 400801 400570 401311 403140 405351 407191 408439 409245 409815 410404 411341
51078 411341 412803 414585 416172 417095 417333 417411 418045 419532 421550 423576 425419 427302 429636 432871 437403
51063 437403 443383 450609 458716 467410 476506 485937 495845 506413 517378 527936 537442 546081 554535
51050 554535 563069 571266 578595 584827 589783 593063 594274 593355 590529 586114 580520 574246 567614 560569
51036 560569 553050 545629 539486 535458 533103 530918 527580 522845 517249 511319 505386 499902 495339 491683
51022 491683 488499 485740 484116 484389 486603 490260 494981 500565 506681 513033 519858 527819 537263 547843
51008 547843 558929 570114 581338 592764 604612 616842 628875 639832 649176 657000 663643 669189
50996 669189 673436 676226 677654 678000 677560 676610 675506 674741 674732 675626 677509 680840 686317 694194 704019 715236
50980 715236 727672 741099 754742 767882 780830 794817 810948 829697 851283 875935 903716
50969 903716 934653 969159 1007815 1050625 1097006 1146675 1199968 1256973 1316912 1378753 1441918
50958 1441918 1505865 1569367 1630791 1688985 1743457 1793786 1839194 1878650 1911246 1936737 1956039
50947 1956039 1970907 1982727 1991754 1997794 2001317 2003462 2005157 2006612 2007428 2006692 2003196 1996227 1986158 1973794
50933 1973794 1959271 1942114 1922167 1899616 1873978 1844005 1809021 1769786 1727504 1682484 1634386
50922 1634386 1583436 1530769 1477588 1424510 1371737 1319513 1268389 1219306 1173429 1131598 1093849
50911 1093849 1059598 1028274 999653 973684 950259 929144 909937 892065 875107 859187 844848
50900 844848 832365 821316 811038 801478 793307 787080 782436 778413 774524 771182 768950 767717 766945 766495
50886 766495 766697 767657 769021 770627 772975 776784 782336 789409 797502 805916 813984 821656 829671 838857 849465
50871 849465 861429 874913 890110 906760 924470 943424 964219 987041 1011635 1038215 1067810
50860 1067810 1101432 1139379 1181606 1228282 1279641 1335761 1397015 1464470 1539392 1622453 1713746
50849 1713746 1813358 1921383 2037473 2160819 2290647 2426288 2566536 2709179 2851417 2990698
50839 2990698 3125040 3252552 3370649 3475884 3564880 3635726 3688494 3724369 3744531 3750123 3743048
50828 3743048 3726229 3702865 3675610 3646559 3617798 3591712 3570713 3556455 3549078 3547010 3547602 3547988
50816 3547988 3545447 3537232 3520493 3492582 3451452 3395869 3325492 3240818 3143003 3033759 2915454
50805 2915454 2791035 2663462 2535072 2407629 2282930 2163161 2050591 1947076 1853744 1770907
50795 1770907 1698188 1634883 1580296 1533771 1494791 1463314 1439667 1423538 1413146 1405989 1400470 1396321
50783 1396321 1393468 1391212 1388755 1385835 1382363 1377919 1372059 1364695 1355722 1344762 1331837 1317842 1303609
50770 1303609 1288774 1272360 1254272 1235328 1215852 1195233 1173202 1150692 1128834 1107747 1086955
50759 1086955 1066675 1047994 1031871 1018438 1007266 997901 990167 984283 980833 980368 983001 988535 996969
50746 996969 1008661 1023961 1042923 1065405 1091317 1120690 1153708 1190737 1232146 1277882 1327352
50735 1327352 1379912 1435445 1494291 1556560 1621774 1689284 1758871 1830674 1904513 1979437 2053943
50724 2053943 2126473 2195703 2260525 2319908 2372745 2417739 2453480 2478609 2492016 2493139 2482423
50713 2482423 2461530 2432908 2399081 2362462 2325688 2291529 2262142 2238638 2221502 2210992 2206714
50702 2206714 2207150 2210219 2214235 2217851 2219150 2215487 2204467 2184768 2155873 2117494 2069652 2013116 1949494
50689 1949494 1880970 1810028 1739188 1670694 1606414 1547962 1496620 1452949 1416737 1387597 1365564
50678 1365564 1351005 1344135 1344799 1352490 1366309 1385094 1408010 1435017 1466396 1501638 1538988 1576223
50666 1576223 1611713 1644691 1674749 1701448 1724483 1744034 1760810 1775693 1789315 1801855 1813216
50655 1813216 1823387 1832630 1841319 1849647 1857700 1865877 1875051 1886105 1899383 1914811 1932540 1953153
50643 1953153 1977154 2004546 2035096 2068778 2105618 2145200 2186608 2228836 2271056 2312465 2352228
50632 2352228 2389809 2425334 2459455 2492600 2524176 2552581 2576253 2594635 2607601 2613694 2609432 2591165
50620 2591165 2557883 2512236 2459193 2404091 2351522 2304915 2266284 2236282 2214575 2200221 2191988
50609 2191988 2188779 2189822 2194174 2200045 2204994 2206790 2203700 2194044 2176169 2149176 2113250 2069030 2017210
50596 2017210 1959058 1896745 1832436 1767220 1701485 1636141 1572889 1513135 1457126 1404294 1354194
50585 1354194 1306951 1263026 1222821 1186492 1154039 1125415 1100479 1079008 1060947 1046585 1036150
50574 1036150 1029264 1025181 1023608 1024811 1028772 1034775 1042179 1051116 1062028 1074971 1089912 1107250 1127308
50561 1127308 1149567 1173224 1198440 1226249 1257113 1290319 1324959 1360732 1397418 1434264 1470484
50550 1470484 1505986 1541026 1575461 1608867 1641236 1672969 1704259 1735030 1765660 1797383 1831710
50539 1831710 1869595 1911318 1957052 2007313 2062752 2123562 2189292 2259425 2334186 2414591 2501625
50528 2501625 2595562 2696128 2803015 2915847 3033689 3154860 3277268 3398746 3517106 3630089
50518 3630089 3735256 3829783 3910512 3974670 4020729 4048285 4056935 4045669 4013748 3962004 3892885
50507 3892885 3809329 3714010 3609597 3499196 3386271 3274435 3167492 3069296 2983138 2911341
50497 2911341 2855534 2816918 2795898 2791681 2802672 2827115 2862863 2906657 2954154 3000727 3041809
50486 3041809 3072501 3087704 3083356 3057518 3010139 2942129 2855062 2751711 2636341 2514097 2389814
50475 2389814 2267107 2148397 2035607 1930478 1833920 1745431 1663870 1588879 1521008 1460331
50465 1460331 1405647 1355458 1309195 1266967 1228683 1194174 1163916 1138833 1119265 1104641 1094131
50454 1094131 1087113 1082950 1080885 1080415 1081518 1084414 1089293 1096265 1105230 1115748 1127324 1139871 1153592
50441 1153592 1168371 1183543 1198305 1212053 1224344 1234945 1244104 1252400 1260086 1266758 1271894 1275636
50429 1275636 1278944 1283079 1288863 1296203 1304252 1312322 1320795 1331047 1344440 1361460 1381784 1404967 1431098
50416 1431098 1461045 1496057 1536823 1582889 1633224 1687407 1745886 1808985 1875987 1945334 2015319
50405 2015319 2084387 2151120 2214327 2273020 2326037 2371880 2409158 2437059 2455076 2462388 2457910 2440979
50393 2440979 2411789 2371111 2319877 2259238 2190940 2117494 2041874 1966979 1895271 1828817 1769441
50382 1769441 1718534 1676663 1643621 1619160 1603598 1597425 1600266 1610425 1625587 1643757 1663342 1682469
50370 1682469 1698695 1709654 1713797 1710192 1697811 1675607 1643543 1603259 1557359 1508144 1457152 1405610
50358 1405610 1354801 1305894 1259645 1216478 1176822 1141313 1110530 1084325 1061514 1040675 1021447
50347 1021447 1004551 990169 976699 961737 944082 924329 903776 883542 864652 848035 834007
50336 834007 822301 812876 806163 802158 799821 797905 796104 795001 795150 796651 799423 803430 808583 814647
50322 814647 821237 827868 834204 840345 846604 852908 858760 863942 868772 873304 876766 878436 878928 879957
50308 879957 882700 886744 890729 893725 895877 897992 900692 903909 907115 909951 912489 914904 917215 919566
50294 919566 922380 925875 929554 932594 934766 936685 939204 942757 947219 952069 956667 960589 963789 966349
50280 966349 968247 969670 971353 974155 978199 982772 987202 991561 996356 1001785 1007531 1013176 1018667 1024372
50266 1024372 1030749 1037875 1045362 1052951 1061143 1071010 1083276 1097873 1114550 1133533 1155198 1179174
50254 1179174 1204286 1229496 1254526 1279324 1303262 1325382 1345423 1364187 1382675 1401090 1418804
50243 1418804 1434983 1448861 1459478 1465618 1466231 1460844 1449555 1432812 1411273 1385867 1357952 1329290
50231 1329290 1301559 1275629 1251393 1228436 1206603 1185599 1164328 1141216 1115262 1086446 1055238
50220 1055238 1022367 989119 957045 926959 898666 872062 847951 827209 809559 793899 779669
50209 779669 767255 757028 748627 741367 734892 729135 723996 719344 715193 711591 708356 705102 701579 697830
50195 697830 693994 690054 686006 682268 679541 677901 676286 673332 668747 663458 658444 653971 650023 646802
50181 646802 644428 642692 641484 640993 641051 640836 639832 638664 638350 639054 640235 641687 643575 645640 647362 648972
50165 648972 651459 655289 659812 664190 668251 672221 676376 681439 688607 698515 710513 723553 737409
50152 737409 752467 768609 785219 802282 820693 841150 863306 886539 911238 938772 970218
50141 970218 1005594 1044468 1086874 1133234 1183576 1237175 1292853 1349233 1404797 1458345 1509638
50130 1509638 1559186 1607057 1652230 1693387 1729858 1761198 1786025 1801931 1806576 1798613 1777840 1745180
50118 1745180 1702611 1652520 1596828 1536997 1474888 1412992 1353502 1297455 1244999 1196159 1151100
50107 1151100 1109937 1072664 1039148 1009012 981651 956496 933136 911171 890310 870815 853500
50096 853500 838961 826978 816950 808696 802415 797967 794725 792325 791168 791829 794122 797111 800073 803120
50082 803120 806779 811294 816610 822755 829653 836607 842530 846930 850265 853089 855318 856739 857776 859168
50068 859168 860976 862438 862821 862020 860372 858184 855463 851874 847153 841765 836844 833018 829550 825179 819667
50053 819667 813993 809191 805643 803469 802940 804287 807489 812315 818268 824677 831381 839191 849054 860869
50039 860869 873761 887303 901617 916372 930820 944968 959635 974974 989953 1003822 1017099
50028 1017099 1030478 1043744 1056547 1069459 1083305 1098105 1113657 1130660 1150178 1172169 1195415
50017 1195415 1218735 1241560 1263546 1284455 1304343 1323219 1340649 1356293 1370555 1383944 1395991
50006 1395991 1405499 1411652 1414029 1411711 1403383 1388411 1366964 1339064 1304551 1264353 1220950 1177035
49994 1177035 1134213 1093211 1054611 1018822 985781 955202 926869 900424 875326 851395 829051
49983 829051 808631 789740 771619 753992 737268 722107 708959 697763 687836 678270 668672 659396
49971 659396 650957 643513 637133 632168 628905 626926 625208 622948 620150 617430 615463 614646 615131 616993 620212
49956 620212 624527 629453 634658 640203 646247 652563 658610 664072 669123 674054 678754 682618 684928 685482
49942 685482 684880 683971 682805 680411 675943 669737 662737 655129 646191 635519 623708 611674 599883 588549
49928 588549 578104 569117 561983 556860 553604 551635 550317 549627 550067 551699 553771 555531 556962 558381
49914 558381 559836 561371 563453 566551 570492 574762 579328 584690 591241 598883 607142 615333 622837 629672
49900 629672 636605 644277 652285 659512 665168 669071 671134 671281 669879 667565 664360 659450 652189 643045
49886 643045 633242 623610 614032 603960 593362 583076 574075 566339 558763 550540 542319 535492 530525
49873 530525 526695 523396 520829 519198 518062 517057 516633 517388 519151 521435 524456 528920 534933 541978 549953
49858 549953 559386 570353 581879 592815 602779 611888 620061 627146 633371 639018 643764 646836 647852
49845 647852 647086 644927 641461 636686 630795 624079 616743 608948 600875 592774 585113 578630 573914 570842
49831 570842 568689 566881 565408 564427 563817 563409 563451 564501 566956 570867 576101 582458 589659 597421 605526
49816 605526 613763 621937 630023 638149 646169 653420 659162 663183 665741 667037 667111 666159 664514 662167 658650
49801 658650 653575 647142 639991 632746 625835 619554 614055 609287 605007 600874 596634 592351 588385 584934
49787 584934 581639 577997 574211 571194 569519 568696 567823 566646 565581 564924 564621 564898 566532 570089 575112
49772 575112 580382 584967 588841 592550 596484 600527 604232 607183 609228 610451 610952 610694 609604 607777 605474
49757 605474 602817 599555 595273 589880 583737 577246 570405 562960 554977 547079 540014 534044 528891 524255
49743 524255 520290 517464 516001 515571 515573 515642 515792 516153 516763 517645 518889 520542 522554 524946 527846 531245 534897
49726 534897 538717 543132 548650 555099 561675 567873 574042 580737 587761 594183 599245 602947 605737 607887
49712 607887 609256 609413 607859 604392 599523 594405 589992 586219 582293 577844 573398 569503 565846 561852
49698 561852 557918 555337 554743 555281 555744 556108 557451 560564 565248 570825 576759 582647 588153 593305 598634
49683 598634 604715 611648 619123 626865 634912 643502 652727 662249 671435 679935 688014 695957 703143 708110
49669 708110 709869 708950 706942 705086 703582 702063 700375 698680 697044 695157 692568 689079 684758 679537
49655 679537 672991 664732 654970 644530 634278 624668 615801 607694 600417 594136 589125 585545 583231 581852
49641 581852 581432 582380 584785 587824 590294 591729 592611 593290 593038 590685 586177 581004 576766 573668 570818
49626 570818 567724 564772 562237 559647 556638 553902 552576 552858 553795 554344 554197 553628 553061 552848 553085 553556
49610 553556 554115 555073 556812 559103 561197 562625 563460 563945 564365 565234 566899 568887 570307 571097 572134 573851
49594 573851 575491 576222 576353 576875 578288 580444 583031 585545 587186 587560 587303 587354 587822 588158 588242 588539 589301
49577 589301 590371 591748 593549 595321 596200 596131 596328 598123 601757 606611 612129 618135 624575 631471 638961
49562 638961 647013 655153 662685 669104 674124 677512 679192 679455 678817 677632 676039 674217 672458 670877 669194
49547 669194 667020 664383 661848 659961 658672 657490 656235 655321 655105 655229 655046 654619 654887 656719 660155 664784
49531 664784 670598 678124 687692 698879 710851 723223 736444 751215 767580 784668 801215 816085
49519 816085 828316 837086 842008 843351 841787 838076 833180 828349 824570 821877 819594 817271 815064 813114
49505 813114 811006 808046 803878 798551 792146 784605 775974 766661 757364 748721 741045 734386 728781 724174
49491 724174 720124 715899 711194 706618 703186 701359 700753 700699 700855 701387 702783 705424 709047 712704 715519
49476 715519 717391 718689 719490 719574 719091 718686 718834 719505 720585 722142 724014 725595 726409 726673 726985 727586 728163
49459 728163 728276 727829 727119 726445 725581 723868 721128 718247 716237 714758 712337 708300 703756 700156 697562
49444 697562 695114 692723 691301 691320 692028 692450 692641 693585 696129 700313 705588 711381 717421 723592 729652 735312
49428 735312 740713 746548 753447 761375 769832 778469 787142 795522 802985 808831 812246 812281 808536 802026 794818
49413 794818 788479 783232 778820 775666 774681 776288 780231 786248 794348 804331 815513 827197 839194 851712
49399 851712 864895 878602 892425 905784 918179 929509 940074 950145 959679 968521 976605 983725
49387 983725 989311 992814 994243 994005 992236 988678 983255 976434 968883 961123 953691 947236 942106 938066
49373 938066 934751 932195 930644 930009 929967 930451 931704 933856 936802 940392 944385 948224 951282 953323 954353
49358 954353 954069 952001 948286 943759 939035 933985 928433 922904 918216 914672 912093 910399 909621 909508 909660
49343 909660 910096 911220 913090 915060 916286 916399 915590 914296 912974 911983 911431 911139 910834 910420 910021 909813 909857
49326 909857 910191 911166 913615 918496 926189 936214 947709 960082 973071 986211 998433 1008221 1014226
49313 1014226 1015872 1013535 1008238 1001114 993058 984638 976009 966947 957153 946674 935914 925285 915111
49300 915111 905843 898014 891839 887132 883764 881807 881012 880485 879302 877206 874429 871134 867534 864222 861669
49285 861669 859382 856213 851711 846699 842297 838813 835945 833676 832521 832966 834952 837890 841037 844021
49271 844021 847206 851389 856836 862672 867555 870983 873614 876136 878192 878775 877613 875723 874523 874776 876598
49256 876598 880073 885259 891672 898394 904931 911560 918487 924932 929410 930825 929038 924538 917987 910057
49242 910057 901410 892607 884130 876444 869878 864473 860049 856448 853680 851967 851716 853228 856256 860112
49228 860112 864429 869600 876119 883719 891641 899622 908081 917261 926719 935874 944630 953192 961577 969554
49214 969554 976873 983356 988922 993755 998290 1002875 1007686 1013118 1020043 1029313 1040999 1054336 1068449
49201 1068449 1083031 1098323 1114507 1131224 1147744 1163609 1178992 1194297 1209592 1224621 1239157
49190 1239157 1252908 1265151 1275105 1282954 1290074 1297873 1306601 1315610 1324520 1333729 1343888 1355323 1368156
49177 1368156 1382794 1400101 1420964 1445556 1473022 1502077 1531900 1562155 1592058 1619836 1643454
49166 1643454 1661678 1674300 1681795 1685316 1686751 1688009 1689984 1692477 1695153 1698239 1702164 1706944 1712102
49153 1712102 1717059 1721464 1725377 1729320 1734040 1740169 1748096 1757970 1769575 1782282 1795517 1809293 1823950
49140 1823950 1839349 1854763 1869742 1884654 1900131 1916374 1933246 1950676 1968435 1985829 2002154
49129 2002154 2017452 2032385 2047430 2062581 2077748 2092933 2108027 2122921 2137959 2153768 2170425
49118 2170425 2187262 2203747 2220183 2237287 2255600 2275800 2299147 2326815 2358772 2393979 2431834
49107 2431834 2473022 2518650 2568601 2620612 2670755 2715298 2752992 2785628 2815426 2841162 2857357
49096 2857357 2858066 2841733 2812331 2776184 2737927 2698842 2657963 2614369 2568794 2523517 2480892 2442284
49084 2442284 2408433 2380160 2357911 2340761 2326736 2314445 2303874 2295423 2288785 2283218 2278333 2273962
49072 2273962 2269553 2264417 2258617 2253029 2248368 2244556 2241201 2238256 2235849 2233707 2231221 2228126 2224790 2221661
49058 2221661 2218661 2215386 2211784 2208346 2205565 2203505 2202061 2201399 2201841 2203480 2206209 2210092 2215376 2222115
49044 2222115 2229994 2238492 2246875 2254004 2258577 2259821 2257893 2253596 2247998 2242326 2237693 2234527 2232487 2231260
49030 2231260 2231198 2232818 2235900 2239467 2242655 2245263 2247538 2249774 2252161 2254679 2257004 2258775 2260079 2261541
49016 2261541 2263848 2267283 2271793 2277370 2284255 2292754 2302887 2314217 2326104 2338134 2350257 2362502
49004 2362502 2374763 2386946 2399098 2411225 2423159 2434702 2445637 2455372 2462965 2467989 2471224 2473932
48992 2473932 2476428 2477829 2477285 2474972 2471688 2467943 2463848 2459599 2455640 2452213 2448901 2444689 2438686 2431037
48978 2431037 2423100 2416323 2410792 2405165 2398180 2389874 2381136 2372524 2364034 2355760 2348155 2341537 2335768 2330596
48964 2330596 2326082 2322506 2320107 2319097 2319778 2322393 2326822 2332544 2338976 2345824 2353177 2361365 2370828 2381948
48950 2381948 2394782 2408795 2423090 2437147 2451411 2466944 2484515 2504094 2525221 2547600 2571289
48939 2571289 2596575 2623848 2653468 2685618 2720374 2757943 2798575 2842116 2887854 2935124 2983927
48928 2983927 3034716 3087626 3142248 3198163 3255491 3314700 3375904 3438458 3501351 3564019 3626652
48917 3626652 3689492 3751947 3812839 3871607 3928859 3985375 4040906 4094422 4145353 4194042 4240962
48906 4240962 4286071 4329207 4370668 4411009 4450326 4488096 4523794 4557529 4589938 4621385 4651289
48895 4651289 4678357 4701560 4720801 4736590 4749296 4758931 4765434 4768827 4769128 4766484 4761414 4754640 4746470
48882 4746470 4736446 4723611 4707104 4686649 4662719 4636078 4606915 4574473 4537825 4496855 4452179
48871 4452179 4404323 4353535 4300235 4244912 4187552 4128005 4067188 4007100 3949155 3893103 3838127
48860 3838127 3784340 3732499 3682842 3635135 3589531 3546473 3505867 3467244 3430750 3397159 3366852
48849 3366852 3339608 3315525 3295275 3279078 3266169 3255698 3247601 3242207 3239626 3239983 3243645 3250544 3259706
48836 3259706 3270058 3281469 3294442 3309143 3325330 3342942 3361990 3381927 3401869 3421511 3441227
48825 3441227 3461210 3481102 3500616 3519925 3539224 3558470 3577841 3597899 3618849 3640006 3660440
48814 3660440 3679933 3698920 3717762 3736538 3755426 3774759 3794678 3815030 3835695 3856767 3878429
48803 3878429 3900876 3924343 3948956 3974521 4000693 4027285 4054160 4080821 4106473 4130571 4153055
48792 4153055 4173996 4193388 4211366 4228289 4244316 4259227 4272835 4285248 4296350 4305400 4311633 4315072
48780 4315072 4316145 4314546 4309109 4298984 4284425 4266197 4244655 4219764 4191608 4160417 4126243 4089004
48768 4089004 4048801 4005964 3960925 3914245 3866554 3818164 3768916 3718764 3668340 3618535 3569551
48757 3569551 3520866 3472203 3424206 3378012 3334487 3293995 3256547 3221901 3189604 3159196 3130358
48746 3130358 3102920 3076899 3052542 3030125 3009689 2991212 2975057 2961822 2951526 2943232 2935804 2928934
48734 2928934 2923148 2918884 2915844 2913306 2910930 2909095 2908489 2909390 2911445 2914141 2917342 2921095 2925058 2928523
48720 2928523 2931083 2932969 2934571 2935935 2936935 2937607 2938041 2938151 2937915 2937677 2937858 2938467 2939243 2940219 2941748 2943940
48704 2943940 2946352 2948427 2949963 2951001 2951463 2951188 2950309 2949386 2949030 2949423 2950258 2951094 2951712 2952152 2952539 2952992 2953597
$$ [...]
##END NTUPLES=NMR SPECTRUM
##END=
