
##TITLE=AC1302_PERAH12114_7525498_Bu7zzF2CVs
##JCAMPDX= 6.0         $$ Bruker NMR JCAMP-DX V2.0
##DATA TYPE= NMR SPECTRUM
##DATA CLASS= NTUPLES
##ORIGIN= BRUKER
##OWNER= Administrator
$$ 1.72 TOPSPIN		Version 2.1
$$ 2013-02-21 03:01:48.862 -0500  Administrator@X
$$ Compression mode = diff/dup
##.OBSERVE FREQUENCY= 400.02188249412
##.OBSERVE NUCLEUS= ^1H
##.ACQUISITION MODE= SIMULTANEOUS (DQD)
##.ACQUISITION SCHEME= undefined
##.AVERAGES= 8
##.DIGITISER RES= 22
##SPECTROMETER/DATA SYSTEM= spect
##.PULSE SEQUENCE= zg30
##.SOLVENT NAME= COFFEE_meoh
##.SHIFT REFERENCE= INTERNAL, COFFEE_meoh, 1, 14.98509
##AUDIT TRAIL= $$ (NUMBER, WHEN, WHO, WHERE, PROCESS, VERSION, WHAT)
$$ ##TITLE= Audit trail, TOPSPIN		Version 2.1
$$ ##JCAMPDX= 5.01
$$ ##ORIGIN= Bruker BioSpin GmbH
$$ ##OWNER= Administrator
$$ $$ E:\/data/COFFEE/nmr/AC1302_PERAH12114_7525498_Bu7zzF2CVs/60/pdata/1/auditp.txt
$$ ##AUDIT TRAIL=  $$ (NUMBER, WHEN, WHO, WHERE, PROCESS, VERSION, WHAT)
(   1,<2013-02-21 03:01:40.377 -0500>,<Administrator>,<X>,<go>,<TOPSPIN 2.1>,
      <created by zg
	started at 2013-02-21 03:00:34.075 -0500,
	POWCHK enabled, PULCHK disabled,
       configuration hash MD5:
       86 BA 57 50 F2 9D 5C 9B 26 00 A9 28 5F 66 2E 89
       data hash MD5: 64K
       82 D8 B4 03 B5 5A AC DA DE 5A 03 A0 94 8F 14 A2>)
(   2,<2013-02-21 03:01:43.565 -0500>,<Administrator>,<X>,<proc1d>,<TOPSPIN 2.1>,
      <Start of raw data processing
       efp LB = 0 FT_mod = 6 PKNL = 1 PHC0 = 0 PHC1 = 0 SI = 32K 
       data hash MD5: 32K
       30 7C BD CC 65 DA 42 22 82 64 22 C8 D2 CF BC B0>)
(   3,<2013-02-21 03:01:44.033 -0500>,<Administrator>,<X>,<proc1d>,<TOPSPIN 2.1>,
      <pk PHC0 = 70.06531 PHC1 = 0 
       data hash MD5: 32K
       FF 45 EE 64 55 A5 F7 0D 9E 2C E4 ED A5 5D 75 D7>)
(   4,<2013-02-21 03:01:44.330 -0500>,<Administrator>,<X>,<proc1d>,<TOPSPIN 2.1>,
      <abs ABSG = 1 
       data hash MD5: 32K
       A8 96 0D A2 5E 46 62 B1 54 F3 FE A3 59 6A B3 66>)
(   5,<2013-02-21 03:01:44.471 -0500>,<Administrator>,<X>,<proc1d>,<TOPSPIN 2.1>,
      <abs ABSG = 2 
       data hash MD5: 32K
       3D 37 22 74 2B F9 82 31 B8 D1 FA 8E 87 D3 DE BB>)
(   6,<2013-02-21 03:01:44.612 -0500>,<Administrator>,<X>,<proc1d>,<TOPSPIN 2.1>,
      <abs ABSG = 3 
       data hash MD5: 32K
       AD 93 1C 6E 73 2F 11 0A 55 08 AC A1 C0 B3 8B 25>)
(   7,<2013-02-21 03:01:44.768 -0500>,<Administrator>,<X>,<proc1d>,<TOPSPIN 2.1>,
      <abs ABSG = 4 
       data hash MD5: 32K
       B4 2F 54 B8 17 9E 6C 80 E3 40 64 D4 35 25 E9 E8>)
(   8,<2013-02-21 03:01:44.893 -0500>,<Administrator>,<X>,<proc1d>,<TOPSPIN 2.1>,
      <abs ABSG = 5 
       data hash MD5: 32K
       76 93 ED 1E 4C CB 38 60 DC DE 80 09 5B 63 CF 65>)
$$ ##END=
$$ 
$$ $$ hash MD5
$$ $$ EB B8 B1 B1 57 AF 3A 5E 32 E5 42 37 C1 4D 51 A9
##$RELAX= 
##$RELAX= 
##$RELAX= 
##$RELAX= 
##$RELAX= 
##$RELAX= 
##$RELAX= 
$$ Bruker specific parameters
$$ --------------------------
##$DU= <E:\>
##$EXPNO= 60
##$NAME= <AC1302_PERAH12114_7525498_Bu7zzF2CVs>
$$ [...]
150 150 150 150 150 150 150 150
##$TP07= 0
##$TPNAME0= <>
##$TPNAME1= <>
##$TPNAME2= <>
##$TPNAME3= <>
##$TPNAME4= <>
##$TPNAME5= <>
##$TPNAME6= <>
##$TPNAME7= <>
##$TPOAL= (0..7)
0.5 0.5 0.5 0.5 0.5 0.5 0.5 0.5
##$TPOFFS= (0..7)
0 0 0 0 0 0 0 0
##$TUNHIN= 0
##$TUNHOUT= 0
##$TUNXOUT= 0
##$USERA1= <user>
##$USERA2= <user>
##$USERA3= <user>
##$USERA4= <user>
##$USERA5= <user>
##$V9= 5
##$VALIST= <valist>
##$VCLIST= <CCCCCCCCCCCCCCC>
##$VD= 0
##$VDLIST= <DDDDDDDDDDDDDDD>
##$VPLIST= <PPPPPPPPPPPPPPP>
##$VTLIST= <TTTTTTTTTTTTTTT>
##$WBST= 1024
##$WBSW= 4
##$XGAIN= (0..3)
0 0 0 0
##$XL= 0
##$YL= 0
##$YMAX_a= 553760
##$YMIN_a= -551432
##$ZGOPTNS= <>
##$ZL1= 120
##$ZL2= 120
##$ZL3= 120
##$ZL4= 120
##$ABSF1= 14.98509
##$ABSF2= -5.573092
##$ABSG= 5
##$ABSL= 3
##$ALPHA= 0
##$AQORDER= 0
##$ASSFAC= 0
##$ASSFACI= 0
##$ASSFACX= 0
##$ASSWID= 0
##$AUNMP= <proc_prof1d_extract_pilot.lims>
##$AXLEFT= 0
##$AXNAME= <>
##$AXNUC= <1H>
##$AXRIGHT= 0
##$AXTYPE= 0
##$AXUNIT= <>
##$AZFE= 0.1
##$AZFW= 0.1
##$BCFW= 0
##$BC_mod= 0
##$BYTORDP= 0
##$COROFFS= 0
##$CY= 15
##$DATMOD= 1
##$DC= 0
##$DFILT= <>
##$DTYPP= 0
##$F1P= 0
##$F2P= 0
##$FCOR= 0.5
##$FTSIZE= 32768
##$FT_mod= 6
##$GAMMA= 0
##$GB= 0
##$INTBC= 1
##$INTSCL= 1
##$ISEN= 128
##$LB= 0
##$LEV0= 0
##$LPBIN= 0
##$MAXI= 10000
##$MC2= 0
##$MEAN= 0
##$ME_mod= 0
##$MI= 0
##$NCOEF= 0
##$NC_proc= -8
##$NLEV= 6
##$NOISF1= 0
##$NOISF2= 0
##$NSP= 0
##$NTH_PI= 0
##$NZP= 0
##$OFFSET= 14.98509
##$PC= 1
##$PHC0= 70.06531
##$PHC1= 0
##$PH_mod= 1
##$PKNL= yes
##$PPARMOD= 0
##$PPDIAG= 0
##$PPIPTYP= 0
##$PPMPNUM= 2147483647
##$PPRESOL= 1
##$PSCAL= 4
##$PSIGN= 0
##$PYNMP= <proc.py>
##$REVERSE= no
##$SF= 400.02
##$SI= 32768
##$SIGF1= 0
##$SIGF2= 0
##$SINO= 400
##$SIOLD= 32768
##$SPECTYP= <>
##$SREGLST= <1H.CDCl3>
##$SSB= 0
##$STSI= 32768
##$STSR= 0
##$SW_p= 8223.68421052631
##$SYMM= 0
##$S_DEV= 0
##$TDeff= 65536
##$TDoff= 0
##$TI= <>
##$TILT= no
##$TM1= 0
##$TM2= 0
##$TOPLEV= 0
##$USERP1= <user>
##$USERP2= <user>
##$USERP3= <user>
##$USERP4= <user>
##$USERP5= <user>
##$WDW= 1
##$XDIM= 32768
##$YMAX_p= 456925223
##$YMIN_p= -696621
##$CURPLOT= <Network HP LaserJet P1505>
##$CURPRIN= <$Network HP LaserJet P1505>
##$DFORMAT= <normdp>
##$LAYOUT= <+/1D_H.xwp>
##$LFORMAT= <normlp>
##$PFORMAT= <normpl>
##$SURQMSG= 1
$$ End of Bruker specific parameters
$$ ---------------------------------
##NTUPLES= NMR SPECTRUM
##VAR_NAME=  FREQUENCY,     SPECTRUM/REAL,   SPECTRUM/IMAG
##SYMBOL=    X,             R,               I
##VAR_TYPE=  INDEPENDENT,   DEPENDENT,       DEPENDENT
##VAR_FORM=  AFFN,          ASDF,            ASDF
##VAR_DIM=   32768,         32768,           32768
##UNITS=     HZ,            ARBITRARY UNITS, ARBITRARY UNITS
##FACTOR=    0.250966925370066, 1,           1
##FIRST=     8223.43324360094, -173235,      -149022
##LAST=      0,             111992,          193415
##MIN=       0,             -696621,         0
##MAX=       8223.43324360094, 456925223,    0
$$ Real data points
##PAGE= N=1
##DATA TABLE= (X++(R..R)), XYDATA
$$ [...]
19533b94673a42041n629j16972A11996a78801D1755I743h7253m789b0400A79938
$$ -294673 -142041 -147670 -264642 111996 -178801 41755 9743 -87253 -92042 -20400 179938
19521a0783j70839l79606C5573b3966j57233a5546j95549P3194B07236i2733A21711
$$ -10783 -181622 -561228 35573 -23966 -181199 -15546 -211095 -137901 207236 -92733 121711
19509a27385B7670e2264L924B94581d04435E455a3934l29703j71610C38964e01391
$$ -127385 27670 -52264 -48340 294581 -404435 5455 -13934 -343637 -515247 338964 -501391
19497a25581A97169b69468D9371I37b58092R3262B65418b34809f502H7488d19657
$$ -125581 197169 -269468 49371 937 -258092 -164830 265418 -234809 -6502 87488 -419657
19485B45218r8778b46618m112M8097k8267e9582k41471M2265A04237a97778j12900
$$ 245218 146440 -246618 -250730 -202633 -230900 -59582 -301053 -258788 104237 -197778 -310678
19474c10678P5768b1217B6027c12990F6932g1740A4030e7998A32317J49260F9436
$$ -310678 -234910 -21217 26027 -312990 66932 -71740 14030 -57998 132317 281577 69436
19462a23742B95633a25984G4574a87405h1177j49804J07881r182c8948p8276D6388
$$ -123742 295633 -125984 74574 -187405 -81177 -230981 -123100 -132282 -38948 -117224 46388
19450a3195n6275b2764B29788j12233l920E5325a41140A9550K8568F759c55641
$$ -13195 -69470 -22764 229788 117555 113635 55325 -141140 19550 48118 6759 -355641
19438A77620P6341H2789A5397a31494r1574l5042o7519a06585B47670a97006l4614
$$ 177620 253961 82789 15397 -131494 -223068 -258110 -325629 -106585 247670 -197006 -231620
19427b31620d1760m0026l14659i1234I3395d9192G2165A0111J04790a60400j87945
$$ -231620 -41760 -81786 -396445 -91234 93395 -49192 72165 10111 114901 -160400 -348345
19416c48345g2760A79052b13836i3566K4414Q701k85081G1498b63825M6911G3959
$$ -348345 -72760 179052 -213836 -93566 -69152 -60451 -345532 71498 -263825 -216914 73959
19404a48889l097O8491A05927J60125c46464F0554B2635J41064c55197A2991N5844
$$ -148889 -151986 -83495 105927 266052 -346464 60554 22635 163699 -355197 12991 68835
19393F8835K0281a69536K4215k26905a33308N619k98384J96281J4038L1694p2717
$$ 68835 89116 -169536 -145321 -372226 -133308 -127689 -426073 -229792 -215754 -184060 -256777
19382b56777J20804C874c39986a12037j08368A64401l2557b85018a23934K8632
$$ -256777 -135973 3874 -339986 -112037 -220405 164401 131844 -285018 -123934 -95302
19372i5302d1223B28097a72153F5263b49136P8057M5254A49732C3972b25810l2160
$$ -95302 -41223 228097 -172153 65263 -249136 -171079 -125825 149732 33972 -225810 -257970
19361b57970a01406j30757J08845L9798E1646P0515L61295e3558k01817A29163
$$ -257970 -101406 -232163 -123318 -83520 51646 122161 483456 -53558 -255375 129163
19350b75421f5123A5339a31706B56401a92990M6191e6664l39771c3381A51964
$$ -275421 -65123 15339 -131706 256401 -192990 -146799 -56664 -396435 -33381 151964
19339C2933c2150A16243b24565M3865B7642J06559a25714o8105M5052D2649a87298
$$ 32933 -32150 116243 -224565 -180700 27642 134201 -125714 -193819 -148767 42649 -187298
19327a79674e6336r5080J8627o3462j85367j19667a40629k0920A44867Q3863b23213
$$ -179674 -56336 -151416 -132789 -196251 -381618 -501285 -140629 -161549 144867 228730 -223213
19315C6435i1349l1603F0988b20037A17960C2967b15104d8213j06970C04394A35488
$$ 36435 -91349 -122952 60988 -220037 117960 32967 -215104 -48213 -155183 304394 135488
19303C7878b53111M2850e8200l209A99091A2633a11862o0574B1399J66623b56619
$$ 37878 -253111 -210261 -58200 -61409 199091 12633 -111862 -172436 21399 188022 -256619
19291G3299h7417F3494b8656A72496a870j23876b6544j51411A14335a72639j37083
$$ 73299 -87417 63494 -28656 172496 -1870 -125746 -26544 -177955 114335 -172639 -309722
19280c09722A62558L15391A09114m28b8998q9068e4303B9601e9196A2613k882
$$ -309722 162558 477949 109114 108686 -28998 -118066 -54303 29601 -59196 12613 9731
19269I731J1218a22958F8905a15278j9762F7519f09407b25361g7247j35941B21059
$$ 9731 20949 -122958 68905 -115278 -135040 67519 -609407 -225361 -77247 -213188 221059
19257a73469q2631B87387I1897K1869e144j59877l9390I847c11689J15250B01066
$$ -173469 -256100 287387 91897 113766 -5144 -165021 -204411 9847 -311689 -196439 201066
19245a0556B9882P4876a04856k10554a35625B79822a7956j17072k3482A99215
$$ -10556 29882 104758 -104856 -315410 -135625 279822 -17956 -135028 -158510 199215
19234C9533b19598D3949c24788c1219B19123H7171b41311B701P1174a61284F2106
$$ 39533 -219598 43949 -324788 -31219 219123 87171 -241311 2701 73875 -161284 62106
19222a44199B47789c56507j20417a28772D532a71333N5432p084K4761M5993j74143
$$ -144199 247789 -356507 -476924 -128772 4532 -171333 -115901 -122985 -98224 -52231 -226374
19211b26374i4495m7008b8991j33645l4907R0539A48015d00927a0548c363m5814
$$ -226374 -94495 -141503 -28991 -162636 -197543 -107004 148015 -400927 -10548 -3363 -49177
19200d9177j37927A14696A1475J10733a7959j87091P0867q0687Q1849A31087E4513
$$ -49177 -187104 114696 11475 122208 -17959 -205050 -134183 -214870 -133021 131087 54513
19188b82758N5334A13654J02561N8862j0266a72946A82303Q4996a49234n7592
$$ -282758 -227424 113654 216215 275077 264811 -172946 182303 267299 -149234 -206826
19178b06826Q1005A62416c07592K3564a41671a5489l01331A34833a22570a7824
$$ -206826 -125821 162416 -307592 -284028 -141671 -15489 -316820 134833 -122570 -17824
19167B0334J29397b78146a0481A03594b98048E0063Q034i4076j77864d4515p9902
$$ 20334 149731 -278146 -10481 103594 -298048 50063 58097 -94076 -271940 -44515 -124417
19156a24417G5223M725b36394A26277A3657N0926A5035M1190b84832D4782a7084
$$ -124417 75223 79948 -236394 126277 13657 64583 15035 56225 -284832 44782 -17084
19144a93564A00797i4831k28052a20302j28098O1785a2117A18798R733I861R0269
$$ -193564 100797 -94831 -322883 -120302 -248400 -186615 -12117 118798 128531 9861 100130
19133A00130f9465A41672d6976j14770E4197Q7792a3540F8224a4881r0502j06488
$$ 100130 -69465 141672 -46976 -161746 54197 141989 -13540 68224 -14881 -105383 -211871
19122b11871A5082O9335o905b2524j58667A15760c1070l25242r1829A24288a95196
$$ -211871 15082 84417 77512 -22524 -181191 115760 -31070 -356312 -448141 124288 -195196
19110C75996a70663j35713A93927H6058a21939B5309J89714g0896j94106J09782
$$ 375996 -170663 -306376 193927 86058 -121939 25309 215023 -70896 -265002 -155220
19100a55220a7225A27207a58005B5463b88683E3706M8809a68036p2299C71612
$$ -155220 -17225 127207 -158005 25463 -288683 53706 102515 -168036 -240335 371612
19089B50600a20061d508j3707r7183H0744a6656A08945g8089B41960b86785I3057
$$ 250600 -120061 -4508 -18215 -115398 80744 -16656 108945 -78089 241960 -286785 93057
19077a23568C9799a85380Q6295k91534b0427B71617j29909A22J24786a07667L7355
$$ -123568 39799 -185380 -99085 -390619 -20427 271617 141708 122 124908 -107667 -70312
19066g0312j1363k22583J32643A15011m3522a93764h1825A88884b33256A59824
$$ -70312 -81675 -304258 -171615 115011 71489 -193764 -81825 188884 -233256 159824
19055a11430k0103j68314d9219r3468c6800j05341j5494E258a09856q7444g2438
$$ -111430 -131533 -299847 -49219 -142687 -36800 -142141 -157635 5258 -109856 -197300 -72438
19043b22768Q5180F3361a64168D02146b53265P1337c5334n5647A18441h379A2259
$$ -222768 -137588 63361 -164168 402146 -253265 -181928 -35334 -90981 118441 -8379 12259
19031b29338k70233D9265f475l55032I9225a29334B19597E49f1630D027b63529
$$ -229338 -499571 49265 -6475 -361507 99225 -129334 219597 549 -61630 4027 -263529
19019B85648b24648B82323j35561D3829a86709B94957D2204J30497n7075F397
$$ 285648 -224648 282323 146762 43829 -186709 294957 42204 172701 115626 6397
19008b2941q7410c0205A3168b15711A38339j5024c72463A14896b41899J12569
$$ -22941 -110351 -30205 13168 -215711 138339 123315 -372463 114896 -241899 -129330
18998a29330l78709A34791i5256l08705B22894c6067E4734c00336C2296a66993
$$ -129330 -508039 134791 -95256 -403961 222894 -36067 54734 -300336 32296 -166993
18987a26834j35997E2974a21608k5854a375r095C7843b4878n5558j04343d1534
$$ -126834 -262831 52974 -121608 -147462 -1375 -10470 37843 -24878 -80436 -184779 -41534
18975c86163a01879d9283H1816A3280a7919j913n7357F7930c95705A47509h4127
$$ -386163 -101879 -49283 81816 13280 -17919 -19832 -77189 67930 -395705 147509 -84127
18963c23036J35155Q2435k309A72251b79832a16797B76422F860a33090G1588l3795
$$ -323036 -187881 -105446 -107755 172251 -279832 -116797 276422 6860 -133090 71588 37793
18952C7793c57496g3159L6129m8417L7284C50836b46046B2976a55326B29147I1680
$$ 37793 -357496 -73159 -37030 -85447 -48163 350836 -246046 22976 -155326 229147 91680
18940g455C1982H731K27057e4100J1368a8410r9712A24853L4273b15889D0382
$$ -7455 31982 8731 235788 -54100 -42732 -18410 -118122 124853 159126 -215889 40382
18928a38341A46119J08057c3718n89279b73051r9796a85862k16986c9181j4110
$$ -138341 146119 254176 -33718 -622997 -273051 -372847 -185862 -402848 -39181 -53291
18918e3291A76771G7632b13380E0173b93032q9678B06239d5967G7743a13080l3567
$$ -53291 176771 77632 -213380 50173 -293032 -382710 206239 -45967 77743 -113080 -146647
18907a46647D5657l370b63853b5035j31337A45084a23367a6853o3764G7996a74857
$$ -146647 45657 42287 -263853 -25035 -156372 145084 -123367 -16853 -80617 77996 -174857
18895C7008J08881a20111H707L7377K5950M8472b4446k00265D5204d2141k44419
$$ 37008 145889 -120111 8707 46084 72034 120506 -24446 -224711 45204 -42141 -286560
18884b86560b3735r8970e7015k24498i2696j7252K1731K3153I3777g2249A16966
$$ -286560 -23735 -122705 -57015 -281513 -92696 -109948 -88217 -65064 93777 -72249 116966
18872b09028n4819D41393B9360a91813g6364k25926f9292F6628e3109B03321b10137
$$ -209028 -263847 441393 29360 -191813 -76364 -302290 -69292 66628 -53109 203321 -210137
18860D6350O0763c01804D4395J03222R6433e6566m7613A55372b8966A92693F5067
$$ 46350 107113 -301804 44395 147617 244050 -56566 -104179 155372 -28966 192693 65067
18848e0169J7883l3462B3850F355a21578L7728D7397j8821M5239a45962j27175
$$ -50169 -32286 -65748 23850 6355 -121578 -83850 47397 28576 73815 -145962 -273137
18837b73137p8329G7766a93806g2889c2503j3122j52819c483j96180L1112A59505
$$ -273137 -351466 77766 -193806 -72889 -32503 -45625 -198444 -3483 -199663 -168551 159505
18825b1601j42441n0856B31424G7520J26806J72879j63270a41753A07498a3011
$$ -21601 -164042 -214898 231424 77520 204326 377205 213935 -141753 107498 -13011
18814A04594K65633A43896a88459A98338d517A02926O9819f039A8924K0826b18805
$$ 104594 370227 143896 -188459 198338 -4517 102926 172745 -6039 18924 39750 -218805
18802b44735j04533J72039j56418A07219E087L6706c55057A19260i3803c0169
$$ -244735 -349268 -177229 -333647 107219 5087 41793 -355057 119260 -93803 -30169
18791A40525a08752L2766A41400J65734a0394k88446J39827l86725A82682a92522
$$ 140525 -108752 -75986 141400 307134 -10394 -298840 -159013 -545738 182682 -192522
18780B8954a55473E3065K9587f7253a2040A19475Q8578c5754k34682A65695L2511
$$ 28954 -155473 53065 82652 -67253 -12040 119475 208053 -35754 -270436 165695 198206
18769A98206F9394K2387c03311g877k04059G2403M6689l8508k4995b70032j00221
$$ 198206 69394 91781 -303311 -7877 -211936 72403 119092 80584 55589 -270032 -370253
18758c70253F5368i5286O920j89841a03204o1508p2471a09142N1145A6011K37235
$$ -370253 65368 -95286 -88366 -278207 -103204 -164712 -237183 -109142 -57997 16011 253246
18747B53246Q9514b28721a12734M6131B07591H3233k5895a27376E5169a68910
$$ 253246 342760 -228721 -112734 -66603 207591 83233 57338 -127376 55169 -168910
18736B58236a454j31634f0220n0836B47356n9140i7902L2048k9618k1061l15474
$$ 258236 -1454 -133088 -60220 -111056 247356 188216 -97902 -65854 -95472 -116533 -432007
18725d32007A10721b14794h3851K9394I2462a5991l0606k37647I8802b10798D4464
$$ -432007 110721 -214794 -83851 -54457 92462 -15991 -46597 -284244 98802 -210798 44464
18713a83393F1908a07406m0883A12769J11800b08805B06917m9875F543M9331a47128
$$ -183393 61908 -107406 -148289 112769 224569 -208805 206917 157042 6543 55874 -147128
18701I6731D0321a64584O9751k38665h2353B70989b18273j58917a07785B3333
$$ 96731 40321 -164584 -94833 -333498 -82353 270989 -218273 -377190 -107785 23333
18690c03930B3899b32250b7835j50684m2287n3105B49913b6022k08415n1512j2978
$$ -303930 23899 -232250 -27835 -178519 -220806 -273911 249913 -26022 -234437 -285949 -298927
18679b98927e5216l21587a37307c5349j49979g5482j28164K3299A30614g5937
$$ -298927 -55216 -376803 -137307 -35349 -185328 -75482 -203646 -180347 130614 -75937
18668i0718k21986Q3274R5126e9592k3687k7251A37249N7611b81947P5208B935
$$ -90718 -312704 -229430 -134304 -59592 -83279 -110530 137249 194860 -281947 -206739 2935
18656b31115i0468k9612e3014A40670E8719r917d33541a57917D9466a78500j11957
$$ -231115 -90468 -120080 -53014 140670 58719 48802 -433541 -157917 49466 -178500 -290457
18645b90457A85049b37446M3419e1347D5624O2040b32419M7871G38K24273r6284
$$ -290457 185049 -237446 -194027 -51347 45624 107664 -232419 -184548 738 225011 128727
18634A28727g6002r167I3024h8747A08342K10256a10636j66194I5453j1562a20304
$$ 128727 -76002 -85169 93024 -88747 108342 318598 -110636 -276830 95453 83891 -120304
18622A4686a24741d0342k22963f3025l8729A0389K96364a34165A8680K39435A18104
$$ 14686 -124741 -40342 -263305 -63025 -101754 10389 306753 -134165 18680 258115 118104
18610A07150P6639b61959K0758J16671B0166g8322j3716k29002a8006j82116F1338
$$ 107150 183789 -261959 -241201 -124530 20166 -78322 -92038 -321040 -18006 -200122 61338
18598b97973n846a20034C79285i1405j11027O8211k4355b1066k10027h3656O165
$$ -297973 -303819 -120034 379285 -91405 -202432 -134221 -158576 -21066 -231093 -83656 -77491
18587g7491O79A96645c18912J43116A87788R253j2548b88732P2712j26174J56793
$$ -77491 -76812 196645 -318912 -175796 187788 197041 184493 -288732 -216020 -342194 -185401
18576a85401D5734a13400H5900c28060E1571b00171A88717C0840a80826I0263
$$ -185401 45734 -113400 85900 -328060 51571 -200171 188717 30840 -180826 90263
18565A32627J13773a68810j47295a05185E7541a5834A95568a62187K2280k6830
$$ 132627 246400 -168810 -316105 -105185 57541 -15834 195568 -162187 -139907 -166737
18555a66737J2976b9084l85491a56653c2397j64702A87229h9413A94707c82200
$$ -166737 -153761 -29084 -414575 -156653 -32397 -197099 187229 -89413 194707 -382200
18544c86499F9127b410G8696k2579a91248B59608a07669K9029h975l23044a16526
$$ -386499 69127 -2410 78696 56117 -191248 259608 -107669 -78640 -8975 -332019 -116526
18532A65967e7865j11655J7391o4425R9410A07087P9891c64388h7182A02897b08737
$$ 165967 -57865 -169520 -152129 -216554 -117144 107087 186978 -364388 -87182 102897 -208737
18520a91366I8848a55753b8527D2518A1933M5099a65459j07482A27318a24798
$$ -191366 98848 -155753 -28527 42518 11933 57032 -165459 -272941 127318 -124798
18509A63453a76168h1916D795b37627c9873j6014A00468b58978b0033j84416A02057
$$ 163453 -176168 -81916 4795 -237627 -39873 -55887 100468 -258978 -20033 -204449 102057
18497i0956l21822B17105b57378C33223a28002O0136p7123c1718k39020B80214
$$ -90956 -412778 217105 -257378 333223 -128002 -67866 -144989 -31718 -270738 280214
18486b25329J08477C5842c84983A15932b11865C7464f1977J9883j02836r396j65940
$$ -225329 -116852 35842 -384983 115932 -211865 37464 -61977 -42094 -144930 -154326 -320266
18475c20266A70204g8099o018l53287B537e5759J0936A2696a36278A20011b02550
$$ -320266 170204 -78099 -84117 -437404 2537 -55759 -44823 12696 -136278 120011 -202550
18463A84863J0898F801a43153L3809B2446b64612H9271a9896B2246a2758A03880
$$ 184863 195761 6801 -143153 -109344 22446 -264612 89271 -19896 22246 -12758 103880
18451b23610q9266g0968o7208a6371k57344e0232r6723f5374b400B12291C6837
$$ -223610 -312876 -70968 -138176 -16371 -273715 -50232 -146955 -65374 -2400 212291 36837
18439B850J29913a44920B76451a35936j39876K9398J16290b1065j9901k17824
$$ 2850 132763 -144920 276451 -135936 -275812 -246414 -130124 -21065 -40966 -258790
18429b58790a9232j651I0932A2038b45235C5794a48451g512I1785b4711C10723
$$ -258790 -19232 -20883 90932 12038 -245235 35794 -148451 -7512 91785 -24711 310723
18417h5460c6099j38514B50952a26977J0787B3719a80486K2532q0672A79592n7510
$$ -85460 -36099 -174613 250952 -126977 -116190 23719 -180486 -157954 -238626 179592 122082
18406A22082C8234b66263n9930A24072b4438A14464A0162b63528D6964A3209J75090
$$ 122082 38234 -266263 -326193 124072 -24438 114464 10162 -263528 46964 13209 188299
18395A88299H293J2592Q6769a39663A02971a95348j15613e4110l83192J1805C441
$$ 188299 8293 20885 107654 -139663 102971 -195348 -310961 -54110 -437302 -425497 3441
18383a85010A13467a47325k93065b5369A14761E333M07699c85174J88429G4669
$$ -185010 113467 -147325 -440390 -25369 114761 5333 413032 -385174 -196745 74669
18372A8291d88893G2210g9136C1757K0534a30953A09253N9326J13776A24674e7665
$$ 18291 -488893 72210 -79136 31757 52291 -130953 109253 168579 282355 124674 -57665
18360B14345a35228F8481a14480H4098b73886b137A39247d10765f5243j33241
$$ 214345 -135228 68481 -114480 84098 -273886 -2137 139247 -410765 -65243 -198484
18350a98484e2010p1237I6980R5375F155J53985J1463B8830e5078A83379c76550
$$ -198484 -52010 -123247 96980 192355 6155 160140 171603 28830 -55078 183379 -376550
18338b1603k21476i2814j15541g7362B34580a54340A64357f3387o9201a869B91825
$$ -21603 -243079 -92814 -208355 -77362 234580 -154340 164357 -63387 -132588 -1869 291825
18326B50141n0671D3483c68179I3087l9645L58516b04784G2184b01792A31489
$$ 250141 199470 43483 -368179 93087 53442 411958 -204784 72184 -201792 131489
18315B64410d28354A12339c84350a79654e1006k87167e3683m5161k5417k60846
$$ 264410 -428354 112339 -384350 -179654 -51006 -338173 -53683 -98844 -124261 -385107
18305c85107a37108j28231B7814a71232o8409b6941k77939J50803M9169I6389
$$ -385107 -137108 -265339 27814 -171232 -239641 -26941 -304880 -154077 -104908 96389
18294f3989n5553j15701I1790A2309c0452j8289B50298H7322b37451A11059l4538
$$ -63989 -119542 -235243 91790 12309 -30452 -48741 250298 87322 -237451 111059 76521
18283G6521h2826A90972c09766J02123B30159J38b8981A22311Q6182b09743E3480
$$ 76521 -82826 190972 -309766 -207643 230159 230297 -28981 122311 208493 -209743 53480
18271a98378j3117N2945E8680R0852n3107c45292C9987a65019a4671j075D4712
$$ -198378 -211495 -158550 58680 149532 96425 -345292 39987 -165019 -14671 -15746 44712
18259b07955h7744m1918e8507o2789j8777f1437C0897a01785J9379j02918C8065
$$ -207955 -87744 -129662 -58507 -121296 -140073 -61437 30897 -101785 -82406 -185324 38065
18247F2456Q7707a88298O6128A11242a86800c0633j62177B2340R3841a577j2616
$$ 62456 150163 -188298 -122170 111242 -186800 -30633 -192810 22340 116181 -1577 -14193
18236a4193j51034P1997H3779J27666B5457g3577f198j14580c8821k24359g6475
$$ -14193 -165227 -93230 83779 211445 25457 -73577 -6198 -120778 -38821 -263180 -76475
18224c6214A04867P2962b87408A19274i500A16305j3749L4026a96617o472G8892
$$ -36214 104867 177829 -287408 119274 -9500 116305 102556 136582 -196617 -203089 78892
18212A23972O7965H894a78658h5304j87813b1499F65R276K1437P2170C3592a55311
$$ 123972 191937 8894 -178658 -85304 -273117 -21499 665 9941 31378 103548 33592 -155311
18199b45880A2643b11345K1086K7429a4399A45679d7688K2510j73937O0041E17540
$$ -245880 12643 -211345 -190259 -162830 -14399 145679 -47688 -25178 -199115 -139074 517540
18187a4992H1288a35557D7050J66967b4266C05423h548B9685a96106h2339k6317
$$ -14992 81288 -135557 47050 214017 -24266 305423 -8548 29685 -196106 -82339 -108656
18176a08656l7287c3623p7140e2176A5437a0289j9063k68393a32044q8901a07362
$$ -108656 -145943 -33623 -110763 -52176 15437 -10289 -29352 -297745 -132044 -220945 -107362
18164h2164E4747a26686k74007a08665a1136C21761H062J98848I6349a26843e6605
$$ -82164 54747 -126686 -400693 -108665 -11136 321761 8062 206910 96349 -126843 -56605
18152f054r4644j21649f8954G4473h3245A53696b76273B7125f7369l89835E6788
$$ -6054 -100698 -222347 -68954 74473 -83245 153696 -276273 27125 -67369 -457204 56788
18140f6435A15788a06620B15347i0360r6365l3399d5414A79830a31863k30320
$$ -66435 115788 -106620 215347 -90360 -186725 -220124 -45414 179830 -131863 -362183
18130c62183e9318J7023r0087G0194b93572J29701m8765a31j24341m6008D5820
$$ -362183 -59318 -42295 -132382 70194 -293572 -163871 -212636 -131 -124472 -170480 45820
18118c89391A50130n1832h9624A14076c10731B58294d9144C50305p2956m1458
$$ -389391 150130 98298 -89624 114076 -310731 258294 -49144 350305 277349 235891
18108B35891b35444f5958r1937g0349A93349G4045e7270k483D3613l417f496r7173
$$ 235891 -235444 -65958 -157895 -70349 193349 74045 -57270 -59753 43613 40196 -6496 -103669
18096a03669B5941a93557o5670M9307B6479N143A3516R1912c59897J71591j16693
$$ -103669 25941 -193557 -259227 -209920 26479 31622 13516 105428 -359897 -188306 -304999
18085c04999f758j60621B22756J747A10229g5989m8509B62063A00705a18200k6906
$$ -304999 -6758 -167379 222756 224503 110229 -75989 -124498 262063 100705 -118200 -145106
18074a45106c8158o9645n4833A0006a09619M9189I108g2730G8130a8087k27478
$$ -145106 -38158 -107803 -162636 10006 -109619 -60430 9108 -72730 78130 -18087 -245565
18063b45565a17737A17677D3927N857a21285j81768J1593E1511e7385A04617b53773
$$ -245565 -117737 117677 43927 49784 -121285 -303053 -291460 51511 -57385 104617 -253773
18051b80236Q6351d2000j14357N6397K8883q0412d7985B36136A8893J20959a16564
$$ -280236 -193885 -42000 -156357 -99960 -71077 -151489 -47985 236136 18893 139852 -116564
18039d34171B59667r6261E2401a20622r4581k9627Q0567J5528n2892M5244B96346
$$ -434171 259667 163406 52401 -120622 -215203 -244830 -164263 -148735 -201627 -156383 296346
18027b0316j80810H0987i3828o3723A16273k5493i6267j81651L0969Q0894m8495
$$ -20316 -201126 80987 -93828 -157551 116273 90780 -96267 -277918 -246949 -166055 -214550
18016b14550j08121f8740F7621J7577b93963O5769m5887i9364n6086o7686B21870
$$ -214550 -322671 -68740 67621 85198 -293963 -228194 -274081 -99364 -155450 -223136 221870
18004d972q4244H5852c87501a74230G1943a8725m5413J2302j1724j07323C0466
$$ -4972 -89216 85852 -387501 -174230 71943 -18725 -64138 -51836 -63560 -170883 30466
17992E3840R7740d8999A58309a18025l3595E9746J53731A3987d0869j76859A29972
$$ 53840 151580 -48999 158309 -118025 -151620 59746 213477 13987 -40869 -217728 129972
17980a63415A093a66769N2983H7145a26234P825j04028O7408r2971A86105a31699
$$ -163415 1093 -166769 -113786 87145 -126234 -118409 -222437 -155029 -248000 186105 -131699
17968b40516B0583J50948P437D1033J36508h3927F1487k2248a87096F8665R1215
$$ -240516 20583 171531 178968 41033 177541 -83927 61487 39239 -187096 68665 159880
17957A59880F9098L50713H5883m1277R1090L1579F5085M0990b8299B8051b5580
$$ 159880 69098 419811 85883 44606 135696 167275 65085 106075 -28299 28051 -25580
17945E897R6629C1556J24784N405c87435d5573A94278b9211m3685A96137G722
$$ 5897 102526 31556 156340 161745 -387435 -45573 194278 -29211 -72896 196137 7722
17933b45247H5586a49815D5507J11885e8562B03372i0414A57471i279A76759m184
$$ -245247 85586 -149815 45507 157392 -58562 203372 -90414 157471 -9279 176759 172575
17922A72575i1378j17095d7337A18033K3861b2697B7334M671b61894A97816c4204
$$ 172575 -91378 -208473 -47337 118033 141894 -22697 27334 32005 -261894 197816 -34204
17910a85774A5920J14160c83901F5962a48800P890A9007J83513a10666m1212K060
$$ -185774 15920 130080 -383901 65962 -148800 -140910 19007 202520 -110666 -151878 -149818
17899a49818p5799a01795k30874A99464a70988D0248g695A03001k8982R4653a17721
$$ -149818 -225617 -101795 -332669 199464 -170988 40248 -7695 103001 74019 168672 -117721
17887e4984A28036b80105a22996j37847I1163i9489A16892O5363B9903a59815
$$ -54984 128036 -280105 -122996 -260843 91163 -99489 116892 182255 29903 -159815
17876B87312c04557d9491F609b78342A39852J19584j09449a23929a2641j13001
$$ 287312 -304557 -49491 6609 -278342 139852 259436 149987 -123929 -12641 -125642
17866a25642A36037G207e50394K04807a65589j16814D3575A9526J3159J11570
$$ -125642 136037 7207 -550394 -345587 -165589 -282403 43575 19526 32685 144255
17856A44255b3885A35864C527d0407q7003d0804B13863C1585A3901a38273n3801
$$ 144255 -23885 135864 3527 -40407 -127410 -40804 213863 31585 13901 -138273 -192074
17845a92074A646b09346F5906j9094K00038f6798m8514C17L37555E2346k0607
$$ -192074 1646 -209346 65906 46812 246850 -66798 -115312 317 337872 52346 31739
17834C1739j0928a18727k13838a59398f006k72780g113A72582b59327e445F3408
$$ 31739 20811 -118727 -332565 -159398 -6006 -278786 -7113 172582 -259327 -5445 63408
17822b01514D7153K95887C3543a9882A8469e5698k75726a46112A70854D99d2976
$$ -201514 47153 343040 33543 -19882 18469 -55698 -331424 -146112 170854 499 -42976
17810G2769J16273b2354j69918A78743P4630n7434L968c42723C2884C134g0689
$$ 72769 189042 -22354 -192272 178743 253373 195939 199907 -342723 32884 3134 -70689
17798a15469k0955j2906q4221A99302H6142c199j03186L0541B59778b93580f9493
$$ -115469 -136424 -149330 -233551 199302 86142 -3199 -106385 -75844 259778 -293580 -69493
17786F7738a15874F3144b0245k67464J22769A96347n1031E6387M1517m7138J9150
$$ 67738 -115874 63144 -20245 -287709 -164940 196347 145316 56387 97904 50766 69916
17775F9916B5409d0085r6135m923A37895f1958r4910m4629d1933I632i4723c1783
$$ 69916 25409 -40085 -136220 -141143 137895 -61958 -156868 -201497 -41933 9632 -94723 -31783
17762H5427a76677A1145a26041C07559b06418H5618a26499M4342b2315D6394d81138
$$ 85427 -176677 11145 -126041 307559 -206418 85618 -126499 -82157 -22315 46394 -481138
17750B6751L186K58272B9966e0245b0668M982a454C86331A35180J52307H3403
$$ 26751 29937 288209 29966 -50245 -20668 -15686 -1454 386331 135180 287487 83403
17738B5937c7028B81277A0870a34874E7206J93192E9290a68654j9889H997K07831
$$ 25937 -37028 281277 10870 -134874 57206 250398 59290 -168654 -188543 8997 216828
17727B16828e388A25591K2700a30329M7356k40136a27105B31471A06383a41095
$$ 216828 -5388 125591 148291 -130329 -82973 -323109 -127105 231471 106383 -141095
17716B20807I5589J18830G136K09494a66132I4854b11419E1696g2848B44068I0919
$$ 220807 95589 214419 7136 216630 -166132 94854 -211419 51696 -72848 244068 90919
17704E4389K214j8166a04235m1390d0060k02013A1855K17013l5909F4610K02130
$$ 54389 56603 38437 -104235 -145625 -40060 -242073 11855 228868 192959 64610 266740
17693B66740b01696B45380G2611O8673N5604h6795B44359b04385h4896j87680
$$ 266740 -201696 245380 72611 141284 196888 -86795 244359 -204385 -84896 -272576
17683b72576A62854G5226R0287a06828B67275B4996c47259A67999C5424b70714
$$ -272576 162854 75226 165513 -106828 267275 24996 -347259 167999 35424 -270714
17672I8270l2103b77177J12540H4302a28370B02265g5786k26344D0554b10215
$$ 98270 66167 -277177 -164637 84302 -128370 202265 -75786 -302130 40554 -210215
17661E5347b23161I291b94203A43081d7974p2365B16519g2413q8172E162K63769
$$ 55347 -223161 9291 -294203 143081 -47974 -120339 216519 -72413 -160585 5162 268931
17650B68931N4597a03802c5492j08799A45314K8044G4833J0336c17801A42533
$$ 268931 323528 -103802 -35492 -144291 145314 173358 74833 85169 -317801 142533
17639b4986A00398h7799j01206A15780a89780l7195N4581B6131J1864J48129b80864
$$ -24986 100398 -87799 -189005 115780 -189780 -226975 -172394 26131 37995 186124 -280864
17627E1913d619C1631J78746a34348E2808K31496r2708a69835b7237q3819A55906
$$ 51913 -4619 31631 210377 -134348 52808 284304 191596 -169835 -27237 -111056 155906
17615B98284B682L36957I2551i6381B05474f0033B15055b81074A24840M8755a49964
$$ 298284 2682 339639 92551 -96381 205474 -60033 215055 -281074 124840 173595 -149964
17603B83170B4529f4812J5989j8254k37652A40267D8932B3093d24872A55159C2932
$$ 283170 24529 -64812 -48823 -67077 -304729 140267 48932 23093 -424872 155159 32932
17591H5986K07813a61845j4646E5166m53a3604C17740j15654R6396f9342J0974
$$ 85986 293799 -161845 -176491 55166 54713 -13604 317740 202086 298482 -69342 -58368
17580e8368G4414b80395C89276C2687P7303D3360h875p9055D2472M1329a19737
$$ -58368 74414 -280395 389276 32687 109990 43360 -8875 -87930 42472 83801 -119737
17568G7031a49729O1918K3159l7130A65001k6260A1989c5775A79345j8161E315
$$ 77031 -149729 -87811 -64652 -101782 165001 138741 11989 -35775 179345 161184 5315
17556D6856R9828B3465M47249b866A80068d8579o5701A10320n1103a0876B41967
$$ 46856 146684 23465 470714 -2866 180068 -48579 -114280 110320 59217 -10876 241967
17544B97152b32872a12303J9457k59975b5033K522B15330C9559f2403m2310d8290
$$ 297152 -232872 -112303 -92846 -352821 -25033 -22511 215330 39559 -62403 -104713 -48290
17532e838B50746G0264L26692A82070E7063e555o0712A91519R3333a13525F7260
$$ -5838 250746 70264 396956 182070 57063 -5555 -66267 191519 284852 -113525 67260
17520G2607a21061j32276L6273C86109J84194B71826d5668n9831E3810b87933
$$ 72607 -121061 -253337 -217064 386109 570303 271826 -45668 -105499 53810 -287933
17509a8560E44232b5905A5543a04723A52223n6412k1415M6960G400K6786r283
$$ -18560 544232 -25905 15543 -104723 152223 95811 74396 121356 7400 34186 24903
17498B4903J43816N9389D7050J7881J33648C4206a44363l1623B43367G0950J11649
$$ 24903 168719 228108 47050 64931 198579 34206 -144363 -175986 243367 70950 182599
17487A82599H3079O4903D5534a21904H935L16300H2059K5947O8055k9325i01A60469
$$ 182599 83079 147982 45534 -121904 8935 325235 82059 108006 176061 146736 -901 160469
17474A14361f2349B70168p0670B4058K60783k8263B9272J69183r3371O8249o1008
$$ 114361 -62349 270168 199498 24058 284841 256578 29272 198455 105084 173333 112325
17463A12325f4441B27499L4623g741A53315b3043j69711A01033P7599l550c5626
$$ 112325 -64441 227499 262122 -7741 153315 -23043 -192754 101033 178632 175082 -35626
17451A65349J13711K31783A81710M6277p456N5607j5720m9176c7042k218E3200
$$ 165349 279060 510843 181710 227987 220531 276138 260418 211242 -37042 -39260 53200
17439c7462D45201R592j8884j92995E1100J44801O7382m9551H5968J34879N1891
$$ -37462 445201 454793 435909 242914 51100 195901 263283 213732 85968 220847 272738
17428B72738j16049J46852j01432M47689B22335K54527B29403J34239J14685A97233
$$ 272738 156689 303541 202109 649798 222335 476862 229403 363642 478327 197233
17417I7978J33600Q8356J1371p0380e156E91633B5293L16406A0026J60406E6144
$$ 97978 231578 319934 331305 260925 -5156 591633 25293 341699 10026 170432 56144
17405B76967A33166a80931d8570b993A75508o3931M2414Q1291c3756B72185J21820
$$ 276967 133166 -180931 -48570 -2993 175508 111577 153991 235282 -33756 272185 394005
17394C94005p1117A17787D992R7359O054J38765K7232K4872m2494J84579F9940
$$ 394005 322888 117787 4992 102351 108405 247170 274402 299274 256780 441359 69940
17382H6206i9623A00033L56458j53911j27807J23198A01288a00714D0561K18102
$$ 86206 -99623 100033 456491 302580 174773 297971 101288 -100714 40561 258663
17372B58663J12944j23795q5424J2790G4083L08496A84721c9368A38991k9582
$$ 258663 371607 247812 162388 175178 74083 382579 184721 -39368 138991 109409
17362A09409a63331H3120L7291L5026C1271P5116e0638A22505b08435h5883D00441
$$ 109409 -163331 83120 120411 155437 31271 106387 -50638 122505 -208435 -85883 400441
17350e2430p9208A04738K4437g3470A87235a25867M2180l4353B70221A11907M01835
$$ -52430 -131638 104738 129175 -73470 187235 -125867 -83687 -118040 270221 111907 513742
17339E13742I1242f9205A98527l5503p1434R017J41228H6681P0802f9930j732
$$ 513742 91242 -69205 198527 163024 91590 100607 241835 86681 157483 -69930 -71662
17328g1662B00147M6496a62701N7445D15447A77065M4785j01847j3508R0675r3057
$$ -71662 200147 246643 -162701 -105256 415447 177065 221850 120003 106495 197170 104113
17317A04113D397a13318H5832C2695N46714A54903O7040j05007M5120b13376A38879
$$ 104113 4397 -113318 85832 32695 579409 154903 221943 116936 162056 -213376 138879
17305C93511j68807a72772A43113i7361a5564C4865J25582k0578K10049m7941
$$ 393511 224704 -172772 143113 -97361 -15564 34865 160447 139869 349918 301977
17295C01977b13114A14783J10858C6429J07789L70596j78329M8770G0374K1849
$$ 301977 -213114 114783 225641 36429 144218 514814 336485 385255 70374 92223
17285I2223J45346o4970n1708D6334O0388P9226K20363E1269L9780M0107L1856
$$ 92223 237569 172599 120891 46334 106722 185948 406311 51269 91049 131156 163012
17274A63012i6769F6692M9995O0462P1012J36643j67691d6779B31783K68926B37086
$$ 163012 -96769 66692 116687 177149 248161 384804 217113 -46779 231783 500709 237086
17262C45650C2694J70080K01428F9978N2459j5602J20177G6183a51711O4601A38321
$$ 345650 32694 202774 404202 69978 122437 106835 227012 76183 -151711 -87110 138321
17250A90525N56197A14032J35495A15124C9644J44494M5485k022K30219j42537
$$ 190525 746722 114032 249527 115124 39644 184138 229623 227601 457820 315283
17240C15283J44564j54716J39744A41253j1947m3726l1048L75081K07497j33884
$$ 315283 459847 305131 444875 141253 129306 85580 54532 429613 637110 503226
17230E03226g8617B51340M4408j38094O0963r1870K90248j17589A44768J63079
$$ 503226 -78617 251340 295748 157654 218617 126747 416995 299406 144768 307847
17220C07847A50327k69K13291j18410A14142D2083J08477M48466i0630A14511
$$ 307847 150327 150058 363349 244939 114142 42083 150560 599026 -90630 114511
17209A93759K31683j39304o9691N7020O1092A56383L2588a14873C36251A13619
$$ 193759 425442 286138 216447 273467 334559 156383 188971 -114873 336251 113619
17198C65613A02226O0063O2893J71705j42861A4761L08759j30632F8243i869B65362
$$ 365613 102226 162289 225182 396887 254026 14761 323520 192888 68243 -9869 265362
17186H0736J3597b27067C54945K4168j81989q9723C4232L94224j09324I0925M10897
$$ 80736 94333 -227067 354945 379113 197124 107401 34232 428456 319132 90925 501822
17175E01822j72774J23863o6978j20367p1045J47753A02580K54086l9766j11626
$$ 501822 329048 452911 385933 265566 194521 342274 102580 356666 316900 205274
17165B05274L04121B53384p820A18628J77125A47596P8798r0714J30696q9507
$$ 205274 509395 253384 245564 118628 295753 147596 226394 135680 266376 176869
17155A76869K19622m8128K0624K24781J16689A42335K49446A00771K60360j10385
$$ 176869 396491 348363 368987 593768 710457 142335 391781 100771 361131 250746
17145B50746K68098F8653K80703K8700J12758l6247D5904N934O74500k00514B54110
$$ 250746 518844 68653 349356 378056 490814 454567 45904 51838 726338 525824 254110
17133E39551A85935L07398q9684r8542j31950J42594j4138L65589j69186k08953
$$ 539551 185935 493333 403649 305107 173157 315751 301613 667202 498016 289063
17123B89063K33554L1836r0952p5404o748l0212K6208j55286R3932q31O5444k1435
$$ 289063 522617 554453 463501 388097 381349 351137 377345 222059 315991 315160 380604 359169
17111C59169K44491j09032j91983J23332m3385J38947k7363K19057C31589j62511
$$ 359169 603660 494628 302645 425977 382592 521539 494176 713233 331589 169078
17101A69078L21559M66150l54023m8106P1507q9837K09648C29636L44471k34487
$$ 169078 490637 956787 602764 554658 626165 536328 745976 329636 674107 439620
17091D39620n669m2487J17298A60411K74919M14226j27738B16323L51502k52574
$$ 439620 433951 391464 508762 160411 435330 849556 721818 216323 567825 315251
17081C15251K25888J53555N5208B91328o3801L93397j16072L8775k71186J20834
$$ 315251 541139 694694 749902 291328 227527 620924 504852 543627 272441 393275
17071C93275J86765k30289K169J26978J25946j24536K68713k01453r3889L11815
$$ 393275 580040 349751 351920 478898 604844 480308 749021 547568 453679 765494
17061G65494A45962N70156l3311B31940J66793A15028L50275j00567L5921R2334
$$ 765494 145962 716118 682807 231940 398733 115028 465303 364736 400657 492991
17051D92991R7732k42637N55382j81935j22574l2234j7578J5472K27810C53110
$$ 492991 590723 348086 903468 721533 598959 566725 549147 564619 792429 353110
17040G93196j59032B03258M62530m2339M5244k40672O9964R2037k55454N47802
$$ 793196 634164 203258 665788 623449 668693 428021 497985 590022 334568 882370
17030H82370k12395M5521o2185k06220J76457o2497J23954j04761J25828O1770
$$ 882370 669975 715496 653311 447091 623548 561051 685005 580244 706072 767842
17020G67842l65391N04591j63320l25968J06905K29874j087M67L1859j76216k68151
$$ 767842 402451 907042 743722 417754 524659 754533 753446 753913 785772 609556 341405
17009C41405O33544l08522L00260k68482k3475k511M2536Q2067J39909l01683
$$ 341405 974949 666427 966687 698205 674730 672219 714755 796822 936731 635048
16999F35048L28027j67459R9272D01374L03187N3051j99968K17244J66195l5753
$$ 635048 963075 795616 894888 401374 704561 757612 557644 774888 941083 905330
16989I05330k01318M15925n04693K30209p7204J55670q9270j23472L17175k63841
$$ 905330 704012 1119937 615244 845453 768249 923919 834649 711177 1028352 764511
16979G64511R3452m05814M61407K14420r9837o496K75241l32517N6587k72846
$$ 764511 857963 452149 913556 1127976 1028139 1021643 1296884 964367 1020954 748108
16969G48108K77765j20577L44936k43582J62820O1662m01818q7855L60378l0855
$$ 748108 1025873 905296 1250232 1006650 1169470 1231132 829314 741459 1101837 1070982
16959A070982N7546l78685O20193l9918k49987L13382j33896k58239o1425M11622
$$ 1070982 1128528 749843 1370036 1330118 1080131 1393513 1259617 1001378 939953 1351575
16949A351575n00716M33859J5315l66782L74881N2864Q9338j0106k0948k3184
$$ 1351575 850859 1284718 1300033 933251 1308132 1360996 1450334 1440228 1419280 1396096
16939A396096j73496K17819P2453l84002N38502m60817K16523K49673j33187P579
$$ 1396096 1222600 1440419 1512872 1128870 1667372 1206555 1423078 1672751 1539564 1547143
16929A547143j42414m83378Q58310P5799m7058l05503J11770m87249M11602j13337
$$ 1547143 1404729 921351 1779661 1855460 1808402 1502899 1614669 1127420 1539022 1425685
16919A425685L35113l37546K49798j98379L77129j26253J48587j52471r1164J04919
$$ 1425685 1760798 1423252 1673050 1474671 1851800 1725547 1874134 1721663 1630499 1735418
16909A735418J00032r0358j59894L86812k01599K00820o5261r3387R0712m4688
$$ 1735418 1835450 1745092 1585198 1972010 1770411 1971231 1905970 1812583 1903295 1858607
16899A858607K60650k70065Q1382L95257n51047O31626k30640M7718j46364K08354
$$ 1858607 2119257 1849192 1930574 2325831 1774784 2406410 2175770 2223488 2077124 2285478
16889B285478l40676K72824K13827j28197K31965K2914j93699K57091j08892j00701
$$ 2285478 1944802 2217626 2431453 2303256 2535221 2558135 2364436 2621527 2512635 2411934
16879B411934J84682K4509J36472J03146j74127K67803l48573K08214K79615j83456
$$ 2411934 2596616 2621125 2757597 2860743 2686616 2954419 2605846 2814060 3093675 2910219
16869B910219k84534K25435k6260K03817J42517j1331O7842j21033K2215M17335
$$ 2910219 2625685 2851120 2824860 3028677 3171194 3159863 3227705 3106672 3128887 3546222
16859C546222J23554l68305J97080k73774L56275J77448R1073m44595K32011K87221
$$ 3546222 3669776 3301471 3498551 3224777 3581052 3758500 3849573 3404978 3636989 3924210
16849C924210k51269J33194K83554K10603l89110M65431k0355q7704L42248j82431
$$ 3924210 3672941 3806135 4089689 4300292 3911182 4376613 4356258 4268554 4610802 4428371
16839D428371q258k46333O03367O9254k30970L48496L3959q2332P7740J73821
$$ 4428371 4420113 4173780 4777147 4846401 4615431 4963927 4997886 4915554 4993294 5167115
16829E167115j83496K46091K29446L78894k94406P7242K87875l1614M34048K97011
$$ 5167115 4983619 5229710 5459156 5838050 5543644 5620886 5908761 5877147 6311195 6608206
16819F608206k27637J10169O6069J77371K62167n8838L33004j11771K51835K84603
$$ 6608206 6380569 6490738 6556807 6734178 6996345 6937507 7270511 7158740 7410575 7695178
16809G695178K04709J07388j8943M53574M4262K00428o0160P26972j0368K42448
$$ 7695178 7899887 8007275 7988332 8441906 8486168 8686596 8626436 9353408 9343040 9585488
16799I585488L03551L20753l7857K92634K35068J20833J48700O21228J84458L14131
$$ 9585488 9889039 10209792 10171935 10464569 10699637 10820470 10969170 11590398 11774856 12088987
16789A2088987K75120N79471K47408N06049l52820J130457K44511O11504J94014
$$ 12088987 12364107 12943578 13190986 13697035 13344215 14474672 14719183 15330687 15524701
16780A5524701M29831O07789N50595M17579K93470Q89197O78318J85824J016216
$$ 15524701 15954532 16562321 17112916 17530495 17823965 18713162 19391480 19577304 20593520
16771B0593520P13087O96888R46647N99733R79512O50172J287108P59528R85760
$$ 20593520 21306607 22003495 22950142 23549875 24529387 25179559 26466667 27226195 28211955
16762B8211955J085356J227681J127695J395295J105413J355144J823967J552793
$$ 28211955 29297311 30524992 31652687 33047982 34153395 35508539 37332506 38885299
16754C8885299J668412J966158J541170K100236K334043K239359K370629K263241
$$ 38885299 40553711 42519869 44061039 46161275 48495318 50734677 53105306 55368547
16746E5368547K799316L046498K803098L195061L427872L753291L940615L851930
$$ 55368547 58167863 61214361 64017459 67212520 70640392 74393683 78334298 82186228
16738H2186228M098046M674299M326701N142848M892943N312629N195268N471118
$$ 82186228 86284274 90958573 95285274 100428122 105321065 110633694 115828962 121300080
16730A21300080N714981N504125N196232N543946M952551M908615M251666M020642
$$ 121300080 127015061 132519186 137715418 143259364 148211915 153120530 157372196 161392838
16722A61392838L365561K064337J915705J180101L85168p16562j522942k021389
$$ 161392838 164758399 166822736 168738441 169918542 170303710 169587148 168064206 166042817
16714A66042817k976055l812911m086328m678612m885829n478744n461385n252913
$$ 166042817 163066762 159253851 155167523 150488911 145603082 140124338 134662953 129410040
16706A29410040n474269n944749n482559n231074n079928n009319n027974m310972
$$ 129410040 123935771 117991022 112508463 107277389 102197461 97188142 92160168 87849196
16698H7849196m609686m170112l781923l858757l472565k924600l693160k911950
$$ 87849196 83239510 79069398 75287475 71428718 67956153 65031553 61338393 58426443
16690E8426443k543408k389104k537600k702946j977291k183038j801091j770295
$$ 58426443 55883035 53493931 50956331 48253385 46276094 44093056 42291965 40521670
16682D0521670k049430j601962j510671j281940j502875j249977r92376j347758
$$ 40521670 38472240 36870278 35359607 34077667 32574792 31324815 30332439 28984681
16674B8984681r42297j175114r73173j008855r32427q53255r44306p56292q35247
$$ 28984681 28042384 26867270 25894097 24885242 23952815 23099560 22155254 21398962 20563715
16665B0563715j36934q93270o19519m22880p15632o01593o74996q6216l95760
$$ 20563715 20426781 19533511 18913992 18491112 17775480 17173887 16498891 16412675 16016915
16656A6016915q98263m63215l86751k28376n30065k83344m38958k34596n25231
$$ 16016915 15118652 14655437 14268686 14040310 13510245 13226901 12787943 12553347 12028116
16647A2028116M3799p41313m44811J24363j44032n81851J39313r29756L04295
$$ 12028116 12071915 11330602 10885791 11010154 10866122 10284271 10423584 9493828 9798123
16638I798123l71791l05772o18663L28408l58221k8348m90079j26359N1340r1820
$$ 9798123 9426332 9120560 8501897 8830305 8472084 8443736 7953657 7827298 7878638 7786818
16628G786818k94400k16149k59128K45509o04568l111j11935J99831n59258j00585
$$ 7786818 7492418 7276269 7017141 7262650 6658082 6654971 6543036 6742867 6183609 6083024
16618F083024J41927l78100l48888m7814R2721l2534J62685k73444l50793K88233
$$ 6083024 6224951 5846851 5497963 5450149 5542870 5510336 5673021 5399577 5048784 5337017
16608E337017j28031q9583L6618j68350l98700j62246K92671l9095l03395l25400
$$ 5337017 5208986 5119403 5156021 4987671 4588971 4426725 4719396 4680301 4376906 4051506
16598D051506K75604q2683l08126J64962r4700p9681Q8340j90531l01957J68685
$$ 4051506 4327110 4244427 3936301 4101263 4006563 3926882 4015222 3824691 3522734 3691419
16588C691419R6198r7647j66249j067l46757O9771n4791K51835N852m48143o0686
$$ 3691419 3787617 3689970 3523721 3522654 3175897 3245668 3190877 3442712 3448564 3000421 2939735
16577B939735K43019k23072N7883l56852Q620R5165j91471K55738m2155N0798
$$ 2939735 3182754 2959682 3017565 2660713 2669333 2764498 2573027 2828765 2786610 2837408
16567B837408J87773n75871L03208j63282l4587m6646l29685J60954J43771j33082
$$ 2837408 3025181 2449310 2752518 2589236 2554649 2508003 2178318 2339272 2483043 2349961
16557B349961R0517r714K0521k15581k93833J73193j63544L97775n18262M85711
$$ 2349961 2440478 2430764 2451285 2235704 1941871 2115064 1951520 2349295 1831033 2316744
16547B316744L0644n21082K48629j52061K47212o1122J42293k00342P6769o38605
$$ 2316744 2347388 1826306 2074935 1922874 2170086 2108964 2251257 2050915 2127684 1489079
16537A489079N87255j72348k85089L62556j88300J65280j71564l6077j00152j78056
$$ 1489079 2076334 1903986 1618897 1981453 1793153 1958433 1786869 1750792 1650640 1472584
16527A472584m3874K45800N4913n08672K43833k12296N39495l87300K94775m81275
$$ 1472584 1428710 1674510 1729423 1220751 1464584 1252288 1791783 1404483 1699258 1217983
16517A217983L88974k84112p6996M93555l81694M392j54252N19280l55477k13242
$$ 1217983 1606957 1322845 1245849 1739404 1357710 1362102 1207850 1727130 1371653 1158411
16507A158411o8148K5884J13911k2126k02093P5103J79924k5852j16065R4646
$$ 1158411 1090263 1116147 1230058 1207932 1005839 1080942 1260866 1235014 1118949 1213595
16497A213595P0413j56560l0568R0606J45348m93268L43488l08333L36797l4949
$$ 1213595 1284008 1127448 1096880 1187486 1332834 839566 1183054 874721 1211518 1176569
16487A176569l23702K66881J21823l46674L12011k72563K02512n4789L35377n72999
$$ 1176569 852867 1119748 1241571 894897 1206908 934345 1136857 1082068 1417445 844446
16477H44446J31800k95523J41650L60904j99811R5701K20467l01032N4411L8134
$$ 844446 976246 680723 822373 1183277 983466 1079167 1299634 998602 1053013 1091147
16467A091147q0535j99861M9992k00111N6367K378J26259r7903J10611J73310
$$ 1091147 1010612 810751 860743 660632 716999 719377 845636 747733 858344 1031654
16457A031654n15635N00323k17761J22528m2550J07717J15670m02729K47651K04204
$$ 1031654 516019 1016342 798581 921109 878559 986276 1101946 699217 946868 1151072
16447A151072m03112k20891L20124R4537D66878M8277M34986l54819K67201j67247
$$ 1151072 747960 527069 847193 941730 466878 515155 950141 595322 862523 695276
16437F95276K59866k86762K400N7615l0183j51952N4721J2195K51507l16625K81286
$$ 695276 955142 668380 670780 728395 698212 546260 600981 613176 864683 548058 829344
16426H29344l04613K66252k66307j4059k12462M16480J00445N007l91565K35242
$$ 829344 524731 790983 524676 510617 298155 714635 815080 820087 428522 663764
16416F63764P9257l6121j41508K32128j72160q987m6390j48304L29287j86424
$$ 663764 743021 706900 565392 797520 625360 616373 569983 421679 750966 564542
16406E64542J70062l37956L22444J1003L03209m78381J78299k30853j42047J41506
$$ 564542 734604 396648 719092 730095 1033304 554923 733222 502369 360322 501828
16396E01828J69227k69453K47956A97470O01672l43924K06075l9678k55991J26768
$$ 501828 671055 401602 649558 197470 799142 455218 661293 621615 365624 492392
16386D92392j34188J76579n0782K13471A67860M37986J0902k07323M52013C61202
$$ 492392 358204 534783 484001 697472 167860 605846 616748 409425 861438 361202
16375C87435A40415M49744M6706k71827M157J40594j81201N28313l88486L75991
$$ 387435 140415 590159 636865 365038 369195 509789 328588 856901 468415 844406
16365H44406A08228L81086B27034F0125L58460j84445K18512j06310j6925R6K994
$$ 844406 108228 489314 227034 60125 418585 234140 452652 346342 329417 329513 332507
16354C32507q5332J02193J09828q2523M27761k28055L4631d2765B70139J37457
$$ 332507 247175 349368 459196 376673 804434 576379 611010 -42765 270139 407596
16344D07596k9231q7015M2347o9189K74365j60776j71227Q8572K97483j82218
$$ 407596 378365 291350 333697 264508 538873 378097 206870 295442 592925 410707
16334D10707D143N12332B08191J14836R4087a11446B24062J87818A96292j3444
$$ 410707 4143 516475 208191 323027 417114 -111446 224062 411880 196292 182848
16324A82848Q1102L5899J37173A89726E5670L08359N220C2681M41077m9039H7096
$$ 182848 263950 299849 437022 189726 55670 364029 369249 32681 473758 424719 87096
16312C95930Q3631L3343A59902J59001N4614l9873j42566K19906j88532K72558
$$ 395930 479561 512904 159902 318903 373517 333644 191078 410984 222452 495010
16302D95010m6062j26757O9438j58924p542L54092o1669B39025Q3651A3285K21630
$$ 495010 448948 322191 391629 232705 225163 579255 517586 239025 322676 13285 234915
16291B34915h887A54792J63141J2318k3447j9745o2060n219J31618A53387g0849
$$ 234915 -8887 154792 317933 330251 306804 287059 224999 219780 351398 153387 -70849
16279F21740m8833A95740P7381a6237A97552o4319J37620D9174K79082j47565
$$ 621740 572907 195740 273121 -16237 197552 133233 270853 49174 328256 180691
16269A80691P8408N314J3936P4638G5750L60025o2995G7604L84024C8393O1169
$$ 180691 259099 264413 278349 352987 75750 435775 372780 77604 461628 38393 99562
16258I9562P7564j994a95611A23283a43114B16143K4163a1235B83076d0152j29827
$$ 99562 177126 175132 -195611 123283 -143114 216143 240306 -11235 283076 -40152 -169979
16247a69979j46993E04541L4805j88442K26221G6709b4639A73807E3823K38074
$$ -169979 -316972 504541 539346 350904 577125 76709 -24639 173807 53823 291897
16237B91897r7803a7262H9264m4530K52513A1881K13546j4581r6153M2464J05215
$$ 291897 194094 -17262 89264 44734 297247 11881 225427 210846 114693 157157 262372
16226B62372a81605A17774j583J26443A08528L35757A56640m2597N4924j0223
$$ 262372 -181605 117774 116191 242634 108528 444285 156640 114043 168967 158744
16216A58744h2606B98205j38043J73865A63971p520n6904d1184E6185J06517J66044
$$ 158744 -82606 298205 160162 334027 163971 156451 99547 -41184 56185 162702 328746
16205C28746J40303n4645A90051a5020q6559A86749F7675f9237E9179L2019e634
$$ 328746 469049 414404 190051 -15020 -101579 186749 67675 -69237 59179 91198 -5634
16193i1247A18168E7542r68R6501j9534C8496a55140B92130L1711f660D12531
$$ -91247 118168 57542 56574 153075 133541 38496 -155140 292130 323841 -6660 412531
16181c22593H7773i5608A0956J18653M3814m5268o4066k2545J56293K01964j01076
$$ -322593 87773 -95608 10956 129609 173423 128155 64089 41544 197837 399801 298725
16170B98725j46920A4808a84107B03447f3809F6388P7931c7539C60984C5897e4638
$$ 298725 151805 14808 -184107 203447 -63809 66388 144319 -37539 360984 35897 -54638
16158A13629m3152N0721P9601o1284P0702L27332b93811O4939G4972a25214I1315
$$ 113629 70477 121198 200799 139515 210217 537549 -293811 -228872 74972 -125214 91315
16146I4757L154d5268I2529a51728B16650p5867l3641g9343C04487A20360J01600
$$ 94757 97911 -45268 92529 -151728 216650 140783 107142 -79343 304487 120360 221960
16135B21960m5618K39452c9168k4792p7388J8172c0991A68600C7317K90575A00824
$$ 221960 176342 415794 -39168 -63960 -141348 -123176 -30991 168600 37317 327892 100824
16123a2902C8317A8345n072J91079L1957K6898P8039G7285O9510D399a84682J4891
$$ -12902 38317 18345 13273 204352 236309 263207 341246 77285 146795 4399 -184682 -169791
16111a69791I046b1018j45497F7096J77888B6398K5345J23619K44084A60622K50979
$$ -169791 9046 -21018 -166515 67096 244984 26398 51743 175362 419446 160622 411601
16100D11601E9743R5216E7456K77250h532E5951J96681j22155B9275J7834J66901
$$ 411601 59743 154959 57456 334706 -8532 55951 252632 130477 29275 47109 214010
16089B14010J34028a82043A34462F0095c61958J57331C25235b0218A24303c2501
$$ 214010 348038 -182043 134462 60095 -361958 -204627 325235 -20218 124303 -32501
16078a17947c4813B11424F2197a67270A79126m926n7427N6446G5436k6028K63714
$$ -117947 -34813 211424 62197 -167270 179126 174200 116773 173219 75436 49408 313122
16067C13122a27443j91628a09895b3879A54680a0763B11493i4764r1481n0044
$$ 313122 -127443 -319071 -109895 -23879 154680 -10763 211493 -94764 -186245 -236289
16057b36289B08451e0288a9134p3662k4003A12133J63899b11765e9282A77458
$$ -236289 208451 -50288 -19134 -92796 -116799 112133 276032 -211765 -59282 177458
16046h4188A2867a17875M1457I3187j3659K30336E2306L81460A06260J0683P4500
$$ -84188 12867 -117875 -76418 93187 79528 309864 52306 433766 106260 116943 191443
16035A91443b47244c0145j08986M935d1193j05532O0051C43837H714a0181D5976
$$ 191443 -247244 -30145 -139131 -134196 -41193 -146725 -86674 343837 8714 -10181 45976
16023F8218b4817H7370J67159C2199a66276j53149a00339G297R2043a48737A95301
$$ 68218 -24817 87370 254529 32199 -166276 -319425 -100339 7297 99340 -148737 195301
16011D35328A54619O0539B4042a29955j04290a08791m382C5530Q0214a86791h290
$$ 435328 154619 215158 24042 -129955 -234245 -108791 -113173 35530 115744 -186791 -8290
15999A20564l8799l6693L9943h8935A85769a92152j4112q023A3759b419n0687
$$ 120564 81765 45072 85015 -88935 185769 -192152 -206264 -214287 13759 -2419 -53106
15988e3106D8402d8478j49184f5912A18131J82502M7620j56589J18809J84995
$$ -53106 48402 -48478 -197662 -65912 118131 300633 348253 191664 310473 495468
15978D95468n5572A37280J32624n4353c7715A16679i9348j03158j8183A34963
$$ 495468 439896 137280 269904 215551 -37715 116679 -99348 -202506 -220689 134963
15967A0276M2936b68550a0501j78832A53947M01885B55427H1246N1303m4182b81683
$$ 10276 53212 -268550 -10501 -189333 153947 555832 255427 81246 132549 88367 -281683
15955D9971b92028B09011b1687A0057K33404B1377p85b90666G3312a72336m6722
$$ 49971 -292028 209011 -21687 10057 243461 21377 20592 -290666 73312 -172336 -219058
15944b19058k594e38j75336b4582k81081A00416n850a48280j60541B65153d4551
$$ -219058 -221652 -538 -175874 -24582 -305663 100416 94566 -148280 -308821 265153 -44551
15932b49548h7444m950A26403a87588k9874f5029H5330C7030J75921H3895c6888
$$ -249548 -87444 -92394 126403 -187588 -217462 -65029 85330 37030 212951 83895 -36888
15920B62113A30093g5635h029A09961b483o3006D9869N0923a88631f8808j6724
$$ 262113 130093 -75635 -8029 109961 -2483 -65489 49869 100792 -188631 -68808 -85532
15909h5532j80893J21719j22510B0047J95034o195a48706C5651L5909G656a19105
$$ -85532 -266425 -144706 -267216 20047 215081 208886 -148706 35651 71560 7656 -119105
15897a12075B8623J43360k2628a2394r9309B06265B2578e4352a3154j52494L7732
$$ -112075 28623 171983 149355 -12394 -111703 206265 22578 -54352 -13154 -165648 -127916
15886a27916b6270l86431A27055m7591b37440h061F4655a92859a3764o5691B9245
$$ -127916 -26270 -412701 127055 79464 -237440 -8061 64655 -192859 -13764 -79455 29245
15874i7309A48874D9772b37495i8118j06724B31154d26466B8447a43914l1039
$$ -97309 148874 49772 -237495 -98118 -204842 231154 -426466 28447 -143914 -174953
15864a74953r1754b7877l9225i428o9102l77656a03059D5900c35183D9696b8071
$$ -174953 -266707 -27877 -67102 -9428 -78530 -456186 -103059 45900 -335183 49696 -28071
15852a96599A59940l734i2095g094k313j69553h7075k51680A87909p5207O0869
$$ -196599 159940 156206 -92095 -7094 -9407 -178960 -87075 -338755 187909 112702 173571
15841A73571C1141b42197A8550K13395a50914G0236R0546O2230I6830B9185Q8862
$$ 173571 31141 -242197 18550 231945 -150914 70236 160782 223012 96830 29185 118047
15830A18047A0764J0107b07060I8683a37286k4285C9597d3216k14373B6618b09254
$$ 118047 10764 20871 -207060 98683 -137286 -161571 39597 -43216 -257589 26618 -209254
15818a82993n7826o6650J28418j42479a06010a6408q343A89856i394E7828a38844
$$ -182993 -240819 -307469 -179051 -321530 -106010 -16408 -24751 189856 -9394 57828 -138844
15806A67098o4663J97522i8575I6246J3343a23303i455p4302C05150b4439j37425
$$ 167098 102435 299957 -98575 96246 109589 -123303 -9455 -83757 305150 -24439 -161864
15795a61864A82529C6512K24265j0390A24697E8595c19043a13874A17379A90a66911
$$ -161864 182529 36512 260777 250387 124697 58595 -319043 -113874 117379 190 -166911
15783a54521N6749P677D6907j7754c42262H8549N421M2940d0585j65630j44794
$$ -154521 -97772 -90095 46907 29153 -342262 88549 93970 136910 -40585 -206215 -351009
15772c51009A94011b27101K6190l5280A34149a74606e6365A35359c5183o7888
$$ -351009 194011 -227101 -200911 -236191 134149 -174606 -56365 135359 -35183 -103071
15762a03071A17531b15480d2224F3631K52797Q020a60217f551A04709a76395P5630
$$ -103071 117531 -215480 -42224 63631 316428 324448 -160217 -6551 104709 -176395 -100765
15751a00765j55834E6356a20553H454Q9406Q9644J18907a05490G6039a05377H8718
$$ -100765 -256599 56356 -120553 8454 97860 187504 306411 -105490 76039 -105377 88718
15739E1894e9561o5291K0590J0448k29520q9484K9601A76366k6491c1k37300P6622
$$ 51894 -59561 -124852 -104262 -93814 -323334 -412818 -383217 176366 149875 -31 -237331 -160709
15727a60709B22227a53734A48085i4120b0703k86180m201j08085C1458Q0686a80
$$ -160709 222227 -153734 148085 -94120 -20703 -306883 -311084 -419169 31458 112144 -180
15715B29372a93970F7615R7516a73216h4217A50873a22720C2403b12690C096a58424
$$ 229372 -193970 67615 165131 -173216 -84217 150873 -122720 32403 -212690 3096 -158424
15703a30106A23462l2553J00905a0075m08481a2733I7184i6316F0875b14323C079
$$ -130106 123462 90909 191814 -10075 -418556 -12733 97184 -96316 60875 -214323 3079
15691A76977K66944a43476f7297B22129D487K53551r4327K71120C080L47380A3342
$$ 176977 443921 -143476 -67297 222129 4487 258038 163711 434831 3080 350460 13342
15679a21880B0627g8143G5594A451M131d8712A8774d8211B47254A21739b08315
$$ -121880 20627 -78143 75594 1451 5582 -48712 18774 -48211 247254 121739 -208315
15667e3554B04679d6102p4681I451c85002a12862b910A32069N7508e2915o7790
$$ -53554 204679 -46102 -120783 9451 -385002 -112862 -2910 132069 189577 -52915 -120705
15656a20705k63962C8315f5312A76092a7453j65895B79267a25030k16396E46a83566
$$ -120705 -384667 38315 -65312 176092 -17453 -183348 279267 -125030 -341426 546 -183566
15644b50177A70319J55050A53393d9248f121j96160M7776B7776d6013M712j29921
$$ -250177 170319 325369 153393 -49248 -6121 -202281 -154505 27776 -46013 -41301 -171222
15633a71222g6071A34133N4675b85417d0386J4769B18327d195k16596e4046a7176
$$ -171222 -76071 134133 188808 -285417 -40386 -25617 218327 -4195 -220791 -54046 -17176
15621a96579B03438C4090M2659a37749J5869B74254j09957h1205j12626j26683
$$ -196579 203438 34090 76749 -137749 -121880 274254 164297 -81205 -193831 -320514
15611c20514a02246b2842C24590c2085j55648B72908b61533J28280J8949B79475
$$ -320514 -102246 -22842 324590 -32085 -187733 272908 -261533 -133253 -114304 279475
15600A39509b8218B29100c23098A01715A0637b22655M6922K1499b2889l9416A67325
$$ 139509 -28218 229100 -323098 101715 10637 -222655 -175733 -154234 -22889 -62305 167325
15588C43405b89667A31b12759C74508a1488p607A69538c84195A57379j1342d7776
$$ 343405 -289667 131 -212759 374508 -11488 -19095 169538 -384195 157379 146037 -47776
15576A54272Q4818H2101D0969f510p6579b0615A1335J10738l8368c19689A25711
$$ 154272 239090 82101 40969 -6510 -83089 -20615 11335 122073 83705 -319689 125711
15564g4590B8285b61641A46720b08812C04817B3177i7777j8548L2097A69261a9541
$$ -74590 28285 -261641 146720 -208812 304817 23177 -97777 -116325 -84228 169261 -19541
15552A54113o8558g6189b5067G7395b28746D32199B797h0818B35965b3231j55365
$$ 154113 85555 -76189 -25067 77395 -228746 432199 2797 -80818 235965 -23231 -178596
15541a78596C9509a49062l2560I4755N6351a89774A79320a70767j14688J0630
$$ -178596 39509 -149062 -181622 94755 151106 -189774 179320 -170767 -285455 -274825
15531b74825e5434l5022F1760c00164h8524l3989J4452D27755b11332B09060a74943
$$ -274825 -55434 -90456 61760 -300164 -88524 -122513 -108061 427755 -211332 209060 -174943
15519a93676K5396A2400O2312D027a162A91921a27913f3538k29897O2765I3871
$$ -193676 -168280 12400 74712 4027 -1162 191921 -127913 -63538 -293435 -230670 93871
15507i8346n406K7529F8775a14695B32594g8335I686b63152n1500C40968j46309
$$ -98346 -103752 -76223 68775 -114695 232594 -78335 9686 -263152 -314652 340968 194659
15496A94659c9243m9135c6105A7144g6027B79054e8076q4887F7673J04491C8301
$$ 194659 -39243 -88378 -36105 17144 -76027 279054 -58076 -142963 67673 172164 38301
15484a02246j24015A81863B5481K5845k2824c52617i4358j59288J26501B1935
$$ -102246 -226261 181863 25481 51326 28502 -352617 -94358 -253646 -127145 21935
15473H8262J93625H5924l606P5182d2978n313C15439r7399a08738A13591a16207
$$ 88262 281887 85924 82318 157500 -42978 -48291 315439 218040 -108738 113591 -116207
15461a49800k79576D1367K16656r0171D2462a12023A23604b11346e2438h663j46274
$$ -149800 -429376 41367 258023 167852 42462 -112023 123604 -211346 -52438 -8663 -154937
15450a54937C27722b11134N6466B8991b878R75j30644a2300I9728f4640B68699
$$ -154937 327722 -211134 -154668 28991 -2878 -1903 -132547 -12300 99728 -64640 268699
15438b08247A96146F4449a92279n9864D4178i3352k13386F9133O9958i9385K686
$$ -208247 196146 64449 -192279 -252143 44178 -93352 -306738 69133 139091 -99385 -96699
15427i6699o1715A2020J15884B0457M1375B7415c42563a48178C88221e31896B38329
$$ -96699 -158414 12020 127904 20457 61832 27415 -342563 -148178 388221 -531896 238329
15415D5449j7869M9836J29695a32668L8136o4925P2552i76C8444J11303c15105
$$ 45449 27580 77416 207111 -132668 -94532 -159457 -86905 -976 38444 149747 -315105
15403A6050P6807e7054C64721c03910B08934O4661d3395j13101O8153j0060H6197
$$ 16050 92857 -57054 364721 -303910 208934 273595 -43395 -156496 -88343 -98403 86197
15391F3881O7859b45628G3616g183E9148b33C21503f4061A03541c9153j48346
$$ 63881 131740 -245628 73616 -7183 59148 -233 321503 -64061 103541 -39153 -187499
15380a87499O3997C82315b41562a18243H6686I66K1165K43525e6247r6612m9549
$$ -187499 -123502 382315 -241562 -118243 86686 966 22131 265656 -56247 -152859 -202408
15369b02408H2692l0790a83818D922h7726F1080J55621A6727Q5039M926J34310
$$ -202408 82692 51902 -183818 4922 -87726 61080 216701 16727 101766 106692 241002
15358B41002a61314D695P7896h4480A06447a21597k03850f2033f82C34905g8676
$$ 241002 -161314 4695 82591 -84480 106447 -121597 -325447 -62033 -682 334905 -78676
15346A24149a53403A98328G3367a2026j2304j89128D506c2991n1013A0516b59474
$$ 124149 -153403 198328 73367 -12026 -24330 -213458 4506 -32991 -84004 10516 -259474
15334d09894K04679F3964d7456C2471b70938E5319K04520o3062B9018K10194f1581
$$ -409894 -205215 63964 -47456 32471 -270938 55319 259839 196777 29018 239212 -61581
15322d7325p2235B5489N0311a2974A28185D2346b6849k7605o9956G2739K04920
$$ -47325 -119560 25489 75800 -12974 128185 42346 -26849 -54454 -124410 72739 277659
15311B77659a79666B04969c3865j31207A07016b66360Q1570p202L0832O9612B77368
$$ 277659 -179666 204969 -33865 -165072 107016 -266360 -184790 -191992 -161160 -91548 277368
15299B53277j16803b6521l25709a65524M4407l2132g2430A22577k758f4721j34152
$$ 253277 136474 -26521 -352230 -165524 -121117 -153249 -72430 122577 119819 -64721 -198873
15288a98873c6668Q296m4896B09481c15003k62036B7017a76997b4702j10304g620
$$ -198873 -36668 -28372 -73268 209481 -315003 -577039 27017 -176997 -24702 -135006 -7620
15276E3422K04769A12463e7061C21736j15067d7988E5620a63496B8039J2559M1863
$$ 53422 258191 112463 -57061 321736 206669 -47988 55620 -163496 28039 40598 82461
15265H2461b15941o9279A56278c17488Q7216B31777J23431a93173A27424f9261
$$ 82461 -215941 -285220 156278 -317488 -230272 231777 355208 -193173 127424 -69261
15254B08734k3035i508o193A37279L51892N40742L83715m59037L46555n45096
$$ 208734 185699 -9508 -15701 137279 489171 1029913 1413628 954591 1301146 756050
15244G56050l14994j55284j12371Q2761a79792E575g4303k4916C28963j46381
$$ 756050 441056 285772 173401 256162 -179792 5575 -74303 -99219 328963 182582
15234A82582K01772n8102B6978a30493D31507a12271j37470k4963A62158a40993
$$ 182582 384354 326252 26978 -130493 431507 -112271 -249741 -274704 162158 -140993
15223f8333C99932a87677P3760B59721l9037C7954R401B2787f1363A03463P056
$$ -68333 399932 -187677 -113917 259721 220684 37954 47355 22787 -61363 103463 110519
15212A10519l5999a44195A22384K7152a279n7232B12811B2546J84655e071F2091
$$ 110519 74520 -144195 122384 149536 -1279 -58511 212811 22546 207201 -5071 62091
15200I2223d7859O306B25003A174K06230a67104A36586a50496l4649m6j14877
$$ 92223 -47859 -41553 225003 1174 207404 -167104 136586 -150496 -185145 -185191 -300068
15189c00068q2550a729m884A11596C9924c0856B56315J59653A9199R1006J5379
$$ -300068 -382618 -1729 -6613 111596 39924 -30856 256315 415968 19199 110205 125584
15178A25584d11118A45212a11617J0759C58150p7170b09282E3544b84014C67708
$$ 125584 -411118 145212 -111617 -100858 358150 280980 -209282 53544 -284014 367708
15167a45632N5985B338K64798a0472A42368d92630A75791a25780K8641A2956J12275
$$ -145632 -89647 2338 267136 -10472 142368 -492630 175791 -125780 -97139 12956 125231
15156A25231J2875D7540f123C28646i5583i511F2714K95012P6160B10412K377
$$ 125231 138106 47540 -6123 328646 -95583 -9511 62714 357726 433886 210412 212789
15145B12789b29697b1754A47225b30840A34142J68564D6988L0138K0344K61613
$$ 212789 -229697 -21754 147225 -230840 134142 302706 46988 77126 97470 359083
15135C59083A06769j0256O4429K00150A1396c4798k80891a0306k8730B65566a98984
$$ 359083 106769 96513 160942 361092 11396 -34798 -315689 -10306 -39036 265566 -198984
15123A68480c4863A89956N5844j20289O3219o9453d7492B3553J1895K76282A06811
$$ 168480 -34863 189956 245800 125511 188730 119277 -47492 23553 35448 311730 106811
15111A56558N6114A8512l605b1161A54569i5298F1258L8174B1467L00496d2630
$$ 156558 212672 18512 14907 -21161 154569 -95298 61258 99432 21467 321963 -42630
15099B68709M0546j39774k6174C8841i639j15073I9417q405a04469I3567L6120
$$ 268709 309255 169481 143307 38841 -9639 -124712 99417 91012 -104469 93567 129687
15088A29687k7652K0459a2305I0352J88451H4223m1200f318j57736D27207j91930
$$ 129687 102035 122494 -12305 90352 278803 84223 43023 -6318 -164054 427207 235277
15077B35277A06791M607i4067A45014B9889J1106L15012L4611a63313B23104J3565
$$ 235277 106791 111398 -94067 145014 29889 40995 356007 390618 -163313 223104 236669
15066B36669H9304e6588B74073E3185M00497A86626R1882a02265d7105B93431
$$ 236669 89304 -56588 274073 53185 453682 186626 278508 -102265 -47105 293431
15055i9178C55406N1324I2259M5117K6365N1616o6152J43798P9557A0534M84240
$$ -99178 355406 406730 92259 137376 163741 215357 149205 293003 372560 10534 494774
15044D94774A40878a44338I4261L00124A73336K5359q9410K84595H1925K96972
$$ 494774 140878 -144338 94261 394385 173336 198695 109285 393880 81925 378897
15034C78897j22711C6682K35781j32118J22943p3864m666K57364f5205A63821
$$ 378897 256186 36682 272463 140345 263288 189424 184758 442122 -65205 163821
15023B78361A01781j7545J17885a9372A30575a14131C06295J737p0059J0417d0192
$$ 278361 101781 84236 202121 -19372 130575 -114131 306295 308032 237973 248390 -40192
15011F0216K20114E0631g6560n4647E6174J1494K41493J39646I2228K01427A08066
$$ 60216 280330 50631 -76560 -131207 56174 67668 309161 448807 92228 293655 108066
14999A36863O859e863F7743b23566F4033J77392J9209i573B43916J32650r1288
$$ 136863 143722 -5863 67743 -223566 64033 241425 260634 -9573 243916 376566 285278
14988B85278b13319H2500j1542k9967R0607P2550D6567K74621f4504B46881P130
$$ 285278 -213319 82500 70958 40991 131598 204148 46567 321188 -64504 246881 254011
14977B54011A07419a55712A63441m4023K17922K34504G3681A8273K98877i0617
$$ 254011 107419 -155712 163441 119418 337340 571844 73681 18273 317150 -90617
14966E1494J13480L78729B37726p9389J52975a3554B89323b95370C74865f6777
$$ 51494 164974 543703 237726 158337 311312 -13554 289323 -295370 374865 -66777
14955A76190l6803a3867B8195J80253r5013J02306M4632j0959o8558K34559j82077
$$ 176190 139387 -13867 28195 208448 113435 215741 260373 249414 180856 415415 233338
14944B33338K71857j90953K63870k47564O585J40109m4973A54461J56359C3774
$$ 233338 505195 314242 578112 330548 337133 477242 432269 154461 310820 33774
14933A68768M9786J66639k4586A51095J48012C4838N1948M06669A38075O0563
$$ 168768 218554 385193 360607 151095 299107 34838 86786 493455 138075 198638
14923A98638L28853a26347D93177j69877i0747D91311n5993A70700L4772J41661
$$ 198638 527491 -126347 493177 323300 -90747 491311 435318 170700 205472 347133
14913C47133m1645q2649O6018m9873J57428q71A54385P3240J13591J85244k24495
$$ 347133 305488 222839 288857 238984 396412 395541 154385 227625 341216 526460 301965
14902C01965P2512K12102a02044E7997J81816J72243p3473J52868A56232I651
$$ 301965 374477 586579 -102044 57997 239813 412056 338583 491451 156232 9651
14891A15976L54077r756q8690j13120N6467j1921K38276k13553K73150B52107
$$ 115976 470053 460297 371607 258487 314954 303033 541309 327756 600906 252107
14880C53404m7369j00467K04594k0944j3168A54801M8405K89231o0202A57545
$$ 353404 306035 205568 410162 389218 376050 154801 203206 492437 432235 157545
14869E19101B24034C7977M13478j66701J11781L0064j1703j64658N3106j38803
$$ 519101 224034 37977 451455 284754 396535 426599 414896 250238 303344 164541
14859A64541J13042A32022N04959k77935C7686M24145j59534J20356F9279P53003
$$ 164541 277583 132022 636981 359046 37686 461831 302297 422653 69279 822282
14849H22282C46628p7769K94059k19633N9991R28A14224J82893N2606M5421A55590
$$ 822282 346628 268859 562918 343285 403276 404204 114224 297117 349723 395144 155590
14837C98274P9079J2343j94803j45497J79921a32667B85893P7195q9475L16263
$$ 398274 477353 489696 294893 149396 329317 -132667 285893 363088 273613 589876
14827E89876k79772k2459J99583A72936L94613j30995N2111K59693q5342k16669
$$ 589876 310104 287645 487228 172936 567549 436554 488665 748358 663016 446347
14817D46347B18469m6472O52892l20298q0007J37827j90056J7431A68375K54872
$$ 446347 218469 171997 824889 504591 424584 562411 372355 389786 168375 423247
14807D23247N36754m08632B73242J81532Q0200K4008p1711k8514H3893K53478
$$ 423247 960001 551369 273242 454774 534974 558982 487271 458757 83893 337371
14797C37371N7817J90939k55505J81704n4293p4202J94204Q0069j61290j64044
$$ 337371 395188 586127 330622 512326 458033 383831 578035 658104 496814 332770
14787C32770k0085L63398r3317j01739M6284Q4559j07043J35675p6683j06353
$$ 332770 312685 676083 582766 481027 527311 611870 504827 640502 563819 457466
14777D57466L25471m6301C47709M65832l92342O8740J80078k11330o8611J46983
$$ 457466 782937 736636 347709 813541 421199 489939 670017 458687 390076 537059
14767E37059M4112m8794n5170j80478K86012k69677L63935k25255K81538k47339
$$ 537059 581171 532377 477207 296729 582741 313064 676999 451744 733282 485943
14757D85943J22822q3774n8196J25418k70432N69521k36886B92820M26490J56762
$$ 485943 608765 524991 466795 592213 321781 891302 654416 292820 719310 876072
14747H76072M7123l20378j51796K38862k96355J95141L18359j11803k5924P044
$$ 876072 923195 602817 451021 689883 393528 588669 907028 795225 769301 776345
14737G76345K36354j40622j96810P2126N6382J38627J9278m50817L55244j6114
$$ 776345 1012699 872077 675267 747393 803775 942402 961680 510863 866107 849993
14727H49993j79856n0840j14105o660K29108J53332k79887L90742l36361J34438
$$ 849993 670137 619297 505192 498532 727640 880972 601085 991827 655466 789904
14717G89904L0878J55862k71709K24902J07667j76529j82873K08440j45412l43570
$$ 789904 820782 976644 704935 929837 1037504 860975 678102 886542 741130 397560
14707C97560J15103k579N8253M46097k37771K19467l76953K09935k70138Q9365
$$ 397560 512663 510084 568337 1014434 776663 996130 619177 829112 558974 648339
14697F48339M30138j73670m6971n8504J98051Q0785k05744J98514j84052m9887
$$ 648339 1078477 904807 857836 799332 997383 1078168 872424 1070938 886886 836999
14687H36999k493J83877P5338J51430j51488j17965r5175l11873N23897l9345
$$ 836999 834506 1018383 1093721 1245151 1093663 975698 880523 568650 1092547 1053202
14677A053202l10477O9019P6635L56236l99752l3932L42644k30885o4040k1700
$$ 1053202 742725 811744 888379 1244615 844863 810931 1153575 922690 858650 836950
14667H36950L53380l84431L64197m30073M00722j62463J24367K74727k15696k4870
$$ 836950 1190330 805899 1170096 740023 1140745 978282 1102649 1377376 1161680 1136810
14657A136810Q3873j36586L3429l73110L92437k17716K96478j28549j9104j95951
$$ 1136810 1220683 1084097 1117526 744416 1136853 919137 1215615 1087066 1067962 872011
14647H72011M4538Q5334P9734L66964k04648k9773k13558J67400J70251l32407
$$ 872011 916549 1001883 1081617 1448581 1243933 1214160 1000602 1168002 1338253 1005846
14637A005846Q8551K12220j86047L77966j60603j36998M9139J76671l02951M34883
$$ 1005846 1094397 1306617 1120570 1498536 1337933 1200935 1250074 1426745 1123794 1558677
14627A558677m2174j85863J33539k6443l87968L25980j89825J93670M3250K47089
$$ 1558677 1516503 1330640 1464179 1437736 1049768 1375748 1185923 1379593 1422843 1669932
14617A669932m55927K25698k0134l49071O29717k5315j90568j90218K21690J08175
$$ 1669932 1214005 1439703 1419569 1070498 1700215 1674900 1484332 1294114 1515804 1623979
14607A623979k61903J97035Q8615j61072K12035K48203n91816K14770R5293o4023
$$ 1623979 1362076 1559111 1647726 1486654 1698689 1946892 1355076 1569846 1665139 1601116
14597A601116p6900K44993k20058J80720k46953M05204k97278L17576R3322k38350
$$ 1601116 1524216 1769209 1549151 1729871 1482918 1888122 1590844 1908420 2001742 1763392
14587A763392j96217L70035m37539O8356L67014l18981J72716K48184K2410m8399
$$ 1763392 1567175 1937210 1499671 1568027 1935041 1616060 1788776 2036960 2059370 2010971
14577B010971l864K53955k39496J27891K8465k58192M06226J06572J69567l99222
$$ 2010971 2007107 2261062 2021566 2149457 2177922 1919730 2325956 2432528 2602095 2202873
14567B202873j30759m340J59644j4252L28130m0700R4057M1995M25788l24902
$$ 2202873 2072114 2067774 2227418 2213166 2541296 2500596 2594653 2636648 3062436 2737534
14557B737534j1802J76979M63192l7709J35990O14633N00462J259826J836014
$$ 2737534 2725732 2902711 3365903 3328194 3464184 4078817 4579279 5839105 7675119
14548G675119M742949Q838067J6474347P525366k0850748A0066128D879186k066389
$$ 7675119 12418068 21256135 37730482 45255848 24405100 10066128 4879186 2812797
14540B812797l91907k72620o955l9750J75068j08183r0447k11865n2745M72685
$$ 2812797 2420890 2148270 2141315 2101565 2276633 2168450 2078003 1866138 1813393 2286078
14530B286078Q5527m31808J78146j3845k717M33114o36368O75676O154k12211
$$ 2286078 2371605 1939797 2117943 2104098 2101381 2534495 1898127 2573803 2579957 2367746
14520B367746m3291j75353K72128K40585Q6233j24877J37869l59020N41769m87605
$$ 2367746 2324455 2149102 2421230 2661815 2748048 2623171 2761040 2402020 2943789 2456184
14510B456184L49736k71563N2586o6902J11853J62934Q5858R203j37104L71463
$$ 2456184 2805920 2534357 2586943 2520041 2631894 2794828 2880686 2889889 2752785 3124248
14500C124248k57632J35610O2858l0124K06840R5034j70290J25418J97964J7699
$$ 3124248 2866616 3002226 3065084 3034960 3241800 3336834 3166544 3291962 3489926 3507625
14490C507625j38513J40945M47088k47063j09561m7279J42923L6971K74037l1226
$$ 3507625 3369112 3510057 3957145 3710082 3600521 3553242 3696165 3733136 4007173 3975947
14480C975947K4292l16880L75315j57158J12772R161j73903N55407j18600m7992
$$ 3975947 4000239 3683359 4058674 3901516 4014288 4023449 3849546 4404953 4286353 4238361
14470D238361Q5314j06869K73307k92168L00913K18709o7103J46242Q7857K3752
$$ 4238361 4323675 4216806 4490113 4197945 4498858 4717567 4650464 4796706 4884563 4908315
14460D908315m7972N6664K43576l71532J65542L24073j78626K51959J44051k09873
$$ 4908315 4860343 4917007 5160583 4789051 4954593 5278666 5100040 5351999 5496050 5286177
14450E286177J15675P8559L3999L50549l463r7705P5573n9912J63845K07625J83506
$$ 5286177 5401852 5480411 5514410 5864959 5861496 5763791 5839364 5779452 5943297 6150922 6334428
14439F334428l5159Q66J12551L34978k78745J8777M05654q5855J31364J98213
$$ 6334428 6299269 6300135 6412686 6747664 6468919 6487696 6893350 6807495 6938859 7137072
14429G137072J67233j24223l3803J39832L4244k6364K65218K67278j04899M29895
$$ 7137072 7304305 7180082 7146279 7286111 7320355 7293991 7559209 7826487 7721588 8151483
14419H151483J775Q2345k57332M83096J59203J17465R8597J57363L23329n4504
$$ 8151483 8153258 8235603 7978271 8461367 8620570 8738035 8836632 8993995 9317324 9262820
14409I262820K19834K0272M63201k28378J13024J87290M58335m21574L94047L64647
$$ 9262820 9482654 9502926 9966127 9737749 9850773 10038063 10496398 10074824 10468871 10833518
14399A0833518q1806N35226l59751M48107K77001K96839K39394j64202M52838
$$ 10833518 10751712 11286938 10927187 11375294 11652295 11949134 12188528 12024326 12477164
14390A2477164j40421N49766K02091K74051N18962r7214J45911L27095K56753
$$ 12477164 12336743 12886509 13088600 13362651 13881613 13784399 13930310 14257405 14514158
14381A4514158K79955L56929j09426O88858K44378J58763L49615l6492O03003
$$ 14514158 14794113 15151042 15041616 15730474 15974852 16133615 16483230 16446738 17049741
14372A7049741M01670K97063M98793K25591K75145P74265l1582N06897K13782
$$ 17049741 17451411 17748474 18247267 18472858 18748003 19522268 19490686 19997583 20211365
14363B0211365M65450J040029K57699K85006N31915N81719N44650N75441J71194
$$ 20211365 20676815 21716844 21974543 22259549 22791464 23373183 23917833 24493274 24664468
14354B4664468O30243O05325Q52564O86035L29118O51323P93363Q60813O19249
$$ 24664468 25294711 25900036 26752600 27438635 27767753 28419076 29212439 30073252 30692501
14345C0692501R87473Q43854P56270J242627O18305R74958P87800J205943J371346
$$ 30692501 31679974 32523828 33280098 34522725 35141030 36115988 36903788 38109731 39481077
14336C9481077O83381J327693J151868J080635J676159J084557J863290J367945
$$ 39481077 40164458 41492151 42644019 43724654 45400813 46485370 48348660 49716605
14328D9716605J308176J938518J670963J578094J621859K054439K273919K412462
$$ 49716605 51024781 52963299 54634262 56212356 57834215 59888654 62162573 64575035
14320F4575035K295880K138922K303831K873490L057184K607554L327826L064175
$$ 64575035 66870915 69009837 71313668 74187158 77244342 79851896 83179722 86243897
14312H6243897L382579L409405M133678L912866M252888M697463M497089N175729
$$ 86243897 89626476 93035881 97169559 101082425 105335313 110032776 114529865 119705594
14304A19705594N168946N627341N920981O532596O495224O880545P571023Q187901
$$ 119705594 124874540 130501881 136422862 142955458 149450682 156331227 163902250 172090151
14296A72090151Q431936Q618242R233751J0000148J0483273J1096565J1309419
$$ 172090151 180522087 189140329 198374080 208374228 218857501 229954066 241263485
14289B41263485J1958570J2609908J3235650J3529231J4085234J4196755J4392638
$$ 241263485 253222055 265831963 279067613 292596844 306682078 320878833 335271471
14282C35271471J4977380J4450712J4708351J4176113J3790107J2555713J1894552
$$ 335271471 350248851 364699563 379407914 393584027 407374134 419929847 431824399
14275D31824399J0544850Q466510M604274Q83583J49457r94237J446387j764854
$$ 431824399 442369249 450835759 455440033 456323616 456473073 455478836 456925223 455160369
14267D55160369k492111m571439p477381j0090699j1501575j2960935j3694266
$$ 455160369 452668258 448096819 440619438 430528739 419027164 406066229 392371963
14260C92371963j4504078j5124933j5361107j5542682j4716796j4151845j4233559
$$ 392371963 377867885 362742952 347381845 331839163 317122367 302970522 288736963
14253B88736963j3841039j3141375j2717879j2067312j1372623j1196549j0337282
$$ 288736963 274895924 261754549 249036670 236969358 225596735 214400186 204062904
14246B04062904r723436r304939q198733q358800q015251p308069o879809o688363
$$ 204062904 194339468 185034529 176835796 168476996 160461745 153153676 146273867 139585504
14238A39585504n507736n915838n615563n308503m955895m582203m477636l778244
$$ 139585504 134077768 128161930 122546367 117237864 112281969 107699766 103222130 99443886
14230I9443886l624092m161827l161322l650161l015854l049105k820787l038085
$$ 99443886 95819794 91657967 88496645 84846484 81830630 78781525 75960738 72922653
14222G2922653k403992k425821k064917k246928k166130k415925j840924j640227
$$ 72922653 70518661 68092840 66027923 63780995 61614865 59198940 57358016 55717789
14214E5717789j645115j285094j911941j372886j938705q47066j513401o81529
$$ 55717789 54072674 52787580 50875639 49502753 47564048 46716982 45203581 44522052
14206D4522052j315349j036158j673673j084899j203240n85290o34674j499477
$$ 44522052 43206703 42170545 40496872 39411973 38208733 37623443 36988769 35489292
14198C5489292r16184j170160q15475n17116p46323r66869l60516p54414q68167
$$ 35489292 34573108 33402948 32587473 32070357 31324034 30357165 29996649 29242235 28374068
14189B8374068p88897l56777r03863l98319m51665o93345m31367q77387l32745
$$ 28374068 27585171 27228394 26324531 25926212 25474547 24781202 24349835 23472448 23139703
14180B3139703l86326o95706k28336m32939n33438q22326l2259n14905n33130
$$ 23139703 22753377 22057671 21829335 21396396 20862958 20040632 20008373 19493468 18960338
14171A8960338j53970l59226k18350m54257j86961l70330p2174p35266p9286l33917
$$ 18960338 18806368 18447142 18228792 17774535 17587574 17217244 17145070 16409804 16330518 15996601
14161A5996601m14724n39968K01747n91834k7927o23026j32499j1331m52578k68820
$$ 15996601 15581877 15041909 15243656 14651822 14623895 14000869 13868370 13857039 13404461 13135641
14151A3135641J68864k89249l63910j43103j29889l44259k90676K185L1837m00958
$$ 13135641 13304505 13015256 12651346 12508243 12378354 12034095 11743419 11745604 11777441 11376483
14141A1376483K8059M272l22961l25016O1476m23145l58416J99323l21704J2316
$$ 11376483 11404542 11408814 11085853 10760837 10822313 10399168 10040752 10240075 9918371 9930687
14131I930687m22416p3347j79955L89413n18258J63940j95216j27907m87109O3063
$$ 9930687 9508271 9434924 9254969 9644382 9126124 9290064 9094848 8966941 8479832 8542895
14121H542895o3023n2659j97551Q1483l45981m25196Q3571K22494m44743R8971
$$ 8542895 8479872 8427213 8229662 8311145 7965164 7539968 7623539 7846033 7401290 7500261
14111G500261j91906O0768N069M1529l39230J08725m19353R829q8524O8107o16477
$$ 7500261 7308355 7369123 7374192 7415721 7076491 7185216 6765863 6775692 6687168 6755275 6138798
14100F138798L07944M391J85943n56549L16741m01938p7653k46081P2715Q4551
$$ 6138798 6446742 6451133 6637076 6080527 6397268 5995330 5917677 5671596 5744311 5828862
14090E828862M0510k3167l57766L22104j96352k61007O8160k42598L98998m13159
$$ 5828862 5869372 5846205 5488439 5810543 5614191 5353184 5421344 5178746 5577744 5164585
14080E164585N3524m9592j89931L39926k53503k69722k67080J50185N8348j52251
$$ 5164585 5218109 5168517 4978586 5318512 5065009 4795287 4528207 4678392 4736740 4584489
14070D584489J91769k31673r2289J09718P8704n3499j8290K2644l40442M05090
$$ 4584489 4776258 4544585 4452296 4562014 4640718 4587219 4568929 4591573 4251131 4656221
14060D656221j00053j55093q0957j11787J87769l27042M1547N0351k95540L56273
$$ 4656221 4556168 4401075 4320118 4208331 4396100 4069058 4110605 4160956 3865416 4221689
14050D221689j59529j5707q8142k33801k0747K67304m49719J1391J6613P4652
$$ 4221689 4062160 4046453 3958311 3724510 3703763 3971067 3521348 3532739 3549352 3624004
14040C624004m9652o0662j71461K67634l07548L95536j30128J0476m73655N34436
$$ 3624004 3574352 3513690 3342229 3609863 3302315 3697851 3567723 3578199 3104544 3638980
14030C638980l90066p1738l7925J66954l82485J63368l17766J86038J38949j615
$$ 3638980 3248914 3177176 3139251 3306205 2923720 3087088 2769322 2955360 3094309 3092694
14020C092694J19727l86966J98666j52097j60530P5032j72812R3626k94815M62541
$$ 3092694 3212421 2825455 3024121 2872024 2711494 2786526 2613714 2707340 2412525 2875066
14010B875066j84316j39730r4003K19388K03016m78745l904J23344l48835L07563
$$ 2875066 2690750 2551020 2457017 2676405 2879421 2400676 2396772 2520116 2171281 2478844
14000B478844j26253L95924m87402K6484J0788l788k6045r5446R3351J60952N29987
$$ 2478844 2352591 2748515 2261113 2287597 2298385 2294597 2268552 2173106 2266457 2427409 2957396
13989B957396J001210K868203O720701J6689448J4337235j4285224j4704531o294342
$$ 2957396 3958606 6826809 13547510 30236958 44574193 30288969 15584438 9290096
13981I290096k848728j390734o62986m23108l77958q3067j10432o68738J56475
$$ 9290096 6441368 5050634 4387648 3964540 3586582 3503515 3393083 2724345 2880820
13972B880820r8333P7699l64406M79209m20403n7461p2121K61551l03510m3983
$$ 2880820 2782487 2860186 2495780 2974989 2554586 2497125 2425004 2686555 2383045 2339062
13962B339062L18599j9613m44704o6531J8536J53142k67832q2174L18017Q2357
$$ 2339062 2657661 2638048 2193344 2126813 2145349 2298491 2030659 1948485 2266502 2348859
13952B348859l1628l57128L76449n93793L82283K12660l51274j26656P4658j35560
$$ 2348859 2317231 1960103 2336552 1742759 2125042 2337702 1986428 1859772 1934430 1798870
13942A798870L49383j26076j7328j33119J85104k72207l1592K18403n9032K64527
$$ 1798870 2148253 2022177 2004849 1871730 2056834 1784627 1753035 1971438 1912406 2176933
13932B176933l65194k20078K59801r1669R5541J44148l6315j5797j99928N6417
$$ 2176933 1811739 1591661 1851462 1759793 1855334 1999482 1963167 1947370 1747442 1803859
13922A803859J51897k61777j98920J11696J73106j9210K78734j38034l12077K11912
$$ 1803859 1955756 1693979 1495059 1606755 1779861 1760651 2039385 1901351 1589274 1801186
13912A801186n7514j10908j02721L03399l18839J62888J6025O4260m02531M09927
$$ 1801186 1743672 1632764 1530043 1833442 1514603 1677491 1693516 1757776 1355245 1765172
13902A765172l71252L28584j95899k6877O3250j81688j3255l18089M98843j49156
$$ 1765172 1393920 1722504 1526605 1499728 1562978 1381290 1368035 1049946 1548789 1399633
13892A399633j64158L52254m12772N01538l35976R8166K1429m35568m6352M60285
$$ 1399633 1235475 1587729 1174957 1676495 1340519 1438685 1460114 1024546 978194 1438479
13882A438479m0471J92478k72559J6669k8647k38874L99074j48503k04934M62308
$$ 1438479 1398008 1590486 1317927 1334596 1305949 1067075 1466149 1317646 1112712 1575020
13872A575020m56950R2704K72414k37007l7456M3859j55622K70845l22885J62733
$$ 1575020 1118070 1210774 1483188 1246181 1208725 1252584 1096962 1367807 1044922 1207655
13862A207655j72599M8115K00747j03521J34377j35261k80212K89401J12635r3280
$$ 1207655 1035056 1083171 1283918 1180397 1314774 1179513 899301 1188702 1301337 1208057
13852A208057l64913K84034P5911K28201r8056m08492J9771r6790K94202q2077
$$ 1208057 843144 1127178 1203089 1431290 1333234 924742 944513 847723 1141925 1059848
13842A059848J44197J6286k50470O458J00123j38554K20585k90549j25318Q3184
$$ 1059848 1204045 1220331 969861 976319 1076442 937888 1158473 867924 742606 825790
13832H25790L00003l24866K18988k55150K34259m8211K27923k90653J42030J06316
$$ 825790 1125793 800927 1019915 764765 999024 950813 1178736 888083 1030113 1136429
13822A136429k4571j29828j88934J51042J1018j9030o5603K78060k18348J6786
$$ 1136429 1111858 982030 793096 944138 955156 936126 870523 1148583 930235 947021
13812I47021L68935l13066o8986p8229J42568K09257n02720J04748j03427L29339
$$ 947021 1315956 1002890 933904 855675 998243 1207500 704780 809528 706101 1035440
13802A035440K66443n32751l7632M81781l7958l83141L23757k36849J80726j58185
$$ 1035440 1301883 769132 731500 1213281 1175323 792182 1115939 879090 1059816 901631
13792I01631J65443l08364k16593K54029p573O5443p1707J35586N9637L5770j98070
$$ 901631 1067074 758710 542117 796146 788573 854016 782309 917895 977532 1013302 815232
13781H15232J98705l8053j66494K11314k04028J36393l42204m2574J92103q8847
$$ 815232 1013937 975884 809390 1020704 816676 953069 610865 568291 760394 671547
13771F71547K31084J39437k23666j36249N3921q4420K01018J82464k37262l8606
$$ 671547 902631 1042068 818402 682153 736074 651654 852672 1035136 797874 759268
13761G59268m1357l6477M2679Q5953j18975l27737N05663j17012K79377q4337
$$ 759268 717911 681434 724113 810066 691091 363354 869017 752005 1031382 947045
13751I47045k15014k57526K88514l0279j62841K88742M7329j69802J06553j01995
$$ 947045 732031 474505 763019 732740 569899 858641 905970 736168 842721 740726
13741G40726M71255l28735k60870J56462l55968J17592K56805J4154k54588J68746
$$ 740726 1211981 883246 622376 778838 422870 540462 797267 811421 556833 725579
13731G25579L52480D85501J81765q8656J87293C69183J94768K57152m09933L38345
$$ 725579 1078059 485501 667266 578610 765903 369183 563951 821103 411170 749515
13721G49515o2263j32522R7520J81834j4702r6623n9798Q7429P2437j96230m1093
$$ 749515 687252 554730 652250 834084 819382 722759 662961 750390 822827 626597 585504
13710E85504J79257k73468M240q4840J69166N1152J79514J16368l32179R0077
$$ 585504 764761 491293 495533 410693 579859 631011 810525 926893 594714 684791
13700F84791K63998D35285J38757j00990J81874o3266K00196o5963J5537j70539
$$ 684791 948789 435285 574042 473052 654926 591660 791856 725893 741430 570891
13690E70891j19466O6444K04063k05320j92970M49964k29303K10999k06957r2522
$$ 570891 451425 517869 721932 516612 323642 773606 544303 755302 548345 455823
13680D55823j68060K21119K73437k01328o190J84946k69548K38620k13939q9920
$$ 455823 287763 508882 782319 580991 574801 759747 490199 728819 514880 424960
13670D24960n799K99940p6800B53825K05545K47873o9482k7699j58566J57389
$$ 424960 419161 719101 642301 253825 459370 707243 637761 610062 451496 608885
13660F08885J70911B92089Q8608M47512l57297J09907R6828k62578J22488K506
$$ 608885 779796 292089 380697 828209 470912 580819 677647 415069 537557 540063
13650E40063R7634B95613J63923J60375k57324N1208J94249M2261k58288p0256
$$ 540063 637697 295613 459536 619911 362587 413795 608044 650305 392017 321761
13640C21761p3471K00833j00872J36998l973j06447J11822k08298J55482k01410
$$ 321761 248290 449123 348251 485249 481276 374829 486651 278353 433835 232425
13630B32425J71994j59507L46470o6053B39129L48303O0444n7919j80974J05949
$$ 232425 404419 244912 591382 525329 239129 587432 647876 589957 408983 514932
13620E14932j53849J36687J03164o9714k55932R3505m0739L43767B19184K52717
$$ 514932 361083 497770 600934 531220 275288 368793 328054 671821 219184 471901
13610D71901j49882J77833o395j69514K51827M2686J51324l15816K65927l16362
$$ 471901 322019 499852 493457 323943 575770 618456 769780 453964 719891 403529
13600D03529J98263k81742J85868j09510L62073k44302J11997j69001Q2136j6160
$$ 403529 601792 320050 505918 396408 758481 514179 626176 457175 539311 523151
13590E23151R6917J89732B81505K22150L4099k6255N8958B56403p6884K78236
$$ 523151 620068 809800 281505 503655 537754 511499 570457 256403 179519 457755
13580D57755J11375J9164M5219j63569r7734A76584P9354K07176n2004j22382
$$ 457755 569130 588294 633513 469944 372210 176584 255938 463114 411110 288728
13570B88728K00346n2148J38517A34584J49534j30525J83690l0014L42428k57079
$$ 288728 489074 436926 575443 134584 284118 153593 337283 307269 649697 392618
13560C92618j896n1556R877P5503a09532C06218K03919j68881A24543L22062M1226
$$ 392618 390722 339166 349043 424546 -109532 306218 510137 341256 124543 446605 487831
13549D87831k08027O3023K00077k43711F8258L65605j49472j33678K49577D6099
$$ 487831 279804 342827 542904 299193 68258 433863 284391 150713 400290 46099
13538D90416L7305P4126a6113C70176j63876K69880j55958J35572Q2221A94266
$$ 490416 527721 601847 -16113 370176 206300 476180 320222 455794 538015 194266
13527C15466R1531j50871F5917M03670B21289J3792L0063j31583K86349A50429
$$ 315466 406997 256126 65917 469587 221289 235081 265144 133561 419910 150429
13516G9016L25976A39617K58260O454o1185j49878K05866A27003M6766J8639J12878
$$ 79016 404992 139617 397877 404331 343146 193268 399134 127003 173769 192408 305286
13505C05286F97P92006A40057K77400H4721N9443L4025Q4580j8011K71275j32863
$$ 305286 697 792703 140057 417457 84721 144164 178189 262769 244758 516033 383170
13494C83170L36245B71466E9037K71510A06296K01986J95282J1109k56658R7337
$$ 383170 719415 271466 59037 330547 106296 308282 503564 514673 258015 355352
13484C55352h4147D36582j02289M3642j26673q5624J93190k108A00737K08481
$$ 355352 -84147 436582 334293 377935 251262 165638 358828 356720 100737 309218
13474C09218q4833J31644A69623P4194J42272A63846P9927K27795j05908l0700
$$ 309218 224385 356029 169623 243817 386089 163846 243773 471568 365660 334960
13464C34960q1835J9202J61490F9533M7680J43532J03309j47246a76129D06311
$$ 334960 253125 272327 433817 69533 117213 260745 364054 216808 -176129 406311
13453B57709Q0881q4979j14054K07212A0433J73285K68882A96348D8720L33303
$$ 257709 338590 253611 139557 346769 10433 183718 452600 196348 48720 382023
13443C82023L9999A72487K1464L37810i7755H9101L28020b7217C08050L0006a41551
$$ 382023 422022 172487 193951 531761 -97755 89101 417121 -27217 308050 338056 -141551
13431C47025A68966J87342j11641J42602m8992n0552J81207k08222N18765E8264
$$ 347025 168966 356308 244667 387269 338277 287725 468932 260710 779475 58264
13420F81035A61484J35202J21993A81345a82337B25069K7653M8533C4579M4128
$$ 681035 161484 296686 418679 181345 -182337 225069 252722 301255 34579 78707
13410G8707L30728j32905J75915j01359J33210A70981p8723k9490N715L03308
$$ 78707 409435 276530 452445 351086 484296 170981 92258 62768 68483 371791
13400C71791K36915b4643C49762J28507H9800J43298l3379M0780A12818J94849
$$ 371791 608706 -24643 349762 478269 89800 233098 199719 240499 112818 307667
13390C07667J23399j37860j44608E2531J6364K51533k5044j19687l0971J79037
$$ 307667 431066 293206 148598 52531 68895 320428 295384 175697 144726 323763
13380C23763r5569J27270k0921n7740L7780A22894L74333A15192l801J47452Q0616
$$ 323763 228194 355464 334543 276803 314583 122894 497227 115192 111391 258843 339459
13369C39459i6428C25144j49849R3902K31746A88406j3436b17B53637n0973M2005
$$ 339459 -96428 325144 175295 269197 500943 188406 174970 -217 253637 202664 244669
13358B44669A650K23055n4176g597D37659A1602J6248L62025l4458j75028J14015
$$ 244669 1650 224705 170529 -7597 437659 11602 27850 389875 355417 180389 294404
13347B94404j15081M08688N8712j99004j10762M7203j83128M8666q6472M00156
$$ 294404 179323 588011 646723 447719 336957 384160 201032 249698 163226 563382
13337E63382k28475A28814b03723A78105K56863j45052j44800J20810K08887R7826
$$ 563382 334907 128814 -203723 178105 434968 289916 145116 265926 474813 572639
13327E72639a22904F30293A07816J97883o5648J72071p7641E7186L97575k21976
$$ 572639 -122904 630293 107816 305699 240051 412122 334481 57186 454761 232785
13317B32785n3972F3071J50701J36809p0069b72644a5139C99845a15757A98218
$$ 232785 178813 63071 213772 350581 280512 -272644 -15139 399845 -115757 198218
13306C55424H3507J56941J99616k01169A06369a37184A2654J62273o0776a47345
$$ 355424 83507 240448 440064 238895 106369 -137184 12654 174927 114151 -147345
13295B57356e2191C04240j17661A6165K10775c2323A12320Q0221J4022n7078J92197
$$ 257356 -52191 304240 186579 16165 226940 -32323 112320 192541 206563 149485 341682
13284C41682A58574h8613A13851K92953a10804F5562J80862a7336A74207J79430
$$ 341682 158574 -88613 113851 406804 -110804 65562 246424 -17336 174207 353637
13274C53637h6355D23952B08033m0274D5921J77752E4765K68163m8474c2693A21910
$$ 353637 -86355 423952 208033 167759 45921 223673 54765 322928 274454 -32693 121910
13262E9888J65808L39160a18793C7578J0911L6561O8733m8148Q1197L555m5477
$$ 59888 225696 564856 -118793 37578 48489 85050 153783 105635 186832 190387 144910
13251A44910i2369B99042j08094E6708b4464E1511K85259j43210J26717M7283
$$ 144910 -92369 299042 190948 56708 -24464 51511 336770 193560 320277 367560
13241C67560b07221D05245n0149I2678J0344c2872B29002K79044g3653A11462
$$ 367560 -207221 405245 355096 92678 103022 -32872 229002 508046 -73653 111462
13230a07063I2965J38734Q5788A55018F9557b62768B11639a20622l0437B17270
$$ -107063 92965 231699 317487 155018 69557 -262768 211639 -120622 -151059 217270
13219a248B53283J02082B0625N3204L12703A88603J79130j7256A34596L44616
$$ -1248 253283 355365 20625 73829 386532 188603 367733 350477 134596 479212
13209D79212j00459j39001K28131A10752A0855m639K38818B5664L05674a39877
$$ 479212 378753 239752 467883 110752 10855 6216 245034 25664 331338 -139877
13198d9841j9138C31095o9895q7654J06082E4721N0613b62617c1222f477A15284
$$ -49841 -68979 331095 261200 173546 279628 54721 105334 -262617 -31222 -6477 115284
13186c0294A13148D9152K36289m4589D3497P8981D6383L93268B6800L9835K10301
$$ -30294 113148 49152 285441 240852 43497 122478 46383 439651 26800 66635 276936
13175B76936J66788k07233a07849B29082A12866K27252g5688B36731o2414g8033
$$ 276936 443724 236491 -107849 229082 112866 340118 -75688 236731 174317 -78033
13164A34258K72756F8560a1289B702J51583f3747o2536M5764B09253G3551a78812
$$ 134258 407014 68560 -11289 2702 154285 -63747 -126283 -80519 209253 73551 -178812
13152C245L41709K09728b3725A21899c9389o4387B28466i7541C30752p2634g6649
$$ 3245 344954 554682 -23725 121899 -39389 -103776 228466 -97541 330752 258118 -76649
13140A82715Q4978l5374I8337g688k00370C9203C01J69828E2627j6724I553J70898
$$ 182715 267693 232319 98337 -7688 -208058 39203 301 170129 52627 35903 9553 180451
13128A80451C450a7601D53878h7562l2882A14526L1982D7868J7743L2575h1693
$$ 180451 3450 -17601 453878 -87562 -120444 114526 146508 47868 65611 98186 -81693
13116A71298c5971B70380p2808r2324c8117B89349c9137m0954A02322a21493C24469
$$ 171298 -35971 270380 197572 105248 -38117 289349 -39137 -80091 102322 -121493 324469
13104A50309J05611j11043O8269D0987D780J09045m4383Q9100c3102B66097N6827
$$ 150309 255920 144877 213146 40987 4780 113825 69442 158542 -33102 266097 322924
13093C22924A05841J88873j11008P5444L5602i5726D4973e2880A59083o8760J97654
$$ 322924 105841 294714 183706 259150 294752 -95726 44973 -52880 159083 90323 287977
13082B87977F3129h5136D3482a43240n841B36700a12179C14408r0198J1159l5273
$$ 287977 63129 -85136 43482 -143240 -149081 236700 -112179 314408 224210 235369 200096
13071B00096J48887a3538A55709J33322b4010C31246A9585M32430A40713K4251
$$ 200096 348983 -13538 155709 289031 -24010 331246 19585 452015 140713 164964
13061A64964J81173A29732N5945B5159c8276A5284K20213I0872J67503a15550
$$ 164964 346137 129732 185677 25159 -38276 15284 235497 90872 258375 -115550
13050A11949D3506d6763j41077H5503a19879B48421G5959J07367E058M4913O8817
$$ 111949 43506 -46763 -187840 85503 -119879 248421 75959 183326 5058 49971 118788
13039A18788n7694K39536E2866c1347a3903A10065O7216F3623M5754Q2417q2676
$$ 118788 61094 300630 52866 -31347 -13903 110065 177281 63623 109377 191794 109118
13028A09118Q7824J24030j35514D5636J50077L8152A03584P8485O9876r3598M6544
$$ 109118 196942 320972 185458 45636 195713 233865 103584 182069 251945 158347 204891
13017B04891d5888q1364A78003l0339M6110I1053J02454d5402B59924F5542k0147
$$ 204891 -45888 -127252 178003 147664 193774 91053 193507 -45402 259924 65542 45395
13006D5395b29428E48e664n3774l4475k08350C77275A33386m1672c996k65390
$$ 45395 -229428 548 -5664 -59438 -93913 -302263 377275 133386 91714 -3996 -269386
12995b69386A5707L3846a77938g2973D36003b1021A74360C493M9435J38483K8340
$$ -269386 15707 49553 -177938 -72973 436003 -21021 174360 3493 52928 191411 219751
12984B19751b92802B02983F7772k6713J61077D5061a08209A44146k1665O0892
$$ 219751 -292802 202983 67772 41059 202136 45061 -108209 144146 122481 183373
12974A83373l7275a54593e2275j35249e958B04140H1502J97704J03131a10713
$$ 183373 146098 -154593 -52275 -187524 -5958 204140 81502 279206 382337 -110713
12963I7146f6664H2702Q6546h146I2260P2518J939o1491a10760k38131B66425
$$ 97146 -66664 82702 169248 -8146 92260 164778 166717 105226 -110760 -348891 266425
12951b1865C79942A56165a66475l2745D27195c6229B82252j40708O9494O3386
$$ -21865 379942 156165 -166475 -199220 427195 -36229 282252 141544 211038 274424
12941B74424a01702A8185G436h8841B69750h3127l3739A90775F1546A5420a39873
$$ 274424 -101702 18185 7436 -88841 269750 -83127 -116866 190775 61546 15420 -139873
12929A41154g2337k6382B37020I0636L3632A8183M549J90627j06200C3863J15663
$$ 141154 -72337 -98719 237020 90636 124268 18183 22732 213359 107159 33863 149526
12918A49526p3371L8072L3154a82797n0051D10846D9638J35603K10897I3874J86405
$$ 149526 76155 114227 147381 -182797 -232848 410846 49638 185241 396138 93874 280279
12907B80279p9905E6578a60631k3105A71184J4614j9637p1493a48979B4102O6712
$$ 280279 200374 56578 -160631 -183736 171184 185798 166161 94668 -148979 24102 90814
12896I0814a53595A7131K35813q4525m7317c1322k8006C03576J55686i1413B62772
$$ 90814 -153595 17131 252944 168419 121102 -31322 -59328 303576 459262 -91413 262772
12884b47380A17964L1452h8533A580N19850B42811j19457a03155B31053a24891
$$ -247380 117964 149416 -88533 1580 521430 242811 123354 -103155 231053 -124891
12873B35897A3640K69706d3092k20116j1209H8172b32022M1651e4922K0886A32895
$$ 235897 13640 283346 -43092 -263208 -274417 88172 -232022 -190371 -54922 -34036 132895
12861b52178F5951K5834L44687b84083B01023q0204j1725J03250B0109a21652
$$ -252178 65951 91785 436472 -284083 201023 120819 109094 212344 20109 -121652
12850A09803B6632b05842A48728b22223h3216b1851D36696b49961K6012A39008
$$ 109803 26632 -205842 148728 -222223 -83216 -21851 436696 -249961 -223949 139008
12839h70j60426B66590b47543P8779B06746j5315i8062J9328B10488h4578C17877
$$ -870 -161296 266590 -247543 -168764 206746 191431 -98062 -78734 210488 -84578 317877
12827C8646L00319d4499A3587J86467k9066a17658a1775I4452L5894a56288A89082
$$ 38646 338965 -44499 13587 200054 170988 -117658 -11775 94452 130346 -156288 189082
12815a42213J7084F9617a66249C22979A1506J10124a9156A43415J45936a02204
$$ -142213 -125129 69617 -166249 322979 11506 121630 -19156 143415 289351 -102204
12804B5241D434J93281Q8661c72745J82894B10997l3843a6165g341A5398J01026
$$ 25241 4434 197715 286376 -372745 -189851 210997 177154 -16165 -7341 15398 116424
12793A16424c69181A99394I0402b2967A720g6791A78000a20429k8328E1859c21050
$$ 116424 -369181 199394 90402 -22967 1720 -76791 178000 -120429 -148757 51859 -321050
12781A64877a99529f19j43446H999b25243B4598L14199A3858J38660J65266e7198
$$ 164877 -199529 -619 -144065 8999 -225243 24598 338797 13858 152518 317784 -57198
12769C07572j40635e4520q4752K2728g380B34088L71H8447R1549J31491b14970
$$ 307572 166937 -54520 -139272 -116544 -7380 234088 234459 88447 179996 311487 -214970
12757g8702C8074K46278a33755A27935K24191a2715A66988J2944F7821K5961M9945
$$ -78702 38074 284352 -133755 127935 352126 -12715 166988 179932 67821 93782 143727
12746A43727M1163q7231d3243k32201A40072o5833j2058K14154I423K27007a24345
$$ 143727 184890 97659 -43243 -275444 140072 74239 62181 276335 9423 236430 -124345
12734A23771L10235A2223a29220B90489o7154M6644j5339j22908C7084a34541
$$ 123771 434006 12223 -129220 290489 223335 269979 254640 131732 37084 -134541
12723I435Q0922B3339J12256c54260d5514A76821B3879J66154F2471J21917A4515
$$ 9435 90357 23339 135595 -354260 -45514 176821 23879 190033 62471 184388 14515
12711B99285A03534C4474J13999J14132H4544a21103C20302G5499r766L53568
$$ 299285 103534 34474 148473 262605 84544 -121103 320302 75499 65733 419301
12701D19301H6401M1097C6314J21631o5505D4548Q1652B1239b49954A58614a46158
$$ 419301 86401 127498 36314 157945 92440 44548 126200 21239 -249954 158614 -146158
12689C04825R1467c49203a33679F9263K19718I8228b32172B03569d3128C76262
$$ 304825 396292 -349203 -133679 69263 288981 98228 -232172 203569 -43128 376262
12678H8901I703N078a85279h731A71257p6677e6547D00245j08908h6114D9979
$$ 88901 9703 14781 -185279 -8731 171257 94580 -56547 400245 291337 -86114 49979
12666B52178A21663a3436B45430a82044G4187L59642b28693h7084F8492A9686
$$ 252178 121663 -13436 245430 -182044 74187 433829 -228693 -87084 68492 19686
12655A13412k5212a84378B63758J18664b7436e806j7260A6849c9863a7328D01069
$$ 113412 88200 -184378 263758 382422 -27436 -5806 -23066 16849 -39863 -17328 401069
12643C06970A06541a83973L5457g4092J5913A62270o0988Q1568D5254L53491i4769
$$ 306970 106541 -183973 -148516 -74092 -58179 162270 101282 182850 45254 398745 -94769
12631B93092j35741P8828H8641I305K54770O6920D2818K62660c08108B31141a38182
$$ 293092 157351 236179 88641 9305 264075 330995 42818 305478 -308108 231141 -138182
12619H2927K86786O0712b2065l3915j87018A27093a98612E5759K16501a0107j03937
$$ 82927 369713 430425 -22065 -55980 -242998 127093 -198612 55759 272260 -10107 -114044
12608a14044I2044M75368A51336O6162a53564j586A33267o4891J12989o1623K49372
$$ -114044 92044 567412 151336 217498 -153564 -155150 133267 68376 181365 119742 369114
12597C69114G7846d64933f1334C84235B3838a63564n0077j08902N9268A47336
$$ 369114 77846 -464933 -61334 384235 23838 -163564 -213641 -322543 -263275 147336
12586e2696H1559b47394C2340K41427j1899F8615O5478E9059Q3018c71279c862
$$ -52696 81559 -247394 32340 273767 261868 68615 134093 59059 142077 -371279 -3862
12574B26295C30K7329i7621M6986A12882E3096J18503h6793L1613j58838e4232
$$ 226295 330 27659 -97621 -50635 112882 53096 171599 -86793 -55180 -214018 -54232
12562A60046b9203D0297J78452c4139B66263A22348K5595c6578j71047J02040
$$ 160046 -29203 40297 218749 -34139 266263 122348 147943 -36578 -207625 -105585
12552a05585j00771b3870k40650A0609L20608b03628A18249K54930E4881K46552
$$ -105585 -206356 -23870 -264520 10609 331217 -203628 118249 373179 54881 301433
12542C01433a04524H6642C3908a2483k6946k48670a17262G7212J77070b42147
$$ 301433 -104524 86642 33908 -12483 -39429 -288099 -117262 77212 254282 -242147
12531A33547K63516A04065d8757C79744H5013e035r8113A99965c40544e0560j54933
$$ 133547 397063 104065 -48757 379744 85013 -5035 -103148 199965 -340544 -50560 -205493
12520b05493b6556l6477b1734k49881D18649a04531C53507E7746J38829m4411
$$ -205493 -26556 -63033 -21734 -271615 418649 -104531 353507 57746 196575 152164
12510A52164I677a41964n1235i6042a6990C75954a5602A61478C2736N02477b0401
$$ 152164 9677 -141964 -193199 -96042 -16990 375954 -15602 161478 32736 535213 -20401
12498i2205B97251b52519b3088o4596c558G5043L31662n7081a17188A78058q0146
$$ -92205 297251 -252519 -23088 -87684 -3558 75043 406705 349624 -117188 178058 97912
12487I7912K1759n3222C682J72294f4938C02579p2722a31795Q980D1635J19034
$$ 97912 119671 66449 3682 175976 -64938 302579 229857 -131795 -122815 41635 160669
12476A60669a32286H6672Q6585a02651C12038a17186A44964a11175o0081B16910
$$ 160669 -132286 86672 173257 -102651 312038 -117186 144964 -111175 -171256 216910
12465B54890a42900H0235R8298a46915e9825A03193J33976K0473b80806A267K89535
$$ 254890 -142900 80235 178533 -146915 -59825 103193 237169 257642 -280806 1267 290802
12454B90802d06061c2040j16481A10463e6821C4813L06301a74007A45023m0621
$$ 290802 -406061 -32040 -148521 110463 -56821 34813 341114 -174007 145023 104402
12444A04402k2782b74138F2880O2756a24648B75207F5693B7914J13544A1931K27392
$$ 104402 81620 -274138 62880 125636 -124648 275207 65693 27914 141458 11931 239323
12433B39323H7959M9759o739a31991A58842a57148C20454A6075K13512e3132a8899
$$ 239323 87959 137718 130979 -131991 158842 -157148 320454 16075 229587 -53132 -18899
12421a70826j15530h5454q1853P9838K7410B54241j15961l5945g6785c6783A43652
$$ -170826 -286356 -85454 -167307 -87469 -60059 254241 138280 102335 -76785 -36783 143652
12409a10401E6746i87A49221D993R5522J37551j15926N0942i9523n7869A33916
$$ -110401 56746 -987 149221 4993 100515 238066 122140 173082 -99523 -157392 133916
12397A67845C9712J78202F2971c76441a22721G0136b58344D780f0007J2026j23881
$$ 167845 39712 217914 62971 -376441 -122721 70136 -258344 4780 -60007 -47981 -171862
12386a71862B05835h0717j506I3480b62825J3169j8823H1536j5758l1580J85131
$$ -171862 205835 -80717 -82223 93480 -262825 -249656 -268479 81536 65778 34198 219329
12375B19329e8117k6982k62142N4917e2682G6364j641a77999C6257L1409B534
$$ 219329 -58117 -85099 -347241 -292324 -52682 76364 74723 -177999 36257 67666 2534
12363A93973D4728f1397A4963K49367H608L6450H496O4870a35424m6864A95372
$$ 193973 44728 -61397 14963 264330 8608 45058 8496 73366 -135424 -182288 195372
12351i4329L2355p8999C6898O4478g0196B3150J50522P3943D2325K69898J4505
$$ -94329 -61974 -140973 36898 101376 -70196 23150 173672 247615 42325 312223 326728
12340C26728f9860A14494E3344b08706A43350h7718E3982M9454g5335c5902A20926
$$ 326728 -69860 114494 53344 -208706 143350 -87718 53982 103436 -75335 -35902 120926
12328A94334C0763e1311l1030A97515a27810C18057d7160B29705d5606h310q7670
$$ 194334 30763 -51311 -82341 197515 -127810 318057 -47160 229705 -45606 -8310 -95980
12317i5980B54934c9087k05348a3867k01242j80767F0226i5866F3696L7733a59228
$$ -95980 254934 -39087 -244435 -13867 -215109 -395876 60226 -95866 63696 101429 -159228
12305B17994H9267b75621a06565B15397c21363i6471A82756j8109E6040J21551
$$ 217994 89267 -275621 -106565 215397 -321363 -96471 182756 164647 56040 177591
12295A77591H4354a31130G404O7649N8603N6147c46639b4088B03421H2635K97959
$$ 177591 84354 -131130 7404 75053 133656 189803 -346639 -24088 203421 82635 380594
12284C80594h5072l6907n2732O6006A28904J11950a35146A59286a86125A01814
$$ 380594 -85072 -121979 -174711 -108705 128904 240854 -135146 159286 -186125 101814
12273C57777Q0049D0698O7941M1884J70621A36691b78884D0721J48720O778B2791
$$ 357777 437826 40698 108639 150523 321144 136691 -278884 40721 189441 196219 22791
12261a218j34183e7684i978k03224I0797a4129j44881k6940B87080L5002d219
$$ -1218 -135401 -57684 -9978 -213202 90797 -14129 -159010 -185950 287080 322082 -4219
12249c0389A60940B4477a36052B24988J63515b13668B06723A9742b23538A23438
$$ -30389 160940 24477 -136052 224988 388503 -213668 206723 19742 -223538 123438
12238h4125B96633B7376L19485r8726j2510K2078D5135M0141J31176C4959K19413
$$ -84125 296633 27376 346861 248135 235625 257703 45135 85276 216452 34959 254372
12227B54372A5793K92066j39589A8750K41532m0830G8363R9284M413J31901H2609
$$ 254372 15793 307859 168270 18750 260282 219452 78363 177647 182060 313961 82609
12215A37817J56009j41943L10224B7127e2661p8610E5862d5642D08775r4358E0005
$$ 137817 293826 151883 462107 27127 -52661 -131271 55862 -45642 408775 314417 50005
12203F4757L78685B01434a98629B9369L04697j1655e1719A79479p5956g8514A51303
$$ 64757 443442 201434 -198629 29369 334066 322411 -51719 179479 103523 -78514 151303
12191C92948A84746k8697N2105E3442d5949C04370j30642E1840K8859J24125l975
$$ 392948 184746 156049 208154 53442 -45949 304370 173728 51840 80699 204824 200849
12180B00849d898G771J96682c3751r8689D1512J12963j0219J09882A08400j2655
$$ 200849 -4898 7771 204453 -33751 -132440 41512 154475 144256 254138 108400 95745
12169I5745J72712J5283l9885K8385N5400A30599o4150N8464J38341N6746g1384
$$ 95745 268457 283740 243855 272240 327640 130599 66449 124913 263254 320000 -71384
12157E81907a70539C15119d8344A54070L3860A8473L04395j22082E250K02918
$$ 581907 -170539 315119 -48344 154070 187930 18473 322868 200786 5250 208168
12147B08168a11026A75273K43588i6418B20429D3570a12051B16552J70519H9258
$$ 208168 -111026 175273 418861 -96418 220429 43570 -112051 216552 387071 89258
12136a23799D75380j19602E2129g1658C00920a49597A8788J26579b67035A19223
$$ -123799 475380 355778 52129 -71658 300920 -149597 18788 145367 -267035 119223
12125C26716f6963B52702G836J64740a34503B4931c3015A36805K965a07151B36714
$$ 326716 -66963 252702 7836 172576 -134503 24931 -33015 136805 139770 -107151 236714
12113a98869B58787j05623D4160h1090j53477J080j00570i2764D8631k0241b1271
$$ -198869 258787 153164 44160 -81090 -234567 -233487 -334057 -92764 48631 28390 -21271
12101f7863N659C8583i7039A30073a94489F427J9340N0929i2669A02979D3551
$$ -67863 -62204 38583 -97039 130073 -194489 6427 25767 76696 -92669 102979 43551
12089b3234j9687B147b34303B1469N1913h4157A76133h5129A16213p148i2573
$$ -23234 -42921 2147 -234303 21469 73382 -84157 176133 -85129 116213 109065 -92573
12077B14242J13833J005961J1599o10048D5471A0827K55753K61322C309J66194
$$ 214242 328075 1334036 1345635 735587 45471 10827 266580 527902 3309 169503
12067A69503g5493B26221H1666g2742a3859n752l02361a5296l50569a07209P181
$$ 169503 -75493 226221 81666 -72742 -13859 -19611 -321972 -15296 -365865 -107209 -100028
12056a00028B46005F9249J76986c5099I838J60537D4400d2637E532M7113K74237
$$ -100028 246005 69249 246235 -35099 9838 170375 44400 -42637 5532 52645 326882
12045C26882j18802e8166j74867B37897D3684N7107h4882B64731a19027l03887
$$ 326882 208080 -58166 -233033 237897 43684 100791 -84882 264731 -119027 -422914
12035d22914i1255D6604a11204L1006j5700j93537J34469f6010l7179n132A36869
$$ -422914 -91255 46604 -111204 -80198 -95898 -289435 -154966 -66010 -103189 -108321 136869
12023A0520J27935b58829B994O2512e6099j03473L8281b504G4207N6334l2841
$$ 10520 138455 -258829 2994 65506 -56099 -159572 -121291 -2504 74207 130541 97700
12012I7700a22911A87436A2099c21429A54516d0828m5230k36845g5139K1977F9058
$$ 97700 -122911 187436 12099 -321429 154516 -40828 -86058 -322903 -75139 -53162 69058
12000B29088a13275M1712A53716L8205O7377j09854b0547l17648a04617j5563
$$ 229088 -113275 -71563 153716 191921 259298 149444 -20547 -338195 -104617 -120180
11990a20180D81057A55740J07159c8333B63153j05037Q519i4387A47576d3316
$$ -120180 481057 155740 262899 -38333 263153 158116 166635 -94387 147576 -43316
11979B39741a48991A43661n5026b39200K1107B20243C4702a10189D2947K476J03383
$$ 239741 -148991 143661 88635 -239200 -218093 220243 34702 -110189 42947 45423 148806
11968A48806a20077n7416d1455j61812B8895L53924E0421b68095a31277B43056
$$ 148806 -120077 -177493 -41455 -203267 28895 382819 50421 -268095 -131277 243056
11957B23431I923N3021B8569J7993P8318O522l2860j9039f6071A32989b817A03165
$$ 223431 9923 62944 28569 46562 124880 131402 98542 79503 -66071 132989 -2817 103165
11944b455l07497O680b3151I3145a2522A22295a83626A11341K6197K53151a42768
$$ -2455 -309952 -303272 -23151 93145 -12522 122295 -183626 111341 137538 390689 -142768
11932A58149G6152M02691d5208n6495a4275A58243k2231c08457B45367c0129G0411
$$ 158149 76152 478843 -45208 -101703 -14275 158243 136012 -308457 245367 -30129 70411
11920a2265A0940K5204J13128a13591a0335k1401B00411H4458c65453H7493a32351
$$ -12265 10940 36144 149272 -113591 -10335 -31736 200411 84458 -365453 87493 -132351
11908C8758b49187H4612b23465E557h8625A50238a43545b8326B56948a32462r5085
$$ 38758 -249187 84612 -223465 5557 -88625 150238 -143545 -28326 256948 -132462 -227547
11897b27547b147H567a0190l8628G6465M1080d1235k56091a29057a3004A11155
$$ -227547 -2147 8567 -10190 -48818 76465 117545 -41235 -297326 -129057 -13004 111155
11885e8092A3895J90899g1457r3869C2724e2198l4505c1452A11536N2193F9682
$$ -58092 13895 204794 -71457 -165326 32724 -52198 -86703 -31452 111536 163729 69682
11873b3973C62594B1504c65008F7796c1686A7241d3935B50916g7356k4551k6057
$$ -23973 362594 21504 -365008 67796 -31686 17241 -43935 250916 -77356 -101907 -127964
11862a27964c5659L397f981A47154j8805a33264B80436c83021P2977g7958E808
$$ -127964 -35659 -32262 -6981 147154 128349 -133264 280436 -383021 -310044 -77958 5808
11850b36105B23369D2432b79557A95168F9427a31016k17115F3250J5906J09205
$$ -236105 223369 42432 -279557 195168 69427 -131016 -348131 63250 79156 188361
11840A88361C9198L5288a62474e0001k47203q6693h9087m262A5276a89227R189
$$ 188361 39198 74486 -162474 -50001 -297204 -383897 -89087 -93349 15276 -189227 -180038
11829a80038A15199M1017a51363a9411j6607A66202M5363e6461B6153a07197B0857
$$ -180038 115199 156216 -151363 -19411 -36018 166202 211565 -56461 26153 -107197 20857
11817A58092B4541L9941B6891c89866A5107N6298P9882b16277a4732j14257k46179
$$ 158092 24541 64482 26891 -389866 15107 71405 151287 -216277 -14732 -128989 -375168
11806c75168a54505A06975a35298j85840g1225j9699m867k7232M3090c512j04852
$$ -375168 -154505 106975 -135298 -321138 -71225 -90924 -95791 -123023 -79933 -3512 -108364
11795a08364B32386a27824k9105a8305l9777D00742H9118a23200A67580b32744
$$ -108364 232386 -127824 -156929 -18305 -58082 400742 89118 -123200 167580 -232744
11784C18694E4380h0615A16902f0251o7434A32649F312L49060q1574A4123L0930
$$ 318694 54380 -80615 116902 -60251 -127685 132649 6312 355372 273798 14123 45053
11773D5053Q0020b17192D7224c7787j14873p6036J02409A43044g1008c3652A21932
$$ 45053 125073 -217192 47224 -37787 -152660 -228696 -126287 143044 -71008 -33652 121932
11761E8768k5470Q4483l2525O9432b1443q9010C09265j45383L1918d9076J8847
$$ 58768 33298 117781 85256 154688 -21443 -110453 309265 163882 195800 -49076 -30229
11750c0229o3486H2620a11481k7763B27577h289r6401A65157d3791j10977j08828
$$ -30229 -93715 82620 -111481 -139244 227577 -8289 -104690 165157 -43791 -154768 -263596
11739b63596A43865f9868A81061K554j6206a36411A20295I153L12154f4826m299
$$ -263596 143865 -69868 181061 183615 167409 -136411 120295 9153 321307 -64826 -69125
11728f9125j15229P2384E3535Q3937D0159K1504b30248E3750J86751r7524L1924
$$ -69125 -184354 -111970 53535 137472 40159 61663 -230248 53750 240501 142977 174901
11717A74901a3944B93356G0784b34487A65996a29727J9492a2170B73981e5110
$$ 174901 -13944 293356 70784 -234487 165996 -129727 -110235 -12170 273981 -55110
11706A51950F8703L1897b2002k49529B0916R1691c24898B25715a18042D0242J18429
$$ 151950 68703 100600 -22002 -271531 20916 112607 -324898 225715 -118042 40242 158671
11695A58671J04354g662j8189j10141j25626A63567B7088J33091K19035A32267
$$ 158671 263025 -7662 -25851 -135992 -261618 163567 27088 160179 379214 132267
11684B12912J6084B3037J09827k3760J87530F034b881I9080M5975K18924I2103
$$ 212912 228996 23037 132864 109104 296634 6034 -2881 99080 145055 363979 92103
11672B16443a94333O5020F3425i5036J3760E7577Q675L9363d9233j10121E21814
$$ 216443 -194333 -129313 63425 -95036 -81276 57577 66252 105615 -49233 -159354 521814
11660b03887i6003c9850A47070j6068O2732H6165L1239b63403B66897r0946D5992
$$ -203887 -96003 -39850 147070 131002 193734 86165 117404 -263403 266897 175951 45992
11648a28028A0948h4238j6406j33340a557A37717J04408J4549a02788j00151g6962
$$ -128028 10948 -84238 -100644 -233984 -1557 137717 242125 256674 -102788 -202939 -76962
11636A9733f5659k2078B98379Q8050c39792a32703p3977A78098J78060A33495
$$ 19733 -65659 -87737 298379 386429 -339792 -132703 -206680 178098 356158 133495
11625h4411j47860g5571K617D09444E3360i2926E2725h1201B11243a82482I472
$$ -84411 -232271 -75571 -72954 409444 53360 -92926 52725 -81201 211243 -182482 9472
11613b30842A70477a82415M6995A03426M04913F7717N6663K12903G0335c00009
$$ -230842 170477 -182415 -135420 103426 508339 67717 124380 337283 70335 -300009
11602C27864a87767A70609J05471a03927C1557K66597j40359K15487a71272H6689
$$ 327864 -187767 170609 276080 -103927 31557 298154 157795 373282 -171272 86689
11591C9045L72883n0007H7834J15407d8174B43630K51b88643A06863m3171J78752
$$ 39045 411928 361921 87834 203241 -48174 243630 243881 -288643 106863 63692 242444
11580B42444h8904c8400A68103K44310b18664D12267i3127G044L78273a85014
$$ 242444 -88904 -38400 168103 412413 -218664 412267 -93127 7044 385317 -185014
11569b9540I4111J01081J22194a7479B04077a98072d2998E4595Q6467E6860J18347
$$ -29540 94111 195192 317386 -17479 204077 -198072 -42998 54595 141062 56860 175207
11558A75207H7282J15980E3389a34080D8981a29186C53313f8660D073b19433O8907
$$ 175207 87282 203262 53389 -134080 48981 -129186 353313 -68660 4073 -219433 -150526
11547a50526F2887P0108J11685b56704A54537a9931j7557A96866a17306I3386
$$ -150526 62887 132995 244680 -256704 154537 -19931 -37488 196866 -117306 93386
11536B50401g3818I7518R4528k7350G4607J14464L3879o8379D6771a19703d7785
$$ 250401 -73818 97518 192046 164696 74607 189071 222950 154571 46771 -119703 -47785
11524F6658O4320l9492J24257b72023f2269B44212H0510a34363A99090p5752a57442
$$ 66658 130978 91486 215743 -272023 -62269 244212 80510 -134363 199090 123338 -157442
11512A23468J39076a79209A81948G4063M0477J23219A6878J38224A0759L98121
$$ 123468 262544 -179209 181948 74063 114540 237759 16878 155102 10759 408880
11502D08880F0553L70251A31777J11407J89610D3339L85864A31473K4766F5461
$$ 408880 60553 430804 131777 243184 432794 43339 429203 131473 156239 65461
11491c4073A693a9384B28349C9372J46244L6828j6640k4886J07278L1455A09231
$$ -34073 1693 -19384 228349 39372 185616 222444 205804 180918 288196 319651 109231
11479a14286K598A08988H698b13804g2n1371A42256M9330i1879B79368j06796
$$ -114286 -111688 108988 8698 -213804 -72 -51443 142256 191586 -91879 279368 172572
11468A72572q3019o123P391b0604A67158J63677D9436j156J64371A3523J59206
$$ 172572 89553 83430 90821 -20604 167158 330835 49436 48280 212651 13523 172729
11457A72729E2750L2860c7971B7686K34743J11772j41395A13859l3679K9604c00035
$$ 172729 52750 85610 -37971 27686 262429 374201 232806 113859 80180 109784 -300035
11445B03368o4345a96095B20221n6099K31209A3890J8360c3766d671k25194d0233
$$ 203368 139023 -196095 220221 164122 395331 13890 32250 -33766 -4671 -229865 -40233
11433a56070A5263J56612J3648n7225G350b26325P2798a174B37994q9290N2423
$$ -156070 15263 171875 185523 128298 7350 -226325 -153527 -1174 237994 148704 201127
11422B01127a01185B63493a91349f5873D849L76173A54724f8173j32538A06175
$$ 201127 -101185 263493 -191349 -65873 4849 381022 154724 -68173 -200711 106175
11411E1754h2487A81358J31218q5099R4446j56909b16381J06403D3143a03702
$$ 51754 -82487 181358 312576 227477 321923 165014 -216381 -109978 43143 -103702
11400a59976E632d5335B89099h6338k0704A4904L3632c2731q806o7819A42838
$$ -159976 5632 -45335 289099 -86338 -107042 14904 48536 -32731 -41537 -109356 142838
11388G9302a44010j14511F448a59986P5748j60696A42048i5799A23530K22498
$$ 79302 -144010 -258521 6448 -159986 -84238 -244934 142048 -95799 123530 346028
11378C46028a0745A70645b68031c63A11878J00154K9527a22655B95915b10806
$$ 346028 -10745 170645 -268031 -363 111878 212032 241559 -122655 295915 -210806
11367f3538m6644k255C26847C7538J22741b69323C84511j80868f7928A88461G9121
$$ -63538 -110182 -112437 326847 37538 160279 -269323 384511 203643 -67928 188461 79121
11355a74590M6307J2129A18076E8938d654D7956j411a30476c698q2337A78446
$$ -174590 -128283 -116154 118076 58938 -4654 47956 46545 -130476 -3698 -86035 178446
11343C00157E9749a51734j9189N2070A07567k0818A0888J18365E1833d9894i026
$$ 300157 59749 -151734 -170923 -118853 107567 86749 10888 129253 51833 -49894 -9026
11331a69283C4802J16896b77634G724Q2257C7182K52514h1031a9870c371l883
$$ -169283 34802 151698 -277634 7724 89981 37182 289696 -81031 -19870 -3371 -7254
11320g254j27216G4020P2160c02923A05006p928J4417g4934D0678a9169k10908
$$ -7254 -134470 74020 146180 -302923 105006 97078 111495 -74934 40678 -19169 -230077
11309b30077h7300k68490G3702a66605C11688c2695A45541L7365b04940B01615
$$ -230077 -87300 -355790 73702 -166605 311688 -32695 145541 182906 -204940 201615
11298A78453a32495N1500A7455J578b0848A82139a36132n4754j471B00445l6054
$$ 178453 -132495 -80995 17455 19033 -20848 182139 -136132 -190886 -192357 200445 164391
11287A64391g4060E05743c4196o999B43679I1636O2296B533R0420a15353A4614
$$ 164391 -74060 505743 -34196 -41195 243679 91636 153932 2533 92953 -115353 14614
11275e8321A18762d294C65668i7728F8042K344f4017B2196b36994D4136b41525
$$ -58321 118762 -4294 365668 -97728 68042 70386 -64017 22196 -236994 44136 -241525
11263c0330h202m3250C02042a90047E4278d9470A18300j6740m9074G452r12a2961
$$ -30330 -8202 -51452 302042 -190047 54278 -49470 118300 101560 52486 7452 6540 -12961
11250f2736A18883b42945A04766b7464n6026a0996k17005B73977g8977H4510a64090
$$ -62736 118883 -242945 104766 -27464 -83490 -10996 -228001 273977 -78977 84510 -164090
11238B88233f3694J90j94619L9788b9524j5822A5366a00663c4262E7229L11729
$$ 288233 -63694 -63504 -258123 -218335 -29524 -45346 15366 -100663 -34262 57229 368958
11227C68958d5035n7207j27815a06294j92861b7424l8257C3785i5372M1191p7189
$$ 368958 -45035 -102242 -230057 -106294 -299155 -27424 -65681 33785 -95372 -54181 -131370
11216a31370B65753f4305f226B49906b25667Q4837n8607a7508A44127c17701b8954
$$ -131370 265753 -64305 -6226 249906 -225667 -140830 -199437 -17508 144127 -317701 -28954
11204A3136b29873A52235a42925N3106G0994c34603B68750a23251A35804c9711
$$ 13136 -229873 152235 -142925 -89819 70994 -334603 268750 -123251 135804 -39711
11193a19055N1701A4520c00530A15856g1014k45674a00379K8258j07399j69620
$$ -119055 -67354 14520 -300530 115856 -71014 -316688 -100379 -72121 -179520 -349140
11183c49140r0926a25668j83524o2222B19422a3918D41524b03508A99919C257
$$ -349140 -440066 -125668 -309192 -371414 219422 -13918 441524 -203508 199919 3257
11172A86391n9945O8424C1918J42099D4739d2452A19277a00954q4800n2594N3201
$$ 186391 126446 194870 31918 174017 44739 -42452 119277 -100954 -185754 -238348 -185147
11161a85147J0768e5146A92555r5010O6290R1814m9821H6331K898J1778m615j406
$$ -185147 -174379 -55146 192555 97545 163835 255649 205828 86331 89229 101007 96392 94986
11149I4986g0518k9323C7835b50080A54132i4893k25583k4265f1373A69844c04712
$$ 94986 -70518 -99841 37835 -250080 154132 -94893 -320476 -344741 -61373 169844 -304712
11137A8628K65010D8608J10580J00953G3404P2236K3290H62J71623D9663K6871
$$ 18628 283638 48608 159188 260141 73404 145640 168930 862 172485 49663 76534
11126G6534R2031K32808H4928a40381c5009F3728L02969j65539J13346a06534
$$ 76534 168565 401373 84928 -140381 -35009 63728 366697 201158 314504 -106534
11115d0515B30148j12171f9079B39068E2525L40243A28374o2765b27541D35878
$$ -40515 230148 117977 -69079 239068 52525 392768 128374 65609 -227541 435878
11104B23780a66323B36916j2716J15782H6474J97875D5826a00785A18508N1243
$$ 223780 -166323 236916 224200 339982 86474 284349 45826 -100785 118508 169751
11094A69751N6730j06848O5775J85649p2207F8962L57567j29702J7082N0991j14994
$$ 169751 226481 119633 185408 371057 298850 68962 426529 296827 313909 364900 249906
11083B49906P8840f2868a8812A25469a3214I9712R1089j4037P5154G9235M202
$$ 249906 328746 -62868 -18812 125469 -13214 99712 190801 176764 251918 79235 83437
11072H3437L84413A75858L29046L5390J01046j85212A25572O78453A42428J71406
$$ 83437 467850 175858 504904 540294 641340 456128 125572 804025 142428 313834
11062C13834m8375J10390K094R9113J51525J26517l09988K58535P0231k84901
$$ 313834 265459 375849 377943 477056 628581 755098 445110 703645 773876 488975
11052D88975J03667K14223L72j27442k78698M51093j18971o8798J61352j35181
$$ 488975 592642 806865 807237 679795 401097 852190 733219 664421 825773 690592
11042F90592J34808l26010K27950J60848k64207o5706L69509m10169K37075k8013
$$ 690592 825400 499390 727340 888188 623981 558275 927784 517615 754690 726677
11032G26677k37508j27939K10738j1012R9252J62758r0616J17028l65400J49072
$$ 726677 489169 361230 571968 560956 660208 822966 732350 849378 483978 633050
11022F33050J57496j14829J06590j84219o879M63539C39181K28859J13300k22386
$$ 633050 790546 675717 782307 598088 591209 1054748 339181 568040 681340 458954
11012D58954K79718C09444K45580N3408m3283J25911k87458M29667k69695J3320
$$ 458954 738672 309444 555024 608432 565149 691060 403602 833269 563574 576894
11002E76894J70661J06804k8788J1072j13606j7595p1223J16579K86674D54513
$$ 576894 747555 854359 825571 836643 723037 705442 634219 750798 1037472 454513
10991F81776Q007j16466J35535j05554M38477k20861o1463J99954j86453L97387
$$ 681776 689783 573317 708852 603298 1041775 820914 759451 959405 772952 1170339
10981A170339M8503k13867J23515k5334L97051N96648k16376N25084q9115K38999
$$ 1170339 1218842 1004975 1128490 1103156 1500207 2096855 1880479 2405563 2316448 2555447
10971B555447J79874k15855q212K52226n03031j1814n09191o8365K1379l60521
$$ 2555447 2735321 2519466 2511254 2763480 2260449 2248635 1739444 1671079 1692458 1331937
10961A331937M45238O4547j89267L53954k49997l64215L17455j20306J0637k10716
$$ 1331937 1777175 1841722 1652455 2006409 1756412 1392197 1709652 1589346 1599983 1389267
10951A389267j36785M4714E87511j7381k44003L63244C14557j11476L3992a88032
$$ 1389267 1252482 1297196 587511 570130 326127 689371 314557 203081 237073 -188032
10940H9696K03532F0965J96915a26281B26343L7925q1762K6660B4065J29539N1022
$$ 89696 293228 60965 257880 -126281 226343 264268 182506 209166 24065 153604 204626
10929B04626K62332I6878J00731b6682A02965A4886O4098g8556L4481H0026C6270
$$ 204626 466958 96878 197609 -26682 102965 14886 78984 -78556 -44075 80026 36270
10917A25270A7391J7513b75774A26198b18230c1662G0510k7275i8443A43654a22845
$$ 125270 17391 34904 -275774 126198 -218230 -31662 70510 43235 -98443 143654 -122845
10905B3566a13065A52738J12466c2563j94846C8793c3650p2678A14351b70606
$$ 23566 -113065 152738 265204 -32563 -227409 38793 -33650 -106328 114351 -270606
10894h3896A36251d83059a64124d3063A40510J6367a40624f8713A2659a67121
$$ -83896 136251 -483059 -164124 -43063 140510 156877 -140624 -68713 12659 -167121
10883A65667G9951K16032h4704N775B58361E6006J05551D8709q737N6912B1262
$$ 165667 79951 295983 -84704 -78929 258361 56006 161557 48709 39972 96884 21262
10871a72378r9904B98709a30573H0280a42982Q037B61545a42120A1393e4986A92829
$$ -172378 -272282 298709 -130573 80280 -142982 -134945 261545 -142120 11393 -54986 192829
10859E8175A8277J97699a10414f342B58361P6124c37219e7261k00886A17210c52262
$$ 58175 18277 215976 -110414 -6342 258361 334485 -337219 -57261 -258147 117210 -352262
10847A56801b00291j44397A76692h4634j07925B600K54321C9846b27241o9551
$$ 156801 -200291 -344688 176692 -84634 -192559 2600 256921 39846 -227241 -296792
10837b96792G6575B6995a64988f4309k35784F71b84558A03194a00166r2186A47039
$$ -296792 76575 26995 -164988 -64309 -300093 671 -284558 103194 -100166 -192352 147039
10825b40779j4651o0063a13510l7438j47194h2173F6695j9779b29751Q0506F183
$$ -240779 -255430 -315493 -113510 -150948 -298142 -82173 66695 46916 -229751 -149245 6183
10813g0354j06880f6650A53103J61368d3592A93241c08587a15727B68733G6569
$$ -70354 -177234 -66650 153103 314471 -43592 193241 -308587 -115727 268733 76569
10802c1424I2317i2174G9299b673B41784K4525a05889j18872F9048a19042A65609
$$ -31424 92317 -92174 79299 -2673 241784 266309 -105889 -224761 69048 -119042 165609
10790a23258e3413o772j39659b4833k41257A21749a39237K1981j82902E798J66846
$$ -123258 -53413 -60185 -199844 -24833 -266090 121749 -139237 -117256 -300158 5798 172644
10779A72644g1644F205L8986J71642A779N7212a25828C00609g6882H8972c31829
$$ 172644 -71644 6205 45191 216833 1779 58991 -125828 300609 -76882 88972 -331829
10767A65861a92321o7665c3157n1262A26928A3348b55549M5907l98288a46399
$$ 165861 -192321 -259986 -33157 -84419 126928 13348 -255549 -209642 -607930 -146399
10756A5074c3987o8067c0743q5919a7809j9629F1626b54444a0814K377k87784
$$ 15074 -33987 -102054 -30743 -116662 -17809 -37438 61626 -254444 -10814 -8437 -296221
10745b96221A04610R1979b48581j32403J22053I1774a63451f2504J2273n4684
$$ -296221 104610 196589 -248581 -380984 -258931 91774 -163451 -62504 -50231 -104915
10735a04915l7889n1737o2277A76697M5777a49804I9749N4019K34160I6953a04990
$$ -104915 -142804 -194541 -256818 176697 222474 -149804 99749 153768 387928 96953 -104990
10723A60609C3329E220L9138c9009B53964b99542J34852A69146m030a00895j27641
$$ 160609 33329 5220 44358 -39009 253964 -299542 -164690 169146 165116 -100895 -228536
10712b28536j27481G7650a99618N7515K0059m8637A84185G0513R361B9133a5087
$$ -228536 -356017 77650 -199618 -142103 -122044 -170681 184185 70513 79874 29133 -15087
10700c43669D39060a57409B94228a88463j44257F8025i4949n9058j30669c6551
$$ -343669 439060 -157409 294228 -188463 -332720 68025 -94949 -154007 -284676 -36551
10689I5990g7948r2749k67159I4701j6416E179J98176a43339j10146A67056r287
$$ 95990 -77948 -170697 -437856 94701 78285 5179 203355 -143339 -253485 167056 157769
10678A57769e0806k17797A24350j1236J02786b42749e9033o0357b2463A27607
$$ 157769 -50806 -268603 124350 113114 215900 -242749 -59033 -119390 -22463 127607
10667b73768a08809A28153a37185A11306B9976a89913k69673E5731J37860d4278
$$ -273768 -108809 128153 -137185 111306 29976 -189913 -459586 55731 193591 -44278
10656E1567J77337M5438a17045r1953H616c4657n4229j65715d3996A11977D4278
$$ 51567 228904 274342 -117045 -208998 8616 -34657 -88886 -254601 -43996 111977 44278
10644a32878F9056a66777A09402a28802o1734O6794d4336N039l3897o9458E2429
$$ -132878 69056 -166777 109402 -128802 -190536 -123742 -44336 -39297 -73194 -142652 52429
10632i2468A82146c71048F7856c66812B31403a52793A46433a49946D2637c36045
$$ -92468 182146 -371048 67856 -366812 231403 -152793 146433 -149946 42637 -336045
10621A27915n8885J7940B7769a5219C5982J79996g5874a4091A71896m5844l3703
$$ 127915 69030 86970 27769 -15219 35982 215978 -75874 -14091 171896 126052 92349
10610I2349a11231M1207k1892E4498K65081a32886A8728g3779k28638C01813j02555
$$ 92349 -111231 -70024 -91916 54498 319579 -132886 18728 -73779 -302417 301813 199258
10599A99258E2310M7303k9707K38408A01526K8421b68646E6132b14334d0796j40010
$$ 199258 52310 99613 69906 308314 101526 129947 -268646 56132 -214334 -40796 -180806
10588a80806f726q8449b9833j0824j53850g8736a9700B26177B0511b03834C847
$$ -180806 -6726 -95175 -29833 -40657 -194507 -78736 -19700 226177 20511 -203834 3847
10576H2299b36554e7006l6989E507b91966g1442H023b75334H3760A1836J01045
$$ 82299 -236554 -57006 -93995 5507 -291966 -71442 8023 -275334 83760 11836 112881
10565A12881d2316j96576d0084n6983o149q3684Q038F2206L6066J5178b03504
$$ 112881 -42316 -238892 -40084 -97067 -103216 -186900 -178862 62206 98272 113450 -203504
10553F6465a44962q141A48627h6083g135m6878D6477j6456Q0789a74648O4804
$$ 66465 -144962 -153103 148627 -86083 -7135 -54013 46477 30021 110810 -174648 -109844
10542a09844L1596A37445a18279G9871b00396A0516J13055a67985j98513J00681
$$ -109844 -78248 137445 -118279 79871 -200396 10516 123571 -167985 -366498 -265817
10532b65817a21847c7415m4619j28819J9176A15342i8054k4029I5831b4252B82996
$$ -265817 -121847 -37415 -82034 -210853 -191677 115342 -98054 -122083 95831 -24252 282996
10520F6316L8845B561N417b71341C0219K28099b16498i1437E6573b18479h8021
$$ 66316 105161 2561 7978 -271341 30219 258318 -216498 -91437 56573 -218479 -88021
10508i7065r0335K3005A1327a69916J9651E7899L3570D3579e3830k8445j81109
$$ -97065 -187400 -164395 11327 -169916 -150265 57899 91469 43579 -53830 -82275 -263384
10497b63384H3101a63117e5607F1110b12006M0448Q073H3328b47874A0113P5610
$$ -263384 83101 -163117 -55607 61110 -212006 -171558 -163485 83328 -247874 10113 85723
10486H5723b1196A4443a44200D10726A42410J48187O2306K05165k19927A52444
$$ 85723 -21196 14443 -144200 410726 142410 290597 352903 558068 338141 152444
10475f0424B44685H1723M242a15821A32385a35943E2215a5726B41791H2730d76677
$$ -60424 244685 81723 85965 -115821 132385 -135943 52215 -15726 241791 82730 -476677
10463b48231A57359o4180c32066b8390A62793L5027f3875A79825a18656l1064
$$ -248231 157359 93179 -332066 -28390 162793 197820 -63875 179825 -118656 -149720
10453a49720b6091A16751B7702a37968A05842e0040A2995K18400B0041c6705C690
$$ -149720 -26091 116751 27702 -137968 105842 -50040 12995 231395 20041 -36705 3690
10441E1675a68015G4976c0157e294j09671d1555A75563a16444F795a01214I9866
$$ 51675 -168015 74976 -30157 -5294 -114965 -41555 175563 -116444 6795 -101214 99866
10429A06378A515J71677F8074g4166l6975c1078A11536h8050q1077C04293B6535
$$ 106378 1515 173192 68074 -74166 -111141 -31078 111536 -88050 -169127 304293 26535
10417G2537c947o6490o939H5529N3486a10280B2302a66326A3894a77260P7592
$$ 72537 -3947 -70437 -77376 85529 139015 -110280 22302 -166326 13894 -177260 -99668
10406i9668M8536q6192j2688B02674j440J13123B85h4395j57713a05025A76619
$$ -99668 -51132 -137324 -150012 202674 201234 314357 285 -84395 -242108 -105025 176619
10394C06233r5221j8580o4058n2472J93260a68495C2750L49899l8248A04023d18545
$$ 306233 211012 192432 128374 75902 269162 -168495 32750 382649 344401 104023 -418545
10382A62582h5883D2020r012J77001h8077A0563K36840P077A17690M52999a87018
$$ 162582 -85883 42020 33008 210009 -88077 10563 247403 254480 117690 570689 -187018
10370B39290Q7309I6448K7256L90767K1979J4070j60361j08150K98795A37181
$$ 239290 326599 96448 123704 514471 536450 550520 390159 282009 580804 137181
10359B08984B1971L04802l9256k6573g6916B57993p0281J04543J92608r3799J83146
$$ 208984 21971 326773 287517 260944 -76916 257993 187712 292255 484863 391064 574210
10348E74210J29239B56061K63830k18720R6901J35442k02535P4351O9392e3042
$$ 574210 703449 256061 519891 301171 398072 533514 330979 405330 474722 -53042
10337B40372H3009B0754K80791a46633J9644G0996J29554q5393K61826E7549f9125
$$ 240372 83009 20754 301545 -146633 -126989 70996 200550 115157 376983 57549 -69125
10325A18285e8802B13264n559h2498B12328F9037f8935B60283A04934J29886b13720
$$ 118285 -58802 213264 207705 -82498 212328 69037 -68935 260283 104934 234820 -213720
10313C2090J50886d9810B01619d1999A23116A0866d3642G4197a43106A45912a4075
$$ 32090 182976 -49810 201619 -41999 123116 10866 -43642 74197 -143106 145912 -14075
10301I3861J0807b0945q8909j47353C84660c55724A88036a68002n307E6040A8453
$$ 93861 104668 -20945 -109854 -257207 384660 -355724 188036 -168002 -173309 56040 18453
10289g5073k52065i9316l9105c136j66569B74007a27109G9465r345d0779N860
$$ -75073 -327138 -99316 -138421 -3136 -169705 274007 -127109 79465 70120 -40779 -34919
10278c4919D4011D414K6390a18108K5045A55184e219F2463j7591J39409a18532
$$ -34919 44011 4414 30804 -118108 -93063 155184 -5219 62463 44872 184281 -118532
10266b416m85832K11009B0180J47533b15436A8724J75673J61491K7600j77376
$$ -2416 -488248 -277239 20180 167713 -215436 18724 194397 355888 383488 206112
10256B06112J37741b43928A24539K30590H1791B5846G237J79582Q1307i4007D0996
$$ 206112 343853 -243928 124539 355129 81791 25846 7237 186819 268126 -94007 40996
10244b63845A11515f0479a3473C06287b8723j48153F6742a37204M507k77067A49479
$$ -263845 111515 -60479 -13473 306287 -28723 -176876 66742 -137204 -132697 -409764 149479
10232e8608B29603m8298a81281B13217D6671J52160b91210h1926A78518i970A9817
$$ -58608 229603 181305 -181281 213217 46671 198831 -291210 -81926 178518 -9970 19817
10220b96102K5237l0652e2239k68097M2369a10399A3760e4560A47148b3193m04251
$$ -296102 -270865 -301517 -52239 -320336 -277967 -110399 13760 -54560 147148 -23193 -427444
10209d27444a55600C38522a62381b0808m3739j57459Q5723l787O2767C32865b86212
$$ -427444 -155600 338522 -162381 -20808 -64547 -222006 -136283 -140070 -77303 332865 -286212
10197d22774I1765d33621I7677a53326c9195D6189d3086R564j1346A14864J59248
$$ -422774 91765 -433621 97677 -153326 -39195 46189 -43086 -33522 -44868 114864 274112
10186B74112b25755C2416M4004a03288C3095q965b62279A42519M980a67567A9937
$$ 274112 -225755 32416 76420 -103288 33095 24130 -262279 142519 147499 -167567 19937
10174a31299A662Q66a27509I2745M3776F4061b32886A02077c48702h2703l3110
$$ -131299 1662 2528 -127509 92745 136521 64061 -232886 102077 -348702 -82703 -115813
10163a15813A55123c26530g2871p4294b7988k3529j41917j7382A33492b83556
$$ -115813 155123 -326530 -72871 -147165 -27988 -51517 -193434 -210816 133492 -283556
10152A11205b53534L3225d8792j01855p0245A66591c07234A13165a62574j13989
$$ 111205 -253534 -220309 -48792 -150647 -220892 166591 -307234 113165 -162574 -276563
10142b76563G7831b03142g2840B83493A35178a97256I6102J35765f2075A517a94870
$$ -276563 77831 -203142 -72840 283493 135178 -197256 96102 231867 -62075 1517 -194870
10130d1354C3863l226a24492L5813I0148a26458l3784H600h6115c1147j8833k43905
$$ -41354 33863 30637 -124492 -88679 90148 -126458 -160242 8600 -86115 -31147 -49980 -293885
10118b93885Q5365j04282B98895a04027b6096j14684J3199j06230f1039l27305
$$ -293885 -208520 -312802 298895 -104027 -26096 -140780 -127581 -233811 -61039 -388344
10108c88344B5035c09063a53447L3305A46684g4493o3073r1874a06083n2756A56558
$$ -388344 25035 -309063 -153447 -120142 146684 -74493 -137566 -229440 -106083 -158839 156558
10096a26822f3145j10662m5897B01687h5023n5654A70187q4888J5071J17339H7777
$$ -126822 -63145 -173807 -219704 201687 -85023 -140677 170187 85299 100370 217709 87777
10084B26515c76880A02398j0590C9182c91699a03488A06057k3460a57292n8874
$$ 226515 -376880 102398 91808 39182 -391699 -103488 106057 82597 -157292 -216166
10074b16166r7367B70208e406j23234M6510j15452A08715i265A02345e4285q4663
$$ -216166 -313533 270208 -5406 -128640 -82130 -197582 108715 -9265 102345 -54285 -138948
10063a38948q1217A03676a30086d2023j94646A25190j0726b19970m5014H179d6063
$$ -138948 -220165 103676 -130086 -42023 -236669 125190 114464 -219970 -264984 8179 -46063
10051c72936J55908R5145A09300d800k11573h3085j4901G281a39215j02463A3398
$$ -372936 -217028 -121883 109300 -4800 -216373 -83085 -97986 7281 -139215 -241678 13398
10039b1561j43506D2430c5985F8824b15010A38975n447J55504c846A9734h5486
$$ -21561 -165067 42430 -35985 68824 -215010 138975 133528 289032 -3846 19734 -85486
10027D674a72896A2562O4911c80531J23567g9430n1748e7497H578a59617E5119
$$ 4674 -172896 12562 77473 -380531 -256964 -79430 -131178 -57497 8578 -159617 55119
10015c06079n8687B5600g9496D7601a17245j0789G5798j8546J47685C557J38032
$$ -306079 -364766 25600 -79496 47601 -117245 -128034 75798 57252 204937 3557 141589
10004A41589a31278N7585k6208j84048a04717f098A73479A5195e7529B06401q1682
$$ 141589 -131278 -73693 -99901 -283949 -104717 -6098 173479 15195 -57529 206401 124719
9993A24719a81663h7075j9061k435J6191b5869j95995J04449j14870A41336b5153
$$ 124719 -181663 -87075 -106136 -108571 -92380 -25869 -221864 -117415 -232285 141336 -25153
9981D0064j8001b8993g745r5094A26611b91658i3985j58595M680g7608n076F1964
$$ 40064 22063 -28993 -7745 -102839 126611 -291658 -93985 -252580 -247900 -77608 -82684 61964
9968G0527j4210i3112P95o6886C18246j52195B7552a52847j33138h7420k21677
$$ 70527 56317 -93112 -92317 -159203 318246 166051 27552 -152847 -285985 -87420 -309097
9957c09097a05985C5503b58184j29853A68525K1440a81895g3980o4778B71329
$$ -309097 -105985 35503 -258184 -388037 168525 189965 -181895 -73980 -138758 271329
9946C4006M8299a93107D0119a99427n7385B06622c9250a3232o2152c1518j77160
$$ 34006 82305 -193107 40119 -199427 -256812 206622 -39250 -13232 -75384 -31518 -208678
9935b08678c5365n1159j07496B97938c6642A77820c93611a57081A3410a54032
$$ -208678 -35365 -86524 -194020 297938 -36642 177820 -393611 -157081 13410 -154032
9924a51689c2822j21925I0292c00286B33127c06730N1082a09691A38581b28421
$$ -151689 -32822 -154747 90292 -300286 233127 -306730 -255648 -109691 138581 -228421
9913b07142C7298a59603m1403B15757e4051o595K3435k37962A89525a1295A7432
$$ -207142 37298 -159603 -201006 215757 -54051 -60646 -37211 -275173 189525 -11295 17432
9901a51059O8446j99318a24104A17425b82712A78504c64464C04634I2555a81386
$$ -151059 -82613 -281931 -124104 117425 -282712 178504 -364464 304634 92555 -181386
9890a92505F8514a95355b3112A2835J32558a31122H9336j002J9031a23270c5960
$$ -192505 68514 -195355 -23112 12835 145393 -131122 89336 88334 107365 -123270 -35960
9878B58109b33210O0403m3578e6457H1363a97112l7388a0487j70264j4131Q74
$$ 258109 -233210 -172807 -216385 -56457 81363 -197112 -234500 -10487 -180751 -194882 -194008
9867a94008e6496q0554O824f0689F990N4844b59636A02716J27653e78171J84326
$$ -194008 -56496 -137050 -130226 -60689 6990 61834 -259636 102716 230369 -578171 -393845
9856c93845J96852G5394D839i890j29534e5729A81343h1679j12921B01316h5940
$$ -393845 -196993 75394 4839 -9890 -139424 -55729 181343 -81679 -194600 201316 -85940
9844a9405j94624A84348b71548d8783j19956p6317b4052j01117A10855k9830C7028
$$ -19405 -214029 184348 -271548 -48783 -168739 -245056 -24052 -125169 110855 81025 37028
9832D5064b86107C57754E4215c19930B8112g3342B0562h5702A3099b19993A34813
$$ 45064 -286107 357754 54215 -319930 28112 -73342 20562 -85702 13099 -219993 134813
9820e5178m5660k24040j7022H564i3133k6813h804k56067A30942k3116b42565
$$ -55178 -100838 -324878 -341900 8564 -93133 -119946 -8804 -264871 130942 107826 -242565
9808A93315M2076b02424F3665c69089A4918K14445f9665A28099l5998A2190c67992
$$ 193315 235391 -202424 63665 -369089 14918 229363 -69665 128099 92101 12190 -367992
9796e06850K36780O3865A07270K5477P4675j59b7415A49046Q6366a10456A35138
$$ -506850 -270070 -206205 107270 132747 207422 207263 -27415 149046 235412 -110456 135138
9784c38945M9049k7539H6202a34788k8393G8148e9088j24107r885K6131c6961
$$ -338945 -289896 -317435 86202 -134788 -163181 78148 -59088 -183195 -193080 -166949 -36961
9772c32193a60083A13587a19837A17252A5508K24091l4572c98767C8610J89136
$$ -332193 -160083 113587 -119837 117252 15508 239599 205027 -398767 38610 227746
9762B27746b04048h0433n912H6122l9292h2252G1914d16605G3746b9911j77058
$$ 227746 -204048 -80433 -86345 86122 46830 -82252 71914 -416605 73746 -29911 -206969
9751b06969B7926a61567d0611A80523e4556A92723D9195J09436A5885J82514E7994
$$ -206969 27926 -161567 -40611 180523 -54556 192723 49195 158631 15885 198399 57994
9739F0160c57484A26396J36546K00328E4267b68181O3290p0678J5088g7464j59000
$$ 60160 -357484 126396 262942 463270 54267 -268181 -204891 -275569 -260481 -77464 -236464
9728b36464A90893G5166J91738B6105a29909k0494j42171j15097a26096A13416
$$ -236464 190893 75166 266904 26105 -129909 -150403 -292574 -407671 -126096 113416
9717a94094F2730d6542j84218b3094j59555I3620h9112j0375d0738A90698q8814
$$ -194094 62730 -46542 -230760 -23094 -182649 93620 -89112 -99487 -40738 190698 101884
9706A01884a61624m3986A1587a78697c5888k7217A28602B4143i8597A26266b31017
$$ 101884 -161624 -205610 11587 -178697 -35888 -63105 128602 24143 -98597 126266 -231017
9694b41516k1936g90k10594C30504b5150p283A94925c37268b8629N361q1j6053
$$ -241516 -263452 -790 -211384 330504 -25150 -32433 194925 -337268 -28629 -23268 -23349 -39402
9682c9402j4021m2118C2115a50065B82302A20674m2534a28297A5268b59436E5215
$$ -39402 -53423 -95541 32115 -150065 282302 120674 78140 -128297 15268 -259436 55215
9670b92946L3115B8066J16732a8906k04147i3033b1172j62769Q1131k4619k21496
$$ -292946 -259831 28066 144798 -18906 -223053 -93033 -21172 -183941 -102810 -127429 -348925
9659c48925A42098d4937B73806a18361A49351b04653N2079F9139j7697c3384j44920
$$ -348925 142098 -44937 273806 -118361 149351 -204653 -152574 69139 51442 -33384 -178304
9648a78304B2344d26982a01153J0110p7056B753a88792J4613A40838c0778l443
$$ -178304 22344 -426982 -101153 -91043 -168099 2753 -188792 -174179 140838 -30778 -34221
9637c4221j56854o7637B92366a26240j76885J08728i3293H229O1681a96287F5084
$$ -34221 -191075 -258712 292366 -126240 -303125 -194397 -93293 8229 69910 -196287 65084
9625h9090B54192a34850p158C4456a47061A77803e19911J86316J52915o3202A1403
$$ -89090 254192 -134850 -142008 34456 -147061 177803 -519911 -333595 -180680 -243882 11403
9613f8572j98420i6304l2095M0127o7916b1120j02139B03325c10009B43034a87919
$$ -68572 -266992 -96304 -128399 -88272 -156188 -21120 -123259 203325 -310009 243034 -187919
9601B03311b81501B7908a50728A02606a39020q7137A41492C0737d34677a54827
$$ 203311 -281501 27908 -150728 102606 -139020 -226157 141492 30737 -434677 -154827
9590a73427C07553b04622b1631o3343K0044k30871A64076i5880l01733C3829b26203
$$ -173427 307553 -204622 -21631 -84974 -64930 -295801 164076 -95880 -397613 33829 -226203
9578b34422c7641B86024m8488j8358I6879a258l80177J36907O5546p1863b6824
$$ -234422 -37641 286024 237536 219178 96879 -1258 -381435 -244528 -178982 -250845 -26824
9566A42940a08299E6634J35708b07087f6868j67243d6847k41677h068j03563A2607
$$ 142940 -108299 56634 192342 -207087 -66868 -234111 -46847 -288524 -8068 -111631 12607
9554E4520J71920j4168i753A81648E9718b01140R4380A66711f5066K6414B38271
$$ 54520 226440 212272 -9753 181648 59718 -201140 -106760 166711 -65066 -38652 238271
9542E8500R4229J12867O6638D5524R2324f1779j77397M5176a9635k47215a17507
$$ 58500 152729 265596 332234 45524 137848 -61779 -239176 -194000 -19635 -266850 -117507
9530a60643c6982q768k05272M3973e9618A19186a60553k98j8427N0813B7264K49671
$$ -160643 -36982 -45750 -251022 -207049 -59618 119186 -160553 -160851 -179278 -128465 27264 276935
9518B76935c79698J49181d9796A11674a07153K0333r5552n2005A08701h8131I40
$$ 276935 -379698 -230517 -49796 111674 -107153 -86820 -182372 -234377 108701 -88131 940
9506g7126A07952a08469p4153D06070a85317j64459o1370J43994j4264d5151A7874
$$ -77126 107952 -108469 -182622 406070 -185317 -349776 -411146 -267152 -281416 -45151 17874
9494a67588c4974k4094d937I1163K9456N1735a5496j24440A31284a52401p35r6710
$$ -167588 -34974 -59068 -4937 91163 120619 172354 -15496 -139936 131284 -152401 -153136 -249846
9482b49846e7122j81408k8505i6471j67400o9792a41633C1888J9643a29094o8180
$$ -249846 -57122 -238530 -267035 -96471 -263871 -333663 -141633 31888 51531 -129094 -197274
9471a97274r4163B57185I3483O895B6805a83450B02530a2572k45512A27416a81039
$$ -197274 -291437 257185 93483 100378 26805 -183450 202530 -12572 -258084 127416 -181039
9459b86019i5388D8590b74490J35397d527A16592c80257D053c34803a50773e3952
$$ -286019 -95388 48590 -274490 -139093 -4527 116592 -380257 4053 -334803 -150773 -53952
9447C3294K16659j09684o2551I238b64606C4252b45084P5953g1711k00583B17428
$$ 33294 249953 140269 77718 9238 -264606 34252 -245084 -169131 -71711 -272294 217428
9435a14396B11927A4530c18684P5240n798p8466B0526a51028K4349e1920b123
$$ -114396 211927 14530 -318684 -243444 -249242 -327708 20526 -151028 -126679 -51920 -2123
9423a37720G3537B2908o750M2369d37084A58c71419a85203K7099M2558E0373B649
$$ -137720 73537 22908 16158 58527 -437084 158 -371419 -185203 -158104 -115546 50373 2649
9410I3858b06391j19382a45497A41722b58535h8537j7044r4228A66407a13312
$$ 93858 -206391 -325773 -145497 141722 -258535 -88537 -105581 -199809 166407 -113312
9399G0873j8928P0285l5308a14717e0527A15021h6336A44695d9259F725c43570
$$ 70873 51945 122230 86922 -114717 -50527 115021 -86336 144695 -49259 6725 -343570
9387c49687J04565B91844D7729d7112j0167l50973K2379J74065H3363P8500e0384
$$ -349687 -245122 291844 47729 -47112 -57279 -408252 -385873 -211808 83363 161863 -50384
9375a4254G1004a65739M6420E0237a63831A09900f1404j54570f8976B25143b69788
$$ -14254 71004 -165739 -119319 50237 -163831 109900 -61404 -215974 -68976 225143 -269788
9363a70781F0220a6841A64962c38398D7443d4760H1735K70923F9478a09125A15896
$$ -170781 60220 -16841 164962 -338398 47443 -44760 81735 352658 69478 -109125 115896
9351b40351e1648r8261B40597a17683a5108k07813D1001g9222b4064k27169c9205
$$ -240351 -51648 -149909 240597 -117683 -15108 -222921 41001 -79222 -24064 -251233 -39205
9339G3487g7266B91008b65320J16473a5312B96123a904k07146B89525e3516k14311
$$ 73487 -77266 291008 -265320 -148847 -15312 296123 -1904 -209050 289525 -53516 -267827
9328b67827f0384J8731k43984A82102e3369B9142h5973D4356J97009A20189c06289
$$ -267827 -60384 -41653 -285637 182102 -53369 29142 -85973 44356 241365 120189 -306289
9316a30520c0873r0360m0967B638b05693L3191a3280j2408j92463k30381J22764
$$ -130520 -30873 -121233 -162200 2638 -205693 -172502 -13280 -25688 -218151 -448532 -325768
9305c25768G7372h1206a6354N570k16236L3095K7949g081I7952e4778k77023A83832
$$ -325768 77372 -81206 -16354 -10784 -227020 -193925 -165976 -7081 97952 -54778 -331801 183832
9292A91620m9415J83856a72865k7578O6488I9845c04305f5146j83193d0721A99592
$$ 191620 142205 326061 -172865 -200443 -133955 99845 -304305 -65146 -248339 -40721 199592
9280A47850c22977d4685G3187d9743j491A01040a04387E07K7910a67909A940K95811
$$ 147850 -322977 -44685 73187 -49743 -51234 101040 -104387 507 28417 -167909 1940 297751
9268B97751c32460C8288c13013J53822k73042J82640r0320F1895d4369j08634
$$ 297751 -332460 38288 -313013 -159191 -432233 -249593 -339913 61895 -44369 -153003
9258a53003F6905O5713K688h8123p3479N5088a1852k78179C35223a66645A41069
$$ -153003 66905 132618 135306 -88123 -161602 -106514 -11852 -290031 335223 -166645 141069
9246b57445k7012B94091E5041d7242A09638b18355A44965e9311A22152a98758
$$ -257445 -284457 294091 55041 -47242 109638 -218355 144965 -59311 122152 -198758
9235a1822C8099c69800J68678C10618a20249D2002a99953k7364j15899A38248
$$ -11822 38099 -369800 -201122 310618 -120249 42002 -199953 -227317 -343216 138248
9224A19818J28961I884J87651q2229a24523j98594M7176b7090a0141B82608a04013
$$ 119818 248779 9884 197535 115306 -124523 -323117 -275941 -27090 -10141 282608 -104013
9212A47232P3079c59656G331J1810c965H6850k1788g1982B15955b18215c7885
$$ 147232 220311 -359656 7331 19141 -3965 86850 65062 -71982 215955 -218215 -37885
9200B6414c66397B6121b2583F5325f3648j22602o7568J21253A04534C1257c2236
$$ 26414 -366397 26121 -22583 65325 -63648 -186250 -253818 -132565 104534 31257 -32236
9188A34211a06411c7846A97646d14665a23627A41269c0745l84617a81092C8577
$$ 134211 -106411 -37846 197646 -414665 -123627 141269 -30745 -415362 -181092 38577
9177b23280g9051k27816J8154A46566D7844a54603B8882d0430k2833C35584b55929
$$ -223280 -79051 -306867 -288713 146566 47844 -154603 28882 -40430 -63263 335584 -255929
9165B3441b68135J1466e5713A02214a34112C2781H38O4405g8309j38562I2086
$$ 23441 -268135 -256669 -55713 102214 -134112 32781 838 65243 -78309 -216871 92086
9153a38159b0708j6295j24708j64492d5985D7257i0289M3L7153j53706A29909
$$ -138159 -20708 -37003 -161711 -326203 -45985 47257 -90289 -90246 -53093 -206799 129909
9141b18665J3168A61399D8560B2097c3696I4658O2697a45659l3871M2211b0077
$$ -218665 -205497 161399 48560 22097 -33696 94658 157355 -145659 -179530 -137319 -20077
9129A5353J82628a14579j7788G1245J8461b62661j39296A20745c9898C2785K8243
$$ 15353 197981 -114579 -132367 71245 89706 -262661 -401957 120745 -39898 32785 61028
9118F1028M3622a67050j89651J50300k02857J56697D6129H148d538H2332e2256
$$ 61028 104650 -167050 -356701 -206401 -409258 -252561 46129 8148 -4538 82332 -52256
9106i1842H340a88700A0562a83181c1148l2540L1236j00697B0818e798A53653
$$ -91842 8340 -188700 10562 -183181 -31148 -63688 -32452 -133149 20818 -5798 153653
9094G5946a21306M9361C5191f4407j259B28151b1587D0423b89719C02333A6420
$$ 75946 -121306 -71945 35191 -64407 -65666 228151 -21587 40423 -289719 302333 16420
9082G893a0055A34647a94476r6066A17565b7743A32203a54332J8934d8433j15025
$$ 7893 -10055 134647 -194476 -290542 117565 -27743 132203 -154332 -135398 -48433 -163458
9071a63458M6135r7474g7523n3369D4165c30850j04956K01040j33979A04797b63011
$$ -163458 -117323 -214797 -77523 -130892 44165 -330850 -435806 -234766 -368745 104797 -263011
9059c01099i7446j24561f7845k21529e4486r6352j08535B13632e18199a57092
$$ -301099 -97446 -222007 -67845 -289374 -54486 -150838 -259373 213632 -518199 -157092
9048a76015A30526j128a64257b3298k27950K8152C33954F268a7006j65737A82016
$$ -176015 130526 129398 -164257 -23298 -251248 -223096 333954 6268 -17006 -182743 182016
9036H9624P3244R4339a23117j13638O0023L7092A31055m301l3150j6185a43931
$$ 89624 162868 257207 -123117 -236755 -176732 -139640 131055 126754 93604 77419 -143931
9024g6981A1141K33752f3068o9669C99916a41489A36624D8877b7601j13708j20397
$$ -76981 11141 244893 -63068 -132737 399916 -141489 136624 48877 -27601 -141309 -261706
9013b61706A12274b97043B66662c4987l6801b2532j36080k53144A9286K6801J70095
$$ -261706 112274 -297043 266662 -34987 -71788 -22532 -158612 -411756 19286 46087 216182
9002B16182b40041G8919c90719g5418B39401b7812m61R885E0375Q6428n8505c8566
$$ 216182 -240041 78919 -390719 -75418 239401 -27812 -28273 -18388 50375 136803 78298 -38566
8989a74473k72370J35422D2459a40369n6493c1949r27B05145c40504c2746I043
$$ -174473 -446843 -311421 42459 -140369 -196862 -31949 -32876 205145 -340504 -32746 9043
8977E3245b0528o1147B9233b1903A10279a32163F7528c08502H273b77235Q2893
$$ 53245 -20528 -81675 29233 -21903 110279 -132163 67528 -308502 8273 -277235 -194342
8966a94342A29926b08114g8195F0273k661b68820J04317c3010C0181a15153B65407
$$ -194342 129926 -208114 -78195 60273 57612 -268820 -164503 -33010 30181 -115153 265407
8954A67847a81354q1830a23333q3056f7775a7800C8682f8477a596r5038E2521
$$ 167847 -181354 -263184 -123333 -206389 -67775 -17800 38682 -68477 -1596 -96634 52521
8942a63020A64010a98779M4822l55142A30134O3689n0593p0302L22984j19751
$$ -163020 164010 -198779 -153957 -509099 130134 193823 143230 72928 395912 276161
8932B76161F9227A7332b83715b7651I4001a18860D8163M95183K92767J220015
$$ 276161 69227 17332 -283715 -27651 94001 -118860 48163 543346 836113 2056128
8922B056128M933037O161660E583071A803111F50648k73127q642a91585j50731
$$ 2056128 6989165 13150825 5583071 1803111 650648 377521 368879 -191585 -342316
8913c42316a41729A29640n1582K0381a47927A70791L27263B42218j16526e2979
$$ -342316 -141729 129640 78058 98439 -147927 170791 498054 242218 125692 -52979
8902b34013f4541l6471r8763L1941f2383G1389c3716A49828Q8371a70835m3451
$$ -234013 -64541 -101012 -199775 -167834 -62383 71389 -33716 149828 238199 -170835 -214286
8891b14286h7985C0770a04745B2910a53810A48111O3317f3836r7711n4804A05806
$$ -214286 -87985 30770 -104745 22910 -153810 148111 211428 -63836 -161547 -216351 105806
8879B36866K1901l5841b55642K4583N0784C16023H7502a25234L0046l29866B49714
$$ 236866 258767 222926 -255642 -231059 -180275 316023 87502 -125234 -95188 -425054 249714
$$ [...]
##END NTUPLES=NMR SPECTRUM
##END=
