
##TITLE=AC1302_PERAH12114_7525498_Bu7zzF2CVs
##JCAMPDX= 6.0         $$ Bruker NMR JCAMP-DX V2.0
##DATA TYPE= NMR SPECTRUM
##DATA CLASS= NTUPLES
##ORIGIN= BRUKER
##OWNER= Administrator
$$ 1.72 TOPSPIN		Version 2.1
$$ 2013-02-21 03:14:51.918 -0500  Administrator@X
$$ Compression mode = diff/dup
##.OBSERVE FREQUENCY= 400.02188249412
##.OBSERVE NUCLEUS= ^1H
##.ACQUISITION MODE= SIMULTANEOUS (DQD)
##.ACQUISITION SCHEME= undefined
##.AVERAGES= 64
##.DIGITISER RES= 22
##SPECTROMETER/DATA SYSTEM= spect
##.PULSE SEQUENCE= noesygpps1d.comp
##.SOLVENT NAME= COFFEE_meoh
##.SHIFT REFERENCE= INTERNAL, COFFEE_meoh, 1, 14.96119
##AUDIT TRAIL= $$ (NUMBER, WHEN, WHO, WHERE, PROCESS, VERSION, WHAT)
$$ ##TITLE= Audit trail, TOPSPIN		Version 2.1
$$ ##JCAMPDX= 5.01
$$ ##ORIGIN= Bruker BioSpin GmbH
$$ ##OWNER= Administrator
$$ $$ E:\/data/COFFEE/nmr/AC1302_PERAH12114_7525498_Bu7zzF2CVs/62/pdata/1/auditp.txt
$$ ##AUDIT TRAIL=  $$ (NUMBER, WHEN, WHO, WHERE, PROCESS, VERSION, WHAT)
(   1,<2013-02-21 03:14:45.981 -0500>,<Administrator>,<X>,<go>,<TOPSPIN 2.1>,
      <created by zg
	started at 2013-02-21 03:03:15.815 -0500,
	POWCHK enabled, PULCHK disabled,
       configuration hash MD5:
       86 BA 57 50 F2 9D 5C 9B 26 00 A9 28 5F 66 2E 89
       data hash MD5: 64K
       C3 3D 7E 08 33 19 FC E1 0A 77 EC 85 A6 10 64 85>)
(   2,<2013-02-21 03:14:49.074 -0500>,<Administrator>,<X>,<proc1d>,<TOPSPIN 2.1>,
      <Start of raw data processing
       efp LB = 0.3 FT_mod = 6 PKNL = 1 PHC0 = 0 PHC1 = 0 SI = 128K 
       data hash MD5: 128K
       17 6F 6B 37 E0 2A 93 7B 08 7F CD C5 51 F5 EB A4>)
(   3,<2013-02-21 03:14:50.231 -0500>,<Administrator>,<X>,<proc1d>,<TOPSPIN 2.1>,
      <pk PHC0 = 252.1857 PHC1 = 0 
       data hash MD5: 128K
       81 CC E0 61 91 41 0F 85 8E A4 AA 19 81 CE 3F 31>)
(   4,<2013-02-21 03:14:50.871 -0500>,<Administrator>,<X>,<proc1d>,<TOPSPIN 2.1>,
      <abs ABSG = 1 
       data hash MD5: 128K
       94 3F 5F C7 70 3B 29 D7 73 B3 F6 F5 01 CA A0 3C>)
(   5,<2013-02-21 03:14:51.043 -0500>,<Administrator>,<X>,<proc1d>,<TOPSPIN 2.1>,
      <abs ABSG = 2 
       data hash MD5: 128K
       91 28 4B 63 52 8B B9 3D 50 66 E6 87 7E FE 27 3F>)
(   6,<2013-02-21 03:14:51.215 -0500>,<Administrator>,<X>,<proc1d>,<TOPSPIN 2.1>,
      <abs ABSG = 3 
       data hash MD5: 128K
       7F 78 40 30 2E 20 F4 02 3B 41 55 A2 80 B6 98 02>)
(   7,<2013-02-21 03:14:51.403 -0500>,<Administrator>,<X>,<proc1d>,<TOPSPIN 2.1>,
      <abs ABSG = 4 
       data hash MD5: 128K
       7F A3 AD ED BE 07 9C 27 9F D0 96 E3 40 3C 87 46>)
(   8,<2013-02-21 03:14:51.590 -0500>,<Administrator>,<X>,<proc1d>,<TOPSPIN 2.1>,
      <abs ABSG = 5 
       data hash MD5: 128K
       F8 62 6B 53 AF 80 40 73 DD 78 60 F2 A7 82 90 7F>)
$$ ##END=
$$ 
$$ $$ hash MD5
$$ $$ 76 C0 AA 64 CF AE FD 00 E4 D6 26 46 38 B9 07 16
##$RELAX= 
##$RELAX= 
##$RELAX= 
##$RELAX= 
##$RELAX= 
##$RELAX= 
##$RELAX= 
##$RELAX= 
$$ Bruker specific parameters
$$ --------------------------
##$DU= <E:\>
##$EXPNO= 62
$$ [...]
150 150 150 150 150 150 150 150
##$TP07= 0
##$TPNAME0= <>
##$TPNAME1= <>
##$TPNAME2= <>
##$TPNAME3= <>
##$TPNAME4= <>
##$TPNAME5= <>
##$TPNAME6= <>
##$TPNAME7= <>
##$TPOAL= (0..7)
0.5 0.5 0.5 0.5 0.5 0.5 0.5 0.5
##$TPOFFS= (0..7)
0 0 0 0 0 0 0 0
##$TUNHIN= 0
##$TUNHOUT= 0
##$TUNXOUT= 0
##$USERA1= <user>
##$USERA2= <user>
##$USERA3= <user>
##$USERA4= <user>
##$USERA5= <user>
##$V9= 5
##$VALIST= <valist>
##$VCLIST= <CCCCCCCCCCCCCCC>
##$VD= 0
##$VDLIST= <DDDDDDDDDDDDDDD>
##$VPLIST= <PPPPPPPPPPPPPPP>
##$VTLIST= <TTTTTTTTTTTTTTT>
##$WBST= 1024
##$WBSW= 4
##$XGAIN= (0..3)
0 0 0 0
##$XL= 0
##$YL= 0
##$YMAX_a= 6219627
##$YMIN_a= -10502948
##$ZGOPTNS= <>
##$ZL1= 120
##$ZL2= 120
##$ZL3= 120
##$ZL4= 120
##$ABSF1= 14.96119
##$ABSF2= -5.596992
##$ABSG= 5
##$ABSL= 3
##$ALPHA= 0
##$AQORDER= 0
##$ASSFAC= 0
##$ASSFACI= 0
##$ASSFACX= 0
##$ASSWID= 0
##$AUNMP= <proc_prof1d_extract.lims>
##$AXLEFT= 0
##$AXNAME= <>
##$AXNUC= <1H>
##$AXRIGHT= 0
##$AXTYPE= 0
##$AXUNIT= <>
##$AZFE= 0.1
##$AZFW= 0.1
##$BCFW= 0
##$BC_mod= 0
##$BYTORDP= 0
##$COROFFS= 0
##$CY= 15
##$DATMOD= 1
##$DC= 0
##$DFILT= <>
##$DTYPP= 0
##$F1P= 0
##$F2P= 0
##$FCOR= 0.5
##$FTSIZE= 131072
##$FT_mod= 6
##$GAMMA= 0
##$GB= 0
##$INTBC= 1
##$INTSCL= 1
##$ISEN= 128
##$LB= 0.3
##$LEV0= 0
##$LPBIN= 0
##$MAXI= 10000
##$MC2= 0
##$MEAN= 0
##$ME_mod= 0
##$MI= 0
##$NCOEF= 0
##$NC_proc= -2
##$NLEV= 6
##$NOISF1= 0
##$NOISF2= 0
##$NSP= 0
##$NTH_PI= 0
##$NZP= 0
##$OFFSET= 14.96119
##$PC= 1
##$PHC0= 252.1857
##$PHC1= 0
##$PH_mod= 1
##$PKNL= yes
##$PPARMOD= 0
##$PPDIAG= 0
##$PPIPTYP= 0
##$PPMPNUM= 2147483647
##$PPRESOL= 1
##$PSCAL= 4
##$PSIGN= 0
##$PYNMP= <proc.py>
##$REVERSE= no
##$SF= 400.020009561738
##$SI= 131072
##$SIGF1= 0
##$SIGF2= 0
##$SINO= 400
##$SIOLD= 131072
##$SPECTYP= <>
##$SREGLST= <1H.CDCl3>
##$SSB= 0
##$STSI= 131072
##$STSR= 0
##$SW_p= 8223.68421052631
##$SYMM= 0
##$S_DEV= 0
##$TDeff= 65536
##$TDoff= 0
##$TI= <>
##$TILT= no
##$TM1= 0
##$TM2= 0
##$TOPLEV= 0
##$USERP1= <user>
##$USERP2= <user>
##$USERP3= <user>
##$USERP4= <user>
##$USERP5= <user>
##$WDW= 1
##$XDIM= 131072
##$YMAX_p= 405195156
##$YMIN_p= -13722
##$CURPLOT= <Network HP LaserJet P1505>
##$CURPRIN= <$Network HP LaserJet P1505>
##$DFORMAT= <normdp>
##$LAYOUT= <+/1D_H.xwp>
##$LFORMAT= <normlp>
##$PFORMAT= <normpl>
##$SURQMSG= 1
$$ End of Bruker specific parameters
$$ ---------------------------------
##NTUPLES= NMR SPECTRUM
##VAR_NAME=  FREQUENCY,     SPECTRUM/REAL,   SPECTRUM/IMAG
##SYMBOL=    X,             R,               I
##VAR_TYPE=  INDEPENDENT,   DEPENDENT,       DEPENDENT
##VAR_FORM=  AFFN,          ASDF,            ASDF
##VAR_DIM=   131072,        131072,          131072
##UNITS=     HZ,            ARBITRARY UNITS, ARBITRARY UNITS
##FACTOR=    0.0627417313425164, 1,          1
##FIRST=     8223.62146879497, 606,          -62167
##LAST=      0,             2435,            -62664
##MIN=       0,             -13722,          0
##MAX=       8223.62146879497, 405195156,    0
$$ Real data points
##PAGE= N=1
##DATA TABLE= (X++(R..R)), XYDATA
$$ [...]
61740D66051k194k494k124j488r90m94K35R51J196R44N98L99L09L85Q08J415J679
61723D65186J381R48R33J335J765J986K048K021J945J959K185K458K405J795P26
61708D91076n11j643k515l106l472l575l307k725k169j959k102k393k687k931
61694D55981l028k910k671k451k262k100k117k396k640k405j720j210j475k470
61680D24126l575m123l852l061k440k498l033l277k761j882j464j796k347k473
61666C85544k104j580j050l53M64Q66M02n67j079o20K86P58O18N22J034J933K546
61649C87620K628K594K914L514L969M109M174M315M268L773L038K485K131J607
61635D33139P46k61j344k630l914m549m284l763l779m278m613m472m020l337k376
$$ y = [466051, 463857, 461363, 459239, 457751, 456761, 456267, 456502, 457453, 458649, 459593, 460191, 460590, 460899, 461284, 462092, 463507, 465186, 466567, 467515, 468448, 469783, 471548, 473534, 475582, 477603, 479548, 481507, 483692, 486150, 488555, 490350, 491076, 490565, 488922, 486407, 483301, 479829, 476254, 472947, 470222, 468053, 466094, 463992, 461599, 458912, 455981, 452953, 450043, 447372, 444921, 442659, 440559, 438442, 436046, 433406, 431001, 429281, 428071, 426596, 424126, 420551, 416428, 412576, 409515, 407075, 404577, 401544, 398267, 395506, 393624, 392160, 390364, 388017, 385544, 383440, 381860, 380810, 380457, 380921, 381787, 382189, 381622, 380543, 379923, 380209, 380967, 381585, 382107, 383141, 385074, 387620, 390248, 392842, 395756, 399270, 403239, 407348, 411522, 415837, 420105, 423878, 426916, 429401, 431532, 433139, 433885, 433624, 432280, 429650, 425736, 421187, 416903, 413140, 409361, 405083, 400470, 395998, 391978, 388641, 386265]
61620C86265j455j069j143j051n64k14m57j064j693k459l448m152m037l401l011
61605C57047l094l272l390l655l989l959l549l293l389l264k551j868k034k830
61591C12910l251k866k193j765j479j085o71l66m3K96K53l49r05p37j77k59j240
61574B96073k123j983j204q64j215j416p96J93N75N6o94q55l22L64P02P67R38
61557B88196J280J374R18K52O8N66J182J275Q43L65J36O5R3L81R07J236J052P74
61539C00963J151K221L110L107K502K017J698J040M0n60l75l4k96r09j032m79
61523C14164J25L46L60K86j63r71j434j063m14l41p28p30j71K13j2l48l69m77
61505C08273j108j780j727j100o90o82n29rM45O30Q74J212J070K42m89l18N27
$$ y = [386265, 384810, 383741, 382598, 381547, 380983, 380769, 380312, 379248, 377555, 375096, 371648, 367496, 363459, 360058, 357047, 353953, 350681, 347291, 343636, 339647, 335688, 332139, 328846, 325457, 322193, 319642, 317774, 315740, 312910, 309659, 306793, 304600, 302835, 301356, 300271, 299600, 299234, 299191, 299487, 299740, 299391, 298486, 297749, 297572, 297313, 296073, 293950, 291967, 290763, 289899, 288684, 287268, 286472, 286665, 287240, 287296, 286602, 285747, 285425, 285789, 286491, 287258, 288196, 289476, 290850, 291768, 292020, 292088, 292654, 293836, 295111, 295954, 296319, 296455, 296520, 296613, 296994, 297901, 299137, 300189, 300963, 302114, 304335, 307445, 310552, 313054, 315071, 316769, 317809, 317849, 317289, 316914, 316880, 316584, 315675, 314643, 314164, 314289, 314635, 314995, 315281, 315118, 314147, 312713, 311650, 311236, 310895, 310167, 309437, 309266, 309479, 309467, 309119, 308750, 308273, 307165, 305385, 303658, 302558, 301868, 301186, 300657, 300648, 301093, 301723, 302597, 303809, 304879, 305121, 304632, 304314, 304841]
61488C04841J265J635J841J898J768J786K185K385J650L35l67l8M90M21o1m35
61472C21599o44p36m15M77J432J794J544J143Q69O95N76M92L77L03M70P57O67
61455C31400R8k27L55J411J789J001k93j103j016l12L72M94K8m31k16P80K058
61438C36188K998L227K741J909J211Q29O64Q02J472K393K745K280J849K169K649
61423C66126K330J568J594K550L121K473J436J211J748K041J535N28m64j136j402
61408C85259j427j553j947k385k598k559k344j987j641j568j715j669j218o49
61394C59999k34J30N60Q44P97O50O59O72M55J31o9j92l24k32K39O96O44K39K9
61375C65693J64M07Q30J769L023L797L622K913K354K204K413K934L595M001L978
$$ y = [304841, 306106, 307741, 309582, 311480, 313248, 315034, 317219, 319604, 321254, 321589, 321222, 321184, 321674, 322095, 322034, 321599, 320955, 320219, 319804, 320281, 321713, 323507, 325051, 326194, 327063, 327758, 328334, 328826, 329203, 329506, 329976, 330733, 331400, 331498, 331271, 331626, 333037, 334826, 335827, 335534, 334431, 333415, 333103, 333475, 333969, 333997, 333566, 333350, 334130, 336188, 339186, 342413, 345154, 347063, 348274, 349103, 349767, 350569, 352041, 354434, 357179, 359459, 361308, 363477, 366126, 368456, 370024, 371618, 374168, 377289, 379762, 381198, 382409, 384157, 386198, 387733, 388261, 387797, 386661, 385259, 383832, 382279, 380332, 377947, 375349, 372790, 370446, 368459, 366818, 365250, 363535, 361866, 360648, 359999, 359765, 359895, 360455, 361299, 362096, 362746, 363405, 364077, 364532, 364663, 364594, 364402, 364078, 363846, 364085, 364781, 365425, 365664, 365693, 365857, 366264, 367094, 368863, 371886, 375683, 379305, 382218, 384572, 386776, 389189, 392123, 395718, 399719, 403697]
61360D03697L883M117M534M684M530M562N114N926O490O653O656O647O370N497
61346D79360M198L135K761K768K501J872J519J895K529K550J773Q63L46q9r98
61331E06983k213k987l079l146l760m465m315l259k363k491l162l172k087p24
61317D65760p8j71j93M49J564K662L630M716N993P261Q403R480J0321J0459R718
61302E39974Q571P526O497N233M041L446L180K330N74j323k568l227l741m100
61288E66413m117m003m093m253m179m010m074m210l983l492l237l154k520j055
61274E16033N31J500J960K402K749K566K023J914K697L933M934N546O098O783
61260E61669P482Q062Q503Q646Q164O986N611M652M140L515K380R89j77j084k140
$$ y = [403697, 407580, 411697, 416231, 420915, 425445, 430007, 435121, 441047, 447537, 454190, 460846, 467493, 473863, 479360, 483558, 486693, 489454, 492222, 494723, 496595, 498114, 500009, 502538, 505088, 506861, 507724, 508070, 507981, 506983, 504770, 501783, 498704, 495558, 491798, 487333, 483018, 479759, 477396, 474905, 471743, 468571, 466484, 465760, 465682, 465511, 465318, 465767, 467331, 469993, 473623, 478339, 484332, 491593, 499996, 509476, 519797, 530256, 539974, 548545, 556071, 562568, 567801, 571842, 575288, 578468, 580798, 581372, 580049, 577481, 574254, 570513, 566413, 562296, 558293, 554200, 549947, 545768, 541758, 537684, 533474, 529491, 525999, 522762, 519608, 517088, 516033, 516564, 518064, 520024, 522426, 525175, 527741, 529764, 531678, 534375, 538308, 543242, 548788, 554886, 561669, 569151, 577213, 585716, 594362, 602526, 609512, 615123, 619775, 623915, 627430, 629810, 630799, 630622, 629538, 627398]
61245F27398l608n298o815p864q318q152p531o771o090n445m733m102l794l641
61231E45236l014j555J43J042R21P11J298K336K796K434K104K568L581M393M694
61216E69688M780N015N494N962N975N256M113L249L039L253L582M012M476M655
61202F32549M483M568N568P370R293J0901J2208J3280J4154J4962J5634J5537
61190G60507J3988J1168Q121N745M188L179K482J782O19j211l343n103o091o452
61176G89579o731p427q539r595j0179j0355j0412j0431j0381j0393j0648j1092
61164F73396j1570j2085j2581j2745j2450j2108j1984j1426r574o771m343k881
61152E52878j656r8J142J269O94L38N2j264l918o692q094p858o852n897n057m008
$$ y = [627398, 623790, 618492, 611677, 603813, 595495, 587343, 579812, 573041, 566951, 561506, 556773, 552671, 548877, 545236, 542222, 540667, 540810, 541852, 542773, 543484, 544782, 547118, 549914, 552348, 554452, 557020, 560601, 564994, 569688, 574468, 579483, 584977, 590939, 596914, 602170, 606283, 609532, 612571, 615824, 619406, 623418, 627894, 632549, 637032, 641600, 647168, 654538, 663831, 674732, 686940, 700220, 714374, 729336, 744970, 760507, 774495, 785663, 793784, 799529, 803717, 806896, 809378, 811160, 811779, 810568, 807225, 802122, 796031, 789579, 782848, 775421, 766882, 757287, 747108, 736753, 726341, 715910, 705529, 695136, 684488, 673396, 661826, 649741, 637160, 624415, 611965, 599857, 587873, 576447, 566873, 560102, 555759, 552878, 551222, 551124, 552266, 553535, 554229, 554567, 554619, 553355, 549437, 542745, 534651, 526793, 519941, 514044, 508987, 504979]
61136E04979k665j291l5J295K833M200M819M744M844N950P921R761J0646J0794
61122E68795J1275J2831J4958J6371J6602J6664J7683J9344K0382K0393K0206
61111G55504K0379K0369J9595J8407J7331J6075J4023J1304Q547N907L105K29
61099I10775k275m384o634r375j2347j5003j6875j7677j7569j7250j7338j7625
61087G56423j7460j6772j6114j5655j4834j3330j1685j0517r557q137o356n047
61075F10959m544m138l125j871j225j104m38J305L243M281M664N414O576P117
61061F27114O750O667P894R813J1188J1919J2777J3904J4755J5374J6561J8612
61049G73328K0893K2862K4640K6247K7218K7482K7886K9176L0997L2526L3631
$$ y = [504979, 502314, 501023, 500988, 502283, 505116, 509316, 514135, 518879, 523723, 529673, 537594, 547355, 558001, 568795, 580070, 592901, 607859, 624230, 640832, 657496, 675179, 694523, 714905, 735298, 755504, 775883, 796252, 815847, 834254, 851585, 867660, 881683, 892987, 901534, 907441, 910546, 910775, 908500, 904116, 897482, 888107, 875760, 860757, 843882, 826205, 808636, 791386, 774048, 756423, 738963, 722191, 706077, 690422, 675588, 662258, 650573, 640056, 630499, 622362, 616006, 610959, 606415, 602277, 599152, 597281, 596056, 594952, 594514, 595819, 599062, 603343, 608007, 613421, 619997, 627114, 633864, 640531, 648425, 658238, 669426, 681345, 694122, 708026, 722781, 738155, 754716, 773328, 794221, 817083, 841723, 867970, 895188, 922670, 950556, 979732, 1010729, 1043255, 1076886]
61038A076886L4804L6256L7765L9237M0805M2392M3793M5154M6953M9341N1858
61027A545244N3937N5501N7006N9096O2358O7215P3853Q2135R1599J01748J12547
61016B362239J24668J39088J56668J78347K05537K39683K81410L30824L88896
61007D407360M58091N41901O45034P74067R34626J124111J326866J518820J676210
60998A3407086J775181J781824J652707J362246R40618M81841J02569j19158j75439
60989B1209475j13012K5R1026Q5296p8478m13225q59751j306559j645505j820789
60979A5148503j838104j739438j572755j376652j178432r95472q35815p00023
60971D911812n84986m87385m04917l36011k79463k34196j98898j71742j50628
$$ y = [1076886, 1111690, 1147946, 1185711, 1224948, 1265753, 1308145, 1351938, 1397092, 1444045, 1493386, 1545244, 1599181, 1654682, 1711688, 1770784, 1833142, 1900357, 1974210, 2056345, 2147944, 2249692, 2362239, 2486907, 2625995, 2782663, 2961010, 3166547, 3406230, 3687640, 4018464, 4407360, 4865451, 5407352, 6052386, 6826453, 7761079, 8885190, 10212056, 11730876, 13407086, 15182267, 16964091, 18616798, 19979044, 20919662, 21401503, 21504072, 21384914, 21209475, 21096463, 21096488, 21187514, 21272810, 21194332, 20781107, 19921356, 18614797, 16969292, 15148503, 13310399, 11570961, 9998206, 8621554, 7443122, 6447650, 5611835, 4911812, 4326826, 3839441, 3434524, 3098513, 2819050, 2584854, 2385956, 2214214, 2063586]
60962B063586j33702j19592j07278r6008q5454p5704o6943n9158n2226m6266m1683
60951A179572l8755l7200l6253l5241l3973l2546l0914k8892k6629k4703k3460
60940H31006k2476k1073j9337j8089j7753j7678j6984j5732j4773j4573j4640
60929F37898j4194j2977j1306r621q127o799n513m342l617l560l884m048l887
60916E46023l598l129k102o49K99O8p49r86m05K13L95N88J184J691J476P84L74
60899E41477L62J00p66j764k341k627l107l827m385m602m807n316n928o182n946
60884D90341n591n558n962o625p265p576p354o701o028n596n251m786m401m380
60870D07267m402l730k221o32L09P81J357K111K708L165L817M514M515L422J812
$$ y = [2063586, 1929884, 1810292, 1703014, 1607006, 1521552, 1445848, 1378905, 1319747, 1267521, 1221255, 1179572, 1140817, 1103617, 1067364, 1032123, 998150, 965604, 934690, 905798, 879169, 854466, 831006, 808530, 787457, 768120, 750031, 732278, 714600, 697616, 681884, 667111, 652538, 637898, 623704, 610727, 599421, 589800, 581673, 574874, 569361, 565019, 561402, 557842, 553958, 549910, 546023, 542425, 539296, 537194, 536545, 536844, 536912, 536163, 535177, 534772, 534985, 535380, 535968, 537152, 538843, 540319, 541103, 541477, 541839, 541939, 541173, 539409, 537068, 534441, 531334, 527507, 523122, 518520, 513713, 508397, 502469, 496287, 490341, 484750, 479192, 473230, 466605, 459340, 451764, 444410, 437709, 431681, 426085, 420834, 416048, 411647, 407267, 402865, 399135, 396914, 396282, 396591, 397372, 398729, 400840, 403548, 406713, 410530, 415044, 419559, 422981, 424793]
60855D24793O40L51P88J665K689L433L568L290L158L311L168K191Q57L12R78J828
60839D57020J520K8j385j782j623j944k985m024m291l618k378j225q31j388k405
60824D28689l142l297l020k537k089k012k385k727k559k185k351l204m120m641
60810C88420m928n166n197m973m749m554l999l011k214k138k493k667k543k358
60796C37430k115j663j147r02j047j541k351l171l238k019O0K008L222L685L460
60781C30671K602J493P13M82O11R96J742K730L501L628L087K231J633J768K498
60766C60386L067K945K527K514K722K187N70j162j849j453r74j151j700j861j431
60751C65337j034j247j735j638p84M3K76L28O52O96l88k320l940m750n242n678
$$ y = [424793, 425433, 425784, 426572, 428237, 430926, 434359, 437927, 441217, 444375, 447686, 450854, 453045, 453902, 454214, 455192, 457020, 458540, 458568, 457183, 455401, 453778, 451834, 448849, 444825, 440534, 436916, 434538, 433313, 432482, 431094, 428689, 425547, 422250, 419230, 416693, 414604, 412592, 410207, 407480, 404921, 402736, 400385, 397181, 393061, 388420, 383492, 378326, 373129, 368156, 363407, 358853, 354854, 351843, 349629, 347491, 344998, 342331, 339788, 337430, 335315, 333652, 332505, 331603, 330556, 329015, 326664, 323493, 320255, 318236, 318296, 320304, 323526, 327211, 330671, 333273, 334766, 335479, 335961, 336572, 337568, 339310, 342040, 345541, 349169, 352256, 354487, 356120, 357888, 360386, 363453, 366398, 368925, 371439, 374161, 376348, 376918, 375756, 373907, 372454, 371480, 370329, 368629, 366768, 365337, 364303, 363056, 361321, 359683, 358899, 358942, 359218, 359546, 360198, 360894, 360506, 358186, 354246, 349496, 344254, 338576]
60735C38576n595m842m155m099m208l773k949k322j842j036lN20J79n17q22m46
60719C02666M38J416J982J846J312J003J085J017L85k93l2J321K735L154K684
60704C22719K256K379K722K899L006L141L006K350J476Q62O41Q50J721L084L928
60689C57040L350J815O54L98M10J72J6K73N79M00k35r61j509j643j204n58m13
60672C58584q67j158p95l40n27j146j502j592k050l034l799l547k272p84l8l52
60656C34781j110j376q82j34M77J119J861K213J799J097Q80J249J711J921J785
60641C47391J129j16j526k514k964l091k900k284j494r56p35o17o21q30r42n35
60625C26395K31P46P65N17J24m47q50n39L79J035Q69L09J18M72R21R54M79j3K13
$$ y = [338576, 332981, 328139, 323984, 319885, 315677, 311904, 308955, 306633, 304791, 303755, 303752, 304272, 304451, 303934, 303112, 302666, 303104, 304520, 306502, 308348, 309660, 310663, 311748, 312765, 313150, 312857, 312825, 314146, 316881, 320035, 322719, 324975, 327354, 330076, 332975, 335981, 339122, 342128, 344478, 345954, 346816, 347457, 348307, 350028, 353112, 357040, 360390, 362205, 362859, 363257, 363667, 363839, 363855, 364128, 364707, 365107, 364872, 363911, 362402, 360759, 359555, 358997, 358584, 357717, 356559, 355764, 355424, 354897, 353751, 352249, 350657, 348607, 345573, 341774, 338227, 335955, 335171, 335133, 334781, 333671, 332295, 331413, 331279, 331756, 332875, 334736, 336949, 338748, 339845, 340725, 341974, 343685, 345606, 347391, 348520, 348404, 346878, 344364, 341400, 338309, 335409, 333125, 331631, 330675, 329940, 329323, 328702, 327872, 326930, 326395, 326626, 327372, 328137, 328654, 328778, 328331, 327481, 326942, 327321, 328356, 329225, 329534, 329652, 330124, 331045, 331999, 332478, 332465, 332678]
60606C32678J282K204J828L17q69p19K26Q17P68O68R34J397J836K352L069L719
60590C52507L708K602O41j251k158k009j496j150p59R7J182J713J319N81M79J322
60574C57328K487L173L317L482L980M557N002N615O695P959Q884R295R154Q190
60560D39118O376M543L599L233K244K82j604k427k356k018j514p76j23K39Q02
60545D49618K113L930N675P296Q998J0484J1321J1839J2747J3935J4565J4369
60533E66890J3953J3566J2444R872O177K200j645n158p705q642q218p390o719
60520E79625o025n120m314l924l732l266k345j113K28J412K050K025J879K430
60506E59810L922N862P783R837J2404J5421J8523K1733K5547L0172L4899L8539
$$ y = [332678, 333960, 336164, 337992, 338309, 337440, 336721, 336947, 337764, 338532, 339200, 340134, 341531, 343367, 345719, 348788, 352507, 356215, 358817, 359458, 358207, 356049, 354040, 352544, 351394, 350635, 350732, 351914, 353627, 354946, 355527, 356006, 357328, 359815, 362988, 366305, 369787, 373767, 378324, 383326, 388941, 395636, 403595, 412479, 421774, 430928, 439118, 445494, 450037, 453636, 456869, 459113, 459395, 457791, 455364, 453008, 450990, 449476, 448700, 448577, 448816, 449618, 451731, 455661, 461336, 468632, 477630, 488114, 499435, 511274, 524021, 537956, 552521, 566890, 580843, 594409, 606853, 616725, 622902, 625102, 623457, 618299, 610594, 601952, 593734, 586344, 579625, 573600, 568480, 564166, 560242, 556510, 553244, 550899, 549786, 550014, 551426, 553476, 555501, 557380, 559810, 563732, 569594, 577377, 587214, 599618, 615039, 633562, 655295, 680842, 711014, 745913, 784452]
60494G84452M0399M0760M0423L9801L8463L5493L0287K2979J4157M359n942j6087
60482A069544k5342l3316l9917m4824m7360m7232m5150m2320l9415l6359l3045
60471F35264k9789k6890k4175k1324j8532j6335j4838j3414j1440r113p288o496
60459D35630o396o224n630m888m388m061l445k255q19J31Q7q81k298l578m159
60444C86826l717k530j429r95r28n52J29M23n5q66j478j877k127j869q69L24R24
60427C69334R17Q73Q68L79o18j244q18J87P27M34j94n48l87L09J421K498K871
60410C77009K253J144M55P12J615K366K323J457L60j90J59R87J439J090M22K34
60394C93835P09J386K047L002M292N126M710L421K449K343K458K010J179Q02J247
$$ y = [784452, 824851, 865611, 906034, 945835, 984298, 1019791, 1050078, 1073057, 1087214, 1091573, 1085631, 1069544, 1044202, 1010886, 970969, 926145, 878785, 831553, 786403, 744083, 704668, 668309, 635264, 605475, 578585, 554410, 533086, 514554, 498219, 483381, 469967, 458527, 449414, 442126, 435630, 429234, 423010, 417380, 412492, 408104, 404043, 400598, 398343, 397524, 397655, 397742, 396861, 394563, 390985, 386826, 383109, 380579, 379150, 378155, 377227, 376675, 376804, 377227, 377172, 376306, 374828, 372951, 370824, 368955, 368086, 368410, 369334, 370251, 371124, 371992, 372371, 371753, 370509, 369691, 369878, 370605, 371039, 370845, 370297, 369910, 370219, 371640, 374138, 377009, 379262, 380406, 380861, 381573, 383188, 385554, 387877, 389334, 389694, 389504, 389663, 390650, 392089, 393179, 393601, 393835, 394544, 395930, 397977, 400979, 405271, 410397, 415107, 418528, 420977, 423320, 425778, 427788, 428967, 429769, 431016]
60379D31016K000K320K090J815J911K185K164J824J667K016K566K785K504J892
60365D60755J149M80J68L78J022J962L047L859L909L436L519M798O558P676Q038
60350E10754Q224Q228P458N953M454L218J735j84j930l127m208n495o436o370
60336E22274n490m562m064m069m488m996n109m752m418m440m509m217l647l097
60322D60416k558j879j059j73O55J076R19Q70K007M267O240P021P389Q434R844
60307E03469J0514J0226R643R162Q786Q767R179Q994O897L175l19k362l611n290
60293E77230p556r699j1262j2256j2640j2253j1193r877q680p620o432m921l317
60280D59524k164j781k005k560l360m166m383l681k566j808j466j061n51m53r79
$$ y = [431016, 433016, 435336, 437426, 439241, 441152, 443337, 445501, 447325, 448992, 451008, 453574, 456359, 458863, 460755, 461904, 462384, 462552, 462930, 463952, 465914, 468961, 472820, 476729, 480165, 483684, 488482, 495040, 502716, 510754, 518978, 527206, 534664, 540617, 545071, 548289, 550024, 549840, 547910, 544783, 540575, 535080, 528644, 522274, 516784, 512222, 508158, 504089, 499601, 494605, 489496, 484744, 480326, 475886, 471377, 467160, 463513, 460416, 457858, 455979, 454920, 454747, 455402, 456478, 457397, 458267, 460274, 464541, 470781, 477802, 485191, 493625, 503469, 513983, 524209, 533852, 543014, 551800, 560567, 569746, 578740, 585637, 588812, 588493, 586131, 582520, 577230, 569674, 559975, 548713, 536457, 523817, 511564, 500371, 490494, 481814, 474194, 467762, 462841, 459524, 457360, 455579, 453574, 451014, 447654, 443488, 439105, 435424, 432858, 431050, 429584, 428523, 427972, 427519, 426540]
60265D26540j699k099k040j591r34m46m19o41o37l13N0L35O17P84O99O12P73P48
60247D20339p9j354j958j492p39m11l21r3J60L77Q95J715K077J518O96M97P86
60230D22613Q81Q04J181K072K722K542J739R45P01J262K383L322L529L376L716
60215D53788M728N676N835N234M394L811L839M600N665O193N741M722L815L224
60201E21265K832K778L269L841L542K155P04K67N89M85n25j696k220k187k075
60186E33024j911j586j438j901k710l117k860k321j880j581j442j530j661j589
60172E05497j448j528j593j083q8N75M36j24n91r33j142r59m55k80p27j157q90
60155D93510j76L88Q00J264J342M92p56j225p49l54n89o46L14J784K559K359K012
$$ y = [426540, 424841, 422742, 420702, 419111, 418177, 417731, 417312, 416671, 416034, 415721, 415771, 416106, 416723, 417507, 418206, 418818, 419591, 420339, 420260, 418906, 416948, 415456, 414717, 414306, 413985, 413892, 414052, 414429, 415324, 417039, 419116, 420634, 421330, 421827, 422613, 423494, 424298, 425479, 427551, 430273, 432815, 434554, 435499, 436200, 437462, 439845, 443167, 446696, 450072, 453788, 458516, 464192, 470027, 475261, 479655, 483466, 487305, 491905, 497570, 503763, 509504, 514226, 518041, 521265, 524097, 526875, 530144, 533985, 537527, 539682, 540386, 540653, 541242, 541727, 541202, 539506, 537286, 535099, 533024, 531113, 529527, 528089, 526188, 523478, 520361, 517501, 515180, 513300, 511719, 510277, 508747, 507086, 505497, 504049, 502521, 500928, 499845, 499757, 500332, 500768, 500644, 500053, 499120, 497978, 497019, 496564, 496284, 495557, 494400, 493510, 493334, 493722, 494522, 495786, 497128, 497620, 496864, 495639, 494890, 494536, 493947, 493301, 493615, 495399, 497958, 500317, 502329]
60138E02329K227K837L319L449L324L133L126L547M276M705M225K858J292L06
60124E44953K14P08J134R82L57q0J35O82R23Q39R51J244R29l88j845k349k025
60107E47364j872k236k475k115j486j035p81o76q89j313j389q03N1O96J195J817
60091E34053K494L046L537L989M067L526K686K015J432N10p68j893k440k522k565
60076E51167k894l498m143m764n605o726p489p099n818m945n287o149o312n484
60062D74954m332l518l291l672m345m568l827k524j486r37m50K04O98P29M94N08
60046D44637J139K299L432L975L966L929L981L549K364J166P86R62P56j17j106
60031D75718j801k257k500k435k269k381k744l061l422m121m877n020m537m150
$$ y = [502329, 504556, 507393, 510712, 514161, 517485, 520618, 523744, 527291, 531567, 536272, 540497, 543355, 544647, 544953, 545167, 545875, 547009, 547991, 548348, 548268, 548403, 549085, 550008, 550847, 551798, 553042, 553971, 553583, 551738, 549389, 547364, 545492, 543256, 540781, 538666, 537180, 536145, 535364, 534688, 533799, 532486, 531097, 530294, 530345, 531041, 532236, 534053, 536547, 539593, 543130, 547119, 551186, 554712, 557398, 559413, 560845, 561355, 560587, 558694, 556254, 553732, 551167, 548273, 544775, 540632, 535868, 530263, 523537, 516048, 508949, 503131, 498186, 492899, 486750, 480438, 474954, 470622, 467104, 463813, 460141, 455796, 451228, 447401, 444877, 443391, 442454, 442004, 442208, 442906, 443635, 444129, 444637, 445776, 448075, 451507, 455482, 459448, 463377, 467358, 470907, 473271, 474437, 475223, 476185, 476941, 476824, 475718, 473917, 471660, 469160, 466725, 464456, 462075, 459331, 456270, 452848, 448727, 443850, 438830, 434293, 430143]
60017D30143m213m239l789l143k768k688k701k721k681k516k400k555k669k113
60003C88947r24K2O5n24j101j309r21K23J704K521K173J309Q90J132J683K325
59987C98215K935L161K757J995J231M38l89p58k78M93N29m13j591k230k167j625
59971D02303r42n55p40j198j301q68l12L4L57R35J605J939J747J214O04O9l10
59954D04581m24k43N2J33j09m67p64j168j848k471k457j754r39m27j41l8l66j080
59936C90070j479j020r6N12O72P93J006J104J195J719K727L704M278M579M761
59921D14525M636M025L142K333J717J196O77P8o04j054p61L66J646K251K103J874
59905D38150K035K262J968J200N84M18K96j30m52q8P62J387J713K351L377L907
$$ y = [430143, 425930, 421691, 417902, 414759, 411991, 409303, 406602, 403881, 401200, 398684, 396284, 393729, 391060, 388947, 388023, 388045, 388110, 387586, 386485, 385176, 384255, 384478, 386182, 388703, 390876, 392185, 393075, 394207, 395890, 398215, 401150, 404311, 407068, 409063, 410294, 410732, 410343, 409585, 409307, 409800, 410329, 409916, 408325, 406095, 403928, 402303, 401361, 400806, 400066, 398868, 397567, 396699, 396387, 396421, 396778, 397713, 399318, 401257, 403004, 404218, 404822, 404891, 404581, 404157, 403914, 403966, 404099, 403990, 403523, 402759, 401591, 399743, 397272, 394815, 393061, 392122, 391695, 391554, 391516, 391150, 390070, 388591, 387571, 387475, 387987, 388659, 389452, 390458, 391562, 392757, 394476, 397203, 400907, 405185, 409764, 414525, 419161, 423186, 426328, 428661, 430378, 431574, 432251, 432329, 431725, 430671, 429910, 430276, 431922, 434173, 436276, 438150, 440185, 442447, 444415, 445615, 446199, 446617, 446913, 446783, 446331, 446243, 447005, 448392, 450105, 452456, 455833, 459740]
59889D59740L382K632K858M066N258N900O334O835P102O870O334N706M919M051
59875E31987L542L632L874L532K320O16r02j659j519q82m05m81j077j894k501
59860E38183k474j741p95j74J50O24J446K524L874N498O800O982O094N042M328
59845E76361L485K115O82k13o73r61p81J02J016J010P0j060k076l208m324m880
59829E66665m828m706m635m110l032k114j816j628r62j83j15q80j871k658l346
59814E29781m147n032n752n980n533m699m055l781l465k871k355k161j811r26
59800D77213k23p31k160l043k621j657j167j205j376j664k100k214j617p41l19
59785D54375l72l53o5K55N64R70J190P85P3l8P13J554J833J922K461L295L775
$$ y = [459740, 463122, 465754, 468612, 472678, 477936, 483836, 490170, 497005, 504107, 510977, 517311, 523017, 527936, 531987, 535529, 539161, 543035, 546567, 548887, 549503, 548601, 546942, 545423, 544541, 544136, 543655, 542578, 540684, 538183, 535709, 533968, 533173, 532999, 533149, 533773, 535219, 537743, 541617, 547115, 553915, 560897, 566991, 572033, 576361, 579846, 581961, 582643, 582430, 581757, 580796, 580015, 580117, 581133, 582143, 582213, 581153, 579077, 575869, 571545, 566665, 561837, 557131, 552496, 548386, 545354, 543240, 541424, 539796, 538834, 538651, 538536, 537656, 535785, 533127, 529781, 525634, 520602, 514850, 508870, 503337, 498638, 494583, 490802, 487337, 484466, 482111, 479950, 478139, 477213, 476990, 476259, 474099, 471056, 468435, 466778, 465611, 464406, 463030, 461366, 459266, 457052, 455435, 454694, 454375, 454003, 453650, 453585, 453840, 454404, 455374, 456564, 457349, 457422, 457384, 458097, 459651, 461484, 463406, 465867, 469162, 472937]
59768D72937L738L521L241K722K073J692J580J266O08K07O72J822K969L764M358
59753E07170M796M790M251L662L593L952M080L611K942K713L034L434L495L220
59739E58743K855K574K433K448K548K604K528K345K082J754J467J392J518J610
59725E88901J436R97M85J44K16P67J440J626J051R7p07j271j759k036j764j001
59709E88622k96kJ11L73O56N51p2q78j360j157k94P38J311J258J010R18O86j58
59691E92017j378k140k018j414r28p51q68j332j958k171j704j177j442k504l604
59676E66628m306m826n315n463n069m428l821l134k367k010k387k985l018k443
59662E15056j887j660j435q90j53N13J072J640K321L095L656L439K221O24m13
$$ y = [472937, 476675, 480196, 483437, 486159, 488232, 489924, 491504, 492770, 493378, 493585, 494257, 496079, 499048, 502812, 507170, 511966, 516756, 521007, 524669, 528262, 532214, 536294, 539905, 542847, 545560, 548594, 552028, 555523, 558743, 561598, 564172, 566605, 569053, 571601, 574205, 576733, 579078, 581160, 582914, 584381, 585773, 587291, 588901, 590337, 591334, 591819, 591963, 592179, 592946, 594386, 596012, 597063, 597160, 596453, 595182, 593423, 591387, 589623, 588622, 588326, 588324, 588435, 588808, 589464, 590015, 589943, 589065, 587705, 586548, 586254, 586992, 588303, 589561, 590571, 591489, 592175, 592017, 590639, 588499, 586481, 585067, 584139, 583388, 582520, 581188, 579230, 577059, 575355, 574178, 572736, 570232, 566628, 562322, 557496, 552181, 546718, 541649, 537221, 533400, 530266, 527899, 525889, 523502, 520517, 517499, 515056, 513169, 511509, 510074, 509184, 509031, 509544, 510616, 512256, 514577, 517672, 521328, 524767, 526988, 527612, 527199]
59647E27199o63p19j081j648k183k753l498m352n143n624n342m054k380j448j585
59632D84726j904j548q02m72o93j022j268j612k049k393k694l103l417l326l032
59617D55391l091l597m086m194l967l474k653j619o82Q3P67J174R24J87k52Q9
59601D31000Q85J628K213K597K477J839J402J813K604K635J638O02N26J231J767
59586D56857J634J129O72K26m49j280j872j997j921k085k553k833k413j400n33
59571D41182m94j240k094k415k083j353n20J57M10J48l23o02o42p09q87r45p17
59554D26873l00K09Q26J428J790K085K882M273N478N725N364N546O944R224J1650
59539D89997J3717J5262J6364J7089J6946J4812J0009L545k319n911p188o964
$$ y = [527199, 526536, 525817, 524736, 523088, 520905, 518152, 514654, 510302, 505159, 499535, 494193, 490139, 487759, 486311, 484726, 482822, 481274, 480472, 480000, 479307, 478285, 477017, 475405, 473356, 470963, 468269, 465166, 461749, 458423, 455391, 452300, 448703, 444617, 440423, 436456, 432982, 430329, 428710, 428028, 428111, 428878, 430052, 430976, 431163, 430911, 431000, 431885, 433513, 435726, 438323, 440800, 442639, 444041, 445854, 448458, 451093, 452731, 453333, 453859, 455090, 456857, 458491, 459620, 460292, 460518, 460069, 458789, 456917, 454920, 452999, 450914, 448361, 445528, 443115, 441715, 441182, 440688, 439448, 437354, 434939, 432856, 431503, 430983, 431140, 431550, 431698, 431375, 430773, 430131, 429422, 428535, 427590, 426873, 426573, 426782, 427608, 429036, 430826, 432911, 435793, 440066, 445544, 451269, 456633, 462179, 469123, 478347, 489997, 503714, 518976, 535340, 552429, 569375, 584187, 594196, 597741, 595422, 589511, 582323, 575359]
59527E75359n859m278k745j669r45k52M14P77O68N2j126k783m464n614o158o593
59511E34784p372q300q678q105p001o147n742n215m189l119k639k595k358j857
59497D61467j621j769j737j156l74J58L89L75Q9j73J57J028J567J259P57R19J616
59480D62951K175K516L029L622L792L574L504L693L576K786J609M89l27o24k88
59465D96077K49K72k85n90J40J832L834N494O368O357N955N895O297O530O209
59450E50634N796N815N924N365M050K575J286n7j695l416m887o014o776o962o374
59435E45264n164l817k772k130j707j313r02m79J19J210K963N124P154Q602R412
59420E61564R982J0941J2754J5282J7825J9702K0850K1706K2437K2409K0431J5604
$$ y = [575359, 569500, 565222, 562477, 560808, 559863, 559611, 560025, 560802, 561470, 561522, 560396, 557613, 553149, 547535, 541377, 534784, 527412, 519112, 510434, 502329, 495328, 489181, 483439, 478224, 474035, 470916, 468277, 465682, 463324, 461467, 459846, 458077, 456340, 455184, 454810, 454968, 455357, 455732, 455821, 455648, 455805, 456833, 458400, 459659, 460416, 461335, 462951, 465126, 467642, 470671, 474293, 478085, 481659, 485163, 488856, 492432, 495218, 496827, 497316, 496989, 496365, 496077, 496326, 496598, 496313, 495723, 495863, 497695, 501529, 507023, 513391, 519748, 525703, 531598, 537895, 544425, 550634, 556430, 562245, 568169, 573534, 577584, 580159, 581445, 581388, 579693, 576277, 571390, 565376, 558600, 551638, 545264, 540100, 536283, 533511, 531381, 529674, 528361, 527459, 526980, 527099, 528309, 531272, 536396, 543550, 552152, 561564, 571546, 582487, 595241, 610523, 628348, 648050, 668900, 690606, 713043, 735452, 755883, 771487]
59408G71487P990j168r704j5250j6431j3807r418n099j224K585N835O909M556
59395G27261q07p538j3958j8759k0985k0449j8121j5373j2760r983o973m354k632
59382E74569j559o34J83O59Q03Q18P45N38M32Q26J776K803L310L133K634K239
59366E93275J984J584J040Q13J209J786J941J896K497L973N532O432O841P340
59352F38143Q115R162J0695J2691J4361J4829J4238J3481J2942J2164J0843R412
59340G81076Q310P198N363K665l43l063n300p063q247q709q617q519q857r489
59326G36405r917r996j0079j0339j0376r820q960q332p898p236o336n620n202
59313F26294m778m326m261m603m614l624j830J18J991L982O131Q138R649J0319
$$ y = [771487, 779477, 778309, 768605, 753355, 736924, 723117, 713699, 708600, 707376, 709961, 715796, 722705, 727261, 726454, 718916, 704958, 686199, 665214, 644765, 626644, 611271, 598511, 588528, 581555, 577201, 574569, 573010, 572376, 572559, 573218, 574021, 574839, 575584, 576122, 576554, 577380, 579156, 581959, 585269, 588402, 591036, 593275, 595259, 596843, 597883, 598696, 599905, 601691, 603632, 605528, 608025, 611998, 617530, 623962, 630803, 638143, 646258, 655420, 666115, 678806, 693167, 707996, 722234, 735715, 748657, 760821, 771664, 781076, 789386, 796584, 801947, 804612, 804269, 801206, 795906, 788843, 780596, 771887, 763270, 754751, 745894, 736405, 726488, 716492, 706413, 696074, 685698, 675878, 666918, 658586, 650688, 643452, 637116, 631496, 626294, 621516, 617190, 612929, 608326, 603712, 600088, 598258, 598376, 600367, 604349, 610480, 618618, 628267, 638586]
59299F38586R673P276L126k192p766j2597j5825j7029j6390j4526j2156r885q013
59286E42282o452m914l360k079j308r05m43N29K226M362O112O860P029P625Q817
59271E66381R611R257Q350P922Q072Q172P972P555O528M335J412r40k068k533
59257F40026l026l509l837m278m889n050m334l354k965l008k548j229L52J499
59243E99850K011K047K007K548M019N751O507N853M623L776L390L022K500J769
59229F49673M47j730m091n416n324m779m916n814o711p062o864o253n294m296
59215E81570l732l708l833l831l905m291m738m816m535m258m127l920l439k767
59201E25670k116j636j284p56K63J547K331K278K042K396L048L123K650K604L438
$$ y = [638586, 648259, 655535, 658661, 656469, 648703, 636106, 620281, 603252, 586862, 572336, 560180, 550295, 542282, 535830, 530916, 527556, 525477, 524169, 523264, 522821, 523350, 525576, 529938, 536050, 542910, 549939, 557564, 566381, 575992, 585249, 593599, 601521, 609593, 617765, 625737, 633292, 639820, 644155, 645567, 644627, 642559, 640026, 637000, 633491, 629654, 625376, 620487, 615437, 611103, 607749, 604784, 601776, 599228, 597999, 598351, 599850, 601861, 603908, 605915, 608463, 612482, 618233, 624740, 630593, 635216, 638992, 642382, 645404, 647904, 649673, 650120, 648390, 644299, 638883, 633559, 628780, 623864, 618050, 611339, 604277, 597413, 591160, 585866, 581570, 577838, 574130, 570297, 566466, 562561, 558270, 553532, 548716, 544181, 539923, 535796, 531876, 528437, 525670, 523554, 521918, 520634, 519878, 520141, 521688, 524019, 526297, 528339, 530735, 533783, 536906, 539556, 542160, 545598]
59186E45598M496N124N415N447M818L623K969L575M548M592L882L576L950M244
59172F05857M202M447N158N654N608N527N561M943L292J487M37l06j668l418m467
59157F42314m610m838n920p412q408q610q409q261q289q241p757o801n791n101
59143E43866m633m174l990m533n565o196n955n292m780m299l443k333j486j043
59129D86144o99l41k34l94l07M69J751L059M213N282O185O814P417Q359R476J0151
59113E47345J0126R863R856J0040J0097R948R628R013Q042P059O428O014N326
59100F58785M157K777J611J009R99J037L04j285k656k761j925j386j685k254k533
59085F54194k618k702k714k802l467m776o076o818p151p357p323o964o542o167
$$ y = [545598, 550094, 555218, 560633, 566080, 570898, 574521, 577490, 581065, 585613, 590205, 594087, 597663, 601613, 605857, 610059, 614506, 619664, 625318, 630926, 636453, 642014, 646957, 650249, 651736, 652173, 651867, 650199, 646781, 642314, 637704, 632866, 626946, 619534, 611126, 602516, 594107, 585846, 577557, 569316, 561559, 554758, 548967, 543866, 539233, 535059, 531069, 526536, 520971, 514775, 508820, 503528, 498748, 494449, 491006, 488673, 487187, 486144, 485445, 485104, 484870, 484476, 484169, 484638, 486389, 489448, 493661, 498943, 505128, 511942, 519359, 527718, 537194, 547345, 557471, 567334, 577190, 587230, 597327, 607275, 616903, 625916, 633958, 641017, 647445, 653459, 658785, 662942, 665719, 667330, 668339, 669338, 670375, 670679, 669394, 666738, 663977, 662052, 660666, 658981, 656727, 654194, 651576, 648874, 646160, 643358, 639891, 635115, 629039, 622221, 615070, 607713, 600390, 593426, 586884, 580717]
59071E80717n563m752m336m562m685l986k912k441k672k893k737k508k496k724
59057E31450l271m144m845m707l721k590j934j937k430k860k425r37O16J095O59
59042D98019L70N22L90l01p62l69M07Q08Q23R01J208J734K601L762M810N561O430
59025E26914P801R341J0436J0960J1174J1146J0747R971Q857P315N460L854K918
59012F36894K296J278k34j608k280k260j880j378q15j60O09J407K030K390K559
58997F38848K526K151J534J136J260J636J775J506Q44l20j909l287l764l433k956
58982F37547k579j930q85%L11N59J662L863O440Q369R040Q549P706P585Q597R890
58966G04724J0116Q925P379O682O809O815O180N266M426L348J650l67k094l509
$$ y = [580717, 575154, 570402, 566066, 561504, 556819, 552833, 549921, 547480, 544808, 541915, 539178, 536670, 534174, 531450, 528179, 524035, 519190, 514483, 510762, 508172, 506238, 504301, 501871, 499011, 496586, 495649, 496265, 497360, 498019, 498389, 498911, 499301, 499000, 498238, 497869, 498276, 499084, 499907, 500808, 502016, 503750, 506351, 510113, 514923, 520484, 526914, 534715, 544056, 554492, 565452, 576626, 587772, 598519, 608490, 617347, 624662, 630122, 633976, 636894, 639190, 640468, 640234, 638626, 636346, 634086, 632206, 630828, 630013, 629853, 630462, 631869, 633899, 636289, 638848, 641374, 643525, 645059, 646195, 647455, 649091, 650866, 652372, 653216, 652896, 650987, 647700, 643936, 640503, 637547, 634968, 633038, 632153, 632153, 632464, 633023, 634685, 638548, 644988, 653357, 662397, 670946, 678652, 686237, 694834, 704724, 714840, 723765, 731144, 737826, 744635, 751450, 757630, 762896, 767322, 770670, 772320, 771953, 769859, 766350]
58952G66350n160p324r583j1356j2435j2982j3228j3239j2794j1569r704q005
58940F38971p134o706n780m287l228l233l612l311k281j303q66q51j092j573k017
58925E91697j994j520j137j202j453j463j211r77q28n36j2M00K82k71o08k13P21
58908E79675J632K401L460N041O764Q141R203J0351J1708J2860J3191J2454J1156
58895F88037J0354J0748J1947J2995J3579J4190J5048J5662J5756J5858J6305
58884H40479J6287J4709J1634Q084M693J433j554l806n392o994q868j0423j1050
58871H49232j0943j0730j0752j0894j0733r787p985o016m788m435m347m202m374
58858G49246n176o344p516q594r321r235q456p944q314q855q509p459o883p286
$$ y = [766350, 761190, 753866, 744283, 732927, 720492, 707510, 694282, 681043, 668249, 656680, 646976, 638971, 631837, 625131, 619351, 615064, 611836, 608603, 604991, 601680, 599399, 598096, 597230, 596379, 595287, 593714, 591697, 589703, 588183, 587046, 585844, 584391, 582928, 581717, 580740, 579912, 579376, 579364, 579764, 580046, 579775, 579167, 578954, 579675, 581307, 583708, 587168, 592209, 598973, 607114, 616317, 626668, 638376, 651236, 664427, 676881, 688037, 698391, 709139, 721086, 734081, 747660, 761850, 776898, 792560, 808316, 824174, 840479, 856766, 871475, 883109, 891193, 895886, 897319, 895765, 891959, 886567, 879573, 870705, 860282, 849232, 838289, 827559, 816807, 805913, 795180, 785393, 777408, 771392, 766604, 762169, 757822, 753620, 749246, 744070, 737726, 730210, 721616, 712295, 703060, 694604, 686660, 678346, 669491, 660982, 653523, 646640, 639354]
58844F39354p856p683o903o341o385o674o677o283n759n309m790l934k807j872
58830E60081j502j549j520j083l29L95Q54J197J838K888L766L760K971K322K418
58815E76507K831K852K462K141K012J772J318Q24K78n34j443j866j560j109j370
58800E85115k639m400n738n981n230m373m279m872n219m637l431k380j816j450
58786E28670q40K40J740L307M435M918N119N554O217O638O600O411O375O232N407
58771E97023L640J190j522m179o496q170r015r095q669q003p293o602n875n078
58757E21856m306l660l020k112r38M1L53P1k05P5R66K065K821K890K425K026K248
58740E23596L034L782M011L860L916M612N863P137P839P764P220O664O287N976
$$ y = [639354, 631498, 623815, 616912, 610571, 604186, 597512, 590835, 584552, 578793, 573484, 568694, 564760, 561953, 560081, 558579, 557030, 555510, 554427, 554098, 554493, 555347, 556544, 558382, 561270, 565036, 568796, 571767, 574089, 576507, 579338, 582190, 584652, 586793, 588805, 590577, 591895, 592719, 592997, 592463, 591020, 589154, 587594, 586485, 585115, 582476, 578076, 572338, 566357, 561127, 556754, 552475, 547603, 542384, 537747, 534316, 531936, 530120, 528670, 527830, 528070, 529810, 533117, 537552, 542470, 547589, 553143, 559360, 565998, 572598, 579009, 585384, 591616, 597023, 600663, 601853, 600331, 596152, 589656, 581486, 572471, 563376, 554707, 546704, 539411, 532809, 526934, 521856, 517550, 513890, 510870, 508758, 507820, 507861, 508214, 508285, 508080, 508155, 509121, 511186, 514007, 516897, 519322, 521348, 523596, 526630, 530412, 534423, 538283, 542199, 546811, 552674, 559811, 567650, 575414, 582634, 589298, 595585, 601561]
58726F01561N638N298M895M215L178K047J276J201J906L162M461N276N466N360
58712F54940N324N361N129M275K709O81j377l186m863o629q401r897j1111j2265
58698F20690j3315j3872j3837j3610j3405j2856j1664j0229r120q222p035n646
58686D87879m675m311m059l567l070k783k434j740r62n48n26n12j25Q88K661M935
58670D67051O972Q147Q642R227J0429J2079J3640J4690J5042J4614J3316J0982
58658F04831P556L377p74m179o613q218r067r126q602q000p739p807p824p351
58644E30464o211m667l278k442k164k374l073l935m033k707o79M78K68n5P77K242
58628D98611K743J685Nj197j678j567q67K04J070J540K183L443M819N517N467
$$ y = [601561, 607199, 612497, 617392, 621607, 624785, 626832, 628108, 629309, 631215, 634377, 638838, 644114, 649580, 654940, 660264, 665625, 670754, 675029, 677738, 678419, 677042, 673856, 668993, 662364, 653963, 644066, 632955, 620690, 607375, 593503, 579666, 566056, 552651, 539795, 528131, 517902, 508782, 500560, 493525, 487879, 483204, 478893, 474834, 471267, 468197, 465414, 462980, 461240, 460278, 459730, 459204, 458692, 458567, 459455, 462116, 467051, 474023, 482170, 490812, 500039, 510468, 522547, 536187, 550877, 565919, 580533, 593849, 604831, 612387, 615764, 614990, 610811, 604198, 595980, 586913, 577787, 569185, 561185, 553446, 545639, 537815, 530464, 524253, 519586, 516308, 513866, 511702, 509328, 506255, 502320, 498287, 495580, 494901, 495379, 495647, 495592, 496369, 498611, 501354, 503039, 503044, 501847, 500169, 498602, 497735, 497939, 499009, 500549, 502732, 506175, 510994, 516511, 521978]
58613E21978N081M369L129J835J311J461J177j16j592k168j845j339r16l32K82
58598E32315L44l59j350k031k185j843j097j34Q43J770K600L083L122L358M719
58583E43155P163R359J0087R551Q921Q808Q725P981O561N087M277M565N842P482
58569F47564Q866J0026J1534J3629J5785J7310J8189J8982K0085K1256K1850K1291
58557H46367J9383J6445J3187J0274P874N636L158M73j839l116l331l368m289
58544I06854o216q322j0008j1671j3759j5661j6310j5830j5545j6133j6683j6069
58532G44647j4506j2978j1775j0483r058p862o701m899k549p78l72p64r17o45
58518F60360n11q42j454k137k824l278l150k452j716j502j814k121j981j627j738
$$ y = [521978, 527059, 531428, 534557, 536392, 537703, 539164, 540341, 540225, 538633, 536465, 534620, 533281, 532365, 532033, 532315, 532659, 532300, 530950, 528919, 526734, 524891, 523794, 523660, 524503, 526273, 528873, 531956, 535078, 538436, 543155, 550318, 559677, 569764, 579315, 588236, 597044, 605769, 613750, 620311, 625398, 629675, 634240, 640082, 647564, 656430, 666456, 677990, 691619, 707404, 724714, 742903, 761885, 781970, 803226, 825076, 846367, 865750, 882195, 895382, 905656, 913530, 919166, 922324, 922797, 920958, 917842, 914511, 911143, 906854, 900638, 892316, 882308, 870637, 856878, 841217, 824907, 809077, 793532, 777399, 760716, 744647, 730141, 717163, 705388, 694905, 685847, 677985, 671284, 666385, 663836, 663058, 662686, 661922, 661005, 660360, 659849, 659007, 657553, 655416, 652592, 649314, 646164, 643712, 641996, 640494, 638680, 636559, 634578, 632951, 631213]
58503F31213k407k685j646Q6P31m64k159k578j618n29O2O98J778K750L015K886
58487F29133L097L842M857O086P675R406J0658J1128J1208J1482J1971J2042J1086
58474G43671R131O704M201J607j047l325m744n434n996o697p073o508n020l242
58460G16228j758n93O67K317M151N711O872P939Q991R421Q529O432L931J532q78
58445G79492l249m907n277m732m217m123m019l377k219r19K26J038J399J397J463
58430G47976K089L326M742N881O667P213P418P035O105N009L946K659R01j092
58416H09875k879m329n509o249o329o043o012o356o525o136n420m615l479j929
58402G38065o12j72j86M30J919L317L725L411L264L666M301M847N269N481N203
$$ y = [631213, 628806, 626121, 624475, 624561, 625292, 624828, 622669, 620091, 618473, 617944, 618006, 618704, 620482, 623232, 626247, 629133, 632230, 636072, 640929, 647015, 654690, 664096, 674754, 685882, 697090, 708572, 720543, 732585, 743671, 752802, 759506, 763707, 765314, 764267, 760942, 756198, 750764, 744768, 738071, 730998, 724490, 719470, 716228, 714470, 713877, 714544, 716861, 721012, 726723, 733595, 741534, 750525, 759946, 768475, 774907, 778838, 780370, 779492, 776243, 771336, 766059, 761327, 757110, 752987, 748968, 745591, 743372, 742453, 742679, 743717, 745116, 746513, 747976, 750065, 753391, 758133, 764014, 770681, 777894, 785312, 792347, 798452, 803461, 807407, 810066, 810967, 809875, 806996, 802667, 797158, 790909, 784580, 778537, 772525, 766169, 759644, 753508, 748088, 743473, 739994, 738065, 737453, 737281, 737095, 737525, 739444, 742761, 746486, 749897, 753161, 756827, 761128, 765975, 771244, 776725, 781928]
58387G81928M373L410K840K829L259M056N132O115O605O794P352Q423R152Q732
58373H61000P594O955P199P478P058O379O309O883P391P447P374P594Q143Q825
58359I63629R419R658R303Q354P013N469L966K936K655K784K653K152J946K616
58345A034553L934N223O182P042Q059R220J0360J1382J2256J3005J3688J4264
58333A149168J4516J4224J3485J2702J2178J1745J0924R449P627O095N236M901
58321A272250M753M761N139N877O577O909P067P536Q480R643J0780J1927J3051
58308A374750J3775J3787J3452J3539J4306J5181J5542J5470J5493J5838J6340
58297A537473J6902J7578J8260J8706J8903J9017J9032J8870J8931J9862K1684
$$ y = [781928, 786301, 789711, 792551, 795380, 798639, 802695, 807827, 813942, 820547, 827341, 834693, 843116, 852268, 861000, 868594, 875549, 882748, 890226, 897284, 903663, 909972, 916855, 924246, 931693, 939067, 946661, 954804, 963629, 973048, 982706, 992009, 1000363, 1007376, 1012845, 1016811, 1019747, 1022402, 1025186, 1027839, 1029991, 1031937, 1034553, 1038487, 1043710, 1049892, 1056934, 1064993, 1074213, 1084573, 1095955, 1108211, 1121216, 1134904, 1149168, 1163684, 1177908, 1191393, 1204095, 1216273, 1228018, 1238942, 1248391, 1256018, 1262113, 1267349, 1272250, 1277003, 1281764, 1286903, 1292780, 1299357, 1306266, 1313333, 1320869, 1329349, 1338992, 1349772, 1361699, 1374750, 1388525, 1402312, 1415764, 1429303, 1443609, 1458790, 1474332, 1489802, 1505295, 1521133, 1537473, 1554375, 1571953, 1590213, 1608919, 1627822, 1646839, 1665871, 1684741, 1703672, 1723534, 1745218]
58286A745218K3658K5288K6843K8511K9722K9986K9906L0528L1915L3191L3908
58275B068674L4561L5613L6798L7702L8380L9141M0174M1673M3855M6509M8982
58264B512062N0938N2800N5078N7618N9870O1612O2955O3838O4106O4037O4432
58253C169346O5936O8475P1439P4351P7326Q0883Q5339R0484R5931J01596J07578
58242D088684J13728J19788J25959J32833J40620J48889J57176J65509J74224
58233E367410J83716J94487K06896K20671K35225K50650K67738K86850L07534
58224G521177L29668L54006L81020M10177M41341M75997N15965N61600O12516
58215A1603467O69392P33709Q06408Q88470R82385J091184J216410J359363J524416
$$ y = [1745218, 1768876, 1794164, 1821007, 1849518, 1879240, 1909226, 1939132, 1969660, 2001575, 2034766, 2068674, 2103235, 2138848, 2175646, 2213348, 2251728, 2290869, 2331043, 2372716, 2416571, 2463080, 2512062, 2563000, 2615800, 2670878, 2728496, 2788366, 2849978, 2912933, 2976771, 3040877, 3104914, 3169346, 3235282, 3303757, 3375196, 3449547, 3526873, 3607756, 3693095, 3783579, 3879510, 3981106, 4088684, 4202412, 4322200, 4448159, 4580992, 4721612, 4870501, 5027677, 5193186, 5367410, 5551126, 5745613, 5952509, 6173180, 6408405, 6659055, 6926793, 7213643, 7521177, 7850845, 8204851, 8585871, 8996048, 9437389, 9913386, 10429351, 10990951, 11603467, 12272859, 13006568, 13812976, 14701446, 15683831, 16775015, 17991425, 19350788, 20875204]
58206B0875204J719104J951181K229042K566460K984269L505176M147573M924258
58198D4902267N844792O919480Q166583R621033J1339734J3405948J5932246J9032701
58190A35164784K2727830K6816130L0829584L4141004L6113535L6114986L3425982
58183C55333835K7327626J7558979M878968q831786k1198709l0335172l5491068
58176C09242673l7013394l5841269l2996382k9322245k5427871k1703241j8351189
58169A08587082j5438468j2955468j0860351r101920p631458o408164n397128
58162D0794125m565147l881200l319356k858223k478099k161254j894628j669809
58154A7966409j479950j318114j178416j056864r50438q56399p72770o98488o32469
$$ y = [20875204, 22594308, 24545489, 26774531, 29340991, 32325260, 35830436, 39978009, 44902267, 50747059, 57666539, 65833122, 75454155, 86793889, 100199837, 116132083, 135164784, 157892614, 184708744, 215538328, 249679332, 285792867, 321907853, 355333835, 382661461, 400220440, 405099408, 396267622, 375068913, 344733741, 309242673, 272229279, 236388010, 203391628, 174069383, 148641512, 126938271, 108587082, 93148614, 80193146, 69332795, 60230875, 52599417, 46191253, 40794125, 36228978, 32347778, 29028422, 26170199, 23692100, 21530846, 19636218, 17966409, 16486459, 15168345, 13989929, 12933065, 11982627, 11126228, 10353458, 9654970, 9022501]
58145I022501n73179n19340m70580m27134l89333l57382l31008l09117k90167
58136E355261k73029k57155k42034k27032k11946j97260j83574j71028j59310
58127C432893j48049j37128j26963j18326j11518j05767r9911r3692q7851q2873
58117B320815p8305p3662o9336o6038o3633o1261n8529n5969n4168n2928n1617
58106A635369n0011m8396m6903m5207m3056m0806l9057l7843l6578l4808l2736
58095A179968l0795k9079k7531k6247k5213k3878k1652j8801j6333j4893j4188
58084I31358j3648j3150j2885j2964j3461j4493j5870j6926j7176j6905j6796
58073G67084j7082j7422j7443j6990j5900j4118j2092j0682j0318j0505j0385
$$ y = [9022501, 8449322, 7929982, 7459402, 7032268, 6642935, 6285553, 5954545, 5645428, 5355261, 5082232, 4825077, 4583043, 4356011, 4144065, 3946805, 3763231, 3592203, 3432893, 3284844, 3147716, 3020753, 2902427, 2790909, 2685142, 2585231, 2491539, 2403688, 2320815, 2242510, 2168848, 2099512, 2033474, 1969841, 1908580, 1850051, 1794082, 1739914, 1686986, 1635369, 1585358, 1536962, 1490059, 1444852, 1401796, 1360990, 1321933, 1284090, 1247512, 1212704, 1179968, 1149173, 1120094, 1092563, 1066316, 1041103, 1017225, 995573, 976772, 960439, 945546, 931358, 917710, 904560, 891675, 878711, 865250, 850757, 834887, 817961, 800785, 783880, 767084, 750002, 732580, 715137, 698147, 682247, 668129, 656037, 645355, 635037, 624532, 614147]
58062F14147r653q706p971p436o929o608o822p519q107q167q047q361r011r154
58048E01656q283o855n648m905m480m474n175o462p717q333q061o992n599m660
58034D14012m641n051m924m108l607m334n907p121p360p075o889o734o164n167
58020C34930m277l838l516k789j759j135j357k058k540k495k058j415p72n66j151
58005C03204k254l090l155k638k027j641j616j992k584l046l199l104k756j988
57991B68114q27M19J538K587L443L644L021K130J592J246M14j068k574l404l426
57976B76849l007k641k690l084l239k607j346k13K35O8l64p73q54l20O94J611
57960B58319K027K153K279K113J075p39k389l061k973k981l400l611k961j746
$$ y = [614147, 604494, 595788, 587817, 580381, 573452, 566844, 560022, 552503, 544396, 536229, 528182, 519821, 510810, 501656, 493373, 486518, 480870, 475965, 471485, 467011, 461836, 455374, 447657, 439324, 431263, 424271, 418672, 414012, 409371, 404320, 399396, 395288, 391681, 387347, 381440, 374319, 366959, 359884, 352995, 346261, 340097, 334930, 330653, 326815, 323299, 320510, 318751, 317616, 316259, 314201, 311661, 309166, 307108, 305693, 304921, 304355, 303204, 300950, 297860, 294705, 292067, 290040, 288399, 286783, 284791, 282207, 279161, 275962, 272858, 270102, 268114, 267287, 267706, 269244, 271831, 275274, 278918, 281939, 284069, 285661, 286907, 287321, 286253, 283679, 280275, 276849, 273842, 271201, 268511, 265427, 262188, 259581, 258235, 258022, 258257, 258325, 257961, 257188, 256334, 256014, 256708, 258319, 260346, 262499, 264778, 266891, 267966, 267227, 264838, 261777, 258804, 255823, 252423, 248812, 245851, 244105]
57946B44105q86o90m56N25K045L424M498N573O588P079P055P194P844Q397Q070
57931C10365O866N269L394J092j360l386m951o591q440r821j0141r744r468r607
57917B53477r669r059p622n631l560j899q81l46M4M92J125K084L235L934L613
57902B29337K677K186K475K631J852Q00P83J919K948L004K619K633K911K813K374
57887B63962K226K581K958K881K234J069l61j376j443j042j306k614m135n038
57873B60596n440n768n836n178l933k721j898j453j364j482j263k81J064J964
57859B27007K274K573L174L777M184M612N031M879L965L015K748K789K257J114
57845B73399K53J72L16o0q82j494j536j214p95k98K72O89P60O66P86J157J329
$$ y = [244105, 243219, 242529, 242073, 242598, 244643, 248067, 252565, 258138, 264726, 271805, 278860, 286054, 293898, 302295, 310365, 317231, 322500, 325894, 326986, 325626, 322240, 317289, 310698, 302258, 292437, 282296, 272552, 263084, 253477, 243808, 234749, 227127, 221496, 217936, 216037, 215156, 214810, 214854, 215346, 216471, 218555, 221790, 225724, 229337, 232014, 234200, 236675, 239306, 241158, 241958, 242741, 244660, 247608, 250612, 253231, 255864, 258775, 261588, 263962, 266188, 268769, 271727, 274608, 276842, 277911, 277550, 276174, 274731, 273689, 272383, 269769, 265634, 260596, 255156, 249388, 243552, 238374, 234441, 231720, 229822, 228369, 227005, 225523, 224260, 223979, 225043, 227007, 229281, 231854, 235028, 238805, 242989, 247601, 252632, 257511, 261476, 264491, 267239, 270028, 272285, 273399, 273652, 273824, 274140, 274080, 273198, 271704, 270168, 268954, 268159, 267861, 268133, 268822, 269582, 270248, 271034, 272191, 273520]
57828B73520R39J95m35r01j560k456l032k825k109j594j594j846k022k106k229
57813B49945k484l059m277o211q298r638r713q774p467o230n210m529m287m206
57799A65562l662k426j088l71j54K77J028J340P58p0k41K08N95Q37J537K894M213
57782A71237M806M869N071N612O012N776M967M137L818L976L987L272J930N39
57768B30009n70j516k278k489k058j602j830k699l550l926l851l507l120l105
57754A93908l745m569m602l452j824o18J02Q30J631K029J871J671J797J839J203
57739A88071M8q50j110j049r69p37k79rk54o28m81K05Q62J157J204J032N04j25
57721A86592k08M30J166J453J484J593J572J108M70Q5k48r88j898k214j735j016
$$ y = [273520, 274459, 274654, 274219, 273318, 271758, 269302, 266270, 263445, 261336, 259742, 258148, 256302, 254280, 252174, 249945, 247461, 244402, 240125, 233914, 225616, 215978, 206265, 197491, 190024, 183794, 178584, 174055, 169768, 165562, 161900, 159474, 158386, 158015, 157861, 158138, 159166, 160506, 161264, 161194, 160953, 161161, 161756, 162593, 164130, 167024, 171237, 176043, 180912, 185983, 191595, 197607, 203383, 208350, 212487, 216305, 220281, 224268, 227540, 229470, 230009, 229439, 227923, 225645, 223156, 221098, 219496, 217666, 214967, 211417, 207491, 203640, 200133, 197013, 193908, 190163, 185594, 180992, 177540, 175716, 175098, 175200, 176030, 177661, 179690, 181561, 183232, 185029, 186868, 188071, 188119, 187269, 186159, 185110, 184141, 183404, 183125, 183116, 182862, 182234, 181753, 181958, 182820, 183977, 185181, 186213, 186717, 186592, 186384, 186814, 187980, 189433, 190917, 192510, 194082, 195190, 195660, 195745, 195497, 194509, 192611, 190397, 188662, 187646]
57705A87646m50J9J99m78j981l322l687l349l030k905k842k964l277l159k124
57690A54296q33m36j006j575j686j866k257j961m04J499K498K797L650N425P231
57675A65372Q521J0037J2667J6237K0068K4142K8821L3760L7982M0898M2369M1465
57663D82339L6198K5318J0108o202k0652l1782l9118m2505m2255l9339l4855k9571
57651B67684k4174j9554j6327j4233j2435j0469q546p038n947n030m129l324k815
57638A33663k687k666k269j312k25M06M81L70L83N44Q26J133J072K58j005j820
57622A27152j753j423j650k388k883k687k077j560j371j467j656j711j609j611
57608A01306j847j989j639r84n29k96J85R49J327R16K76J26K69oo79r80o47m88
$$ y = [187646, 187196, 187215, 187414, 186936, 184955, 181633, 177946, 174597, 171567, 168662, 165820, 162856, 159579, 156420, 154296, 153463, 153027, 152021, 150446, 148760, 146894, 144637, 142676, 142272, 143771, 146269, 149066, 152716, 158141, 165372, 173893, 183930, 196597, 212834, 232902, 257044, 285865, 319625, 357607, 398505, 440874, 482339, 518537, 543855, 553963, 547761, 527109, 495327, 456209, 413704, 371449, 332110, 297255, 267684, 243510, 223956, 207629, 193396, 180961, 170492, 161946, 154908, 148961, 143931, 139802, 136478, 133663, 130976, 128310, 126041, 124729, 124504, 124910, 125391, 125761, 126144, 126688, 127514, 128647, 129719, 129977, 128972, 127152, 125399, 123976, 122326, 119938, 117055, 114368, 112291, 110731, 109360, 107893, 106237, 104526, 102917, 101306, 99459, 97470, 95831, 94847, 94318, 94022, 94207, 95156, 96483, 97399, 97675, 97801, 98070, 98064, 97385, 96405, 95758, 95270]
57590I5270j269k594l364l095k292j674j496j663j991k180j913j285q20q31r19
57575F7884n57kj04j134k297k664k212j561j029m86M1K41O1j22j35l24r32j565
57557E3103j681j362j083q79l28O41J435J536J150P98N61J59l42m11J84R10J067
57540E5458P57P67J459K138J879P42k90n56m25n62r64j192j189j341j732j951
57524E2998j693j165o76k65K6j32q70j582j381j49J217J833J767J765K156K468
57508E6317K154J381Q19P85J008J234J585K076K249J737R51O50Q89R53L63n66
57492G4585j358j982k551k882k711k070j161j63N31L64o38j516j371n25q8n23
57476E5941j237j583j569j445j243r56p59o96n55k46n4j77l73l65k98m69p72q48
$$ y = [95270, 94001, 91407, 88043, 84948, 82656, 80982, 79486, 77823, 75832, 73652, 71739, 70454, 69634, 68803, 67884, 67327, 67325, 67221, 66087, 63790, 61126, 58914, 57353, 56324, 55838, 55879, 56120, 56181, 56059, 55924, 55600, 54668, 53103, 51422, 50060, 48977, 48098, 47770, 48411, 49846, 51382, 52532, 53330, 53891, 54050, 53708, 53297, 53481, 54391, 55458, 56215, 56982, 58441, 60579, 62458, 63200, 62910, 62354, 61929, 61367, 60403, 59211, 58022, 56681, 54949, 52998, 51305, 50140, 49464, 49199, 49225, 49093, 48223, 46641, 45260, 45111, 46328, 48161, 49928, 51693, 53849, 56317, 58471, 59852, 60671, 61456, 62464, 63698, 65283, 67359, 69608, 71345, 72296, 72946, 73835, 74788, 75151, 74585, 73227, 71245, 68694, 65812, 63101, 61031, 59870, 59707, 60238, 60602, 59964, 58448, 57077, 56552, 56464, 55941, 54704, 53121, 51552, 50107, 48864, 47908, 47149, 46453, 45898, 45652, 45598, 45421, 45048, 44683, 44385, 43916, 43144, 42296]
57458D2296o71o24r10j223j135o71k66k14l35k97j03j2j4K30P44R35L17o90j212
57439C6145j002n32q1N95J476J857J210lq23r03o45m66l18K7N58R33P89J78l21
57420C8674k27R5k10j256k034j679o00J29J50m8j02j43k37j80P8K98L78M59N26
57401C4071L80J31K02O38Q41L00p17j440j317l05J233K625L211K892K214J682
57385D6641J197M27m29p29j44Q78J516J269K92p09r98m03M74P77K19o62j065o96
57367D7855L2N22N96N77P77J063J054P03M77Q36J611K090J768R11L12M22Q99J101
57349F3606R50R67J463J954J764R14J17r9J32L87M97N80P87J203J797K318K366
57332H1703J751P34j81o75p81o88m44Q9R18J598J448L61p68q12L67J703K085J438
$$ y = [42296, 41625, 41001, 40091, 38868, 37733, 37062, 36796, 36582, 36247, 35950, 35847, 35835, 35821, 36051, 36795, 37730, 38047, 37357, 36145, 35143, 34611, 34530, 35125, 36601, 38458, 39668, 39665, 38842, 37939, 37294, 36828, 36510, 36537, 37095, 38028, 38817, 38995, 38674, 38447, 38542, 38332, 37076, 35042, 33363, 32763, 32892, 33042, 32994, 32892, 32749, 32512, 32332, 32410, 32708, 33086, 33545, 34071, 34451, 34582, 34784, 35422, 36263, 36563, 35846, 34406, 33089, 32784, 34017, 36642, 39853, 42745, 44959, 46641, 47838, 48265, 47836, 47107, 46963, 47841, 49357, 50626, 50918, 50209, 49211, 48808, 49282, 50059, 50278, 49616, 48551, 47855, 47887, 48409, 49005, 49582, 50359, 51422, 52476, 53179, 53656, 54492, 56103, 58193, 59961, 60872, 61184, 61606, 62505, 63606, 64556, 65523, 66986, 68940, 70704, 71618, 71735, 71636, 71768, 72155, 72652, 73232, 74019, 75222, 77019, 79337, 81703, 83454, 84188, 84007, 83332, 82551, 81863, 81419, 81508, 82426, 84024, 85472, 85833, 85065, 84253, 84620, 86323, 88408, 89846]
57314H9846N56R2P0J99M21R00J632K232K260J731J144R49J197J712K353K847K736
57297A12877J935J148J243K212L258L884M265M523M262L299K240J855K107K398
57283A51506K505K793L507M377N035N430N690N828N721N320M709M042L530L388
57269B13381L710M297M672M491L960L691L936M257M211M046M335N049N650N957
57255B75643O251O477O222N687N883P231Q768R382R230R169R324R224R005R298
57241C86794R990J0224R824R679J0317J0985J0873J0471J0916J2378J3885J4620
57229E20956J4743J4867J5352J6224J7387J8576J9398J9683J9716J9952K0480
57218G17334K0955K1025K0740K0373J9961J9287J8434J8044J8727K0226K1510
$$ y = [89846, 90402, 90494, 90564, 90763, 91184, 92084, 93716, 95948, 98208, 99939, 101083, 102032, 103229, 104941, 107294, 110141, 112877, 114812, 115960, 117203, 119415, 122673, 126557, 130822, 135345, 139607, 142906, 145146, 147001, 149108, 151506, 154011, 156804, 160311, 164688, 169723, 175153, 180843, 186671, 192392, 197712, 202421, 206463, 209993, 213381, 217091, 221388, 226060, 230551, 234511, 238202, 242138, 246395, 250606, 254652, 258987, 264036, 269686, 275643, 281894, 288371, 294593, 300280, 306163, 313394, 322162, 331544, 340774, 349943, 359267, 368491, 377496, 386794, 396784, 407008, 416832, 426511, 436828, 447813, 458686, 469157, 480073, 492451, 506336, 520956, 535699, 550566, 565918, 582142, 599529, 618105, 637503, 657186, 676902, 696854, 717334, 738289, 759314, 780054, 800427, 820388, 839675, 858109, 876153, 894880, 915106, 936616]
57207I36616K1798K1264K0714K0669K0952K1053K0772K0453K0606K1335K2238
57196A168470K2852K3112K3253K3474K3824K4339K5027K5756K6294K6459K6136
57185A438996K5334K4342K3725K3945K4969K6418K7921K9217L0154L0902L1969
57174A737892L3608L5329L6430L6917L7370L7975L8188L7538L6243L4825L3488
57163B135803L2226L1148L0478L0325L0688L1480L2371L2885L2847L2624L2691
57152B485566L3190L3946L4731L5352L5682L5821L6078L6659L7486L8349L9014
57141B881874L9133L8438L7175L5972L5050L3876L1953K9685K8092K7829K8836
57130C247913L0791L3489L6813M0710M5251N0410N5731O0505O4416O7844P1306
$$ y = [936616, 958414, 979678, 1000392, 1021061, 1042013, 1063066, 1083838, 1104291, 1124897, 1146232, 1168470, 1191322, 1214434, 1237687, 1261161, 1284985, 1309324, 1334351, 1360107, 1386401, 1412860, 1438996, 1464330, 1488672, 1512397, 1536342, 1561311, 1587729, 1615650, 1644867, 1675021, 1705923, 1737892, 1771500, 1806829, 1843259, 1880176, 1917546, 1955521, 1993709, 2031247, 2067490, 2102315, 2135803, 2168029, 2199177, 2229655, 2259980, 2290668, 2322148, 2354519, 2387404, 2420251, 2452875, 2485566, 2518756, 2552702, 2587433, 2622785, 2658467, 2694288, 2730366, 2767025, 2804511, 2842860, 2881874, 2921007, 2959445, 2996620, 3032592, 3067642, 3101518, 3133471, 3163156, 3191248, 3219077, 3247913, 3278704, 3312193, 3349006, 3389716, 3434967, 3485377, 3541108, 3601613, 3666029, 3733873, 3805179]
57119C805179P4652P7055P8024P8353P9844Q4011R1332J01831J15882J33881J55447
57108D875491J79672K06320K36281K71100L12848L64613M30248N13321O17049
57099H006943P45707R05286J102030J340549J623218J950226K319087K724408
57091B0717454L158579L612429M075311M534880M973820N360669N641980N752827
57083E7827949N650166N344279M894395M366177L788128L144051K401183J544234
57075H8960562N91502m09039j395569k312141l123018l812956m375584m803249
57067F9320508n087789n227760n232066n117557m905134m617191m275599l900094
57059C0957318l508330l116778k740275k390243k073747j793997j551042j342294
$$ y = [3805179, 3879831, 3956886, 4034910, 4113263, 4193107, 4277118, 4368450, 4470281, 4586163, 4720044, 4875491, 5055163, 5261483, 5497764, 5768864, 6081712, 6446325, 6876573, 7389894, 8006943, 8752650, 9657936, 10759966, 12100515, 13723733, 15673959, 17993046, 20717454, 23876033, 27488462, 31563773, 36098653, 41072473, 46433142, 52075122, 57827949, 63478115, 68822394, 73716789, 78082966, 81871094, 85015145, 87416328, 88960562, 89552064, 89143025, 87747456, 85435315, 82312297, 78499341, 74123757, 69320508, 64232719, 59004959, 53772893, 48655336, 43750202, 39133011, 34857412, 30957318, 27448988, 24332210, 21591935, 19201692, 17127945, 15333948, 13782906, 12440612]
57051A2440612j163809j011951q83782p76126o85185o07596n41352m85225m37628
57042E847958l96338l59219l24910k92915k63184k35602k09910j86005j63898
57033C415977j43139j22610j01458q0131n9990m2210k7920j9465k0284l2463n4311
57022B711996q0546j04719j21736j29317j28200j21110j10887r9283q7330p6228
57012A652640o7179o0499n5386n0706m5854m0909l6336l2552k9660k7577k6327
57001A179655k5926k5890k5355k3946k2233k0923j9992j8987j7832j6703j5418
56990I46450j3606j1380r206p082m523j458J499L769N261N849M986K162k516q387
56976I11818j4474j9578k2653k3519k2914k1601j9765j7387j4746j2135r470o575
$$ y = [12440612, 11276803, 10264852, 9381070, 8604944, 7919759, 7312163, 6770811, 6285586, 5847958, 5451620, 5092401, 4767491, 4474576, 4211392, 3975790, 3765880, 3579875, 3415977, 3272838, 3150228, 3048770, 2968639, 2908649, 2866439, 2838519, 2819054, 2798770, 2766307, 2711996, 2631450, 2526731, 2404995, 2275678, 2147478, 2026368, 1915481, 1816198, 1728868, 1652640, 1585461, 1524962, 1469576, 1418870, 1373016, 1332107, 1295771, 1263219, 1233559, 1205982, 1179655, 1153729, 1127839, 1102484, 1078538, 1056305, 1035382, 1015390, 996403, 978571, 961868, 946450, 932844, 921464, 912258, 905176, 900653, 899195, 900694, 904463, 909724, 915573, 920559, 922721, 920205, 911818, 897344, 877766, 855113, 831594, 808680, 787079, 767314, 749927, 735181, 723046, 713576, 707001]
56964G07001l625q57J865M872Q165J1443J4441J6923J8471J8557J6767J2774O399
56951H33196j952j1031j9284k5541k9120k9651k7406k3572j9572j6017j2641r192
56939F08217n853k742M84M239Q570J3265J8124K2841K6859K9509L0104K7761K1527
56926H02905J1247j604j4343k4597l1458l5232l6424l5331l2476k8919k5653k2846
56914E25269j9943j6576j3140j0496r188q997r044q383o810n055l950l416k640
56901D07631j288%N56O45J105K292L766M931N637O222P223Q957J1224J3518J5657
56886D88076J7908K0305K2079K2046J9413J4103O664j766r616j5488j8654j9086
56874E45984j7268j4165j0793p478l794N07M999R365J4001J9326K5018L0632L6474
$$ y = [707001, 703376, 702519, 704384, 709256, 717421, 728864, 743305, 760228, 778699, 797256, 814023, 826797, 833196, 831244, 820213, 800929, 775388, 746268, 716617, 689211, 665639, 646067, 630050, 617409, 608217, 602364, 599622, 600106, 604345, 612915, 626180, 644304, 667145, 694004, 723513, 753617, 781378, 802905, 814152, 812548, 798205, 773608, 742150, 706918, 670494, 635163, 602687, 573768, 548115, 525269, 505326, 488750, 475610, 465114, 455926, 446929, 437885, 429502, 422692, 417637, 413687, 410271, 407631, 406343, 406343, 406899, 407544, 408649, 410941, 414707, 419638, 425275, 431497, 438720, 447677, 458901, 472419, 488076, 505984, 526289, 548368, 570414, 589827, 603930, 610594, 608828, 599212, 583724, 565070, 545984, 528716, 514551, 503758, 496280, 492486, 492993, 497992, 507357, 521358, 540684, 565702, 596334, 632808]
56861F32808M2929M9268N3997N6057N4739M8768L6859J9573k48j9034l3953m3223
56849H98540m6402m4766m0416l4527k7235j9042j1062l459M909J4616K4698L4363
56837G50217M4490N6194O8745Q0104Q8738R3570R2626Q3266O4039L5913K266l1553
56825A428615n9569p7959q6819q8605q5192p7390o6604n4959m3598l2288k1094
56814G34538j0922j825P773J9095L1184M2022N0805N8054O3708O5956O1896M9229
56802A171513K7964J218k5879m8679o4692p3353p5200p1746o5173n7181m8332
56791F70460l8971l0112k2633j6125r490k443M490J1141J7836K4338K9553L2563
56779F70607L3117L0848K4813J4497R46j3483k6364l6072m2024m4498m4252m2004
$$ y = [632808, 675737, 725005, 779002, 835059, 889798, 938566, 975425, 994998, 994750, 975716, 941763, 898540, 852138, 807372, 766956, 732429, 705194, 686152, 675090, 671631, 676540, 691156, 715854, 750217, 794707, 850901, 919646, 999750, 1088488, 1182058, 1274684, 1357950, 1421989, 1457902, 1460168, 1428615, 1369046, 1291087, 1204268, 1115663, 1030471, 953081, 886477, 831518, 787920, 755632, 734538, 723616, 721791, 729564, 748659, 779843, 821865, 872670, 930724, 994432, 1060388, 1122284, 1171513, 1199477, 1200695, 1174816, 1126137, 1061445, 988092, 912892, 841146, 775973, 718792, 670460, 631489, 601377, 578744, 562619, 553129, 550686, 555176, 566317, 584153, 608491, 638044, 670607, 703724, 734572, 759385, 773882, 774828, 761345, 734981, 698909, 656885, 612387, 568135, 526131]
56767E26131l8327l3878k9412k5387k1768j8356j5203j2579j0756r789r374q896
56755B92406p896o529n340m590m099l713l511l443l196k633k059j772j740j857
56741B40028k212k698k780k119j205q53j178j552j533j284j028o48n4M69O70P52
56725B22775J052J433J410P89r4p66r88o98J05J288K445L051K762J676L52m67
56709B36125l27N41J406J696J453J156J103J255J440J563J483R35j55j335j880
56694B46459j436l51P37J471J884K025J760J059L19R4M58P65L15p21j360q62L91
56677B53007J342J435J058Q32Q60Q97R29J139J403J276O59J22K36P46Q31J91m86
56660B66477l67M97J314J569J441J216P89M1p16j129j405j974k658k779k160j417
$$ y = [526131, 487804, 453926, 424514, 399127, 377359, 359003, 343800, 331221, 320465, 310676, 301302, 292406, 284510, 277981, 272641, 268051, 263952, 260239, 256728, 253285, 250089, 247456, 245397, 243625, 241885, 240028, 237816, 235118, 232338, 230219, 229014, 228161, 226983, 225431, 223898, 222614, 221586, 220938, 220884, 221353, 222023, 222775, 223827, 225260, 226670, 227459, 227365, 226599, 225611, 224913, 225018, 226306, 228751, 231802, 234564, 236240, 236592, 236125, 235798, 236339, 237745, 239441, 240894, 242050, 243153, 244408, 245848, 247411, 248894, 249829, 249674, 248339, 246459, 245023, 244672, 245409, 246880, 248764, 250789, 252549, 253608, 253927, 254021, 254479, 255244, 255559, 254838, 253478, 252616, 253007, 254349, 255784, 256842, 257674, 258534, 259431, 260360, 261499, 262902, 264178, 264837, 264959, 265195, 265941, 266772, 266963, 266477, 266110, 266607, 267921, 269490, 270931, 272147, 272936, 272977, 272261, 271132, 269727, 267753, 265095, 262316, 260156, 258739]
56644B58739j128j230j553k277l294l708k858j587j499k831l946l294j156R36
56630B29314J927J785R35j09p76q17o41p25q68n96j88m51j417k016j485m20N8
56613B23510k90q03r40p14l49p5j73o51r44m95L58P57N38M33P98R57K83o82r78
56594B20540o10m01n51k77R12K377L126K931K230J394N88P1L3K34K60J62M16J144
56576B34579J792J787J235P32O68J015J622K384L091L438L336L104L138L520M082
56561B69523M774N683O702P474P830P996Q151Q057P418O425N508M648L536K329
56547C56054J733J965K286J919R97Q5p18j612k326k423k243k704l950n042n322
56532C38699n362n996o929p118o217m953m081l599l180k822k770l005l180k977
$$ y = [258739, 257611, 256381, 254828, 252551, 249257, 245549, 242691, 241104, 239605, 236774, 232828, 229534, 228378, 229314, 231241, 233026, 233961, 233852, 233076, 232259, 231618, 230893, 230025, 229429, 229241, 228790, 227373, 225357, 223872, 223452, 223510, 223220, 222417, 221477, 220763, 220414, 220339, 220166, 219515, 218571, 218076, 218434, 219191, 219729, 220162, 220960, 221917, 222200, 221518, 220540, 219930, 219529, 218978, 218701, 219613, 221990, 225116, 228047, 230277, 231671, 232259, 232330, 232363, 232597, 232857, 233019, 233435, 234579, 236371, 238158, 239393, 240125, 240793, 241808, 243430, 245814, 248905, 252343, 255679, 258783, 261921, 265441, 269523, 274297, 279980, 286682, 294156, 301986, 309982, 318133, 326190, 333608, 340033, 345541, 350189, 353725, 356054, 357787, 359752, 362038, 363957, 364954, 365039, 364321, 362709, 360383, 357960, 355717, 353013, 349063, 344021, 338699, 333337, 327341, 320412, 313294, 307077, 302124, 298043, 294444, 291264, 288442, 285672, 282667, 279487, 276510]
56518B76510k489k200k539l356l869l435k322j509j624k215k264j297J90J306
56504B48887J603J276P64L41R8J18M83J086J546J446P14j96o38l31L40P52O90
56487B58979M31K10r9n84q90n72K39R25J019N80n2m73l18L94J041Q81n0r62j248
56468B59451j027o56k10K64M73K23k89p97j261j510j096P7J340J967K059K162
56452B61170K283J935J046J81k40l79n60q40j145j403j433r67%J096J840J960
56436B64544J513R03O36P37O53kp62q88l96j7j65n14o25l99J40R09J494J411Q46
56417B70018N56Q11J017P26L87N84J038R79K70m27n14rO55J095J179J048R65J066
56399B81444J280J496J567J205L24m40j09J412K933L232K375J326O54K29J3L61
$$ y = [276510, 274021, 271821, 269282, 265926, 262057, 258622, 256300, 254791, 253167, 250952, 248688, 247391, 247581, 248887, 250490, 251766, 252530, 252871, 252969, 253087, 253570, 254656, 256202, 257648, 258362, 258166, 257528, 257197, 257537, 258289, 258979, 259410, 259620, 259521, 258937, 258047, 257475, 257714, 258639, 259658, 260238, 260186, 259713, 259395, 259789, 260830, 261711, 261661, 260699, 259451, 258424, 257768, 257558, 257822, 258295, 258518, 258229, 257432, 256171, 254661, 253565, 253642, 254982, 256949, 259008, 261170, 263453, 265388, 266434, 266615, 266375, 265996, 265436, 264596, 263451, 262048, 260615, 259648, 259648, 260744, 262584, 264544, 266057, 266960, 267596, 268333, 268986, 268984, 268222, 267334, 266938, 266921, 266756, 266242, 265617, 265218, 265358, 266267, 267761, 269172, 270018, 270574, 271385, 272402, 273128, 273515, 274099, 275137, 276116, 276386, 275959, 275445, 275436, 276091, 277186, 278365, 279413, 280378, 281444, 282724, 284220, 285787, 286992, 287316, 286876, 286767, 288179, 291112, 294344, 296719, 298045, 298699, 298928, 298941, 299302]
56383B99302J376K482K875K278J163L38K71O79Q63N76L04M52O00N7j079j980k148
56366C08409j848j451r08q8P38J141R93N39J18JK71P54J165J411J605J743J636
56349C16229J272R34Q14P41N58M96Q46J388J581J270Q44N62K10l28n41J39J327
56332C28342J929J428M95N2K34O46J211K095K997L245K743K203K224K621K866
56317C55331K737K233J342L25j62K33R68J212R39Q78J491K502L502M464N399N952
56301C89346N736M933M193L922L987M136M427N012N599N586M854M036L780L951
56287D53498L971L766L867M584N574O418P141P947Q761R343R578R463R070Q759
56273E51740R088J0213J1633J2768J3568J4340J5284J6529J8228K0303K2361K4274
$$ y = [299302, 300678, 303160, 306035, 308313, 309476, 309814, 310085, 310764, 311627, 312203, 312507, 312959, 313559, 313616, 312537, 310557, 308409, 306561, 305110, 304202, 304114, 304852, 305993, 306986, 307525, 307643, 307644, 307915, 308669, 309834, 311245, 312850, 314593, 316229, 317501, 318435, 319249, 319990, 320548, 321044, 321890, 323278, 324859, 326129, 326973, 327535, 327745, 327417, 326876, 327015, 328342, 330271, 331699, 332194, 332246, 332480, 333126, 334337, 336432, 339429, 342674, 345417, 347620, 349844, 352465, 355331, 358068, 360301, 361643, 361968, 361806, 362039, 363007, 364219, 365158, 366036, 367527, 370029, 373531, 377995, 383394, 389346, 395082, 400015, 404208, 408130, 412117, 416253, 420680, 425692, 431291, 436877, 441731, 445767, 449547, 453498, 457469, 461235, 465102, 469686, 475260, 481678, 488819, 496766, 505527, 514870, 524448, 533911, 542981, 551740, 560828, 571041, 582674, 595442, 609010, 623350, 638634, 655163, 673391, 693694, 716055, 740329]
56261G40329K6549K9707L3494L7275M1014M5448N1232N8240O5680P2737P9288
56250A280993Q6138R4224J03321J11904J18618J23414J26787J28528J27993J25138
56240B427058J20266J12915J02045Q7422O9985N0697K9851P833j4247l5045n3662
56229B905118o9606q2675r3133j01450j07622j11271j12532j12212j10751j07811
56219A896055j03317r8200r3409q8729q3289p6925p0362o4248n8709n3743m9424
56208A055700m5587m1825l7940l4204l0988k8311k5804k3070k0092j7325j5264
56197G35290j3902j2800j1670j0584r591q521p364o460n940n378m308k917j876
56184F33979j567j760j952j770j212o49m40m08NQ82J514J316P09O28J362K379
$$ y = [740329, 766878, 796585, 830079, 867354, 908368, 953816, 1005048, 1063288, 1128968, 1201705, 1280993, 1367131, 1461355, 1564676, 1676580, 1795198, 1918612, 2045399, 2173927, 2301920, 2427058, 2547324, 2660239, 2762284, 2849706, 2919691, 2970388, 3000239, 3008072, 2993825, 2958780, 2905118, 2835512, 2752837, 2659704, 2558254, 2450632, 2339361, 2226829, 2114617, 2003866, 1896055, 1792738, 1694538, 1601129, 1512400, 1429111, 1352186, 1281824, 1217576, 1158867, 1105124, 1055700, 1010113, 968288, 930348, 896144, 865156, 836845, 811041, 787971, 767879, 750554, 735290, 721388, 708588, 696918, 686334, 676743, 668222, 660858, 654398, 648458, 643080, 638772, 635855, 633979, 632412, 630652, 628700, 626930, 625718, 625069, 624629, 624221, 624226, 625108, 626622, 627938, 628647, 629275, 630637, 633016]
56168F33016L140L596L921M262M845N899P279Q460R035R046Q834Q769R190J0286
56154G29578J1942J3885J5996J8398K1233K4655K8911L4113L9817M5362N0824
56143A034714N7291O5709P5561Q4988R2203R6427R7507R5138Q8996P9529O8234
56132A936297N6994M7257L9738L4437L0630K6961K2040J5192O726k421j1066j8106
56120B184679k2970k6172k9251l3959m1274n1009o2077p2906q1827q7408q8794
56109A587032q5996p9871p1754o2867n3947m5449l7782l1201k5563k0506j5943
56098A056153j2155r307p084m972k801q27O59J693K583L544M492N251N858O508
56084A049595P307Q208R150R984J0316R901R258R364J0429J1513J1805J1709J2107
$$ y = [633016, 636156, 639752, 643673, 647935, 652780, 658679, 665958, 674418, 683453, 692499, 701333, 710102, 719292, 729578, 741520, 755405, 771401, 789799, 811032, 835687, 864598, 898711, 938528, 983890, 1034714, 1092005, 1157714, 1233275, 1318263, 1410466, 1506893, 1604400, 1699538, 1788534, 1868063, 1936297, 1993291, 2040548, 2080286, 2114723, 2145353, 2172314, 2194354, 2209546, 2216272, 2213851, 2202785, 2184679, 2161709, 2135537, 2106286, 2072327, 2031053, 1980044, 1917967, 1845061, 1763234, 1675826, 1587032, 1501036, 1421165, 1349411, 1286544, 1232597, 1187148, 1149366, 1118165, 1092602, 1072096, 1056153, 1043998, 1034691, 1027607, 1022635, 1019834, 1019007, 1019666, 1021359, 1023942, 1027486, 1031978, 1037229, 1043087, 1049595, 1056902, 1065110, 1074260, 1084244, 1094560, 1104461, 1113719, 1123083, 1133512, 1145025, 1156830, 1168539, 1180646]
56071A180646J2987J3670J4047J4670J5637J6333J6477J6528J6835J7092J6992
56060A351914J6795J6821J6850J6520J5907J5385J5177J5275J5563J5855J6129
56049A528191J6765J8120J9911K1477K2683K3885K5003K5541K5709K6505K8284
56038A782074L0093L1093L1721L2764L4010L4830L5360L6276L7719L9358M1113
56027B166411M2918M4184M4492M4555M5495M7272M8871M9944N1254N3353N5898
56016B694647N8502O1376O4684O8013P0963P3788P7041Q0986Q5520R0360R5142
56005C521022R9832J05026J11252J17940J23907J29058J34715J41790J49548J56886
55995D790976J64119J72495J82352J92943K03962K16083K29753K44441K59704
$$ y = [1180646, 1193633, 1207303, 1221350, 1236020, 1251657, 1267990, 1284467, 1300995, 1317830, 1334922, 1351914, 1368709, 1385530, 1402380, 1418900, 1434807, 1450192, 1465369, 1480644, 1496207, 1512062, 1528191, 1544956, 1563076, 1582987, 1604464, 1627147, 1651032, 1676035, 1701576, 1727285, 1753790, 1782074, 1812167, 1843260, 1874981, 1907745, 1941755, 1976585, 2011945, 2048221, 2085940, 2125298, 2166411, 2209329, 2253513, 2298005, 2342560, 2388055, 2435327, 2484198, 2534142, 2585396, 2638749, 2694647, 2753149, 2814525, 2879209, 2947222, 3018185, 3091973, 3169014, 3250000, 3335520, 3425880, 3521022, 3620854, 3725880, 3837132, 3955072, 4078979, 4208037, 4342752, 4484542, 4634090, 4790976, 4955095, 5127590, 5309942, 5502885, 5706847, 5922930, 6152683, 6397124, 6656828]
55986F656828K76291K95467L17551L41811L67629L95253M25416M58797M95988
55977A0031031N37573N84169O36539O95785P63208Q40027R27458J027142J141467
55968A7184399J273765J428649J612166J831979K098144K424296K827516L326233
55960C4007147L937919M677726N557826O589270P789006R188211J0834812J2794527
55952I5376444J5159701J8044704K1517853K5470461K9529478L3122044L5629151
55945B73849836L6430113L4793045K9881700K1166172R074290m718202j7787637
55938C82689317k7986718l4254110l6715748l6220627l3795908l0335294k6508206
55931A56872706k2758290j9329456j6316910j3728465j1530928r676953q120809
$$ y = [6656828, 6933119, 7228586, 7546137, 7887948, 8255577, 8650830, 9076246, 9535043, 10031031, 10568604, 11152773, 11789312, 12485097, 13248305, 14088332, 15015790, 16042932, 17184399, 18458164, 19886813, 21498979, 23330958, 25429102, 27853398, 30680914, 34007147, 37945066, 42622792, 48180618, 54769888, 62558894, 71747105, 82581917, 95376444, 110536145, 128580849, 150098702, 175569163, 205098641, 238220685, 273849836, 310279949, 345072994, 374954694, 396120866, 405195156, 400476954, 382689317, 354702599, 320448489, 283732741, 247512114, 213716206, 183380912, 156872706, 134114416, 114784960, 98468050, 84739585, 73208657, 63531704, 55410895]
55924E5410895o824084n751750m868084m139452l538328l042141k630539k286205
55916B2330312j996501j751894j543866j365582j212878j082701r71314q75004
55908A1530572p91321p18410o54032n96219n44019m96876m54006m14994l80054
55899F480641l49053l21132k95797k73305k53478k35170k17620k01352j86997
55890D146737j74135j61939j50200j38938j27969j17634j09201j03608j00336
55881B962777r8254r6889r6046r4813r2106q7959q3432p9332p5753p2613o9835
55870B015745o7061o3949o0795n8251n6338n4238n1245m7551m4046m1673m0906
55859A429692m1375m1843m1042l8797l6085l3826l1914k9725k7209k5014k3558
$$ y = [55410895, 48586811, 42835061, 37966977, 33827525, 30289197, 27247056, 24616517, 22330312, 20333811, 18581917, 17038051, 15672469, 14459591, 13376890, 12405576, 11530572, 10739251, 10020841, 9366809, 8770590, 8226571, 7729695, 7275689, 6860695, 6480641, 6131588, 5810456, 5514659, 5241354, 4987876, 4752706, 4535086, 4333734, 4146737, 3972602, 3810663, 3660463, 3521525, 3393556, 3275922, 3166721, 3063113, 2962777, 2864523, 2767634, 2671588, 2576775, 2484669, 2396710, 2313278, 2233946, 2158193, 2085580, 2015745, 1948684, 1884735, 1823940, 1765689, 1709351, 1655113, 1603868, 1556317, 1512271, 1470598, 1429692, 1388317, 1346474, 1305432, 1266635, 1230550, 1196724, 1164810, 1135085, 1107876, 1082862, 1059304]
55848A059304k2614k1894k1564k1744k1915k1422k0419j9716j9646j9704j9412
55837H29254j8910j8359j7437j5923j4338j3347j2824j2048j0727r287q224p655
55825F70175p441p367p229p048p153p767q719r719j0660j1394j1578j1125j0434
55812E52541r707q504o505m276k540j156L96J877K662L022L875N250O094N809
55798E48838M979M231L340J867j86k679n521q057r200q767p926p671p596o865
55784D98787n787n394n915o615o918o788o106m422j533K267O531J0788J4296J6200
55770D99391J6047J3756R167K174o455j4842k1023k4176k4813k3941k2316k0313
55758C82656j8187j6175j4304j2380j0354q556p317o450n453m242l190k414j500
$$ y = [1059304, 1036690, 1014796, 993232, 971488, 949573, 928151, 907732, 888016, 868370, 848666, 829254, 810344, 791985, 774548, 758625, 744287, 730940, 718116, 706068, 695341, 686054, 677830, 670175, 662734, 655367, 648138, 641090, 633937, 626170, 617451, 607732, 597072, 585678, 574100, 562975, 552541, 542834, 534330, 527825, 523549, 521009, 519853, 520249, 522126, 524788, 527810, 531685, 536935, 543029, 548838, 553817, 558048, 561388, 563255, 563069, 560390, 554869, 546812, 537612, 528845, 520919, 513248, 505652, 498787, 493000, 487606, 481691, 475076, 468158, 461370, 455264, 450842, 449309, 451576, 458107, 468895, 483191, 499391, 515438, 529194, 538361, 540535, 534080, 519238, 498215, 474039, 449226, 425285, 402969, 382656, 364469, 348294, 333990, 321610, 311256, 302700, 295383, 288933, 283480, 279238, 276048, 273634, 272134]
55745B72134k60P33Q20K19j46K71J090J476R27m13j953l185m034m626m743l936
55729B54374k342r53o58j259j906k262k697l382l805l345k003l18J122J992K372
55714B34930K743L583M759N516N260M175K839J437k82k281l863m348l899l351
55700B47218l275l508l727m082m924o101o948o993o300n136l769k653k265k385
55686A85152j996n31J190J932J804K154L582M997N174M493M182M334L776J975
55672B22218l2j047j246j550k151k500k441k369k247j488o6J109J388J293J632
55657B10503K246K372J904J516J566J608J148L82r1kL16K80m13j478k368k921
55641B16568l525m444n343n779n884o075o295o119n528m965m526l761k446j041
$$ y = [272134, 271874, 272607, 273427, 273646, 273500, 273771, 274861, 276337, 277264, 276851, 274898, 271713, 267679, 263053, 258310, 254374, 252032, 251079, 250421, 249162, 247256, 244994, 242297, 238915, 235110, 231765, 229762, 229444, 230566, 232558, 234930, 237673, 241256, 246015, 251531, 256791, 260966, 263805, 265242, 264960, 262679, 258816, 254468, 250569, 247218, 243943, 240435, 236708, 232626, 227702, 221601, 214653, 207660, 201360, 196224, 192455, 189802, 187537, 185152, 183156, 182625, 183815, 185747, 187551, 189705, 193287, 198284, 203458, 207951, 212133, 216467, 220243, 222218, 222186, 221139, 219893, 218343, 216192, 213692, 211251, 208882, 206635, 205147, 205081, 206190, 207578, 208871, 210503, 212749, 215121, 217025, 218541, 220107, 221715, 222863, 223245, 223154, 223152, 223468, 223748, 223335, 221857, 219489, 216568, 213043, 208599, 203256, 197477, 191593, 185518, 179223, 173104, 167576, 162611, 158085, 154324, 151878, 150837]
55627A50837j42J48K7m19j113j705j792j350p59m72o56j098j429j549j744k134
55611A34650k316j930j380j407j971k203j669r65p78r43q95n69l54l93n18o47
55595A15712q61j080j080p54k16L66Q02Q24K64o97j560j869j564j077r63j287
55579A04960j474r83l6O86R63J182J552J757J572J286J256J428J556J557J427
55564A18689J114O58J54m84j332j962j732p74mP6q8q5k40p87j117o83l1ml77k46
55544A10745M85J046J087J037J133J037O37M15O72J024J038Q39Q02R58J007O62
55528A24624j57j254k201k723k957l107l031k595k200k348k771k746k234j906
55514I2394j982j860j232o35m51k16N16J271J399J168J210J297O69n64j354j169
$$ y = [150837, 150695, 150843, 150870, 150451, 149338, 147633, 145841, 144491, 143732, 143260, 142604, 141506, 140077, 138528, 136784, 134650, 132334, 130404, 129024, 127617, 125646, 123443, 121774, 120809, 120031, 119088, 118193, 117624, 117270, 116877, 116359, 115712, 114851, 113771, 112691, 111937, 111721, 112087, 112889, 113713, 113977, 113280, 111720, 109851, 108287, 107210, 106247, 104960, 103486, 102503, 102467, 103153, 104116, 105298, 106850, 108607, 110179, 111465, 112721, 114149, 115705, 117262, 118689, 119803, 120461, 120615, 120131, 118799, 116837, 115105, 114331, 114327, 114403, 114315, 114230, 113990, 113203, 112086, 111403, 111372, 111368, 110991, 110745, 111230, 112276, 113363, 114400, 115533, 116570, 117207, 117622, 118294, 119318, 120356, 121195, 121997, 122955, 123962, 124624, 124467, 123213, 121012, 118289, 115332, 112225, 109194, 106599, 104399, 102051, 99280, 96534, 94300, 92394, 90412, 88552, 87320, 86685, 86234, 86018, 86534, 87805, 89204, 90372, 91582, 92879, 93548, 92984, 91630, 90461]
55498I0461o23l63j89K62O63N16J11J05L38q6j378k487k373j369o48o52p72m60
55480H1056K7K79M47Q83J431J622J407J115P93J30q76j643j675j158o36l17K9
55463H2914N52J004R86M01l84q51p96m83k91k57r4L51Q48J036Q91P30Q13J009
55445H8379R30L73m34j053j158o87J73R69J197Q33N01P79J379J469Q18K1m63q78
55427I3148j374j371l61J027J599J115M65L79O72R22J167J543J735J306L55n03
55411A01824q21o71m27l24l27l37m11o82j041j138q37m67m18p08j117j457j471
55394H9170q39K73R69O09j94k45N84J212R27K58k2M3K7m5L9L0l89q53p06m0L59
55373I1167J37j71q0N2m41j511k396k531k104j582j122o40k14o9j34k6M27R21
$$ y = [90461, 89838, 89475, 89286, 89548, 90211, 90727, 90838, 90943, 91281, 91195, 89817, 87330, 84957, 83588, 82940, 82288, 81516, 81056, 81083, 81362, 81809, 82692, 84123, 85745, 87152, 88267, 89060, 89190, 88314, 86671, 84996, 83838, 83202, 82885, 82914, 83466, 84470, 85456, 85857, 85473, 84622, 83826, 83343, 83052, 82795, 82701, 83052, 83900, 84936, 85827, 86557, 87370, 88379, 89309, 89682, 89248, 88195, 87037, 86350, 86523, 87492, 88689, 89522, 90023, 90802, 92181, 93650, 94468, 94489, 94026, 93148, 91774, 90403, 90042, 91069, 92668, 93783, 94248, 94627, 95299, 96221, 97388, 98931, 100666, 101972, 102327, 101824, 101003, 100332, 99905, 99581, 99254, 98917, 98506, 97824, 96783, 95645, 94808, 94341, 93923, 93215, 92098, 90641, 89170, 88331, 88604, 89573, 90182, 89988, 89743, 90327, 91539, 92466, 92724, 92702, 92745, 92772, 92727, 92766, 92796, 92407, 91554, 90848, 90808, 91167, 91304, 91133, 91053, 91105, 90664, 89153, 86757, 84226, 82122, 80540, 79418, 78778, 78564, 78495, 78361, 78335, 78762, 79683]
55355G9683J141J182J274J305J021N02J06%P8K57N14O82O30M93M15J34o09j393
55337H7415j454p64j03R9K84Q68J434J307M77m91j133j268q53q9N70Q45Q66P35
55319H8745K87m21q40o18k04j83l53j13M52O28J64l27k30L08O66M52k17q32q87
55300H6477l42K74M30J97P2L10P40J050R45K18q91j583j241k50M54N68N47O45
55282H8620N41J12j95p6J30J05J00L45M99K31k4L26R74J017L43j65Q5N74N28M1
55262I4111j68J84O66Q23P15O58P57Q39P22L62j75p72j299j634j682j382p71r1
55244I1863K54J3o09j026p71J05J074J506J079j4j147j637j205j70Q28J266J027
55227I2436L88k28n55o42o85o93m91m7M14P16R11J011P87J79l35k08L72O64L66
$$ y = [79683, 80824, 82006, 83280, 84585, 85606, 86108, 86214, 86214, 86292, 86549, 87063, 87745, 88375, 88868, 89283, 89417, 88808, 87415, 85961, 85197, 85094, 85193, 85477, 86345, 87779, 89086, 89563, 89072, 87939, 86671, 85818, 85729, 86299, 87144, 88010, 88745, 89032, 88611, 87771, 87153, 86949, 86766, 86413, 86300, 86752, 87380, 87544, 87217, 86987, 87295, 87961, 88413, 88196, 87364, 86477, 86135, 86409, 86839, 87036, 87108, 87418, 88158, 89208, 90153, 90371, 89480, 87897, 86656, 86406, 86860, 87428, 87975, 88620, 89161, 89273, 89078, 89002, 89132, 89237, 89337, 89682, 90181, 90412, 90388, 90714, 91688, 92705, 93048, 92883, 92968, 93542, 94070, 94111, 93943, 94127, 94793, 95616, 96331, 96989, 97746, 98585, 99307, 99669, 99494, 98722, 97423, 95789, 94107, 92725, 91954, 91863, 92117, 92130, 91521, 90495, 89724, 89829, 90903, 92409, 93488, 93474, 92327, 90690, 89485, 89315, 90143, 91409, 92436, 92824, 92596, 92041, 91399, 90714, 90021, 89530, 89483, 89897, 90613, 91524, 92535, 93322, 93501, 93166, 92958, 93330, 93994, 94360]
55208I4360J3J32N22O72N19L62K54m2n66j030j182r89n20KJ03n03j309j338l18
55189H9142Q70J230P73K13p9l11n83o20k81J63M58O57P75N14k50r54q02K66J424
55170I2605J843J474Q37L34Pj85j81pJ20K7j43r0K46O06Q16J001J238J272Q27
55151A02647J30k59j79q2l46p21p04k54J90L12J76l7l14o75r82j024p17j52N58
55132I7567J381K219K674K255R47m87j204j138q93p90n74j34J00j60m76l59p3
55115A00855j39l42%Q41J264O90l54r39o95O6P83R76N75J33K62Q02R65M71m9l4
55095A06131K48L10K48L33L60O4k16j8L42J88l18k89M88J156J068O37M48K13n63
55076A10830j473j592r00l79n24n81K72J593K193J670P55J78o3j71j7L91M14n06
$$ y = [94360, 94373, 94505, 95027, 95699, 96218, 96580, 96834, 96792, 96226, 95196, 94014, 93025, 92505, 92507, 92610, 92107, 90798, 89460, 89142, 90012, 91242, 92015, 92228, 92149, 91838, 91255, 90635, 90354, 90517, 90975, 91632, 92407, 92921, 92671, 91717, 90915, 91181, 92605, 94448, 95922, 96759, 97093, 97100, 96915, 96734, 96727, 96847, 96874, 96731, 96641, 96887, 97493, 98309, 99310, 100548, 101820, 102647, 102777, 102518, 102339, 102257, 101911, 101190, 100486, 100232, 100422, 100734, 100910, 100873, 100559, 99884, 98902, 97878, 97161, 97009, 97567, 98948, 101167, 103841, 106096, 107043, 106556, 105352, 104214, 103321, 102531, 101957, 101823, 101923, 101763, 101287, 100928, 100855, 100716, 100374, 100374, 101215, 102479, 103169, 102815, 101876, 101181, 101247, 102030, 103006, 103581, 103714, 103976, 104778, 105743, 106214, 106165, 106131, 106379, 106689, 106937, 107270, 107630, 107694, 107478, 107460, 107802, 107990, 107672, 107383, 107871, 109027, 110095, 110732, 111180, 111393, 110830, 109357, 107765, 106865, 106486, 105962, 105381, 105653, 107246, 109439, 111109, 111864, 112042, 111979, 111808, 111791, 112182, 112596, 112090]
55058A12090j833k301j359J83J159J183O89K18Kn5k17n96q52m85M16J094J074
55041A10410P96Q51R53L64p86j387q10J86M59m1m15j82J35o1n64p55n67n13q60
55022A07213j205j074n57j01R1J79L37N92R34J308J508J312P82J81l36p66r94
55005A09404q17k99J87L96M66O61J040J479J778J665R72r7j029j474j435j040
54989A11857l91K61N76N44N10N94M58p2n42m11J79O23O75N75N14L87K01K69Q06
54970A17613J491J668J016m6p27o73k81n6J04N60J035P57l29j183r89k64kk63
54952A19431l63j76l22j007j576j486j037p69o63l30L29J076J684J986J819J249
54936A19845P00N29N32K30l42n12K32J564K731L494M259N192N632M912L509K759
$$ y = [112090, 110257, 107956, 106597, 106780, 107939, 109122, 109811, 110029, 110031, 109976, 109759, 109163, 108311, 107826, 108242, 109336, 110410, 111206, 112057, 113010, 113374, 112588, 111201, 110391, 110577, 111036, 110995, 110580, 110398, 110533, 110472, 109908, 109153, 108586, 108073, 107213, 106008, 104934, 104377, 104276, 104367, 104546, 104883, 105475, 106409, 107717, 109225, 110537, 111319, 111500, 111164, 110398, 109404, 108587, 108288, 108475, 108871, 109337, 109998, 111038, 112517, 114295, 115960, 116932, 116835, 115806, 114332, 112897, 111857, 111466, 111727, 112303, 112847, 113357, 113951, 114409, 114337, 113795, 113384, 113563, 114186, 114861, 115436, 115950, 116337, 116538, 116807, 117613, 119104, 120772, 121788, 121742, 121015, 120342, 120061, 120005, 120109, 120669, 121704, 122461, 122132, 120949, 119960, 119696, 119694, 119431, 119068, 118892, 118570, 117563, 115987, 114501, 113464, 112695, 112032, 111702, 112031, 113107, 114791, 116777, 118596, 119845, 120545, 121074, 121606, 121836, 121494, 120982, 121214, 122778, 125509, 129003, 133262, 138454, 144086, 148998, 152507, 155266]
54920A55266L259M111M088L109K067J519J104K12j290l044m467n037m661l875
54906A52361l356l240l158k886k516k085j481q74p22j108j509j464j104p32k28
54891A25898O06J430J605J124P56J068J671J759J193O42P23J383K268L278M410
54876A49814N279N306M444L305K346J319k23k110l612m199l965l405k986k891
54862A48422k998l071l044l010k955k699k237j818j578j339r92p39p49q81j050
54847A19262j452j998k005j058J21M09j93n46O3J042J338O43n38j517j831j421
54831A10319p06k45j52l7L91R39J268J304J193J068R68Q17M38j83o34m40K54P58
54813A17320O69L12J73K42J33l10p69p35l1R04J355J100O36M18K02m19j039q00
$$ y = [155266, 158525, 162636, 166724, 169833, 171900, 173419, 174523, 174735, 173445, 170401, 165934, 160897, 156236, 152361, 149005, 145765, 142607, 139721, 137205, 135120, 133639, 132765, 132043, 130935, 129426, 127962, 126858, 126126, 125898, 126504, 127934, 129539, 130663, 131419, 132487, 134158, 135917, 137110, 137752, 138475, 139858, 142126, 145404, 149814, 155093, 160399, 164843, 168148, 170494, 171813, 171590, 169480, 165868, 161669, 157704, 154299, 151313, 148422, 145424, 142353, 139309, 136299, 133344, 130645, 128408, 126590, 125012, 123673, 122681, 121942, 121193, 120312, 119262, 117810, 115812, 113807, 112749, 112870, 113279, 113086, 112540, 112603, 113645, 114983, 115626, 115088, 113571, 111740, 110319, 109613, 109368, 109216, 109179, 109570, 110509, 111777, 113081, 114274, 115342, 116310, 117127, 117565, 117382, 116748, 116308, 116562, 117320, 117989, 118301, 118474, 118716, 118849, 118539, 117770, 117035, 117004, 117908, 119263, 120363, 120999, 121417, 121619, 121200, 120161, 119361]
54795A19361L16J310J461J141J009J011P24K29NK12N30O34N01K94K29M67R40J381
54777A31755J620J731J767J590J157Q00R45J657K591L363L897M375M911N234M887
54762A72280L853K755K140J716P42r51k696l811m175m074l859l813l965l985l629
54747A48528l156k888k553j715o76j15N7N48J247J101j34j126p07N46J308J331
54731A41596J310J475J468J356J743K745L675L945L727L565L716L904L553K361
54717A80139P47n00j186j928l093m161m529m451m486m526m147l540l203k962k213
54702A35961j079m13n23p47n16j30j56n62q44o80k54q6n54j303j366k71J066J217
54684A28760Oj259j412o43J77O52R01R23O45L66N49J110J341P82j16m98j82R7
$$ y = [119361, 119677, 120987, 122448, 123589, 124598, 125609, 126333, 126562, 126567, 126779, 127309, 127943, 128444, 128738, 128967, 129434, 130374, 131755, 133375, 135106, 136873, 138463, 139620, 140420, 141365, 143022, 145613, 148976, 152873, 157248, 162159, 167393, 172280, 176133, 178888, 181028, 182744, 183486, 182535, 179839, 176028, 171853, 167779, 163920, 160107, 156142, 152157, 148528, 145372, 142484, 139931, 138216, 137540, 137425, 137482, 138030, 139277, 140378, 140244, 139118, 138411, 138957, 140265, 141596, 142906, 144381, 145849, 147205, 148948, 151693, 155368, 159313, 163040, 166605, 170321, 174225, 177778, 180139, 180886, 180386, 179200, 177272, 174179, 170018, 165489, 161038, 156552, 152026, 147879, 144339, 141136, 138174, 135961, 134882, 134469, 133946, 133199, 132683, 132553, 132397, 131835, 130991, 130311, 130057, 129971, 129417, 128114, 126748, 126477, 127543, 128760, 128766, 127507, 126095, 125452, 125629, 126281, 127182, 128105, 128750, 129116, 129665, 130775, 132116, 132898, 132782, 132284, 132102, 132199]
54666A32199l11j066j329r96q55j352j885j651p26J60N78O26M56J57k9J10M63
54649A24549Q29J249J668J615Q05j37k79L71R16Q10L89Q8j32l91n74p09j057j548
54631A28462j573p35N21J343J324O54k45r40j099p07j70L9j95n70p03m85j33R4
54613A24882K35N60J133J671J891J769J315M72n73j306j435j243j048p88l94j42
54597A26999j00K55J265K332K622K136J400M77p33j646j520p13l72q05j195r81
54581A29421n03j21K53N51M67K50N58J238J254L30m18m9Q93J351J190R69Q66O42
54563A39142J89m29j090j411j013k64j9k95j12Q63J598J345Q77J138J571J123
54547A43213J24j94L34P90R10J344K136K306J340L4o12n45l14k45l72o84j027
$$ y = [132199, 131888, 130822, 129493, 128497, 127642, 126290, 124405, 122754, 122028, 122188, 122766, 123392, 123848, 124005, 123976, 124086, 124549, 125378, 126627, 128295, 129910, 130715, 130578, 130299, 130670, 131586, 132396, 132785, 132873, 132741, 132350, 131776, 131067, 130010, 128462, 126889, 126154, 126675, 128018, 129342, 129996, 129751, 128811, 127712, 127005, 126835, 126874, 126679, 126109, 125406, 124921, 124788, 124882, 125117, 125677, 126810, 128481, 130372, 132141, 133456, 133928, 133355, 132049, 130614, 129371, 128323, 127535, 127141, 126999, 126899, 127154, 128419, 130751, 133373, 135509, 136909, 137386, 136653, 135007, 133487, 132774, 132402, 131597, 130402, 129421, 128918, 128797, 129050, 129601, 130068, 130318, 130876, 132114, 133368, 133698, 133280, 133231, 134124, 135475, 136665, 137634, 138500, 139142, 139331, 138902, 137812, 136401, 135388, 135124, 135105, 134810, 134698, 135561, 137159, 138504, 139381, 140519, 142090, 143213, 143337, 143143, 143477, 144267, 145177, 146521, 148657, 150963, 152303, 152337, 151725, 151180, 150866, 150621, 150249, 149565, 148538]
54530A48538j156j052r09p51m67k01k82o59r07q47o93n71l24O0K85K07M0kP6K30
54510A40615L95K65m94j622k236j761o50R9mn61q83p24l38P5O56J506K198K144
54492A38680J410O50K45j1k64k85p9j08m48m07M64J545J976J772J408R40L01l6
54474A47753K63N68J91k74K16J251J358K91n38k31M12N07N06J129J904J791O74
54457A57771o53j555j834j383l40O01P18rj007j692j674p99M78J142N46q18j807
54440A47685j696o15P22J501J376Q47O95R25Q56L77K55P92J049K06j067j479q44
54423A51585nN19Q03P23N1p08o67J71Q53Q21M80K81J22mL15J131J640J142K4o67
54403A58610l67N82J424J576J036M66N83J263J601J046P8n36o99p77q36o79m50
$$ y = [148538, 147382, 146330, 145421, 144670, 144203, 144002, 143720, 143061, 142154, 141307, 140614, 140043, 139719, 139779, 140064, 140271, 140311, 140309, 140385, 140615, 141010, 141275, 140781, 139159, 136923, 135162, 134512, 134611, 134607, 134046, 133163, 132439, 132101, 132176, 132832, 134338, 136536, 138680, 140090, 140740, 140985, 140974, 140710, 140425, 140346, 140238, 139790, 139383, 139847, 141392, 143368, 145140, 146548, 147488, 147789, 147753, 148016, 148584, 148775, 148501, 148717, 149968, 151326, 151617, 151079, 150848, 151260, 151767, 152273, 153402, 155306, 157097, 157771, 157118, 155563, 153729, 152346, 152006, 152607, 153325, 153316, 152309, 150617, 148943, 148144, 148622, 149764, 150310, 149492, 147685, 145989, 145374, 146096, 147597, 148973, 149820, 150515, 151440, 152296, 152673, 152928, 153720, 154769, 154975, 153908, 152429, 151585, 151580, 152099, 152902, 153625, 153676, 152968, 152301, 152472, 153325, 154146, 154626, 154907, 155029, 155025, 155340, 156471, 158111, 159253, 159277, 158610, 158243, 158825, 160249, 161825, 162861, 163327, 163910, 165173, 166774, 167820, 167898, 167362, 166663, 165886, 165050, 164371, 163921]
54386A63921n87j114j482j205m34K53M43J91p7O5O41J232J425J275J151J221J297
54369A68216J226J206J582K385L213L604L489L203L044K887K391J512N97q7o86
54354A97782j429k187k673k976l481m176m400l614k241j341j402j793j601p97
54340A63671j69k22n52n10j19P5j94o60j044j369j602j465q32q5K55Q9k73n10
54322A54484m07J88J112J743J505O19r8k47k07m11o85o86n66o57p73m23K58M31
54304A55180l09j239j295l71O41R27M89j34m47k39L86J001J140P94M56N78J088
54287A58646J596J771J407M38p23j200n88K73J24j060j942j584o55l47o75p42
54271A54739k64O4j67l55J72J115J604J331P96O23R78J539J786J426P84N65R99
$$ y = [163921, 163334, 162220, 160738, 159533, 159099, 159352, 159795, 159986, 159909, 159974, 160615, 161847, 163272, 164547, 165698, 166919, 168216, 169442, 170648, 172230, 174615, 177828, 181432, 184921, 188124, 191168, 194055, 196446, 197958, 198555, 198468, 197782, 196353, 194166, 191493, 188517, 185036, 180860, 176460, 172846, 170605, 169264, 167862, 166069, 164468, 163671, 163502, 163280, 162728, 162218, 162099, 162174, 161980, 161320, 160276, 158907, 157305, 155840, 155008, 154923, 155178, 155267, 154994, 154484, 154077, 154265, 155377, 157120, 158625, 159244, 159146, 158899, 158692, 158281, 157596, 156910, 156344, 155687, 154914, 154491, 154749, 155180, 154871, 153632, 152337, 151966, 152607, 153534, 154023, 153889, 153442, 153203, 153589, 154590, 155730, 156524, 156980, 157558, 158646, 160242, 162013, 163420, 163858, 163135, 161935, 161347, 161620, 161744, 160684, 158742, 157158, 156503, 156156, 155481, 154739, 154475, 154539, 154372, 154017, 154189, 155304, 156908, 158239, 159035, 159658, 160636, 162175, 163961, 165387, 166171, 166736, 167735]
54254A67735J447J219N98M59R12R26k89k024k785k146j273j278j649r98P87K015
54238A63656J266o73j745j115J39P97Q91J032J243J198R74Q28N88j4o45p74n49
54221A67097n25p25o64l30k87p63j319j607j729j674j134j80N24O06M35L92K68
54204A58385j53m52j13O89J306J393J021L97j30j32M01Q77Q07L66o3m65q64r35
54186A62335n05l0M8P5N67J168J072K86l81n04l50n9N30J125R44j07j067j130
54168A64017o14k57j75n1R6lk80l77j90N6J94K70K92J16l72r77j201o19N14J250
54148A61689R15qm51j62J02j37m08k05R3j12o24q07n84l62j23N83J721K544K486
54129A66150J818J175Q39O69M52O7m60q94r59o75l35o6L53J067J735J818J225
$$ y = [167735, 169182, 170401, 170999, 171458, 172370, 173296, 173007, 170983, 168198, 166052, 164779, 163501, 161852, 160854, 161641, 163656, 164922, 164249, 162504, 161389, 161528, 162325, 163216, 164248, 165491, 166689, 167663, 168491, 169079, 169065, 168420, 167646, 167097, 166572, 165847, 165183, 164853, 164566, 163803, 162484, 160877, 159148, 157474, 156340, 156160, 156684, 157290, 157725, 158117, 158385, 158232, 157780, 157667, 158356, 159662, 161055, 162076, 162473, 162343, 162211, 162612, 163489, 164296, 164662, 164599, 164134, 163270, 162335, 161830, 161800, 161848, 161923, 162490, 163658, 164730, 165016, 164635, 164131, 163781, 163722, 164252, 165377, 166321, 166214, 165147, 164017, 163403, 163146, 162971, 162920, 163016, 163013, 162733, 162356, 162166, 162222, 162416, 162686, 162978, 163094, 162722, 161745, 160544, 159925, 160439, 161689, 162604, 162596, 162145, 161983, 162085, 161948, 161540, 161335, 161428, 161316, 160692, 159885, 159301, 158939, 158816, 159399, 161120, 163664, 166150, 167968, 169143, 169982, 170651, 171103, 171170, 170710, 169816, 168857, 168182, 167847, 167781, 168134, 169201, 170936, 172754, 173979]
54112A73979M56R7K59N97P35O63O28Q12J146J550K244L567N428P069P709P353
54096B14292O707O155N133K883l18l170m651m975n053n342n534n118l909k177
54082A94923n49L62N09N10Q73J427J760J959K317K553K062Q97j79p39j071j434
54066B06180j608j506j474j648j664j480j719k614l264k722j382m01j23O1M81
54051A85117P88P52O38O47P06R77J809K937L513L239K897L285M161M723M710M485
54035B25384M341M263M204M163M024L678L259K943K638K201J834J844K043J859
54021B68678J159O04Q17J432J384J32j681k946l249l123l264l827m495m947n087
54006B41587m975m740m409l750k541j139m27p95j508j590j173j274k269l359l693
$$ y = [173979, 174435, 174532, 174791, 175388, 176123, 176786, 177414, 178226, 179372, 180922, 183166, 186733, 192161, 199230, 206939, 214292, 220999, 227154, 232287, 235170, 234852, 231682, 227031, 222056, 217003, 211661, 206127, 201009, 197100, 194923, 194374, 194736, 195245, 195755, 196628, 198055, 199815, 201774, 204091, 206644, 208706, 209603, 209424, 208685, 207614, 206180, 204572, 203066, 201592, 199944, 198280, 196800, 195081, 192467, 189203, 186481, 185099, 184698, 184575, 184636, 185117, 185905, 186657, 187295, 187942, 188648, 189625, 191434, 194371, 197884, 201123, 204020, 207305, 211466, 216189, 220899, 225384, 229725, 233988, 238192, 242355, 246379, 250057, 253316, 256259, 258897, 261098, 262932, 264776, 266819, 268678, 269837, 270441, 271258, 272690, 274074, 274206, 272525, 269579, 266330, 263207, 259943, 256116, 251621, 246674, 241587, 236612, 231872, 227463, 223713, 221172, 220033, 219606, 218811, 217303, 215713, 214540, 213266, 210997, 207638, 203945]
53991B03945l341k791k172j516j153j187r99p8R96J179M67j35r2J03M7J24O39
53974A94036J128J199J363K188L150L294K793K817L875N188O032O721P886R469
53960B51139J0969J2096J2520J1521Q633M503M21k935n665p770q843q786q126
53947B69677p313o243m802l354k334j674j070m89O5R50K425L937M560M225L923
53932B62483M343M901M555L273K089J788K093K309K276K317K577K855L044L294
53918C04197L675M008M262M731N546O225O159N432M703M286L790K846J668O44
53904C62172k68j274k125k363k155k287l127m054m269l860l571l719l893l810
53890C21397l930m776o018o707o397n567m900m594m491m490m462m113l343k581
$$ y = [203945, 200604, 197813, 195641, 194125, 192972, 191785, 190786, 190708, 191704, 192883, 193350, 193215, 193123, 193226, 193273, 193397, 194036, 195164, 196363, 197726, 199914, 203064, 206358, 209151, 211968, 215843, 221031, 227063, 233784, 241670, 251139, 262108, 274204, 286724, 298245, 306878, 311381, 311802, 308867, 303202, 295432, 286589, 277803, 269677, 262364, 256121, 251319, 247965, 245631, 243957, 242887, 242398, 242463, 243413, 245838, 249775, 254335, 258560, 262483, 266826, 271727, 276282, 279555, 281644, 283432, 285525, 287834, 290110, 292427, 295004, 297859, 300903, 304197, 307872, 311880, 316142, 320873, 326419, 332644, 338803, 344235, 348938, 353224, 357014, 359860, 361528, 362172, 361904, 360630, 358505, 356142, 353987, 351700, 348573, 344519, 340250, 336390, 332819, 329100, 325207, 321397, 317467, 312691, 306673, 299966, 293569, 288002, 283102, 278508, 274017, 269527, 265065, 260952, 257609, 255028]
53876B55028k379k722l098l164k964k564j958j394j335j845k408k582k532k650
53862B21433k949l160l144k942k513j807r70k53K56M95K35n94j478j681j145o56
53846A99127q66j480j697j251n76m1M90J127J430R30ql92J69R00Q52J06l99j9
53828A98402J061K205K792K407J148j50o13k87K4k2Q2O73J220J130O99O60J134
53811B12565J599J692J421Q50K44L56J858M306O235O549N526M323L861M266N061
53796B60712N641N692N330M746L865K600J291N28M33N31L89M8l37r03j849l038
53780B85679m077m714m944m833m451l965l610l509l542l421k926k155j518j400
53766B36614j782k227k277j929j637j841k417k711k312j642j477j836j842r21
$$ y = [255028, 252649, 249927, 246829, 243665, 240701, 238137, 236179, 234785, 233450, 231605, 229197, 226615, 224083, 221433, 218484, 215324, 212180, 209238, 206725, 204918, 203948, 203695, 203951, 204446, 204681, 204087, 202609, 200928, 199783, 199127, 198261, 196781, 195084, 193833, 193257, 193216, 193706, 194833, 196263, 197193, 197185, 196793, 196962, 197862, 198714, 198820, 198421, 198402, 199463, 201668, 204460, 206867, 208015, 207865, 207252, 206965, 206989, 206967, 207049, 207722, 208942, 210072, 210771, 211431, 212565, 214164, 215856, 217277, 218127, 218371, 218727, 220585, 224891, 231126, 237675, 243201, 247524, 251385, 255651, 260712, 266353, 272045, 277375, 282121, 285986, 288586, 289877, 290405, 290838, 291369, 291758, 291806, 291469, 290566, 288717, 285679, 281602, 276888, 271944, 267111, 262660, 258695, 255085, 251576, 248034, 244613, 241687, 239532, 238014, 236614, 234832, 232605, 230328, 228399, 226762, 224921, 222504, 219793, 217481, 215839, 214362, 212526, 210684, 209763]
53752B09763K88O34r4r51r88l40M2n08j570j990j105L84J140Q03L78P40J383J250
53734B09259L69k47j05L27P28J466K628L350K772J267Q9l6N10R38R04O59O15Q99
53716B26392J299J594J863K269K640K592K094J626J667K246L018L545L492K907
53702B59244K331K293K671K886K745K607K658K597K319K270K703L079K770K009
53688B95182J526J446J170L29p00j359j563j550j403r99m02J8j6k51j76K34L32
53671B91818k96j064j062l74Ml72p34k69P25J389J447J182O46l12j387j946j836
53654B87559j510j269r64n10j65o2R1N59J149J548J771K058K347K280J719J034
53638B97635P69J019J340J351J317J848L004M006M092L384K678K593L139L923
$$ y = [209763, 210051, 210685, 210591, 209640, 208652, 208312, 208354, 207846, 206276, 204286, 203181, 203565, 204705, 205508, 205886, 206626, 208009, 209259, 209628, 209381, 209276, 209603, 210331, 211797, 214425, 217775, 220547, 221814, 221903, 221867, 222377, 223315, 224219, 224878, 225493, 226392, 227691, 229285, 231148, 233417, 236057, 238649, 240743, 242369, 244036, 246282, 249300, 252845, 256337, 259244, 261575, 263868, 266539, 269425, 272170, 274777, 277435, 280032, 282351, 284621, 287324, 290403, 293173, 295182, 296708, 298154, 299324, 299653, 298953, 297594, 296031, 294481, 293078, 292079, 291677, 291695, 291679, 291428, 291252, 291486, 291818, 291522, 290458, 289396, 289022, 289026, 288654, 287920, 287651, 288376, 289765, 291212, 292394, 293040, 292728, 291341, 289395, 287559, 286049, 284780, 283816, 283306, 283141, 283079, 283170, 283729, 284878, 286426, 288197, 290255, 292602, 294882, 296601, 297635, 298404, 299423, 300763, 302114, 303431, 305279, 308283, 312289, 316381, 319765, 322443, 325036, 328175, 332098]
53624C32098M439M333L778L461L741L997L339J916Q47P48J009Q62O08J105K405
53609C68686L605M019L878L716L654L567L544L746L924L590K700J830J526J694
53595D13679J818J620J257Q98M47k54j058j544j456j054q88j183j585j672j613
53580D07412j879k340k234j354o39r89j864j955j106n69j126j952j913j151o54
53565C85687p14p50m47k20m42q58j000p68l47J29O81J321J923K204J896J030m6
53548C89279r76j574j639r38L58J552K046J945J715J592J693K318L585M915N570
53533D11441N646N875O448O741O446O246O986Q596J0337J1728J2773J3465J3649
53520E26377J3359J2966J2843J3090J3664J4613J5972J7494J8717J9455K0143
$$ y = [332098, 336537, 340870, 344648, 348109, 351850, 355847, 359186, 361102, 361949, 362697, 363706, 364568, 365176, 366281, 368686, 372291, 376310, 380188, 383904, 387558, 391125, 394669, 398415, 402339, 405929, 408629, 410459, 411985, 413679, 415497, 417117, 418374, 419272, 419719, 419465, 418407, 416863, 415407, 414353, 413465, 412282, 410697, 409025, 407412, 405533, 403193, 400959, 399605, 398966, 397977, 396113, 394158, 393052, 392483, 391357, 389405, 387492, 386341, 385687, 384973, 384223, 383776, 383556, 383114, 382256, 381256, 380488, 380141, 380270, 380951, 382272, 384195, 386399, 388295, 389325, 389279, 388303, 386729, 385090, 384152, 384510, 386062, 388108, 390053, 391768, 393360, 395053, 397371, 400956, 405871, 411441, 417087, 422962, 429410, 436151, 442597, 448843, 455829, 464425, 474762, 486490, 499263, 512728, 526377, 539736, 552702, 565545, 578635, 592299, 606912, 622884, 640378, 659095, 678550, 698693]
53509F98693K1322K2830K3912K4214K4259K4577K4882K4642K4054K3752K3755
53498I60892K3582K3269K3382K3730K3143K1024J8526J7395J7993J9071J9332
53487A191339J8639J7817J7708J8465J9444J9828J9435J8856J8639J8606J8191
53476A396967J7154J5725J4276J3068J2082J0809Q559N361K269K30j125l043o035
53463A486297r338j1938j3582j4611j5333j5812j6092j6281j6596j7292j8376
53452A321046j9394j9866j9975k0376k1170k1578k0995j9958j9504j9801j9960
53441A098469j9198j7677j5959j4177j2150j0056q413p310o160m478k578j093
53429I79220j8J230K832M210M929N517O810Q777J0493J1309J1593J2233J3743
$$ y = [698693, 720015, 742845, 766757, 790971, 815230, 839807, 864689, 889331, 913385, 937137, 960892, 984474, 1007743, 1031125, 1054855, 1077998, 1099022, 1117548, 1134943, 1152936, 1172007, 1191339, 1209978, 1227795, 1245503, 1263968, 1283412, 1303240, 1322675, 1341531, 1360170, 1378776, 1396967, 1414121, 1429846, 1444122, 1457190, 1469272, 1480081, 1488640, 1494001, 1496270, 1496500, 1495375, 1492332, 1486297, 1476959, 1465021, 1451439, 1436828, 1421495, 1405683, 1389591, 1373310, 1356714, 1339422, 1321046, 1301652, 1281786, 1261811, 1241435, 1220265, 1198687, 1177692, 1157734, 1138230, 1118429, 1098469, 1079271, 1061594, 1045635, 1031458, 1019308, 1009252, 1000839, 993529, 987369, 982891, 980313, 979220, 979202, 980432, 983264, 987474, 992403, 997920, 1004730, 1013507, 1024000, 1035309, 1046902, 1059135, 1072878]
53416A072878J6003J8509K0695K2246K3279K4091K4751K5194K5710K6908K8916
53405A329180L1070L2738L4117L5821L7936M0019M1903M3860M6007M8091M9997
53394A770739N1959N3987N5614N6559N7230N8145N9086N9355N8688N7532N6382
53383B395276N5309N4114N2598N0586M8003M4982M1716L8127L3990K9438K5008
53372B869147K0989J6998J2434P209J737l704r368j5688k2666k9648l5829m0943
53360B770668m5347m9344n2666n4858n6006n6669n7097n7032n6377n5522n4713
53349B175037n3513n1440m8802m6473m4890m3820m2941m2218m1597m0836l9836
53338A678671l8789l7831l6678l4843l2136k8847k5604k2970k1043j9374j7496
$$ y = [1072878, 1088881, 1107390, 1128085, 1150331, 1173610, 1197701, 1222452, 1247646, 1273356, 1300264, 1329180, 1360250, 1392988, 1427105, 1462926, 1500862, 1540881, 1582784, 1626644, 1672651, 1720742, 1770739, 1822698, 1876685, 1932299, 1988858, 2046088, 2104233, 2163319, 2222674, 2281362, 2338894, 2395276, 2450585, 2504699, 2557297, 2607883, 2655886, 2700868, 2742584, 2780711, 2814701, 2844139, 2869147, 2890136, 2907134, 2919568, 2926777, 2928514, 2924810, 2915442, 2899754, 2877088, 2847440, 2811611, 2770668, 2725321, 2675977, 2623311, 2568453, 2512447, 2455778, 2398681, 2341649, 2285272, 2229750, 2175037, 2121524, 2070084, 2021282, 1974809, 1929919, 1886099, 1843158, 1800940, 1759343, 1718507, 1678671, 1639882, 1602051, 1565373, 1530530, 1498394, 1469547, 1443943, 1420973, 1399930, 1380556, 1363060]
53327A363060j5502j3927j3028j2550j2287j2509j3475j4759j5466j5093j3916
53316A210548j2421j0725q726o632n038m352m306m128l170j402O50K380L517M256
53302A160451M990N990P337R080J1299J3887J6412J8424J9842K0974K2076K3136
53290A333898K4061K4905K5809K6792K7597K7730K6791K4916K2785K0953J9333
53279A605570J7560J5697J4027J2284R697O043K082j368m280p058r822j2451j4936
53266A633045j7233j9155k0764k2563k4771k6842k8220k9141l0118l0973l1243
53255A352022l1232l1698l2548l2785l1927l0544k9198k7694k5931k4642k4612
53244A029211k5567k6475k6725k6448k5881k4981k3746k2475k1504k0809k0008
$$ y = [1363060, 1347558, 1333631, 1320603, 1308053, 1295766, 1283257, 1269782, 1255023, 1239557, 1224464, 1210548, 1198127, 1187402, 1178676, 1172044, 1167006, 1162654, 1158348, 1154220, 1151050, 1149648, 1150298, 1152678, 1156195, 1160451, 1165441, 1171431, 1178768, 1187848, 1199147, 1213034, 1229446, 1247870, 1267712, 1288686, 1310762, 1333898, 1357959, 1382864, 1408673, 1435465, 1463062, 1490792, 1517583, 1542499, 1565284, 1586237, 1605570, 1623130, 1638827, 1652854, 1665138, 1674835, 1680878, 1682960, 1681592, 1677312, 1670254, 1660432, 1647981, 1633045, 1615812, 1596657, 1575893, 1553330, 1528559, 1501717, 1473497, 1444356, 1414238, 1383265, 1352022, 1320790, 1289092, 1256544, 1223759, 1191832, 1161288, 1132090, 1104396, 1078465, 1053823, 1029211, 1003644, 977169, 950444, 923996, 898115, 873134, 849388, 826913, 805409, 784600, 764592]
53233G64592j8818j7473j6484j5890j5034j3392j1333r658q601p824p260p269
53221F15556p892q623r136r654j0440j1408j2414j3317j3649j2888j1419j0467
53209D84249j0621j1022j0512r109p753p024o796o749o664o354n900n747o118
53196C83880o586o655o506o681p165p400p074o435n920n749n875n945n576m834
53182B95479m203l821l248k390k043k763l721l542k128p36k87m98p54r64j235
53167B63146j471j599j761j973k023j811j446r48l23N3k57r83j354j212j193j574
53151B43271j725j138l34p1j96kO71J334J643J619J293P25L16M66Q86Q08K9q05
53133B48790j017n75J83J052J862K283K174J887J826J869J596R78M35J55j25n17
$$ y = [764592, 745774, 728301, 711817, 695927, 680893, 667501, 656168, 646510, 637909, 630085, 622825, 615556, 607664, 599041, 589905, 580251, 569811, 558403, 545989, 532672, 519023, 506135, 494716, 484249, 473628, 462606, 452094, 442985, 435232, 428208, 421412, 414663, 407999, 401645, 395745, 389998, 383880, 377294, 370639, 364133, 357452, 350287, 342887, 335813, 329378, 323458, 317709, 311834, 305889, 300313, 295479, 291276, 287455, 284207, 281817, 279774, 277011, 273290, 269748, 267620, 266884, 266597, 266099, 265345, 264381, 263146, 261675, 260076, 258315, 256342, 254319, 252508, 251062, 250114, 249791, 249844, 249587, 248604, 247250, 246038, 244845, 243271, 241546, 240408, 240074, 240003, 239807, 239805, 240476, 241810, 243453, 245072, 246365, 247090, 247406, 247872, 248758, 249566, 249595, 248790, 247773, 247198, 247381, 248433, 250295, 252578, 254752, 256639, 258465, 260334, 261930, 262908, 263343, 263498, 263373, 262856]
53117B62856o45k42K80L24p4l71l87m80q99j429j815k022j961j517r92r90j493
53100B48143j680j065k88j55m43l89K9J70p4j15K49M44O9m84o53l69J46P30J123
53081B45388R28J29o76r10o11k01N6J30P3J4J15L46N03M64K41k34r24j334r46
53062B42551j47n8j063k099j952p69K87N23K46lm8N9K84N63P88Q98Q38N22J9l89
53042B41050n11m06j66J95M60K36m05p95n76l40p65j506j657j065l43K03Q26J450
53024B35885J505R63O98J264J997J908J062L57K57M14M17K99K60K80K25K1l27
53007B47485o52n98K3Q33J094N34l41q56q99q27q64q64o60l65j71q3KP0M4K2K43
52986B43170P95J512K235K870L124K452O73j460k690k359r44N70J550J928J884
$$ y = [262856, 262211, 261969, 262249, 262573, 262499, 262128, 261741, 261261, 260362, 258933, 257118, 255096, 253135, 251618, 250626, 249636, 248143, 246463, 245398, 245110, 244955, 244512, 244123, 244152, 244322, 244248, 244133, 244382, 244826, 244895, 244411, 243758, 243389, 243535, 244265, 245388, 246316, 246445, 245769, 244859, 244248, 244047, 244103, 244233, 244306, 244320, 244435, 244781, 245284, 245748, 245989, 245755, 244831, 243497, 242551, 242404, 242346, 241283, 239184, 237232, 236463, 236750, 237273, 237519, 237516, 237468, 237527, 237811, 238374, 239162, 240060, 240898, 241420, 241439, 241050, 240539, 240133, 239967, 240162, 240622, 240858, 240453, 239658, 239082, 238742, 237977, 236471, 234814, 233749, 233406, 233609, 234435, 235885, 237390, 238353, 239051, 240315, 242312, 244220, 245282, 245639, 245896, 246310, 246727, 247026, 247286, 247566, 247791, 247812, 247485, 246833, 246235, 246258, 247091, 248185, 248719, 248378, 247522, 246623, 245796, 244932, 244068, 243408, 243043, 242872, 242789, 242791, 242861, 242905, 242927, 243170, 243965, 245477, 247712, 250582, 253706, 256158, 256831, 255371, 252681, 250322, 249378, 249948, 251498, 253426, 255310]
52971B55310J678J577J596J394P42K8j09L42O32K78k20j14M06L84n34j511j603
52954B60276r93p01j214j918j921j100j60J45k77q53r23l73K99N20J92l43p82
52937B49874j064j186j064o85k04J80M21N53N85M81K44k8j60l8J76J39k68p31
52919B47225q64p21o52p03m93J98J005J327R21P4o96r81p48l14j3J29K60L08P6
52900B45338k98l61K5M01L16p6k37J08P91J425J625J248O64M82Q00R93N49k12
52882B53581o54o99p10p38n15r4J15K5L4M20J017J674K468L283L591K987J692
52865B67477K65q99j590j637j091l80oj89r12j993k930l033k149j047p23j371
52849B47792k314k852k804k369j851j550j580j724j726j640j650j631j316q66
$$ y = [255310, 256988, 258565, 260161, 261555, 262297, 262325, 262216, 262558, 263190, 263468, 263248, 263134, 263540, 263924, 263390, 261879, 260276, 259283, 258582, 257368, 255450, 253529, 252429, 252269, 252414, 252137, 251284, 250361, 249988, 250287, 250807, 250999, 250656, 249874, 248810, 247624, 246560, 245875, 245671, 245851, 246272, 246825, 247410, 247891, 248135, 248107, 247947, 247909, 248085, 248224, 247956, 247225, 246361, 245640, 244988, 244285, 243792, 243990, 244995, 246322, 247243, 247317, 246621, 245640, 244892, 244578, 244565, 244694, 244954, 245262, 245338, 245040, 244679, 244704, 245105, 245421, 245345, 245108, 245216, 246007, 247432, 249057, 250305, 250969, 251451, 252251, 253244, 253793, 253581, 252927, 252228, 251518, 250780, 250265, 250171, 250286, 250311, 250345, 250765, 251782, 253456, 255924, 259207, 262798, 265785, 267477, 267742, 266843, 265253, 263616, 262525, 262145, 262139, 261950, 261038, 259045, 256115, 253082, 250933, 249886, 249163, 247792, 245478, 242626, 239822, 237453, 235602, 234052, 232472, 230748, 229022, 227382, 225732, 224101, 222785, 221919]
52835B21919p23q11m52O45J805K239K054J873J797J460R15P15R26Q54J03o69n73
52818B34077K82R94J090R87J214J689J956J817J378P33j44j194k128k588k484
52803B37679k128j977k157k294j952j193n50l82m25j47M68P22j0j347k086j528
52787B20693l44K13j78p29p86n02j39N03J443J986J606Q51N49M79j48j139j457
52770B22901r57o72j006r09L59J723J674M28n11n11l29n86q19m16M77J261J574
52753B23681J384Q76M42L92N60N91N99J051J914K495K406K055J973K093K073J893
52737B46478J718J498J136Q27Q31J028J046P21J68m91j145j561j571j403j512
52722B47768k043k636k785k334j530p55j80K50N87O86L67k03n55l71J98P08Q18
$$ y = [221919, 221196, 220385, 219933, 220578, 222383, 224622, 226676, 228549, 230346, 231806, 232721, 233436, 234362, 235216, 235319, 234650, 234077, 234359, 235353, 236443, 237430, 238644, 240333, 242289, 244106, 245484, 246217, 246073, 244879, 242751, 240163, 237679, 235551, 233574, 231417, 229123, 227171, 225978, 225428, 225046, 224621, 224474, 224942, 225664, 225654, 224307, 222221, 220693, 220349, 220562, 220384, 219655, 218869, 218367, 218228, 218731, 220174, 222160, 223766, 224617, 225166, 225645, 225497, 224358, 222901, 221944, 221272, 220266, 219357, 219716, 221439, 223113, 223541, 223030, 222519, 222190, 221604, 220785, 220369, 220846, 222107, 223681, 225065, 225941, 226383, 226775, 227335, 227926, 228525, 229576, 231490, 233985, 236391, 238446, 240419, 242512, 244585, 246478, 248196, 249694, 250830, 251657, 252488, 253516, 254562, 255283, 255451, 254960, 253815, 252254, 250683, 249280, 247768, 245725, 243089, 240304, 237970, 236440, 235685, 235505, 235755, 236342, 237028, 237395, 237192, 236637, 236266, 236464, 237172, 237990]
52705B37990M87Nk55j53P9K15L97Q44J346J434J054O07K40k75q41q43p7P17P83
52686B43754L75J75J61k20r35j311j082p18n67m36k16k08n28p78p03o18p37n92
52668B34816K60J375J910J729J424J324J147P29M68P92J560K218K410K223K002
52653B56387J906J677R40k14j127j344j188j231j410j227o97m25o31p77l80K79
52637B50538O15M24j73r18j259n48J017K206K127J421J282J667J443J63j247j869
52621B56889j876j849j796j408p83k75K2J96K14J46L42R23J387J232P14M75O09
52604B55162P41P91R84J089M85q25j870j813r38j25K32L68M96N86O42P05N78N8
52586B57346n30m73L24J031R38M98O81J506J948J432O61M97P18N50ol09k58l88
$$ y = [237990, 238477, 238482, 238227, 238074, 238153, 238368, 238765, 239609, 240955, 242389, 243443, 244050, 244290, 244015, 243174, 242331, 242254, 242971, 243754, 244129, 244304, 244465, 244245, 243310, 241999, 240917, 240199, 239632, 239196, 238980, 238772, 238244, 237466, 236763, 236145, 235408, 234816, 235076, 236451, 238361, 240090, 241514, 242838, 243985, 244714, 245182, 245974, 247534, 249752, 252162, 254385, 256387, 258293, 259970, 260910, 260696, 259569, 258225, 257037, 255806, 254396, 253169, 252472, 252047, 251416, 250639, 250259, 250538, 251153, 251577, 251404, 250486, 249227, 248679, 249696, 251902, 254029, 255450, 256732, 258399, 259842, 260005, 258758, 256889, 255013, 253164, 251368, 249960, 249177, 248902, 248924, 249120, 249334, 249480, 249822, 250745, 252132, 253364, 254078, 254553, 255162, 255903, 256694, 257678, 258767, 259252, 258427, 256557, 254744, 253806, 253681, 253913, 254281, 254777, 255363, 256005, 256710, 257288, 257346, 256816, 256343, 256667, 257698, 258636, 259134, 259815, 261321, 263269, 264701, 265362, 265859, 266577, 267127, 267121, 266812, 266554, 266166]
52568B66166p98r40p62j014j933k553k034r18k57j81k58o40j615k377j666K94
52552B48514J780J764J024O94Q19R02Q87Q09L24n58r72l10O73Q06J85j08K79O01
52534B58113L93J77M61Q48O31k14j039j265q26j48J67j29n95n87p8L57M52O52
52516B57370J384K339K809K492J670Q71O13J165K192K850K571J643P26Np70j580
52500B78350k029j997j913k097k255j894j078m00k98n97p91o09k62j55m32p57
52484B60786o14J83J272K023J998J247K82j98J82J110J805J761J199O84M36K13
52468B74369j52m40l22K31R35J454J579J338R77P51N85J13q03j749k113j785j278
52451B73690j209j734k474k833k439j407k72M34N40K17k59o43p29m64p4J29M4
$$ y = [266166, 265368, 264428, 263666, 262652, 260719, 258166, 256132, 255214, 254957, 254776, 254518, 253878, 252263, 249886, 248220, 248514, 250294, 252058, 253082, 253776, 254595, 255497, 256384, 257193, 257517, 256959, 255987, 255677, 256350, 257156, 257341, 257233, 257512, 258113, 258506, 258683, 259144, 259992, 260623, 260409, 259370, 258105, 257279, 257131, 257298, 257169, 256574, 255987, 255909, 256266, 256718, 257370, 258754, 261093, 263902, 266394, 268064, 268935, 269548, 270713, 272905, 275755, 278326, 279969, 280695, 280700, 279930, 278350, 276321, 274324, 272411, 270314, 268059, 266165, 265087, 264687, 264389, 263792, 263001, 262392, 262130, 261975, 261543, 260786, 260172, 260355, 261627, 263650, 265648, 266895, 267177, 266979, 267161, 268271, 270076, 271837, 273036, 273720, 274156, 274369, 274217, 273777, 273455, 273686, 274621, 276075, 277654, 278992, 279969, 280720, 281305, 281418, 280615, 278866, 276753, 274968, 273690, 272481, 270747, 268273, 265440, 263001, 261594, 261322, 261756, 262296, 262513, 262254, 261611, 260882, 260418, 260344, 260473, 260517]
52434B60517k11n14p92q47m72K46R11J196J100Q09N13M08N89Q11O76K09QN56J603
52415B67316K479K867K988L243L997N477P431Q954R213Q417P584P228O722N274
52401C49190K983N50j711l944o057p557q083p733o761n420m134l344l005k565
52387B92409j675n89K72P77R42P54M53N83J234J666J270O12Q01J932K989L391
52371C07821L707M473N104M751L711L083L117K822J412m93j553j267l79J49J01
52356C36559j02j47m0K57R27J834K310J866R47N04Q82J492J712J633J784K448
52340C54866L444M275M440L960L617M199N443O367O781P628R380J1019J1440J1123
52326D47982J1337J2244J2987J3351J4049J5226J6091J6339J6717J7602J8104
$$ y = [260517, 260306, 259792, 259000, 258153, 257681, 257927, 258838, 260034, 261134, 261943, 262456, 262864, 263453, 264264, 264940, 265149, 265157, 265713, 267316, 269795, 272662, 275650, 278893, 282890, 288367, 295798, 304752, 313965, 322382, 329966, 337194, 343916, 349190, 352173, 352723, 351012, 347068, 341011, 333454, 325371, 317638, 310877, 305457, 301323, 297979, 294974, 292409, 290734, 290145, 290417, 291194, 292136, 292890, 293343, 293926, 295160, 296826, 298096, 298708, 299509, 301441, 304430, 307821, 311528, 316001, 321105, 325856, 329567, 332650, 335767, 338589, 340001, 339508, 337955, 336688, 336309, 336458, 336559, 336457, 336310, 336270, 336527, 337454, 339288, 341598, 343464, 344411, 344915, 345797, 347289, 349001, 350634, 352418, 354866, 358310, 362585, 367025, 370985, 374602, 378801, 384244, 390611, 397392, 405020, 414400, 425419, 436859, 447982, 459319, 471563, 484550, 497901, 511950, 527176, 543267, 559606, 576323, 593925, 612029]
52315F12029J7498J6608J6747J7753J8249J7622J6792J6788J7469J7898J7534
52304H02987J6653J5837J5354J5021J4526J3825J3051J2092J0497Q063N236K742
52292I45884R08m14j470k426l432m520n412n738n481n024m684m386l875l103k309
52277H94518j739j378r46j60J102K797M734O488P550P781P669P832Q404R107R833
52262I63592J0710J1657J2332J2651J2930J3297J3437J3159J2829J2876J3102
52251A102572J2891J1892J0244Q247O119L969J772n63k883m703n651n962o244
52238A131700o873p745q558r124r450r725j0103j0454j0385r666q533p473o835
52225A016776o661o723o600n934m749l492k610k186j989j689j005J67J611K975
$$ y = [612029, 629527, 646135, 662882, 680635, 698884, 716506, 733298, 750086, 767555, 785453, 802987, 819640, 835477, 850831, 865852, 880378, 894203, 907254, 919346, 929843, 937906, 943142, 945884, 946792, 946378, 944908, 942482, 939050, 934530, 929118, 923380, 917899, 912875, 908191, 903805, 899930, 896827, 894518, 892779, 891401, 890455, 890295, 891397, 894194, 898928, 905416, 912966, 920747, 928416, 936248, 944652, 953759, 963592, 974302, 985959, 998291, 1010942, 1023872, 1037169, 1050606, 1063765, 1076594, 1089470, 1102572, 1115463, 1127355, 1137599, 1145846, 1151965, 1155934, 1157706, 1157143, 1154260, 1149557, 1143906, 1137944, 1131700, 1124827, 1117082, 1108524, 1099400, 1089950, 1080225, 1070122, 1059668, 1049283, 1039617, 1031084, 1023611, 1016776, 1010115, 1003392, 996792, 990858, 986109, 982617, 980007, 977821, 975832, 974143, 973138, 973305, 974916, 977891]
52211I77891M017M639M766M496M249M349M509M188L408K774K646K924L595M778
52197A033229O053O577O214N788N793N600M554L080J969J191K44q06j582k348
52183A075556l632n140n919n774n654o368p521p996p223n764m814m983n610n438
52169I93720m180k782j977j318k34P75R17M88M29Q64J215J437J994K637K484J410
52153I97879K91k82n12m67J66J085J352Q60P37J600K409J879K61j190j876k048
52137A002144j779q02P16K099K958L613M550N852P254Q634J0308J2764J5882J8642
52123A092835K0030K0240K0431K1267K2295K2879K3079K3264K3401K3215K2669
52112A335605K1969K1308K0847K0476J9604J7702J5208J3252J2266J1564J0473
$$ y = [977891, 981908, 986547, 991313, 995809, 1000058, 1004407, 1008916, 1013104, 1016512, 1019286, 1021932, 1024856, 1028451, 1033229, 1039282, 1045859, 1052073, 1057861, 1063654, 1069254, 1073808, 1076888, 1078857, 1080048, 1080292, 1079486, 1077904, 1075556, 1071924, 1066784, 1060865, 1055091, 1049437, 1043069, 1035548, 1027552, 1020329, 1014565, 1009751, 1004768, 999158, 993720, 989540, 986758, 984781, 983463, 983229, 984004, 984921, 985409, 985838, 986702, 987917, 989354, 991348, 993985, 996469, 997879, 998170, 997888, 997376, 996909, 997075, 998160, 999512, 1000372, 1001109, 1002709, 1005118, 1006997, 1007258, 1006068, 1004192, 1002144, 1000365, 999563, 1000279, 1002378, 1005336, 1008949, 1013499, 1019351, 1026605, 1035239, 1045547, 1058311, 1074193, 1092835, 1112865, 1133105, 1153536, 1174803, 1197098, 1219977, 1243056, 1266320, 1289721, 1312936, 1335605, 1357574, 1378882, 1399729, 1420205, 1439809, 1457511, 1472719, 1485971, 1498237, 1509801, 1520274]
52101A520274R087P469N131J967j058l073m523o435q956j1401j3290j4490j4788
52088A465914j4280j3831j4143j4621j4144j2751j1530j0887j0136q853p482o228
52076A327028m442j734J078K906L697M243N088O287P885R988J2371J4524J6078
52063A404997J6927J7013J6365J5263J4137J3253J2710J2565J2614J2109J0177
52052A558130O778L029J77j671l492o071r122j1785j3575j4532j4779j4498j4247
52039A464342j4707j5944j7237j7798j7438j6486j5470j4859j4804j4991j5121
52028A289487j5479j6563j8077j8937j8503j7275j6091j5146j4257j3495j3053
52017A112611j2812j2489j1951j1051r665q313q118r508j1371j2264j2203j2444
$$ y = [1520274, 1529361, 1536830, 1541961, 1543928, 1542870, 1539797, 1535274, 1528839, 1519883, 1508482, 1495192, 1480702, 1465914, 1451634, 1437803, 1423660, 1409039, 1394895, 1382144, 1370614, 1359727, 1349591, 1340738, 1333256, 1327028, 1322586, 1320852, 1321930, 1324836, 1328533, 1332776, 1337864, 1344151, 1352036, 1362024, 1374395, 1388919, 1404997, 1421924, 1438937, 1455302, 1470565, 1484702, 1497955, 1510665, 1523230, 1535844, 1547953, 1558130, 1564908, 1567937, 1568114, 1566443, 1562951, 1556880, 1547758, 1535973, 1522398, 1507866, 1493087, 1478589, 1464342, 1449635, 1433691, 1416454, 1398656, 1381218, 1364732, 1349262, 1334403, 1319599, 1304608, 1289487, 1274008, 1257445, 1239368, 1220431, 1201928, 1184653, 1168562, 1153416, 1139159, 1125664, 1112611, 1099799, 1087310, 1075359, 1064308, 1054643, 1046330, 1038212, 1028704, 1017333, 1005069, 992866, 980422]
52005I80422j3650j5087j5728j5443j4879j4595j4533j4141j3008j1483j0518
51994H27357j0659j1501j2350j3060j3788j4377j4553j4465j4417j4293j3876
51983F80018j3449j3467j3824j4117j4331j4573j4357j3050j0908q841p134n298
51971E36669l198j436l92K76R59J688K485L377L819L050J328m2l45l10q97k027
51955E45004l145m239n470o333o089m756l015j281N52K588M664O564Q178R545
51941E42767J0930J2578J4205J5103J5087J4948J5562J6903J8326J9392J9936
51930G15737J9704J8500J6478J3634R264K649n729j4224k1316k6470k9728l1169
51918F67330l0958k9508k7242k4392k1205j8038j5034j1948q607n457l344k571
$$ y = [980422, 966772, 951685, 935957, 920514, 905635, 891040, 876507, 862366, 849358, 837875, 827357, 816698, 805197, 792847, 779787, 765999, 751622, 737069, 722604, 708187, 693894, 680018, 666569, 653102, 639278, 625161, 610830, 596257, 581900, 568850, 557942, 549101, 541967, 536669, 533471, 532035, 531643, 531919, 532878, 534566, 537051, 540428, 544247, 547297, 548625, 548583, 548238, 547928, 547031, 545004, 541859, 537620, 532150, 525817, 519728, 514972, 511957, 510676, 511228, 513816, 518480, 525044, 533222, 542767, 553697, 566275, 580480, 595583, 610670, 625618, 641180, 658083, 676409, 695801, 715737, 735441, 753941, 770419, 784053, 793317, 795966, 790237, 776013, 754697, 728227, 698499, 667330, 636372, 606864, 579622, 555230, 534025, 515987, 500953, 489005, 480398, 474941, 471597, 469026]
51906D69026k469k029r81O6N01L70m5q69k419m471o311p482q071q237q009p526
51890D11044o977o119m468k166p0J293K270L220L883M083M491N716P147P560O746
51875D37653N673N020M402L242J634J0j439k652l441l767l888l928l477k149k92
51860D32601J172J661J368Q34M10K42L89P17P63Q1j236k619l679m582n597o487
51844D16038o735o284n666n299m948m082k606j014R9N51O88J000J620K214K429
51829C88005K261J869J207J78r29j616j744j560j205o06O9L71J65j63k68k05k0
51812C85809M70J195J546J019j81j437k328k634k220j260l19K44O28J096J487
51797C83115J612J594J384M19j497l274l408j694M87J632J302K2j278j748j152
$$ y = [469026, 466557, 464528, 463547, 463613, 464114, 464484, 464439, 463570, 461151, 456680, 450369, 442887, 434816, 426579, 418570, 411044, 404067, 397948, 393480, 391314, 391244, 392537, 394807, 398027, 401910, 405993, 410484, 416200, 423347, 430907, 437653, 443326, 448346, 452748, 455990, 457624, 457634, 456195, 453543, 450102, 446335, 442447, 438519, 435042, 432893, 432601, 433773, 435434, 436802, 437636, 438046, 438288, 438677, 439394, 440157, 440238, 439002, 436383, 432704, 428122, 422525, 416038, 409303, 403019, 397353, 392054, 387106, 383024, 380418, 379404, 379503, 380054, 380742, 381742, 383362, 385576, 388005, 390266, 392135, 393342, 393520, 392591, 390975, 389231, 387671, 386466, 385860, 385929, 386300, 386465, 386302, 386034, 385829, 385809, 386279, 387474, 389020, 390039, 389858, 388421, 386093, 383459, 381239, 379979, 379660, 379904, 380532, 381628, 383115, 384727, 386321, 387705, 388124, 386627, 383353, 379945, 378251, 378738, 380370, 381672, 381694, 380416, 378668, 377516]
51782C77516j62L91N28R05J626K058J938J951K765M027M859M999M922N047N274
51767D18644N302M978M228K962J203p35k466l907n299o700p625p541o659n846
51753C90539n597n497m918l828k615j538p30l89m54m41m1L82M65O11J382K428
51737C69759K885K662K464K536K361J703J019O02J75l25m18nK61M9l3M33P00q3
51719C86745j371j827j101r1M09M15J56k46l77L15J655K689K873K759L086L714
51703C99803L927L419K425J148l48j721k369k012r44L03J345J872J623O43o94
51688D08420k106l644n213o157n742m043k042p40m84r90j656j769r89J22M77k64
51672C73180j134r51L32J803K833L559M246M788M968M793M383L739K744J293m59
$$ y = [377516, 377354, 377745, 378273, 379178, 380804, 382862, 384800, 386751, 389516, 393543, 398402, 403401, 408323, 413370, 418644, 423946, 428924, 433152, 436114, 437317, 436582, 434116, 430209, 424910, 418210, 410585, 403044, 396385, 390539, 384942, 379445, 374527, 370699, 368084, 366546, 365816, 365427, 364973, 364532, 364491, 364873, 365338, 365949, 367331, 369759, 372644, 375306, 377770, 380306, 382667, 384370, 385389, 385991, 386166, 385841, 385423, 385418, 385679, 385728, 385695, 386128, 386828, 386745, 385374, 383547, 382446, 382355, 382764, 383179, 383335, 383089, 382712, 383027, 384682, 387371, 390244, 393003, 396089, 399803, 403730, 407149, 409574, 410722, 410374, 408653, 406284, 404272, 403328, 403631, 404976, 406848, 408471, 409114, 408420, 406314, 402670, 397457, 391300, 385558, 381515, 379473, 378733, 378249, 377259, 375603, 373834, 372845, 372967, 373444, 373180, 372046, 371095, 371427, 373230, 376063, 379622, 383868, 388656, 393624, 398417, 402800, 406539, 409283, 410576, 410117]
51657D10117j848j989o84J190K589L445M347N351N743M991L274R40j863m766p045
51642D23792q172q273p737o828n738m644l498k182r40k02J19N93J360J868J680
51627C81198R99J35q59j742k017j779j876k683l358l018k024j430j599k134k669
51612C55144k985k721j826r61p18p17k87L78P30J132K430M359N653N914O201P381
51596C79107Q910R781R719Q862P042M188R63j656l210l817l793l574l533l477
51582D05512k605m36K579N606Q283J0606J2430J3528J3944J3877J3439J2774J2154
51569E21691J1585J0669R105P179N524M736N415Q042J2339J7093K1086K3943K5741
51556F84148K6282K5281K2893J9487J5163J0047M724l02n205j0273j5007j8591
$$ y = [410117, 408269, 406280, 405596, 406786, 409375, 412820, 417167, 422518, 428261, 433252, 436526, 437466, 435603, 430837, 423792, 415620, 407347, 399610, 392782, 387044, 382400, 378902, 376720, 375780, 375578, 375697, 376290, 377650, 379518, 381198, 382197, 382332, 381473, 379731, 377714, 375935, 374059, 371376, 368018, 365000, 362976, 361546, 359947, 357813, 355144, 352159, 349438, 347612, 346651, 345933, 345216, 344929, 345307, 346037, 347169, 349599, 353958, 359611, 365525, 371726, 379107, 388017, 397798, 407517, 416379, 423421, 427609, 428572, 426916, 423706, 419889, 416096, 412522, 408989, 405512, 402907, 402471, 405050, 410656, 418939, 429545, 441975, 455503, 469447, 483324, 496763, 509537, 521691, 533276, 543945, 553050, 560229, 565753, 570489, 575904, 583946, 596285, 613378, 634464, 658407, 684148, 710430, 735711, 758604, 778091, 793254, 803301, 808025, 807723, 802518, 792245, 777238, 758647]
51544G58647k1078k3200k5128k6299k6425k5715k4040k0974j7049j3858j2314
51533E22567j1596j0364q336o063l958k366j917k854m373n454o032o570o906o535
51519D39243n809n685o236o439n714m688m124l918l668l441l481l618l617l599
51505C75206l656l463k789k005j567j347j008o80o24n04K01J225J681J281P18
51490C62669O67R96J180J053Q12O38N49M71K72j60p48j247j466j354j035r02j433
51473C60962k540l350l136k321j992k414k833k726k456k373k100j273l40qk03
51458C30897k34K63J121K073K914L385L426L406L711M321N144O405Q148R761J0616
51443C95357J0892J1005J0564Q873O343M262L080J957M13p96j074j266k607m940
$$ y = [758647, 737569, 714369, 689241, 662942, 636517, 610802, 586762, 565788, 548739, 534881, 522567, 510971, 500607, 492271, 486208, 482250, 479884, 477967, 475113, 470740, 465286, 459254, 452684, 445778, 439243, 433434, 427749, 421513, 415074, 409360, 404672, 400548, 396630, 392962, 389521, 386040, 382422, 378805, 375206, 371550, 368087, 365298, 363293, 361726, 360379, 359371, 358691, 358067, 357563, 357764, 358989, 360670, 361951, 362669, 363336, 364332, 365512, 366565, 367377, 368015, 368564, 369035, 369307, 369147, 368399, 367152, 365686, 364332, 363297, 362395, 360962, 358422, 355072, 351936, 349615, 347623, 345209, 342376, 339650, 337194, 334821, 332721, 331448, 331108, 331100, 330897, 330663, 330926, 332047, 334120, 337034, 340419, 343845, 347251, 350962, 355283, 360427, 366832, 374980, 384741, 395357, 406249, 417254, 427818, 436691, 443034, 447296, 450376, 452333, 452746, 451950, 450876, 449610, 447003, 442063]
51429D42063o994q048q401q387p881o895n872n149m561l811k856j869j170j145
51415C69024j849k623k546j485k85K72K78K98N44Q09J038J459K160K812K999K691
51399C75596K285K176K344K425K172J782J700K206L305M849O587Q109R135R903
51385D34574J1119J3292J6258J9428K2408K5155K7751L0166L2285L4025L5291
51374G01752L5842L5258L3089K9095K3391J6433Q906J543n169j1242j7025k2678
51362H29195k7861l2031l4908l6553l7087l6563l5035l2548k9222k5485k2029
51351D79873j9173j6465j3436j0603r037q813q665p596o126n307n080m488l237
51338C61847k045j422j062o89o41j065j279o25M83J111J146J293J799J950J111
$$ y = [442063, 435069, 427021, 418620, 410233, 402352, 395457, 389585, 384436, 379875, 376064, 373208, 371339, 370169, 369024, 367175, 364552, 362006, 360521, 360236, 360508, 360786, 361084, 361628, 362437, 363475, 364934, 367094, 369906, 372905, 375596, 377881, 380057, 382401, 384826, 386998, 388780, 390480, 392686, 395991, 400840, 407427, 415536, 424671, 434574, 445693, 458985, 475243, 494671, 517079, 542234, 569985, 600151, 632436, 666461, 701752, 737594, 772852, 805941, 835036, 858427, 874860, 883766, 885309, 880140, 868898, 851873, 829195, 801334, 769303, 734395, 697842, 660755, 624192, 589157, 556609, 527387, 501902, 479873, 460700, 444235, 430799, 420196, 411159, 402346, 393681, 386085, 379959, 374652, 369572, 365084, 361847, 359802, 358380, 357318, 356629, 355988, 354923, 353644, 353019, 353502, 354613, 355759, 357052, 358851, 360801, 361912]
51323C61912l74j624k172k101j647j098q61j073j239p08M25J273J182M67j69n42
51307C51651r59j448j553j042l76j81m87q14q57p49o98p53r13j191j352r90r7
51290C37191O89P64L39K05P72J763K822L930N032N606N132L792K385J454Q66K52
51274C72994l95p77p54n02k19J24O60J341J915K142J926J262K37q36j518j722
51258C75878j967k708l469l219j879q17j234k455k733j675p41j023j607j013M97
51243C49835J203L19j094j729j509j067n82J24Q85J300J346J298J205R35O12N48
51227C53629P75J087J455J934K205J772P22j62k82J66N89O73M39l3n64p91m00
51210C63214N30J547K171K198J811J515J744K473L259L635L361K391R78k52p61
$$ y = [361912, 361538, 359914, 357742, 355641, 353994, 352896, 352035, 350962, 349723, 349015, 349440, 350713, 351895, 352362, 352193, 351651, 350692, 349244, 347691, 346649, 346273, 346092, 345605, 344791, 343934, 343185, 342487, 341734, 340821, 339630, 338278, 337288, 337191, 337880, 338644, 338983, 339188, 339960, 341723, 344545, 348475, 353507, 359113, 364245, 368037, 370422, 371876, 372742, 372994, 372599, 371822, 371068, 370566, 370347, 370471, 371131, 372472, 374387, 376529, 378455, 379717, 379954, 379118, 377600, 375878, 373911, 371203, 367734, 364515, 362636, 361819, 360585, 358130, 355397, 353722, 352981, 351958, 350351, 349338, 349835, 351038, 351357, 350263, 348534, 347025, 345958, 345376, 345500, 346385, 347685, 349031, 350329, 351534, 352469, 353081, 353629, 354404, 355491, 356946, 358880, 361085, 362857, 363579, 363417, 363135, 363301, 363890, 364563, 365002, 364969, 364405, 363614, 363214, 363744, 365291, 367462, 369660, 371471, 372986, 374730, 377203, 380462, 384097, 387458, 389849, 390827, 390575, 389814]
51195C89814p35q28j173j155m62K30J12n33o57J70J257J658J073j13j222j657
51179C85779j334q12p20r46p94M0R82J289Q83K89j0J68P87J589K049J720P52j29
51161C91582l88l32p22j744k636k642k114k105k914l562l037j594l62n9m88j118
51145C65765j537j436p99j03J63K25P64J786K352J753N33j33J97R04J234J165
51129C72833J187J548J983K249K500K908L072K435J316Q27J450K280K320J838
51115D00746J668J712J207K58j73J41L34k7k26K70Q24P23L36M08Q91J314J671
51098D12077K067K098J475Q42R78J519J431N88j19j98j15l45o57n90o2O42J105
51081D22736R73L82LK55O52N97M08P80J511J794J681K068L123L880L774L496L785
$$ y = [389814, 389079, 388251, 387078, 385923, 385461, 385691, 385803, 385270, 384613, 384783, 386040, 387698, 388771, 388658, 387436, 385779, 384445, 383633, 382913, 381967, 381173, 381213, 382195, 383484, 384367, 384656, 384646, 384814, 385601, 387190, 389239, 390959, 391711, 391582, 391194, 390862, 390140, 388396, 385760, 383118, 381004, 378899, 375985, 372423, 369386, 367792, 367430, 367371, 366883, 365765, 364228, 362792, 361993, 361890, 362053, 362278, 363042, 364828, 367180, 368933, 369466, 369333, 369530, 370434, 371668, 372833, 374020, 375568, 377551, 379800, 382300, 385208, 388280, 390715, 392031, 392858, 394308, 396588, 398908, 400746, 402414, 404126, 405333, 405591, 405418, 405559, 405893, 405866, 405640, 405910, 406734, 407457, 407793, 408201, 409092, 410406, 412077, 414144, 416242, 417717, 418559, 419537, 421056, 422487, 423075, 422956, 422758, 422643, 422298, 421641, 421051, 420989, 421631, 422736, 423709, 424091, 424094, 424349, 425001, 425598, 426006, 426786, 428297, 430091, 431772, 433840, 436963, 440843, 444617, 448113, 451898]
51064D51898M467N298O763R050J1051J1495J0699J0128J0474J1030J0887R935
51052E63175Q627P563P335Q068Q899Q498O353L186L7k578m542n845o704p508q184
51037E86380q017o585m561l156k916l475m365n466o574p160o886o005m910l631
51023E12673k174j021o01m38N09K391M134M831M916N440O663P982Q959R778J0683
51008E74725J1608J2330J2647J2382J1617J0832J0403R979Q890P107N322L976
50996F91818K800J460J43p88j285j485j362p14O37K649M837O337O782O987Q299
50981G27115J1014J3990J5924J6450J5958J5098J4804J6073J9101K3000K6835
50970I15362L0524L4384L8311M2025M5607M9243N2752N5893N8825O1675O3973
$$ y = [451898, 456365, 461663, 468426, 477476, 488527, 500022, 510721, 520849, 531323, 542353, 553240, 563175, 571802, 579365, 586700, 594768, 603667, 612165, 618518, 621704, 621741, 619163, 614621, 608776, 602072, 594564, 586380, 578363, 571778, 567217, 564061, 561145, 557670, 553305, 547839, 541265, 534105, 527219, 521214, 516304, 512673, 510499, 509478, 508877, 508439, 508948, 511339, 515473, 520304, 525220, 530660, 537323, 545305, 554264, 564042, 574725, 586333, 598663, 611310, 623692, 635309, 646141, 656544, 666523, 675413, 682520, 687842, 691818, 694618, 696078, 696221, 695433, 694148, 692663, 691301, 690587, 691224, 693873, 698710, 705047, 711829, 718816, 727115, 738129, 752119, 768043, 784493, 800451, 815549, 830353, 846426, 865527, 888527, 915362, 945886, 980270, 1018581, 1060606, 1106213, 1155456, 1208208, 1264101, 1322926, 1384601, 1448574]
50959A448574O5114O5098O4152O1950N7981N2573M6791M1303L5925L0363K4722
50948A994546J9265J4294J0325P774O353N255M100L056J965Ql346p570j1648j5023
50934B029354j7612j9438k0728k2216k4646k8029l1740l5406l9284m3589m7823
50923A698843n1063n2924n3913n4723n5350n5161n3757n1424m8683m5672m2284
50912A133889l8569l4752l0979k7389k4321k2090k0569j9258j7802j6229j4644
50901H67287j3023j1360r809q530p512o608n680m728l858l115k391j637j117j080
50887G86839j161n86P95K183K939L500M620O098P061P344P713Q654R756J0481
50873H56236J0982J1716J2834J4244J5862J7515J8946K0211K1809K4084K6820
$$ y = [1448574, 1513688, 1578786, 1642938, 1704888, 1762869, 1815442, 1862233, 1903536, 1939461, 1969824, 1994546, 2013811, 2028105, 2038430, 2046204, 2052557, 2057812, 2061912, 2064968, 2066933, 2066941, 2063595, 2056025, 2044377, 2029354, 2011742, 1992304, 1971576, 1949360, 1924714, 1896685, 1864945, 1829539, 1790255, 1746666, 1698843, 1647780, 1594856, 1540943, 1486220, 1430870, 1375709, 1321952, 1270528, 1221845, 1176173, 1133889, 1095320, 1060568, 1029589, 1002200, 977879, 955789, 935220, 915962, 898160, 881931, 867287, 854264, 842904, 833095, 824565, 817053, 810445, 804765, 800037, 796179, 793064, 790673, 789036, 787919, 786839, 785678, 785092, 785887, 788070, 791009, 794509, 799129, 805227, 812288, 819632, 827345, 835999, 845755, 856236, 867218, 878934, 891768, 906012, 921874, 939389, 958335, 978546, 1000355, 1024439, 1051259]
50862A051259K9675L2692L6084L9838M3925M8624N4277O0691O7297P3848Q0757
50851A618967Q8539R7104J05778J13997J21787J29372J36364J41716J44614J45147
50841B843385J43784J40487J34793J26425J15322J01226Q4024O4695M5222K7253
50831C826616J1309k575j4095k2933k9202l3004l3913l1518k6303j9542j2441
50820C612399n836o24K045J224l395j1515k2497l5605n0159o5539q0960r5482
50808C244056j08326j19091j27478j33009j35290j34472j31145j25782j18496
50799B110967j09417r9105q8443p8160o8502n9363n0604m2179l4016k6116j8812
50788A436250j2729q198m901k326m30N14M77l17j783l821n865p188p793q457r736
$$ y = [1051259, 1080934, 1113626, 1149710, 1189548, 1233473, 1282097, 1336374, 1397065, 1464362, 1538210, 1618967, 1707506, 1804610, 1910388, 2024385, 2146172, 2275544, 2411908, 2553624, 2698238, 2843385, 2987169, 3127656, 3262449, 3388874, 3504196, 3605422, 3689446, 3754141, 3799363, 3826616, 3837925, 3835350, 3821255, 3798322, 3769120, 3736116, 3702203, 3670685, 3644382, 3624840, 3612399, 3606563, 3605939, 3607984, 3609208, 3605813, 3594298, 3571801, 3536196, 3486037, 3420498, 3339538, 3244056, 3135730, 3016639, 2889161, 2756152, 2620862, 2486390, 2355245, 2229463, 2110967, 2001550, 1902445, 1814002, 1735842, 1667340, 1607977, 1557373, 1515194, 1481178, 1455062, 1436250, 1423521, 1415323, 1410422, 1408096, 1407666, 1408180, 1408657, 1408340, 1406557, 1402736, 1396871, 1389683, 1381890, 1373433, 1363697]
50773A363697j1432j3149j4779j6278j7537j8723k0194k1831k3044k3616k3869
50762A159245k3738k2571k0409j8457j7463j6447j4129j0958q446o785m600j132
50750I94110K668N646P964J0554J3815J7449K1066K4434K7577L0969L5221M0218
50738A231691M4990M8810N2031N5433N9220O3025O6610O9869P2430P3848P4306
50727A912263P4534P4831P4515P2538O8560O3196N7183N0510M2431L2330K0407
50716B543298P474n620j8081k8795l6420m0145m0265l7799l3607k8000k1121j3524
50704B247395o230k04M114O624P029M820p8p020j5306k4805l5479m6482n6328
50691B078050o4027o9555p3065p4164p2365o7948o1967n5418m8690m1739l4524
$$ y = [1363697, 1352265, 1339116, 1324337, 1308059, 1290522, 1271799, 1251605, 1229774, 1206730, 1183114, 1159245, 1135507, 1112936, 1092527, 1074070, 1056607, 1040160, 1026031, 1015073, 1006627, 999842, 995242, 994110, 996778, 1002424, 1010388, 1020942, 1034757, 1052206, 1073272, 1097706, 1125283, 1156252, 1191473, 1231691, 1276681, 1325491, 1377522, 1432955, 1492175, 1555200, 1621810, 1691679, 1764109, 1837957, 1912263, 1986797, 2061628, 2136143, 2208681, 2277241, 2340437, 2397620, 2448130, 2490561, 2522891, 2543298, 2550772, 2545152, 2527071, 2498276, 2461856, 2421711, 2381446, 2343647, 2310040, 2282040, 2260919, 2247395, 2241165, 2240961, 2245075, 2251699, 2258728, 2263548, 2263470, 2256450, 2241144, 2216339, 2180860, 2134378, 2078050, 2014023, 1944468, 1871403, 1797239, 1724874, 1656926, 1594959, 1539541, 1490851, 1449112, 1414588]
50680A414588k7115j9537j1720l759L877J0668J6606K2175K7542L2107L5186L6884
50668A537502L7782L7872L6486L3421K9584K6124K3290K0571J7691J5058J3201
50657A828582J2092J1192J0091Q900Q045P732P871Q538J0127J2790J5996J9026
50645A960982K1797K4774K8099L1366L4279L7024L9776M2232M3919M4649M4416
50634B353313M3155M0886L8045L5352L3334L1919L0407K7948K4200J9339J3071
50623B690969M037q988k5002m0571n2128n8095n8741n4923m7781l9113l0722k3180
50611B255762j5830q258j273L820O435O872N533K416k639r550j7981k7529l7613
50598B160165m7286n5444o1477o5536o8017o9014o8569o7136o5245o2800n9279
$$ y = [1414588, 1387473, 1367936, 1356216, 1352457, 1356334, 1367002, 1383608, 1405783, 1433325, 1465432, 1500618, 1537502, 1575284, 1613156, 1649642, 1683063, 1712647, 1738771, 1762061, 1782632, 1800323, 1815381, 1828582, 1840674, 1851866, 1861957, 1870857, 1878902, 1886634, 1894505, 1903043, 1913170, 1925960, 1941956, 1960982, 1982779, 2007553, 2035652, 2067018, 2101297, 2138321, 2178097, 2220329, 2264248, 2308897, 2353313, 2396468, 2437354, 2475399, 2510751, 2544085, 2576004, 2606411, 2634359, 2658559, 2677898, 2690969, 2695006, 2686018, 2661016, 2620445, 2568317, 2510222, 2451481, 2396558, 2348777, 2309664, 2278942, 2255762, 2239932, 2231674, 2230401, 2234221, 2240656, 2247528, 2253061, 2255477, 2252838, 2243288, 2225307, 2197778, 2160165, 2112879, 2057435, 1995958, 1930422, 1862405, 1793391, 1724822, 1657686, 1592441, 1529641, 1470362]
50587A470362n4814n0392m6775m3664m0309l6535l2701k8992k5222k1225j7122
50576A072611j3184r681o625l663m40K787N355P164Q969J1298J3666J5401J6694
50563A120352J8210K0030K1848K3931K6920L0536L3417L4605L4643L4827L5773
50552A435092L7055L7915L7957L7297L6288L5123L3720L2161L1060L1172L2595
50541A817435L4713L7033L9714M3159M7394N2116N7113O2441O8236P4482Q0969
50530B414805Q7516R4224J01335J08665J15436J20918J25009J27766J28668J26915
50520C551257J22369J15555J06642R5078Q0436O3117M3942K3527K394j8764l9318
50509D146235n8968p7327r3520j06499j15595j20578j21379j18096j11060j00632
$$ y = [1470362, 1415548, 1365156, 1318381, 1274717, 1234408, 1197873, 1165172, 1136180, 1110958, 1089733, 1072611, 1059427, 1049746, 1043121, 1039458, 1039018, 1041805, 1047160, 1054324, 1063293, 1074591, 1088257, 1103658, 1120352, 1138562, 1158592, 1180440, 1204371, 1231291, 1261827, 1295244, 1329849, 1364492, 1399319, 1435092, 1472147, 1510062, 1548019, 1585316, 1621604, 1656727, 1690447, 1722608, 1753668, 1784840, 1817435, 1852148, 1889181, 1928895, 1972054, 2019448, 2071564, 2128677, 2191118, 2259354, 2333836, 2414805, 2502321, 2596545, 2697880, 2806545, 2921981, 3042899, 3167908, 3295674, 3424342, 3551257, 3673626, 3789181, 3895823, 3990901, 4071337, 4134454, 4178396, 4201923, 4204317, 4185553, 4146235, 4087267, 4009940, 3916420, 3809921, 3694326, 3573748, 3452369, 3334273, 3223213, 3122581]
50499C122581q7049p0802n2983l4897j7333m38J5679L0360M2410N0522N3729N1536
50487C103315M3734L0372J2138r356l2120n4683p6163r5493j11192j22184j28412
50476B559956j30448j28872j24303j17598j09534j00556r1218q2473p5048o8759
50466A531147o2977n7470n2362m7484m2424l7158l2045k7205k2483j7991j4063
50455A117485j0605p103l447j96K268M199N891P119P736Q300R572J1520J3383
50442A166122J4669J5536J6209J6400J5558J3528J0810Q214O383N457N120M923
50430A298929M587M182M076M641N905P496R105J0873J3106J5724J8330K0886K3927
50417A441767K7926L2761L7994M3395M8937N4491N9772O4543O8593P1665P3505
$$ y = [3122581, 3035532, 2964730, 2911747, 2876850, 2859517, 2859079, 2874758, 2905118, 2947528, 2998050, 3051779, 3103315, 3147049, 3177421, 3189559, 3180203, 3148083, 3093400, 3017237, 2921744, 2810552, 2688368, 2559956, 2429508, 2300636, 2176333, 2058735, 1949201, 1848645, 1757427, 1674954, 1599906, 1531147, 1468170, 1410700, 1358338, 1310854, 1268430, 1231272, 1199227, 1172022, 1149539, 1131548, 1117485, 1106880, 1099777, 1096330, 1096134, 1098402, 1102601, 1108492, 1115611, 1123347, 1131647, 1141219, 1152739, 1166122, 1180791, 1196327, 1212536, 1228936, 1244494, 1258022, 1268832, 1277046, 1283429, 1288886, 1294006, 1298929, 1303516, 1307698, 1311774, 1316415, 1322320, 1329816, 1338921, 1349794, 1362900, 1378624, 1396954, 1417840, 1441767, 1469693, 1502454, 1540448, 1583843, 1632780, 1687271, 1747043, 1811586, 1880179, 1951844, 2025349]
50406B025349P3889P2479O9085O4207N8870N3486M7118L8505K7563J5401K940
50395B548892r713k2547l5057m6680n7212o6410p3653p8395q0574q0151p6733
50384A921767p0215o1531n2114m2656l2947k2890j3093m246L559J0596J6778K1419
50372A674427K3646K2892J9147J2842M585n001j5156k5016l3905m1541m7754n2151
50360A537015n4377n4515n2991n0260m6833m3369m0116l6468l1702k6249k1485
50349A078650j8156j5809j4047j3501j4863j7552k0122k1718k2338k2033k0635
50338H77876j8307j5557j2609r388o221l924k874k483j908q94L30J555K702L693
50324H11991M559N496O595P587Q107Q075P661P077O449N782M942L867K871K465
$$ y = [2025349, 2099238, 2171717, 2240802, 2305009, 2363879, 2417365, 2464483, 2502988, 2530551, 2545952, 2548892, 2539179, 2516632, 2481575, 2434895, 2377683, 2311273, 2237620, 2159225, 2078651, 1998500, 1921767, 1851552, 1790021, 1737907, 1695251, 1662304, 1639414, 1626321, 1622075, 1625634, 1636230, 1653008, 1674427, 1698073, 1720965, 1740112, 1752954, 1757539, 1752538, 1737382, 1712366, 1678461, 1636920, 1589166, 1537015, 1482638, 1428123, 1375132, 1324872, 1278039, 1234670, 1194554, 1158086, 1126384, 1100135, 1078650, 1060494, 1044685, 1030638, 1017137, 1002274, 984722, 964600, 942882, 920544, 898511, 877876, 859569, 844012, 831403, 822015, 815794, 811870, 808996, 806513, 804605, 803711, 804041, 805596, 808298, 811991, 816550, 822046, 828641, 836228, 844335, 852410, 860071, 867148, 873597, 879379, 884321, 888188, 891059, 893524]
50310H93524K735L150L165K821K528K481K505K436K334K407K754L185L275K804
50296I32104K205K213K951L605L336K265J246Q63J042J459J906K173K054J686
50282I61108J547J931K604L210L834M830O143P111P128O270N193M498M409M932
50268A024748N920O976P629P868Q283R419J1168J2999J4625J6222J8110K0491
50256A164458K3269K5791K7042K6570K5106K3794K2924K1936K0520J9002J7695
50245A418107J6591J5774J5195J3854J0213M024l048r271j4555j9608k4211k7372
50233A395693k8724k8707k7594k5405k2695k0458j9196j8963k0206k3451k7977
50222A132317l1860l3799l4078l3387l1707k8968k5973k3705k2120k0414j8208
$$ y = [893524, 896259, 899409, 902574, 905395, 907923, 910404, 912909, 915345, 917679, 920086, 922840, 926025, 929300, 932104, 934309, 936522, 939473, 943078, 946414, 948679, 949925, 950788, 951830, 953289, 955195, 957368, 959422, 961108, 962655, 964586, 967190, 970400, 974234, 979064, 985207, 992318, 999446, 1005716, 1010909, 1015407, 1019816, 1024748, 1030668, 1037644, 1045273, 1053141, 1061424, 1070843, 1082011, 1095010, 1109635, 1125857, 1143967, 1164458, 1187727, 1213518, 1240560, 1267130, 1292236, 1316030, 1338954, 1360890, 1381410, 1400412, 1418107, 1434698, 1450472, 1465667, 1479521, 1489734, 1493758, 1490710, 1481439, 1466884, 1447276, 1423065, 1395693, 1366969, 1338262, 1310668, 1285263, 1262568, 1242110, 1222914, 1203951, 1183745, 1160294, 1132317, 1100457, 1066658, 1032580, 999193, 967486, 938518, 912545, 888840, 866720, 846306, 828098]
50211H28098j5868j3840j2216j0907r738q451p009n812n252n162n051m783m643
50198G19366m768m839m429l534k668k536l356m516n065m686l955l473l193k826
50184F65522k513k537k682k422j704r89n64l21j96l17n07k17P27J734K180K270
50168F57464K633L279L488K942K369K725M002N317O112O732P707Q963J0074J0968
50154G34775J1937J3137J4549J6176J7890J9134J9477J9435K0195K2299K5217
50143I34221K8358L1959L6515M1841M7120N1561N4650N6160N6361N5884N4936
50132A449566N3086N0282M7607M6189M5510M3625L9049L1793K2588J1933J57j2252
50120A829133k4781l6934m7829n6220o1276o3256o3150o1883n9932n7311n3747
$$ y = [828098, 812230, 798390, 786174, 775267, 765529, 757078, 750069, 744257, 739005, 733843, 728792, 724009, 719366, 714598, 709759, 705330, 701796, 699128, 696592, 693236, 688720, 683655, 678969, 675014, 671541, 668348, 665522, 663009, 660472, 657790, 655368, 653664, 652675, 652111, 651790, 651594, 651277, 650770, 650553, 651280, 653014, 655194, 657464, 660097, 663376, 666864, 669806, 672175, 674900, 678902, 684219, 690331, 697063, 704770, 713733, 723807, 734775, 746712, 759849, 774398, 790574, 808464, 827598, 847075, 866510, 886705, 909004, 934221, 962579, 994538, 1031053, 1072894, 1120014, 1171575, 1226225, 1282385, 1338746, 1394630, 1449566, 1502652, 1552934, 1600541, 1646730, 1692240, 1735865, 1774914, 1806707, 1829295, 1841228, 1841385, 1829133, 1804352, 1767418, 1719589, 1663369, 1602093, 1538837, 1475687, 1413804, 1353872, 1296561, 1242814]
50109A242814m9136m4022l9372l5696l2665k9864k7487k5912k4846k3408k1111
50098H89295j8338j5797j3744j1966j0242q562o931n218l347j481J66J543K625
50085G98003L166L030K745L166M373N432N596N270N217N284M768L782L288L744
50071H56864M503M775M437L688K627J523P42N7j249l130m390m244l515l498m162
50056H55028m469m103l771l868l877l289k261j111J81J656L175M761O649Q723
50042H53424J0396J1347J1913J2500J3078J3525J4011J4666J5247J5531J5689
50031A001327J5876J5847J5436J5055J5165J5461J5302J4857J5144J6784J9217
50020A175471K1371K2673K3140K2951K2307K1556K0989K0451J9451J7749J5736
$$ y = [1242814, 1193678, 1149656, 1110284, 1074588, 1041923, 1012059, 984572, 958660, 933814, 910406, 889295, 870957, 855160, 841416, 829450, 819208, 810646, 803715, 798497, 795150, 793669, 793835, 795378, 798003, 801169, 804199, 806944, 810110, 814483, 819915, 825511, 830781, 835998, 841282, 846050, 849832, 853120, 856864, 861367, 866142, 870579, 874267, 876894, 878417, 879159, 879216, 877967, 874837, 870447, 866203, 862688, 859190, 855028, 850559, 846456, 842685, 838817, 834940, 831651, 829390, 828279, 828460, 830116, 833291, 838052, 844701, 853424, 863820, 875167, 887080, 899580, 912658, 926183, 940194, 954860, 970107, 985638, 1001327, 1017203, 1033050, 1048486, 1063541, 1078706, 1094167, 1109469, 1124326, 1139470, 1156254, 1175471, 1196842, 1219515, 1242655, 1265606, 1287913, 1309469, 1330458, 1350909, 1370360, 1388109, 1403845]
50009A403845J4121J3239J2577J1027P696K523l807j0553j7409k4405l1505l8290
49997A339059m3907m7332m7997m6292m3374m0306l7463l4769l2253l0110k8385
49986I06871k6900k5510k4120k2506k0392j7853j5423j3618j2511j1825j1262
49975G04951j0588r578q190o750n698n098m563l697k572j694j542k044k556k394
49961F37987j493l24Q33K234M059N777O615O593O573P084P611P306O055M501L193
49946G04604K097R60k59j431k496l501m491n492o605p959r456j0632j1030j0781
49932F33528j0624j0949j1107j0097p961n953n043m783m050k540r34K48J274K478
49918E63487L464L514K604J667J629K420L159L340L456M210N391O200O545P252
$$ y = [1403845, 1417966, 1431205, 1443782, 1454809, 1462505, 1465028, 1461221, 1450668, 1433259, 1408854, 1377349, 1339059, 1295152, 1247820, 1199823, 1153531, 1110157, 1069851, 1032388, 997619, 965366, 935256, 906871, 879971, 854461, 830341, 807835, 787443, 769590, 754167, 740549, 728038, 716213, 704951, 694363, 684785, 676595, 669845, 664147, 659049, 654486, 650789, 648217, 646523, 644981, 642937, 640381, 637987, 636494, 636170, 637003, 639237, 643296, 649073, 655688, 662281, 668854, 675938, 683549, 690855, 696910, 701411, 704604, 706701, 707661, 707402, 705971, 703475, 699974, 695483, 689991, 683386, 675427, 665971, 655339, 644309, 633528, 622904, 611955, 600848, 590751, 582790, 576837, 571794, 567011, 562961, 560421, 559487, 559735, 561009, 563487, 566951, 570465, 573069, 574736, 576365, 578785, 581944, 585284, 588740, 592950, 598341, 604541, 611086, 618338]
49904F18338Q674R943J0168R734R453Q976P190M135J343o0o10j435k841m543o486
49889F71979q541j0017j0313r849r510r370q804p806p261p687q435q482p610o392
49875E51902n396m679l942k906j689q44p61r86n34R46K680L740M213N003O629
49860E53376Q600J0025J0532J0494J0474J0587J0440R609Q120O371M644K988J509
49847F57769M36k80j102k434m167n927p490q673r099q583p605o850o247n082l287
$$ y = [618338, 627012, 636955, 647123, 656857, 666310, 675286, 682476, 686611, 687954, 687894, 687284, 685849, 683008, 678465, 671979, 663438, 653421, 643108, 633259, 623749, 614379, 605575, 597769, 590508, 582821, 574386, 565904, 558294, 551902, 546506, 541827, 537885, 534979, 533290, 532446, 531685, 530699, 530165, 531111, 533791, 537531, 541744, 546747, 553376, 561976, 572001, 582533, 593027, 603501, 614088, 624528, 634137, 642257, 648628, 653272, 656260, 657769, 658205, 657925, 656823, 654389, 650222, 644295, 636805, 628132, 619033, 610450, 602845, 595995, 589748, 584666, 581379]
$$ [...]
##END NTUPLES=NMR SPECTRUM
##END=
