
##TITLE=AC1302_PERAH12114_6608382_PZ89wDSsjw
##JCAMPDX= 6.0         $$ Bruker NMR JCAMP-DX V2.0
##DATA TYPE= NMR SPECTRUM
##DATA CLASS= NTUPLES
##ORIGIN= BRUKER
##OWNER= Administrator
$$ 1.72 TOPSPIN		Version 2.1
$$ 2012-08-01 13:35:36.234 -0500  Administrator@TOPSPIN
$$ Compression mode = diff/dup
##.OBSERVE FREQUENCY= 400.02188249412
##.OBSERVE NUCLEUS= ^1H
##.ACQUISITION MODE= SIMULTANEOUS (DQD)
##.ACQUISITION SCHEME= undefined
##.AVERAGES= 8
##.DIGITISER RES= 22
##SPECTROMETER/DATA SYSTEM= spect
##.PULSE SEQUENCE= zg30
##.SOLVENT NAME= COFFEE_meoh
##.SHIFT REFERENCE= INTERNAL, COFFEE_meoh, 1, 14.98509
##AUDIT TRAIL= $$ (NUMBER, WHEN, WHO, WHERE, PROCESS, VERSION, WHAT)
$$ ##TITLE= Audit trail, TOPSPIN		Version 2.1
$$ ##JCAMPDX= 5.01
$$ ##ORIGIN= Bruker BioSpin GmbH
$$ ##OWNER= Administrator
$$ $$ C:\Bruker\TOPSPIN/data/COFFEE/nmr/AC1302_PERAH12114_6608382_PZ89wDSsjw/10/pdata/1/auditp.txt
$$ ##AUDIT TRAIL=  $$ (NUMBER, WHEN, WHO, WHERE, PROCESS, VERSION, WHAT)
(   1,<2012-08-01 13:35:28.640 -0500>,<Administrator>,<TOPSPIN>,<go>,<TOPSPIN 2.1>,
      <created by zg
	started at 2012-08-01 13:34:21.984 -0500,
	POWCHK enabled, PULCHK disabled,
       configuration hash MD5:
       6B 1B 68 BB D9 2E 58 E2 7F 35 AD 54 07 DF 0E 41
       data hash MD5: 64K
       F2 34 FD 79 21 CC 5F C6 43 99 D0 91 78 F8 12 63>)
(   2,<2012-08-01 13:35:31.593 -0500>,<Administrator>,<TOPSPIN>,<proc1d>,<TOPSPIN 2.1>,
      <Start of raw data processing
       efp LB = 0 FT_mod = 6 PKNL = 1 PHC0 = 0 PHC1 = 0 SI = 32K 
       data hash MD5: 32K
       C0 CE FE 40 4F D9 18 49 43 38 B2 15 5A 9F AF C3>)
(   3,<2012-08-01 13:35:31.953 -0500>,<Administrator>,<TOPSPIN>,<proc1d>,<TOPSPIN 2.1>,
      <pk PHC0 = 175.7318 PHC1 = 0 
       data hash MD5: 32K
       CD A6 1E 80 1E 5E 1E 62 CC 1A B6 47 D2 F0 A8 2C>)
(   4,<2012-08-01 13:35:32.093 -0500>,<Administrator>,<TOPSPIN>,<proc1d>,<TOPSPIN 2.1>,
      <abs ABSG = 1 
       data hash MD5: 32K
       4B 5A 9D 42 95 37 F4 56 C3 73 F2 4A D9 CB 49 EE>)
(   5,<2012-08-01 13:35:32.125 -0500>,<Administrator>,<TOPSPIN>,<proc1d>,<TOPSPIN 2.1>,
      <abs ABSG = 2 
       data hash MD5: 32K
       38 A9 63 9A CC D9 BE 2A 73 AE 1D 29 90 C3 FD 4C>)
(   6,<2012-08-01 13:35:32.187 -0500>,<Administrator>,<TOPSPIN>,<proc1d>,<TOPSPIN 2.1>,
      <abs ABSG = 3 
       data hash MD5: 32K
       FE 61 F9 C8 9E 52 D9 9F C4 34 1D 4E 90 98 57 A3>)
(   7,<2012-08-01 13:35:32.234 -0500>,<Administrator>,<TOPSPIN>,<proc1d>,<TOPSPIN 2.1>,
      <abs ABSG = 4 
       data hash MD5: 32K
       6C CE 9B F1 34 96 77 71 A7 84 BF A8 75 C1 1B 44>)
(   8,<2012-08-01 13:35:32.265 -0500>,<Administrator>,<TOPSPIN>,<proc1d>,<TOPSPIN 2.1>,
      <abs ABSG = 5 
       data hash MD5: 32K
       1D 01 64 81 C4 6E ED 5C 31 26 EA 97 8F CA E1 AE>)
$$ ##END=
$$ 
$$ $$ hash MD5
$$ $$ DD 28 15 79 B4 9C 58 DA AA 10 D0 CA DA 61 4F 38
##$RELAX= 
##$RELAX= 
##$RELAX= 
##$RELAX= 
##$RELAX= 
##$RELAX= 
##$RELAX= 
$$ Bruker specific parameters
$$ --------------------------
$$ [...]
##$TP= (0..7)
150 150 150 150 150 150 150 150
##$TP07= 0
##$TPNAME0= <>
##$TPNAME1= <>
##$TPNAME2= <>
##$TPNAME3= <>
##$TPNAME4= <>
##$TPNAME5= <>
##$TPNAME6= <>
##$TPNAME7= <>
##$TPOAL= (0..7)
0.5 0.5 0.5 0.5 0.5 0.5 0.5 0.5
##$TPOFFS= (0..7)
0 0 0 0 0 0 0 0
##$TUNHIN= 0
##$TUNHOUT= 0
##$TUNXOUT= 0
##$USERA1= <user>
##$USERA2= <user>
##$USERA3= <user>
##$USERA4= <user>
##$USERA5= <user>
##$V9= 5
##$VALIST= <valist>
##$VCLIST= <CCCCCCCCCCCCCCC>
##$VD= 0
##$VDLIST= <DDDDDDDDDDDDDDD>
##$VPLIST= <PPPPPPPPPPPPPPP>
##$VTLIST= <TTTTTTTTTTTTTTT>
##$WBST= 1024
##$WBSW= 4
##$XGAIN= (0..3)
0 0 0 0
##$XL= 0
##$YL= 0
##$YMAX_a= 485073
##$YMIN_a= -613684
##$ZGOPTNS= <>
##$ZL1= 120
##$ZL2= 120
##$ZL3= 120
##$ZL4= 120
##$ABSF1= 14.98509
##$ABSF2= -5.573092
##$ABSG= 5
##$ABSL= 3
##$ALPHA= 0
##$AQORDER= 0
##$ASSFAC= 0
##$ASSFACI= 0
##$ASSFACX= 0
##$ASSWID= 0
##$AUNMP= <proc_prof1d_extract_pilot.lims>
##$AXLEFT= 0
##$AXNAME= <>
##$AXNUC= <1H>
##$AXRIGHT= 0
##$AXTYPE= 0
##$AXUNIT= <>
##$AZFE= 0.1
##$AZFW= 0.1
##$BCFW= 0
##$BC_mod= 0
##$BYTORDP= 0
##$COROFFS= 0
##$CY= 15
##$DATMOD= 1
##$DC= 0
##$DFILT= <>
##$DTYPP= 0
##$F1P= 0
##$F2P= 0
##$FCOR= 0.5
##$FTSIZE= 32768
##$FT_mod= 6
##$GAMMA= 0
##$GB= 0
##$INTBC= 1
##$INTSCL= 1
##$ISEN= 128
##$LB= 0
##$LEV0= 0
##$LPBIN= 0
##$MAXI= 10000
##$MC2= 0
##$MEAN= 0
##$ME_mod= 0
##$MI= 0
##$NCOEF= 0
##$NC_proc= -8
##$NLEV= 6
##$NOISF1= 0
##$NOISF2= 0
##$NSP= 0
##$NTH_PI= 0
##$NZP= 0
##$OFFSET= 14.98509
##$PC= 1
##$PHC0= 175.7318
##$PHC1= 0
##$PH_mod= 1
##$PKNL= yes
##$PPARMOD= 0
##$PPDIAG= 0
##$PPIPTYP= 0
##$PPMPNUM= 2147483647
##$PPRESOL= 1
##$PSCAL= 4
##$PSIGN= 0
##$PYNMP= <proc.py>
##$REVERSE= no
##$SF= 400.02
##$SI= 32768
##$SIGF1= 0
##$SIGF2= 0
##$SINO= 400
##$SIOLD= 32768
##$SPECTYP= <>
##$SREGLST= <1H.CDCl3>
##$SSB= 0
##$STSI= 32768
##$STSR= 0
##$SW_p= 8223.68421052631
##$SYMM= 0
##$S_DEV= 0
##$TDeff= 65536
##$TDoff= 0
##$TI= <>
##$TILT= no
##$TM1= 0
##$TM2= 0
##$TOPLEV= 0
##$USERP1= <user>
##$USERP2= <user>
##$USERP3= <user>
##$USERP4= <user>
##$USERP5= <user>
##$WDW= 1
##$XDIM= 32768
##$YMAX_p= 462791201
##$YMIN_p= -735218
##$CURPLOT= <Network HP LaserJet P1505>
##$CURPRIN= <$Network HP LaserJet P1505>
##$DFORMAT= <normdp>
##$LAYOUT= <+/1D_H.xwp>
##$LFORMAT= <normlp>
##$PFORMAT= <normpl>
##$SURQMSG= 1
$$ End of Bruker specific parameters
$$ ---------------------------------
##NTUPLES= NMR SPECTRUM
##VAR_NAME=  FREQUENCY,     SPECTRUM/REAL,   SPECTRUM/IMAG
##SYMBOL=    X,             R,               I
##VAR_TYPE=  INDEPENDENT,   DEPENDENT,       DEPENDENT
##VAR_FORM=  AFFN,          ASDF,            ASDF
##VAR_DIM=   32768,         32768,           32768
##UNITS=     HZ,            ARBITRARY UNITS, ARBITRARY UNITS
##FACTOR=    0.250966925370066, 1,           1
##FIRST=     8223.43324360094, 97998,        75660
##LAST=      0,             -103247,         -260224
##MIN=       0,             -735218,         0
##MAX=       8223.43324360094, 462791201,    0
$$ Real data points
##PAGE= N=1
##DATA TABLE= (X++(R..R)), XYDATA
$$ [...]
19573d5914A06154J20211a61423P037k19039i0095k5562N801A21532a28673j7830
$$ -45914 106154 226365 -161423 -154386 -373425 -90095 -115657 -109856 121532 -128673 -146503
19562a46503A10892a91449B4875b15084A5236b44045A62819a47315B8933P8125
$$ -146503 110892 -191449 24875 -215084 15236 -244045 162819 -147315 28933 107058
19552A07058a99121N8325B1360K21581a56089A84006a91131o9142a9897q2840
$$ 107058 -199121 -140796 21360 242941 -156089 184006 -191131 -260273 -19897 -102737
19542a02737c2324A77920i4158A59897c58756f1426A97205b26292G6050a97515
$$ -102737 -32324 177920 -94158 159897 -358756 -61426 197205 -226292 76050 -197515
19531B20491J5283q1744k6398a0193o790l21984b8366l55022a27717a5389L236
$$ 220491 235774 154030 127632 -10193 -16983 -338967 -28366 -383388 -127717 -15389 -12153
19520a2153j20648A54674a78177l2806N3574G9714M2968K96547i7482A3379a77933
$$ -12153 -132801 154674 -178177 -210983 -157409 79714 122682 419229 -97482 13379 -177933
19508B3072f4388K3288D1868J16752d4471N246a1957M74j48971e8960k09875K4201
$$ 23072 -64388 -41100 41868 158620 -44471 -39225 -11957 -11483 -160454 -58960 -268835 -244634
19496b44634q0167L7546g6285F6915M8122O9097M4815a8242m0257o699A03932
$$ -244634 -324801 -287255 -76285 66915 115037 184134 228949 -18242 -58499 -65198 103932
19484e8475A2313b06472R687a8186l33292g4741n894r3923K0900j07928B04668
$$ -58475 12313 -206472 -196785 -18186 -351478 -74741 -80635 -174558 -153658 -261586 204668
19472c60958a75642C677P4874C3454O2978B6691a8140q2848I5941C804b57186
$$ -360958 -175642 3677 78551 33454 96432 26691 -18140 -100988 95941 3804 -257186
19460c24501J61682k3130G0395d36057C1881c71291A86148b56965C87711b85861
$$ -324501 -162819 -185949 70395 -436057 31881 -371291 186148 -256965 387711 -285861
19449A05272J1216c09935E1382J48937d8628A25682a67922L8253f4677j1960C5927
$$ 105272 116488 -309935 51382 200319 -48628 125682 -167922 -129669 -64677 -76637 35927
19437b10912e8865A61922F6944K44178c77393D1179b11428j7528f427B75240g2017
$$ -210912 -58865 161922 66944 311122 -377393 41179 -211428 -228956 -6427 275240 -72017
19425a12191F0790a79913j39425d730l08232e2309p4952A45597B2938c7139m6285
$$ -112191 60790 -179913 -319338 -4730 -312962 -52309 -127261 145597 22938 -37139 -83424
19414h3424m6703j95923B32131g3950F1773J5078h5829J2094J5122A98658a37995
$$ -83424 -130127 -326050 232131 -73950 61773 76851 -85829 -73735 -58613 198658 -137995
19402h2734A7658Q0646A6778O957a65335E4479a2192E1976f8068l6772k0888B9026
$$ -82734 17658 98304 16778 23735 -165335 54479 -12192 51976 -68068 -104840 -125728 29026
19389C9160j631a77447b3761j06917A02234O6801a53823B18263a0918r7744m8722
$$ 39160 37529 -177447 -23761 -130678 102234 169035 -153823 218263 -10918 -108662 -157384
19378a57384J446A27577F3464h9718L5599j56429C46713c52292d3818K1843I9488
$$ -157384 -155938 127577 63464 -89718 -54119 -210548 346713 -352292 -43818 -21975 99488
19366a15300o8865g4972B47091b27958F9121b55643D1626b14514E5289a4929G0900
$$ -115300 -184165 -74972 247091 -227958 69121 -255643 41626 -214514 55289 -14929 70900
19354C9180c38411d8166A45391a62321l46662d8065A35889g8797F2574j3228R1332
$$ 39180 -338411 -48166 145391 -162321 -508983 -48065 135889 -78797 62574 49346 140678
19343A40678i615D1006J52940d3385B22608a58244F0481J35239a22503M737d3521
$$ 140678 -9615 41006 193946 -43385 222608 -158244 60481 195720 -122503 -117766 -43521
19331d5448l63969A39176a05874a0482k64753a04753L3207F083N6415c54804f080
$$ -45448 -409417 139176 -105874 -10482 -275235 -104753 -71546 6083 62498 -354804 -6080
19319b91614p7376A6889J94531a75713A7275a90639A27921c33986J62757j5766
$$ -291614 -368990 16889 211420 -175713 17275 -190639 127921 -333986 -171229 -186995
19309a86995h9219D8768c5159j46869m2758J4310Q2378j7944J4886L156l52011
$$ -186995 -89219 48768 -35159 -182028 -224786 -210476 -128098 -146042 -131156 -128000 -480011
19298d80011g1415F753J73777h4097r5766l06165d1925j08467j76068b8522m75372
$$ -480011 -71415 6753 180530 -84097 -179863 -486028 -41925 -150392 -326460 -28522 -503894
19287e03894a98412h9473k86459A72043b58591O3801C7404j4648K11346a07121
$$ -503894 -198412 -89473 -375932 172043 -258591 -194790 37404 22756 234102 -107121
19276B2898a27332d5840k96824C4603b37813K2030i3382a4477B38669c1852o7716
$$ 22898 -127332 -45840 -342664 34603 -237813 -215783 -93382 -14477 238669 -31852 -99568
19265i9568M779B32841A13580a7597B4031H594K5164O8401b00411B9782c12009
$$ -99568 -94789 232841 113580 -17597 24031 8594 33758 102159 -200411 29782 -312009
19253a01735a6846j16270B42848f3969B0184b43A90227b5380r214q0204B33544
$$ -101735 -16846 -133116 242848 -63969 20184 -243 190227 -25380 -34594 -114798 233544
19241B08416J04425a38749B74436a57137B74596a90331F336R1198N9446e05384
$$ 208416 312841 -138749 274436 -157137 274596 -190331 6336 97534 156980 -505384
19230a57883B64857a38011e3058l3903A02033e08966G3642a7030E6285b1540B6015
$$ -157883 264857 -138011 -53058 -86961 102033 -508966 73642 -17030 56285 -21540 26015
19218a88711d1471A20279a14077N053C06318G07b17491A20375J54237f3716E3358
$$ -188711 -41471 120279 -114077 -109024 306318 707 -217491 120375 274612 -63716 53358
19206a91097N9803c7023k41169K2249c5174m47290C0735a34291C4372A5511L4117
$$ -191097 -131294 -37023 -278192 -255943 -35174 -482464 30735 -134291 34372 15511 49628
19195D9628G577J35341a61859F1725j1591c31820C8814c57196a01312k553C4931
$$ 49628 7577 142918 -161859 61725 50134 -331820 38814 -357196 -101312 -103865 34931
19183a65359k606D043b92627i3056C0c2474B1981f7654j04572b6723B71465b04489
$$ -165359 -167965 4043 -292627 -93056 30 -32474 21981 -67654 -172226 -26723 271465 -204489
19170A79982a17721j46077A72299G7983O0392b13102l1830Q1747l3109j1110M6268
$$ 179982 -117721 -263798 172299 77983 138375 -213102 -244932 -163185 -196294 -207404 -161136
19159a61136c2458C2284b3407j8759G9895c1397A14746J06838A649h5994A57217
$$ -161136 -32458 32284 -23407 -42166 79895 -31397 114746 221584 1649 -85994 157217
19147A29772c5906C4237O9604f5522j132F9432P7368a80646i718k204j27991F1813
$$ 129772 -35906 34237 103841 -65522 -66654 69432 146800 -180646 -9718 -11922 -139913 61813
19134A29374b4966I738O7662a82724f9451A73529A5290c4382A3918a30057b6019
$$ 129374 -24966 9738 77400 -182724 -69451 173529 15290 -34382 13918 -130057 -26019
19122a13445B18929e3486a0983D5572a35918b4409A06285c1115A24861b57916
$$ -113445 218929 -53486 -10983 45572 -135918 -24409 106285 -31115 124861 -257916
19111c59378C5575a7558j62438g8990p3468B5218M9343d8067A1000b34921r4673
$$ -359378 35575 -17558 -179996 -78990 -152458 25218 74561 -48067 11000 -234921 -329594
19100c29594e4733A1284b62164a9408j00095j13143h8413J3301K9686G8652l364
$$ -329594 -54733 11284 -262164 -19408 -119503 -232646 -88413 -75112 -45426 78652 75288
19089G5288b39982a14424G1033KN0728l0007b41545L7194k28550a34300F2512
$$ 75288 -239982 -114424 71033 71035 121763 91756 -241545 -204351 -432901 -134300 62512
19077A11112J18416F8095J9546j1737a63373H394P6605b19913o2558B67153i959
$$ 111112 229528 68095 87641 75904 -163373 8394 84999 -219913 -282471 267153 -9959
19065F2591a62084i941l16376A92070b0929j43729L3494A56737G0590b15380k32938
$$ 62591 -162084 -9941 -326317 192070 -20929 -164658 -131164 156737 70590 -215380 -448318
19054d48318b7465A6493J04453C359g6194A04929f2490A73561a12391B77456g1381
$$ -448318 -27465 16493 120946 3359 -76194 104929 -62490 173561 -112391 277456 -71381
19042B8386N2748b76072B18299j00408J7152F139c8074A74275E1726J8653K4626
$$ 28386 81134 -276072 218299 117891 135043 6139 -38074 174275 51726 70379 95005
19031I5005f2652a0343B02923A00753d6225D47854j94939c2436C44622a42972
$$ 95005 -62652 -10343 202923 100753 -46225 447854 252915 -32436 344622 -142972
19020b06838A8546C653a83538B19014L7996j25875b15223g7630K7241A01062a99996
$$ -206838 18546 3653 -183538 219014 257010 131135 -215223 -77630 -50389 101062 -199996
19008e05771A39755d7141J7675j11296r449a5219n3660j57821A50643p0454b9033
$$ -505771 139755 -47141 -29466 -140762 -150211 -15219 -68879 -226700 150643 80189 -29033
18996B04371a81383M1940j33780B11242a5781B8681f303j88889L1507C37294b43408
$$ 204371 -181383 -139443 -273223 211242 -15781 28681 -6303 -195192 -163685 337294 -243408
18984I8761A5168b87028b9984k367k33092j6793g1207j53667A40200J32848a64128
$$ 98761 15168 -287028 -29984 -32351 -265443 -282236 -71207 -224874 140200 273048 -164128
18972h4330J5695l25507h747A00746k802a75038d2353n4285C12P1622b63729A89661
$$ -84330 -68635 -394142 -8747 100746 97944 -175038 -42353 -96638 312 71934 -263729 189661
18959B19126J41506A16684i7815A91483a77335k36888A44370g8965a3910A48976
$$ 219126 360632 116684 -97815 191483 -177335 -414223 144370 -78965 -13910 148976
18948H8851b84700A12991M1078C3398a43024D3796d9175j07973e4758B4064a51266
$$ 88851 -284700 112991 154069 33398 -143024 43796 -49175 -157148 -54758 24064 -151266
18936B4223i7835A63755a31428j23292J20e2901A48338B1569d2530q8228A328
$$ 24223 -97835 163755 -131428 -254720 -254600 -52901 148338 21569 -42530 -130758 1328
18924i2396C1489b77174B11995B8566a33105E7902a46177E8609b42951R494D0519
$$ -92396 31489 -277174 211995 28566 -133105 57902 -146177 58609 -242951 -233457 40519
18912a14145o9664h2587A28153a84190Q9677C09904a96737P930J8656O0392B264
$$ -114145 -183809 -82587 128153 -184190 -94513 309904 -196737 -188807 -170151 -109759 2264
18900a76187P6847B19994b49833R7628L7302j24462e1771j07411b295E9656L0944
$$ -176187 -99340 219994 -249833 -152205 -114903 -239365 -51771 -159182 -2295 59656 90600
18889I0600e0051A89753c05020b302F171b44762j44307a39506k4507N3833k83723
$$ 90600 -50051 189753 -305020 -2302 6171 -244762 -389069 -139506 -164013 -110180 -393903
18878c93903A83035g1521G6831b10154A08321e7254j09812A64834J5970c70201
$$ -393903 183035 -71521 76831 -210154 108321 -57254 -167066 164834 180804 -370201
18867h43j87965g8278c2357B63521b30914a8751D2443b61846f7715H6314a74552
$$ -843 -188808 -78278 -32357 263521 -230914 -18751 42443 -261846 -67715 86314 -174552
18855a8326A60538c03547q210c2521C1631d6686B92386j39736b43296a15294c7539
$$ -18326 160538 -303547 -311757 -32521 31631 -46686 292386 152650 -243296 -115294 -37539
18843c16640h3814A24010b52165E522d9617A14045a37628E1516J23842a35582
$$ -316640 -83814 124010 -252165 5522 -49617 114045 -137628 51516 175358 -135582
18832A00550a25917j53321A07142E146K22666I7652J56788h1969k9295N2187m889
$$ 100550 -125917 -279238 107142 5146 227812 97652 254440 -81969 -111264 -59077 -63966
18821f3966F7560J69071d2376l0729A30048Q6872a58882o9101i3100q9311j20073
$$ -63966 67560 236631 -42376 -73105 130048 216920 -158882 -227983 -93100 -182411 -302484
18810c02484H0732K97354A53580C1801J53231G4993C5886K33201o6250A0671a15441
$$ -302484 80732 378086 153580 31801 185032 74993 35886 269087 202837 10671 -115441
18798B1998a80237Q9632j8519A33428b11972i8445A21696a77801a7572k39305
$$ 21998 -180237 -90605 -109124 133428 -211972 -98445 121696 -177801 -17572 -256877
18788b56877H9904c30804G1109e2083C32518q0442a98574K7801F5115R4473b30099
$$ -256877 89904 -330804 71109 -52083 332518 252076 -198574 -170773 65115 159588 -230099
18776H6895C5994M065h9189A17966i3676m945A28673a25888p0230j48873C9049
$$ 86895 35994 40059 -89189 117966 -93676 -98621 128673 -125888 -196118 -344991 39049
18764a23067A5397d5818D7996a33511O857l696d8300K2383j04603l00189J58184
$$ -123067 15397 -45818 47996 -133511 -126654 -130350 -48300 -25917 -130520 -430709 -272525
18753b72525E3849f7527D087O2032B0339P6419e8881B47657a6576D3110L1904
$$ -272525 53849 -67527 4087 66119 20339 96758 -58881 247657 -16576 43110 75014
18742G5014P4800b27649b3357F9024B9351K06839b11345B4716e5828l0937j7356
$$ 75014 149814 -227649 -23357 69024 29351 236190 -211345 24716 -55828 -86765 -104121
18731a04121G0054d4102p6533A1919i1651A587J79665B0158g876k2755m2597j01982
$$ -104121 70054 -44102 -120635 11919 -91651 1587 181252 20158 -7876 -30631 -73228 -175210
18719a75210f3743A10160a41756e6006k22748D7499a18024A05783i5418b9002
$$ -175210 -63743 110160 -141756 -56006 -278754 47499 -118024 105783 -95418 -29002
18708B99013A03340K01629a6798q8406o2125g7303L5654k97461b1335o5217B22481
$$ 299013 103340 304969 -16798 -105204 -167329 -77303 -41649 -339110 -21335 -86552 222481
18696C63141b79368d7630h48B74953c25669C48067C7012P9883P4857d5751B46858
$$ 363141 -279368 -47630 -848 274953 -325669 348067 37012 116895 191752 -45751 246858
18684A92230b0845A6263a2044j4018D8710a29224D4715c92243A5446h9830C95644
$$ 192230 -20845 16263 -12044 -26062 48710 -129224 44715 -392243 15446 -89830 395644
18672b66014B41680A9635c14484A41653c78200A84261i550r2677j44510E0791
$$ -266014 241680 19635 -314484 141653 -378200 184261 -9550 -102227 -246737 50791
18661B8291C975c4733r8518f6335k12036i6145k28776a47238J0897I2966B0139
$$ 28291 3975 -34733 -133251 -66335 -278371 -96145 -324921 -147238 -136341 92966 20139
18649A8196b75167a25526d4156C23913h4889B25006c02233L7219I8960b15360
$$ 18196 -275167 -125526 -44156 323913 -84889 225006 -302233 -265014 98960 -215360
18638A37542a04730I2856h5924j22497K5128j20477d9411B1935b05995A00504
$$ 137542 -104730 92856 -85924 -208421 -183293 -303770 -49411 21935 -205995 100504
18627a82975e447j21221A88835q2759b39764A25844B6313a52305j49188P4334
$$ -182975 -5447 -126668 188835 106076 -239764 125844 26313 -152305 -301493 -227159
18617b27159a07368B9526a74831D9805d5720l12979B1854L20132g8717C0513a87080
$$ -227159 -107368 29526 -174831 49805 -45720 -358699 21854 341986 -78717 30513 -187080
18605a18709E6898a53750m7033k7547j13374B40516d75054A03577a92532I3167
$$ -118709 56898 -153750 -200783 -228330 -341704 240516 -475054 103577 -192532 93167
18594A687i2458j41421p2086E6301a30916q3511j9522F787P2447a1768k47876
$$ 1687 -92458 -233879 -305965 56301 -130916 -214427 -233949 6787 79234 -11768 -259644
18583b59644h8384D7420L022A7610i6878I1439B6316i6326j00962M0709A1407
$$ -259644 -88384 47420 50442 17610 -96878 91439 26316 -96326 -197288 -156579 11407
18571a90369g3451n9386A55740d0791m8508D4070i8254A13866a04187A45591c26729
$$ -190369 -73451 -132837 155740 -40791 -89299 44070 -98254 113866 -104187 145591 -326729
18559b62280j5783A00281J8760j9275b46985B03491e9054A50470a82633A06230
$$ -262280 -278063 100281 119041 99766 -246985 203491 -59054 150470 -182633 106230
18548a77554G2361A3471i9026B0993f1762j06407f131k0112j60480F9541G45Q4194
$$ -177554 72361 13471 -99026 20993 -61762 -168169 -6131 -26243 -186723 69541 745 84939
18536H4939O9218b11122L8607B24347i080l10903A0007M0424a64853b3935A82826
$$ 84939 154157 -211122 -172515 224347 -9080 -319983 10007 50431 -164853 -23935 182826
18524d8042j62721P4895f6855j03681J820A40651C8904J58048a94518e2859A67511
$$ -48042 -210763 -135868 -66855 -170536 -168716 140651 38904 196952 -194518 -52859 167511
18512A58489d8772A33926f7037B94796j05747b77871B1563i8102G6121a95264
$$ 158489 -48772 133926 -67037 294796 189049 -277871 21563 -98102 76121 -195264
18501G8791a08796B045R6656b78287A27923b46132R3942m1022o4871A65946c67852
$$ 78791 -108796 2045 98701 -278287 127923 -246132 -152190 -193212 -258083 165946 -367852
18489b0779k11574b4100A8504a49635n6642C76445f7466j69428N8042G1281C0438
$$ -20779 -232353 -24100 18504 -149635 -206277 376445 -67466 -236894 -178852 71281 30438
18477d38746A90474a16993d9810j57881f998j07705A37222A5495b74237e0167
$$ -438746 190474 -116993 -49810 -207691 -6998 -114703 137222 15495 -274237 -50167
18466a0592k47156J11318k31491D37524b23772r1078C6521P4900h3963b1421j94328
$$ -10592 -257748 -146430 -377921 437524 -223772 -314850 36521 111421 -83963 -21421 -215749
18455b15749O0959P6677l8319B3185L11202a10585B27795h3035a3569A92659K5373
$$ -215749 -154790 -78113 -116432 23185 334387 -110585 227795 -83035 -13569 192659 218032
18444B18032d66021h7165K2166A44059l2581J3289j8316e4746o7794A6921a09339
$$ 218032 -466021 -87165 -64999 144059 111478 124767 106451 -54746 -122540 16921 -109339
18432f7374k54832j6603d2118j83557g8343r4606h3629J8488l6238j17148b2471
$$ -67374 -322206 -338809 -42118 -225675 -78343 -172949 -83629 -65141 -101379 -218527 -22471
18420B45487k7145a96824a3394C2362J43937N564c07998H8006A1153J79073F2697
$$ 245487 218342 -196824 -13394 32362 176299 181863 -307998 88006 11153 190226 62697
18408A33294b57742d3866A02992a00624I099g5397L6615A27900b65674B16161
$$ 133294 -257742 -43866 102992 -100624 9099 -75397 -38782 127900 -265674 216161
18397d4671n549j68130B88087b03112n3990b4356A98906b47774A2247J29462i3405
$$ -44671 -50220 -218350 288087 -203112 -257102 -24356 198906 -247774 12247 141709 -93405
18385e5606B48549b40668e3570k0354G959P6528M0911a19100A09540N1916b46388
$$ -55606 248549 -240668 -53570 -73924 7959 84487 125398 -119100 109540 161456 -246388
18373d4977h175k0652G2638O148R6624e5699A47945C6469R7715a54055B67269
$$ -44977 -8175 -28827 72638 78786 175410 -55699 147945 36469 134184 -154055 267269
18361A84062a80943b2527m6367k30161H4954B3150b73386b7960l7726c1534l4158
$$ 184062 -180943 -22527 -68894 -299055 84954 23150 -273386 -27960 -65686 -31534 -65692
18350f5692a2507j00185E5707g1406b2875A03702a13026j09790F7769h6658j15092
$$ -65692 -12507 -112692 55707 -71406 -22875 103702 -113026 -222816 67769 -86658 -201750
18339b01750J4276A12579b8985p0198r1981G0710b42525b8088r0772p49I1045
$$ -201750 -187474 112579 -28985 -99183 -191164 70710 -242525 -28088 -118860 -119609 91045
18327h6930I8779a7564j29741C09918d6942O390k54635B13058f9998A05394a06116
$$ -86930 98779 -17564 -147305 309918 -46942 -40552 -295187 213058 -69998 105394 -106116
18315A07867a0164A7056a33065j3910f868o7057A97531c50001C56826a52622G0612
$$ 107867 -10164 17056 -133065 -146975 -6868 -73925 197531 -350001 356826 -152622 70612
18303c0100f512n4868G1525a7620A1283K16104a65252c2196H7646g0518l2372
$$ -30100 -6512 -61380 71525 -17620 11283 227387 -165252 -32196 87646 -70518 -102890
18292a02890b1910B39516a11316j44454n8815O7907R9849A91586e3028O450G9349
$$ -102890 -21910 239516 -111316 -255770 -314585 -246678 -146829 191586 -53028 -46578 79349
18280a05119A60061k724b49884E7032b41495H142P1130J37328D6098f3615r5832
$$ -105119 160061 157337 -249884 57032 -241495 8142 79272 216600 46098 -63615 -159447
18269a59447A65763J88939A76863b98246J27617A26261e35902H0381K86541G8831
$$ -159447 165763 354702 176863 -298246 -170629 126261 -535902 80381 366922 78831
18258a21971D7227M67028a56614J0113j2750j6370E5393J80823A01747b57763
$$ -121971 47227 514255 -156614 -146501 -159251 -175621 55393 236216 101747 -257763
18247e3778H7083e02032a19169p1677L0788A5656J75683b0932Q985o5442G1933
$$ -53778 87083 -502032 -119169 -190846 -160058 15656 191339 -20932 -11947 -77389 71933
18235A60351a85866n4272c6802n5159j93461e2257E8197J14545l2114e6034j23745
$$ 160351 -185866 -240138 -36802 -91961 -285422 -52257 58197 172742 140628 -56034 -179779
18224a79779d9017j99671q5169M0320r967a08303A71082a24746B00874a9875A10983
$$ -179779 -49017 -248688 -333857 -293537 -303504 -108303 171082 -124746 200874 -19875 110983
18212E0190e5853j5887r1575J7692e2521H1500J15567A4695J0078K10694m5236
$$ 50190 -55853 -71740 -163315 -145623 -52521 81500 197067 14695 24773 235467 190231
18201A90231O971a33277K1425l9049r3086N1728k4624P9843e2733l27655e2521
$$ 190231 197202 -133277 -111852 -150901 -243987 -192259 -216883 -137040 -52733 -380388 -52521
18189B91521B5934a15999q9675D84675a17987I9360a59923k62600M447A39319
$$ 291521 25934 -115999 -205674 484675 -117987 99360 -159923 -422523 -418076 139319
18178b73397a34062O2250B11559D1684i033B45668a33807j39344q1440J64234
$$ -273397 -134062 -71812 211559 41684 -9033 245668 -133807 -273151 -354591 -190357
18168a90357a937k07674A32233a43474f9545C26234e1930j11175A0554a23995
$$ -190357 -1937 -209611 132233 -143474 -69545 326234 -51930 -163105 10554 -123995
18157a04681E9857N1875O0287b12530Q7603d1164I4871a19330A98158l7484b76761
$$ -104681 59857 111732 172019 -212530 -124927 -41164 94871 -119330 198158 160674 -276761
18145D5536J72929f5526A8994P7404M5174a2655A01670a04422E7939F493L73076
$$ 45536 218465 -65526 18994 96398 141572 -12655 101670 -104422 57939 6493 379569
18134C79569j42807j5999b1780E8971a01937G6360a20312A63138o0136J04207
$$ 379569 236762 220763 -21780 58971 -101937 76360 -120312 163138 103002 207209
18124B07209G1574a13415C4287d96437A33191E5721L1801b74343B7064Q150e0891
$$ 207209 71574 -113415 34287 -496437 133191 55721 87522 -274343 27064 35214 -50891
18112a86066r0144G2045c9747C02511F3076K16745I0949a25102H9466c80455a4131
$$ -186066 -276210 72045 -39747 302511 63076 279821 90949 -125102 89466 -380455 -14131
18100b02681e9721j61497L1810i4279j7333A13179b71448A96352a82144J6055
$$ -202681 -59721 -221218 -189408 -94279 -111612 113179 -271448 196352 -182144 -166089
18090a66089Q0219A25530a35124I1198b08174c9891q5250L3463A0866b50461h8497
$$ -166089 -85870 125530 -135124 91198 -208174 -39891 -125141 -91678 10866 -250461 -88497
18078b91631a33870N4401c7815l7663F5408B6756P684b25208o8055C19891B6471
$$ -291631 -133870 -79469 -37815 -75478 65408 26756 34440 -225208 -293263 319891 26471
18066A92146c9830j43882r9252A12435e8816H2386M6087l8672A8254c29688g343
$$ 192146 -39830 -183712 -282964 112435 -58816 82386 128473 89801 18254 -329688 -7343
18054a39609D4762b4691E1545O0825m5701k9587i7535C22865G0641J8001b15363
$$ -139609 44762 -24691 51545 112370 66669 37082 -97535 322865 70641 88642 -215363
18042A90797c4173k50429h5566b2640O549l08246G6860j5116J59755b66881E0076
$$ 190797 -34173 -284602 -85566 -22640 -16091 -324337 76860 61744 221499 -266881 50076
18030b57248H1930l7831a7710B19325O3058A09809J48258a33938a5111k12332
$$ -257248 81930 44099 -17710 219325 282383 109809 258067 -133938 -15111 -227443
18020b27443A23002J2543d3858j82411f954j98589f5117A12024J09282B6083a0606
$$ -227443 123002 135545 -43858 -226269 -6954 -205543 -65117 112024 221306 26083 -10606
18008b50604A02950g3661F1292J12240a40948A1757J0540b22709j90872a03235
$$ -250604 102950 -73661 61292 173532 -140948 11757 22297 -222709 -413581 -103235
17997b70092A1889M7935a0016o6842a3054A87927K2810b36531N2278g9769B61915
$$ -270092 11889 59824 -10016 -76858 -13054 187927 210737 -236531 -184253 -79769 261915
17985b120A9097a48131i736j50928A12249J59760m8559g408A82851o7696d9851
$$ -2120 19097 -148131 -9736 -160664 112249 272009 223450 -7408 182851 115155 -49851
17973D6921a69294M5782A12231n5623O3609n7120d9482H3250J66089a48832C31149
$$ 46921 -169294 -123512 112231 56608 120217 63097 -49482 83250 249339 -148832 331149
17961g3335j9628B03847F0171a18780a8331j08148B05352b08748d1375j64430
$$ -73335 -92963 203847 60171 -118780 -18331 -126479 205352 -208748 -41375 -205805
17951b05805A45380G0199b73325B06634r9252a74925A52607B8398a21826k5762
$$ -205805 145380 70199 -273325 206634 107382 -174925 152607 28398 -121826 -147588
17941a47588B00301p5014b7631o8721a9227m9125o0783d8054A07862k6198P2879
$$ -147588 200301 125287 -27631 -96352 -19227 -68352 -129135 -48054 107862 81664 154543
17930A54543d1050H9379A7987a06944a2514A28909b74018g4804B92993b74276
$$ 154543 -41050 89379 17987 -106944 -12514 128909 -274018 -74804 292993 -274276
17919B6282J47136J54179j56570J25215d9754j59195Q6079B08868q5487c54301
$$ 26282 173418 327597 171027 296242 -49754 -208949 -122870 208868 123381 -354301
17908A29489L71568c34282J59523L6941f5080j38825e3600A76645K01a70690B13496
$$ 129489 501057 -334282 -174759 -137818 -65080 -203905 -53600 176645 176846 -170690 213496
17896c54827A115a78892E5321b89982B86064N250E5718N88f1057j46059B42803
$$ -354827 1115 -178892 55321 -289982 286064 291314 55718 56306 -61057 -207116 242803
17884b7412k58747G4815c24349a49854O6706c1524o4708j17771p0443E8825B3120
$$ -27412 -286159 74815 -324349 -149854 -83148 -31524 -96232 -214003 -284446 58825 23120
17872H025a5864b126j4753j92718j6745j08374B36439a17474A35354n1299m0355
$$ 8025 -15864 -2126 -16879 -209597 -226342 -334716 236439 -117474 135354 84055 43700
17861D3700e6242k79435a1454B08012J04319c75898A27453C1211c3801I1133i620
$$ 43700 -56242 -335677 -11454 208012 312331 -375898 127453 31211 -33801 91133 -9620
17849A28064L7401e6434I0488b81233h843D6408L7770P0284E8059Q9627b11549
$$ 128064 165465 -56434 90488 -281233 -8843 46408 84178 154462 58059 147686 -211549
17837E0603b29350i1123A03003R4765c9354j95912h878A91519o1408a28754k51069
$$ 50603 -229350 -91123 103003 197768 -39354 -235266 -8878 191519 130111 -128754 -379823
17826c79823b8598j42799A44917h2371b0821A21702J11667b2282A75971e4378
$$ -379823 -28598 -171397 144917 -82371 -20821 121702 233369 -22282 175971 -54378
17815a19406L8051j2645A69110F8944h6372l38121F8465A7614h9086b6029j49561
$$ -119406 -81355 -94000 169110 68944 -86372 -424493 68465 17614 -89086 -26029 -175590
17804a75590M5431l433B63518a38881B27686N8782a2960A8742f2036A19208c30477
$$ -175590 -130159 -133592 263518 -138881 227686 286468 -12960 18742 -62036 119208 -330477
17792B33059G2884E424J46358p038l8456e7074I679J5357O6502K05711J11319
$$ 233059 72884 5424 151782 144744 106288 -57074 9679 25036 91538 297249 408568
17781D08568d1479A39552b6282k79285a13313C3940Q2859a2064H2796J68746a79619
$$ 408568 -41479 139552 -26282 -305567 -113313 33940 116799 -12064 82796 251542 -179619
17769h1336A08502b05858P7834n3261A3312n884J78979a89957C22640g6496E0851
$$ -81336 108502 -205858 -128024 -181285 13312 7428 186407 -189957 322640 -76496 50851
17757a84319g4874E8925K63312b98713J39618B8824A3132J265L47174a56102D9807
$$ -184319 -74874 58925 322237 -298713 -159095 28824 13132 14397 361571 -156102 49807
17745E8414J03639d006B94518B355a26618a4264p3340a9925c521p2728B4186a15498
$$ 58414 162053 -4006 294518 2355 -126618 -14264 -87604 -19925 -3521 -76249 24186 -115498
17732a45675A45361E1587b1738B02067L2193a09953l25487a32077q8854A38942
$$ -145675 145361 51587 -21738 202067 234260 -109953 -435440 -132077 -220931 138942
17721h3670r4070C27944A07469f076C08067k5377b35975G0058i6648b0994n5489
$$ -83670 -177740 327944 107469 -6076 308067 282690 -235975 70058 -96648 -20994 -76483
17710g6483g917p7791A68826c4072j31369C9824P9185J6493E452L11460C5789
$$ -76483 -7917 -85708 168826 -34072 -165441 39824 119009 135502 5452 316912 35789
17698b23812J05337B45023j21335N3684b48923B02726J14700a8686p8972H67J15325
$$ -223812 -118475 245023 123688 177372 -248923 202726 317426 -18686 -97658 867 116192
17687A16192Q708B3160j645b00452G4336a29470J7770D0018J52900a58520P6398
$$ 116192 124900 23160 21515 -200452 74336 -129470 -111700 40018 192918 -158520 -82122
17676h2122N379p2765j74721J39390A58915c06988C27306a00510G62J89121L0418
$$ -82122 -76743 -149508 -324229 -184839 158915 -306988 327306 -100510 762 189883 220301
17665B20301R6902I4d28963A78389b9951D0946b54501B07703p8936J1266R8422
$$ 220301 317203 94 -428963 178389 -29951 40946 -254501 207703 128767 140033 238455
17654B38455A04274b91111a20450A35318o1114e6940k40395h8167d1108o062k00982
$$ 238455 104274 -291111 -120450 135318 74204 -56940 -297335 -88167 -41108 -47170 -248152
17643b48152p4233F3691N3402P9498q5639f7943I0986k1868a12438C6818K41505
$$ -248152 -322385 63691 117093 196591 110952 -67943 90986 69118 -112438 36818 278323
17632B78323b48406B24388b7260k2061R156A50895A7085J30735k0378a28031A41419
$$ 278323 -248406 224388 -27260 -49321 -40165 150895 17085 147820 127442 -128031 141419
17620d85133a03836B47484A0182b37405E3237J4976d66568a07150C9307L14957
$$ -485133 -103836 247484 10182 -237405 53237 68213 -466568 -107150 39307 354264
17610C54264f8279B7986a62326B57836c4141B96984b68204a16761j04792H4981
$$ 354264 -68279 27986 -162326 257836 -34141 296984 -268204 -116761 -221553 84981
17599D36837o1146a93717Q8012B66456F8065J12817p3768D5109Q7365a73915A75241
$$ 436837 375691 -193717 -105705 266456 68065 180882 107114 45109 132474 -173915 175241
17587c75569a06479A9581K65395c41670A25257d2162E2200B4102e9432n8739c2092
$$ -375569 -106479 19581 284976 -341670 125257 -42162 52200 24102 -59432 -118171 -32092
17575c8152n4779A63250a54469B3883J24044K13552e3015D0162a40456k32055
$$ -38152 -92931 163250 -154469 23883 147927 361479 -53015 40162 -140456 -372511
17565c72511H1610K44701h7894D27291H9268P0200a8308B43760c6958c05j12849
$$ -372511 81610 326311 -87894 427291 89268 159468 -18308 243760 -36958 -305 -113154
17554a13154D71677c8603A42082K36009a33669A81856n1677K0317l5581L7411
$$ -113154 471677 -38603 142082 378091 -133669 181856 130179 150496 114915 152326
17544A52326L9142a8328n2672B87502j23475a70860C8649J09268b8623A3141d4035
$$ 152326 191468 -18328 -71000 287502 164027 -170860 38649 147917 -28623 13141 -44035
17532a81850B79438a02585k54629C05142A28367j0608L7621a60946B41344A6988
$$ -181850 279438 -102585 -357214 305142 128367 117759 155380 -160946 241344 16988
17521a41110b6012k14792B1809J47687m1141b77959A64708i4326k56613E34430
$$ -141110 -26012 -240804 21809 169496 128355 -277959 164708 -94326 -350939 534430
17510A48511E1667L32644b8980j30811C26008A31001b2458A24609J13682L06528
$$ 148511 51667 384311 -28980 -159791 326008 131001 -22458 124609 238291 544819
17500E44819a99887C00531F438J01041a11810I8225b197j29621B66315D9432P2612
$$ 544819 -199887 300531 6438 107479 -111810 98225 -2197 -131818 266315 49432 122044
17489A22044e5926A27691J30057b0259n9943C6998F595R3425a19896I1184J55416
$$ 122044 -55926 127691 257748 -20259 -80202 36998 6595 100020 -119896 91184 246600
17478B46600O0627o535l6011D5342K92933j53060J15403J55921B8985f3757A61112
$$ 246600 307227 300692 264681 45342 338275 185215 300618 456539 28985 -63757 161112
17466g047k39117G499a69962D4950j8597a08981l767A13710J38330H7454a14120
$$ -7047 -246164 7499 -169962 44950 26353 -108981 -112748 113710 252040 87454 -114120
17454B35852H910K32963f4315p849B22313D9847J15135Q4639J52634j96856D7359
$$ 235852 8910 241873 -64315 -72164 222313 49847 164982 249621 402255 205399 47359
17442a4802B84177B1423K70159M5684d66430F2373J10855C3372K66770f6955B37593
$$ -14802 284177 21423 291582 337266 -466430 62373 173228 33372 300142 -66955 237593
17430D5523L33662A44433L09490A09015K74921a8762B09024o5001c1725C49400
$$ 45523 379185 144433 453923 109015 383936 -18762 209024 144023 -31725 349400
17419B21042K53853B07698n4172J38183K40144O062j82848B8399L70753j71470
$$ 221042 474895 207698 153526 291709 531853 537915 355067 28399 399152 227682
17409B27682r1579n4067r818J2820L51341B14628i3576C64467c82588B09987g2809
$$ 227682 136103 82036 72218 85038 436379 214628 -93576 364467 -382588 209987 -72809
17397B9913K0234K47972J91667q3378o2197a1005A51460e5946B92346i1806C29217
$$ 29913 50147 298119 489786 406408 344211 -11005 151460 -55946 292346 -91806 329217
17385A03676K9920P858A642K54937k9609J4097l1494J18903K49390A84773J67771
$$ 103676 133596 141454 1642 256579 226970 241067 209573 328476 577866 184773 352544
17374C52544m3470m6318j9032a72314B2114N7653J40595k4911B6298i3891q0277
$$ 352544 309074 262756 243724 -172314 22114 79767 220362 195451 26298 -93891 -174168
17363a74168B39054n5758a41693B86691I1239h7130A84808o4021J80291a4652
$$ -174168 239054 183296 -141693 286691 91239 -87130 184808 120787 301078 -14652
17352A25138J55362a01857b3371A07145A7974g874p5976E874L65064e582E2446
$$ 125138 280500 -101857 -23371 107145 17974 -7874 -83850 5874 370938 -5582 52446
17340d5115E44960A79281J1464C0611L14481b03364B77771H9367l5834K76148
$$ -45115 544960 179281 190745 30611 345092 -203364 277771 89367 53533 329681
17330C29681q5607a04472I2572m5926M3010O694K1676P5497J32309r2087l5611
$$ 329681 244074 -104472 92572 46646 89656 96350 118026 193523 325832 233745 198134
17319A98134b05147C01545n2040J8776D1769c1506B71925a26543C86782h4683
$$ 198134 -205147 301545 249505 268281 41769 -31506 271925 -126543 386782 -84683
17308B8556N01581A74356m9359a31600A28429K32616e6761A34783F5819g2456
$$ 28556 530137 174356 124997 -131600 128429 361045 -56761 134783 65819 -72456
17297C113a91351H4480a34800A51876K28905e9818D52857C7307b22330B96069
$$ 3113 -191351 84480 -134800 151876 380781 -59818 452857 37307 -222330 296069
17286C32860j20735A2831g9866A71075F1059J1733R8110L5157a34843M6173A94152
$$ 332860 212125 12831 -79866 171075 61059 72792 170902 206059 -134843 -88670 194152
17274D6828K40285j13033j8907b34484B9114a56895D15272j59491b0953A27467
$$ 46828 287113 174080 155173 -234484 29114 -156895 415272 255781 -20953 127467
17263A15392A2132h35D61308j05622A6614L27044c5271B5005L32677a0267B94905
$$ 115392 12132 -835 461308 355686 16614 343658 -35271 25005 357682 -10267 294905
17251B19643r3750d60B74061O1132j4201a63432A64104c16584C56697O9052j66466
$$ 219643 125893 -460 274061 335193 320992 -163432 164104 -316584 356697 425749 259283
17240B59283P9956M1657j63140j0785K7549A09566h4507L7137B35068K2928A2521
$$ 259283 339239 380896 217756 206971 234520 109566 -84507 -47370 235068 257996 12521
17228D15175q6685p1821j08982o266l2847Q1082J34248i8492B05648D5164J19375
$$ 415175 328490 256669 147687 141421 108574 189656 323904 -98492 205648 45164 164539
17217A64539F2464L77221j6014J48486B67903A23264L49407B33429K9051G9977
$$ 164539 62464 439685 423671 572157 267903 123264 472671 233429 262480 79977
17206C84428j39863L0216j09134K29318j01046A30604a2693C73689I5748M1838
$$ 384428 244565 274781 165647 394965 293919 130604 -12693 373689 95748 137586
17196A37586L9651f3347B73496J62162i0316C06936J4417G7969J20659K4112R9453
$$ 137586 177237 -63347 273496 435658 -90316 306936 321353 77969 198628 222740 322193
17185C22193J90718J44328C10798A48811J04080q1996f877B85448j35781K01298
$$ 322193 512911 657239 310798 148811 252891 170895 -6877 285448 149667 350965
17175C50965J10659j478A05340K47539j68690J50161c7915A5520K1417Q5326N3170
$$ 350965 461624 460146 105340 352879 184189 334350 -37915 15520 36937 122263 175433
17164A75433K01683A12314L4178P4844L09717k35316o2051q25C35L10533A46453
$$ 175433 377116 112314 146492 221336 531053 295737 233686 232861 335 310868 146453
17152d3216E85297k42844r1584o7236L21200B08309j4772C5818L31430M2143Q2614
$$ -43216 585297 342453 250869 183633 504833 208309 193537 35818 367248 409391 492005
17141D92005h4718D60182m4152J33727A93509e0303E11378A40255K22060j38036
$$ 492005 -84718 460182 416030 549757 193509 -50303 511378 140255 362315 224279
17131B24279n7519H460M63293D2911J04550Q7400M0142L6406J14959A43733L39580
$$ 224279 166760 8460 471753 42911 147461 234861 275003 311409 426368 143733 483313
17120D83313j12846I8785K12112A50941c4871E35681B00130K7014Q9992K2046
$$ 483313 370467 98785 310897 150941 -34871 535681 200130 227144 317136 339182
17110C39182D9306O5604a13895D79841j76517M13450l06022m1605J99085k1049
$$ 339182 49306 114910 -113895 479841 303324 716774 410752 369147 568232 547183
17100E47183j37154J84681q5733j206L28875C5457M6166O73783k88664j76585
$$ 547183 410029 594710 508977 507771 836646 35457 81623 755406 466742 290157
17090B90157O0422A40385M32475o9035j71013J59117j48357e5557F93055M8192
$$ 290157 350579 140385 572860 503825 332812 491929 343572 -55557 693055 741247
17080G41247k92016r7935q7145L9477J35440J7089A95304j6302M48152J35300
$$ 741247 449231 351296 264151 303628 439068 456157 195304 179002 627154 762454
17070G62454B44494R6443j08765J84108K34130l12892J17822K0889p1528p7492
$$ 762454 244494 340937 232172 416280 650410 337518 455340 476229 404701 327209
17060C27209K16800j4206P811j6649k39612K5015K7163J68904n9287j04225l8269
$$ 327209 544009 529803 537614 520965 281353 306368 333531 502435 443148 338923 300654
17049C00654L27358k21793B02894p2323M06723B60030K54263L45193m23227p0552
$$ 300654 628012 406219 202894 130571 537294 260030 514293 859486 436259 365707
17039C65707J62124r0412L8466K11707k95468L10706k55755J86404L2274B68742
$$ 365707 527831 437419 475885 687592 392124 702830 447075 633479 665753 268742
17028D78942L49160m01141K27706j98968O340K47195N1386j15926P7115r2051
$$ 478942 828102 426961 654667 455699 462039 709234 760620 644694 721809 629758
17018F29758j06671k9238L2984j68031J97905j75569J34954Q8366Q1018m5456
$$ 629758 523087 493849 526833 358802 556707 381138 516092 604458 685476 640020
17008F40020n7268K1822K05069q1985k81969J73710n3649L31019j21890J9733
$$ 640020 582752 604574 809643 727658 445689 619399 565750 896769 774879 794612
16998G94612k81997O225K79284L20294n26286o0403J41345J83649l82880K14622
$$ 794612 512615 518840 798124 1118418 592132 531729 673074 856723 473843 688465
16988F88465J12334k32243K49190k33842n0850K8639L51693r8823P0893j39460
$$ 688465 800799 568556 817746 583904 533054 561693 913386 814563 885456 745996
16978G45996J37399P0156m39489K04783r7423L98243k07182J67256k7884k74814
$$ 745996 883395 953551 514062 718845 621422 1019665 812483 979739 951855 677041
16968F77041M10744l99618J76477k43348M38365l02364J45132L7080l30405K68854
$$ 677041 1087785 688167 864644 621296 1059661 757297 902429 939509 609104 877958
16958H77958k30915L42175j14000L92798m9796n94899P0414M79453l43370M37191
$$ 877958 647043 989218 875218 1268016 1218220 623321 693735 1173188 829818 1267009
16948A267009m08508p0870O1858J38201L11877n99576K81573J90589l67391P5716
$$ 1267009 858501 787631 849489 987690 1299567 699991 981564 1172153 804762 880478
16938H80478K01382J27610o9327M5098k99419N99922k04339j16312j19391r1910
$$ 880478 1081860 1209470 1140143 1185241 885822 1485744 1281405 1165093 1045702 953792
16928I53792j28357M24878k0735J75311j10739j38619K31506m4562Q8644j53226
$$ 953792 825435 1250313 1229578 1404889 1294150 1155531 1387037 1342475 1431119 1277893
16918A277893J2877O6485k01863N33991k77526k71219O18109j75907Q8744n42742
$$ 1277893 1290770 1357255 1155392 1689383 1411857 1140638 1758747 1582840 1671584 1128842
16908A128842J98087L09070j68914K42852q7489k1480L11010K1675l10858J21367
$$ 1128842 1326929 1635999 1467085 1709937 1622448 1600968 1911978 1933653 1622795 1744162
16898A744162n5282k70396M78600k08128K3516j36533L78325m6566j79397n2039
$$ 1744162 1688880 1418484 1897084 1688956 1712472 1575939 1954264 1907698 1728301 1676262
16888A676262J60420j31978J42042K15414k57029J20138J74414P7710R8462k42990
$$ 1676262 1836682 1704704 1846746 2062160 1805131 1925269 2099683 2177393 2275855 2032865
16878B032865j2363L5572j21403M59742l61444J05629N4703L35551l74691l6884
$$ 2032865 2020502 2056074 1934671 2394413 2032969 2138598 2193301 2528852 2154161 2117277
16868B117277L84413k81166j0578L662L26182k16192O4605L77824l09069M23946
$$ 2117277 2501690 2220524 2209946 2213608 2539790 2323598 2388203 2766027 2456958 2880904
16858B880904n05778K63384L6861O6265k33074N53727m30016K82108M27306k60548
$$ 2880904 2375126 2638510 2675371 2741636 2508562 3062289 2632273 2914381 3341687 3081139
16848C081139R0717J07619o6510J68377j61301M0834Q91M08027Q151o5614K7132
$$ 3081139 3171856 3279475 3212965 3381342 3220041 3260875 3261766 3669793 3677944 3612330 3639462
16837C639462l0788J64435j29335k08095N47662l81573N53464K63418k00576j04654
$$ 3639462 3608674 3773109 3643774 3435679 3983341 3601768 4155232 4418650 4218074 4113420
16827D113420p6777L70708J47379J12325K3684M5766J86896K35076n90830P07818
$$ 4113420 4036643 4407351 4554730 4667055 4690739 4736505 4923401 5158477 4567647 5275465
16817E275465k34921L59301K449k11490M72697j23064K69214J22316J42789Q2316
$$ 5275465 5040544 5399845 5402294 5190804 5663501 5540437 5809651 5931967 6074756 6157072
16807F157072K85452J28574o7345J76479J29099N16763r3967M14806k56067L54952
$$ 6157072 6442524 6571098 6503753 6680232 6809331 7326094 7232127 7646933 7390866 7745818
16797G745818L45322m0357M13751l28482Q64637j50589J61984J82550K27349M89328
$$ 7745818 8091140 8050783 8464534 8136052 9000689 8850100 9012084 9194634 9421983 9911311
16787I911311J58258K66706M94525K42716K96218K19166J84042Q98886P9609N89404
$$ 9911311 10069569 10336275 10830800 11073516 11369734 11588900 11772942 12671828 12751437 13340841
16777A3340841Q5960L44658Q12392J44843M25656O31424J099443J26869N94269
$$ 13340841 13426801 13771459 14583851 14728694 15154350 15785774 16885217 17012086 17606355
16768A7606355N24705P40352L72959Q37548P71824Q67529Q97385J494730M84231
$$ 17606355 18131060 18871412 19244371 20081919 20853743 21721272 22618657 24113387 24597618
16759B4597618R04106J130162J029215J195097J421082J380280J423545J081238
$$ 24597618 25501724 26631886 27661101 28856198 30277280 31657560 33081105 34162343
16751C4162343K161166J382565K052470J843463K272867K572182K205731K880282
$$ 34162343 36323509 37706074 39758544 41602007 43874874 46447056 48652787 51533069
16743E1533069K715814K969084L286432L699753L344886M197179M499477M621315
$$ 51533069 54248883 57217967 60504399 64204152 67549038 71746217 76245694 80867009
16735H0867009N126401N590826N729045O045160O834793O664582P311970P845635
$$ 80867009 85993410 91584236 97313281 103358441 110193234 116857816 124169786 132015421
16727A32015421P791290P812612P984117Q075186Q001316P427822O551757N698430
$$ 132015421 139806711 147619323 155603440 163678626 171679942 179107764 185659521 191357951
16719A91357951N153127L327449J762639R59101j350109k077555m010890n015220
$$ 191357951 196511078 199838527 201601166 202560267 201210158 199132603 195121713 190106493
16711A90106493o137877o664433p642079p796014q126808q609308q200631p338688
$$ 190106493 183968616 177304183 169662104 161866090 153739282 145129974 136929343 129590655
16703A29590655p807759p594699o923050o669238o362014n517718n603164n102825
$$ 129590655 121782896 114188197 107265147 100595909 94233895 88716177 83113013 78010188
16695G8010188m413172m625949m155920l654216l594985l028867k978047k760358
$$ 78010188 73597016 68971067 64815147 61160931 57565946 54537079 51559032 48798674
16687D8798674l128464j765046k707995j792978k078103k073241j343768j621670
$$ 48798674 45670210 43905164 41197169 39404191 37326088 35252847 33909079 32287409
16679C2287409j214889k141766j236643j064351r40663r29409j358594q35174
$$ 32287409 31072520 28930754 27694111 26629760 25689097 24759688 23401094 22565920
16671B2565920j274849l42337q25487r54401p66485m87251m43115j132786n76594
$$ 22565920 21291071 20948734 20123247 19168846 18402361 17915110 17471995 16339209 15762615
16662A5762615l29035n25903n40051m49005m12671k17185j104633p9767m839o33876
$$ 15762615 15433580 14907677 14367626 13918621 13505950 13288765 12184132 12104365 12099526 11465650
16652A1465650k21631m05030o35231j65600k84236j99787N3014r9341n63786m38177
$$ 11465650 11244019 10838989 10203758 10038158 9753922 9554135 9607149 9507808 8944022 8505845
16642H505845j0538j58960l31696r0399m92722J75481o29396J4303j6346l52354
$$ 8505845 8495307 8336347 8004651 7914252 7421530 7597011 6967615 6981918 6965572 6613218
16632F613218m02416L85257k76008l72391J74166l72464l92900K83643k94730
$$ 6613218 6210802 6596059 6320051 5947660 6121826 5749362 5356462 5640105 5345375
16623E345375M5647m184q6006k82181k70481J88607l76340l38138K28578K2710
$$ 5345375 5391022 5386838 5300832 5018651 4748170 4936777 4560437 4222299 4450877 4473587
16613D473587j68423j65385M58653p14605M36497o43090m72935N19534j75173
$$ 4473587 4305164 4139779 4598432 3883827 4320324 3677234 3204299 3723833 3548660
16604C548660J27143k87645J31920N248k61037j33841K76290k59848K8674L9571
$$ 3548660 3675803 3388158 3520078 3525326 3264289 3130448 3406738 3146890 3175564 3215135
16594C215135l46900m0834L6834k4575j2834m30159M19561P5455m2857n52558
$$ 3215135 2868235 2827401 2864235 2839660 2826826 2396667 2816228 2891683 2848826 2296268
16584B296268L00099j33987k51493l10813M45230J63230k37417n8328j35740L40432
$$ 2296268 2596367 2462380 2210887 1900074 2345304 2508534 2271117 2212789 2077049 2417481
16574B417481l23430L31125m02190J77919k34239j75449L23951m4523j30249j9297
$$ 2417481 2094051 2425176 2022986 2200905 1966666 1791217 2115168 2070645 1940396 1921099
16564A921099j77660n0598L16407l86501J23724j24061Q3879j80934J9959R9662
$$ 1921099 1743439 1692841 2009248 1622747 1746471 1622410 1706289 1525355 1545314 1644976
16554A644976k27067K37640l38810M68751j2985m58481K53242k60989J37899P7360
$$ 1644976 1417909 1655549 1316739 1785490 1772505 1314024 1567266 1306277 1444176 1521536
16544A521536j56649K72129j77480J15290K340m577j12379j53952J29863O3669
$$ 1521536 1364887 1637016 1459536 1574826 1577166 1572589 1460210 1306258 1436121 1499790
16534A499790k50575K61246k43261N8529m5259j02827l3918J48856k51831j69561
$$ 1499790 1249215 1510461 1267200 1325729 1280470 1177643 1143725 1292581 1040750 871189
16524H71189M13526l48017K72674l5536j13863J21834o0364p0792q2596m1228
$$ 871189 1284715 936698 1209372 1173836 1059973 1181807 1121443 1050651 968055 926827
16514I26827m0699l1389j89949J94719o3596j4346M09626j20337l51020J3842
$$ 926827 886128 854739 664790 859509 795913 781567 1191193 1070856 719836 733678
16504G33678J43479K0516r250K12073p8998k70373J84827n1415j10664O6774Q8104
$$ 733678 877157 897673 888423 1100496 1021498 751125 935952 884537 773873 840647 928751
16493I28751o1555J21344l99499K61216m5213M4315j91917R0162j13424L78297
$$ 928751 867196 988540 589041 850257 805044 849359 657442 747604 634180 1012477
16483A012477k93476L01092l13484j26965R1219K97318r3871j15703K9937k71507
$$ 1012477 719001 1020093 706609 579644 670863 968181 874310 758607 788544 517037
16473E17037J06695K5604k59522K03765K61650m23048K56570N7883l6864Q6828
$$ 517037 623732 649336 389814 593579 855229 432181 688751 746634 709770 796598
16463G96598k35643J06379M07J49616j55978B17436K34464P07777n50982N5100
$$ 796598 560955 667334 667741 817357 661379 217436 451900 1159677 608695 663795
16453F63795o1183P6188m2413K0209l05107R1354L24873C79769j88533M97875
$$ 663795 602612 678800 636387 656596 351489 442843 767716 379769 191236 689111
16443F89111k74219Q5828K17803j96697B59786K16239K41324A35396K22452J08345
$$ 689111 414892 500720 718523 521826 259786 476025 717349 135396 357848 466193
16433D66193K05348B21878L06393k12316l582K58140R0376H5147K66945L18764
$$ 466193 671541 221878 528271 315955 312373 570513 660889 85147 352092 670856
16423F70856q187B67611Q5277j00467K3279n550J77084A37610L62215A32459N3102
$$ 670856 662669 267611 352888 252421 275700 270150 447234 137610 499825 132459 185561
16412A85561L06244k09299j5071I0510L69588A82475L52089I1457L40706r868
$$ 185561 491805 282506 267435 90510 460098 182475 534564 91457 432163 422295
16402D22295K64116k40257j69373K48099B22748L59925j10633k01649K22599A06967
$$ 422295 686411 446154 276781 524880 222748 582673 472040 270391 492990 106967
16391a14115B46204K74984r2232R965o545k15554J59882K13382A79931L8582o3615
$$ -114115 246204 521188 428956 438921 432376 216822 376704 590086 179931 218513 154898
16380A54898K41759A16590K32207m3281O8527A80187M36499B33027a03429A36259
$$ 154898 396657 116590 348797 305516 374043 180187 616686 233027 -103429 136259
16369B10564M6409K63683j99709l9486J87415K12520l37121j2506r3861J72532
$$ 210564 256973 520656 320947 281461 468876 681396 344275 331769 237908 410440
16359D10440j48594N4272a49223C21040P6562P9145j92592H4898L25590q6888
$$ 410440 261846 316118 -149223 321040 397602 476747 284155 84898 410488 323600
16349C23600p2331L9388A28918k1599K59086j06907H9553K29283A26543J21763
$$ 323600 251269 290657 128918 107319 366405 259498 89553 318836 126543 248306
16339B48306g1611k7256B94271p4315h7654B34001F366K55872I5374K26787A43363
$$ 248306 -71611 -98867 294271 219956 -87654 234001 6366 262238 95374 322161 143363
16327A23110K44820j50490J63171j81175J0953o8815J79169m6584a41574e0222
$$ 123110 367930 217440 380611 199436 210389 141574 320743 274159 -141574 -50222
16316C31516j02524J15857G3783o543L35092j16224j20256J13315D8789e9560
$$ 331516 228992 344849 73783 67240 402332 286108 165852 279167 48789 -59560
16305c8044B36161m885J60912A03163A0312J02544r459b15649A81704h294C02644
$$ -38044 236161 231276 392188 103163 10312 112856 103397 -215649 181704 -8294 302644
16293C44869c5277B229d1114B27516J4360e1882F0950J24200H8726J30608r8501
$$ 344869 -35277 2229 -41114 227516 241876 -51882 60950 185150 88726 219334 120833
16282A20833l7379a88658A4766L78373I1011J83076A15412d1280A77891n9402
$$ 120833 83454 -188658 14766 393139 91011 274087 115412 -41280 177891 118489
16272A18489a28970B16389P1014i6335A52252A652P4892J48319K1268j4394J1841
$$ 118489 -128970 216389 287403 -96335 152252 1652 76544 224863 246131 231737 243578
16261B43578n4228r2462P722K98817E5802J93124J44180g6582F6508P8588m1152
$$ 243578 189350 96888 104610 403427 55802 248926 393106 -76582 66508 145096 103944
16250A03944P8123M3534D6727P9942a89277C23480j57551a27103B76717m1814
$$ 103944 182067 225601 46727 126669 -189277 323480 165929 -127103 276717 234903
16240B34903A05723O0358P7971a31933C78402A18953J20442a72272A68203F6810
$$ 234903 105723 166081 244052 -131933 378402 118953 239395 -172272 168203 66810
16229B61299G8315J679K51325J04507B05533a03815A22740J04168j3069J0290
$$ 261299 78315 79994 331319 435826 205533 -103815 122740 226908 213839 224129
16219B24129a8259B08366i9859L2957C23202a00236B0325J61771p9624M2414a01166
$$ 224129 -18259 208366 -99859 -66902 323202 -100236 20325 182096 102472 144886 -101166
16207B18591G7022M4459J10164q4975O7013g4689A2921Q5562K13309G5432f1117
$$ 218591 77022 121481 231645 146670 213683 -74689 12921 98483 311792 75432 -61117
16195A01083c64956A88650b56611b2754C7037e9063k24729l212A8923a1936G731
$$ 101083 -364956 188650 -256611 -22754 37037 -59063 -283792 -287004 18923 -11936 7731
16183a2375j46854I8474b21342A22307M5618k48b09806Q538a242E0774b40480
$$ -12375 -159229 98474 -221342 122307 167925 167677 -209806 -201268 -1242 50774 -240480
16171e6817B05866a95185C69510a23406F1745J17493a092r6623B8898b4712M746
$$ -56817 205866 -195185 369510 -123406 61745 179238 -1092 -97715 28898 -24712 -19966
16160a9966C6995K88529A35639K09790d0795A10384e5533k00675A89831a67660
$$ -19966 36995 325524 135639 345429 -40795 110384 -55533 -256208 189831 -167660
16149h9902A46361a13146C691b3378B1520J50193m72e0900l1792K6481d895D32737
$$ -89902 146361 -113146 3691 -23378 21520 171713 171241 -50900 -82692 -56211 -4895 432737
16136h0658m770f52A47623a09648d3620B50500I0963d1646E0375J28565e03360
$$ -80658 -85428 -652 147623 -109648 -43620 250500 90963 -41646 50375 178940 -503360
16124a52433A41872b23190Q5328b9817m8520m4937j14604A534J53749K7972a21172
$$ -152433 141872 -223190 -137862 -29817 -78337 -123274 -237878 1534 155283 183255 -121172
16112E8716A8559J46186N1952B4706a11779J5163k5872H7660g0926B35603F8480
$$ 58716 18559 164745 216697 24706 -111779 -96616 -122488 87660 -70926 235603 68480
16100B84725O2930E4111K50477H1776d94373a42187F4761b27648N0073j17847
$$ 284725 347655 54111 304588 81776 -494373 -142187 64761 -227648 -177575 -295422
16090b95422A25418J2804a13004A03251O7536R8892d5267A31632c71645a64624
$$ -295422 125418 138222 -113004 103251 170787 269679 -45267 131632 -371645 -164624
16079b52318Q8129A39776a08266M1916E6407f0264B6814b69451a03687k956c1013
$$ -252318 -164189 139776 -108266 -66350 56407 -60264 26814 -269451 -103687 -106643 -31013
16067C06783a7210B40467B913P5737b84494B37781A04363a33379k1538B95504
$$ 306783 -17210 240467 2913 78650 -284494 237781 104363 -133379 -154917 295504
16056A79413b052k78883J22871M1636G5257l7408a83410E1705h584r5780j41511
$$ 179413 -2052 -280935 -158064 -116428 75257 37849 -183410 51705 -8584 -104364 -245875
16045b45875k80M8600F0093a9171C26914L7090D2332Q8723h4541A74636b87650
$$ -245875 -246155 -197555 60093 -19171 326914 364004 42332 131055 -84541 174636 -287650
16033A15898g4899o8633f5143A01343A0236a74780g6513a5856j07468B26940h2637
$$ 115898 -74899 -143532 -65143 101343 10236 -174780 -76513 -15856 -123324 226940 -82637
16021F3462J00440f2846A59125n7346c24914a53529q4378A45063a05433F8473
$$ 63462 163902 -62846 159125 101779 -324914 -153529 -237907 145063 -105433 68473
16010g8697l0960j05563p0101A17353I381b16918j021m4816p0005A4597d8785
$$ -78697 -109657 -215220 -285321 117353 9381 -216918 -217939 -262755 -332760 14597 -48785
15998b06680Q1755k07044B56179l9824E3794O0483b81912A48577a86222k861B4186
$$ -206680 -124925 -331969 256179 216355 53794 114277 -281912 148577 -186222 -189083 24186
15986a91375D8579R4244j2148J21464k3020J83471A39147K09279C5519J83945
$$ -191375 48579 142823 130675 252139 229119 412590 139147 348426 35519 219464
15976B19464b33833d7553C10161f0432k8072m18040B25567D0710a79931O6995
$$ 219464 -233833 -47553 310161 -60432 -88504 -506544 225567 40710 -179931 -112936
15966a12936E4028b31783A57049N2202d8589D5904K33870B5685K03322a5735E0977
$$ -112936 54028 -231783 157049 209251 -48589 45904 279774 25685 229007 -15735 50977
15954b70893k5608J17760C3289a75047B13204g0229j68915D6462a04102H6514
$$ -270893 -296501 -178741 33289 -175047 213204 -70229 -239144 46462 -104102 86514
15943A3746e3071j8666k40891a08322B11576a59618A44707r247b32516f3325D3658
$$ 13746 -53071 -71737 -312628 -108322 211576 -159618 144707 135460 -232516 -63325 43658
15931B4143b52519I0995d0273I0989k2763K07498A14073c14742J51764C8721c0338
$$ 24143 -252519 90995 -40273 90989 68226 275724 114073 -314742 -162978 38721 -30338
15919c65596A8145K4287g8812B21152a87510C19821A09290h3498q0074A58217
$$ -365596 18145 42432 -78812 221152 -187510 319821 109290 -83498 -163572 158217
15908B3477K8200c45002R5952G9582L4325L8625J13891J94707f5219p1143f7970
$$ 23477 51677 -345002 -249050 79582 113907 152532 266423 461130 -65219 -136362 -67970
15896e7875j11126F7110b21401K9362D124J34886a8882l02437a446q0080m4605
$$ -57875 -169001 67110 -221401 -192039 4124 139010 -18882 -321319 -1446 -81526 -126131
15885a26131b7595B4223e6465m5290k38824j05702C40940a79920N2020e1723A02271
$$ -126131 -27595 24223 -56465 -101755 -340579 -446281 340940 -179920 -127900 -51723 102271
15873a9126A4063J71519a64385o1233R8832C7970e21704B00317g1273B39407a39633
$$ -19126 14063 185582 -164385 -225618 -126786 37970 -521704 200317 -71273 239407 -139633
15861a01981J7056A57166J64042B8259M4587K38855E4393K28159b96263A90766
$$ -101981 -84925 157166 321208 28259 72846 311701 54393 282552 -296263 190766
15850a97724B40331h4019C51891G4251a58743j60940g6628L7342C420J24726E6209
$$ -197724 240331 -84019 351891 74251 -158743 -319683 -76628 -39286 3420 128146 56209
15838c50301H9L4881J3846c6298G5301g3765A62603b98878J30036D4177M2833
$$ -350301 89 34970 48816 -36298 75301 -73765 162603 -298878 -168842 44177 87010
15827H7010b81368q7067a28075A12519d7287k8508K2303j03232G3160J67973A12088
$$ 87010 -281368 -368435 -128075 112519 -47287 -75795 -53492 -156724 73160 241133 112088
15815c64742d42l36305J65599b7912j91867H0622h0118C11034b19607k3067I4350
$$ -364742 -442 -336747 -171148 -27912 -219779 80622 -80118 311034 -219607 -242674 94350
15803b12239e5002K5454m60809b08126A22871A0396h1530p0443G3298R8296a4222
$$ -212239 -55002 -29548 -490357 -208126 122871 10396 -81530 -151973 73298 171594 -14222
15791C42432a37471I6179K668a1469j37111n0972i4668A73410O8154a12082K2211
$$ 342432 -137471 96179 98847 -11469 -148580 -199552 -94668 173410 241564 -112082 -89871
15780h9871k89361b0809I891a01794o4576j01958a24855n3925p316I8660b6327
$$ -89871 -379232 -20809 9891 -101794 -166370 -268328 -124855 -178780 -186096 98660 -26327
15768a32250A64888K732a83362c145q8050H7090l6973L2143P9898a22198E024
$$ -132250 164888 167620 -183362 -3145 -91195 87090 50117 82260 162158 -122198 5024
15756b19463g814o1797C549b54521A5656b223l059A11357b38471A80216a39413
$$ -219463 -7814 -69611 3549 -254521 15656 -2223 -5282 111357 -238471 180216 -139413
15744B13292P051j07954J50634a06099F5465b37184p588N4383J1901O7973F6893
$$ 213292 220343 112389 263023 -106099 65465 -237184 -244772 -190389 -178488 -110515 66893
15732h6957A5284b40978A6243R3054a72793j4805A46564d3549r8709j2246e720
$$ -86957 15284 -240978 16243 109297 -172793 -187598 146564 -43549 -142258 -154504 -5720
15720a47471L5153j815j37859M1839B5097J9704J5042B4250K20543A19192b34240
$$ -147471 -112318 -114133 -251992 -210153 25097 44801 59843 24250 244793 119192 -234240
15708a99389G8578a88430E0J80310a50144a9262j52501a9595B78612n357b08449
$$ -199389 78578 -188430 50 180360 -150144 -19262 -171763 -19595 278612 273255 -208449
15696c03341E8630O4128f4846i572o3384n0420j37416e2188m35525a40498B21709
$$ -303341 58630 122758 -64846 -9572 -72956 -123376 -260792 -52188 -487713 -140498 221709
15684d8054A49680c8970l22853D10780a79220A05872j901E1429M4116j3075a45598
$$ -48054 149680 -38970 -361823 410780 -179220 105872 103971 51429 95545 82470 -145598
15672A29964n8344J12810K921D4727K07341h6508j0535A19503J30074e96190K84989
$$ 129964 71620 184430 187351 44727 252068 -86508 -97043 119503 249577 -596190 -311201
15661c11201f4998l51954D09183G1592b00231f6713m0863A04322C0474a20235
$$ -311201 -64998 -416952 409183 71592 -200231 -66713 -107576 104322 30474 -120235
15650B11729a2098m6468E06061A32062R7403A01359l1463B3604g5767j12460a5090
$$ 211729 -12098 -58566 506061 132062 229465 101359 69896 23604 -75767 -188227 -15090
15638g3407k18787B03057c8703j10035K9491c8650m72297A02480N1212A7261b83922
$$ -73407 -292194 203057 -38703 -148738 -119247 -38650 -510947 102480 153692 17261 -283922
15626A09008d06583a68078h0393D45242q7969I8537L342c53906f9747j73975a01966
$$ 109008 -406583 -168078 -80393 445242 357273 98537 101879 -353906 -69747 -243722 -101966
15614D03252a30255A67232C8324L4068b80920R8438F812b13453R8721j20H474
$$ 403252 -130255 167232 38324 72392 -280920 -182482 6812 -213453 -114732 -114852 8474
15602a28298E7634a5463j33513c0773m5598l90276h0038h777o6466E489a30487
$$ -128298 57634 -15463 -148976 -30773 -76371 -466647 -80038 -8777 -75243 5489 -130487
15590C48256D1665b5713l32463A73371k8464E7437N827b38685C73324d23763a72142
$$ 348256 41665 -25713 -358176 173371 144907 57437 63264 -238685 373324 -423763 -172142
15578G3296a52957q7693c9254k5584A21207a35683f5715B02445n3226K06640f8823
$$ 73296 -152957 -240650 -39254 -64838 121207 -135683 -65715 202445 149219 355859 -68823
15566A24404Q6888a47572A8653a17092P848B65121A32322b7710H0576a70728l02317
$$ 124404 211292 -147572 18653 -117092 -109244 265121 132322 -27710 80576 -170728 -473045
15555d73045A57127F44R9415b59287e0162j88478h5335o1549j73818l9087b335
$$ -473045 157127 644 100059 -259287 -50162 -238640 -85335 -146884 -320702 -359789 -2335
15543g0813K6825l7314B03011a438k11226l2510C6947i3362B07688b0700E22939
$$ -70813 -43988 -81302 203011 -1438 -212664 -245174 36947 -93362 207688 -20700 522939
15531G1092B9917J08300a95862A54169e82016F5844e9893j10244B66387M07040
$$ 71092 29917 138217 -195862 154169 -582016 65844 -59893 -170137 266387 673427
15521F73427G6643J19692b45432J20802F1947B0428a75585I7269C2029a30217
$$ 673427 76643 196335 -245432 -124630 61947 20428 -175585 97269 32029 -130217
15510g0772C67309a83031O4751r446A97158a65512j77115a48908B77463b8472
$$ -70772 367309 -183031 -118280 -127726 197158 -165512 -342627 -148908 277463 -28472
15499b04986E7978b8630A96143a07397f343p1546n9400N4980j56812P0843A16540
$$ -204986 57978 -28630 196143 -107397 -6343 -77889 -137289 -82309 -239121 -168278 116540
15487i7415b7041M988H7850d2529k7920A58756d3339B44210D2719b44501A93316
$$ -97415 -27041 -22053 87850 -42529 -70449 158756 -43339 244210 42719 -244501 193316
15475b04722f2584c0195F3742i577j34996j90655a08352B4538a57261A35191J91953
$$ -204722 -62584 -30195 63742 -9577 -144573 -335228 -108352 24538 -157261 135191 327144
15464C27144c35189a0049k53346m1848h8522I9830R216J45387D2629R3752m251
$$ 327144 -335189 -10049 -263395 -305243 -88522 99830 109046 254433 42629 136381 132130
15453A32130o3690J45250a486j49659l5697m8911R7564H4466a35023J7508I2840
$$ 132130 68440 213690 -1486 -151145 -186842 -235753 -138189 84466 -135023 -117515 92840
15441A69901B5625J56110O5535J64529c6567B1366J6840b79825B01882H7704e5738
$$ 169901 25625 181735 247270 411799 -36567 21366 38206 -279825 201882 87704 -55738
15429A3995a4236D1401a06591l7013k7997A11212d1995o2940e922E7149a25143
$$ 13995 -14236 41401 -106591 -143604 -171601 111212 -41995 -104935 -5922 57149 -125143
15417a66260B95562f3241q2174q1801h0555A35444J6422a49607P008r0028e2018
$$ -166260 295562 -63241 -145415 -227216 -80555 135444 151866 -149607 -142599 -232627 -52018
15405a03818l80518B24203k7941J97267f7058J3462A53517a90529m204B0132d9914
$$ -103818 -484336 224203 196262 393529 -67058 -53596 153517 -190529 -194733 20132 -49914
15393d7781o9691j04233A31654d47614A74798R7734H1487O511d00066I0621C9765
$$ -47781 -117472 -221705 131654 -447614 174798 272532 81487 87998 -400066 90621 39765
15381a01775j87937J04433A86672g6197B34221g4341K4991A16260a46967j42542
$$ -101775 -289712 -185279 186672 -76197 234221 -74341 -49350 116260 -146967 -289509
15371b89509A88125o8589a40664J9899q8577D4921b13618C20431e4675B16591
$$ -289509 188125 119536 -140664 -120765 -209342 44921 -213618 320431 -54675 216591
15360A68496d0523E0294b76119H5310q386g8803j08299A50429a67080e2789a0087
$$ 168496 -40523 50294 -276119 85310 76924 -78803 -187102 150429 -167080 -52789 -10087
15348D23725a31261A94116J16655i3186C4078j4787b02148A57220M7485q6613
$$ 423725 -131261 194116 310771 -93186 34078 19291 -202148 157220 204705 118092
15338A18092a4537r1501A34351a45599E5615K8979d04914B18892I0002c6851F0363
$$ 118092 -14537 -106038 134351 -145599 55615 84594 -404914 218892 90002 -36851 60363
15326A49944R7647c22484e4867A06151C6623Q9208K02032C4288L45946h1487p7236
$$ 149944 247591 -322484 -54867 106151 36623 125831 327863 34288 380234 -81487 -158723
15315a58723n4405d5089p2348A54984C014J2670J02433b44874m891a490B01530
$$ -158723 -213128 -45089 -117437 154984 3014 15684 118117 -244874 -249765 -1490 201530
15303c1642j69463B70134M553F724L11930a93457B03054a10991j91232c8889F2647
$$ -31642 -201105 270134 274687 6724 318654 -193457 203054 -110991 -302223 -38889 62647
15291B05185K8262O2532e318A56240P4540J19858h1902b5673L26A29947k9416
$$ 205185 233447 295979 -5318 156240 230780 350638 -81902 -25673 -25347 129947 100531
15280A00531D8941J86801j6771l3572b82921A31891O5620j7717L4804a58275A009
$$ 100531 48941 235742 218971 185399 -282921 131891 197511 179794 214598 -158275 1009
15268b29910a25l25994a06469A44388o8767K1004J26944J39600A39544F2355d3885
$$ -229910 -125 -326119 -106469 144388 75621 96625 223569 363169 139544 62355 -43885
15256A35251Q5937d3893A72453B3797M90901A13530L15172O87937K78694k55102
$$ 135251 221188 -43893 172453 23797 514698 113530 428702 1116639 1395333 1140231
15246A140231L54807G40696j10558A2187J05284k8122d6087k22583A19427L6278
$$ 1140231 1495038 740696 630138 12187 117471 89349 -46087 -268670 119427 155705
15236A55705a54334A64997M82466A66913J4416c1067B74639A26714d0633C3107
$$ 155705 -154334 164997 647463 166913 181329 -31067 274639 126714 -40633 33107
15225c4727o0021C2871A2074R7981g0428F2057J11575a63225B15693r2277L30678
$$ -34727 -94748 32871 12074 110055 -70428 62057 173632 -163225 215693 123416 454094
15214D54094k10093E415K37948B3187J43647o2417A6743a5743A68999D4370D85
$$ 454094 244001 5415 243363 23187 166834 104417 16743 -15743 168999 44370 485
15202A00908J42054j07767b3551q7525g268D09156B4640O6804b9215D02613f1910
$$ 100908 242962 135195 -23551 -111076 -7268 409156 24640 91444 -29215 402613 -61910
15190a96385C07590d708l24863G4180e2195j1720l3503E7439b70422A35579a61606
$$ -196385 307590 -4708 -329571 74180 -52195 -63915 -97418 57439 -270422 135579 -161606
15178B73527b05131B04878a40491B3266b62396B65666b58706C8615d43553f5854
$$ 273527 -205131 204878 -140491 23266 -262396 265666 -258706 38615 -443553 -65854
15167B31826c8153C695K0728g9698c8644A5340J44833a9786k88737A33713F0741
$$ 231826 -38153 3695 24423 -79698 -38644 15340 160173 -19786 -308523 133713 60741
15155d3795I4925O0728G7461l3105J40499b1138p3915j7505E4502q76e3833r1752
$$ -43795 94925 155653 77461 44356 184855 -21138 -95053 -112558 54502 53626 -53833 -145585
15143a45585A45709J73545k5923A40578O0514h0392c1195m7424B67934j12553
$$ -145585 145709 319254 293331 140578 201092 -80392 -31195 -78619 267934 155381
15133A55381D5889J72724h3539H4770L34701a10302A97297c6966I1142k8449c7069
$$ 155381 45889 218613 -83539 84770 419471 -110302 197297 -36966 91142 62693 -37069
15121B06891q2143F1877b86447A71638l7223L51347a03870A68670f6383A48123
$$ 206891 124748 61877 -286447 171638 134415 485762 -103870 168670 -66383 148123
15110i7399k04271C46621b76840J34436D8556K41402d951A03078K30663A36290
$$ -97399 -301670 346621 -276840 -142404 48556 289958 -4951 103078 333741 136290
15099g5809P92A85037i062k0351H9552J10760J61461A48369n0488J73515K2295
$$ -75809 -75017 185037 -9062 -29413 89552 200312 361773 148369 97881 271396 293691
15088B93691J1610E3601K08378n0767a22529G1493K04319H4184J30240I1718J56595
$$ 293691 305301 53601 261979 211212 -122529 71493 275812 84184 214424 91718 248313
15077B48313f5869B83306a58761B52164m4784N9094F1364L79718k4000j06905
$$ 248313 -65869 283306 -158761 252164 207380 266474 61364 441082 417082 310177
15067C10177J88935k35378a13445n482B14000n5992n4855i487B58715A11301m3410
$$ 310177 499112 263734 -113445 -118927 214000 158008 103153 -9487 258715 111301 67891
15056F7891P5090a69j53936I9630l8973J95290r7356b46820b6926E5225d3883
$$ 67891 142981 -169 -154105 99630 60657 255947 158591 -246820 -26926 55225 -43883
15044B69930J23631f606A25604K61556j30433p5259l9795l5352L377j7368k5190
$$ 269930 393561 -6606 125604 387160 256727 181468 141673 106321 109698 92330 67140
15033F7140L70352p521o997k05651j4595d8108B64254j25344j0796K24919A60958
$$ 67140 437492 429971 422974 217323 202728 -48108 264254 138910 128114 353033 160958
15021a6719C37577A38913L8123M47228A53744J89919o9360B8143L44598A61249
$$ -16719 337577 138913 177036 624264 153744 343663 274303 28143 372741 161249
15010C37328m1575j11585n6628c195C56477j35162E9423M77266k22103j8J16545
$$ 337328 295753 184168 127540 -3195 356477 221315 59423 536689 314586 314568 431113
14999D31113j41445B4280K54894d7847C79411l1233b63884D26369j31892l6694
$$ 431113 289668 24280 279174 -47847 379411 348178 -263884 426369 294477 257783
14989B57783L38972j93650Q3945j40447K4038A68296K21896a53983D33626b30142
$$ 257783 596755 403105 487050 346603 370641 168296 390192 -153983 433626 -230142
14978E438K3676J47853B9804J10570a27385B43303K8108j30434P9717J6033A5402
$$ 5438 29114 176967 29804 140374 -127385 243303 271411 140977 220694 236727 15402
14966B85747O4687N9731q5730H6950J25470J13885J59109a37615A85563K03521
$$ 285747 350434 410165 324435 86950 212420 326305 485414 -137615 185563 389084
14956C89084A38571J94316j9390L73563j02051A78430i6422A10087C3393e711
$$ 389084 138571 332887 313497 687060 585009 178430 -96422 110087 33393 -5711
14945H2323L60179j58791b6259I2589K29583L37890A02166J93936b0010D16392
$$ 82323 442502 283711 -26259 92589 322172 660062 102166 296102 -20010 416392
14934C67839o5192j19896n4642p948K42343j11355m8081K66303B14180k343j04176
$$ 367839 302647 182751 128109 120161 362504 251149 203068 469371 214180 211837 107661
14923A07661K18267P8727J03878j09304A22959E8447K43307b7035C79778E9630
$$ 107661 325928 404655 508533 399229 122959 58447 301754 -27035 379778 59630
14912E12131J11901B24366K1083N1690d7623A47090J6245M25084Q0748m6990k20445
$$ 512131 624032 224366 245449 297139 -47623 147090 163335 588419 669167 622177 401732
14901D01732l5285F3434K84066q0652p4848J1600a43902B79958j10322R8993m6018
$$ 401732 366447 63434 347500 266848 192000 203600 -143902 279958 169636 268629 222611
14890B22611K35135j90416A22137L22142K9697P8328A4453N04426B13074Q2392
$$ 222611 457746 267330 122137 444279 473976 552304 14453 518879 213074 295466
14880B95466K1459j34815H3110L30565j43540J30167K8863k14268L48370D0454
$$ 295466 316925 182110 83110 413675 270135 400302 429165 214897 563267 40454
14869E47308J24388j19931k57259L2444M71887C72444O6988J48405j12260k25458
$$ 547308 671696 551765 294506 326950 798837 372444 439432 587837 475577 250119
14859B50119O5251L0010H9621J43651R6419K39417L5082j18104a18676D46356
$$ 250119 315370 345380 89621 233272 329691 569108 604190 486086 -118676 446356
14848A87120n8405K49635j10949Q6245j06938o9046J75836p6355J56932K5695
$$ 187120 128715 378350 267401 353646 246708 177662 353498 277143 434075 459770
14838D59770L5778K5781k28116r4050L59874J83616k22238n2955A42640M28197
$$ 459770 495548 521329 293213 199163 559037 742653 520415 467460 142640 570837
14828E70837q1016J83335C28687k2674j8514J62372j80816M22413A77151G2139
$$ 570837 489821 673156 328687 306013 287499 449871 269055 691468 177151 72139
14817F54806O023A58892J94862P8469Q3020B33883M88938B74006K41929K24451
$$ 654806 660829 158892 353754 432223 515243 233883 722821 274006 515935 740386
14807G40386B55175O1521K01108j68163k6669K22412J3792J1524r1144B34349
$$ 740386 255175 316696 517804 349641 322972 545384 559176 570700 479556 234349
14796D17792L7660K07188L8318N175j73943K19682C40718L45798k85750P1266
$$ 417792 455452 662640 700958 706133 532190 751872 340718 686516 400766 472032
14786D72032J17181K4262j49401P0674P7760m7865Q872L86714j97778C51259K82360
$$ 472032 589213 613475 464074 534748 612508 564643 573515 960229 762451 351259 633619
14775F33619j81592K12994B20651M73462k9755J29848R5636k26190j8642k39754
$$ 633619 452027 665021 220651 694113 664358 794206 889842 663652 645010 405256
14765D05256J43068N47866B35376M20420o9828J30685k25710k5808P56940n92088
$$ 405256 548324 1096190 235376 655796 585968 716653 490943 465135 1222075 629987
14755F29987q819B94372L78021K81814l54968n7438j3146K11943k22672N9986
$$ 629987 621168 294372 672393 954207 599239 541801 528655 740598 517926 577912
14745E77912K15941j29587J49539J15644j97141l50904L27567k06691K26258j09785
$$ 577912 793853 664266 813805 929449 732308 381404 708971 502280 728538 618753
14735F18753J02675J21072L86539E59510J32110j39448K20627r7239M7239N4433
$$ 618753 721428 842500 1229039 559510 691620 552172 772799 675560 722799 777232
14725G77232P2314P7082k20562J447M284L2323J34309J1739j49714j71919K02918
$$ 777232 849546 926628 706066 707513 711797 744120 878429 890168 740454 568535 771453
14714G71453J19085J7528k59440j58208K75598K22899l08999J17086j79315L29832
$$ 771453 890538 908066 648626 490418 766016 988915 679916 797002 617687 947519
14704I47519D25958O01221D81071N12699k46976p3320J15039P4643R0913o2736
$$ 947519 425958 1027179 481071 993770 746794 673474 788513 863156 954069 891333
14694H91333J33980l48931j75101L26999l4918K23677q4156K9858j62868L09992
$$ 891333 1025313 676382 501281 828280 793362 1017039 932883 962741 799873 1109865
14684A109865m935l01996K80338k55460q8316K31470j35895j34006K43545k53351
$$ 1109865 1104930 802934 1083272 827812 739496 970966 835071 701065 944610 691259
14674F91259L71618K3347j37300K84034o0141J4608k90955P9714j91682N72988
$$ 691259 1062877 1086224 948924 1232958 1172817 1187425 896470 976184 784502 1357490
14664A357490l92211p8995j31612o105j04416M08487L22819m8831j7887M1335
$$ 1357490 965279 886284 754672 748567 644151 1052638 1375457 1326626 1308739 1350074
14654A350074j85095L6650k61847J48298n7184M12652l23206K88854n5201J40583
$$ 1350074 1164979 1201629 939782 1088080 1030896 1443548 1120342 1409196 1353995 1494578
14644A494578m94149L41837l28k72251J14136k4621M82355k30200m94124K26760
$$ 1494578 1000429 1342266 1341938 1069687 1183823 1159202 1641557 1411357 917233 1143993
14634A143993M13284l60900L77193k27283j59728J94258K40792l60152K80822
$$ 1143993 1557277 1196377 1573570 1346287 1186559 1380817 1621609 1261457 1542279
14625A542279o1623l12597r2109P14169n91503R4435R0807K55982k47904j0459
$$ 1542279 1480656 1168059 1075950 1790119 1198616 1293051 1383858 1639840 1391936 1381477
14615A381477J00587J34545q8462n0909Q4831r7840j25814J19562j79124M06580
$$ 1381477 1482064 1616609 1528147 1477238 1562069 1464229 1338415 1457977 1278853 1685433
14605A685433j47965M12510k25765j55437l36209K49781J4680K15801p9037j83838
$$ 1685433 1537468 1949978 1724213 1568776 1232567 1482348 1497028 1712829 1633792 1449954
14595A449954L08561R3608j98504k0067J66851n5568j48852M05810K7221k68619
$$ 1449954 1758515 1852123 1653619 1633552 1800403 1744835 1595983 2001793 2029014 1760395
14585A760395L21214k90911K07928j51550J74697j46763J8558P3802O8276m65220
$$ 1760395 2081609 1790698 1998626 1847076 2021773 1875010 1893568 1967370 2035646 1570426
14575A570426N08375l97503O08744j17495J04856l7118M2681J25254o6328J43319
$$ 1570426 2078801 1681298 2290042 2172547 2277403 2240285 2282966 2408220 2341892 2485211
14565B485211r6444L17602k97494L9916p7732q2431O63798K808k31134K21919
$$ 2485211 2388767 2706369 2408875 2448791 2371059 2288628 2952426 2955234 2724100 2946019
14555B946019L17339J98729O0675N44523N41559J154684J813216M769260R392195
$$ 2946019 3263358 3462087 3522762 4067285 4608844 5763528 7576744 12346004 21738199
14546B1738199J7654030N52733j6838860A0471363E043475j699804o76886n90033
$$ 21738199 39392229 39944962 23106102 10471363 5043475 3343671 2666785 2076752
14538B076752N1563K21581j494m30180J24569L50850k0586k41520k64257L31674
$$ 2076752 2128315 2349896 2348402 1918222 2042791 2393641 2373055 2131535 1867278 2198952
14528B198952m28963L27823m1539K7854P2161J18630J58047L81990o38019L68855
$$ 2198952 1769989 2097812 2056273 2084127 2156288 2274918 2432965 2814955 2176936 2545791
14518B545791K0209L52295l03175j00946K78130j01360j10609O6045Q3311r9491
$$ 2545791 2566000 2918295 2615120 2514174 2792304 2690944 2580335 2646380 2729691 2630200
14508B630200K95798J15940j07951K47846q586l61678J4951M61308j46820k5814
$$ 2630200 2925998 3041938 2933987 3181833 3173247 2811569 2826520 3287828 3141008 3115194
14498C115194K61082j27996j55715p2653q7058L23337J53801N8050K92300K7382
$$ 3115194 3376276 3248280 3092565 3019912 2932854 3256191 3409992 3468042 3760342 3787724
14488C787724m67914Q2967K29258k83445K01661Q1438J98713j02277j43872P21888
$$ 3787724 3319810 3402777 3632035 3348590 3550251 3631689 3830402 3728125 3584253 4306141
14478D306141l48197K02759j92888L10003m9449o996L26668m58057J83868K81984
$$ 4306141 3957944 4160703 3967815 4277818 4228369 4221373 4548041 4089984 4273852 4555836
14468D555836p3028N5786M8181j39654L34411j77352K62502j91322N9387N40919
$$ 4555836 4482808 4538594 4586775 4447121 4781532 4604180 4866682 4675360 4734747 5275666
14458E275666m82582R6474K82066k84881L95578j23073P7871j10792M62797O4423
$$ 5275666 4793084 4889558 5171624 4886743 5282321 5159248 5237119 5126327 5589124 5653547
14448E653547j90219J41855p7685L72076j55636Q5782O7882K68105J6989j27947
$$ 5653547 5463328 5605183 5527498 5899574 5743938 5829720 5897602 6165707 6182696 6054749
14438F054749O1734N75590j62300j67696J17311K84045J98719l18851K57359j51353
$$ 6054749 6116483 6692073 6529773 6362077 6479388 6763433 6962152 6643301 6900660 6749307
14428F749307N06717q0733K0453J81207k3498L04797j35278M79843J32036l14581
$$ 6749307 7256024 7175291 7195744 7376951 7353453 7658250 7522972 8002815 8134851 7820270
14418G820270O49627l67931K15880M28989j0352M50880m9870j59543L09036L8919
$$ 7820270 8469897 8101966 8317846 8746835 8736483 9187363 9137493 8977950 9286986 9325905
14408I325905K67695K27639J36478J57414j33206L74059m24706O66162j07031
$$ 9325905 9593600 9821239 9957717 10115131 9981925 10355984 9931278 10597440 10490409
14399A0490409K02377K08784J11805O15314k51264J67351K49463M59573l9993
$$ 10490409 10692786 10901570 11013375 11628689 11377425 11544776 11794239 12253812 12213819
14390A2213819J60994M68994M06346M6499J16261M86944J8722J46711J63623N24964
$$ 12213819 12374813 12843807 13250153 13296652 13412913 13899857 13918579 14065290 14228913 14753877
14380A4753877K27953J16115M61051J65493M82081M3710L22062N36981K93295
$$ 14753877 14981830 15097945 15558996 15724489 16206570 16250280 16572342 17109323 17402618
14371A7402618M20082Q358N80087O86378M1132J22309N91081N74503N08207M11965
$$ 17402618 17822700 17831058 18411145 19097523 19138655 19260964 19852045 20426548 20934755 21346720
14361B1346720Q60673L04175J49548P22883N72934M85172N65382M16726K58358
$$ 21346720 22207393 22511568 22661116 23383999 23956933 24442105 25007487 25424213 25682571
14352B5682571J010806N02524N18708J007609O13030Q60049P80699O24121J045444
$$ 25682571 26693377 27195901 27714609 28722218 29335248 30195297 30975996 31600117 32645561
14343C2645561Q80304R51564Q33825J013513J258121Q03464O11331J510611J518983
$$ 32645561 33525865 34477429 35311254 36324767 37582888 38386352 38997683 40508294 42027277
14334D2027277Q10291J275647J527471J188748J644061J606163J384990J571650
$$ 42027277 42837568 44113215 45640686 46829434 48473495 50079658 51464648 53036298
14326E3036298J999151J849324J610357K214938K029998K324333K176304K606524
$$ 53036298 55035449 56884773 58495130 60710068 62740066 65064399 67240703 69847227
14318F9847227K380718L088681K782996K671686L280169L329929L538495L820404
$$ 69847227 72227945 75316626 78099622 80771308 84051477 87381406 90919901 94740305
14310I4740305L897363M431497L972552N206645M516857N160864N651482N871890
$$ 94740305 98637668 103069165 107041717 112248362 116765219 121926083 127577565 133449455
14302A33449455O154038O769120O968922P357684P693855Q358835R051630Q956690
$$ 133449455 139603493 146372613 153341535 160699219 168393074 176751909 185803539 194760229
14294A94760229J0091021J0628022J0616138J1841431J2009733J2509001J3362780
$$ 194760229 204851250 215479272 226095410 237936841 249946574 262455575 275818355
14287B75818355J3484321J4544828J4522969J4828368J4987087J5086596J5068915
$$ 275818355 289302676 303847504 318370473 333198841 348185928 363272524 378341439
14280C78341439J4704416J4206434J3548190J2120317J1163791R157331O882862
$$ 378341439 393045855 407252289 420800479 432920796 444084587 453241918 460124780
14273D60124780K666421j135924k047445l308324m613369n655537m130353o484516
$$ 460124780 462791201 461655277 459607832 456299508 451686139 446030602 441900249 435415733
14265D35415733j0116228j1867179j3263521j3984177j4867460j4560772j5196991
$$ 435415733 425299505 413432326 400168805 386184628 371317168 356756396 341559405
14258C41559405j4871863j4949957j4366447j4159339j3872317j3526344j2800647
$$ 341559405 326687542 311737585 297371138 283211799 269339482 255813138 243012491
14251B43012491j2285729j1545369j1059036r875986j0116196r056520q434940
$$ 243012491 230726762 219181393 208122357 198246371 188130175 179073655 170638715
14244A70638715p957235p542117o977104p322838o438066n925720n408374n285504
$$ 170638715 162681480 155139363 148162259 140839421 134401355 128475635 123067261 117781757
14236A17781757n122135n167887m555696l901458l731735l922090l681303l264780
$$ 117781757 112659622 107491735 102936039 99034581 95302846 91380756 87699453 84434673
14228H4434673l056978l231440l007803k572184k694848k434242k616872k011798
$$ 84434673 81377695 78146255 75138452 72566268 69871420 67437178 64820306 62808508
14220F2808508j821981k270340j710680k091815j552691j972916p88179j572185
$$ 62808508 60986527 58716187 57005507 54913692 53361001 51388085 50599906 49027721
14212D9027721j740707j822156j068950j562131j115526n79617q13531j122754
$$ 49027721 47287014 45464858 44395908 42833777 41718251 41138634 40325103 39202349
14204C9202349j624034r01577j051671p01356q87353q07981j290396q51907o05698
$$ 39202349 37578315 36676738 35625067 34923711 34036358 33228377 31937981 31086074 30480376
14195C0480376n60807q50869p21133m29600q96403o61289n58454q55503m79062
$$ 30480376 29919569 29068700 28347567 27917967 27021564 26360275 25801821 24946318 24467256
14186B4467256n22853l58236m63484o77133m23012j50552q80200k19333p00392
$$ 24467256 23944403 23586167 23122683 22445550 22022538 21871986 20991786 20772453 20072061
14177B0072061j94086k73783n14273m04852m27621l49963j99352n50826j21112
$$ 20072061 19877975 19604192 19089919 18685067 18257446 17907483 17708131 17157305 17036193
14168A7036193q13533j02169r5021l70795j16421m46158m89669M7741m93090l61491
$$ 17036193 16222660 16120491 16025470 15654675 15538254 15092096 14602427 14650168 14157078 13795587
14158A3795587K60140n24083n43713M5899m2409o43711L30816o67118K9952k34137
$$ 13795587 14055727 13531644 12987931 13033830 12991421 12347710 12678526 12011408 12041360 11807223
14148A1807223K35652p18413Q2797l52550j99621r3839l75577K38315k84739k91878
$$ 11807223 12042875 11324462 11407259 11054709 10855088 10761249 10385672 10623987 10339248 10047370
14138A0047370n4994j6252m40331j78848J83349n16925R454L1490r2148k52855
$$ 10047370 9992376 9976124 9535793 9356945 9540294 9023369 9032823 9064313 8972165 8719310
14128H719310j96724J15633k13424k14716k032n5015k99859r960k83243J13376
$$ 8719310 8522586 8638219 8424795 8210079 8208047 8153032 7853173 7843213 7559970 7673346
14118G673346l67584O1133o1655Q7032l47762o6127K15800m08411k80511L54845
$$ 7673346 7305762 7366895 7305240 7392272 7044510 6978383 7194183 6785772 6505261 6860106
14108F860106J05666m56509L4096M4239l81135k5307j15387p8262k60960K24981
$$ 6860106 6965772 6509263 6543359 6587598 6206463 6181156 6065769 5987507 5726547 5951528
14098E951528j45415q983m5633P992r0360J29378l70836K74583k65887j6430j73252
$$ 5951528 5806113 5797130 5751497 5759489 5669129 5798507 5427671 5702254 5436367 5419937 5246685
14087E246685o1906k96577J24109l31030N44898k95906o1392j71928l7924K61955
$$ 5246685 5184779 4888202 5012311 4681281 5226179 4930273 4868881 4696953 4659029 4920984
14077D920984m09548l91859N79618j84256J29861k88562r632k6933l24643K50486
$$ 4920984 4511436 4119577 4699195 4514939 4644800 4356238 4346606 4319673 3995030 4245516
14067D245516l42063L75004p1245o13903P16374l27763K27224J12266k68019k9973
$$ 4245516 3903453 4278457 4207212 3593309 4309683 3981920 4209144 4321410 4053391 4023418
14057D023418J73730j49802n24749L38559J35399k14192o39752N02763j388n3710
$$ 4023418 4197148 4047346 3522597 3861156 3996555 3782363 3142611 3645374 3643986 3590276
14047C590276j97573M73Q5879l6126k88659J18895J01693J05295m08638J19006
$$ 3590276 3392703 3393176 3479055 3442929 3154270 3273165 3374858 3480153 3071515 3190521
14037C190521j045K59756l30404M8179r3560j03462J79085P6554j34454n7109
$$ 3190521 3189476 3449232 3118828 3167007 3073447 2969985 3149070 3225624 3091170 3034061
14027C034061m9396j19250k04648K11735l17380N47964k85378j26460j15851J05827
$$ 3034061 2984665 2865415 2660767 2872502 2555122 3103086 2817708 2691248 2575397 2681224
14017B681224l34489K37745m6956l0472l24153O03160l08588J69528j05752k91165
$$ 2681224 2346735 2584480 2537524 2507052 2182899 2786059 2477471 2646999 2541247 2250082
14007B250082J49920J08808j03898J3512K13336l82620j73040J71746k90717L73647
$$ 2250082 2400002 2508810 2404912 2418424 2631760 2249140 2076100 2247846 1957129 2330776
13997B330776r4024m9207j02995o6400K99238j03376R6629M63813J106692L660778
$$ 2330776 2236752 2187545 2084550 2018150 2317388 2214012 2310641 2774454 3881146 7541924
13987G541924P527523J8354813N949294j3503643j1318778n786306k710234q82330
$$ 7541924 15069447 33424260 39373554 25869911 14551133 8764827 6054593 5172263
13979E172263p77204m99224k22921n71325K76974o62861J35709j86944L703j25944
$$ 5172263 4395059 3895835 3672914 3101589 3378563 2715702 2851411 2664467 2668170 2542226
13969B542226j93959J36776m77721J96665L80417j46726j08614k46965r228J62459
$$ 2542226 2348267 2485043 2007322 2203987 2584404 2437678 2329064 2082099 2072871 2235330
13959B235330j261Q1265j38740O6411j71886j57772R6800N4532l5144J06318j09425
$$ 2235330 2234069 2315334 2176594 2243005 2071119 1913347 2010147 2064679 2029535 2135853 2026428
13948B026428K06557j42390k64664l23124L48936L62984m88813K47324k04298
$$ 2026428 2232985 2090595 1825931 1502807 1851743 2214727 1725914 1973238 1768940
13939A768940J62056p7328Q9553n11314L16235j61361q5283M77758l51261m13731
$$ 1768940 1930996 1853668 1943221 1431907 1748142 1586781 1501498 1979256 1627995 1214264
13929A214264K18032J76194N587p7156M4985M19120j79914k71335Q4404K16238
$$ 1214264 1432296 1608490 1614077 1536921 1581906 2001026 1821112 1549777 1634181 1850419
13919A850419j64469k26693j04735K32265K24929N5027j05647n33545j5851J19684
$$ 1850419 1685950 1459257 1354522 1586787 1811716 1866743 1761096 1227551 1211700 1331384
13909A331384J70605j66277K90863l91349M56012l33763O0172k4896j37344p9142
$$ 1331384 1501989 1335712 1626575 1235226 1691238 1357475 1417647 1392751 1255407 1176265
13899A176265L73245Q3354k93199j19253K0692L09450j06331j36506J38174k23832
$$ 1176265 1549510 1632864 1339665 1220412 1241104 1550554 1444223 1307717 1445891 1222059
13889A222059P0788m3619J48780l24023J60162q8121P5008O2193j41353J71923
$$ 1222059 1292847 1249228 1398008 1073985 1234147 1146026 1221034 1283227 1141874 1313797
13879A313797N5253j69609j80748J61274j76554L84980k41203P7062j9382l15163
$$ 1313797 1369050 1199441 1018693 1179967 1003413 1388393 1147190 1224252 1204870 889707
13869H89707M83474j09758o3531j21327r3438n7733L40598j83125M1559k10613
$$ 889707 1373181 1263423 1199892 1078565 985127 927394 1267992 1084867 1126426 915813
13859I15813J56117J91780l16419j43197M23058k58799j00604K38566j21387m1924
$$ 915813 1071930 1263710 947291 804094 1227152 968353 867749 1106315 984928 943004
13849I43004K61529j21040l29356M43986m37355J43304K45536k82825J20255K8011
$$ 943004 1204533 1083493 754137 1198123 760768 904072 1149608 866783 987038 1015049
13839A015049q1268R7871k43469K26700k94110K71463L05328k50917k73752J14904
$$ 1015049 933781 1031652 788183 1014883 720773 992236 1297564 1046647 772895 887799
13829H87799M73994n22996j7103j32682L34592o6798J69148l17989n8464J81975
$$ 887799 1361793 838797 821694 689012 1023604 956806 1125954 807965 749501 931476
13819I31476J33711k30912P9063l61439M85201j30659j0095J4426Q4069N209j29059
$$ 931476 1065187 834275 913338 551899 1037100 906441 896346 910772 994841 1000050 870991
13808H70991K28898j94794L45528m27377O5816M8442j72862k71892L63148K54758
$$ 870991 1099889 905095 1250623 823246 889062 937504 764642 492750 855898 1110656
13798A110656k51494J72416j10890l22463J30811Q172J9799R5088o683j75001
$$ 1110656 859162 1031578 920688 598225 729036 737208 757007 852095 845412 670411
13788F70411k3392K55200k29045j90184J96489N4355j38669L57533j87910k76064
$$ 670411 647019 902219 673174 482990 679479 733834 595165 952698 764788 488724
13778D88724L22240O3902j01024r4828j5640J44971k12750K07026k13277J77312
$$ 488724 810964 874866 773842 679014 663374 808345 595595 802621 589344 766656
13768G66656P6807j45845j30489J84264j51716j01116M25628K8562l92540K26828
$$ 766656 843463 697618 567129 751393 599677 498561 924189 952751 560211 787039
13758G87039p6941k43906J01484J6203j12151M81067m64006L8176J51779J6383
$$ 787039 710098 466192 567676 583879 471728 952795 488789 526965 678744 695127
13748F95127B81483K4962L89737o964q3941K16688C89507L10100o800N5084k28305
$$ 695127 281483 306445 696182 689218 605277 821965 389507 699607 692807 747891 519586
13737E19586A30110L66856N10417m49704K25882j77662o0943J02470C16050K62490
$$ 519586 130110 496966 1007383 557679 783561 605899 544956 647426 316050 578540
13727E78540M15232l17306k45600j51564M12797B91042L62374N4882r6692M4909
$$ 578540 993772 676466 430866 279302 692099 291042 653416 708298 611606 656515
13717F56515o3611J83551J35844D49107L96507C21661J02797J89901B93787J06622
$$ 656515 592904 776455 912299 449107 845614 321661 424458 614359 293787 400409
13707D00409q7250L46258R159j45974m1052J05895j3172J05390k79994M03271
$$ 400409 313159 659417 668576 522602 481550 587445 574273 679663 399669 802940
13697H02940K12576m93107B43336K07436A71305K01864l0005n2186M72884B75156
$$ 802940 1015516 522409 243336 450772 171305 373169 343164 290978 763862 275156
13686D35206K74970j84718J99996k07350M31003k84020e2707D61143n9793M38940
$$ 435206 710176 525458 725454 518104 949107 665087 -52707 461143 401350 840290
13676H40290k28640l1927r4012L9041l9215k07285C0339P23105C10099J11844
$$ 840290 611650 579723 485711 524752 485537 278252 30339 753444 310099 421943
13666D21943K04612k69075r4400J85062J96450j66201j1304k32506K81915E8702
$$ 421943 626555 357480 263080 448142 644592 478391 467087 234581 516496 58702
13655H33041B42941M6046P5620J17163r3776J90259k15562K92019q2890R1685
$$ 833041 242941 288987 364607 481770 387994 578253 362691 654710 571820 663505
13645F63505B76089J93356K40173M7292B90804p087A0099J64803J32202I0338
$$ 663505 276089 469445 709618 756910 290804 283717 10099 174902 307104 90338
13634E48352J58952k85040K46072j53205A4433M08494F0056K82119K24576j60157
$$ 548352 707304 422264 668336 515131 14433 422927 60056 342175 566751 406594
13624D06594K4837J63086r9705r5774L21657l58244J74687m1290j15224N4099
$$ 406594 431431 594517 494812 399038 720695 362451 537138 495848 380624 434723
13614D34723K66647l16403A79509K89953j3823j56292K64115n6305P8445q6373
$$ 434723 701370 384967 179509 469462 455639 299347 563462 507157 585602 499229
13604D99229A78718L21727A41491K17077K35748B25118K57495k18559H5405P4288
$$ 499229 178718 500445 141491 358568 594316 225118 482613 264054 85405 159693
13594A59693N7151b01215C36745j64119q0091K16963A48930L76508A72496K08685
$$ 159693 216844 -201215 336745 172626 92535 309498 148930 525438 172496 381181
13584C81181J40319k26094J70650q1646K6110r2506L0653o3874L87517R5627l78347
$$ 381181 521500 295406 466056 384410 410520 318014 348667 284793 672310 767937 389590
13573C89590O2871j96747G6119L42286B03069J01152J90586e5802C97689A10524
$$ 389590 452461 255714 76119 418405 203069 304221 494807 -55802 397689 110524
13562b90m4891C72935j35434P6056R1480D3500d7933B79864K6231J80178J27215
$$ -290 -45181 372935 237501 313557 405037 43500 -47933 279864 306095 486273 613488
13551F13488B96324J1786J97814Q8613k56827q5197k3539B2694M96636g1949D54192
$$ 613488 296324 308110 505924 594537 337710 252513 228974 22694 519330 -71949 454192
13539B87034J59012j31055A34540L09312A17226K02346O2948j27350a04710C17732
$$ 287034 446046 314991 134540 443852 117226 319572 382520 255170 -104710 317732
13528D5758L00226p8400N9902A44334J61032A18J74788M5650J75360n3899J98304
$$ 45758 345984 267584 327486 144334 305366 118 174906 220556 395916 342017 540321
13517E40321j79307j66756a32907B16709A1120K103K34571I1758K93167A82133
$$ 540321 361014 194258 -132907 216709 11120 13223 247794 91758 384925 182133
13506A93256J18474d2769A59287J30600H3633K12180K00195j43076b9050B69767
$$ 193256 311730 -42769 159287 289887 83633 295813 496008 352932 -29050 269767
13495C67787J00277j74602j06010J32684j51103K37823A29292J50460j09354J5984
$$ 367787 468064 293462 187452 320136 169033 406856 129292 279752 170398 186382
13485A86382R3641J6512H4749J57578A21036M91821A49607j9250N4828N9727k9417
$$ 186382 280023 296535 84749 242327 121036 612857 149607 130357 185185 244912 215495
13474B15495H176K16558L26605B39316a85488L0673A43479E0705K44962l4097
$$ 215495 8176 224734 551339 239316 -185488 -154815 143479 50705 295667 261570
13464B61570p1788k6505K21933d5458D37891A72710k9459N38614k53974J9007
$$ 261570 189782 163277 385210 -45458 437891 172710 143251 681865 427891 446898
13454D46898A21097L43255J54971B39878J07710M0131A88911O5009G1044K00283
$$ 446898 121097 464352 619323 239878 347588 387719 188911 253920 71044 271327
13444B71327D4962R7658M7772R0066Q7948j56022J93639j74638f43j06919A70158
$$ 271327 44962 142620 190392 280458 368406 212384 406023 231385 -643 -107562 170158
13432A62098k2633n758O9419O5599E972J52850K36384j89213C2836J79994E4580
$$ 162098 139465 133707 203126 268725 5972 158822 395206 205993 32836 212830 54580
13420a5649C1694n086K48855J30303H3505L66234I106M24305P828j39530K22412
$$ -15649 31694 26608 275463 405766 83505 449739 9106 433411 441239 301709 524121
13409E24121k07793J22866j09740a4980A13749M15830A6470M45813j19798K3954
$$ 524121 316328 439194 329454 -14980 113749 529579 16470 462283 342485 366439
13399C66439J23945B30901J14399i7370B66946A6422K31013q5705E2100k5195
$$ 366439 490384 230901 345300 -97370 266946 16422 247435 161730 52100 26905
13389B6905D330K28937j15196D5175M00849h765k54047A48772n2068J08491i6342
$$ 26905 4330 233267 118071 45175 446024 -8765 -262812 148772 96704 205195 -96342
13377a46784B45462J21399A62248k4054N72J76676m5569j01715K97409k24211
$$ -146784 245462 366861 162248 138194 138766 315442 269873 168158 465567 241356
13367B41356J07641r8448E3849J14765R3097k7497P7832G2857K11508J67312D2757
$$ 241356 348997 250549 53849 168614 261711 234214 312046 72857 284365 451677 42757
13355I7282j3262K34049K3246Q33j46731L8696K50746r8878K5969j25185A1808
$$ 97282 84020 318069 341315 342148 195417 234113 484859 385981 411950 286765 11808
13343D48673J91008B3801O2922J05112d063B44406n2524J79623L0258a37368A54598
$$ 448673 639681 23801 86723 191835 -4063 244406 191882 371505 401763 -137368 154598
13331C44406G8510g3656B31697l3822r708o061K11690m9782j23192P9839f8434
$$ 344406 78510 -73656 231697 197875 188167 182106 393796 344014 220822 300661 -68434
13319B33563p1164J32877C9525O6181O5860l4609k5514A6514K25946K6714o5790
$$ 233563 162399 295276 39525 105706 171566 136957 111443 16514 242460 269174 203384
13308B03384L041J6358i9204D76833E9780J35671K40138j88204a1900F7739J91620
$$ 203384 206425 222783 -99204 476833 59780 195451 435589 247385 -11900 67739 259359
13297B59359O5579C8887J07605b71750A58013N7342J73198A19500C170L68946
$$ 259359 324938 38887 146492 -271750 158013 215355 388553 119500 3170 372116
13287C72116A49457a02552B91997p0728P8143H1997J42445m1963c006B48533H5727
$$ 372116 149457 -102552 291997 221269 299412 81997 224442 182479 -3006 248533 85727
13275D49722A88203K4025B9878J94097b95363C71685j74080l8824A9696O7610
$$ 449722 188203 212228 29878 223975 -295363 371685 197605 158781 19696 87306
13265H7306c93532J23786G5276l4988Q4375b98516A26727a1505B56710a71166
$$ 87306 -393532 -269746 75276 40288 124663 -298516 126727 -11505 256710 -171166
13254G6665a03028C02531b35320d3463j25494D44326C9018R8126i6255D8971L68172
$$ 76665 -103028 302531 -235320 -43463 -168957 444326 39018 137144 -96255 48971 417143
13243D17143d2168G8148M3194n4010j629K13769d52604f7441D9420K35146c63881
$$ 417143 -42168 78148 121342 67332 65703 279472 -452604 -67441 49420 284566 -363881
13231I2648l3430N9978E1669K371N6628J10341I8324J52865I8158C5118N8829
$$ 92648 59218 119196 51669 54040 110668 221009 98324 251189 98158 35118 93947
13220I3947J72868j30520K17841E4541i0633A76657K4366J71653b8223j98013
$$ 93947 266815 136295 354136 54541 -90633 176657 201023 372676 -28223 -226236
13210b26236E72247B21656J24854j13933D9921J82443J00092A28853h9210C39755
$$ -226236 572247 221656 346510 232577 49921 232364 332456 128853 -89210 339755
13199C98593k7803F3862l1875K71408d7601F3510a49524F9397B5324C965i4183
$$ 398593 370790 63862 31987 303395 -47601 63510 -149524 69397 25324 3965 -94183
13187D6030J7689J06574M8355r5074K52384j35302i74C3022d8849A84318J74514
$$ 46030 63719 170293 218648 123574 375958 240656 -974 33022 -48849 184318 358832
13176C58832A62645J453L8309i9916A05259C4837K22221I8998O5571Q3754i0210
$$ 358832 162645 164098 202407 -99916 105259 34837 257058 98998 164569 248323 -90210
13164A30606F3311b37078D47038E6544c7836H9184M3580d8553j52761B88980i4343
$$ 130606 63311 -237078 447038 56544 -37836 89184 132764 -48553 -201314 288980 -94343
13152d7750B37811F0718J24866k4468m6509b1837p4304j82470a00411C9815r550
$$ -47750 237811 60718 185584 161116 114607 -21837 -96141 -278611 -100411 39815 30265
13141C0265J1284M24548A1511J01446J03101b03790A9214d3096J1692A9553R1780
$$ 30265 41549 466097 11511 112957 216058 -203790 19214 -43096 -31404 19553 111333
13130A11333J21161j08592L4377d9235B0614M42390A35214d2060j12013B20178
$$ 111333 232494 123902 158279 -49235 20614 463004 135214 -42060 -154073 220178
13119A16779E55d0777B36019b29846A6179K2082J4302c6498E05281a9683A99049
$$ 116779 555 -40777 236019 -229846 16179 38261 52563 -36498 505281 -19683 199049
13107C03397a78206B1983K06908b18774A26550O5580b3942B37273p4616J84982
$$ 303397 -178206 21983 228891 -218774 126550 192130 -23942 237273 162657 347639
13097C47639c1633j01857A25067i5602A19120a83980F5920a13199j43043C54427
$$ 347639 -31633 -133490 125067 -95602 119120 -183980 65920 -113199 -256242 354427
13086h8131c4989A70485J9736e5B2363D828a26619A3196b8722I6291L42819j18852
$$ -88131 -34989 170485 190221 -55 22363 4828 -126619 13196 -28722 96291 439110 320258
13074C20258I4365p509A042J145J68435q4953e5787A91056h1864n3103A95935
$$ 320258 94365 86856 1042 2187 170622 85669 -55787 191056 -81864 -134967 195935
13062D5738b42379B53609G1849a04064A69840k786d3503o4470d3385C74163c740
$$ 45738 -242379 253609 71849 -104064 169840 167054 -43503 -107973 -43385 374163 -3740
13050F8498b44225c656C8286L24361G6158K0088i0417A98777J11411j5085I38
$$ 68498 -244225 -3656 38286 362647 76158 96246 -90417 198777 310188 295103 938
13038A39868J11585B3033c2178B89784n8180q1235J05011I4350C2622K78427p2293
$$ 139868 251453 23033 -32178 289784 231604 150369 255380 94350 32622 311049 238756
13027B38756f3328B78979P397p2454m6718n7365Q2165g1351F4652M20169j99599
$$ 238756 -63328 278979 286376 213922 167204 109839 192004 -71351 64652 484821 285222
13016B85222P6892e6319B33316r7974n2960J9636L26h2445A90599a57363I4522
$$ 285222 362114 -56319 233316 135342 82382 102018 102344 -82445 190599 -157363 94522
13004A1916a79668C07588E8153k2528L32592J54966A70302Q847Q9089j24524h6281
$$ 11916 -179668 307588 58153 35625 368217 523183 170302 179149 268238 143714 -86281
12992A43024J83197b6748G7813a53515C47620h3704A97898H4038c76287A95123
$$ 143024 326221 -26748 77813 -153515 347620 -83704 197898 84038 -376287 195123
12981B70691H6965b9907n4518a4877k33412A39848h2173b6993p9842r1582F4356
$$ 270691 86965 -29907 -84425 -14877 -248289 139848 -82173 -26993 -106835 -198417 64356
12969i8814E2082f7351C57285H5182F270b23285G5078J77264P4635C4800b43725
$$ -98814 52082 -67351 357285 85182 6270 -223285 75078 252342 326977 34800 -243725
12957a13525e0726k23520g4971B56339R5472j13064A04420L1876Q5449a55401
$$ -113525 -50726 -274246 -74971 256339 351811 238747 104420 136296 221745 -155401
12946B2161a01272j07442c7792k25993A8068R7282P1008a7200B61328A01677K561
$$ 22161 -101272 -208714 -37792 -263785 18068 115350 186358 -17200 261328 101677 104238
12935A04238a57920D4577g433B39411a52998B323b11311g756A87890H838h677
$$ 104238 -157920 44577 -7433 239411 -152998 2323 -211311 -7756 187890 8838 -8677
12923A75385R3130p4000H7792f7389C89100a92357A20486i3765A37855L70754
$$ 175385 268515 194515 87792 -67389 389100 -192357 120486 -93765 137855 508609
12913E08609A34204c1152K505h529j12245b2332j95530a0805j27283B06842o0221
$$ 508609 134204 -31152 -28647 -8529 -120774 -22332 -217862 -10805 -138088 206842 146621
12902A46621D1550J37719A3278J25802K85760b7003A57109F0092a71310C35124
$$ 146621 41550 179269 13278 139080 424840 -27003 157109 60092 -171310 335124
12891B09604i244H6266c624r7566b754A21080a55419A02243g7034j791j87972
$$ 209604 -9244 86266 -3624 -101190 -2754 121080 -155419 102243 -77034 -78825 -266797
12880b66797A57637o7791A7285b27385e824B64541o2519e3274j543r0508K5239
$$ -266797 157637 89846 17285 -227385 -5824 264541 202022 -53274 -54817 -145325 -120086
12869a20086c2784j67984E3775K95497j05776m6347c08226J03034e6941B53032
$$ -120086 -32784 -200768 53775 349272 243496 197149 -308226 -205192 -56941 253032
12858A09116g7122A8429c33836G5521p279M7905a58248H8166J44652r6688a81397
$$ 109116 -77122 18429 -333836 75521 68242 116147 -158248 88166 232818 136130 -181397
12846B94299A29790R9558i9166d0280B50123k9482a39473A82687O2016c73443
$$ 294299 129790 229348 -99166 -40280 250123 220641 -139473 182687 244703 -373443
12835A30731A0023h728k57497D17536a50012A87947p7198l989a71444A48925g370
$$ 130731 10023 -8728 -266225 417536 -150012 187947 110749 106760 -171444 148925 -7370
12823b4108F4911a37508d1300C89216A33561b56259A68744a14152l23147i730
$$ -24108 64911 -137508 -41300 389216 133561 -256259 168744 -114152 -437299 -9730
12812G9469a54035G9950A6798J66345b65216B19734J6530j05531g8436E1005N28484
$$ 79469 -154035 79950 16798 183143 -265216 219734 236264 130733 -78436 51005 579489
12801E79489A44348a17556c7314j1114A56795n3974a05296L3185B48584a13125
$$ 579489 144348 -117556 -37314 -48428 156795 102821 -105296 -72111 248584 -113125
12790A64371n4835b60220I4069J88226a69204A04551J13011O9401A5578a29565
$$ 164371 109536 -260220 94069 282295 -169204 104551 217562 286963 15578 -129565
12779C49477d4424k07738A11193C6384g3499A98160P7996a2183A30849a11390
$$ 349477 -44424 -252162 111193 36384 -73499 198160 276156 -12183 130849 -111390
12768B30986r5368b94020a737j59500K575Q485p3468D56629A35457J72153j34625
$$ 230986 135618 -294020 -1737 -161237 -158662 -150177 -223645 456629 135457 307610 172985
12757A72985a45981k99074c0247A0863b26313A30744b27596l129C32703h2395
$$ 172985 -145981 -445055 -30247 10863 -226313 130744 -227596 -230725 332703 -82395
12746a50505b6444j20911B24196b68r5443D5474b1062r6865B52598b23289A58
$$ -150505 -26444 -147355 224196 -268 -95711 45474 -21062 -117927 252598 -223289 158
12734c7266r502j11508A3922L8079J15425o7955k907G308J96615J6680r2773J71275
$$ -37266 -46768 -158276 13922 52001 167426 99471 96564 7308 203923 220603 127830 299105
12722B99105j48782a36205A76031n9104c4667k53280J26888B08273a08444l0513
$$ 299105 150323 -136205 176031 116927 -34667 -287947 -161059 208273 -108444 -138957
12712a38957G6504d5636I7189f6772C99036I4243J81429a58894q0660G0005b2713
$$ -138957 76504 -45636 97189 -66772 399036 94243 275672 -158894 -239554 70005 -22713
12700A79790R7862e9510B06007i7592j40225A36564k3473m0083K5935D6400K012
$$ 179790 277652 -59510 206007 -97592 -237817 136564 113091 73008 98943 46400 48412
12689D8412O5211B2339b2840F8291n183J23186h3297B16828K6175E4576J97743
$$ 48412 113623 22339 -22840 68291 63108 186294 -83297 216828 243003 54576 252319
12678B52319J27840a04482B87131Q474J35532B11525O9196E5338b00279c500B40078
$$ 252319 380159 -104482 287131 295605 431137 211525 280721 55338 -200279 -3500 240078
12666A90723b24769B09466r9485M005o917L40940A16242a486j44403A69963C1039
$$ 190723 -224769 209466 109981 113986 107069 448009 116242 -1486 -145889 169963 31039
12654I2124b63360f8830r3478N0441D3270a01183M0515A69712K8342F3484C691
$$ 92124 -263360 -68830 -162308 -111867 43270 -101183 -60668 169712 198054 63484 3691
12642C55369c9531I3755J80212b3703H0641J37331R4035j36830K6716a40324f2451
$$ 355369 -39531 93755 273967 -23703 80641 217972 312007 175177 201893 -140324 -62451
12630B36474K14196a06259C55359M4092A42011n0647l7213J1226m213O5203A4410
$$ 236474 450670 -106259 355359 399451 142011 91364 54151 65377 61164 126367 14410
12618B31488j08042m8819h9545A17818b19508A13914Q2173D4831n757a01685R811
$$ 231488 123446 74627 -89545 117818 -219508 113914 196087 44831 39074 -101685 -91874
12607i1874K0804B844J34486a07613C59241a0566k5254B13338O7525a44849B63572
$$ -91874 -71070 2844 137330 -107613 359241 -10566 -35820 213338 280863 -144849 263572
12595C63027b203C48761A67606C2856b10541B71630d41697E1180O2138g1580H8942
$$ 363027 -2203 348761 167606 32856 -210541 271630 -441697 51180 113318 -71580 88942
12583b21199A84975o9121L5016a6586H912a89007A08676J28823E844J71595B6725
$$ -221199 184975 115854 150870 -16586 8912 -189007 108676 237499 5844 177439 26725
12571C81130A47445J23981m3326k1384r2715i4443A56782n9609a13208j58848
$$ 381130 147445 271426 228100 206716 114001 -94443 156782 97173 -113208 -272056
12561b72056J05902f2883l35971g3739D7517h54A26308a69804b2586C17909a18221
$$ -272056 -166154 -62883 -398854 -73739 47517 -854 126308 -169804 -22586 317909 -118221
12549E2255c33623C49874a32597j54997C41968b50035a22822C68510D5899K1768
$$ 52255 -333623 349874 -132597 -287594 341968 -250035 -122822 368510 45899 67667
12539F7667b36168F0217K9355a40561A90927a61871D27297c514A29423J02076
$$ 67667 -236168 60217 89572 -140561 190927 -161871 427297 -3514 129423 231499
12529B31499a78223A243e3168B61922M3778j33151K0862d7104B11698F1062a19801
$$ 231499 -178223 1243 -53168 261922 305700 172549 193411 -47104 211698 61062 -119801
12517A58108a08137H6796K23735A35294c8071i104j49557n3667A13555J01941
$$ 158108 -108137 86796 310531 135294 -38071 -9104 -158661 -212328 113555 215496
12507B15496R1010b09226b6137k07482J3129B17461A088c3778D4370K48051f3239
$$ 215496 306506 -209226 -26137 -233619 -220490 217461 1088 -33778 44370 292421 -63239
12495a2754C73827a29597G1943K0303e1427A2813J05594F599J23088b8170j6873
$$ -12754 373827 -129597 71943 92246 -51427 12813 118407 6599 129687 -28170 -45043
12484d5043J0617l87640i1538B83541c62797a58202g6644j52373f349A60563C0612
$$ -45043 -34426 -422066 -91538 283541 -362797 -158202 -76644 -229017 -6349 160563 30612
12472h677C3011J3051L5643b08957a6708j58730B3977K45940r9591a06737r9829
$$ -8677 33011 46062 81705 -208957 -16708 -175438 23977 269917 170326 -106737 -206566
12461b06566i9080K3540K7202a6971l08220A65038a82785f8122n7568C2550a58632
$$ -206566 -99080 -75540 -48338 -16971 -325191 165038 -182785 -68122 -125690 32550 -158632
12449A82721j6555J06497d5794l29100F8766A8828b83453a1261l5183p4712G2448
$$ 182721 166166 272663 -45794 -374894 68766 18828 -283453 -11261 -46444 -121156 72448
12437i510P13k27854f6581C303J03177g6871C1110M4437O9133c62626h6895n7164
$$ -9510 -8797 -236651 -66581 3303 106480 -76871 31110 75547 144680 -362626 -86895 -144059
12425a44059C5258L46415h0827j24786B66175g5171b628q0106B4807P0659a61552
$$ -144059 35258 381673 -80827 -205613 266175 -75171 -2628 -82734 24807 95466 -161552
12413B16907i5780G5504a26264D55225F3728J30894l4418g7411l54184C5795a53563
$$ 216907 -95780 75504 -126264 455225 63728 194622 160204 -77411 -431595 35795 -153563
12401b19672k5859E5432c7273l7939j39810H1731J56142h5865j22301M8437B09073
$$ -219672 -245531 55432 -37273 -75212 -215022 81731 237873 -85865 -208166 -159729 209073
12389C20166D2281a13061L4950m2494I479a44529C63835I4648a11349e452m7544
$$ 320166 42281 -113061 -78111 -120605 9479 -144529 363835 94648 -111349 -5452 -52996
12378e2996j05195L6131a7669C763J17985k9407J16732a631k51965A30597l9297
$$ -52996 -158191 -122060 -17669 3763 121748 92341 209073 -1631 -253596 130597 91300
12367I1300G914R6715h8634k8660E4100J84731g5489k30474c7427C3383J12766
$$ 91300 7914 104629 -88634 -117294 54100 238831 -75489 -305963 -37427 33383 146149
12356A46149a32557r8074g0419E6712d5003o7238A76943P6671a55536B65296C7097
$$ 146149 -132557 -230631 -70419 56712 -45003 -112241 176943 253614 -155536 265296 37097
12344c47431g7014J2904j27058A69391b18993J00722d790o8687l7370A69382K24302
$$ -347431 -77014 -64110 -191168 169391 -218993 -118271 -4790 -73477 -110847 169382 393684
12333C93684A01396K09829b82634J17446b7146A20928a622q8717B3888a41919
$$ 393684 101396 311225 -282634 -165188 -27146 120928 -1622 -90339 23888 -141919
12322A49876k9883a99115A17080J14602c23802a8630o935g317H7770L410G712
$$ 149876 119993 -199115 117080 231682 -323802 -18630 -25565 -7317 87770 91180 7712
12310a24643L6134I7881D8643a66791C85736f3240A81057D6240J17404B6389J00440
$$ -124643 -88509 97881 48643 -166791 385736 -63240 181057 46240 163644 26389 126829
12299A26829g5950j71547A95302M4222F4259l0399k321J67049b0356k7404F3147
$$ 126829 -75950 -247497 195302 239524 64259 33860 31539 198588 -20356 -47760 63147
12287c5078k1113b3921B5764J62571G0186a6637j03942A70319K72696a33264C76584
$$ -35078 -56191 -23921 25764 188335 70186 -16637 -120579 170319 443015 -133264 376584
12275d5367r6068B88490q6460L6678g7136b7864C77088c270A76349a40094G7297
$$ -45367 -141435 288490 202030 238708 -77136 -27864 377088 -3270 176349 -140094 77297
12263D18650j28170a48202A86265n5063j818n3247e9099D375K71339J7865a29965
$$ 418650 290480 -148202 186265 131202 129384 76137 -59099 4375 275714 293579 -129965
12251B27432p8993J4288K66146g0266E9837K83823A55526a14864G6544J38784
$$ 227432 148439 162727 428873 -70266 59837 343660 155526 -114864 76544 215328
12241B15328d9705k5966C54917a70149k6165e145C38702A42282c1762C4221J7420
$$ 215328 -49705 -75671 354917 -170149 -196314 -5145 338702 142282 -31762 34221 51641
12230E1641J43926J45834j29795e5532J8525B39295J33273D1118M3167J80721
$$ 51641 195567 341401 211606 -55532 -37007 239295 372568 41118 84285 265006
12220B65006q2987H6223B4439O0290P9959B2256a61728A65461o1505K6240J01253
$$ 265006 182019 86223 24439 84729 164688 22256 -161728 165461 103956 130196 231449
12209B31449b34083B39325P0086a29005B17428C8438J5011B0688R2637J58912
$$ 231449 -234083 239325 309411 -129005 217428 38438 53449 20688 113325 272237
12199B72237Q9696B9374R6014D0923J82573N3459j32721b55910D7009a2566k5394
$$ 272237 361933 29374 125388 40923 223496 276955 144234 -255910 47009 -12566 -37960
12188c7960n7791r0850A06077J94221i2140C27879K5498A55978G3545K90875c890
$$ -37960 -95751 -186601 106077 300298 -92140 327879 353377 155978 73545 364420 -3890
12176H3385g6248p1530A93333r0215a40416f1337B46988O7713j50377A269K23416
$$ 83385 -76248 -147778 193333 103118 -140416 -61337 246988 314701 164324 1269 224685
12165B24685A0483L29046d4315A40778c122k5157j00416D0150K90018O9557c49293
$$ 224685 10483 339529 -44315 140778 -3122 -28279 -128695 40150 330168 399725 -349293
12153a24544m9213B4560J49945I389L19338e0662k295f283A91594e3836D8952
$$ -124544 -173757 24560 174505 9389 328727 -50662 -52957 -6283 191594 -53836 48952
12141b78158H1965K31817a2265A31521e5191r342k7480I543a43110A44303J80928
$$ -278158 81965 313782 -12265 131521 -55191 -64533 -92013 9543 -143110 144303 325231
12130C25231c60589J08911C53931e9951n2439m39350f1691B27403q5937a6528
$$ 325231 -360589 -251678 353931 -59951 -112390 -551740 -61691 227403 141466 -16528
12119a26327A34041d6215g259D35584a15464A93779b14559b4126G347a95013I7177
$$ -126327 134041 -46215 -7259 435584 -115464 193779 -214559 -24126 7347 -195013 97177
12107h6168k43090J02328g3067j67453Q7251l4850m3347I3236A3317a06309n3915
$$ -86168 -329258 -226930 -73067 -240520 -153269 -188119 -231466 93236 13317 -106309 -160224
12096a60224A5347J12732c17972B75573f6634h861B78114A2545b33427C6082L1713
$$ -160224 15347 128079 -317972 275573 -66634 -8861 278114 12545 -233427 36082 67795
12085F7795b00001A05059g1953A48999l6549O6502G9474A0736J48885h24j46453
$$ 67795 -200001 105059 -71953 148999 112450 178952 79474 10736 159621 -824 -147277
12074a47277A95683a71544C09669a8778A027759P21896p61058C70163i1597K1889
$$ -147277 195683 -171544 309669 -18778 1027759 1749655 988597 370163 -91597 -69708
12064f9708C57361j74907D715O370a39483C8588f9711q0396c6464B9969J45460
$$ -69708 357361 182454 4715 11085 -139483 38588 -69711 -150107 -36464 29969 175429
12053A75429a65428L3264A45055f3418A15553A9645h702k18112H1820a38607A47899
$$ 175429 -165428 -132164 145055 -63418 115553 19645 -8702 -226814 81820 -138607 147899
12041A35053B2191d7182a2310j92365j1678A43736K8591b87493A49307a7533B52819
$$ 135053 22191 -47182 -12310 -204675 -216353 143736 172327 -287493 149307 -17533 252819
12029B41795j08044m6430J3258a85195C4116L3156a85014A91974a39016j06898
$$ 241795 133751 87321 100579 -185195 34116 67272 -185014 191974 -139016 -245914
12019b45914a15845Q45b3763A35718a09209A143h3248A90224q4994b63091p8163
$$ -245914 -115845 -115000 -23763 135718 -109209 1143 -83248 190224 105230 -263091 -341254
12008c41254J44222B12993J53952a57293G4175m385J16148D2777e971o9736A36436
$$ -341254 -197032 212993 366945 -157293 74175 69790 185938 42777 -5971 -75707 136436
11996h4116j30258A25422C1847g8172F4489i996l0826l922G9366f6114n821A381
$$ -84116 -214374 125422 31847 -78172 64489 -9996 -40822 -44744 79366 -66114 -71935 1381
11983b19702A92680P5599H414O5530R5672K40572D3922i2804b0004l42947a24648
$$ -219702 192680 268279 8414 73944 169616 410188 43922 -92804 -20004 -362951 -124648
11971a05402p6909C71419i2602n5497G5539h4328E464K02798p9447L6357k1507
$$ -105402 -182311 371419 -92602 -148099 75539 -84328 5464 208262 128815 165172 143665
11960A43665i0777b2115B26112E1302i6167J5319E7315j5320H451J11043c39124
$$ 143665 -90777 -22115 226112 51302 -96167 -80848 57315 41995 8451 119494 -339124
11948A13532K8512e6957H1541a49286A9455Q4764g8974A20512a52354O5579A3586
$$ 113532 142044 -56957 81541 -149286 19455 104219 -78974 120512 -152354 -86775 13586
11936a98309B19854a64078O7071H9477J82545C0299O3698h79A11814D0674Q9882
$$ -198309 219854 -164078 -97007 89477 272022 30299 93997 -879 111814 40674 130556
11925A30556f2302d472j16993k45788H9458B1260L5405J09152k8893F6692K5661
$$ 130556 -62302 -4472 -121465 -367253 89458 21260 56665 165817 136924 66692 92353
11914I2353J85992E1361i6225j72386A74093a54378M4566A39750n8083h0332A20954
$$ 92353 278345 51361 -96225 -268611 174093 -154378 -109812 139750 81667 -80332 120954
11902B86115K3789a86259c3942A72267e1682j48957m0314e8795a1085E9881J7456
$$ 286115 309904 -186259 -33942 172267 -51682 -200639 -240953 -58795 -11085 59881 77337
11891G7337d0004l0633j41804d7505j3054l11543D4405L54998i4758A32121a49465
$$ 77337 -40004 -70637 -212441 -47505 -60559 -372102 44405 399403 -94758 132121 -149465
11879a93455g0232A3625a2839B566J48146C1431b30790j8951i8948J0257j44177
$$ -193455 -70232 13625 -12839 2566 150712 31431 -230790 -249741 -98948 -88691 -232868
11868b32868f0968r6977r5568b4261j5432k30050a00913k21757E4091d7089A89275
$$ -232868 -60968 -157945 -253513 -24261 -39693 -269743 -100913 -322670 54091 -47089 189275
11856a45087I5200J2286i6719B38749d25199C22939G9837A0744L57907A61201
$$ -145087 95200 107486 -96719 238749 -425199 322939 79837 10744 368651 161201
11845D0650a54047j38215F2772J96758H8164M819a00244C0709a57404j38780d0788
$$ 40650 -154047 -292262 62772 259530 88164 92983 -100244 30709 -157404 -296184 -40788
11833H8875c7176j79748f5580k6983k45317A85247h9118n1932d0507B41053d7303
$$ 88875 -37176 -216924 -65580 -92563 -337880 185247 -89118 -141050 -40507 241053 -47303
11821b4009j12848A65094C7428L8232c9336A77215d2085A4930a45990P2927D080
$$ -24009 -136857 165094 37428 75660 -39336 177215 -42085 14930 -145990 -73063 4080
11809A37427a26438D945e0701k8700j05033b4491B27546o7342k059B0812R8195
$$ 137427 -126438 4945 -50701 -79401 -184434 -24491 227546 160204 158145 20812 119007
11798A19007j0710c5494j80612N3872o1669c0823J0020d097j50483A27790b27915
$$ 119007 108297 -35494 -216106 -162234 -223903 -30823 -20803 -4097 -154580 127790 -227915
11786A56172K06847A00444m349h0377L254o9795A84553c22748Q6721B76887a75959
$$ 156172 363019 100444 96095 -80377 -77123 -146918 184553 -322748 -236027 276887 -175959
11774a63001c8117j14598k8370A07466g6441A34025F2251a49372A93522c0668
$$ -163001 -38117 -152715 -181085 107466 -76441 134025 62251 -149372 193522 -30668
11763A60284c54408R4134a23381m4446Q1912A85215a85486f088j23377k5633d5495
$$ 160284 -354408 -260274 -123381 -167827 -85915 185215 -185486 -6088 -129465 -155098 -45495
11751a46752M9635A26958J5886L3913C4571b12644e6551j96972M5566N4074M6443
$$ -146752 -97117 126958 142844 176757 34571 -212644 -56551 -253523 -207957 -153883 -107440
11740a07440B0545Q3848i9268j95967B22838c81461J16499F7827N5326b34092
$$ -107440 20545 104393 -99268 -295235 222838 -381461 -264962 67827 123153 -234092
11729C49956r8946A07622b10897H6812l8609B0988K13421K5381b87338C1288J19400
$$ 349956 251010 107622 -210897 86812 48203 20988 234409 259790 -287338 31288 150688
11718A50688P5540c9018j78694a1318j68135H2401a39750B18507P8341E0002J9073
$$ 150688 226228 -39018 -217712 -11318 -179453 82401 -139750 218507 296848 50002 69075
11707F9075a52511F1835a49454b4141P547k65976B47303A8258i0552A97081J31997
$$ 69075 -152511 61835 -149454 -24141 -16594 -282570 247303 18258 -90552 197081 329078
11696C29078e32j92126g6360A03406l018J65832d2348A91791b25607C29394F3920
$$ 329078 -532 -192658 -76360 103406 100388 266220 -42348 191791 -225607 329394 63920
11684D56038e5252m0316C32830b8933D4838d00155a40074f2564A62708R9266F6182
$$ 456038 -55252 -95568 332830 -28933 44838 -400155 -140074 -62564 162708 261974 66182
11672C46897a71005G824c1951A69999E5080K21934A36347F7078i2445A62380G4578
$$ 346897 -171005 7824 -31951 169999 55080 277014 136347 67078 -92445 162380 74578
11660D54392j47490b86664I5778d5906a6179F2527N9210K5852L9539a56143F8614
$$ 454392 306902 -286664 95778 -45906 -16179 62527 121737 147589 187128 -156143 68614
11648B57490l4297o1239F9253a41661E4411d304r6513I9427L2667b0308k3769
$$ 257490 223193 161954 69253 -141661 54411 -4304 -100817 99427 132094 -20308 -44077
11637d4077k51757Q2645E5358g9774B12230a39656F0611M423g1316j7479A46052
$$ -44077 -295834 -213189 55358 -79774 212230 -139656 60611 65034 -71316 -88795 146052
11625B00289f8380A15847a4840o1062n5600H7441m1411q953b64215C6373K4503
$$ 200289 -68380 115847 -14840 -75902 -131502 87441 46030 37077 -264215 36373 60876
11614F0876a2427l27443a12846A8361P0992a37031o4771A14353c3216C1138J36318
$$ 60876 -12427 -339870 -112846 18361 89353 -137031 -201802 114353 -33216 31138 167456
11603A67456b2043A07086l5844a96896I5206K24173j15550k5410G0734L97964
$$ 167456 -22043 107086 71242 -196896 95206 319379 203829 178419 70734 468698
11593D68698C200J47399a4759j16664C83959c2825B32711a625C68231n858a67151
$$ 468698 3200 150599 -14759 -131423 383959 -32825 232711 -1625 368231 362373 -167151
11581a72888p6512D0805K8081M3331l1254J29943A3712O6658a34439k38905D24759
$$ -172888 -249400 40805 68886 112217 80963 210906 13712 80370 -134439 -373344 424759
11569A98970a69109a4771H5239J2200K4000c6364N24A5068N1646J64557f7711
$$ 198970 -169109 -14771 85239 97439 121439 -36364 -35840 15068 66714 231271 -67711
11557a2534A79466c65321f6780b441P24D3162Q6809J3055J8298J26915E8100c4757
$$ -12534 179466 -365321 -66780 -2441 -1717 43162 129971 143026 161324 288239 58100 -34757
11544H2374Q4477J1326P6689e6251G1894k3707K00883j7008K10728C975h6739
$$ 82374 166851 178177 254866 -56251 71894 48187 249070 232062 442790 3975 -86739
11532D05512a64034A46201J690b90204B91850J07163A16590L66428A50536K9273
$$ 405512 -164034 146201 147891 -290204 291850 399013 116590 483018 150536 179809
11522A79809K19790C0552e0796D41718i127j07962A69391a2360o0872B05570J40545
$$ 179809 399599 30552 -50796 441718 -9127 -117089 169391 -12360 -73232 205570 346115
11511C46115b19848D3233J09804o8274K9488K27250D5594L03459a67241B39881
$$ 346115 -219848 43233 153037 84763 114251 341501 45594 349053 -167241 239881
11500c8758a2745A36735M5624J1692a40336E1586J46634l0534J52867A10532d0737
$$ -38758 -12745 136735 182359 194051 -140336 51586 198220 167686 320553 110532 -40737
11488B19312E9926l480M23778k05244a32187A4131f990j11272C2103M53538a68562
$$ 219312 59926 56446 480224 274980 -132187 14131 -6990 -118262 32103 485641 -168562
11476G4830c4270A74132b0812C9878K73659a36087E5428K96334j35696J1012l1016
$$ 74830 -34270 174132 -20812 39878 313537 -136087 55428 351762 216066 227078 196062
11465A96062r126a1273F7158j0002R8522l8852O9732n2357d0462A36972a6080
$$ 196062 186936 -11273 67158 57156 155678 116826 186558 134201 -40462 136972 -16080
11453f5941B42366G1465J4556b55656B52015I9907h6454E9366k227K09695c3524
$$ -65941 242366 71465 86021 -255656 252015 99907 -86454 59366 57139 266834 -33524
11441d3466A17579j7653J58356B0395K67142j23553J09973K9521f9827b1676G2315
$$ -43466 117579 99926 258282 20395 287537 163984 273957 303478 -69827 -21676 72315
11429a63540j1303B13789o3056Q657b488G8014a80127N6247j41499C1906J9792
$$ -163540 -174843 213789 150733 159390 -2488 78014 -180127 -123880 -265379 31906 51698
11418E1698b44697M4982c6729i966n0530D5535n912N4242K98729i48A11247J01148
$$ 51698 -244697 -199715 -36729 -9966 -60496 45535 39623 93865 392594 -948 111247 212395
11406B12395D7101K8876J78849p5801a49130r2282q0676A22885M0834J7520C124
$$ 212395 47101 75977 254826 179025 -149130 -241412 -322088 122885 163719 181239 3124
11394b31553A11321k8386a95988A02177g4395j22814A18498C2698L21380a30881
$$ -231553 111321 82935 -195988 102177 -74395 -197209 118498 32698 354078 -130881
11383a03171j56304B38151H3147b15850C4756N573d3518k4997E4162i4762B52866
$$ -103171 -259475 238151 83147 -215850 34756 40329 -43518 -68515 54162 -94762 252866
11371a6549l0408j5802A12736r002a11043q9038A10122h7093A53398J8412J33314
$$ -16549 -46957 -62759 112736 103734 -111043 -200081 110122 -87093 153398 171810 305124
11360C05124E4421a12607A55802c51702g0527B59023A9295R0690m6205c24608
$$ 305124 54421 -112607 155802 -351702 -70527 259023 19295 109985 63780 -324608
11349b25828A1730O7438J38805C2261g4059j7118q5818B9850c8778o2656k9926
$$ -225828 11730 79168 217973 32261 -74059 -91177 -176995 29850 -38778 -101434 -131360
11338a31360B50719F974c8804k89330C9463j1819d17282i4466A09306b53923q5254
$$ -131360 250719 6974 -38804 -328134 39463 27644 -417282 -94466 109306 -253923 -339177
11327c39177C7820N6261Q2923a03485j40310A01811a9815E084J57419J59047a93556
$$ -339177 37820 94081 177004 -103485 -243795 101811 -19815 5084 162503 321550 -193556
11315a00612A69743d85849A1942d3819q1035B52355o0480c7478r034l9429b9347
$$ -100612 169743 -485849 11942 -43819 -124854 252355 191875 -37478 -46512 -85941 -29347
11303e2405j61630A55876B1851b86322h9548c1337j57432l7104B70974c09660
$$ -52405 -214035 155876 21851 -286322 -89548 -31337 -188769 -225873 270974 -309660
11292g2488A28881C5413h8420C54765h762j18702D0913A6108e0428k06186M7669
$$ -72488 128881 35413 -88420 354765 -8762 -127464 40913 16108 -50428 -256614 -208945
11281b08945A28163C7004a41202G5000h1971b0799C7223c63292a102j9751A00542
$$ -208945 128163 37004 -141202 75000 -81971 -20799 37223 -363292 -1102 -20853 100542
11269B59358a0863m1601j69027d5411j98615j05982h8019j35239c5251H7730B6575
$$ 259358 -10863 -52464 -221491 -45411 -244026 -350008 -88019 -223258 -35251 87730 26575
11257b93242A77062R3201B9983K3261h3047k31044a49468n4720a3665k01269A89107
$$ -293242 177062 270263 29983 53244 -83047 -314091 -149468 -204188 -13665 -214934 189107
11245d3263j14235P7403j57347e2097b5190m5881j00183c405r186l41798B59702
$$ -43263 -157498 -80095 -237442 -52097 -25190 -71071 -171254 -3405 -12591 -354389 259702
11233A4010K58814a42628B5688c4558A50864m2350g7970j00009C7566i14q1313
$$ 14010 272824 -142628 25688 -34558 150864 108514 -77970 -177979 37566 -914 -82227
11222h2227e317A8204d6873M009n7752J9779C3640g3051H0418c29649A97192b0906
$$ -82227 -5317 18204 -46873 -42864 -100616 -80837 33640 -73051 80418 -329649 197192 -20906
11209a14781A17423l1522H947K6568b1893A48095K4330c7796k13299A00041i6895
$$ -114781 117423 85901 8947 35515 -21893 148095 172425 -37796 -251095 100041 -96895
11197d3069j46581D0871g9208I5942J60169j10383N5990c8873o2905G153J0979
$$ -43069 -189650 40871 -79208 95942 256111 145728 201718 -38873 -101778 7153 18132
11186A8132J3720b0943p1448A05031E1720a11197p989A21328J56500b54557j36741
$$ 18132 31852 -20943 -92391 105031 51720 -111197 -119186 121328 277828 -254557 -391298
11175c91298d0132l35258E0997a7460B9922J92112E150M7551a09399A22015c0147
$$ -391298 -40132 -375390 50997 -17460 29922 222034 5150 52701 -109399 122015 -30147
11163C44753a44954A76355A7471J89318c570r7732k2114A57477F3438O4717D4277
$$ 344753 -144954 176355 17471 206789 -3570 -101302 -123416 157477 63438 128155 44277
11151a76872l79943d4502A04652A5271a38446B1213f6082j16746c9246j15512
$$ -176872 -556815 -44502 104652 15271 -138446 21213 -66082 -182828 -39246 -154758
11141a54758A2290a0786B28950b18529A09804P4004a7316A31883a49224q2174
$$ -154758 12290 -10786 228950 -218529 109804 183808 -17316 131883 -149224 -231398
11131b31398G564a01633j7221L1701B52330q4490a46028A07654J71663b68491
$$ -231398 7564 -101633 -118854 -87153 252330 167840 -146028 107654 279317 -268491
11120i0667c3181j06813A85752C3776b5058B35971b48160A78128p5357L56600
$$ -90667 -33181 -139994 185752 33776 -25058 235971 -248160 178128 102771 459371
11110D59371A74696m8594c24874c9466F075J43968M3341c7321B9312Q0255J71362
$$ 459371 174696 126102 -324874 -39466 6075 150043 193384 -37321 29312 109567 280929
11099B80929A4742J19785j2488J21555F7095N8372K03916j33437L35715p4583
$$ 280929 14742 134527 122039 243594 67095 125467 329383 195946 531661 457078
11089D57078j52305l9996G7609K43395g1183E15571j17536j12499J77031J48299
$$ 457078 304773 264777 77609 321004 -71183 515571 398035 285536 462567 610866
11079F10866A67433J47990j06381q3038Q5829Q7030J44176J07897k05146I9064
$$ 610866 167433 315423 209042 126004 211833 298863 443039 550936 345790 99064
11068A31144K25475m2195I0728M51305J9067M2397m7333j24184M3711n5285J35567
$$ 131144 356619 314424 90728 542033 561100 603497 556164 431980 475691 420406 555973
11057E55973B31659K42895M4736p0763K07425L1355l18841J98659L88079j27615
$$ 555973 231659 474554 519290 448527 655952 687307 368466 567125 955204 827589
11047H27589r5047L0523j41920L62815N5368m2118j95031K4470j69006J25866
$$ 827589 732542 763065 621145 983960 1039328 997210 802179 826649 657643 783509
11037G83509k0409k58800J03280J09286l24795K50930j70867K19572J34606K55223
$$ 783509 763100 504300 607580 716866 392071 643001 472134 691706 826312 1081535
11027A081535n35828N86580k04062D07966J66271J3664j47092L07743j01626J87255
$$ 1081535 545707 1132287 928225 407966 574237 587901 440809 748552 646926 834181
11017H34181j72358l18236L26662j87465M6479k01406J41451N3349J31691B25786
$$ 834181 661823 343587 670249 482784 529263 327857 469308 522657 654348 225786
11006D48811L3995J06644J51177l0228j36655L03313l16676K49114L26897k78017
$$ 448811 482806 589450 740627 710399 573744 877057 560381 809495 1136392 858375
10996H58375j12939j69401j6932L11158k10789L93232k11458k14457L94721k27761
$$ 858375 745436 576035 559103 870261 659472 1052704 841246 626789 1021510 793749
10986G93749m9837K09054R3614K67524l80514J96305K01395K71857J14662N5671
$$ 793749 743912 952966 1046580 1314104 933590 1129895 1331290 1603147 1717809 1773480
10976A773480N09368K7298K76383K96213K45930n7249l2469k75338m88036M6142
$$ 1773480 2282848 2310146 2586529 2882742 3128672 3071423 3038954 2763616 2275580 2321722
10966B321722o03995L8321J26276L56944l42566q9717j42424P7177J2043j80047
$$ 2321722 1717727 1756048 1882324 2239268 1896702 1806985 1664561 1741738 1753781 1573734
10956A573734M03553n28588M5822N096n36427J42272j44252r2977l96073k19850
$$ 1573734 1977287 1448699 1494521 1499617 963190 1105462 961210 868233 472160 252310
10946B52310M97573l23276j3801a4102j04291C46123j57921J7814J49404A29476
$$ 252310 749883 426607 412806 -14102 -118393 346123 188202 206016 355420 129476
10935e7877C70452J45465A39049O8958H1409e0292A22925J77153E7124N2074i0246
$$ -57877 370452 515917 139049 208007 81409 -50292 122925 300078 57124 109198 -90246
10923B08858g3292B51335n6586b8015n8869H9359i432B67733E6625B5473d8816
$$ 208858 -73292 251335 194749 -28015 -86884 89359 -9432 267733 56625 25473 -48816
10911A84843f0545k06030K3839D0277N8723B7585c10920F6405g0551p6395c5316
$$ 184843 -60545 -266575 -242736 40277 99000 27585 -310920 66405 -70551 -146946 -35316
10899A2765L618b33118M5487e6327A35826a59917M7631B87943d1234r98k31176
$$ 12765 16383 -233118 -187631 -56327 135826 -159917 -112286 287943 -41234 -42232 -273408
10888b73408E2564g1991A0791b04776i9401f997n0177K3387A83220d0883j52284
$$ -273408 52564 -71991 10791 -204776 -99401 -6997 -57174 -33787 183220 -40883 -193167
10877a93167e0274B77687a73466f5663A52093b16012A3238a41741L3600H304c05077
$$ -193167 -50274 277687 -173466 -65663 152093 -216012 13238 -141741 -108141 8304 -305077
10865I3096D2781R3074a73887c6128j84111O9940J6510B17451C730L5277d0727
$$ 93096 42781 135855 -173887 -36128 -220239 -150299 -133789 217451 3730 39007 -40727
10853f8134k2854M4854k2577B04822d4426C1662c31610A03379m8491g1732I9516
$$ -68134 -90988 -46134 -68711 204822 -44426 31662 -331610 103379 54888 -71732 99516
10841D3214P9235d5216A3487a6636H5611K25353i8451C33449a15341L5716a055
$$ 43214 122449 -45216 13487 -16636 85611 310964 -98451 333449 -115341 -79625 -1055
10829E5503c3452D9990c96683A24519K22627b15296c242b34k87170A20879N8773
$$ 55503 -33452 49990 -396683 124519 347146 -215296 -3242 -234 -287404 120879 179652
10818A79652e4192j51991A16658c24476D4690K14708d8910j27045A59685F5623
$$ 179652 -54192 -206183 116658 -324476 44690 259398 -48910 -175955 159685 65623
10807a01224r8818H83O6828b45351D645g5206A98023J05625q2891m4845j0667
$$ -101224 -200042 883 67711 -245351 4645 -75206 198023 303648 220757 175912 165245
10796A65245a60632c0848H2131J20921I226J25626m3381d9659E55068I3885J05108
$$ 165245 -160632 -30848 82131 203052 9226 134852 91471 -49659 555068 93885 198993
10785A98993a08893H1128c31908J17131I0994O1122a18218j2476A10003a74176
$$ 198993 -108893 81128 -331908 -214777 90994 152116 -118218 -130694 110003 -174176
10774A50845D1249J6564Q6631N0512M3627j12340a94300J6870A0752a87481C27972
$$ 150845 41249 57813 144444 194956 238583 126243 -194300 -177430 10752 -187481 327972
10762B03538A9226d21206J8653J80320A36646a17376D8597c0006A04007D5166
$$ 203538 19226 -421206 -402553 -222233 136646 -117376 48597 -30006 104007 45166
10751G0292a87087A13732B3129R3394B4549N1227a27183A65272G1928a59149r0720
$$ 70292 -187087 113732 23129 116523 24549 75776 -127183 165272 71928 -159149 -249869
10740b49869B17585c78142k31008a53657k3054H523b48951i3345m0515j22994
$$ -249869 217585 -378142 -609150 -153657 -176711 8523 -248951 -93345 -133860 -256854
10730b56854A17546o638L0796C4808c48670e9794n0376j771B38236a77091C76184
$$ -256854 117546 110908 141704 34808 -348670 -59794 -110170 -111941 238236 -177091 376184
10718h7632A70752h6816k65037B40192b42809A75054a76201p9862N8018Q0617
$$ -87632 170752 -86816 -351853 240192 -242809 175054 -176201 -256063 -198045 -117428
10708a17428H3502A9193K33956A7491b90661f8072p7130r6956R6510d0570j05880
$$ -117428 83502 19193 253149 17491 -290661 -68072 -145202 -242158 -145648 -40570 -146450
10697a46450D059c30983J33046G5445n671k6814R7896a09478k09194F2752K8316
$$ -146450 4059 -330983 -197937 75445 69774 42960 140856 -109478 -318672 62752 91068
10686I1068B7283d2398r3843a2376l8166Q957j925B34380i0284D15139I2110b4803
$$ 91068 27283 -42398 -136241 -12376 -50542 -41585 -43510 234380 -90284 415139 92110 -24803
10673A99577f4309A69126b49340f9406D2332J69331a80346a2794l81365c4561
$$ 199577 -64309 169126 -249340 -69406 42332 211663 -180346 -12794 -394159 -34561
10662a66342p1116A31393D0602J70612a98282R5109D4628a05999c8926j65741
$$ -166342 -237458 131393 40602 211214 -198282 -103173 44628 -105999 -38926 -204667
10652b04667A7289b28912E4500J63245J49190h6028b5152j08198j17713j65477
$$ -204667 17289 -228912 54500 217745 366935 -86028 -25152 -133350 -251063 -416540
10642d16540a97209A22529n1257K33204p3440n3899J29042A52972a31742p0937
$$ -416540 -197209 122529 71272 304476 231036 177137 306179 152972 -131742 -202679
10632b02679L4080b7453j43165j08130b1007l90634J75221q4169H1196M8093b22299
$$ -202679 -168599 -27453 -170618 -278748 -21007 -411641 -236420 -320589 81196 129289 -222299
10620a70376A61492n4452a72571h4326A01044C5473f5109A2772a65492B9934b69514
$$ -170376 161492 107040 -172571 -84326 101044 35473 -65109 12772 -165492 29934 -269514
10608B56990c9824j31334j1380K2045b3752H8374J36406c05497J27432e6439C64461
$$ 256990 -39824 -171158 -182538 -160493 -23752 88374 224780 -305497 -178065 -56439 364461
10596d2776D3210a45020A18887I479h9189G675b40917A1664d8204G3815a44A76170
$$ -42776 43210 -145020 118887 9479 -89189 7675 -240917 11664 -48204 73815 -144 176170
10583A11340m2150d55691B41624O524h0367j83176h3034D10558g3002L3371A35602
$$ 111340 69190 -455691 241624 248148 -80367 -263543 -83034 410558 -73002 -39631 135602
10571b5930B32502a32981A2926e0137k21704a21716H7017a81865n1743P8945E9221
$$ -25930 232502 -132981 12926 -50137 -271841 -121716 87017 -181865 -233608 -154663 59221
10559A47947p2662B7158P6811m0899b201I446M6996d4598A46046a97675k24298
$$ 147947 75285 27158 103969 63070 -2201 9446 56442 -44598 146046 -197675 -421973
10548d21973J99526i5095A2373d3389m9908m21478A09388a14140e4873J156D7072
$$ -421973 -222447 -95095 12373 -43389 -93297 -514775 109388 -114140 -54873 -53717 47072
10536b13180i7706d2642B35501O2270H1945R9055D7156a61393B56600G7589a71206
$$ -213180 -97706 -42642 235501 297771 81945 181000 47156 -161393 256600 77589 -171206
10524B37458l6813i045n430N512C04588a4506j967B22565J00842h668C2472r698
$$ 237458 200645 -9045 -14475 -8963 304588 -14506 -16473 222565 323407 -8668 32472 22774
10512B2774J02758G020a64567b4234M340o5853A20841a49559N2451d4928j79338
$$ 22774 125532 7020 -164567 -24234 -19894 -85747 120841 -149559 -97108 -44928 -224266
10501b24266p5504D8901g8889n6701B98251c19591d9753m3162A6927J9581b13253
$$ -224266 -299770 48901 -78889 -135590 298251 -319591 -49753 -92915 16927 36508 -213253
10489a64185C62704c15366G5727K74463d1236E3943P1742M45590j73982r4247
$$ -164185 362704 -315366 75727 350190 -41236 53943 125685 571275 397293 303046
10479C03046n8418I5712P8600J0354b8671A30556N8492a28636D5012c80710I1102
$$ 303046 244628 95712 174312 184666 -28671 130556 189048 -128636 45012 -380710 91102
10467c75235G8626a84212j34648f1976B8437e38583h8900a0498H0833J68665b74460
$$ -375235 78626 -184212 -318860 -61976 28437 -538583 -88900 -10498 80833 249498 -274460
10455a97822d5143C2904d6815j86963h3473B6984d948A484a29753B04032H5298
$$ -197822 -45143 32904 -46815 -233778 -83473 26984 -4948 1484 -129753 204032 85298
10443b11216A07336b97636M5689A32288P048k1271d0680J8894j8365p1260A8962
$$ -211216 107336 -297636 -251947 132288 139336 118065 -40680 -21786 -40151 -111411 18962
10431a16528k2421b5684n1171G4486e2973A34336J89799A01687a12393C1041M8113
$$ -116528 -138949 -25684 -76855 74486 -52973 134336 324135 101687 -112393 31041 79154
10420G9154J86055f949j23617B16265b20289a9273j08633j67179d4169j56362
$$ 79154 265209 -6949 -130566 216265 -220289 -19273 -127906 -295085 -44169 -200531
10410b00531p5548A78128C3198c05120d8637I6503k6610N6819k5297l231Q7523
$$ -200531 -276079 178128 33198 -305120 -48637 96503 69893 126712 101415 98184 185707
10399A85707a42691k5401B67680A07579N4637a00881A40172h3409C34177M4886
$$ 185707 -142691 -168092 267680 107579 162216 -100881 140172 -83409 334177 379063
10389C79063A53012J1305J72533k5696a89889f8080C18807j38902C5998M26937
$$ 379063 153012 164317 336850 311154 -189889 -68080 318807 179905 35998 462935
10379D62935E6621O93E603L27322j09816e5466B19707l2616J14337j46751K50615
$$ 462935 56621 57314 5603 332925 223109 -55466 219707 187091 301428 154677 405292
10368D05292J50614j93094o5042J42860j19848l984A05261k9957J98979O2712
$$ 405292 555906 362812 297770 440630 320782 316798 105261 75304 274283 336995
10358C36995H6578O6903K04266k0017J15422j02450K21134J62228J21849k43621
$$ 336995 86578 153481 357747 337730 453152 350702 571836 734064 855913 612292
10348F12292B08932L1250l1264b2781C12094J87239j68866j04814A12191k4675
$$ 612292 208932 240182 208918 -22781 312094 499333 330467 225653 112191 87516
10338H7516h8713K1951C53931l6761A55107d6296A99028a94184A79817E0274K27275
$$ 87516 -88713 -66762 353931 317170 155107 -46296 199028 -194184 179817 50274 277549
10327B77549b61830A24710f725A23887K2756a639A09356a4033k46796I7031M15446
$$ 277549 -261830 124710 -6725 123887 146643 -1639 109356 -14033 -260829 97031 512477
10316E12477A01704J46709F4126h9712j33043A02466m0325a78591A9506h1496
$$ 512477 101704 248413 64126 -89712 -222755 102466 62141 -178591 19506 -81496
10305A17465d1118j47645B8720c0256A26668a590j22031A50748K1383R830a90888
$$ 117465 -41118 -188763 28720 -30256 126668 -1590 -123621 150748 172131 181961 -190888
10293a4206k52126A47208I409J85377l5530f0234C30567a01597A38404M9094I3744
$$ -14206 -266332 147208 9409 194786 159256 -60234 330567 -101597 138404 187498 93744
10281a58438C10657g5028B52324b06715e8822D6628N6462J4247d0821M715F1172
$$ -158438 310657 -75028 252324 -206715 -58822 46628 103090 117337 -40821 -36106 61172
10269a19144m6838a0627A76427j3231a2149D49319j92723j04752b62574B77019
$$ -119144 -165982 -10627 176427 163196 -12149 449319 256596 151844 -262574 277019
10258B39597N7565A39742E2937g1768A42870j0507J0450C9546d5979k45510R1342
$$ 239597 297162 139742 52937 -71768 142870 132363 142813 39546 -45979 -291489 -200147
10247b00147a1283B72933a5512A81029p8175l2701b73452A63852C2564g878j8028
$$ -200147 -11283 272933 -15512 181029 102854 70153 -273452 163852 32564 -7878 -25906
10236b5906B6207a40916g467B9469b4810k30178p7313C5802N2784O4816G0685
$$ -25906 26207 -140916 -7467 29469 -24810 -254988 -332301 35802 88586 153402 70685
10224a12985q3139B08417b05051O8358q9462C0739f1294k07252a31711B82295
$$ -112985 -196124 208417 -205051 -136693 -226155 30739 -61294 -268546 -131711 282295
10213c95898a4838A9967K53598h0532j65938d6081A10955J54058j04946L3947
$$ -395898 -14838 19967 273565 -80532 -246470 -46081 110955 265013 160067 194014
10203A94014h338C3833b60435b8210j02984K3739A64220P7779F4997c381p3357
$$ 194014 -8338 33833 -260435 -28210 -131194 -107455 164220 241999 64997 -3381 -76738
10192g6738k291j3587C5997j840b3918A99207c10503E1071d3808k45771B71986
$$ -76738 -79029 -92616 35997 34157 -23918 199207 -310503 51071 -43808 -289579 271986
10180c03470K1315C4243a8004A43096F8663a12348K6808j03420L9842K98j22493
$$ -303470 -282155 34243 -18004 143096 68663 -112348 -85540 -188960 -149118 -148820 -271313
10169b71313K1964E8087b13794I6512D0584M5559d6966k90425a09161I4612A9770
$$ -271313 -249349 58087 -213794 96512 40584 86143 -46966 -337391 -109161 94612 19770
10157a20339A43530c16242P9610j25419J24093A27559a18612j6573j89469C03364
$$ -120339 143530 -316242 -236632 -362051 -237958 127559 -118612 -135185 -324654 303364
10146a69086O9921A0850c01407F3703g7566L7558A12332a94473k861A62862b8625
$$ -169086 -99165 10850 -301407 63703 -77566 -40008 112332 -194473 -197334 162862 -28625
10134d6294D7868e3477I3714a83049d8141A42287i2912d0159j30096c332l19458
$$ -46294 47868 -53477 93714 -183049 -48141 142287 -92912 -40159 -170255 -3332 -322790
10123c22790E7051a7908A9731c6787n5975q9255d1940m9528j27606H6871h0142
$$ -322790 57051 -17908 19731 -36787 -92762 -182017 -41940 -91468 -219074 86871 -80142
10111B25610A0026d3386E583J47129g0057j28106j51514A12383b118j70372H8818
$$ 225610 10026 -43386 5583 152712 -70057 -198163 -349677 112383 -2118 -172490 88818
10099D3208h2136j47198A42272Q067h6102o5569a4737q5911d0627j24564A22798
$$ 43208 -82136 -229334 142272 150339 -86102 -151671 -14737 -100648 -40627 -165191 122798
10087A26846b19882E1851j3982A2373J53245h2230j63119J9361J009j6419g7186
$$ 126846 -219882 51851 37869 12373 165618 -82230 -245349 -225988 -224979 -241398 -77186
10075c87144C67140a04148A50375n424h0637j9449E3063k3105f0766A4596a87739
$$ -387144 367140 -104148 150375 144951 -80637 -100086 53063 29958 -60766 14596 -187739
10063a05499k05788E802a35392C5264a52625L0548a5552j68931g5643p6709l2932
$$ -105499 -311287 5802 -135392 35264 -152625 -122077 -15552 -184483 -75643 -152352 -185284
10052a85284J5194L5915c1206k62602B05221E7910a4408A02928i4380j7622p6796
$$ -185284 -170090 -134175 -31206 -293808 205221 57910 -14408 102928 -94380 -112002 -188798
10041a88798M0042l7870H4042h336j91435N9282j6437j81451d3214r2397L1031
$$ -188798 -148756 -186626 84042 -8336 -199771 -140489 -156926 -338377 -43214 -135611 -104580
10030a04580l90393b9130B8869J32730a18290E6925b95430e9547k04062J30063
$$ -104580 -494973 -29130 28869 161599 -118290 56925 -295430 -59547 -263609 -133546
10020a33546B79093h0195j10903d5216C2465O1744B7745M5727b398A52240a05062
$$ -133546 279093 -80195 -191098 -45216 32465 94209 27745 73472 -2398 152240 -105062
10008E1229a83158Q0706j75906L4091P1148P7968c4199p2460k7558j63241c1296
$$ 51229 -183158 -102452 -278358 -244267 -173119 -95151 -34199 -106659 -134217 -297458 -31296
9996a90218h1917q807B34480b13364L4996K9794G2539c62327d4308p5871e9887
$$ -190218 -81917 -90724 234480 -213364 -178368 -148574 72539 -362327 -44308 -120179 -59887
9984a06382B59349b29469l7277k86193A16847b69119i0830C02573c50758a03890
$$ -106382 259349 -229469 -266746 -552939 116847 -269119 -90830 302573 -350758 -103890
9973C9432K4253a4417E3131a69153B70200B3187n37b17768D24008G4108c6756
$$ 39432 63685 -14417 53131 -169153 270200 23187 22650 -217768 424008 74108 -36756
9961C9484K9134L0639C4487L01220j65979Q8782c76647A59347O7454b10360B2495
$$ 39484 68618 99257 34487 335707 169728 258510 -376647 159347 226801 -210360 22495
9949a50052A4107b1288k43068A61871e9735k32579i210m9752j86226h9868C487
$$ -150052 14107 -21288 -264356 161871 -59735 -292314 -9210 -58962 -245188 -89868 3487
9937A34806a34631B94359a89557O5949j64334B95508q3464a1150j20356e7691
$$ 134806 -134631 294359 -189557 -123608 -287942 295508 212044 -11150 -131506 -57691
9926a13688k20292a16758k2663E0296L7022a84253f5262j42175f6582A53219c45270
$$ -113688 -333980 -116758 -139421 50296 87318 -184253 -65262 -207437 -66582 153219 -345270
9914A13435Q937a66261p7815a08587A01759a46691B18954b26848B0125b56214
$$ 113435 122372 -166261 -244076 -108587 101759 -146691 218954 -226848 20125 -256214
9903a62323j01802a4859k69634Q2627P4024a2075r0881A88447b0402m80737H3932
$$ -162323 -264125 -14859 -284493 -201866 -127842 -12075 -102956 188447 -20402 -501139 83932
9891c54303A21335c41837B61479d1591C1384M2598a07449A00571C8539a03399
$$ -354303 121335 -341837 261479 -41591 31384 73982 -107449 100571 38539 -103399
9880C58871d41232a84253C2780b18927Q4898B58475a08968k7091p72C502c5513
$$ 358871 -441232 -184253 32780 -218927 -134029 258475 -108968 -136059 -136831 3502 -35513
9868c9287k13652j28095g1726l9204A08421d5354j6305a1197j12142m8973A06267
$$ -39287 -252939 -381034 -71726 -110930 108421 -45354 -61659 -11197 -123339 -172312 106267
9856A00550c56219J26750F2712P4162N854d0697k17873P5087O2519B5936J59197
$$ 100550 -356219 -229469 62712 136874 142728 -40697 -258570 -183483 -120964 25936 185133
9845A85133f4143a4926j36187A69060c22945A43267B2333b7659D1517d2579E3521
$$ 185133 -64143 -14926 -151113 169060 -322945 143267 22333 -27659 41517 -42579 53521
9833A33710f2848o3457N4134A50113a36147L680L2863M2403E7125P6345e17673
$$ 133710 -62848 -126305 -72171 150113 -136147 -132467 -99604 -57201 57125 133470 -517673
9821b17876j01079n983e8179j32791d7090a206j58645K9678A81080Q9063a30904
$$ -217876 -318955 -324938 -58179 -190970 -47090 -1206 -159851 -130173 181080 270143 -130904
9809i4620B2420K2720b2018j03106j14356b5748C3800i1503E8965k3839a44466
$$ -94620 22420 45140 -22018 -125124 -239480 -25748 33800 -91503 58965 35126 -144466
9797b31232b9752j65476F6565b83812f0315k08909a0345j10262A041a34346K5580
$$ -231232 -29752 -195228 66565 -283812 -60315 -269224 -10345 -120607 1041 -134346 -108766
9786a08766p7780b1715F8537b42431J06517b6343m3163p2816a2610D4971b14337
$$ -108766 -186546 -21715 68537 -242431 -135914 -26343 -69506 -142322 -12610 44971 -214337
9774A18599r951a79027H2493a39148A27350d1678j09199m4874m4075a06715q9124
$$ 118599 108648 -179027 82493 -139148 127350 -41678 -150877 -195751 -239826 -106715 -195839
9763a95839m4388A48193l4241d7257E6230b25367a8800A76328l6107i9925K9771
$$ -195839 -240227 148193 113952 -47257 56230 -225367 -18800 176328 140221 -99925 -70154
9752g0154l60026a3666n2938B40028F38a02188A23696g0784I0841h9629j27928
$$ -70154 -430180 -13666 -66604 240028 638 -102188 123696 -70784 90841 -89629 -217557
9741b17557j15672J25409i6872g404C2447a39746B97530B0730P7027c91951g021
$$ -217557 -333229 -207820 -96872 -7404 32447 -139746 297530 20730 97757 -391951 -7021
9729A7237N7668a18121A56233a2709l26691c9435j55636j54510a47206K746m3118
$$ 17237 74905 -118121 156233 -12709 -339400 -39435 -195071 -349581 -147206 -144460 -187578
9718a87578j08738e3873A82996a78529F3723a26290a3682m6848K9232n0928j25965
$$ -187578 -296316 -53873 182996 -178529 63723 -126290 -13682 -60530 -31298 -82226 -208191
9707b08191B8755j601f6485l45261M8988l3204f9455A17057a84784E2434N9441
$$ -208191 28755 27154 -66485 -411746 -362758 -395962 -69455 117057 -184784 52434 111875
9696A11875l9603J34057b90347d5412l58142J09632f4874A71400K4093I4045b19670
$$ 111875 72272 206329 -290347 -45412 -403554 -293922 -64874 171400 195493 94045 -219670
9684a72699k2140C13315a25652j16189k81476a33975C258a42174J9966A88478
$$ -172699 -194839 313315 -125652 -241841 -523317 -133975 3258 -142174 -122208 188478
9673b09943N2359A18131c56149J39836e9772A83993l8781p2413c04518L755B2806
$$ -209943 -157584 118131 -356149 -216313 -59772 183993 145212 72799 -304518 -300763 22806
9661I8702g8595q7698F4884f6997m3016G0596A5889d1770B20325p3370a2703j19167
$$ 98702 -78595 -166293 64884 -66997 -110013 70596 15889 -41770 220325 146955 -12703 -131870
9649a31870e0591B7307K19825L0982b30998a8478k02449R2204j25190Q7614C8789
$$ -131870 -50591 27307 247132 278114 -230998 -18478 -220927 -128723 -253913 -166299 38789
9637B6847a41846A18604J27187b44428G3739c7715D2031K07881b90483A40604
$$ 26847 -141846 118604 245791 -244428 73739 -37715 42031 249912 -290483 140604
9626d2849A9623a80308E3680R5958a61518a3347r8719j86664O3213B38192c01615
$$ -42849 19623 -180308 53680 149638 -161518 -13347 -112066 -298730 -235517 238192 -301615
9614a24870b7360j3366G8296L2190D3530b66719h1393l9313j86100I3432c6100
$$ -124870 -27360 -40726 78296 110486 43530 -266719 -81393 -120706 -306806 93432 -36100
9602I0623b45409j26520G2597b11906C2917R0603C5106e349I7688b7703A51683
$$ 90623 -245409 -371929 72597 -211906 32917 123520 35106 -5349 97688 -27703 151683
9590f7328l3571A91323f1046k9171p2096F7099a42914A94103a99355O3987K9643
$$ -67328 -100899 191323 -61046 -90217 -162313 67099 -142914 194103 -199355 -135368 -105725
9579a05725c5795k50878P5195l0522a4095j92486B43595D8233j324f1594m10301
$$ -105725 -35795 -286673 -211478 -242000 -14095 -206581 243595 48233 46909 -61594 -471895
9568d71895D0775a99755g4307J6619j9794c666q0229B18679A00438a75167c2148
$$ -471895 40775 -199755 -74307 -57688 -77482 -3666 -83895 218679 100438 -175167 -32148
9556A07051b5928j80723k12605Q4207a28517O3662m9574m8870a1197k69618g4793
$$ 107051 -25928 -206651 -419256 -335049 -128517 -64855 -114429 -163299 -11197 -280815 -74793
9544A620b88615a22942m4667D50139a56570A35723D8425L4109c56006B94130a31827
$$ 1620 -288615 -122942 -167609 450139 -156570 135723 48425 82534 -356006 294130 -131827
9532B95793f7911j60911R2180I7863N973c41529h9586j26043E6246a98059A92542
$$ 295793 -67911 -228822 -136642 97863 103836 -341529 -89586 -215629 56246 -198059 192542
9520A57818f5909P359a442B36252b68513j9468p7662a0350j71522b3323C0540
$$ 157818 -65909 -58550 -1442 236252 -268513 -287981 -365643 -10350 -181872 -23323 30540
9508A10784d4079j14977O8779l9880k43063B57747b46256B34641c47924G0714
$$ 110784 -44079 -159056 -90277 -130157 -373220 257747 -246256 234641 -347924 70714
9497i1919B68095L4281a22647b7856F4168d9821A89621b98698A25660a21412A24374
$$ -91919 268095 302376 -122647 -27856 64168 -49821 189621 -298698 125660 -121412 124374
9485A45403c48380h0162L5181A17837a26654d1690c728C1559b31241A030K52501
$$ 145403 -348380 -80162 -44981 117837 -126654 -41690 -3728 31559 -231241 1030 253531
9474B53531G3633a6802r7573m504q2734f8246p7345A34338b39861d2213j20400
$$ 253531 73633 -16802 -114375 -118879 -201613 -68246 -145591 134338 -239861 -42213 -162613
9463a62613b6065I4694M939A0440a69065B64264a60945g4661D3384k0661a39367
$$ -162613 -26065 94694 99633 10440 -169065 264264 -160945 -74661 43384 22723 -139367
9451b22579i1833n602j66929N5395F9840a08148K529k5507k96010F3307c37069
$$ -222579 -91833 -97435 -264364 -208969 69840 -108148 -105619 -131126 -427136 63307 -337069
9439i827r2119k41022d1210k39201J4294h3244m4089J4010A01514F613K207L5854
$$ -9827 -101946 -342968 -41210 -280411 -266117 -83244 -127333 -113323 101514 6613 8820 44674
9427D4674b43096B1634Q5601M7854O0017B4807i9304K7244k94490a10530k34341
$$ 44674 -243096 21634 107235 155089 215106 24807 -99304 -72060 -366550 -110530 -344871
9416c44871a3023k14828j15040C79627b53696b2661A20529b01875j12200h0200
$$ -344871 -13023 -227851 -342891 379627 -253696 -22661 120529 -201875 -314075 -80200
9405a13944j18749A2214f7380r3775O5767l2963q2183B70934A18536d996k54837
$$ -113944 -232693 12214 -67380 -161155 -95388 -128351 -210534 270934 118536 -4996 -259833
9394b59833a643k19771M644B43976M7190i8616q315d8306j70648h5351D3108c3635
$$ -259833 -1643 -221414 -216770 243976 291166 -98616 -106931 -48306 -218954 -85351 43108 -33635
9381I7469m8148b0389m9820I5684J64607b37477l3477C9844i0200k24070A46307
$$ 97469 49321 -20389 -70209 95684 260291 -237477 -270954 39844 -90200 -314270 146307
9369E0921B019N658J70667a06017j65731A32466h2359F557e7327I3837i8155J6758
$$ 50921 2019 7677 178344 -106017 -271748 132466 -82359 6557 -57327 93837 -98155 -81397
9357h1397m149o3221A99465q7260Q2053b2217k3580j01359C79063a71476k6561
$$ -81397 -85546 -148767 199465 112205 194258 -22217 -45797 -147156 379063 -171476 -198037
9346a98037B51145b88376g4302l39670a5034p0267l98652K37595p1769a28533
$$ -198037 251145 -288376 -74302 -413972 -15034 -85301 -483953 -246358 -318127 -128533
9335f7410A50718b27922h6836l08860a15474r132H0260N36a98281k04324H1951
$$ -67410 150718 -227922 -86836 -395696 -115474 -124606 80260 80796 -198281 -402605 81951
9323b77232a14522A95756K8518b83783L153b2784n5945I1380J5228a7452l5497
$$ -277232 -114522 195756 224274 -283783 -280630 -22784 -78729 91380 106608 -17452 -52949
9312e2949j95429j1257J00762j41258c8148D87057G1503O8385A7070d2209j47298
$$ -52949 -248378 -259635 -158873 -300131 -38148 487057 71503 139888 17070 -42209 -189507
9301a89507A25559M8886c12400F8567J97074c61442A94610I3403a40201B20002
$$ -189507 125559 174445 -312400 68567 265641 -361442 194610 93403 -140201 220002
9290c00496G3338a38876j14417A5668J35368e9725k56400J29174A12359b14022
$$ -300496 73338 -138876 -253293 15668 151036 -59725 -316125 -186951 112359 -214022
9279g3952A68223b01229f4433j81409B24107i5246C38128A9134M26932b64332
$$ -73952 168223 -201229 -64433 -245842 224107 -95246 338128 19134 446066 -264332
9268a43166K8845B08999j5617A5425a85673A11187a60731B17662d9350B24434
$$ -143166 -114321 208999 193382 15425 -185673 111187 -160731 217662 -49350 224434
9257I3506J72167a49841f7416k7707L286F9852c9917J3022A23730A0655h6106
$$ 93506 265673 -149841 -67416 -95123 -91837 69852 -39917 -26895 123730 10655 -86106
9245C56371b43618G0401B7572L4432h4789b5664j56491P8321l4400J5831q5147
$$ 356371 -243618 70401 27572 62004 -84789 -25664 -182155 -103834 -138234 -122403 -207550
9234b07550E2242K5939f7230b9524k1596r0643h015A68654d4904a5228l27029
$$ -207550 52242 78181 -67230 -29524 -51120 -141763 -8015 168654 -44904 -15228 -342257
9223c42257G2117c67615a0648A87793b1774k18047f7233K7646A42837a61330j94753
$$ -342257 72117 -367615 -10648 187793 -21774 -239821 -67233 -39587 142837 -161330 -356083
9212c56083A14156d03411b2301n7703j126k54380a51138P3521m5829p6439E908
$$ -356083 114156 -403411 -22301 -80004 -81130 -335510 -151138 -77617 -123446 -199885 5908
9200g0798l1726p2693b1949C08610e8470j15695B65325G6938k0071a39979O1257
$$ -70798 -102524 -175217 -21949 308610 -58470 -174165 265325 76938 56867 -139979 -78722
9189g8722b5508A26094a63910C7169p047M3003o251i8796j41600J4584A08904
$$ -78722 -25508 126094 -163910 37169 30122 73125 66874 -98796 -240396 -225812 108904
9177A61170b89399A27716B9568b05265j21665A22894g631k66127j58347G7297
$$ 161170 -289399 127716 29568 -205265 -326930 122894 -7631 -273758 -432105 77297
9166b97656j32939J68620c3484A35012J29064d0340k55980D63880H3134f6903
$$ -297656 -430595 -261975 -33484 135012 264076 -40340 -296320 463880 83134 -66903
9155G7786K7310k8198C385d5378k2269B10072c37152a2072k8450B933P1240c2340
$$ 77786 105096 76898 3385 -45378 -67647 210072 -337152 -12072 -40522 2933 74173 -32340
9142i0834k62814A8089N1258j2240b09819A51a75142b2249l88116h962p8724M133
$$ -90834 -353648 18089 69347 57107 -209819 151 -175142 -22249 -410365 -8962 -87686 -83553
9130h3553A91818b17963a03367M1781j61049B71597a7824j05239B46779o3056
$$ -83553 191818 -217963 -103367 -61586 -222635 271597 -17824 -123063 246779 183723
9120A83723Q0547c25574c9998j7996k74233C63069c16959A00529a7746j18976
$$ 183723 264270 -325574 -39998 -57994 -332227 363069 -316959 100529 -17746 -136722
9110a36722B7337j0186d6353o793D8508c41500P5919A77405J12809c09172e3767
$$ -136722 27337 17151 -46353 -53146 48508 -341500 -265581 177405 290214 -309172 -53767
9098c86020a84868m06032c1252k5387j79315d6387m7115A0905b67042r0125e9688
$$ -386020 -184868 -590900 -31252 -56639 -235954 -46387 -93502 10905 -267042 -357167 -59688
9086G916a7243A3587b36330E6732J728a41131p8714H5955J2633m9093d4668k05011
$$ 7916 -17243 13587 -236330 56732 58460 -141131 -219845 85955 98588 49495 -44668 -249679
9074b49679Q989P957j03216g1155j51826I808J64889b08951l674L0583O1516r6160
$$ -249679 -240690 -232733 -335949 -71155 -222981 9808 174697 -208951 -212625 -182042 -120526 -216686
9062b16686d9217G7674b21366A3922e30641I5464l3741b29511A67944a5733o0667
$$ -216686 -49217 77674 -221366 13922 -530641 95464 61723 -229511 167944 -15733 -76400
9051g6400b1227B27063c8997j15621B042J7638d4943j07091a0600j16983j14488
$$ -76400 -21227 227063 -38997 -154618 2042 19680 -44943 -152034 -10600 -127583 -242071
9040b42071B20300a90819O8573B02354I4358D5110a48257A09655b32089P1821
$$ -242071 220300 -190819 -122246 202354 94358 45110 -148257 109655 -232089 -160268
9030a60268A29061a07957L4402A49616a60829f1309j4792q1189A83145g5428F2922
$$ -160268 129061 -107957 -73555 149616 -160829 -61309 -76101 -157290 183145 -75428 62922
9018A77283g0942B61022p5881m6259a90625A60827c25489J59380g1865n0053J7095
$$ 177283 -70942 261022 185141 138882 -190625 160827 -325489 -166109 -71865 -121918 -104823
9007a04823A34683K80143C9664h215A09312i7288E0992M4216o49c22987a34119
$$ -104823 134683 414826 39664 -8215 109312 -97288 50992 95208 94559 -322987 -134119
8995A07570a72014A22127a89470C12089A40653c06836g1824j05755B70828i1328
$$ 107570 -172014 122127 -189470 312089 140653 -306836 -71824 -177579 270828 -91328
8984c7739q739j22000B07905a55215A7404a11772A0365b55605H0157b95550J00864
$$ -37739 -46478 -168478 207905 -155215 17404 -111772 10365 -255605 80157 -295550 -194686
8973a94686A3668a90009C2451J78382E8193b02696e9918B30812b14319F4372f4345
$$ -194686 13668 -190009 32451 210833 58193 -202696 -59918 230812 -214319 64372 -64345
8961c27183i6330E6971J6998M6036c6190b478j62879e9747j61792N1632A35073
$$ -327183 -96330 56971 73969 120005 -36190 -2478 -165357 -59747 -221539 -169907 135073
8949a13604A34581C9929c71547E7906a13627A8106e19774K38492l1987C2314a12339
$$ -113604 134581 39929 -371547 57906 -113627 18106 -519774 -281282 -313269 32314 -112339
8937A59382Q6299j11119J7580E6682J80707f5197C6173J06791b8992C29205A4394
$$ 159382 245681 134562 152142 56682 237389 -65197 36173 142964 -28992 329205 14394
8925C18201K50468J468565M527084O005707n162596B580311G17102l33048p4426
$$ 318201 568669 2037234 6564318 12570025 7407429 2580311 717102 384054 309628
8916C09628l3381a1851B794g5987A06641b46706C40630J44433B38673a00376A56545
$$ 309628 276247 -11851 2794 -75987 106641 -246706 340630 485063 238673 -100376 156545
8904a45548f0021j20818k0642A08551B3130g1226I3989a33761q2812O9069l31099
$$ -145548 -60021 -180839 -201481 108551 23130 -71226 93989 -133761 -216573 -147504 -478603
8893d78603a98531o5543a08799k12305B26742a4577j44041B55004c20477j77234
$$ -478603 -198531 -264074 -108799 -321104 226742 -14577 -158618 255004 -320477 -497711
8883d97711a68240j04173B2717J11978B7471K4755K67172A33883i5880j18004
$$ -497711 -168240 -272413 22717 134695 27471 52226 319398 133883 -95880 -213884
8873b13884G2644J15103N2327E4393D082b38777A74378n5331b40682E6904K33675
$$ -213884 72644 187747 240074 54393 4082 -238777 174378 119047 -240682 56904 290579
$$ [...]
##END NTUPLES=NMR SPECTRUM
##END=
