
##TITLE=AC1302_PERAH12114_6608382_PZ89wDSsjw
##JCAMPDX= 6.0         $$ Bruker NMR JCAMP-DX V2.0
##DATA TYPE= NMR SPECTRUM
##DATA CLASS= NTUPLES
##ORIGIN= BRUKER
##OWNER= Administrator
$$ 1.72 TOPSPIN		Version 2.1
$$ 2012-08-01 13:48:39.875 -0500  Administrator@TOPSPIN
$$ Compression mode = diff/dup
##.OBSERVE FREQUENCY= 400.02188249412
##.OBSERVE NUCLEUS= ^1H
##.ACQUISITION MODE= SIMULTANEOUS (DQD)
##.ACQUISITION SCHEME= undefined
##.AVERAGES= 64
##.DIGITISER RES= 22
##SPECTROMETER/DATA SYSTEM= spect
##.PULSE SEQUENCE= noesygpps1d.comp
##.SOLVENT NAME= COFFEE_meoh
##.SHIFT REFERENCE= INTERNAL, COFFEE_meoh, 1, 14.96059
##AUDIT TRAIL= $$ (NUMBER, WHEN, WHO, WHERE, PROCESS, VERSION, WHAT)
$$ ##TITLE= Audit trail, TOPSPIN		Version 2.1
$$ ##JCAMPDX= 5.01
$$ ##ORIGIN= Bruker BioSpin GmbH
$$ ##OWNER= Administrator
$$ $$ C:\Bruker\TOPSPIN/data/COFFEE/nmr/AC1302_PERAH12114_6608382_PZ89wDSsjw/12/pdata/1/auditp.txt
$$ ##AUDIT TRAIL=  $$ (NUMBER, WHEN, WHO, WHERE, PROCESS, VERSION, WHAT)
(   1,<2012-08-01 13:48:34.828 -0500>,<Administrator>,<TOPSPIN>,<go>,<TOPSPIN 2.1>,
      <created by zg
	started at 2012-08-01 13:37:04.421 -0500,
	POWCHK enabled, PULCHK disabled,
       configuration hash MD5:
       6B 1B 68 BB D9 2E 58 E2 7F 35 AD 54 07 DF 0E 41
       data hash MD5: 64K
       F3 58 A0 AC F5 E2 06 39 7B 0E F1 DB 6C BB 2B 91>)
(   2,<2012-08-01 13:48:37.875 -0500>,<Administrator>,<TOPSPIN>,<proc1d>,<TOPSPIN 2.1>,
      <Start of raw data processing
       efp LB = 0.3 FT_mod = 6 PKNL = 1 PHC0 = 0 PHC1 = 0 SI = 128K 
       data hash MD5: 128K
       D3 81 D9 4B F5 E7 0E 55 F4 38 0A E4 74 B9 ED ED>)
(   3,<2012-08-01 13:48:39.031 -0500>,<Administrator>,<TOPSPIN>,<proc1d>,<TOPSPIN 2.1>,
      <pk PHC0 = -2.197266 PHC1 = 0 
       data hash MD5: 128K
       62 56 1B 55 FF 6C F8 75 A3 A7 39 E9 69 5A 04 90>)
(   4,<2012-08-01 13:48:39.531 -0500>,<Administrator>,<TOPSPIN>,<proc1d>,<TOPSPIN 2.1>,
      <abs ABSG = 1 
       data hash MD5: 128K
       2E FD 53 65 09 5F C8 12 BA 8D D9 5C 00 4A A1 BA>)
(   5,<2012-08-01 13:48:39.609 -0500>,<Administrator>,<TOPSPIN>,<proc1d>,<TOPSPIN 2.1>,
      <abs ABSG = 2 
       data hash MD5: 128K
       71 BF F4 EC 66 EE 76 68 A8 30 56 82 DB 80 9F 4B>)
(   6,<2012-08-01 13:48:39.671 -0500>,<Administrator>,<TOPSPIN>,<proc1d>,<TOPSPIN 2.1>,
      <abs ABSG = 3 
       data hash MD5: 128K
       93 30 EF 4E 46 D2 D1 0F 48 C3 82 5F A9 AB 60 EF>)
(   7,<2012-08-01 13:48:39.734 -0500>,<Administrator>,<TOPSPIN>,<proc1d>,<TOPSPIN 2.1>,
      <abs ABSG = 4 
       data hash MD5: 128K
       73 53 88 09 8B 9A 01 FC 5C CC 9C C7 D0 39 CD A7>)
(   8,<2012-08-01 13:48:39.796 -0500>,<Administrator>,<TOPSPIN>,<proc1d>,<TOPSPIN 2.1>,
      <abs ABSG = 5 
       data hash MD5: 128K
       70 F0 83 3F CE 84 5D E9 FF 87 70 97 4E 25 92 E8>)
$$ ##END=
$$ 
$$ $$ hash MD5
$$ $$ 4B 82 26 8C 65 D7 93 C5 42 27 AC B5 56 4F 85 C7
##$RELAX= 
##$RELAX= 
##$RELAX= 
##$RELAX= 
##$RELAX= 
##$RELAX= 
##$RELAX= 
##$RELAX= 
$$ Bruker specific parameters
$$ [...]
##$TP07= 0
##$TPNAME0= <>
##$TPNAME1= <>
##$TPNAME2= <>
##$TPNAME3= <>
##$TPNAME4= <>
##$TPNAME5= <>
##$TPNAME6= <>
##$TPNAME7= <>
##$TPOAL= (0..7)
0.5 0.5 0.5 0.5 0.5 0.5 0.5 0.5
##$TPOFFS= (0..7)
0 0 0 0 0 0 0 0
##$TUNHIN= 0
##$TUNHOUT= 0
##$TUNXOUT= 0
##$USERA1= <user>
##$USERA2= <user>
##$USERA3= <user>
##$USERA4= <user>
##$USERA5= <user>
##$V9= 5
##$VALIST= <valist>
##$VCLIST= <CCCCCCCCCCCCCCC>
##$VD= 0
##$VDLIST= <DDDDDDDDDDDDDDD>
##$VPLIST= <PPPPPPPPPPPPPPP>
##$VTLIST= <TTTTTTTTTTTTTTT>
##$WBST= 1024
##$WBSW= 4
##$XGAIN= (0..3)
0 0 0 0
##$XL= 0
##$YL= 0
##$YMAX_a= 11152974
##$YMIN_a= -9129962
##$ZGOPTNS= <>
##$ZL1= 120
##$ZL2= 120
##$ZL3= 120
##$ZL4= 120
##$ABSF1= 14.96059
##$ABSF2= -5.597591
##$ABSG= 5
##$ABSL= 3
##$ALPHA= 0
##$AQORDER= 0
##$ASSFAC= 0
##$ASSFACI= 0
##$ASSFACX= 0
##$ASSWID= 0
##$AUNMP= <proc_prof1d_extract.lims>
##$AXLEFT= 0
##$AXNAME= <>
##$AXNUC= <1H>
##$AXRIGHT= 0
##$AXTYPE= 0
##$AXUNIT= <>
##$AZFE= 0.1
##$AZFW= 0.1
##$BCFW= 0
##$BC_mod= 0
##$BYTORDP= 0
##$COROFFS= 0
##$CY= 15
##$DATMOD= 1
##$DC= 0
##$DFILT= <>
##$DTYPP= 0
##$F1P= 0
##$F2P= 0
##$FCOR= 0.5
##$FTSIZE= 131072
##$FT_mod= 6
##$GAMMA= 0
##$GB= 0
##$INTBC= 1
##$INTSCL= 1
##$ISEN= 128
##$LB= 0.3
##$LEV0= 0
##$LPBIN= 0
##$MAXI= 10000
##$MC2= 0
##$MEAN= 0
##$ME_mod= 0
##$MI= 0
##$NCOEF= 0
##$NC_proc= -2
##$NLEV= 6
##$NOISF1= 0
##$NOISF2= 0
##$NSP= 0
##$NTH_PI= 0
##$NZP= 0
##$OFFSET= 14.96059
##$PC= 1
##$PHC0= -2.197266
##$PHC1= 0
##$PH_mod= 1
##$PKNL= yes
##$PPARMOD= 0
##$PPDIAG= 0
##$PPIPTYP= 0
##$PPMPNUM= 2147483647
##$PPRESOL= 1
##$PSCAL= 4
##$PSIGN= 0
##$PYNMP= <proc.py>
##$REVERSE= no
##$SF= 400.020009799961
##$SI= 131072
##$SIGF1= 0
##$SIGF2= 0
##$SINO= 400
##$SIOLD= 131072
##$SPECTYP= <>
##$SREGLST= <1H.CDCl3>
##$SSB= 0
##$STSI= 131072
##$STSR= 0
##$SW_p= 8223.68421052631
##$SYMM= 0
##$S_DEV= 0
##$TDeff= 65536
##$TDoff= 0
##$TI= <>
##$TILT= no
##$TM1= 0
##$TM2= 0
##$TOPLEV= 0
##$USERP1= <user>
##$USERP2= <user>
##$USERP3= <user>
##$USERP4= <user>
##$USERP5= <user>
##$WDW= 1
##$XDIM= 131072
##$YMAX_p= 404135801
##$YMIN_p= -12204
##$CURPLOT= <Network HP LaserJet P1505>
##$CURPRIN= <$Network HP LaserJet P1505>
##$DFORMAT= <normdp>
##$LAYOUT= <+/1D_H.xwp>
##$LFORMAT= <normlp>
##$PFORMAT= <normpl>
##$SURQMSG= 1
$$ End of Bruker specific parameters
$$ ---------------------------------
##NTUPLES= NMR SPECTRUM
##VAR_NAME=  FREQUENCY,     SPECTRUM/REAL,   SPECTRUM/IMAG
##SYMBOL=    X,             R,               I
##VAR_TYPE=  INDEPENDENT,   DEPENDENT,       DEPENDENT
##VAR_FORM=  AFFN,          ASDF,            ASDF
##VAR_DIM=   131072,        131072,          131072
##UNITS=     HZ,            ARBITRARY UNITS, ARBITRARY UNITS
##FACTOR=    0.0627417313425164, 1,          1
##FIRST=     8223.62146879497, -524,         -64987
##LAST=      0,             2003,            -65642
##MIN=       0,             -12204,          0
##MAX=       8223.62146879497, 404135801,    0
$$ Real data points
##PAGE= N=1
##DATA TABLE= (X++(R..R)), XYDATA
$$ [...]
$$ plain form
63923 4509924 4469347 4396712 4292909 4160422 4003484 3827053 3635828 3434211 3226733 3017838
63913 3017838 2811116 2609087 2413884 2227777 2052774 1890058 1740347 1604549 1483405
63904 1483405 1376400 1281746 1197760 1123855 1059849 1004787 957040 915301 878957 847589 820642
63893 820642 797639 778195 761609 746790 732797 719333 706550 694526 682987 671452 659630
63882 659630 647817 636879 627634 620273 614623 610918 609844 611754 616272 623035 632452 645241 661389
63869 661389 680071 700560 722668 746191 770519 795222 820680 847587 875851 904356 931798
63858 931798 957371 980560 1000795 1017695 1031452 1042529 1050944 1056166 1057739 1055697 1050175 1040857 1027198
63845 1027198 1009226 987874 964370 939401 912893 884472 853960 821584 788056 754551 722197
$$ packed form
63923D509924m0577p2635j03803j32487j56938j76431j91225k01617k07478k08895
63913C017838k06722k02029j95203j86107j75003j62716j49711j35798j21144
63904A483405j07005r4654q3986p3905o4006n5062m7747m1739l6344l1368k6947
63893H20642k3003j9444j6586j4819j3993j3464j2783j2024j1539j1535j1822
63882F59630j1813j0938r245p361n650l705j074J910M518O763R417J2789J6148
63869F61389J8682K0489K2108K3523K4328K4703K5458K6907K8264K8505K7442
63858I31798K5573K3189K0235J6900J3757J1077Q415N222J573k042n522r318j3659
63845A027198j7972k1352k3504k4969k6508k8421l0512l2376l3528l3505l2354
$$ plain form
63834 722197 691259 660950 630434 599984 570777 543624 518459 495212 474459 456546 440548
63823 440548 424967 409424 394887 382142 370791 360090 349990 340730 331931 322917 313766 305354
63811 305354 298333 292617 287879 283943 280534 277199 273771 270532 267682 264972 262172 259592 257743 256644
63797 256644 255725 254319 252043 248936 245553 242718 240781 239162 237038 234455 232323 231236 230711 229774 227963
63782 227963 225536 222993 220734 218981 217645 216348 214928 213847 213726 214370 214681 213790 212062 210725 210639 211683
63766 211683 213212 214666 215674 216002 215765 215509 215640 215839 215499 214783 214699 215777 217135 217471 216739 216146 216490
63749 216490 217234 217510 217326 217308 217733 218388 219057 219538 219452 218702 218019 218455 220271 222891 225840 229027 232025 233957
63731 233957 234587 234963 236467 239563 243804 248602 253496 258047 262075 265932 270117 274718 279530 284477 289555
$$ packed form
63834G22197l0938l0309l0516l0450k9207k7153k5165k3247k0753j7913j5998
63823D40548j5581j5543j4537j2745j1351j0701j0100r260q799r014r151q412
63811C05354p021n716m738l936l409l335l428l239k850k710k800k580j849j099
63797B56644r19j406k276l107l383k835j937j619k124k583k132j087n25r37j811
63782B27963k427k543k259j753j336j297j420j081j21O44L11q91j728j337q6J044
63766B11683J529J454J008L28k37k56J31J99l40p16q4J078J358L36p32n93L44
63749B16490P44K76j84j8M25O55O69M81q6p50o83M36J816K620K949L187K998J932
63731B33957O30L76J504L096M241M798M894M551M028L857M185M601M812M947N078
$$ plain form
63716 289555 294540 299139 303243 306633 308692 308926 307626 305561 303103 300143 296727 293198 289730 286303
63702 286303 283151 280685 278910 277464 276322 275887 276270 277093 278210 280003 282620 285462 287862 289835 291740
63687 291740 293635 295440 297433 300071 303393 306988 310370 313159 315130 316436 317545 318623 319235 318998 318215
63672 318215 317489 317041 316973 317870 320374 324149 327948 330878 333068 334940 336385 336931 336297 334477 331569 327820
63656 327820 323560 318890 313655 307953 302382 297505 293295 289405 285792 282727 280352 278526 277079 275903
63642 275903 274835 273751 272824 272420 272707 273583 275012 277121 279891 283050 286443 290228 294508 299036 303634
63627 303634 308705 314840 321934 329157 335979 342836 350562 359526 369639 380919 393533 407368 422097
63614 422097 437768 454975 474243 495497 518318 542508 568233 595722 625091 656340 689262
$$ packed form
63716B89555M985M599M104L390K059K34j300k065k458k960l416l529l468l427
63702B86303l152k466j775j446j142m35L83Q23J117J793K617K842K400J973J905
63687B91740J895J805J993K638L322L595L382K789J971J306J109J078O12k37p83
63672C18215p26m48o8Q97K504L775L799K930K190J872J445N46o34j820k908l749
63656C27820m260m670n235n702n571m877m210l890l613l065k375j826j447j176
63642B75903j068j084r27m04K87Q76J429K109K770L159L393L785M280M528M598
63627C03634N071O135P094P223O822O857P726Q964J0113J1280J2614J3835J4729
63614D22097J5671J7207J9268K1254K2821K4190K5725K7489K9369L1249L2922
$$ plain form
63603 689262 723136 756443 786988 812627 832282 846349 855969 861855 864021 862617 858662 853633 848419
63590 848419 842817 835902 826761 815008 800855 784712 766672 746477 724014 699726 674439 648976
63578 648976 624118 600730 579588 561002 544806 530701 518546 508382 500414 494962 492218 491879
63566 491879 493174 495387 498285 501963 506384 511407 517288 524788 534406 545581 557102 568405 580130
63553 580130 593261 608188 624961 644044 666155 691483 719744 751133 786619 826891 871207
63542 871207 917344 962314 1002962 1036415 1060577 1074502 1078502 1074179 1064261 1051772 1038962 1026925
63530 1026925 1016039 1006204 996660 986221 974034 959753 942824 922301 897793 870053 840108 808239
63518 808239 774388 739180 703917 669813 637716 608232 581512 557132 534766 514737 497369
$$ packed form
63603F89262L3874L3307L0545K5639J9655J4067R620N886K166j404l955n029n214
63590H48419n602o915r141j1753j4153j6143j8040k0195k2463k4288k5287k5463
63578F48976k4858k3388k1142j8586j6196j4105j2155j0164p968n452k744l39
63566D91879J295K213K898L678M421N023N881P500R618J1175J1521J1303J1725
63553E80130J3131J4927J6773J9083K2111K5328K8261L1389L5486M0272M4316
63542H71207M6137M4970M0648L3453K4162J3925M000m323r918j2489j2810j2037
63530A026925j0886r835r544j0439j2187j4281j6929k0523k4508k7740k9945l1869
63518H08239l3851l5208l5263l4104l2097k9484k6720k4380k2366k0029j7368
$$ plain form
63507 497369 482187 468467 456233 445783 436509 427290 418116 410192 404155 399239 394614 390548 387576
63494 387576 385334 383050 380635 378494 376661 374892 373415 372768 372986 373549 374149 374955 376208 378098 381055
63479 381055 385482 390974 396294 400510 403871 407206 410655 413414 414679 414493 413465 411910 409559 406136
63465 406136 401899 397427 393000 388427 383507 378468 373884 370232 367530 365365 363318 361354 359766 358726
63451 358726 358134 357966 358491 359942 362313 365758 370826 377803 386036 394547 403252 412983 424315 437064
63437 437064 451109 467110 486099 508836 535744 566784 600919 636039 669837 700507 726488
63426 726488 746311 759488 767259 771805 774847 777420 780668 786121 795108 808528 827189 851753 882017
63413 882017 916597 953520 990864 1026737 1059046 1085778 1105581 1118108 1123937 1124227 1120281 1113285
$$ packed form
63507D97369j5182j3720j2234j0450r274r219r174p924o037m916m625m066k972
63494C87576k242k284k415k141j833j769j477o47K18N63O00Q06J253J890K957
63479C81055M427N492N320M216L361L335L449K759J265j86j028j555k351l423
63465D06136m237m472m427m573m920n039m584l652k702k165k047j964j588j040
63451C58726n92j68N25J451K371L445N068O977Q233Q511Q705R731J1332J2749
63437D37064J4045J6001J8989K2737K6908L1040L4135L5120L3798L0670K5981
63426G26488J9823J3177P771M546L042K573L248N453Q987J3420J8661K4564L0264
63413H82017L4580L6923L7344L5873L2309K6732J9803J2527N829K90l946o996
$$ plain form
63401 1113285 1104334 1094474 1084412 1074085 1062662 1049065 1032456 1012327 988383 960566 929214 895168
63389 895168 859651 823924 788937 755275 723323 693340 665413 639578 616096 595432 577849
63378 577849 563200 551237 541885 535034 530270 527176 525858 526868 530516 536403 543748 552150 561956 573855
63364 573855 588046 603994 621185 639975 661331 685758 712910 742387 774386 809256 846778
63353 846778 886258 926964 967953 1007699 1044396 1076622 1103371 1123656 1136667 1142392 1141731 1136011
63341 1136011 1126718 1115544 1104072 1093078 1082258 1070622 1056887 1039714 1018264 992803 964498
63330 964498 934441 903205 871296 839483 808390 778251 749482 723184 700622 682433 668714
63319 668714 659611 655138 654270 654694 653726 649336 640414 626688 608907 588785 568139 547862 528072
$$ packed form
63401A113285q951r860j0062j0327j1423j3597j6609k0129k3944k7817l1352l4046
63389H95168l5517l5727l4987l3662l1952k9983k7927k5835k3482k0664j7583
63378E77849j4649j1963r352o851m764l094j318J010L648N887P345Q402R806J1899
63364E73855J4191J5948J7191J8790K1356K4427K7152K9477L1999L4870L7522
63353H46778L9480M0706M0989L9746L6697L2226K6749K0285J3011N725o61n720
63341A136011r293j1174j1472j0994j0820j1636j3735j7173k1450k5461k8305
63330I64498l0057l1236l1909l1813l1093l0139k8769k6298k2562j8189j3719
63319F68714r103m473q68M24r68m390q922j3726j7781k0122k0646k0277j9790
$$ plain form
63306 528072 509237 492586 479036 468087 458398 449347 441392 434858 429079 423220 417429 412554 408898
63293 408898 405845 402641 399040 395113 390953 386831 383249 380497 378281 376010 373400 370648 368135 366103
63279 366103 364585 363483 362618 361740 360570 358915 356748 354166 351298 348414 346032 344602 343988 343505 342731
63264 342731 342031 342047 342901 344231 345864 347996 350711 353670 356403 358723 360849 363305 366552 370526 374607
63249 374607 378338 382013 386246 391193 396697 403089 411100 420884 431685 442775 454230 466504 479719
63236 479719 493749 508704 524941 542823 562653 584527 607933 631823 655433 678785 702003
63225 702003 724511 745501 765067 784365 804558 825954 848120 870437 892494 914317 936288
63214 936288 958466 979857 998592 1013019 1022502 1027155 1027089 1022102 1011921 996527 976332 952175 925157
$$ packed form
63306E28072j8835j6651j3550j0949r689r051p955o534n779n859n791m875l656
63293D08898l053l204l601l927m160m122l582k752k216k271k610k752k513k032
63279C66103j518j102q65q78j170j655k167k582k868k884k382j430o14m83p74
63264C42731p00J6Q54J330J633K132K715K959K733K320K126K456L247L974M081
63249C74607L731L675M233M947N504O392Q011R784J0801J1090J1455J2274J3215
63236D79719J4030J4955J6237J7882J9830K1874K3406K3890K3610K3352K3218
63225G02003K2508K0990J9566J9298K0193K1396K2166K2317K2057K1823K1971
63214I36288K2178K1391J8735J4427R483M653o6m987j0181j5394k0195k4157k7018
$$ plain form
63201 925157 896396 866894 837535 809077 782107 757102 734533 714812 698140 684514 673912
63190 673912 666400 662065 660942 662993 668037 675733 685773 698128 712914 729941 748575 768192 788625
63177 788625 809932 831782 853370 874097 894104 913902 933552 952470 969987 985711 999161
63166 999161 1009448 1015753 1018039 1016814 1012121 1003148 989048 969869 946468 919744 890251 858402
63154 858402 824789 790295 756052 723134 692070 662737 634932 608969 585470 564673 546304
63143 546304 530058 515874 503639 492995 483622 475418 468230 461730 455810 450866 447298 444891 443083
63130 443083 441770 441378 442037 443120 443863 444125 444275 444621 445367 446933 449759 453702 458023 462198 466402 470966
63114 470966 475665 479918 483533 486856 490206 493566 496926 500525 504477 508347 511433 513475 514920 516441
$$ packed form
63201I25157k8761k9502k9359k8458k6970k5005k2569j9721j6672j3626j0602
63190F73912p512m335j123K051N044P696J0040J2355J4786J7027J8634J9617K0433
63177G88625K1307K1850K1588K0727K0007J9798J9650J8918J7517J5724J3450
63166I99161J0287O305K286j225m693q973j4100j9179k3401k6724k9493l1849
63154H58402l3613l4494l4243l2918l1064k9333k7805k5963k3499k0797j8369
63143E46304j6246j4184j2235j0644r373q204p188o500n920m944l568k407j808
63130D43083j313l92O59J083P43K62J50L46P46J566K826L943M321M175M204M564
63114D70966M699M253L615L323L350L360L360L599L952L870L086K042J445J521
$$ plain form
63100 516441 518264 519987 521022 521206 520990 520974 521279 521510 521404 521359 522106 523920 526331 528598 530274 531286 531765
63083 531765 532009 532442 533344 534644 536225 538372 541603 546014 551127 556568 562558 569471 577201 585364 593942
63068 593942 603268 613495 624577 636768 650566 666020 682655 700285 719463 740836 764555 790599
63056 790599 819191 850423 883935 919596 958182 1000735 1047360 1097130 1148982 1202200 1256266
63045 1256266 1310971 1366557 1423112 1479890 1535970 1591504 1647484 1704271 1761210 1817872 1874674
63034 1874674 1931752 1988067 2042195 2093302 2140626 2182573 2217039 2242311 2257090 2260119 2250636 2228992
63022 2228992 2196189 2152999 2100157 2039235 1972626 1902665 1831256 1760183 1691186 1625748 1565279
63011 1565279 1511326 1465038 1426471 1395013 1370443 1353043 1342852 1339521 1342827 1352538 1367717 1386988
$$ packed form
63100E16441J823J723J035J84k16j6L05K31j06m5P47J814K411K267J676J012M79
63083E31765K44M33R02J300J581K147L231M411N113N441N990O913P730Q163Q578
63068E93942R326J0227J1082J2191J3798J5454J6635J7630J9178K1373K3719K6044
63056G90599K8592L1232L3512L5661L8586M2553M6625M9770N1852N3218N4066
63045A256266N4705N5586N6555N6778N6080N5534N5980N6787N6939N6662N6802
63034A874674N7078N6315N4128N1107M7324M1947L4466K5272J4779L029r483k1644
63022B228992l2803m3190n2842o0922o6609o9961p1409p1073o8997o5438o0469
63011A565279n3953m6288l8567l1458k4570j7400j0191l331L306R711J5179J9271
$$ plain form
62999 1386988 1409720 1436132 1465963 1497871 1530686 1564482 1599770 1636147 1672525 1708296 1743532
62988 1743532 1778106 1811304 1842240 1870144 1894175 1913354 1926726 1933299 1931880 1921428 1901637 1873008
62976 1873008 1836332 1792336 1741733 1685297 1623892 1558744 1491647 1424596 1359128 1296187 1236571
62965 1236571 1181100 1130228 1083778 1041266 1002363 966962 934977 906234 880404 856926 835046
62954 835046 814081 793636 773607 754119 735475 717927 701352 685294 669494 654250 639994
62943 639994 626549 613176 599471 586017 573881 563540 554546 546148 537961 529945 522107 514566 507782
62930 507782 502323 498242 494908 491584 488150 485128 483098 482138 481805 481516 480860 479631 477731 475272 472709
62915 472709 470629 469214 468089 466800 465318 463837 462299 460456 458336 456273 454426 452575 450481 448158
$$ packed form
62999A386988K2732K6412K9831L1908L2815L3796L5288L6377L6378L5771L5236
62988A743532L4574L3198L0936K7904K4031J9179J3372O573j419j0452j9791k8629
62976A873008l6676m3996n0603n6436o1405o5148o7097o7051o5468o2941n9616
62965A236571n5471n0872m6450m2512l8903l5401l1985k8743k5830k3478k1880
62954H35046k0965k0445k0029j9488j8644j7548j6575j6058j5800j5244j4256
62943F39994j3445j3373j3705j3454j2136j0341q994q398q187q016p838p541o784
62930E07782n459m081l334l324l434l022k030r60l33k89o56j229j900k459k563
62915D72709k080j415j125j289j482j481j538j843k120k063j847j851k094k323
$$ plain form
62901 448158 445727 443325 441230 439733 438732 437764 436627 435623 435021 434682 434510 434807 435734 436769 437290 437469
62885 437469 437987 438972 439883 440440 440950 441597 442066 442269 442827 444297 446237 447548 447606 446718 445596 444778 444413 444288
62867 444288 444004 443360 442513 441628 440609 439448 438667 438960 440329 441955 443008 443368 443453 443641 444014 444485 444978
62850 444978 445542 446358 447588 449205 451105 453341 456060 459175 462314 465173 467685 469730 470937 471001 470134
62835 470134 469042 468471 468779 469779 470830 471195 470529 469066 467303 465647 464373 463717 463812 464656 466270 468765
62819 468765 472061 475746 479385 482844 486104 489016 491574 494252 497569 501343 504910 508102 511474 515407
62805 515407 519540 523475 527570 532530 538482 545012 551968 559708 568582 578642 589939 602668 616864
62792 616864 632290 648830 666791 686726 709161 734579 763357 795581 831233 870786 915417
$$ packed form
62901D48158k431k402k095j497j001r68j137j004o02l39j72K97R27J035N21J79
62885D37469N18R85R11N57N10O47M69K03N58J470J940J311N8q88j122q18l65j25
62867D44288k84o44q47q85j019j161p81K93J369J626J053L60Q5J88L73M71M93
62850D44978N64Q16J230J617J900K236K719L115L139K859K512K045J207O4q67
62835D70134j092n71L08J000J051L65o66j463j763j656j274o56R5Q44J614K495
62819D68765L296L685L639L459L260K912K558K678L317L774L567L192L372L933
62805E15407M133L935M095M960N952O530O956P740Q874J0060J1297J2729J4196
62792F16864J5426J6540J7961J9935K2435K5418K8778L2224L5652L9553M4631
$$ plain form
62781 915417 966321 1023950 1088060 1158269 1234202 1315255 1400638 1489614 1581249 1673747 1764463
62770 1764463 1850798 1930856 2002954 2064878 2114142 2148994 2168720 2173001 2161536 2134663 2093953
62759 2093953 2041710 1979917 1910008 1833528 1752483 1668899 1584408 1500392 1418117 1338412 1261553
62748 1261553 1187890 1118399 1054174 995472 941714 892414 847632 807441 771463 739217 710437
62737 710437 684711 661221 639406 619643 602669 588371 575777 564311 554447 546764 540912 536071
62725 536071 532125 529673 528885 528989 529153 529458 530617 533010 536424 540655 545913 552557 560717 570471 582161
62710 582161 596286 613066 632335 653971 678285 705855 737046 771895 810437 852977 899929
62699 899929 951540 1007925 1069150 1134947 1204420 1276453 1350554 1426775 1504425 1581155 1653848
$$ packed form
62781I15417N0904N7629O4110P0209P5933Q1053Q5383Q8976R1635R2498R0716
62770A764463Q6335Q0058P2098O1924M9264L4852J9726M281j1465k6873m0710
62759B093953n2243o1793o9909p6480q1045q3584q4491q4016q2275p9705p6859
62748A261553p3663o9491o4225n8702n3758m9300m4782m0191l5978l2246k8780
62737G10437k5726k3490k1815j9763j6974j4298j2594j1466r864p683n852m841
62725E36071l946k452p88J04J64L05J159K393L414M231N258O644Q160R754J1690
62710E82161J4125J6780J9269K1636K4314K7570L1191L4849L8542M2540M6952
62699H99929N1611N6385O1225O5797O9473P2033P4101P6221P7650P6730P2693
$$ plain form
62688 1653848 1720303 1779521 1830401 1870847 1898545 1912156 1911414 1896450 1867686 1826257 1773971 1712712
62676 1712712 1644311 1570965 1495179 1418799 1342402 1266177 1191385 1120500 1055637 997020 943203
62665 943203 892715 845279 801546 762019 726572 694841 666657 641897 620080 600381 582097
62654 582097 565023 549419 535647 523838 513820 505287 497881 491051 484017 476227 467923 460024 453333
62641 453333 448052 444051 441127 438791 436272 433312 430738 429714 430446 432049 433602 434800 435577 435774 435458
62626 435458 435078 434992 435128 435345 435664 435870 435440 434426 434068 435754 439467 443840 447770 451375 455339 460029
62610 460029 465596 472318 480206 488564 496591 504495 513546 524863 538425 553442 569490 587010 606781
62597 606781 629265 654574 682843 714248 748679 785732 825209 867314 911963 957962 1003200
$$ packed form
62688A653848O6455N9218N0880M0446K7698J3611p42j4964k8764m1429n2286o1259
62676A712712o8401p3346p5786p6380p6397p6225p4792p0885o4863n8617n3817
62665I43203n0488m7436m3733l9527l5447l1731k8184k4760k1817j9699j8284
62654E82097j7074j5604j3772j1809j0018q533p406o830p034p790q304p899o691
62641D53333n281m001k924k336k519k960k574j024P32J603J553J198P77J97l16
62626D35458l80q6J36K17L19K06m30j014l58J686L713M373L930L605L964M690
62610D60029N567O722P888Q358Q027P904R051J1317J3562J5017J6048J7520J9771
62597F06781K2484K5309K8269L1405L4431L7053L9477M2105M4649M5999M5238
$$ plain form
62586 1003200 1045685 1084113 1117507 1144807 1165112 1177986 1183152 1180124 1168553 1148920 1122582 1091138
62574 1091138 1055926 1018007 978224 937210 895643 854563 815145 778041 743234 710631 680444
62563 680444 652790 627317 603634 581919 562741 546332 532349 520256 509569 499805 490602 481975
62551 481975 474206 467467 461801 457376 454251 451801 448988 445527 442376 440620 440159 439978 439521 439248 439850
62536 439850 441406 443361 444939 445468 444751 443427 442712 443499 445788 449155 453599 459694 467985 478481 490708
62521 490708 504135 518573 534333 552083 572478 595833 622125 651280 683412 718753 757298
62510 757298 798555 841701 885949 930612 974680 1016570 1054557 1087498 1114936 1136553 1151766
62499 1151766 1159975 1161012 1155263 1143510 1126789 1106258 1083073 1058389 1033439 1009439 987370 967980
$$ packed form
62586A003200M2485L8428L3394K7300K0305J2874N166l028j1571j9633k6338l1444
62574A091138l5212l7919l9783m1014m1567m1080l9418l7104l4807l2603l0187
62563F80444k7654k5473k3683k1715j9178j6409j3983j2093j0687r764r203q627
62551D81975p769o739n666m425l125k450k813l461l151j756m61j81m57k73O02
62536D39850J556J955J578N29p17j324p15P87K289L367M444O095Q291J0496J2227
62521D90708J3427J4438J5760J7750K0395K3355K6292K9155L2132L5341L8545
62510G57298M1257M3146M4248M4663M4068M1890L7987L2941K7438K1617J5213
62499A151766Q209J037n749j1753j6721k0531k3185k4684k4950k4000k2069j9390
$$ plain form
62487 967980 952027 940200 932726 929330 929881 934902 945187 961088 982395 1008698 1039446 1073647
62475 1073647 1109786 1146040 1180390 1210801 1235942 1255788 1270897 1280843 1283848 1278346 1264402 1243146
62463 1243146 1215254 1180814 1140481 1095845 1048452 999169 948859 899026 851141 805721 762707
62452 762707 722558 686321 654597 626971 602667 581406 563492 549315 538802 531104 524862 519189
62440 519189 514529 512137 512584 515097 518483 522156 525947 529398 531820 532918 532870 531932 530313 528231 525557
62425 525557 521507 515293 507179 498442 490135 482296 474500 466755 459546 453264 447853 442852 437667 432094
62411 432094 426728 422540 419784 417566 414816 411425 408104 405347 402996 400798 398861 397427 396541 396216 396646
62396 396646 397962 399852 401692 403157 404565 406582 409599 413378 417177 420185 422050 423187 424553 426902
$$ packed form
62487I67980j5953j1827p474l396N51N021J0285J5901K1307K6303L0748L4201
62475A073647L6139L6254L4350L0411K5141J9846J5109R946L005n502j3944k1256
62463A243146k7892l4440m0333m4636m7393m9283n0310m9833m7885m5420m3014
62452G62707m0149l6237l1724k7626k4304k1261j7914j4177j0513p698o242n673
62440E19189m660k392M47K513L386L673L791L451K422J098m8r38j619k082k674
62425E25557m050o214q114q737q307p839p796p745p209o282n411n001n185n573
62411D32094n366m188k756k218k750l391l321k757k351k198j937j434q86l25M30
62396C96646J316J890J840J465J408K017L017L779L799L008J865J137J366K349
$$ plain form
62382 426902 430222 434003 438023 442569 447831 453480 459220 465417 472680 480912 489355 497748 506893 517759
62368 517759 530352 543913 558054 573293 590488 610084 632058 656374 683334 713524 747480
62357 747480 785423 827266 872915 922484 976125 1033471 1093124 1152677 1209447 1261396 1307486
62346 1307486 1347172 1379791 1404508 1420673 1428024 1426672 1417149 1400348 1377089 1347789 1312863 1273305
62334 1273305 1230517 1185622 1139460 1093271 1048698 1006830 967693 931013 897020 866075 837945
62323 837945 812058 788297 767000 748120 730849 714176 697540 680870 664199 647352 629986
62312 629986 611982 593787 576172 559563 543817 528782 514775 502264 491352 481857 473714 467012
62300 467012 461820 458193 456102 455090 454368 453613 453343 453973 454829 454761 453620 452455 452255 453144 454864 457308
$$ packed form
62382D26902L320L781M020M546N262N649N740O197P263Q232Q443Q393R145J0866
62368E17759J2593J3561J4141J5239J7195J9596K1974K4316K6960L0190L3956
62357G47480L7943M1843M5649M9569N3641N7346N9653N9553N6770N1949M6090
62346A307486L9686L2619K4717J6165P351j352r523j6801k3259k9300l4926l9558
62334A273305m2788m4895m6162m6189m4573m1868l9137l6680l3993l0945k8130
62323H37945k5887k3761k1297j8880j7271j6673j6636j6670j6671j6847j7366
62312F29986j8004j8195j7615j6609j5746j5035j4007j2511j0912r495q143o702
62300D67012n192l627k091j012p22p55k70O30Q56o8j141j165k00Q89J720K444
$$ plain form
62284 457308 460310 463481 466646 470057 473897 477927 481891 485980 490581 495858 501845 508665 516332 524531
62270 524531 532931 541657 551208 561923 573751 586592 600826 617400 637226 660439 686491 715199
62258 715199 747431 784334 826093 872013 921676 975206 1032326 1091880 1152591 1213448 1272824
62247 1272824 1327910 1375863 1415222 1445642 1466756 1478180 1480386 1474507 1461014 1439299 1408885 1370541
62235 1370541 1325909 1276448 1223046 1166394 1107450 1047733 989216 933675 881987 834266 790691
62224 790691 751781 717705 687767 660927 636613 614701 595008 577279 561546 548052 536726
62213 536726 527050 518589 511379 505686 501543 498657 496664 495342 494673 494793 495889 498096 501455 505923 511332
62198 511332 517384 523868 530928 538980 548270 558624 569655 581046 592495 603613 614176 624375
$$ packed form
62284D57308L002L171L165L411L840M030L964M089M601N277N987O820P667Q199
62270E24531Q400Q726R551J0715J1828J2841J4234J6574J9826K3213K6052K8708
62258G15199L2232L6903M1759M5920M9663N3530N7120N9554O0711O0857N9376
62247A272824N5086M7953L9359L0420K1114J1424K206n879j3493k1715l0414l8344
62235A370541m4632m9461n3402n6652n8944n9717n8517n5541n1688m7721m3575
62224G90691l8910l4076k9938k6840k4314k1912j9693j7729j5733j3494j1326
62213E36726r676q461p210n693m143k886j993j322o69J20J096K207L359M468N409
62198E11332O052O484P060Q052R290J0354J1031J1391J1449J1118J0563J0199
$$ plain form
62186 624375 634479 644310 653441 661964 670590 679651 688370 695566 700916 705097 708748 711810 714014 715621
62172 715621 717434 720332 725024 732157 742404 756458 774916 798094 825892 858007 894269 934508
62160 934508 977906 1022665 1066536 1107580 1144392 1175868 1201237 1220266 1233158 1240062 1240828 1235270
62148 1235270 1223469 1205707 1182273 1153578 1120473 1084261 1046252 1007372 968334 930103 893899
62137 893899 860637 830617 803938 780987 762145 747172 735299 725949 718919 713852 710084 707322
62125 707322 706015 706638 709007 712742 718073 725444 734386 743483 751667 758988 765794 771641 775504 776893
62111 776893 776358 774921 773305 771697 769928 767677 764540 760083 754011 746419 737861 729088 720670 713011
62097 713011 706604 702027 699566 699085 700393 703485 708220 713999 720120 726418 733285 741098 749876 759432
$$ packed form
62186F24375J0104R831R131Q523Q626R061Q719P196N350M181L651L062K204J607
62172G15621J813K898M692P133J0247J4054J8458K3178K7798L2115L6262M0239
62160I34508M3398M4759M3871M1044L6812L1476K5369J9029J2892O904P66n558
62148A235270j1801j7762k3434k8695l3105l6212l8009l8880l9038l8231l6204
62137H93899l3262l0020k6679k2951j8842j4973j1873r350p030n067l768k762
62125G07322j307O23K369L735N331P371Q942R097Q184P321O806N847L863J389
62111G76893n35j437j616j608j769k251l137m457o072p592q558q773q418p659
62097G13011o407m577k461m81J308L092M735N779O121O298O867P813Q778R556
$$ plain form
62083 759432 769548 779955 790489 801391 813170 826041 839835 854636 871163 890156 911531
62072 911531 934463 958136 982091 1006045 1029886 1053898 1078524 1103828 1129533 1155748 1183241
62061 1183241 1212727 1244090 1276443 1308580 1339152 1366801 1390609 1410354 1426065 1437447 1443986
62050 1443986 1445326 1441213 1431268 1415284 1393656 1367067 1335835 1300049 1260350 1218054 1174272 1129341
62038 1129341 1083335 1036842 991001 946995 905694 867502 832314 799764 769722 742423 718046
62027 718046 696404 677160 660087 644903 631086 618086 605604 593512 581682 570113 559060
62016 559060 548812 539409 530679 522371 514232 506252 499006 493442 489960 487910 486284 484703 483427 482684
62002 482684 482510 483089 484678 487093 489801 492655 496112 500419 504966 508784 511484 513340 514555 514871 513975
$$ packed form
62083G59432J0116J0407J0534J0902J1779J2871J3794J4801J6527J8993K1375
62072I11531K2932K3673K3955K3954K3841K4012K4626K5304K5705K6215K7493
62061A183241K9486L1363L2353L2137L0572K7649K3808J9745J5711J1382O539
62050A443986J340m113r945j5984k1628k6589l1232l5786l9699m2296m3782m4931
62038A129341m6006m6493m5841m4006m1301l8192l5188l2550l0042k7299k4377
62027G18046k1642j9244j7073j5184j3817j3000j2482j2092j1830j1569j1053
62016E59060j0248r403q730q308q139p980p246n564l482k050j626j581j276p43
62002D82684j74N79J589K415K708K854L457M307M547L818K700J856J215L16q96
$$ plain form
61987 513975 511915 508849 504594 498765 491411 483198 474866 466766 459158 452586 447501 443591 440044 436488
61973 436488 433187 430175 426923 423293 420248 418891 419042 419445 419277 418753 418271 417714 416920 416208 415972 416076 416158
61956 416158 416376 417370 419385 421785 423631 424691 425671 427444 430228 433719 437889 443245 450152 458300 467192
61941 467192 476893 487881 500404 514410 529957 547050 565071 582982 600274 617227 634061 650356
61929 650356 665539 679492 692361 704177 714994 724984 733972 741173 745788 747684 747144 744319 739353
61916 739353 732862 725767 718706 711985 706000 701371 698736 698703 701799 708106 717028 727762 739778 752533
61902 752533 765029 776269 785951 794076 799982 802527 801270 796732 789456 779567 767520 754392 740884
61889 740884 726715 711558 696055 681235 667391 654218 641748 630334 619827 609496 598849
$$ packed form
61987E13975k060l066m255n829p354q213q332q100p608o572n085l910l547l556
61973D36488l301l012l252l630l045j357J51M03j68n24m82n57p94p12k36J04Q2
61956D16158K18R94K015K400J846J060R80J773K784L491M170N356O907Q148Q892
61941D67192R701J0988J2523J4006J5547J7093J8021J7911J7292J6953J6834J6295
61929F50356J5183J3953J2869J1816J0817R990Q988P201M615J896n40k825m966
61916G39353o491p095p061o721n985m629k635l3L096O307Q922J0734J2016J2755
61902G52533J2496J1240R682Q125N906K545j257m538p276r889j2047j3128j3508
61889G40884j4169j5157j5503j4820j3844j3173j2470j1414j0507j0331j0647
$$ plain form
61878 598849 587974 577095 566297 555733 545580 535701 525770 515845 506415 497854 490259 483882 479209
61865 479209 476421 475148 474956 475749 477601 480580 484931 491105 499424 509904 522448 536836 552582 569323
61851 569323 587490 608048 631391 656959 684106 712633 742079 771235 799015 825338 850451
61840 850451 873728 893864 909978 921811 929089 931532 929567 924383 917243 909205 901357 894564 888938
61827 888938 884280 881170 881008 884743 892117 902256 914354 927499 940468 952158 961811 968478 970737
61814 970737 967378 958144 943574 924448 901663 876240 848988 820325 790637 760620 731087 702688
61802 702688 675999 651545 629548 609903 592530 577330 563690 550633 537800 525825 515365
61791 515365 506218 497815 490075 483218 477144 471581 466583 462298 458441 454587 450758 447253 444077 441011
$$ packed form
61878E98849j0875j0879j0798j0564j0153r879r931r925r430q561p595o377m673
61865D79209k788j273j92P93J852K979M351O174Q319J0480J2544J4388J5746J6741
61851E69323J8167K0558K3343K5568K7147K8527K9446K9156K7780K6323K5113
61840H50451K3277K0136J6114J1833P278K443j965n184p140q038p848o793n626
61827H88938m658l110j62L735P374J0139J2098J3145J2969J1690R653O667K259
61814I70737l359r234j4570j9126k2785k5423k7252k8663k9688l0017k9533k8399
61802G02688k6689k4454k1997j9645j7373j5200j3640j3057j2833j1975j0460
61791E15365r147q403p740o857o074n563m998m285l857l854l829l505l176l066
$$ plain form
61777 441011 437984 434913 431490 427814 424981 424237 425520 427506 429030 429839 429996 429480 428625 428197 428556 429241
61761 429241 429736 430285 431547 433715 436323 438797 441061 443617 447052 451288 455407 458447 460252 461277 461800
61746 461800 461779 461247 460237 458439 455647 452609 450618 450062 450012 449480 448402 447066 445367 443215 441166 439946
61730 439946 439679 440092 441228 443347 446241 449161 451479 453147 454547 456101 457999 460168 462547 465363 468826
61715 468826 472528 475579 477560 478958 480393 481808 482710 482845 482276 481094 479459 477658 475773 473523 470760
61700 470760 467808 464934 461788 457911 453549 449475 446082 443140 440385 437840 435553 433428 431399 429495
61686 429495 427689 425888 424085 422366 420890 419943 419745 420016 420038 419444 418614 417969 417262 416102 414808 414098 414125
61669 414125 414466 414862 415240 415155 414113 412556 411676 411964 412640 412888 412925 413328 413924 414040 413522 412887 412616 412842 413553
$$ packed form
61777D41011l027l071l423l676k833p44J283J986J524Q09J57n16q55m28L59O85
61761D29241M95N49J262K168K608K474K264K556L435M236M119L040J805J025N23
61746D61800k1n32j010j798k792l038j991n56n0n32j078j336j699k152k049j220
61730D39946k67M13J136K119K894K920K318J668J400J554J898K169K379K816L463
61715D68826L702L051J981J398J435J415R02J35n69j182j635j801j885k250k763
61700D70760k952k874l146l877m362m074l393k942k755k545k287k125k029j904
61686D29495j806j801j803j719j476r47j98K71K2n94q30o45p07j160j294p10K7
61669D14125L41L96L78q5j042j557q80K88O76K48L7M03N96J16n18o35k71K26P11
$$ plain form
61650 413553 414619 415624 416204 416619 417598 419479 421782 423788 425280 426522 427719 428875 430194 432250 435369
61635 435369 438895 441446 442142 441347 440010 438542 436692 434328 431767 429314 426939 424605 422520 420796 419158
61620 419158 417302 415340 413698 412633 412023 411464 410435 408623 406300 404234 402970 402234 401182 399131 395904
61605 395904 391639 386537 380832 374828 368921 363520 358817 354580 350369 346088 342153 338969 336386 333834
61591 333834 330855 327360 323540 319753 316402 313656 311357 309341 307673 306347 304963 303110 301011 299397
61577 299397 298632 298304 297765 296797 295567 294268 293023 291953 291024 289944 288450 286685 285072 283835 282834
61562 282834 281845 280807 279795 278979 278666 279099 280056 280846 281034 281038 281688 283168 284763 285766 286330 287146 288484
61545 288484 289913 290906 291350 291418 291247 290921 290630 290650 291219 292422 294091 295828 297271 298385 299310 299960 300103
$$ packed form
61650D13553J066J005N80M15R79J881K303K006J492J242J197J156J319K056L119
61635D35369L526K551O96p95j337j468j850k364k561k453k375k334k085j724j638
61620D19158j856j962j642j065o10n59j029j812k323k066j264p36j052k051l227
61605C95904m265n102n705o004n907n401m703m237m211m281l935l184k583k552
61591C33834k979l495l820l787l351k746k299k016j668j326j384j853k099j614
61577B99397p65l28n39r68j230j299j245j070r29j080j494j765j613j237j001
61562B82834r89j038j012q16l13M33R57P90J88MO50J480J595J003N64Q16J338
61545B88484J429R93M44O8j71l26k91K0N69J203J669J737J443J114R25O50J43
$$ plain form
61528 300103 299954 300305 301720 303741 305206 305315 304205 302636 301318 300438 299538 297903 295308 292355 289917
61513 289917 288356 287537 287368 287832 288521 288788 288557 288506 289094 289819 289789 288766 287264 285861 284893 284628 285163 286053
61495 286053 286495 286096 285336 285150 286129 288006 289768 290417 289936 289340 289464 289918 289699 288704 287908 287976 288494 288908
61477 288908 289501 290773 292410 293675 294559 295779 297571 299256 300164 300425 300598 300956 301449 302048 302742 303352 303622
61460 303622 303476 303102 302819 302851 303120 303306 303335 303638 304599 305815 306426 306292 306270 307034 308150 308824 309153 309960 311549
61441 311549 313302 314636 315771 317273 319196 321049 322406 323269 323863 324352 324825 325442 326410 327777 329281 330576
61425 330576 331670 333014 334984 337375 339600 341389 343037 344914 346926 348625 349718 350317 350782 351537 353025
61410 353025 355502 358672 361606 363304 363416 362296 360381 357806 354798 352159 350849 350997 351608 351447 350067
$$ packed form
61528C00103j49L51J415K021J465J09j110j569j318q80r00j635k595k953k438
61513B89917j561q19j69M64O89K67k31n1N88P25l0j023j502j403r68k65N35Q90
61495B86053M42l99p60j86R79J877J762O49m81n96J24M54k19r95p96O8N18M14
61477B88908N93J272J637J265Q84J220J792J685R08K61J73L58M93N99O94O10K70
61460C03622j46l74k83L2K69J86K9L03R61J216O11j34k2P64J116O74L29Q07J589
61441C11549J753J334J135J502J923J853J357Q63N94M89M73O17R68J367J504J295
61425C30576J094J344J970K391K225J789J648J877K012J699J093N99M65P55J488
61410C53025K477L170K934J698J12j120j915k575l008k639j310J48O11j61j380
$$ plain form
61395 350067 347967 345958 344618 344159 344469 345157 345674 345543 344597 343117 341715 340980 341111 341950 343267 344881
61379 344881 346470 347526 347721 347272 346862 347153 348344 350109 351930 353588 355267 357065 358591 359313 359243 358907
61363 358907 358609 358190 357603 357343 357991 359626 361861 364232 366392 368372 370835 374647 379868 385605 391259
61348 391259 397386 404740 412886 420572 427210 433233 439075 444634 449833 454902 459870 464395 468384 472241
61334 472241 476221 480033 483316 486044 488199 489530 489927 489626 488789 487343 485500 483873 482678 481284 479107
61319 479107 476560 474591 473590 473292 473486 474215 475448 477183 479818 483889 489410 495882 502901 510386 518415
61304 518415 527353 537920 550333 563398 575216 585035 593670 601805 608675 612951 614396 613920 612357
61291 612357 609852 606259 601471 595328 587768 579148 570089 560990 552040 543603 536089 529406 523083 517082
$$ packed form
61395C50067k100k009j340m59L10O88N17j31r46j480j402p35J31Q39J317J614
61379C44881J589J056J95m49m10K91J191J765J821J658J679J798J526P22p0l36
61363C58907k98m19n87k60O48J635K235K371K160J980K463L812N221N737N654
61348C91259O127P354Q146P686O638O023N842N559N199N069M968M525L989L857
61334D72241L980L812L283K728K155J331L97l01q37j446j843j627j195j394k177
61319D79107k547j969j001k98J94P29J233J735K635M071N521O472P019P485Q029
61304E18415Q938J0567J2413J3065J1818R819Q635Q135O870M276J445m76j563
61291F12357k505l593m788o143p560q620r059r099q950q437p514o683o323o001
$$ plain form
61277 517082 511985 508123 504990 501947 499160 497376 496980 497720 499300 501705 504869 508362 511634 514425 516909
61262 516909 519551 522834 526957 531836 537469 544106 551777 559871 567608 574849 581950 588824 594814 599663
61248 599663 604001 608426 612576 615643 617480 618556 619008 618369 616278 612924 608656 603678 598375 593585 590194
61233 590194 588462 587825 587299 586165 584530 583305 583439 585061 587454 589850 592099 594594 597818 601968 606828
61218 606828 611924 616909 621785 626671 631476 636094 640746 645718 650762 655155 658456 660857 662741 664296
61204 664296 665682 667096 668397 669118 669292 669943 672256 676411 681662 687494 694310 702956 713906 726976
61190 726976 741464 756399 770785 783782 794759 803302 809356 813273 815586 816746 817145 817189 817080 816587
61176 816587 815336 813340 811001 808559 805801 802410 798364 793844 788904 783438 777378 770730 763416 755227
$$ packed form
61277E17082n097l862l133l043k787j784l96P40J580K405L164L493L272K791K484
61262E16909K642L283M123M879N633O637P671Q094P737P241P101O874N990M849
61248E99663M338M425M150L067J837J076M52o39k091l354m268m978n303m790l391
61233E90194j732o37n26j134j635j225J34J622K393K396K249K495L224M150M860
61218F06828N096M985M876M886M805M618M652M972N044M393L301K401J884J555
61204F64296J386J414J301P21J74O51K313M155N251N832O816Q646J0950J3070
61190G26976J4488J4935J4386J2997J0977Q543O054L917K313J160L99M4j09m93
61176H16587j251j996k339k442k758l391m046m520m940n466o060o648p314q189
$$ plain form
61162 755227 745970 735597 724224 712091 699531 686894 674444 662390 650991 640502 630945 622075
61150 622075 613815 606663 601393 598237 596514 595223 593842 592356 590691 588432 585117 580576 574972 568783
61136 568783 562767 557631 553553 550153 547019 544156 541837 540281 539649 540211 542263 545873 550795 556630 563081
61121 563081 570233 578711 589379 602706 618438 635962 654853 674908 695855 717402 739565 762645
61109 762645 786702 811218 835426 858854 881384 902966 923501 942978 961381 978313 992915
61098 992915 1004412 1012634 1017780 1019780 1018188 1012842 1004311 993487 980839 966245 949490 930742 910574
61085 910574 889617 868176 846188 823636 801002 779142 758647 739490 721376 704205 688103
61074 688103 673275 659988 648415 638277 628961 620259 612694 606797 602344 598733 595810 593779 592504
$$ packed form
61162G55227r257j0373j1373j2133j2560j2637j2450j2054j1399j0489r557q870
61150F22075q260p152n270l156j723j291j381j486j665k259l315m541n604o189
61136E68783o016n136m078l400l134k863k319j556o32N62K052L610M922N835O451
61121E63081P152Q478J0668J3327J5732J7524J8891K0055K0947K1547K2163K3080
61109G62645K4057K4516K4208K3428K2530K1582K0535J9477J8403J6932J4602
61098I92915J1497Q222N146K000j592n346q531j0824j2648j4594j6755j8748k0168
61085I10574k0957k1441k1988k2552k2634k1860k0495j9157j8114j7171j6102
61074F88103j4828j3287j1573j0138r316q702p565n897m453l611k923k031j275
$$ plain form
61061 592504 591476 590515 590047 590716 593044 597299 603195 609822 616433 623246 630963 639646 648774 658368 669258
61046 669258 682023 696389 711919 728666 746848 766527 787910 811355 836742 863425 891166
61035 891166 920531 952008 985391 1020567 1058230 1099093 1142757 1188065 1234262 1281231 1328859
61024 1328859 1376942 1425735 1476149 1529463 1587156 1650869 1722143 1802126 1891581 1991121 2101710
61013 2101710 2225694 2367623 2533735 2730876 2966729 3250823 3593887 4006053 4497713
61004 4497713 5083616 5786050 6635515 7672005 8943526 10487981 12294219 14267609 16237324
60995 16237324 18010594 19435939 20435830 21009278 21229812 21241826 21227834 21335279 21602114
60986 21602114 21938589 22178490 22155622 21754553 20925958 19687950 18124090 16366449 14557948
$$ packed form
61061E92504j028r61m68O69K328M255N896O627O611O813P717Q683R128R594J0890
61046F69258J2765J4366J5530J6747J8182J9679K1383K3445K5387K6683K7741
61035H91166K9365L1477L3383L5176L7663M0863M3664M5308M6197M6969M7628
61024A328859M8083M8793N0414N3314N7693O3713P1274P9983Q9455R9540J10589
61013B101710J23984J41929J66112J97141K35853K84094L43064M12166M91660
61004D497713N85903P02434Q49465J036490J271521J544455J806238J973390J969715
60995A6237324J773270J425345R99891N73448K20534J2014j3992J07445K66835
60986B1602114L36475K39901k2868m01069q28595j238008j563860j757641j808501
$$ plain form
60977 14557948 12812918 11200325 9751646 8475777 7368037 6415174 5601078 4911148
60969 4911148 4332109 3849748 3448704 3114203 2833236 2594811 2390211 2212952 2058026
60960 2058026 1921400 1800337 1693326 1599003 1515547 1441528 1376612 1320636 1272305 1229413 1190017
60949 1190017 1152935 1117513 1083620 1051639 1021921 994372 968882 945768 925259 906785 889327
60938 889327 872298 855647 839391 823585 808562 794588 781315 768100 754847 742101 730301
60927 730301 719354 708948 698941 689364 680319 671936 664249 657105 650337 643964 638106 632842 628365
60914 628365 625014 622914 621748 621135 621102 621910 623619 626144 629621 634334 640299 647250 654997 663558 672928
60899 672928 683003 693780 705466 718331 732556 748100 764596 781436 798163 814780 831563
$$ packed form
60977A4557948j745030j612593j448679j275869j107740r52863q14096o89930
60969D911148n79039m82361m01044l34501k80967k38425k04600j77259j54926
60960B058026j36626j21063j07011r4323q3456p4019o4916n5976m8331m2892l9396
60949A190017l7082l5422l3893l1981k9718k7549k5490k3114k0509j8474j7458
60938H89327j7029j6651j6256j5806j5023j3974j3273j3215j3253j2746j1800
60927G30301j0947j0406j0007r577r045q383p687p144o768o373n858n264m477
60914F28365l351k100j166o13l3Q08J709K525L477M713N965O951P747Q561R370
60899F72928J0075J0777J1686J2865J4225J5544J6496J6840J6727J6617J6783
$$ plain form
60888 831563 848618 865720 882528 898881 914881 930634 945824 959672 971545 981527 990092 997285
60876 997285 1002642 1005885 1007134 1006341 1003090 997288 989497 980262 969532 957136 943416 929010 914360
60863 914360 899767 885410 870884 855327 838656 822147 807005 792737 777917 762322 747276
60852 747276 733787 721358 708935 696211 683527 671060 658652 646135 633465 620775 608455
60841 608455 596890 585970 575149 564099 552951 541805 530482 518977 507718 497071 486957
60830 486957 477308 468523 461046 454677 448776 443068 437852 433440 429710 426315 423056 419929 417034 414561
60816 414561 412784 411891 411814 412308 413198 414423 415801 416896 417366 417404 417617 418403 419599 420839 421967 422963 423776
60799 423776 424501 425555 427277 429387 431112 431843 431526 430499 429240 428197 427584 427300 427166 427142 427138 426745 425486
$$ packed form
60888H31563J7055J7102J6808J6353J6000J5753J5190J3848J1873R982Q565P193
60876I97285N357L243J249p93l251n802p791r235j0730j2396j3720j4406j4650
60863I14360j4593j4357j4526j5557j6671j6509j5142j4268j4820j5595j5046
60852G47276j3489j2429j2423j2724j2684j2467j2408j2517j2670j2690j2320
60841F08455j1565j0920j0821j1050j1148j1146j1323j1505j1259j0647j0114
60830D86957r649q785p477o369n901n708n216m412l730l395l259l127k895k473
60816D14561j777q93p7M94Q90J225J378J095M70L8K13P86J196J240J128R96Q13
60799D23776P25J054J722K110J725P31l17j027j259j043o13k84j34k4ml93j259
$$ plain form
60782 425486 423315 420579 417588 414411 410974 407071 402397 396955 391416 386710 383237 380748 378930 377709
60768 377709 376971 376395 375705 374816 373680 372301 370920 369884 369287 368997 368978 369185 369180 368359 366661 364675 362982
60751 362982 361838 361557 362579 364876 367745 370528 373158 375758 378178 380333 382583 385274 388120 390431
60737 390431 391733 391890 390931 389193 387363 385884 384454 382527 380144 377809 375719 373636 371414 369070 366299
60722 366299 362529 357735 352736 348385 344708 341150 337452 333965 331159 329034 327093 324796 322007 319033
60708 319033 316320 314192 312860 312399 312549 312752 312700 312675 313061 313640 313794 313438 313238 313701 314407 314502 313714 312540
60690 312540 311574 311030 310893 311165 311766 312434 312947 313438 314357 316158 318979 322605 326609 330569 334230 337561
60674 337561 340753 344203 348406 353610 359464 365088 369677 373086 375729 378034 380124 382004 383721 385243
$$ packed form
60782D25486k171k736k991l177l437l903m674n442n539m706l473k489j818j221
60768C77709p38n76o90q89j136j379j381j036n97k90j9K07nq21j698j986j693
60751C62982j144k81J022K297K869K783K630K600K420K155K250K691K846K311
60737C90431J302J57r59j738j830j479j430j927k383k335k090k083k222k344k771
60722C66299l770m794m999m351l677l558l698l487k806k125j941k297k789k974
60708C19033k713k128j332m61J50K03n2k5L86N79J54l56k00M63P06R5p88j174
60690C12540r66n44j37K72O01O68N13M91R19J801K821L626M004L960L661L331
60674C37561L192L450M203N204N854N624M589L409K643K305K090J880J717J522
$$ plain form
60660 385243 386396 387098 387447 387413 386737 385503 384604 385087 386930 388953 390119 390522 390891 391548 392364 393368 394730
60643 394730 396028 396194 394571 391755 389002 386814 384485 381075 376558 371761 367351 363237 359077 355053
60629 355053 351782 349517 347810 346097 344386 343151 342643 342527 342186 341241 339835 338530 337934 338237 339044 339670
60613 339670 339634 338895 337737 336584 335914 336153 337419 339300 341036 342127 342851 343959 345703 347325 347823 347178
60597 347178 346479 346750 348035 349781 351707 353901 356324 358731 360975 362990 364474 365015 364644 363899 363212 362531
60581 362531 361695 360847 360265 360023 360112 360725 362108 364198 366684 369442 372751 377059 382659 389561 397624 406773
60565 406773 417062 428338 439815 450263 458812 465443 470465 473748 474799 473478 470285 465934 461008
60552 461008 456027 451493 447669 444551 442213 441020 441406 443597 447592 453208 460101 468016 477085 487649
$$ packed form
60660C85243J153P02L49l4o76j234q99M83J843K023J166M03L69O57Q16J004J362
60643C94730J298J66j623k816k753k188k329l410m517m797m410m114m160m024
60629C55053l271k265j707j713j711j235n08j16l41r45j406j305n96L03Q07O26
60613C39670l6p39j158j153o70K39J266J881J736J091P24J108J744J622M98o45
60597C47178o99K71J285J746J926K194K423K407K244K015J484N41l71p45o87o81
60581C62531q36q48n82k42Q9O13J383K090K486K758L309M308N600O902Q063R149
60565D06773J0289J1276J1477J0448Q549O631N022L283J051j321l193m351m926
60552D61008m981m534l824l118k338j193L86K191L995N616O893P915R069J0564
$$ plain form
60538 487649 499668 512571 525704 538537 550317 560014 566971 571324 573472 573457 571283 567452 562654
60525 562654 557132 550925 544558 538892 534267 530386 527053 524436 522562 521175 520324 520478 521714 523266 524287
60510 524287 524780 525440 526877 529308 532745 537188 542871 550527 561143 575149 592138 611683 634161
60497 634161 660394 690725 724850 762305 802487 844200 885654 925060 960939 991702 1015267
60486 1015267 1029435 1032787 1025302 1008117 982730 950467 912721 871421 828793 786610 745953 707645
60474 707645 672413 640506 611697 585938 563574 544614 528334 514010 501530 490803 481043 471379
60462 471379 461897 453462 446648 441379 437341 434057 430753 426843 422512 418231 413942 409444 405384 402854
60448 402854 401848 401024 399288 396893 394654 392810 391134 389559 388197 387086 386309 385977 385775 384991 383389
$$ packed form
60538D87649J2019J2903J3133J2833J1780R697O957M353K148j5k174l831m798
60525E62654n522o207o367n666m625l881l333k617j874j387q51J54J236J552J021
60510E24287M93O60J437K431L437M443N683P656J0616J4006J6989J9545K2478
60497F34161K6233L0331L4125L7455M0182M1713M1454L9406L5879L0763K3565
60486A015267J4168L352p485j7185k5387l2263l7746m1300m2628m2183m0657l8308
60474G07645l5232l1907k8809k5759k2364j8960j6280j4324j2480j0727r760r664
60462D71379r482q435o814n269m038l284l304l910m331m281m289m498m060k530
60448D02854j006q24j736k395k239j844j676j575j362j111p77l32k02p84j602
$$ plain form
60433 383389 381704 380837 380799 380772 379992 378331 376307 374761 374268 374590 374920 374808 374532 374453 374531 374742 375452 376914
60415 376914 378755 380418 381811 383061 383947 384168 384063 384527 386092 388408 390656 392242 393041 393206 392842 392005
60399 392005 391074 390913 392222 394722 397428 399840 402363 405351 408368 410810 412805 414955 417438 419898 422031
60384 422031 423950 426071 428870 432516 436546 440237 443498 446957 450941 454992 458791 462873 467718 472757
60370 472757 477113 480912 484901 489015 492374 494645 496461 498336 500053 501312 502242 503017 503618 504221 505198
60355 505198 506488 507662 508892 511241 515565 521619 528610 536148 544220 552652 561054 569059 576240 581988
60341 581988 585753 587249 586363 583270 578833 574378 570617 567075 562916 558031 552995 548249 543757 539226
60327 539226 534251 528432 521746 514751 508092 501981 496421 491677 488041 485227 482518 479586 476830 474871
$$ packed form
60433C83389j685q67l8k7p80j661k024j546m93L22L30j12k76p9P8K11P10J462
60415C76914J841J663J393J250Q86K21j05M64J565K316K248J586P99J65l64q37
60399C92005r31j61J309K500K706K412K523K988L017K442J995K150K483K460K133
60384D22031J919K121K799L646M030L691L261L459L984M051L799M082M845N039
60370D72757M356L799L989M114L359K271J816J875J717J259R30P75O01O03R77
60355E05198J290J174J230K349M324O054O991P538Q072Q432Q402Q005P181N748
60341E81988L765J496q86l093m437m455l761l542m159m885n036m746m492m531
60327E39226m975n819o686o995o659o111n560m744l636k814k709k932k756j959
$$ plain form
60313 474871 474034 474412 476121 479354 484338 491273 500160 510718 522813 536944 553924 573835 595476
60300 595476 617001 636845 653816 666604 673835 674833 670052 660565 647326 631138 613049 594321
60288 594321 575963 558635 543065 530057 519760 511254 503347 495754 489119 483965 480111 477104 474714
60275 474714 472753 470861 468849 467001 465667 464707 463663 462398 461178 460093 458691 456362 453005 449247
60261 449247 446014 443826 442385 440887 438825 436458 434448 433125 432224 431250 429976 428612 427690 427703 428650 429894
60245 429894 430651 430730 430620 430792 431125 431202 431019 431071 431682 432556 433136 433263 433318 433785 434824 436224 437662 439040 440662
60226 440662 442932 445732 448300 449975 450986 452098 453562 454866 455655 456386 457807 460181 463398 467509 472637
60211 472637 478557 484784 491016 497144 502985 508493 514047 520008 526012 531315 535929 540791 546557 552760
$$ packed form
60313D74871q37L78J709L233M984O935Q887J0558J2095J4131J6980J9911K1641
60300E95476K1525J9844J6971J2788P231R98m781r487j3239j6188j8089j8728
60288E94321j8358j7328j5570j3008j0297q506p907p593o635n154l854l007k390
60275D74714j961j892k012j848j334r60j044j265j220j085j402k329l357l758
60261D49247l233k188j441j498k062k367k010j323r01r74j274j364r22J3R47J244
60245D29894P57P9j10J72L33P7j83N2O11Q74N80J27N5M67J039J400J438J378J622
60226D40662K270K800K568J675J011J112J464J304P89P31J421K374L217M111N128
60211D72637N920O227O232O128N841N508N554N961O004N303M614M862N766O203
$$ plain form
60197 552760 558521 563622 568425 573062 577281 580965 584311 587363 589759 591068 591307 591002 590777 590823 590719 589777
60181 589777 587541 583912 578954 572920 566531 560749 555934 551449 546433 540844 535488 531110 527780 525112
60167 525112 522748 520547 518533 516816 515477 514429 513418 512151 510460 508413 506355 504725 503691 503061
60153 503061 502621 502477 502853 503679 504602 505409 506214 507207 508420 509838 511561 513692 516142 518669 521164 523854
60137 523854 527182 531402 536261 541141 545607 549803 554150 558673 562776 565789 567706 569247 571187 573665
60123 573665 576135 577951 578928 579409 579899 580719 581925 583429 585159 587156 589504 592144 594742 596850 598263
60108 598263 599191 600033 600992 601880 602328 602175 601675 601227 600855 600049 598248 595473 592372 589607 587332 585278 583290
60091 583290 581680 581045 581756 583684 586481 589980 594076 598221 601479 603419 604663 606156 607977 609340 609695
$$ packed form
60197E52760N761N101M803M637M219L684L346L052K396J309K39l05k25M6j04r42
60181E89777k236l629m958o034o389n782m815m485n016n589n356m378l330k668
60167E25112k364k201k014j717j339j048j011j267j691k047k058j630j034o30
60153E03061m40j44L76Q26R23Q07Q05R93J213J418J723K131K450K527K495K690
60137E23854L328M220M859M880M466M196M347M523M103L013J917J541J940K478
60123E73665K470J816R77M81M90Q20J206J504J730J997K348K640K598K108J413
60108E98263R28Q42R59Q88M48j53n00m48l72q06j801k775l101k765k275k054j988
60091E83290j610o35P11J928K797L499M096M145L258J940J244J493J821J363L55
$$ plain form
60076 609695 609282 608417 606761 603707 599249 594038 588648 583011 576625 569131 560740 552140 543929 536093 528166
60061 528166 519918 511702 504027 497034 490614 484841 480004 476176 472977 469864 466654 463763 461881 461278
60047 461278 461508 461998 462857 464759 467961 471881 475859 479971 484679 489968 495316 500412 505384 510257 514642
60032 514642 518194 521126 523933 526649 528598 529000 527817 525814 523675 521213 517735 513105 508011 503010
60018 503010 497769 491658 484758 477877 471747 466695 462892 460278 458179 455578 452012 447872 443723 439730
60004 439730 435929 432574 429871 427651 425723 424334 423883 424246 424761 424862 424506 423988 423633 423685 424194 424866 425301
59987 425301 425556 426339 428348 431504 435051 438441 441798 445382 448895 451660 453404 454497 455353 455924 455927 455284
59971 455284 454163 452763 451236 449570 447473 444692 441690 439571 438903 438916 438462 437527 437146 437905 439278 440532
$$ packed form
60076F09695m13q65j656l054m458n211n390n637o386p494q391q600q211p836p927
60061E28166q248q216p675o993o420n773m837l828l199l113l210k891j882o03
60047D61278K30M90Q59J902L202L920L978M112M708N289N348N096M972M873M385
60032E14642L552K932K807K716J949M02j183k003k139k462l478m630n094n001
60018E03010n241o111o900o881o130n052l803k614k099k601l566m140m149l993
60004D39730l801l355k703k220j928j389m51L63N15J01l56n18l55N2N09O72M35
59987D25301K55P83K009L156L547L390L357L584L513K765J744J093Q56N71Lo43
59971D55284j121j400j527j666k097k781l002k119o68J3m54r35l81P59J373J254
$$ plain form
59955 440532 441469 442001 441834 441150 440996 442224 444311 445903 446408 446498 447164 448794 451107 453373 454721 454803 454359
59938 454359 454649 456132 458028 459259 459467 459018 458480 458277 458475 458638 458225 457347 456822 457225 458203 459046 459625 460447
59920 460447 461937 464017 466251 468186 469749 471569 474669 479525 485583 491937 498119 503840 508416 511179
59906 511179 512346 512778 512849 512193 510609 508541 506472 504529 502947 502229 502359 502475 501940 501377 501984 504061 506794
59889 506794 509377 511841 514765 518670 523658 529279 534709 539413 543627 547951 552624 557498 562551 567875
59875 567875 573223 578015 581840 584533 585781 585193 582860 579392 575258 570505 565260 560021 555201 550799
59861 550799 546799 543484 541021 539055 537069 534948 533020 531853 532254 534995 540082 546571 553557 561020
59847 561020 569168 577273 583919 588406 591215 592946 593599 593287 593048 594142 596604 599033 599919 598884 596502
$$ packed form
59955D40532R37N32j67o84j54J228K087J592N05R0O66J630K313K266J348Q2m44
59938D54359K90J483J896J231K08m49n38k03J98J63m13q78n25M03R78Q43N79Q22
59920D60447J490K080K234J935J563J820L100M856O058O354O182N721M576K763
59906E11179J167M32P1o56j584k068k069j943j582p18J30J16n35n63O07K077K733
59889E06794K583K464K924L905M988N621N430M704M214M324M673M874N053N324
59875E67875N348M792L825K693J248n88k333l468m134m753n245n239m820m402
59861E50799m000l315k463j966j986k121j928j167M01K741N087O489O986P463
59847E61020Q148Q105O646M487K809J731O53l12k39J094K462K429Q86j035k382
$$ plain form
59832 596502 593253 588986 583428 576908 570348 564531 559527 554913 550436 546311 542850 539935 536956 533348
59818 533348 529195 525233 522134 519783 517426 514535 511356 508542 506422 504804 503293 501586 499552 497299
59804 497299 495157 493392 491916 490392 488597 486532 484237 481709 478997 476231 473537 471106 469330 468594
59790 468594 468886 469753 470684 471314 471269 470216 468360 466596 465747 465667 465440 464476 463122 462127 461831 462043 462449 462797
59772 462797 462861 462547 462043 461628 461332 461067 461068 461792 463188 464435 464775 464475 464591 465872 468194 471012 473919 476712
59754 476712 479347 482096 485485 489762 494539 499155 503317 507215 511140 515186 519253 523157 526726 529953
59740 529953 533007 535988 538733 541069 543176 545463 548032 550495 552424 553801 554920 555959 556809 557267 557234
59725 557234 556809 556311 556172 556574 557164 557356 557038 556747 556982 557594 558172 558753 559642 560571 560691 559646 558133 557018
$$ packed form
59832E96502l249m267n558o520o560n817n004m614m477m125l461k915k979l608
59818E33348m153l962l099k351k357k891l179k814k120j618j511j707k034k253
59804D97299k142j765j476j524j795k065k295k528k712k766k694k431j776p36
59790D68594K92Q67R31O30m5j053j856j764q49q0k27r64j354r95k96K12M06L48
59772D62797O4l14n04m15k96k65JP24J396J247L40l00J16J281K322K818K907K793
59754D76712K635K749L389M277M777M616M162L898L925M046M067L904L569L227
59740E29953L054K981K745K336K107K287K569K463J929J377J119J039Q50M58l3
59725E57234m25m98j39M02N90J92l18k91K35O12N78N81Q89R29J20j045j513j115
$$ plain form
59707 557018 556359 555778 555418 555814 556975 558272 559325 560388 561728 563171 564519 566033 568168 571094 574629
59692 574629 578382 581759 584105 585067 584698 583231 581058 578952 577788 577783 578348 578860 579174 579174 578392 576615 574403
59675 574403 572363 570172 567003 562868 558741 555209 551642 547091 541598 536174 531683 528200 525389 523030
59661 523030 520960 518851 516529 514480 513572 514039 515103 515926 516657 518086 520470 523330 526359 529817 533795
59646 533795 537678 540708 542635 543523 543343 542146 540239 537792 534630 530799 526932 523600 520612 517482 514316
59631 514316 511709 509963 508933 508387 507984 507046 505036 502260 499559 497356 495447 493630 491879 489863 487003
59616 487003 483258 479336 475843 472574 468917 464681 460323 456551 453898 452519 452287 453057 454746 457091 459602
59601 459602 462003 464454 466982 469010 469969 470157 470320 470557 470346 469635 469120 469235 469620 469901 470380 471486 473013
$$ packed form
59707E57018o59n81l60L96J161J297J053J063J340J443J348J514K135K926L535
59692E74629L753L377K346R62l69j467k173k106j164nN65N12L14%p82j777k212
59675E74403k040k191l169m135m127l532l567m551n493n424m491l483k811k359
59661E23030k070k109k322k049r08M67J064Q23P31J429K384K860L029L458L978
59646E33795L883L030J927Q88j80j197j907k447l162l831l867l332k988l130l166
59631E14316k607j746j030n46m03r38k010k776k701k203j909j817j751k016k860
59616D87003l745l922l493l269l657m236m358l772k653j379k32P70J689K345K511
59601D59602K401K451K528K028R59J88J63K37k11p11n15J15L85K81M79J106J527
$$ plain form
59584 473013 474301 474890 474668 473725 472347 470874 469288 467184 464367 461159 457921 454628 451178 447823 444978
59569 444978 442844 441346 440234 439100 437710 436450 435934 435966 435479 433935 432246 431689 432290 432999 433206 433314
59553 433314 433874 434907 436261 437991 440058 442083 443778 445416 447555 450521 454413 459414 465700 473044
59539 473044 481034 489970 501256 516265 534600 553763 570707 583517 591557 594669 593016 587546 579918
59526 579918 571764 564339 558714 555608 554824 555482 557041 559604 563029 566420 568930 570525 571423 571290 569598
59511 569598 566418 562161 556772 549844 541435 532186 522717 513471 505072 498103 492374 486960 481227 475428
59497 475428 470147 465599 461683 458365 455691 453614 452078 451166 450997 451514 452445 453418 454147 454626 455098 455711
59481 455711 456345 457004 458168 460368 463412 466561 469520 472770 476695 480903 484782 488314 491809 495050 497342
$$ packed form
59584D73013J288N89k22r43j378j473j586k104k817l208l238l293l450l355k845
59569D44978k134j498j112j134j390j260n16L2m87j544j689n57O01P09K07J08
59553D33314N60J033J354J730K067K025J695J638K139K966L892N001O286P344
59539D73044P990Q936J1286J5009J8335J9163J6944J2810Q040L112j653n470p628
59526E79918q154p425n625l106p84O58J559K563L425L391K510J595Q98j33j692
59511E69598l180m257n389o928q409r249r469r246q399o969n729n414n733n799
59497D75428n281m548l916l318k674k077j536r12j69N17R31R73P29M79M72O13
59481D55711O34O59J164K200L044L149K959L250L925M208L879L532L495L241K292
$$ plain form
59466 497342 498457 499003 499722 500760 501867 502946 504108 505347 506529 507719 509316 511823 515551 520527 526532
59451 526532 533281 540669 548849 557902 567450 576682 584798 591260 595686 597763 597432 595018 591033 585924
59437 585924 580022 573576 566698 559446 552049 544966 538619 533179 528647 524946 521904 519434 517888 517928 519810
59422 519810 523107 527376 532824 540016 549213 560413 573721 589218 606779 626588 649455 675675
59410 675675 703500 729561 751072 766988 776966 780233 776242 765925 751662 736356 722992 714392
59398 714392 712168 715474 721184 725515 725520 719501 706949 688646 666603 643343 620834 599900 580552
59385 580552 562887 547561 535336 526280 519659 514598 510601 507520 505358 504163 503806 503825 503865 504268 505734
59370 505734 508191 510622 512364 514090 516929 520941 525122 528807 532423 536678 541538 546314 550609 554885
$$ packed form
59466D97342J115N46P19J038J107J079J162J239J182J190J597K507L728M976O005
59451E26532O749P388Q180R053R548R232Q116O462M426K077l31k414l985n109
59437E85924n902o446o878p252p397p083o347n440m532l701l042k470j546M0J882
59422E19810L297M269N448P192R197J1200J3308J5497J7561J9809K2867K6220
59410F75675K7825K6061K1511J5916R978L267l991j0317j4263j5306j3364q600
59398G14392k224L306N710M331No019j2552j8303k2043k3260k2509k0934j9348
59385E80552j7665j5326j2225r056o621n061l997l081k162j195l57J9M0M03J466
59370E05734K457K431J742J726K839M012M181L685L616M255M860M776M295M276
$$ plain form
59356 554885 560004 566289 573217 580148 587220 595245 604792 615758 627857 641058 655325 670342 685856
59343 685856 702015 719047 736790 754764 772432 789089 803802 815910 825515 833163 839053 842778
59331 842778 843677 841274 835535 826973 816425 804518 791471 777425 762710 747665 732533 717697
59319 717697 703654 690535 678109 666611 657011 649866 644198 638306 631659 625461 621342 619927 620727
59306 620727 622872 625770 629421 634445 641814 652319 665993 681650 697008 709667 718236 722351 721722
59293 721722 715908 705398 692194 678654 665986 654355 643927 635013 627484 620929 615360 611114 608073
59280 608073 605721 603980 603255 603501 604004 604450 605680 608957 614688 622101 629958 637509 644977 653179 662506
59265 662506 672271 681249 688669 694313 697941 699284 698669 696970 694638 691202 685942 678718 669934 660047
$$ packed form
59356E54885N119O285O928O931P072Q025R547J0966J2099J3201J4267J5017J5514
59343F85856J6159J7032J7743J7974J7668J6657J4713J2108R605P648N890L725
59331H42778Q99k403n739q562j0548j1907j3047j4046j4715j5045j5132j4836
59319G17697j4043j3119j2426j1498r600p145n668n892o647o198m119j415Q00
59306F20727K145K898L651N024P369J0505J3674J5657J5358J2659Q569M115o29
59293G21722n814j0510j3204j3540j2668j1631j0428q914p529o555n569m246l041
59280F08073k352j741p25K46N03M46J230L277N731P413P857P551P468Q202R327
59265F62506R765Q978P420N644L628J343o15j699k332l436n260p224q784r887
$$ plain form
59251 660047 649478 638832 628904 620388 613461 607632 602118 596637 591718 588060 585751 584406 583820 584079
59237 584079 585175 586978 589467 592523 595664 598469 601170 604216 607356 609807 611328 612402 613182 612963 611013
59222 611013 607406 602803 597919 593380 589518 585906 581624 576314 570651 565481 561011 557150 554163 552378
59208 552378 551506 550732 549431 547545 545451 543660 542481 541805 541381 541305 541852 542796 543465 543807 544785 547202 550547
59191 550547 553642 556186 558980 562678 566988 571303 575581 580154 584901 589089 592182 594533 596913 599392
59177 599392 601128 601560 601477 602324 604560 607297 609634 611689 614054 616870 619970 623536 627939 633005 638044
59162 638044 642753 647745 653970 661707 670162 677936 683824 687296 688422 687584 685351 682381 679106 675500
59148 675500 671404 667051 662895 658829 654005 647784 640705 634157 629081 625166 621362 616995 612200 607360
$$ packed form
59251F60047j0569j0646r928q516o927n829n514n481m919l658k309j345n86K59
59237E84079J096J803K489L056L141K805K701L046L140K451J521J074P80k19j950
59222F11013l607m603m884m539l862l612m282n310n663n170m470l861k987j785
59208E52378q72p74j301j886k094j791j179o76m24p6N47R44O69L42R78K417L345
59191E50547L095K544K794L698M310M315M278M573M747M188L093K351K380K479
59177E99392J736M32q3Q47K236K737K337K055K365K816L100L566M403N066N039
59162F38044M709M992O225P737Q455P774N888L472J126q38k233k970l275l606
59148F75500m096m353m156m066m824o221p079o548n076l915l804m367m795m840
$$ plain form
59134 607360 602545 597822 593790 591130 589510 587628 584771 581789 579979 579520 579647 579932 580491 581212 581856 582950
59118 582950 585601 590115 595603 601229 607091 613495 620045 626038 631380 636703 642800 650030 657868 664997
59104 664997 670463 674852 679680 685445 691015 695189 698067 700403 702443 704016 705175 706060 706591 706850 707281
59089 707281 707971 708191 707260 705437 703406 701358 699175 696961 694616 691327 686338 680020 673413 666887 659969
59074 659969 652227 643631 634250 624429 615185 607607 601782 596847 592089 587398 582801 578296 574170 570786
59060 570786 567929 564952 561601 558131 554635 550928 547171 543916 541349 539056 536742 534622 532900 531428
59046 531428 530080 528980 528124 527251 526338 525765 525767 526144 526710 527565 528682 529644 530096 530106 529912 529778 530277 532187
59028 532187 535650 539873 544077 548437 553702 560324 568380 577932 588861 600490 612045 623370 634645
$$ packed form
59134F07360m815m723m032k660j620j882k857k982j810m59J27K85N59P21O44J094
59118E82950K651M514N488N626N862O404O550N993N342N323O097P230P838P129
59104F64997N466M389M828N765N570M174K878K336K040J573J159Q85N31K59M31
59089G07281O90K20r31j823k031k048k183k214k345l289m989o318o607o526o918
59074F59969p742q596r381r821r244p578n825m935m758m691m597m505m126l384
59060E70786k857k977l351l470l496l707l757l255k567k293k314k120j722j472
59046E31428j348j100q56q73r13n73KL77N66Q55J117R62M52J0j94j34M99J910
59028E32187L463M223M204M360N265O622Q056R552J0929J1629J1555J1325J1275
$$ plain form
59015 634645 645527 655216 663419 670570 676846 681534 683806 683751 682262 680151 677807 675499 673561 672255
59001 672255 671845 672777 675406 679426 683950 688337 692652 697104 701313 704508 706379 707388 708211 709114 709923
58986 709923 710366 710320 709739 708465 706206 702885 698970 695224 691989 689048 686408 684879 685385 687878 691488
58971 691488 695737 701035 707845 715908 724638 733941 744203 755566 767477 778980 789409 798886 808104
58958 808104 817444 826307 833518 838346 840810 841064 838908 834084 826692 817122 805811 793244 779986 766597
58944 766597 753586 741342 729852 718670 707593 697285 688684 681840 675880 670078 664280 658364 652240
58931 652240 646660 642960 641383 640465 638831 636840 635667 635375 634990 634108 633363 633291 633646 633870 633515 632133 629534
58914 629534 626379 623916 622828 622663 622609 622479 622844 624436 627563 631879 636675 641573 646925 653442 661534
$$ packed form
59015F34645J0882R689Q203P151O276M688K272n5j489k111k344k308j938j306
59001F72255m10R32K629M020M524M387M315M452M209L195J871J009Q23R03Q09
58986G09923M43m6n81j274k259l321l915l746l235k941k640j529N06K493L610
58971F91488M249N298O810Q063Q730R303J0262J1363J1911J1503J0429R477R218
58958H08104R340Q863P211M828K464K54k156m824p392r570j1311j2567j3258j3389
58944G66597j3011j2244j1490j1182j1077j0308q601o844n960n802n798n916o124
58931F52240n580l700j577r18j634j991j173k92l85q82p45p2L55K24l55j382k599
58914F29534l155k463j088j65n4j30L65J592L127M316M796M898N352O517Q092
$$ plain form
58899 661534 671116 681791 692934 703875 714342 724632 735166 746097 757567 769931 783322 797358
58887 797358 811757 826938 843455 861089 879058 896882 914346 930712 944828 956194 965359 972962
58875 972962 978722 981603 980733 976083 968403 958520 946688 932786 917306 901707 887445 874922 863714
58862 863714 853424 843752 834217 824599 815504 807633 800555 792948 784133 774594 764906 754936 744487 734070
58848 734070 724495 716019 708244 700638 692971 685399 678237 671552 665000 658309 651750 645754 640172 634407
58834 634407 628307 622376 617044 612149 607310 602425 597683 593386 589831 587034 584550 581961 579584 578324
58820 578324 578740 580620 583507 587207 591563 596109 600206 603469 606078 608753 612202 616293 619930 622160
58806 622160 623258 624260 625687 627283 628869 630575 632084 632420 630978 628301 625413 622625 619347 614898
$$ packed form
58899F61534R582J0675J1143J0941J0467J0290J0534J0931J1470J2364J3391J4036
58887G97358J4399J5181J6517J7634J7969J7824J7464J6366J4116J1366R165P603
58875I72962N760K881q70m650p680r883j1832j3902j5480j5599j4262j2523j1208
58862H63714j0290r672r535r618r095p871p078p607q815r539r688r970j0449j0417
58848G34070r575q476p775p606p667p572p162o685o552o691o559n996n582n765
58834F34407o100n931n332m895m839m885m742m297l555k797k484k589k377j260
58820E78324M16J880K887L700M356M546M097L263K609K675L449M091L637K230
58806F22160J098J002J427J596J586J706J509L36j442k677k888k788l278m449
$$ plain form
58792 614898 609284 603265 597765 593163 589221 585720 582938 581171 580118 579283 578842 579622 582155 586207 591182
58777 591182 596546 601888 607067 612289 617557 622067 624685 625041 623624 620795 616370 610280 602968 594879
58763 594879 586124 577003 568352 560997 555065 550055 545381 540775 536484 533178 531452 531362 532644 535137 538596
58748 538596 542225 545038 546706 547592 548130 548728 550148 553110 557421 562140 566757 571566 576740 581864 586654
58733 586654 591458 596663 602197 607894 613802 619820 625583 631028 636486 641948 646824 650770 654168 657410
58719 657410 660351 662981 666110 670764 677101 684352 691580 698241 704421 710821 718156 726133 733397 738752
58705 738752 742119 743931 744106 742103 737697 731174 722838 712717 700694 686754 671200 654725 638081
58692 638081 621694 605874 591352 579036 569091 560769 553335 546689 540821 535209 529199 522616 515706
$$ packed form
58792F14898n614o019n500m602l942l501k782j767j053q35m41P80K533M052M975
58777E91182N364N342N179N222N268M510K618L56j417k829m425o090p312q089
58763E94879q755r121q651p355n932n010m674m606m291l306j726r0J282K493L459
58748E38596L629K813J668Q86N38N98J420K962M311M719M617M809N174N124M790
58733E86654M804N205N534N697N908O018N763N445N458N462M876L946L398L242
58719F57410K941K630L129M654O337P251P228O661O180O400P335P977P264N355
58705G38752L367J812J75k003m406o523q336j0121j2023j3940j5554j6475j6644
58692F38081j6387j5820j4522j2316r945q322p434o646n868n612o010o583o910
$$ plain form
58679 515706 508762 502152 496407 491968 488986 487473 487344 488170 489265 490246 491340 493126 496235 501176 507970
58664 507970 515968 524493 533598 543587 553859 562942 569655 573517 574148 571375 566192 560481 555264 550036
58650 550036 544213 538230 532635 527133 521437 516264 512478 509830 507460 505263 503827 503352 503449 503836 504500
58635 504500 505312 506122 507084 508291 509229 509140 507868 505940 503923 502048 500285 498476 496611 495165 494788 495494
58619 495494 496670 498225 501064 505870 511979 518235 524541 531807 540499 549876 558595 565610 570678 574464
58605 574464 578037 581865 585393 587837 589088 589554 589523 589098 588389 587273 585267 582072 578041 573822 569867
58590 569867 566597 564562 563901 564053 564519 565665 568320 572827 578884 586033 593901 602235 611006 620206 629286
58575 629286 637225 643535 648837 654193 660296 667489 675919 685305 695253 706212 719387 735167 752441
$$ packed form
58679E15706o944o610n745m439k982j513j29Q26J095R81J094J786L109M941O794
58664E07970P998Q525R105R989J0272R083O713L862O31k773n183n711n217n228
58650E50036n823n983n595n502n696n173l786k648k370k197j436m75R7L87O64
58635E04500Q12Q10R62J207R38q9j272j928k017j875j763j809j865j446l77P06
58619D95494J176J555K839M806O109O256O306P266Q692R377Q719P015N068L786
58605E74464L573L828L528K444J251M66l1m25p09j116k006l195m031m219l955
58590E69867l270k035o61J52M66J146K655M507O057P149P868Q334Q771R200R080
58575F29286P939O310N302N356O103P193Q430R386R948J0959J3175J5780J7274
$$ plain form
58562 752441 770190 789004 810168 833843 859091 885160 911638 937566 961398 981861 998261
58551 998261 1010203 1017748 1021652 1022778 1021387 1017527 1011778 1004988 997558 989641 981667 973861 965419 954973
58537 954973 941824 926170 908335 888537 867349 845747 824649 804793 786840 771101 757360
58526 757360 745419 735580 728165 722833 718892 715960 713809 711921 709810 707556 705545 703994 703077 703018 703465
58511 703465 703298 701783 699523 697634 696372 695212 693790 691963 689328 685577 681163 676913 673207 670041
58497 670041 667536 665671 663909 661780 659567 657826 656674 656124 656575 658185 660327 662502 665321 669731 675745
58482 675745 682786 690724 699573 708706 717579 726890 737893 750747 764579 778859 793490 807719 820173
58469 820173 830039 837186 841188 841305 837659 831547 824444 817273 810547 804490 799096 794667 792035 791678 793149
$$ packed form
58562G52441J7749J8814K1164K3675K5248K6069K6478K5928K3832K0463J6400
58551I98261J1942P545L904J126j391l860n749o790p430p917p974p806q442j0446
58537I54973j3149j5654j7835j9798k1188k1602k1098j9856j7953j5739j3741
58526G57360j1941r839p415n332l941k932k151j888k111k254k011j551r17n9M47
58511G03465j67j515k260j889j262j160j422j827k635l751m414m250l706l166
58497F70041k505j865j762k129k213j741j152n50M51J610K142K175K819M410O014
58482F75745P041P938Q849R133Q873R311J1003J2854J3832J4280J4631J4229J2454
58469H20173R866P147M002J17l646o112p103p171o726o057n394m429k632l57J471
$$ plain form
58454 793149 796189 801661 810234 820699 831040 840887 851363 862516 872363 878767 881082 879679 875051
58441 875051 867804 858662 848115 836665 825428 815734 808093 802322 798507 796945 797241 798515 800571 803875
58427 803875 808400 813562 819444 827001 836661 847524 858272 868251 877421 885812 893184 898898 902218 903073
58413 903073 902199 900081 896281 890467 883468 876449 869580 862457 855271 848434 841608 834384 827613 822803
58399 822803 820325 819278 818822 818589 818198 817702 818233 820957 825516 830556 835452 840289 844585 847428 848722
58384 848722 849117 849070 849074 850177 852766 855403 856523 856786 858081 860681 863378 866060 869953 875354 881236 887317
58368 887317 894483 902842 911232 919146 927452 936897 947470 959486 973529 989004 1004335 1018986 1033743
58355 1033743 1048793 1063144 1076168 1088058 1098532 1106776 1112935 1118046 1122329 1125160 1126811 1128450 1130441
$$ packed form
58454G93149L040N472Q573J0465J0341R847J0476J1153R847O404K315j403m628
58441H75051p247r142j0547j1450j1237r694p641n771l815j562K96J274K056L304
58427H03875M525N162N882P557R660J0863J0748R979R170Q391P372N714L320Q55
58413I03073q74k118l800n814o999p019o869p123p186o837o826p224o771m810
58399H22803k478j047m56k33l91m96N31K724M559N040M896M837M296K843J294
58384H48722L95m7MJ103K589K637J120K63J295K600K697K682L893N401N882O081
58368H87317P166Q359Q390P914Q306R445J0573J2016J4043J5475J5331J4651J4757
58355A033743J5050J4351J3024J1890J0474Q244O159N111M283K831J651J639J991
$$ plain form
58342 1130441 1132556 1135818 1141878 1150359 1159118 1167535 1177272 1189265 1202376 1215780 1230371 1246800 1264150
58329 1264150 1281584 1299471 1317888 1335762 1352304 1367692 1381682 1393358 1402867 1411582 1419928 1426896
58317 1426896 1432217 1437034 1441838 1445927 1449612 1454787 1462439 1471575 1481384 1492375 1504665 1517375 1530502
58304 1530502 1545170 1561269 1577172 1592659 1609639 1628934 1648793 1667757 1686632 1706385 1726412
58293 1726412 1746180 1766439 1787548 1808772 1830304 1853795 1879800 1906968 1934678 1964023 1995183
58282 1995183 2026527 2057438 2089311 2122599 2155722 2188133 2221484 2256390 2291151 2325248 2360901
58271 2360901 2399375 2439050 2479160 2522207 2570346 2622388 2676734 2734282 2795936 2860146 2925558
58260 2925558 2993467 3065108 3139088 3213956 3290662 3370040 3450454 3530416 3611041 3693566 3777072
$$ packed form
58342A130441K115L262O060Q481Q759Q417R737J1993J3111J3404J4591J6429J7350
58329A264150J7434J7887J8417J7874J6542J5388J3990J1676R509Q715Q346O968
58317A426896N321M817M804M089L685N175P652R136R809J0991J2290J2710J3127
58304A530502J4668J6099J5903J5487J6980J9295J9859J8964J8875J9753K0027
58293A726412J9768K0259K1109K1224K1532K3491K6005K7168K7710K9345L1160
58282A995183L1344L0911L1873L3288L3123L2411L3351L4906L4761L4097L5653
58271B360901L8474L9675M0110M3047M8139N2042N4346N7548O1654O4210O5412
58260B925558O7909P1641P3980P4868P6706P9378Q0414P9962Q0625Q2525Q3506
$$ plain form
58249 3777072 3860976 3947050 4036786 4129546 4225435 4326903 4435292 4549017 4667383 4792774
58239 4792774 4926854 5068409 5217375 5376930 5548850 5730984 5922283 6126030 6344943
58230 6344943 6577591 6823088 7084888 7366287 7666799 7986722 8330599 8702282 9101491
58221 9101491 9529264 9991720 10494361 11038248 11626242 12267186 12969314 13736017 14573484
58212 14573484 15496145 16519431 17654774 18918374 20338001 21945233 23769917 25850944
58204 25850944 28246151 31026266 34270123 38075763 42568268 47890039 54195640 61665369
58196 61665369 70511755 80967409 93291874 107816165 124980552 145332328 169492674
58189 169492674 198028284 231077209 267765347 305823800 341849885 372146207 393591871
$$ packed form
58249C777072Q3904Q6074Q9736R2760R5889J01468J08389J13725J18366J25391
58239D792774J34080J41555J48966J59555J71920J82134J91299K03747K18913
58230F344943K32648K45497K61800K81399L00512L19923L43877L71683L99209
58221I101491M27773M62456N02641N43887N87994O40944P02128P66703Q37467
58212A4573484R22661J023286J135343J263600J419627J607232J824684K081027
58204B5850944K395207K780115L243857L805640M492505N321771O305601P469729
58196F1665369Q846386J0455654J2324465J4524291J7164387K0351776K4160346
58189A69492674K8535610L3048925L6688138L8058453L6026085L0296322K1445664
$$ plain form
58182 393591871 404135801 402988829 390723960 369204252 341142884 309412352 276487631
58175 276487631 244235163 213925550 186293460 161630028 139937157 121077103 104842064
58168 104842064 90972168 79184551 69207425 60785581 53673680 47648950 42528256 38161646
58160 38161646 34416806 31180994 28369124 25915464 23760021 21850478 20149797 18630601
58152 18630601 17265420 16029736 14908994 13893739 12971401 12129491 11362014 10665217 10030653
58143 10030653 9448855 8915707 8428496 7979347 7559078 7164377 6795172 6448054 6118274
58134 6118274 5805500 5511755 5235907 4975341 4730694 4503788 4292903 4094808 3909552
58125 3909552 3738823 3581446 3434620 3297633 3170473 3050910 2936872 2829668 2731036 2639076
$$ packed form
58182C93591871J0543930j146972j2264869k1519708k8061368l1730532l2924721
58175B76487631l2252468l0309613k7632090k4663432k1692871j8860054j6235039
58168A04842064j3869896j1787617r977126q421844p111901o024730n120694m366610
58160C8161646l744840l235812k811870k453660k155443j909543j700681j519196
58152A8630601j365181j235684j120742j015255r22338q41910p67477o96797o34564
58143A0030653n81798n33148m87211m49149m20269l94701l69205l47118l29780
58134F118274l12774k93745k75848k60566k44647k26906k10885j98095j85256
58125C909552j70729j57377j46826j36987j27160j19563j14038j07204r8632r1960
$$ plain form
58115 2639076 2550832 2466657 2388104 2313699 2240996 2170993 2106270 2046168 1987864 1930967 1877218
58104 1877218 1826697 1778003 1731316 1687763 1646493 1605583 1565123 1526398 1488800 1450449 1411192
58093 1411192 1372297 1334007 1296055 1259746 1226907 1197396 1169941 1144535 1121767 1100881 1080843
58082 1080843 1062227 1045656 1029517 1011729 992730 974268 956334 937849 919368 902363 886568
58071 886568 870624 854705 840060 826472 812578 798219 784293 770884 757702 745681 735880 727315
58059 727315 718123 708359 699511 691684 683435 674074 664094 653650 642550 631493 621539 612629 604127
58046 604127 596288 589643 583610 577394 571483 566553 561776 556112 550435 546307 543282 539542 534633 529483
58032 529483 524184 517894 510677 503443 496201 488183 479471 470798 462060 452779 443693 436073 429703 423218
$$ packed form
58115B639076q8244q4175p8553p4405p2703p0003o4723o0102n8304n6897n3749
58104A877218n0521m8694m6687m3553m1270m0910m0460l8725l7598l8351l9257
58093A411192l8895l8290l7952l6309l2839k9511k7455k5406k2768k0886k0038
58082A080843j8616j6571j6139j7788j8999j8462j7934j8485j8481j7005j5795
58071H86568j5944j5919j4645j3588j3894j4359j3926j3409j3182j2021r801q565
58059G27315r192r764q848p827q249r361r980j0444j1100j1057r954q910q502
58046F04127p839o645o033o216n911m930m777n664n677m128l025l740m909n150
58032E29483n299o290p217p234p242q018q712q673q738r281r086p620o370o485
$$ plain form
58018 423218 416242 409554 403481 397776 392803 389128 386148 382675 378629 374736 371087 367563 365075 364515
58004 364515 364923 364551 363388 362798 363022 362956 362189 361337 360473 359136 357832 357633 358226 358191 357293 356796 357382 358370
57986 358370 359106 359505 359128 357311 354394 351414 348572 345413 342271 339936 337958 335020 331030 327220 324195
57971 324195 321515 319184 317760 316944 315859 314851 315131 316445 317083 316593 316494 317652 318895 319123 319085 319949 321405
57954 321405 322226 321714 319771 316528 312690 309449 307438 306368 305933 306187 306868 307416 308010 309617 312708 316879
57938 316879 321859 327839 334595 341522 348859 357691 368297 379479 389904 399124 406984 413142 417628
57925 417628 420881 422876 423077 421530 419007 415843 411684 406611 401325 395882 389436 381715 373607 365840
57911 365840 358149 350336 343098 337176 332550 329024 326669 325122 323314 320556 317216 313837 310384 306829
$$ packed form
58018D23218o976o688o073n705m973l675k980l473m046l893l649l524k488n60
58004C64515M08l72j163n90K24o6p67q52q64j337j304j99N93l5q98m97N86R88
57986C58370P36L99l77j817k917k980k842l159l142k335j978k938l990l810l025
57971C24195k680k331j424q16j085j008K80J314O38m90r9J158J243K28l8Q64J456
57954C21405Q21n12j943l243l838l241k011j070m35K54O81N48N94J607L091M171
57938C16879M980N980O756O927P337Q832J0606J1182J0425R220P860O158M486
57925D17628L253J995K01j547k523l164m159n073n286n443o446p721q108p767
57911C65840p691p813p238n922m626l526k355j547j808k758l340l379l453l555
$$ plain form
57897 306829 303722 301546 300070 298808 297568 296241 294739 293503 293431 294885 297325 300156 303336 306869 310396
57882 310396 313607 316550 319242 321497 323279 324693 325591 325786 325616 325590 325498 324647 322990 321158 319306 316772
57866 316772 313014 308134 302455 296390 290746 286333 283226 281070 279831 279361 278714 277152 275611 275741 277586
57851 277586 279716 281546 283804 286534 288555 289456 290386 292057 293509 293728 293077 292198 290818 288699 286598
57836 286598 285172 283871 281912 279463 276989 274311 271256 268447 266554 265482 265025 265475 266784 267995 268465
57821 268465 268889 270328 272944 276456 280961 286323 291462 295299 297873 299708 300612 299972 297694 294167 289798
57806 289798 285236 281329 278174 274917 271237 268198 266780 266377 265805 265092 265158 266256 267834 269467 270895
57791 270895 271564 271201 270539 270478 270786 270544 269596 268625 268028 267622 267326 267350 267837 269012 271421 275283 279799 283857
$$ packed form
57897C06829l107k176j476j262j240j327j502j236p2J454K440K831L180L533L527
57882C10396L211K943K692K255J782J414Q98J95j70k6r2q51j657j832j852k534
57866C16772l758m880n679o065n644m413l107k156j239m70o47j562j541J30J845
57851B77586K130J830K258K730K021R01R30J671J452K19o51q79j380k119k101
57836B86598j426j301j959k449k474k678l055k809j893j072m57M50J309J211M70
57821B68465M24J439K616L512M505N362N139L837K574J835R04o40k278l527m369
57806B89798m562l907l155l257l680l039j418m03n72p13O6J098J578J633J428
57791B70895O69l63o62o1L08k42r48r71n97m06k96K4M87J175K409L862M516M058
$$ plain form
57773 283857 287138 289917 292184 293829 295362 297430 299705 301116 301138 300058 298041 294829 290532 285949 281845
57758 281845 278391 275421 272816 270556 268826 268161 269164 271943 275945 280350 284567 288613 293074 298355
57744 298355 303872 308329 310921 311768 311116 308888 305309 301214 297214 293173 288965 285046 281727 278637 275578
57729 275578 273260 272418 272751 273439 274157 274874 275267 275204 275297 276120 277298 278162 278842 279839 280966 281619 281752 281741 281605
57710 281605 281156 280489 279523 277541 274152 270270 267176 265080 263593 263074 264171 266394 268582 270635 273416
57695 273416 276877 279732 281256 282112 282939 283161 281743 278312 273167 266929 260505 254718 249651 244925 240726
57680 240726 237926 237099 238191 241249 246718 254889 265799 279811 297608 319586 346085 378144 416862
57667 416862 461630 509680 557361 600747 634966 654806 657388 643857 617895 583311 543522 502093
$$ packed form
57773B83857L281K779K267J645J533K068K275J411K2j080k017l212m297m583m104
57758B81845l454k970k605k260j730o65J003K779M002M405M217M046M461N281
57744B98355N517M457K592Q47o52k228l579m095m000m041m208l919l319l090l059
57729B75578k318q42L33O88P18P17L93o3R3Q23J178Q64O80R97J127O53J33j1j36
57710B81605m49o67r66j982l389l882l094k096j487n19J097K223K188K053K781
57695B73416L461K855J524Q56Q27K22j418l431n145o238o424n787n067m726m199
57680B40726k800q27J092L058N469Q171J0910J4012J7797K1978K6499L2059L8718
57667D16862M4768M8050M7681M3386L4219J9840K582j3531k5962l4584l9789m1429
$$ plain form
57655 502093 462172 425382 392066 362495 337264 316619 300018 286398 274702 264389 255738 249359
57643 249359 245165 242146 239395 236879 234908 233389 232130 231451 231861 233371 235576 238173 240877 243090 244297
57628 244297 244753 245217 245988 246632 246705 246298 245674 244751 243184 240838 237974 235005 232170 229514 227123 225271
57612 225271 224194 223695 223124 221852 219752 217239 214972 213566 213407 214567 216772 219399 221619 222742 222595
57597 222595 221495 219820 217816 215849 214491 214014 213987 213737 213163 212808 213139 213967 214476 213759 211562 208788 206986
57580 206986 206977 208112 209178 209667 209761 209465 208555 207243 206214 205846 205940 206200 206456 206388 205711 204747 204175 204075 203843
57561 203843 203286 203080 203746 204766 205351 205669 206726 209179 212697 216348 219210 220701 220746 219737 218224 216608
57545 216608 215087 213615 211778 209049 205475 201954 199450 197948 196392 193695 189688 185068 180610 176558
$$ packed form
57655E02093l9921l6790l3316k9571k5231k0645j6601j3620j1696j0313q651o379
57643B49359m194l019k751k516j971j519j259o79M10J510K205K597K704K213J207
57628B44297M56M64P71O44P3m07o24r23j567k346k864k969k835k656k391j852
57612B25271j077m99n71j272k100k513k267j406j59J160K205K627K220J123j47
57597B22595j100j675k004j967j358m77k7k50n74l55L31Q28N09p17k197k774j802
57580B06986rJ135J066M89R4k96r10j312j029l68R4K60K56o8o77r64n72j00k32
57561B03843n57k06O66J020N85L18J057K453L518L651K862J491M5j009j513j616
57545B16608j521j472j837k729l574l521k504j502j556k697m007m620m458m052
$$ plain form
57531 176558 172770 169231 166159 163613 161318 159096 157219 156037 155348 154560 153470 152622 152784 154214 156451
57516 156451 158752 160776 162933 165912 169848 174217 178605 183139 187944 192654 196939 201096 205538 210027
57502 210027 214038 217589 221015 224156 226565 228372 230112 231689 232447 232337 232125 232184 231979 231164 230397 230563
57486 230563 231816 233840 236426 239239 241616 243295 244966 247452 250584 253431 255409 256639 257395 257732 257644
57471 257644 257169 256361 255452 254938 255205 256107 257182 258189 259218 260325 261286 261701 261293 260259 259401 259630 261105
57454 261105 262982 264212 264476 264243 264156 264555 265462 266751 268346 270281 272499 274651 276352 277677 279157 281182
57438 281182 283624 286138 288588 291081 293809 296896 300190 303146 305204 306341 307043 307777 308781 310284 312427
57423 312427 314879 317026 318679 320158 321562 322460 322498 321913 321171 320607 320633 321819 324374 327884 331777 335736
$$ packed form
57531A76558l788l539l072k546k295k222j877j182o89p88j090q48J62J430K237
57516A56451K301K024K157K979L936M369M388M534M805M710M285M157M442M489
57502B10027M011L551L426L141K409J807J740J577P58j10k12N9k05q15p67J66
57486B30563J253K024K586K813K377J679J671K486L132K847J978J230P56L37q8
57471B57644m75q08r09n14K67R02J075J007J029J107R61M15m08j034q58K29J475
57454B61105J877J230K64k33q7L99R07J289J595J935K218K152J701J325J480K025
57438B81182K442K514K450K493K728L087L294K956K058J137P02P34J004J503K143
57423C12427K452K147J653J479J404Q98L8n85p42n64K6J186K555L510L893L959
$$ plain form
57407 335736 339440 342440 344647 346553 348627 350882 353321 356289 359898 363590 366795 369702 372847 376259
57393 376259 379599 382888 386493 390543 394909 399633 404807 410081 414902 419372 424333 430389 437114 443435
57379 443435 448685 453149 457630 462561 467621 472275 476482 480535 484322 487329 489481 491411 493624 495906
57365 495906 497942 500058 502890 506669 511191 516083 520737 524523 527627 531174 535823 540667 544336 546879
57351 546879 549676 553637 558487 563830 569887 576759 583767 590092 595651 600910 606137 611184 615832 620088
57337 620088 624269 628913 634409 640604 646842 652489 657326 661589 665840 670642 676090 681761 687390 693336
57323 693336 699995 706976 713448 719252 725098 731646 738948 746798 754978 762986 770217 776750 783451 790885
57309 790885 798607 805914 812888 820138 827845 835646 843338 851153 859292 867654 876136 884851 893904 903211
$$ packed form
57407C35736L704L000K207J906K074K255K439K968L609L692L205K907L145L412
57393C76259L340L289L605M050M366M724N174N274M821M470M961O056O725O321
57379D43435N250M464M481M931N060M654M207M053L787L007K152J930K213K282
57365D95906K036K116K832L779M522M892M654L786L104L547M649M844L669K543
57351E46879K797L961M850N343O057O872P008O325N559N259N227N047M648M256
57337F20088M181M644N496O195O238N647M837M263M251M802N448N671N629N946
57323F93336O659O981O472N804N846O548P302P850Q180Q008P231O533O701P434
57309G90885P722P307O974P250P707P801P692P815Q139Q362Q482Q715R053R307
$$ plain form
57295 903211 912691 922391 932244 941866 950834 959129 967161 975360 983890 992793 1002191 1012224 1022888 1034077
57281 1034077 1045685 1057535 1069338 1080993 1092912 1105752 1119733 1134415 1149224 1163968 1178752
57270 1178752 1193616 1208484 1223331 1238239 1253362 1268842 1284621 1300344 1315657 1330553 1345109
57259 1345109 1358901 1371235 1382154 1392691 1403794 1415430 1427067 1438581 1450157 1461697 1472980
57248 1472980 1484191 1495672 1507322 1518852 1530537 1542997 1556190 1569264 1581640 1593637 1605751
57237 1605751 1617794 1629203 1639959 1650803 1662501 1675073 1687780 1699861 1711278 1722684 1734608
57226 1734608 1746942 1759381 1772039 1785219 1798718 1811842 1824169 1835940 1847703 1859888 1872688
57215 1872688 1885910 1898845 1910766 1921815 1933190 1946180 1961015 1976695 1991843 2005768 2018868
$$ packed form
57295I03211R480R700R853R622Q968Q295Q032Q199Q530Q903R398J0033J0664J1189
57281A034077J1608J1850J1803J1655J1919J2840J3981J4682J4809J4744J4784
57270A178752J4864J4868J4847J4908J5123J5480J5779J5723J5313J4896J4556
57259A345109J3792J2334J0919J0537J1103J1636J1637J1514J1576J1540J1283
57248A472980J1211J1481J1650J1530J1685J2460J3193J3074J2376J1997J2114
57237A605751J2043J1409J0756J0844J1698J2572J2707J2081J1417J1406J1924
57226A734608J2334J2439J2658J3180J3499J3124J2327J1771J1763J2185J2800
57215A872688J3222J2935J1921J1049J1375J2990J4835J5680J5148J3925J3100
$$ plain form
57204 2018868 2032104 2046086 2060755 2075879 2091451 2107353 2123006 2137892 2152238 2166729 2181579
57193 2181579 2196303 2210371 2223669 2236204 2247731 2257876 2266582 2274475 2282736 2292266 2302823 2313381
57181 2313381 2323534 2333988 2345273 2356708 2367452 2378021 2389704 2402767 2416408 2430350 2445222
57170 2445222 2461129 2477039 2492067 2506461 2520785 2534967 2548746 2562371 2576214 2590157 2603896
57159 2603896 2617419 2630819 2644112 2657591 2671820 2686883 2702114 2716835 2730796 2743686 2755102
57148 2755102 2765485 2776126 2787444 2797994 2806103 2811957 2817144 2822590 2827962 2832749 2836838 2840064 2842167
57135 2842167 2843334 2844062 2844361 2843666 2841608 2838378 2834339 2829718 2824579 2818695 2811666 2803709 2796132 2790410 2786985
57120 2786985 2785601 2786599 2791065 2799734 2812479 2828959 2849111 2872934 2900420 2931852 2967781 3008862
$$ packed form
57204B018868J3236J3982J4669J5124J5572J5902J5653J4886J4346J4491J4850
57193B181579J4724J4068J3298J2535J1527J0145Q706P893Q261R530J0557J0558
57181B313381J0153J0454J1285J1435J0744J0569J1683J3063J3641J3942J4872
57170B445222J5907J5910J5028J4394J4324J4182J3779J3625J3843J3943J3739
57159B603896J3523J3400J3293J3479J4229J5063J5231J4721J3961J2890J1416
57148B755102J0383J0641J1318J0550Q109N854N187N446N372M787M089L226K103
57135B842167J167P28K99o95k058l230m039m621n139n884p029p957p577n722l425
57120B786985j384R98M466Q669J2745J6480K0152K3823K7486L1432L5929M1081
$$ plain form
57108 3008862 3056315 3112338 3179402 3259305 3353746 3465696 3599407 3759377 3950654 4180294
57098 4180294 4457125 4789386 5183467 5645353 6182130 6801074 7507501 8303377 9186420
57089 9186420 10149199 11179560 12263051 13385629 14535024 15700573 16870557 18026321
57081 18026321 19137469 20164892 21069642 21815643 22361828 22658736 22666220 22382849 21856400
57072 21856400 21160070 20354842 19470682 18515678 17494956 16420150 15307623 14174430 13037537
57063 13037537 11915026 10826558 9792046 8829061 7950225 7162011 6465120 5855609 5326263
57054 5326263 4868283 4472837 4131613 3836633 3580407 3356558 3159961 2986232 2831408
57045 2831408 2692134 2565684 2449741 2342605 2243564 2152310 2067724 1987855 1911500 1839152
$$ packed form
57108C008862M7453N6023O7064P9903R4441J11950J33711J59970J91277K29640
57098D180294K76831L32261L94081M61886N36777O18944P06427P95876Q83043
57089I186420R62779J030361J083491J122578J149395J165549J169984J155764
57081A8026321J111148J027423R04750P46001N46185K96908P484k83371n26449
57072B1856400o96330q05228q84160r55004j020722j074806j112527j133193j136893
57063A3037537j122511j088468j034512r62985q78836p88214o96891o09511n29346
57054E326263m57980l95446l41224k94980k56226k23849j96597j73729j54824
57045B831408j39274j26450j15943j07136r9041r1254q4586p9869p6355p2348
$$ plain form
57035 1839152 1771821 1709334 1650532 1594878 1543285 1497523 1459403 1430155 1409383 1393893 1377961
57024 1377961 1355312 1321082 1272427 1208456 1130628 1043211 952482 864546 783265 709745 643427
57013 643427 583578 529948 482489 440980 405091 374514 348703 326647 307289 290167 275336
57002 275336 262658 251586 241754 233321 226400 220453 214663 208780 203214 198320 194038 190408 188012 187521
56988 187521 188924 191590 195136 199844 205992 213045 219846 225464 229393 230944 229122 223534 215099 205352
56974 205352 195182 184686 174118 164319 156022 149295 144023 140509 139073 139259 140119 141477 144554 151002
56960 151002 161457 175215 191088 208094 225230 241042 253916 262738 266944 266074 259936 249494
56948 249494 237081 225107 214577 205129 196320 188436 182107 177646 174971 173963 174815 178120 184503 194003
$$ packed form
57035A839152o7331o2487n8802n5654n1593m5762l8120k9248k0772j5490j5932
57024A377961k2649l4230m8655o3971p7828q7417r0729q7936q1281p3520o6318
57013F43427n9849n3630m7459m1509l5889l0577k5811k2056j9358j7122j4831
57002B75336j2678j1072r832q433o921n947n790n883n566m894m282l630k396m91
56988A87521J403K666L546M708O148P053O801N618L929J551j822n588q435r747
56974B05352j0170j0496j0568r799q297o727n272l514j436J86Q60J358L077O448
56960A51002J0455J3758J5873J7006J7136J5812J2874Q822M206q70o138j0442
56948B49494j2413j1974j0530r448q809p884o329m461k675j008Q52L305O383R500
$$ plain form
56934 194003 206034 220242 237070 256877 278470 299072 315798 326771 331009 328169 318842 304509
56922 304509 286722 266654 245639 225408 207163 190827 175797 162044 149874 139029 128923
56911 128923 119713 112307 107137 103548 100583 97871 95461 93267 91096 89013 87332 86262 85702 85420 85470
56896 85470 86462 89252 94185 100837 108761 118270 130093 144442 161007 179752 200889 223711 246015
56883 246015 265246 279915 289621 294163 293483 288486 281258 274007 267851 262739 258344 254835 252878 253113
56869 253113 255824 261152 269543 281811 298814 321174 349329 383519 423456 467960 514872 561090
56857 561090 602603 635050 655035 661294 654610 636877 610673 579537 547617 518155 492351 470137
56845 470137 451909 439018 432750 433591 441694 457417 481058 512652 552655 602404 663034 733690
$$ packed form
56934A94003J2031J4208J6828J9807K1593K0602J6726J0973M238k840r327j4333
56922C04509j7787k0068k1015k0231j8245j6336j5030j3753j2170j0845j0106
56911A28923r210p406n170l589k965k712k410k194k171k083j681j070n60k82N0
56896H5470R92K790M933O652P924R509J1823J4349J6565J8745K1137K2822K2304
56883B46015J9231J4669R706M542o80m997p228p251o156n112m395l509j957K35
56869B53113K711N328Q391J2268J7003K2360K8155L4190L9937M4504M6912M6218
56857E61090M1513L2447J9985O259o684j7733k6204l1136l1920k9462k5804k2214
56845D70137j8228j2891o268Q41Q103J5723K3641L1594M0003M9749O0630P0656
$$ plain form
56833 733690 810858 888954 960970 1019179 1056908 1070813 1061481 1031892 985887 928186 864608 800862
56821 800862 740814 686231 637940 596699 563116 537470 519875 510342 508716 515019 529973 554856
56809 554856 590549 636531 690259 746883 799660 841651 867930 876544 867716 842769 804115 755648
56797 755648 702197 648109 596262 548250 505108 467668 436423 411363 392163 378514 370260 367339
56785 367339 369885 378411 393526 415058 441408 469813 497118 520174 535977 542176 537951 524225
56773 524225 502896 475940 445165 412398 379424 347663 318032 291082 267130 246239 228196
56762 228196 212657 199295 187791 177692 168439 159711 151663 144660 138734 133541 128873 124949 121989
56749 121989 119775 117925 116442 115632 115499 115540 115200 114346 113304 112606 112621 113147 113395 112667 111134 109731 109218
$$ packed form
56833G33690P7168P8096P2016N8209L7729J3905r332k9589m6005n7701o3578o3746
56821H00862o0048n4583m8291m1241l3583k5646j7595r533j626O303J4954K4883
56809E54856L5693M5982N3728N6624N2777M1991K6279Q614q828k4947l8654m8467
56797G55648n3451n4088n1847m8012m3142l7440l1245k5060j9200j3649q254k921
56785C67339K546Q526J5115K1532K6350K8405K7305K3056J5803O199m225j3726
56773E24225k1329k6956l0775l2767l2974l1761k9631k6950k3952k0891j8043
56762B28196j5539j3362j1504j0099r253q728q048p003n926n193m668l924k960
56749A21989k214j850j483q10j33M1l40q54j042o98J5N26K48p28j533j403n13
$$ plain form
56732 109218 109557 110161 110477 110252 109611 109103 109413 110758 112609 114250 115521 116865 118724 121060 123499 125758
56716 125758 127819 129754 131481 132753 133302 132923 131517 129308 127091 125954 126411 127875 129189 129712 129711 129737
56700 129737 129880 129768 129139 128252 127712 127909 128693 129566 130088 129963 128947 127047 124846 123109 121867 120384 118346
56683 118346 116642 116331 117157 117795 117483 116741 116430 116751 117384 118005 118356 118212 117620 116883 116089 114978 113510 112221
56665 112221 111701 111976 112724 113851 115445 117331 119141 120909 123261 126733 130978 134864 137501 139108 140714
56650 140714 142962 145454 147420 148709 149728 150629 151149 151328 151818 153133 154961 156560 157698 158891 160689
56635 160689 162922 164723 165408 165283 165359 166104 166781 166347 164693 162475 159939 156693 152665 148465 144521 140520
56619 140520 136180 131975 128546 125826 123324 120955 118993 117372 115631 113595 111644 110195 109238 108476 107743
$$ packed form
56732A09218L39O04L16k25o41n08L10J345J851J641J271J344J859K336K439K259
56716A25758K061J935J727J272N49l79j406k209k217j137M57J464J314N23jK6
56700A29737J43j12o29q87n40J97P84Q73N22j25j016j900k201j737j242j483k038
56683A18346j704l11Q26O38l12p42l11L21O33O21L51j44n92p37p94j111j468j289
56665A12221n20K75P48J127J594J886J810J768K352L472M245L886K637J607J606
56650A40714K248K492J966J289J019R01N20J79M90J315J828J599J138J193J798
56635A60689K233J801O85j25P6P45O77m34j654k218k536l246m028m200l944m001
56619A40520m340m205l429k720k502k369j962j621j741k036j951j449r57p62p33
$$ plain form
56604 107743 107194 107167 107852 109052 110338 111434 112275 112773 112838 112752 113112 114155 115408 116231 116531 116702 117114 117901
56586 117901 119072 120533 122104 123651 125077 126182 126766 127000 127360 128065 128901 129766 130960 132704 134790 136985
56570 136985 139477 142617 146565 151427 157293 163761 169905 175298 180828 187962 197394 208770 221381 234528
56556 234528 247345 258860 268340 275410 280108 283154 285739 288449 290618 291316 290768 290121 289975 289813 288885
56541 288885 286960 284136 280535 276447 272289 268218 264126 260059 256280 252814 249306 245424 241091 236263
56527 236263 230867 224983 218832 212555 206314 200557 195770 191977 188822 186079 183703 181505 179264 177122
56513 177122 175322 173604 171399 168655 165876 163300 160666 157960 155669 154062 152849 151871 151475 151743 151942
56498 151942 151386 150387 149751 149630 149602 149677 150434 152047 153814 154942 155410 155765 156327 156927 157274 157306 157149 156965 156909
$$ packed form
56604A07743n49k7O85J200J286J096Q41M98O5q6L60J043J253Q23L00J71M12P87
56586A17901J171J461J571J547J426J105N84K34L60P05Q36Q65J194J744K086K195
56570A36985K492L140L948M862N866O468O144N393N530P134R432J1376J2611J3147
56556B34528J2817J1515R480P070M698L046K585K710K169O98n48o47j46j62r28
56541B88885j925k824l601m088m158m071m092m067l779l466l508l882m333m828
56527B36263n396n884o151o277o241n757m787l793l155k743k376k198k241k142
56513A77122j800j718k205k744k779k576k634k706k291j607j213r78l96K68J99
56498A51942n56r99o36j21k8P5P57J613J767J128M68L55N62O00L47L2j57j84n6
$$ plain form
56479 156909 157120 157621 158250 158769 158999 158855 158334 157614 157088 157135 157843 159073 160703 162571 164318 165634 166661
56462 166661 167736 168745 169226 169199 169295 169783 170076 169580 168529 167528 166808 166423 166589 167151 167228 166289 165216 165331
56444 165331 166604 167735 167946 167759 167973 168791 170122 171878 173643 174768 175077 174952 174623 173979 173096 172248 171315
56427 171315 169979 168656 168348 169308 170670 171717 172671 173816 174783 175288 175743 176402 176608 175730 174324 173506 173535
56410 173535 173848 174226 175090 176655 178505 180170 181627 183161 184940 186871 188697 190282 191760 193233 194382
56395 194382 194834 194873 195225 195940 196147 195194 193446 191586 189768 187965 186521 185699 185097 184125 182774 181436 180376
56378 180376 179952 180849 183384 186900 190524 194189 198187 202070 204948 206754 208248 209742 210694 210851 210990
56363 210990 212031 213887 215670 216705 216994 216878 216610 216311 216149 216399 217199 218222 218821 218695 218288 218355 219256
$$ packed form
56479A56909K11N01O29N19K30j44n21p20n26M7P08J230J630J868J747J316J027
56462A66661J075J009M81k7R6M88K93m96j051j001p20l85J66N62P7r39j073J15
56444A65331J273J131K11j87K14Q18J331J756J765J125L09j25l29o44q83q48r33
56427A71315j336j323l08R60J362J047R54J145R67N05M55O59K06q78j406q18K9
56410A73535L13L78Q64J565J850J665J457J534J779J931J826J585J478J473J149
56395A94382M52L9L52P15K07r53j748j860j818j803j444q22o02r72j351j338j060
56378A80376m24Q97K535L516L624L665L998L883K878J806J494J494R52J57J39
56363B10990J041J856J783J035K89j16k68k99j62K50Q00J023N99j26m07O7R01
$$ plain form
56346 219256 220776 222342 223216 222850 221520 220472 220990 223281 226500 229734 232689 235493 238213 240716 242801
56331 242801 244443 245914 247645 249918 252815 256430 260848 265801 270621 274705 277835 280034 281411 282225
56317 282225 282727 282835 282327 281388 280518 279825 279052 278400 278498 279161 279036 277229 274708 273319 273812 275545 277789
56300 277789 280455 283643 287186 290753 293979 296562 298661 301037 304433 308812 313475 317705 321109 323783
56286 323783 326474 330138 334967 340242 345545 351479 358650 366600 374498 382301 390303 398083 405040 411805
56272 411805 419942 430118 441486 453043 464786 477293 490929 505770 521874 539306 558193 578768
56260 578768 601141 625200 651167 680062 713078 750617 792410 838469 889408 946077 1009447
56249 1009447 1080688 1160652 1249286 1345970 1450232 1561537 1678696 1800237 1925147 2052378
$$ packed form
56346B19256J520J566Q74l66j330j048N18K291L219L234K955K804K720K503K085
56331B42801J642J471J731K273K897L615M418M953M820M084L130K199J377Q14
56317B82225N02J08n08r39q70o93p73o52R8O63j25j807k521j389M93J733K244
56300B77789K666L188L543L567L226K583K099K376L396M379M663M230L404K674
56286C23783K691L664M829N275N303N934P171P950P898P803Q002P780O957O765
56272D11805Q137J0176J1368J1557J1743J2507J3636J4841J6104J7432J8887K0575
56260E78768K2373K4059K5967K8895L3016L7539M1793M6059N0939N6669O3370
56249A009447P1241P9964Q8634R6684J04262J11305J17159J21541J24910J27231
$$ plain form
56239 2052378 2179557 2302926 2418714 2524063 2616719 2694541 2755448 2797457 2818871 2819018 2798740
56228 2798740 2759714 2703562 2632174 2548479 2455871 2356836 2252813 2145279 2036154 1927233
56218 1927233 1819992 1715905 1616182 1521275 1431445 1347632 1270884 1200992 1136696 1077175 1022421
56207 1022421 972223 925987 883651 845587 811332 779562 749706 722472 698295 676366 655835
56196 655835 637041 620703 606599 593898 582353 572415 564373 557901 552317 546985 541628 536467 531892
56183 531892 527947 524333 520813 517237 513459 509761 507118 506294 506779 507323 507437 507582 508064 508770 509977 512325
56167 512325 515709 519148 522079 525000 528579 532904 537873 543519 549707 556217 563344 571705 581240 591190
56153 591190 601249 612020 624230 638256 654466 673156 693997 716456 740937 768790 801213
$$ packed form
56239B052378J27179J23369J15788J05349R2656P7822O0907M2009K1414J47k0278
56228B798740l9026n6152p1388q3695r2608r9035j04023j07534j09125j08921
56218A927233j07241j04087r9723r4907q9830q3813p6748o9892o4296n9521n4754
56207A022421n0198m6236m2336l8064l4255l1770k9856k7234k4177k1929k0531
56196F55835j8794j6338j4104j2701j1545r938q042o472n584n332n357n161m575
56183E31892l945l614l520l576l778l698k643q24M85N44J14J45M82P06J207K348
56167E12325L384L439K931K921L579M325M969N646O188O510P127Q361R535R950
56153E91190J0059J0771J2210J4026J6210J8690K0841K2459K4481K7853L2423
$$ plain form
56142 801213 839020 883380 935569 995828 1063494 1138204 1219651 1305925 1393406 1478704 1559652
56131 1559652 1634514 1702005 1762755 1819292 1873752 1926544 1977413 2026023 2070576 2107403 2133355
56120 2133355 2147890 2152168 2147150 2133326 2111115 2080360 2040169 1990078 1930658 1862523 1785908 1702129
56108 1702129 1614547 1527271 1443597 1366090 1296790 1236278 1183438 1137060 1096966 1063047 1034382
56097 1034382 1010197 990596 975419 963342 953182 945219 940235 937935 937161 937064 937397 938330 940473 944251
56083 944251 948920 953219 957293 962576 969331 975887 981103 986080 992468 1000435 1009329 1018943 1029088 1039190
56069 1039190 1049339 1060504 1072873 1085294 1097278 1109980 1124260 1139406 1154828 1171299 1189246
56058 1189246 1207546 1225364 1243445 1262269 1280751 1298325 1316402 1336026 1355943 1374887 1393955
$$ packed form
56142H01213L7807M4360N2189O0259O7666P4710Q1447Q6274Q7481Q5298Q0948
56131A559652P4862O7491O0750N6537N4460N2792N0869M8610M4553L6827K5952
56120B133355J4535M278n018j3824k2211l0755m0191n0091n9420o8135p6615q3779
56108A702129q7582q7276q3674p7507o9300o0512n2840m6378m0094l3919k8665
56097A034382k4185j9601j5177j2077j0160p963m984k300p74r7L33R33K143L778
56083I44251M669M299M074N283O755O556N216M977O388P967Q894R614J0145J0102
56069A039190J0149J1165J2369J2421J1984J2702J4280J5146J5422J6471J7947
56058A189246J8300J7818J8081J8824J8482J7574J8077J9624J9917J8944J9068
$$ plain form
56047 1393955 1414639 1436219 1457373 1478762 1501635 1525330 1548593 1572125 1597379 1623929 1650336
56036 1650336 1676582 1703409 1730422 1757126 1784729 1814599 1846075 1878094 1911774 1948899 1989046
56025 1989046 2030766 2074424 2121179 2170233 2219907 2270523 2323514 2378598 2434694 2492748 2554661
56014 2554661 2620027 2686773 2754564 2824865 2898211 2974118 3053175 3136612 3224263 3315306 3410314
56003 3410314 3510307 3614827 3723444 3837942 3960399 4090315 4226346 4369413 4521240 4681434
55993 4681434 4849198 5026374 5215420 5416038 5627359 5851833 6093194 6352214 6628414
55984 6628414 6924330 7243982 7588838 7959440 8359243 8792525 9260693 9765455 10313603
55975 10313603 10913680 11570374 12287800 13076020 13948682 14917195 15994272 17201367 18566541
$$ packed form
56047A393955K0684K1580K1154K1389K2873K3695K3263K3532K5254K6550K6407
56036A650336K6246K6827K7013K6704K7603K9870L1476L2019L3680L7125M0147
56025A989046M1720M3658M6755M9054M9674N0616N2991N5084N6096N8054O1913
56014B554661O5366O6746O7791P0301P3346P5907P9057Q3437Q7651R1043R5008
56003C410314R9993J04520J08617J14498J22457J29916J36031J43067J51827J60194
55993D681434J67764J77176J89046K00618K11321K24474K41361K59020K76200
55984F628414K95916L19652L44856L70602L99803M33282M68168N04762N48148
55975A0313603O00077O56694P17426P88220Q72662R68513J077077J207095J365174
$$ plain form
55966 18566541 20118648 21892443 23938615 26322879 29119568 32415561 36318554 40954312
55958 40954312 46460827 52994596 60737654 69891182 80677450 93374324 108358490 126119822
55950 126119822 147238189 172274822 201451133 234103681 268242681 300685674 327852285
55943 327852285 346741499 355535389 353732027 342066948 322350669 297102740 268964472
55936 268964472 240155406 212240284 186185012 162500887 141367680 122751622 106517846
55929 106517846 92492270 80471454 70229050 61537285 54179592 47949081 42654704
55922 42654704 38135969 34264130 30929683 28038063 25515719 23308098 21368321 19653666
55914 19653666 18131067 16776266 15565973 14477237 13493807 12605565 11801189 11067556 10395890
$$ packed form
55966A8566541J552107J773795K046172K384264K796689L295993L902993M635758
55958D0954312N506515O533769P743058R153528J0786268J2696874J4984166J7761332
55950A26119822K1118367K5036633K9176311L2652548L4139000L2442993K7166611
55943C27852285J8889214Q793890j803362j1665079j9716279k5247929k8138268
55936B68964472k8809066k7915122k6055272k3684125k1133207j8616058j6233776
55929A06517846j4025576j2020816j0242404q691765p357693o230511n294377
55922D2654704m518735l871839l334447k891620k522344k207621j939777j714655
55914A9653666j522599j354801j210293j088736r83430q88242q04376p33633o71666
$$ plain form
55905 10395890 9781717 9218580 8697829 8214607 7767891 7354298 6967661 6605080 6267690
55896 6267690 5954693 5661829 5386443 5129111 4889295 4664079 4452178 4254997 4072786
55887 4072786 3903696 3747363 3605381 3477097 3358383 3245513 3137258 3032701 2930338
55878 2930338 2830082 2733236 2639932 2549214 2461695 2379107 2301071 2225386 2151622 2081322 2014479
55867 2014479 1949204 1885410 1825568 1771019 1720448 1672724 1628386 1587421 1548309 1510218 1473823
55856 1473823 1439206 1405238 1371669 1339529 1308821 1278084 1246876 1216456 1187455 1159126 1131394
55845 1131394 1105344 1080942 1056567 1031652 1007712 985927 965646 946084 927570 910281 893493
55834 893493 876910 861177 846479 832211 818485 806226 795319 784421 773139 762626 753466 744729
$$ packed form
55905A0395890o14173n63137n20751m83222m46716m13593l86637l62581l37390
55896F267690l12997k92864k75386k57332k39816k25216k11901j97181j82211
55887D072786j69090j56333j41982j28284j18714j12870j08255j04557j02363
55878B930338j00256r6846r3304r0718q7519q2588p8036p5685p3764p0300o6843
55867B014479o5275o3794n9842n4549n0571m7724m4338m0965l9112l8091l6395
55856A473823l4617l3968l3569l2140l0708l0737l1208l0420k9001k8329k7732
55845A131394k6050k4402k4375k4915k3940k1785k0281j9562j8514j7289j6788
55834H93493j6583j5733j4698j4268j3726j2259j0907j0898j1282j0513r160q737
$$ plain form
55822 744729 735732 726891 718147 708304 696851 684897 673472 662267 650797 639512 629014 619314
55810 619314 610378 602338 594873 587632 581370 577266 574971 572946 570899 570165 571328 573347 575513 578389
55796 578389 582030 585082 586602 587339 588267 589190 589594 589663 589651 589396 589019 588905 588469 586243 581672 575444 567590
55779 567590 556884 542903 527195 511553 496383 481571 467637 455141 444156 435110 428935 425588
55767 425588 423530 421426 419235 417047 414219 410522 406888 404091 401789 399597 397868 396521 394419 390963
55753 390963 387156 383983 380784 376289 370366 363685 356536 349060 341935 335827 330647 325973 321566 317017
55739 317017 311902 306881 303494 302086 300986 298586 295162 291836 288969 286646 285495 285643 285723 284309 281678
55724 281678 278988 276380 273130 269130 264927 260735 256509 252675 249779 247747 246306 245678 245964 246379 246192
$$ packed form
55822G44729q997q841q744r843j1453j1954j1425j1205j1470j1285j0498r700
55810F19314q936q040p465p241o262m104k295k025k047p34J163K019K166K876
55796E78389L641L052J520P37R28R23M04O9j2k55l77j14m36k226m571o228p854
55779E67590j0706j3981j5708j5642j5170j4812j3934j2496j0985r046o175l347
55767D25588k058k104k191k188k828l697l634k797k302k192j729j347k102l456
55753C90963l807l173l199m495n923o681p149p476p125o108n180m674m407m549
55739C17017n115n021l387j408j100k400l424l326k867k323j151J48Q0j414k631
55724B81678k690k608l250m000m203m192m226l834k896k032j441o28K86M15j87
$$ plain form
55709 246192 245956 246773 248680 250765 252605 254562 256758 258678 259773 259758 258433 255777 252114 247705 242509
55694 242509 236764 231311 226750 222759 218886 215451 212939 211001 208945 206869 205492 205158 205745 207274 209816
55679 209816 212964 216157 219372 222909 226676 230191 233088 235096 235888 235495 234581 233761 232939 231778 230475
55664 230475 229492 228920 228642 228764 229333 230007 230573 231373 232664 234034 235084 236304 238479 241522 244530 246781
55648 246781 248106 248575 248442 248162 247957 247554 246683 245383 243469 240329 235802 230666 225658 220624 215332 210366
55632 210366 206309 202637 198424 193740 189340 185376 181469 177783 174920 172958 171582 171050 171946 173935 175816
55617 175816 176923 177595 178125 178108 177100 175203 172731 169835 166695 163548 160437 157318 154427 152083 150166
55602 150166 148310 146522 145091 143930 142637 141249 140391 140568 141673 143181 144425 144828 144312 143433 142730 142124
$$ packed form
55709B46192k36Q17J907K085J840J957K196J920J095j5j325k656l663m409n196
55694B42509n745n453m561l991l873l435k512j938k056k076j377l34N87J529K542
55679B09816L148L193L215L537L767L515K897K008P92l93r14q20q22j161j303
55664B30475r83n72k78J22N69O74N66Q00J291J370J050J220K175L043L008K251
55648B46781J325M69j33k80k05m03q71j300j914l140m527n136n008n034n292m966
55632B10366m057l672m213m684m400l964l907l686k863j962j376n32Q96J989J881
55617A75816J107O72N30j7j008j897k472k896l140l147l111l119k891k344j917
55602A50166j856j788j431j161j293j388q58J77J105J508J244M03n16q79p03o06
$$ plain form
55586 142124 141342 140626 140422 140714 141346 142731 145339 148612 151355 153363 155858 160109 166348 174256 183721
55571 183721 194615 206365 218184 229460 239619 247947 253930 257596 259294 259204 257196 253085 247016
55558 247016 239580 231490 223143 214675 206510 199394 193596 188439 183055 177320 171669 166311 161175 156446
55544 156446 152605 149948 148434 147832 147744 147710 147699 148179 149263 150169 150035 148963 147685 146583 145676 145187 145297
55527 145297 145533 145291 144788 144711 144970 144723 143611 142078 140421 138485 136466 135075 134548 134344 134249 134993 137205
55510 137205 140396 143542 146180 148296 149593 149591 148385 146694 145089 143470 141411 138790 135994 133503 131280
55495 131280 128739 125448 121789 118645 116543 115343 114663 114174 113517 112429 111118 110233 110207 110831 111548 111975
55479 111975 112015 111723 111238 110792 110669 111011 111561 111636 110677 108927 107272 106235 105500 104640 103842 103449 103202 102561
$$ packed form
55586A42124p82p16k04K92O32J385K608L273K743K008K495M251O239P908R465
55571A83721J0894J1750J1819J1276J0159Q328N983L666J698r0k008m111o069
55558B47016p436q090q347q468q165p116n798n157n384n735n651n358n136m729
55544A56446l841k657j514o02q8l4j1M80J084R06j34j072j278j102r07m89J10
55527A45297K36k42n03p7K59k47j112j533j657j936k019j391n27k04r5P44K212
55510A37205L191L146K638K116J297kj206j691j605j619k059k621k796k491k223
55495A31280k541l291l659l144k102j200o80m89o57j088j311q85k6O24P17M27
55479A11975M0k92m85m46j23L42N50P5r59j750j655j037p35q60p98l93k47o41
$$ plain form
55461 102561 101594 100883 100621 100411 99984 99591 99529 99709 99864 99913 99977 100149 100259 99844 98566 96765 95317 94747 94831
55442 94831 95187 95756 96370 96500 95977 95383 95112 94645 93538 92537 92628 93403 93575 92937 92584 93107 93857 94296 94920
55423 94920 96279 97931 99024 99328 99233 99140 99238 99489 99636 99569 99747 100722 102215 103345 103841 104289 105009 105469 105150
55404 105150 104301 103437 102770 102473 102852 103763 104469 104564 104556 105075 105985 106808 107476 108142 108641 108769 108817 109262 110047 110678
55384 110678 110939 111148 111643 112293 112530 111866 110475 109190 108618 108350 107508 106077 105058 105047 105320 104751 103229
55367 103229 101667 100841 100656 100434 99653 98416 97304 96725 96436 95958 95271 94667 94065 93079 91836 91003 90778
55350 90778 90555 89902 89260 89175 89371 89177 88549 88117 88340 89000 89517 89577 89559 90267 91974 93843 94822 95012 95467
55331 95467 96531 97278 96937 96054 95652 95918 96364 96725 96956 96754 95883 94729 93932 93607 93420 93208 92992 92674
$$ packed form
55461A02561r67p11k62k10m27l93o2J80J55M9O4J72J10m15j278j801j448n70Q4
55442I4831L56N69O14J30n23n94k71m67j107j001R1P75J72o38l53N23P50M39O24
55423I4920J359J652J093L04r5r3R8K51J47o7J78R75J493J130M96M48P20M60l19
55404A05150q49q64o67k97L79R11P06R5qN19R10Q23O68O66M99J28M8M45P85O31
55384A10678K61K09M95O50K37o64j391j285n72k68q42j431j019j1K73n69j522
55367A03229j562q26j85k22p81j237j112n79k89m78o87o04o02r86j243q33k25
55350I0778k23o53o42q5J96j94o28m32K23O60N17O0j8P08J707J869R79J90M55
55331I5467J064P47l41q83m02K66M46L61K31k02q71j154p97l25j87k12k16l18
$$ plain form
55313 92674 92249 92079 92365 92587 92079 91025 90248 90011 89663 88540 86800 85213 84490 84873 86097 87633 89123
55296 89123 90513 91702 92329 92155 91406 90390 89012 87080 84888 83073 81968 81492 81572 82240 83362 84624
55280 84624 85808 86747 87089 86523 85349 84420 84356 85009 85870 86817 88202 90171 92105 93080 92981 92821 93562 94839
55262 94839 95473 95179 95014 95898 97407 98470 98642 98156 97282 96354 96028 96754 98127 99374 100308 101201 101986 102357
55244 102357 102561 103283 104578 105620 105696 104876 103551 101946 100417 99578 99630 99952 99806 99156 98342 97301 95739
55227 95739 93998 93048 93323 94035 94058 93262 92512 92431 92674 92606 92285 92310 92893 93523 93576 92923 91908 91024 90677 90942
55207 90942 91411 91559 91395 91526 92443 93986 95554 96614 96921 96638 96370 96815 98114 99757 101205 102319 103094
55190 103094 103434 103429 103451 103656 103715 103342 102781 102446 102368 102315 102125 101516 99923 97087 93673 90803 88946 87618 86107
$$ packed form
55313I2674m25j70K86K22n08j054p77k37l48j123j740j587p23L83J224J536J490
55296H9123J390J189O27j74p49j016j378j932k192j815j105m76Q0O68J122J262
55280H4624J184R39L42n66j174r29o4O53Q61R47J385J969J934R75r9j60P41J277
55262I4839O34k94j65Q84J509J063J72m86q74r28l26P26J373J247R34Q93P85L71
55244A02357K04P22J295J042P6q20j325j605j529q39N2L22j46o50q14j041j562
55227I5739j741r50K75P12K3p96p50q1K43o8l21K5N83O30N3o53j015q84l47K65
55207I0942M69J48j64J31R17J543J568J060L07k83k68M45J299J643J448J114P75
55190A03094L40nK2K05N9l73n61l35p8n3j90o09j593k836l414k870j857j328j511
$$ plain form
55171 86107 84104 81734 79389 77662 77132 77997 79886 82024 83612 84346 84700 85480 86942 88556 89741 90484
55155 90484 91009 91271 91188 91087 91425 92187 92908 93175 92836 91937 90785 89913 89609 89616 89589 89644 90107 90982 92058 93374
55135 93374 95075 96926 98435 99429 100128 100679 101015 101102 101033 100905 100906 101353 102245 102907 102542 101161 99568 98477
55117 98477 98046 98201 98911 99960 100843 101165 101018 100793 100715 100527 99682 97996 96187 95430 96108 97284 97777 97477
55099 97477 97171 97353 97795 98241 98850 99811 100977 102070 102918 103368 103280 102809 102469 102770 103849 105488 107292 108821
55081 108821 109669 109546 108452 106920 105971 106318 107443 107924 106983 105321 104059 103349 102599 101625 100840 100475 100337
55064 100337 100349 100732 101579 102739 104121 105671 107098 108101 108812 109466 109791 109315 108218 107217 106554 105824 104853
55047 104853 104016 103470 102795 101753 100816 100567 100984 101631 102084 101920 100855 99252 98020 97589 97437 97039 96813
$$ packed form
55171H6107k003k370k345j727n30Q65J889K138J588P34L54P80J462J614J185P43
55155I0484N25K62q3j01L38P62P21K67l39q99j152q72l04Pk7N5M63Q75J076J316
55135I3374J701J851J509R94O99N51L36Q7o9j28JM47Q92O62l65j381j593j091
55117I8477m31J55P10J049Q83L22j47k25p8j88q45j686j809p57O78J176M93l00
55099I7477l06J82M42M46O09R61J166J093Q48M50q8m71l40L01J079J639J804J529
55081A08821Q48j23j094j532r49L47J125M81r41j662j262p10p50r74p85l65j38
55064A00337J2L83Q47J160J382J550J427J003P11O54L25m76j097j001o63p30r71
55047A04853q37n46o75j042r37k49M17O47M53j64j065j603j232m31j52l98k26
$$ plain form
55030 96813 97554 99289 101361 103415 105553 107518 108484 108028 106896 106316 106690 107290 107316 106885 106737 107119 107418
55013 107418 107024 106186 105664 105783 106257 106823 107568 108571 109709 110893 112128 113129 113303 112387 110920 109806
54997 109806 109532 109984 110811 111787 112867 114066 115259 116075 116145 115566 114951 114907 115480 116177 116474 116232 115736 115399
54979 115399 115461 115922 116614 117267 117576 117407 116925 116303 115364 113916 112467 112069 113141 114885 116262 117130 117968
54962 117968 118878 119483 119592 119346 118867 118343 118373 119544 121630 123706 125062 125599 125378 124438 123062 121687 120482
54945 120482 119439 118785 118691 118677 118062 117061 116717 117564 119046 120431 121549 122317 122338 121493 120369 119611 119299 119330
54927 119330 119896 121053 122311 123181 123803 124541 125341 126124 127528 130550 135360 140971 146193 150606 154549 158410
54911 158410 162119 165222 167318 168280 168045 166447 163538 159876 156098 152294 148216 143988 140078 136621 133391
$$ packed form
55030I6813P41J735K072K054K138J965R66m56j132n80L74O00K6m31j48L82K99
55013A07418l94q38n22J19M74N66P45J003J138J184J235J001J74r16j467j114
54997A09806k74M52Q27R76J080J199J193Q16P0n79o15m4N73O97K97k42m96l37
54979A15399O2M61O92O53L09j69m82o22r39j448j449l98J072J744J377Q68Q38
54962A17968R10O05J09k46m79n24L0J171K086K076J356N37k21r40j376j375j205
54945A20482j043o54r4j4o15j001l44Q47J482J385J118P68K1q45j124p58l12L1
54927A19330N66J157J258Q70O22P38Q00P83J404L022M810N611N222M413L943L861
54911A58410L709L103K096R62k35j598k909l662l778l804m078m228l910l457l230
$$ plain form
54896 133391 130448 128138 126306 124299 122025 120262 119528 119334 119059 118864 119112 119561 119862 120374 121602 123146
54880 123146 124085 124305 124668 125907 128017 130748 133981 137495 140938 144287 147956 152283 157153 162143 166683
54865 166683 170028 171473 170889 168886 166329 163733 161033 157833 153964 149892 146416 143786 141376 138470
54851 138470 135178 132151 129630 127307 125087 123404 122534 122005 121082 119652 118262 117295 116409 115005 113105
54836 113105 111431 110489 109902 108993 107818 107085 107037 107013 106379 105492 105301 106271 108018 109794 111004 111462 111495 111700
54818 111700 112316 112988 113364 113706 114533 115789 116783 116963 116404 115536 114676 113929 113318 112897 112708 112677 112542 112066 111402
54799 111402 111113 111633 112757 113763 114013 113493 112855 112852 113525 114025 113585 112598 112300 113334 115136 116872 118348
54782 118348 119675 120636 121010 121152 121638 122487 123238 123668 123980 124405 125069 126198 128001 130316 132691 134845 136868
$$ packed form
54896A33391k943k310j832k007k274j763p34j94k75j95K48M49L01N12J228J544
54880A23146R39K20L63J239K110K731L233L514L443L349L669M327M870M990M540
54865A66683L345J445n84k003k557k596k700l200l869m072l476k630k410k906
54851A38470l292l027k521k323k220j683q70n29r23j430j390r67q86j404j900
54836A13105j674r42n87r09j175p33m8k4o34q87j91R70J747J776J210M58L3K05
54818A11700O16O72L76L42Q27J256R94J80n59q68q60p47o11m21j89l1j35m76o64
54799A11402k89N20J124J006K50n20o38lO73N00m40r87k98J034J802J736J476
54782A18348J327R61L74J42M86Q49P51M30L12M25O64J129J803K315K375K154K023
$$ plain form
54765 136868 139057 141860 145800 151022 156905 162436 166997 170610 173529 175905 177817 179249 179970 179649 178186
54750 178186 175739 172450 168352 163645 158909 154922 152084 149951 147476 144002 140020 136642 134357 132703
54736 132703 131228 130190 129974 130363 130859 131386 132165 133102 133844 134291 134652 135024 135319 135582 136107 137257 139317
54719 139317 142345 145998 149782 153652 157980 162672 166792 169551 171209 172423 173075 172482 170553 167897 164812
54704 164812 160968 156271 151383 147072 143569 140831 138967 138006 137469 136564 134870 132772 131211 130875 131501
54689 131501 132051 131776 130956 130455 130744 131566 132280 132223 130994 128862 126784 125628 125411 125556 125635 125524 125147 124616
54671 124616 124426 124965 125910 126577 126670 126202 124946 122728 120138 118204 117257 116860 116839 117541 118813 119582 118984 117429
54653 117429 116099 115757 116348 117360 118241 118732 119135 120051 121693 123693 125660 127482 128930 129516 129079 128115
$$ packed form
54765A36868K189K803L940N222N883N531M561L613K919K376J912J432P21l21j463
54750A78186k447l289m098m707m736l987k838k133k475l474l982l378k285j654
54736A32703j475j038k16L89M96N27P79R37P42M47L61L72K95K63N25J150K060
54719A39317L028L653L784L870M328M692M120K759J658J214O52n93j929k656l085
54704A64812l844m697m888m311l503k738j864r61n37r05j694k098j561l36O26
54689A31501N50k75q20n01K89Q22P14n7j229k132k078j156k17J45P9j11l77n31
54671A24616j90N39R45O67R3m68j256k218k590j934r47l97k1P02J272P69n98j555
54653A17429j330l42N91J012Q81M91M03R16J642K000J967J822J448N86m37r64
$$ plain form
54637 128115 127156 126118 124666 122951 121599 121063 121319 122079 122990 123677 123844 123383 122376 121111 120127 120033 121066
54620 121066 122873 124736 125930 125969 124868 123271 122086 121796 122225 122947 123699 124416 125120 125871 126592 126965 126781
54603 126781 126398 126475 127151 127850 128011 127647 127068 126507 126241 126652 127762 128937 129444 129191 128653 128230 127965 127741
54585 127741 127489 127199 126963 126955 127207 127509 127720 128060 128822 129811 130328 129846 128532 127022 125856 125298 125543 126728
54567 126728 128618 130524 131761 132058 131350 129516 126767 124126 122799 122897 123382 123474 123527 124143 125135 125991 126819
54550 126819 128015 129283 129948 130116 130694 132141 133965 135628 137271 139203 141232 142842 143729 143951 143881 144111
54534 144111 144965 146000 146366 145856 145192 145090 145394 145382 144614 143267 141880 140936 140532 140349 140072 139714 139352 138762
54516 138762 137724 136543 135737 135285 134767 134214 134181 134866 135752 136237 136061 135064 133268 131366 130412 130667 131350 131858
$$ packed form
54637A28115r59j038j452j715j352n36K56P60R11O87J67m61j007j265r84r4J033
54620A21066J807J863J194L9j101j597j185k90M29P22P52P17P04P51P21L73j84
54603A26781l83P7O76O99J61l64n79n61k66M11J110J175N07k53n38m23k65k24
54585A27741k52k90k36qK52L02K11L40P62R89N17m82j314j510j166n58K45J185
54567A26728J890J906J237K97p08j834k749k641j327R8M85R2N3O16R92Q56Q28
54550A26819J196J268O65J68N78J447J824J663J643J932K029J610Q87K22p0K30
54534A44111Q54J035L66n10o64j02L04j2p68j347j387r44m04j83k77l58l62n90
54516A38762j038j181q06m52n18n53l3O85Q86M85j76r97j796j902r54K55O83N08
$$ plain form
54498 131858 132552 133914 135592 136832 137371 137351 136771 135652 134409 133507 132959 132594 132509 132790 133079 132991 132773 133017
54480 133017 133858 134909 135913 136946 137981 138705 138923 138862 138996 139731 141195 143155 145088 146476 147123 147248
54464 147248 147358 147888 148773 149460 149635 149815 150758 152321 153460 153485 152820 152276 152098 152001 151715 151133 150275 149396 148849
54445 148849 148626 148390 148168 148519 149667 150929 151442 151183 150851 150936 151263 151293 150633 149434 148420 148242 148728 149128
54427 149128 149133 149120 149298 149293 148907 148621 148887 149479 149997 150497 151160 151910 152815 154227 155927 156771 155978 154273 153000
54408 153000 152498 152178 151768 151543 151562 151569 151580 151766 151901 151679 151490 152111 153622 155360 156902 158361 159777 160950
54390 160950 161924 162879 163538 163450 162922 162822 163264 163291 162209 160526 159164 158355 157783 157353 157303 157742 158457 159062 159252
54371 159252 159060 158926 159231 159810 160246 160560 161155 162059 162773 163009 163060 163220 163320 163085 162578 162079 161849 162207 163447
$$ packed form
54498A31858O94J362J678J240N39k0n80j119j243r02n48l65q5K81K89q8k18K44
54480A33017Q41J051J004J033J035P24K18o1J34P35J464J960J933J388O47J25
54464A47248J10N30Q85O87J75J80R43J563J139K5o65n44j78r7k86n82q58q79n47
54445A48849k23k36k22L51J148J262N13k59l32Q5L27L0o60j199j014j78M86M00
54427A49128Nj3J78nl86k86K66N92N18N00O63P50R05J412J700Q44p93j705j273
54408A53000n02l20m10k25J9PJ1J86J35k22j89O21J511J738J542J459J416J173
54390A60950R74R55O59q8n28j00M42K7j082j683j362q09n72m30n0M39P15O05J90
54371A59252j92j34L05N79M36L14N95R04P14K36N1J60J00k35n07m99k30L58J240
$$ plain form
54352 163447 165430 167553 169426 171298 173586 176259 178896 181126 182702 183421 183277 182591 181758 180886 179871
54337 179871 178742 177718 176899 175973 174351 171727 168537 165717 163853 162690 161606 160404 159376 158727 158272
54322 158272 157693 156855 155871 155057 154779 155119 155745 156278 156663 157012 157257 157241 157000 156653 156141 155387 154540 153756 152959
54303 152959 152171 151787 152033 152333 151862 150696 149783 149709 150064 150177 149940 149719 149820 150314 151098 152013 153120 154717
54285 154717 156782 158503 158940 158160 157157 156557 155997 154955 153645 152715 152463 152693 153052 153214 152973 152378 151715
54268 151715 151236 151091 151407 152119 152718 152638 151986 151554 151990 153280 155025 156749 157862 157878 157005 156152 156077 156757
54250 156757 157689 158435 158742 158588 158373 158689 159614 160511 160731 160243 159386 158373 157330 156481 155964 155587 154996 154006
54232 154006 152668 151257 150247 149995 150288 150483 150247 149955 150204 151135 152261 152798 152209 150794 149681 149818 150988
$$ packed form
54352A63447J983K123J873J872K288K673K637K230J576P19j44o86q33q72j015
54337A79871j129j024q19r26j622k624l190k820j864j163j084j202j028o49m55
54322A58272n79q38r84q14k78L40O26N33L85L49K45j6k41l47n12p54q47p84p97
54303A52959p88l84K46L00m71j166r13p4L55J13k37k21J01M94P84R15J107J597
54285A54717K065J721M37p80j003o00n60j042j310r30k52K30L59J62k41n95o63
54268A51715m79j45L16P12N99q0o52m32M36J290J745J724J113J6q73q53p5O80
54250A56757R32P46L07j54k15L16R25Q97K20m88q57j013j043q49n17l77n91r90
54232A54006j338j411j010k52K93J95k36k92K49R31J126N37n89j415j113J37J170
$$ plain form
54215 150988 152218 153080 153906 154711 154815 153892 152676 152069 152106 152298 152460 152593 152431 151860 151529 152274 153937 155325
54197 155325 155376 154048 152087 150342 149264 148698 148111 147211 146296 145850 145935 146251 146607 147031 147550 148118 148689 149132
54179 149132 149181 148713 147929 147111 146375 145898 146128 147373 149266 150978 151944 152129 151738 151002 150202 149568 149039 148351
54161 148351 147445 146657 146408 146722 147126 147115 146767 146765 147628 149032 150184 150751 150994 151021 150556 149648 149041 149355 150321
54142 150321 151246 151893 152349 152310 151246 149346 147750 147527 148638 150059 150790 150644 150219 150250 151031 152381 153936
54125 153936 155272 155915 155606 154662 153793 153476 153746 154544 155838 157291 158305 158668 158847 159371 160257 161270 162336
54108 162336 163363 164071 164418 164935 166162 167872 169192 169370 168198 165969 163419 161439 160446 160107 159969 160080
54092 160080 160608 161122 160901 159909 158968 158792 159210 159457 158997 157974 157005 156667 157114 158175 159668 161483 163331
$$ packed form
54215A50988J230Q62Q26Q05J04r23j216o07L7J92J62J33j62n71l31P45J663J388
54197A55325N1j328j961j745j078n66n87r00r15m46Q5L16L56M24N19N68N71M43
54179A49132M9m68p84q18p36m77K30J245J893J712R66J85l91p36q00o34n29o88
54161A48351r06p88k49L14M04j1l48kQ63J404J152N67K43K7m65r08o07L14R66
54142A50321R25O47M56l9j064j900j596k23J111J421P31j46m25L1P81J350J555
54125A53936J336O43l09r44q69l17K70P98J294J453J014L63J79N24Q86J013J066
54108A62336J027P08L47N17J227J710J320J78j172k229k550j980r93l39j38J11
54092A60080N28N14k21r92r41j76M18K47m60j023r69l38M47J061J493J815J848
$$ plain form
54075 163331 164810 165765 166355 166712 166902 167249 168165 169446 170330 170565 170920 172209 174340 176803 179588 182948
54059 182948 186641 190142 193414 196886 200836 205357 210663 216776 223044 228609 233180 236750 238789 238532
54045 238532 236113 232710 229495 226955 225216 224350 224274 224894 226406 228911 231806 234239 236229 238665 242067
54030 242067 245983 249751 253169 256292 259233 262355 265930 269357 271437 271840 271607 271775 272197 272225 271849 271414
54014 271414 270710 269199 266917 264354 261566 258112 253946 249745 246141 243050 239942 236455 232582 228473
54000 228473 224333 220465 217265 214999 213465 211951 209827 207258 205132 204143 204101 204218 203869 202956 201761 200640
53984 200640 199718 198796 197737 196923 196920 197578 197923 197312 196245 195571 195226 194445 193029 191731 191249 191531 192290 193641
53966 193641 195743 198154 200102 201360 202436 203937 206062 208735 211828 215047 217967 220539 223392 227274
$$ packed form
54075A63331J479R55N90L57J90L47R16J281Q84K35L55J289K131K463K785L360
54059A82948L693L501L272L472L950M521N306O113O268N565M571L570K039k57
54045B38532k419l403l215k540j739q66p6O20J512K505K895K433J990K436L402
54030B42067L916L768L418L123K941L122L575L427K080M03k33J68M22K8l76m35
54014B71414p04j511k282k563k788l454m166m201l604l091l108l487l873m109
54000B28473m140l868l200k266j534j514k124k569k126r89m2J17l49r13j195j121
53984B00640r22r22j059q14lO58L45o11j067o74l45p81j416j298m82K82P59J351
53966A93641K102K411J948J258J076J501K125K673L093L219K920K572K853L882
$$ plain form
53952 227274 232156 237157 241405 244729 247479 249915 251968 253458 254403 255146 256197 257743 259318 260274 260659
53937 260659 261330 262999 265495 268224 271017 274102 277473 280750 283645 286176 288436 290512 292605 294888
53923 294888 297234 299405 301489 303864 306759 310234 314568 320219 327251 335187 343672 352979 363630 375664
53909 375664 388443 401108 413217 425085 437501 450831 464286 476163 484806 489227 489007 484066
53897 484066 474740 461888 446753 430697 414871 399846 385591 372015 359395 348024 337681 327966
53885 327966 319019 311309 304683 298299 291742 285596 280526 276239 271809 266801 261656 257131 253644 251090
53871 251090 249028 247041 244953 242669 240002 237014 234345 232622 231414 229456 226160 222362 219261 217136
53857 217136 215562 214317 213419 212614 211515 210129 208692 207129 205221 203251 201938 201709 202428 203794 205499
$$ packed form
53952B27274M882N001M248L324K750K436K053J490R45P43J051J546J575R56L85
53937B60659O71J669K496K729K793L085L371L277K895K531K260K076K093K283
53923B94888K346K171K084K375K895L475M334N651P032P936Q485R307J0651J2034
53909C75664J2779J2665J2109J1868J2416J3330J3455J1877Q643M421k20m941
53897D84066r326j2852j5135j6056j5826j5025j4255j3576j2620j1371j0343r715
53885C27966q947p710o626o384o557o146n070m287m430n008n145m525l487k554
53871B51090k062j987k088k284k667k988k669j723j208j958l296l798l101k125
53857B17136j574j245q98q05j099j386j437j563j908j970j313k29P19J366J705
$$ plain form
53842 205499 207058 207984 208273 208326 208305 207995 207392 206916 206802 206675 206020 204877 203743 202989 202610 202368 201964 201169
53824 201169 200109 199329 199328 200040 201006 202046 203483 205547 207865 209789 211137 212297 213621 215052 216455 217978
53808 217978 219795 221724 223562 225694 228918 233518 238858 244047 248750 253128 257273 261067 264499 267790
53794 267790 271120 274367 277236 279652 281926 284456 287210 289639 291224 292005 292297 292071 290983 289106 287190
53779 287190 285920 285142 284082 282172 279453 276282 272919 269389 265649 261863 258413 255435 252406 248535
53765 248535 243708 238684 234252 230527 227304 224663 222747 221235 219556 217577 215676 214129 212809 211492
53751 211492 210148 208854 207670 206652 205820 205106 204536 204417 205051 206261 207423 208039 208127 207999 207870 207753 207629
53734 207629 207574 207784 208476 209688 211160 212451 213261 213666 214123 215174 216965 219046 220835 222291 223903 225937
$$ packed form
53842B05499J559R26K89N3k1l10o03m76j14j27o55j143j134p54l79k42m04p95
53824B01169j060p80jP12R66J040J437K064K318J924J348J160J324J431J403J523
53808B17978J817J929J838K132L224M600N340N189M703M378M145L794L432L291
53794B67790L330L247K869K416K274K530K754K429J585P81K92k26j088j877j916
53779B87190j270p78j060j910k719l171l363l530l740l786l450k978l029l871
53765B48535m827n024m432l725l223k641j916j512j679j979j901j547j320j317
53751B11492j344j294j184j018q32p14n70j19O34J210J162O16Q8j28j29j17j24
53734B07629n5K10O92J212J472J291Q10M05M57J051J791K081J789J456J612K034
$$ plain form
53718 225937 228063 229842 231247 232396 233152 233409 233505 233938 234807 235995 237692 240165 243105 245837 248204 250671
53702 250671 253393 255851 257751 259704 262469 265832 268791 270804 272414 274620 277872 281733 285277 287773
53688 287773 289146 289859 290409 291006 291649 292175 292137 290984 288718 286219 284490 283645 282969 281953 280821 279952 279230
53671 279230 278322 277347 276757 276619 276413 275741 274944 274751 275371 276229 276572 276164 275290 274336 273555 273121 273099 273307 273457
53652 273457 273548 273928 274733 275474 275518 274973 274680 275161 275936 276194 275899 275817 276526 277869 279426 281055 282720 284156
53634 284156 285092 285649 286229 287076 288185 289515 291025 292591 294141 295849 297948 300422 303078 305836 308746
53619 308746 311850 315263 319186 323446 327224 329801 331590 333860 337342 341603 345935 350270 354879 359708
53605 359708 364488 369176 373879 378584 383332 388329 393432 397795 400613 402153 403559 405696 408539 411578
$$ packed form
53718B25937K126J779J405J149P56K57R6M33Q69J188J697K473K940K732K367K467
53702B50671K722K458J900J953K765L363K959K013J610K206L252L861L544K496
53688B87773J373P13N50N97O43N26l8j153k266k499j729q45o76j016j132q69p22
53671B79230r08r75n90j38k06o72p97j93O20Q58L43m08q74r54p81m34k2K08J50
53652B73457R1L80Q05P41M4n45k93M81P75K58k95q2P09J343J557J629J665J436
53634B84156R36N57N80Q47J109J330J510J566J550J708K099K474K656K758K910
53619C08746L104L413L923M260L778K577J789K270L482M261M332M335M609M829
53605C59708M780M688M703M705M748M997N103M363K818J540J406K137K843L039
$$ plain form
53591 411578 414214 415771 415684 413996 411360 408336 404916 400842 396152 391235 386582 382594 379433 376912 374661
53576 374661 372509 370535 368683 366609 364097 361448 359210 357613 356452 355474 354647 354061 353753 353736 354086 354846
53560 354846 355826 356558 356561 355763 354743 354516 355852 358629 361861 364523 366399 367993 369702 371436 373133 375221
53544 375221 378166 381832 385789 390078 395044 400402 405272 409444 413987 420047 427493 435312 443071 451342
53530 451342 460828 471676 483633 496273 508963 521168 533038 545342 558565 572423 586461 600851
53518 600851 616248 633009 650877 669436 688614 708672 729842 752105 775216 798839 822677
53507 822677 846651 871039 896277 922392 948683 974220 998665 1022338 1045507 1068015 1089791
53496 1089791 1111201 1132498 1153206 1172599 1190706 1208409 1226558 1245300 1264270 1283036 1301334
$$ packed form
53591D11578K636J557q7j688k636l024l420m074m690m917m653l988l161k521k251
53576C74661k152j974j852k074k512k649k238j597j161r78q27n86l08j7L50P60
53560C54846R80P32Lp98j020k27J336K777L232K662J876J594J709J734J697K088
53544C75221K945L666L957M289M966N358M870M172M543O060P446P819P759Q271
53530D51342R486J0848J1957J2640J2690J2205J1870J2304J3223J3858J4038J4390
53518F00851J5397J6761J7868J8559J9178K0058K1170K2263K3111K3623K3838
53507H22677K3974K4388K5238K6115K6291K5537K4445K3673K3169K2508K1776
53496A089791K1410K1297K0708J9393J8107J7703J8149J8742J8970J8766J8298
$$ plain form
53485 1301334 1319189 1336930 1354856 1372869 1390622 1407939 1424723 1440466 1454295 1465706 1474897
53474 1474897 1482174 1487352 1490007 1490080 1487843 1483354 1476334 1466665 1454775 1441343 1426796 1411356 1395492
53461 1395492 1379899 1364752 1349200 1332038 1312889 1292393 1271242 1249514 1227140 1204507 1182215
53450 1182215 1160538 1139536 1119411 1100327 1082115 1064636 1048269 1033527 1020379 1008503 998086
53439 998086 989681 983243 977995 973472 970076 968308 967938 968352 969353 971214 974258 978704 984712 992197 1000733
53424 1000733 1009981 1020150 1031829 1045427 1060891 1077807 1095631 1114036 1133351 1154530 1178430
53413 1178430 1205011 1233393 1262692 1292744 1324082 1357322 1392618 1429754 1468720 1509976 1553957
53402 1553957 1600418 1648621 1698131 1749109 1801756 1855859 1911019 1967083 2024091 2081981 2140477
$$ packed form
53485A301334J7855J7741J7926J8013J7753J7317J6784J5743J3829J1411R191
53474A474897P277N178K655P3k237m489p020r669j1890j3432j4547j5440j5864
53461A395492j5593j5147j5552j7162j9149k0496k1151k1728k2374k2633k2292
53450A182215k1677k1002k0125j9084j8212j7479j6367j4742j3148j1876j0417
53439I98086q405o438n248m523l396j768l70M14J001J861L044M446O008P485Q536
53424A000733R248J0169J1679J3598J5464J6916J7824J8405J9315K1179K3900
53413A178430K6581K8382K9299L0052L1338L3240L5296L7136L8966M1256M3981
53402A553957M6461M8203M9510N0978N2647N4103N5160N6064N7008N7890N8496
$$ plain form
53391 2140477 2199132 2257360 2314595 2370491 2424829 2477205 2527086 2574279 2619073 2661776 2702298
53380 2702298 2740219 2774968 2805806 2831981 2853142 2869374 2880734 2887058 2888370 2884946 2876576 2862113
53368 2862113 2840314 2811049 2775276 2734058 2688072 2638025 2584980 2530071 2474145 2417777 2361338
53357 2361338 2305042 2249185 2194435 2141629 2091140 2042689 1995795 1950114 1905186 1860240 1814734
53346 1814734 1769066 1724387 1681580 1640679 1601381 1563846 1528621 1495864 1465085 1435815 1408236
53335 1408236 1382873 1359891 1339020 1320074 1303128 1288065 1274243 1260784 1247060 1232867 1218350
53324 1218350 1203858 1189723 1176069 1162950 1150659 1139669 1130216 1122144 1115212 1109343 1104537 1100889
53312 1100889 1098806 1098817 1100890 1104194 1107899 1112121 1117769 1125574 1135533 1147228 1160359 1174884 1190858
$$ packed form
53391B140477N8655N8228N7235N5896N4338N2376M9881M7193M4794M2703M0522
53380B702298L7921L4749L0838K6175K1161J6232J1360O324J312l424q370j4463
53368B862113k1799k9265l5773m1218m5986n0047n3045n4909n5926n6368n6439
53357B361338n6296n5857n4750n2806n0489m8451m6894m5681m4928m4946m5506
53346A814734m5668m4679m2807m0901l9298l7535l5225l2757l0779k9270k7579
53335A408236k5363k2982k0871j8946j6946j5063j3822j3459j3724j4193j4517
53324A218350j4492j4135j3654j3119j2291j0990r453q072o932n869m806l648
53312A100889k083J1K073L304L705M222N648P805R959J1695J3131J4525J5974
$$ plain form
53299 1190858 1208266 1227008 1247099 1268888 1292884 1319111 1346748 1374732 1402755 1431401 1461044
53288 1461044 1490813 1518934 1544186 1566818 1587850 1607644 1625461 1640390 1652263 1661378 1667677 1670706
53276 1670706 1670280 1666765 1660636 1652152 1641494 1628789 1613805 1595969 1575002 1551413 1526186 1500161
53264 1500161 1473670 1446578 1418543 1389475 1359813 1330162 1300645 1270970 1241151 1211693 1182942
53253 1182942 1154660 1126553 1098739 1071421 1044478 1017801 991704 966497 941886 917230 892293
53242 892293 867359 842784 818855 795962 774466 754394 735625 718334 702865 689168 676746
53231 676746 665237 654758 645537 637402 629755 621939 613564 604559 594906 584387 572716 559886 546151
53218 546151 531642 516364 500758 485875 472642 461197 451145 442133 433844 425816 417825 410152
$$ packed form
53299A190858J7408J8742K0091K1789K3996K6227K7637K7984K8023K8646K9643
53288A461044K9769K8121K5252K2632K1032J9794J7817J4929J1873R115O299L029
53276A670706m26l515o129q484j0658j2705j4984j7836k0967k3589k5227k6025
53264A500161k6491k7092k8035k9068k9662k9651k9517k9675k9819k9458k8751
53253A182942k8282k8107k7814k7318k6943k6677k6097k5207k4611k4656k4937
53242H92293k4934k4575k3929k2893k1496k0072j8769j7291j5469j3697j2422
53231F76746j1509j0479r221q135p647p816q375r005r653j0519j1671j2830j3735
53218E46151j4509j5278j5606j4883j3233j1445j0052r012q289q028p991p673
$$ plain form
53206 410152 403016 395999 388607 381158 374381 368235 361848 354691 347094 339506 331980 324680 318189 312767
53192 312767 307789 302490 296953 291882 287554 283618 279893 276866 275133 274536 274148 273147 271603 270235 269434
53177 269434 268768 267583 265882 264293 263257 262563 261720 260475 258926 257445 256543 256572 257375 258375 259029 259068 258357
53160 258357 256858 254776 252504 250319 248331 246744 245868 245802 246292 246990 247581 247681 246940 245399 243462 241404
53144 241404 239254 237291 236270 236751 238385 240181 241379 241847 241768 241336 240839 240725 241325 242506 243662 244158
53128 244158 243825 243040 242402 242426 243436 245416 247767 249491 249993 249628 249226 249220 249549 250139 250972 251735 251983 251750
53110 251750 251506 251411 251037 250009 248440 246635 244878 243721 243805 244987 246104 246151 245295 244271 243230 241827
53094 241827 240103 238471 236932 235091 233084 231773 231697 232390 233133 233959 235390 237382 239024 239433 238680 237696
$$ packed form
53206D10152p136p017p392p449o777o146o387p157p597p588p526p300o491n422
53192C12767m978n299n537n071m328l936l725l027j733n97l88j001j544j368q01
53177B69434o66j185j701j589j036o94q43j245j549j481r02K9Q03J000O54L9p11
53160B58357j499k082k272k185j988j587q76o6M90O98N91J00p41j541j937k058
53144B41404k150j963j021M81J634J796J198M68p9m32m97j14O00J181J156M96
53128B44158l33p85o38K4J010J980K351J724N02l65m02oL29N90Q33P63K48k33
53110B51750k44r5l74j028j569j805j757j157Q4J182J117M7q56j024j041j403
53094B41827j724j632j539j841k007j311p6O93P43Q26J431J992J642M09p53r84
$$ plain form
53078 237696 237328 237617 237990 238059 238047 238363 238958 239354 239284 239063 239209 239806 240385 240365 239558 238221 236741 235360 234214
53059 234214 233518 233512 234132 234887 235227 235059 234797 234899 235373 235840 236097 236509 237658 239552 241367 242212 242035 241537
53041 241537 241311 241324 241205 240630 239348 237280 234882 233114 232660 233259 233992 234148 233634 232715 231660 230664 229925
53024 229925 229695 230204 231402 232785 233693 233950 234013 234386 235084 235779 236253 236451 236354 236055 235811 235727 235558 235112 234706
53005 234706 234826 235413 235888 235918 235828 236152 237036 238217 239365 240280 240896 241236 241358 241319 241202 241101 241002 240753 240269
52986 240269 239702 239399 239727 240968 243074 245429 247211 248248 249210 250579 251777 251867 250977 250340 250882 252345
52970 252345 254019 255772 257956 260625 263300 265447 266975 268282 269845 271659 273160 273884 274107 274394 274649
52955 274649 274175 272856 271520 270722 269782 267726 264792 262153 260236 258247 255610 253094 251859 251844 251829 251045
$$ packed form
53078B37696l68K89L73O9j2L16N95L96p0k21J46N97N79k0q07j337j480j381j146
53059B34214o96oO20P55L40j68k62J02M74M67K57M12J149J894J815Q45j77m98
53041B41537k26J3j19n75j282k068k398j768m54N99P33J56n14r19j055r96p39
53024B29925k30N09J198J383R08K57O3L73O98O95M74J98r7k99k44q4j69m46m06
53005B34706J20N87M75L0r0L24Q84J181J148R15O16L40J22l9j17j01r9k49m84
52986B40269n67l03L28J241K106K355J782J037R62J369J198R0q90o37N42J463
52970B52345J674J753K184K669K675K147J528J307J563J814J501P24K23K87K55
52955B74649m74j319j336p98r40k056k934k639j917j989k637k516j235j5j5p84
$$ plain form
52939 251045 250029 249595 249581 249176 248264 247655 247810 248018 247339 245919 244656 243782 242557 240452 237912 235698 234111
52922 234111 233206 233172 233975 235089 236102 237217 238648 239953 240656 241177 242268 243673 244283 243640 242431 241249
52906 241249 239757 237577 235265 233761 233239 233129 233027 233086 233600 234537 235451 235705 234994 233819 233124 233296 233896
52889 233896 234563 235591 237176 238675 239309 239217 239079 238970 238465 237669 237195 237064 236597 235687 235257 236024 237544 239037
52871 239037 240455 242087 243679 244821 245868 247627 250194 252818 254905 256515 257790 258538 258643 258430 258308
52856 258308 258289 258075 257457 256527 255639 255115 254779 253841 251612 248343 245012 242256 239894 237542 235235 233162
52840 233162 231251 229322 227436 225750 224260 222966 222090 221792 221833 221820 221647 221400 221011 220378 219788 219780 220482 221399
52822 221399 221947 221945 221546 220915 220154 219355 218585 217855 217145 216402 215604 214978 215000 215928 217385 218746 219860 221012
$$ packed form
52939B51045j016m34j4m05r12o09J55K08o79j420j263q74j225k105k540k214j587
52922B34111r05l4Q03J114J013J115J431J305P03N21J091J405O10o43j209j182
52906B41249j492k180k312j504n22j10j02N9N14R37R14K54p11j175o95J72O00
52889B33896O67J028J585J499O34r2j38j09n05p96m74j31m67r10m30P67J520J493
52871B39037J418J632J592J142J047J759K567K624K087J610J275P48J05k13j22
52856B58308j9k14o18r30q88n24l36r38k229l269l331k756k362k352k307k073
52840B33162j911j929j886j686j490j294q76k98M1j3j73k47l89o33n90qP02R17
52822B21399N48kl99o31p61p99p70p30p10p43p98o26K2R28J457J361J114J152
$$ plain form
52804 221012 222175 222909 223183 223732 225091 226689 227449 227038 225958 224593 222865 220882 219193 218105 217249 216194
52788 216194 215129 214527 214378 214225 213886 213730 214151 215009 215747 216029 216157 216797 218193 219812 220978 221706 222486
52771 222486 223264 223227 221968 220363 219718 220320 221317 221909 222037 221905 221461 220648 219785 219358 219506 219911 220078 219780
52753 219780 219321 219299 219932 220731 221109 221130 221286 221666 221902 221988 222534 223971 226011 228191 230524 233210 236015 238333
52735 238333 239738 240218 240095 239970 240530 242072 244294 246662 248747 250139 250484 249976 249435 249466 249749 249556 248726
52718 248726 247628 246416 244894 243072 241288 239739 238305 236935 235811 235001 234313 233631 233099 232848 232732 232445
52702 232445 231781 230750 229702 229307 230156 232193 234576 236208 236513 235906 235512 236151 237444 238213 237903 237228 237141
52685 237141 237668 238234 238725 239510 240617 241635 242460 243413 244485 245034 244501 242988 240989 238961 237251 236070
$$ packed form
52804B21012J163P34K74N49J359J598P60m11j080j365j728j983j689j088q56j055
52788B16194j065o02j49j53l39j56M21Q58P38K82J28O40J396J619J166P28P80
52771B22486P78l7j259j605o45O02R97N92J28j32m44q13q63m27J48M05J67k98
52753B19780m59k2O33P99L78K1J56L80K36Q6N46J437K040K180K333K686K805K318
52735B38333J405M80j23j25N60J542K222K368K085J392L45n08n41L1K83j93q30
52718B48726j098j212j522j822j784j549j434j370j124q10o88o82n32k51j16k87
52702B32445o64j031j048l95Q49K037K383J632L05o07l94O39J293P69l10o75q7
52685B37141N27N66M91P85J107J018Q25R53J072N49n33j513j999k028j710j181
$$ plain form
52669 236070 235395 235129 235345 236015 236652 236789 236758 237390 238894 240666 242237 243701 245034 245825 246064 246554 248027
52652 248027 250337 252854 255173 257046 258182 258588 258653 258498 257750 256331 254883 253852 252736 250914 248769
52637 248769 247242 246663 246743 247315 248239 248862 248580 247923 248150 249620 251304 252163 252321 252621 253579 255067 256539
52620 256539 257268 256704 254929 252566 250128 247735 245565 244098 243679 244117 244950 245887 246771 247379 247528 247301 246941
52603 246941 246529 245948 245161 244412 244045 244102 244242 244242 244459 245496 247343 249239 250560 251465 252359 253142 253495 253580 253898
52584 253898 254585 255452 256573 258184 259928 260917 260788 260215 260083 260544 261132 261438 261350 260935 260410 260041 259822 259443
52566 259443 258820 258434 258795 259660 260064 259235 257295 255030 253097 251588 250237 248872 247524 246262 245202 244652
52550 244652 244865 245538 245912 245617 245120 245031 245292 245498 245671 246161 246866 247195 246858 246216 245763 245669 245902 246358 246798
$$ packed form
52669B36070o75k66K16O70O37J37l1O32J504J772J571J464J333P91K39M90J473
52652B48027K310K517K319J873J136M06O5j55p48j419j448j031j116j822k145
52637B48769j527n79Q0N72R24O23k82o57K27J470J684Q59J58L00R58J488J472
52620B56539P29n64j775k363k438k393k170j467m19M38Q33R37Q84O08J49k27l60
52603B46941m12n81p87p49l67N7J40%K17J037J847J896J321R05Q94P83L53Q5L18
52584B53898O87Q67J121J611J744R89j29n73j32M61N88L06q8m15n25l69k19l79
52566B59443o23l86L61Q65M04q29j940k265j933j509j351j365j348j262j060n50
52550B44652K13O73L74k95m97q9K61K06J73M90P05L29l37o42m53r4K33M56M40
$$ plain form
52531 246798 247062 247455 248458 249967 251266 251881 252060 252245 252509 252700 252752 252606 252243 251997 252418 253554 254784
52514 254784 255669 256596 258180 260401 262764 265033 267345 269790 272299 274854 277417 279700 281343 282228 282372
52499 282372 281653 280021 277853 275705 273696 271482 268835 265960 263244 260995 259436 258616 258199 257588 256458
52484 256458 255041 253847 253254 253396 254208 255432 256704 257830 258926 260184 261528 262645 263396 264067 265159
52469 265159 266910 269090 271184 272716 273491 273780 274305 275787 278313 281270 284022 286442 288487 289571 288889
52454 288889 286467 283376 280729 278709 276766 274465 271862 269325 267217 265646 264293 262632 260536 258561
52440 258561 257400 257052 256762 255828 254367 253187 252899 253241 253435 253185 253052 253556 254225 254073 253010 252181 252689
52423 252689 254425 256474 258216 259588 260561 260993 260964 260874 261098 261788 263089 265301 268735 273457 279209 285584
$$ packed form
52531B46798K64L93J003J509J299O15J79J85K64J91N2j46l63k46M21J136J230
52514B54784Q85R27J584K221K363K269K312K445K509K555K563K283J643Q85J44
52499B82372p19j632k168k148k009k214k647k875k716k249j559q20m17o11j130
52484B56458j417j194n93J42Q12J224J272J126J096J258J344J117P51O71J092
52469B65159J751K180K094J532P75K89N25J482K526K957K752K420K045J084o82
52454B88889k422l091k647k020j943k301k603k537k108j571j353j661k096j975
52440B58561j161l48k90r34j461j180k88L42J94k50j33N04O69j52j063q29N08
52423B52689J736K049J742J372R73M32k9r0K24O90J301K212L434M722N752O375
$$ plain form
52407 285584 292373 299830 308430 318238 328606 338507 346945 352973 355722 354854 350983 345345 338987 332340
52393 332340 325446 318406 311591 305566 300751 297130 294374 292243 290672 289441 288189 286978 286517 287403 289345
52378 289345 291436 293076 294276 295316 296596 298743 302250 306844 311646 316163 320749 325834 331039 335489
52364 335489 338865 341722 344604 347137 348278 347508 345559 343823 343127 343308 343850 344557 345432 346290 346868 347195
52348 347195 347556 348197 349295 351092 353698 356827 360067 363443 367401 372199 377664 383625 390234 397670 405817
52333 405817 414500 423826 434020 445077 456898 469712 484018 499987 517134 534810 552891 571819
52321 571819 591953 613072 634598 656152 677715 699247 720383 740645 759842 778186 796010
52310 796010 813441 830345 846516 861903 876622 890728 903982 915922 926185 934760 942000 948411
$$ packed form
52407B85584O789P457Q600R808J0368R901Q438O028K749q68l871n638o358o647
52393C32340o894p040o815o025m815l621k756k131j571j231j252j211m61Q86J942
52378B89345K091J640J200J040J280K147L507M594M802M517M586N085N205M450
52364C35489L376K857K882K533J141p70j949j736o96J81N42P07Q75Q58N78L27
52348C47195L61O41J098J797K606L129L240L376L958M798N465N961O609P436Q147
52333D05817Q683R326J0194J1057J1821J2814J4306J5969J7147J7676J8081J8928
52321E71819K0134K1119K1526K1554K1563K1532K1136K0262J9197J8344J7824
52310G96010J7431J6904J6171J5387J4719J4106J3254J1940J0263Q575P240O411
$$ plain form
52298 948411 954291 959444 963366 965883 967420 968324 968060 965560 960385 953170 944822 935805 926444 917362 909073
52283 909073 901446 894140 887452 882255 879135 878001 878569 880786 884676 890130 897060 905571 915832 927914
52269 927914 941784 957263 973853 990714 1006935 1021891 1035532 1048410 1061300 1074445 1087213
52258 1087213 1098722 1108840 1118294 1127727 1136890 1144939 1151415 1156661 1161266 1165242 1167889 1168446 1166740 1163112
52244 1163112 1157834 1150860 1142144 1131937 1120626 1108500 1095813 1082894 1069974 1057081 1044303 1032072
52232 1032072 1020942 1011154 1002528 994746 987601 981115 975526 971037 967440 964183 960977 958168 956337 955729
52218 955729 956251 957733 959914 962411 965058 968073 971587 975288 979000 983354 989254 996682 1004565 1011884
52204 1011884 1018381 1024142 1029079 1033203 1036965 1040917 1045091 1048964 1052004 1054219 1056189 1058535 1061269 1063862
$$ packed form
52298I48411N880N153L922K517J537R04k64k500n175p215q348r017r361r082q289
52283I09073p627p306o688n197l120j134N68K217L890N454O930Q511J0261J2082
52269I27914J3870J5479J6590J6861J6221J4956J3641J2878J2890J3145J2768
52258A087213J1509J0118R454R433R163Q049O476N246M605L976K647N57j706l628
52244A163112n278o974q716j0207j1311j2126j2687j2919j2920j2893j2778j2231
52232A032072j1130r788q626p782p145o486n589m489l597l257l206k809j831o08
52218I55729N22J482K181K497K647L015L514L701L712M354N900P428P883P319
52204A011884O497N761M937M124L762L952M174L873L040K215J970K346K734K593
$$ plain form
52190 1063862 1066116 1068622 1071995 1075876 1079258 1081617 1083056 1083432 1082195 1079356 1075827 1072303 1068387 1063387
52176 1063387 1057492 1051511 1045657 1039304 1031958 1024002 1016408 1010021 1005143 1001519 998600 996043 993990 992813
52162 992813 992667 993459 995149 997838 1001503 1005821 1010314 1014567 1018306 1021345 1023566 1024963 1025629 1025635 1024881 1023207
52146 1023207 1020767 1018188 1016215 1015292 1015565 1017071 1019551 1022244 1024327 1025686 1026949 1028764 1031410 1035131
52132 1035131 1040297 1047028 1055070 1064339 1075242 1088218 1103348 1120747 1140992 1164620 1191304 1219922
52120 1219922 1249349 1278927 1308359 1337576 1366710 1395838 1424594 1452213 1477925 1501221 1521831
52109 1521831 1539712 1554983 1567672 1577528 1584285 1588073 1589320 1588269 1584876 1579318 1572389 1565192 1558408
52096 1558408 1551945 1545323 1538320 1531102 1523736 1515832 1506873 1496755 1485716 1473837 1460992 1447337 1433484
$$ packed form
52190A063862K254K506L373L881L382K359J439L76j237k839l529l524l916n000
52176A063387n895n981n854o353p346p956p594o387m878l624k919k557k053j177
52162I92813j46P92J690K689L665M318M493M253L739L039K221J397O66Op54j674
52146A023207k440k579j973r23K73J506K480K693K083J359J263J815K646L721
52132A035131N166O731Q042R269J0903J2976J5130J7399K0245K3628K6684K8618
52120A219922K9427K9578K9432K9217K9134K9128K8756K7619K5712K3296K0610
52109A521831J7881J5271J2689R856O757L788J247j051l393n558o929p197o784
52096A558408o463o622p003p218p366p904q959j0118j1039j1879j2845j3655j3853
$$ plain form
52083 1433484 1420061 1407482 1396333 1387578 1381994 1379511 1379385 1380952 1384153 1389475 1397453 1407955 1419860
52070 1419860 1431763 1443215 1455052 1468372 1483487 1499929 1516966 1533762 1549501 1563788 1576725
$$ packed form
52083A433484j3423j2579j1149q755n584k483j26J567L201N322P978J0502J1905
52070A419860J1903J1452J1837J3320J5115J6442J7037J6796J5739J4287J2937
$$ [...]
##END NTUPLES=NMR SPECTRUM
##END=
