
##TITLE=AC1302_PERAH12114_6608382_PZ89wDSsjw
##JCAMPDX= 6.0         $$ Bruker NMR JCAMP-DX V2.0
##DATA TYPE= NMR SPECTRUM
##DATA CLASS= NTUPLES
##ORIGIN= BRUKER
##OWNER= Administrator
$$ 1.72 TOPSPIN		Version 2.1
$$ 2012-08-01 14:55:54.250 -0500  Administrator@TOPSPIN
$$ Compression mode = diff/dup
##.OBSERVE FREQUENCY= 400.02188249412
##.OBSERVE NUCLEUS= ^1H
##.ACQUISITION MODE= SIMULTANEOUS (DQD)
##.ACQUISITION SCHEME= undefined
##.AVERAGES= 8
##.DIGITISER RES= 22
##SPECTROMETER/DATA SYSTEM= spect
##.PULSE SEQUENCE= zg30
##.SOLVENT NAME= COFFEE_meoh
##.SHIFT REFERENCE= INTERNAL, COFFEE_meoh, 1, 14.98509
##AUDIT TRAIL= $$ (NUMBER, WHEN, WHO, WHERE, PROCESS, VERSION, WHAT)
$$ ##TITLE= Audit trail, TOPSPIN		Version 2.1
$$ ##JCAMPDX= 5.01
$$ ##ORIGIN= Bruker BioSpin GmbH
$$ ##OWNER= Administrator
$$ $$ C:\Bruker\TOPSPIN/data/COFFEE/nmr/AC1302_PERAH12114_6608382_PZ89wDSsjw/20/pdata/1/auditp.txt
$$ ##AUDIT TRAIL=  $$ (NUMBER, WHEN, WHO, WHERE, PROCESS, VERSION, WHAT)
(   1,<2012-08-01 14:55:46.250 -0500>,<Administrator>,<TOPSPIN>,<go>,<TOPSPIN 2.1>,
      <created by zg
	started at 2012-08-01 14:54:39.656 -0500,
	POWCHK enabled, PULCHK disabled,
       configuration hash MD5:
       6B 1B 68 BB D9 2E 58 E2 7F 35 AD 54 07 DF 0E 41
       data hash MD5: 64K
       18 EE 25 DB 40 5E 40 46 30 83 36 35 5B 9E FA 70>)
(   2,<2012-08-01 14:55:49.765 -0500>,<Administrator>,<TOPSPIN>,<proc1d>,<TOPSPIN 2.1>,
      <Start of raw data processing
       efp LB = 0 FT_mod = 6 PKNL = 1 PHC0 = 0 PHC1 = 0 SI = 32K 
       data hash MD5: 32K
       48 FE 61 FF 68 01 5A 3D F8 3E 14 A9 9E BC 57 D3>)
(   3,<2012-08-01 14:55:50.093 -0500>,<Administrator>,<TOPSPIN>,<proc1d>,<TOPSPIN 2.1>,
      <pk PHC0 = 178.9233 PHC1 = 0 
       data hash MD5: 32K
       3B 25 9C EC 3C 31 D6 21 E5 C9 C9 9E 73 35 FE 60>)
(   4,<2012-08-01 14:55:50.156 -0500>,<Administrator>,<TOPSPIN>,<proc1d>,<TOPSPIN 2.1>,
      <abs ABSG = 1 
       data hash MD5: 32K
       1E 2C 25 E4 41 29 8A 8D D4 3D 7E 18 E3 BE AF C5>)
(   5,<2012-08-01 14:55:50.187 -0500>,<Administrator>,<TOPSPIN>,<proc1d>,<TOPSPIN 2.1>,
      <abs ABSG = 2 
       data hash MD5: 32K
       CE AE 9B 0D D3 7B 46 AE D1 A1 5B C5 60 FA 96 DD>)
(   6,<2012-08-01 14:55:50.218 -0500>,<Administrator>,<TOPSPIN>,<proc1d>,<TOPSPIN 2.1>,
      <abs ABSG = 3 
       data hash MD5: 32K
       91 BD 4D A1 65 9D F9 D5 70 89 45 DB B8 03 7C D6>)
(   7,<2012-08-01 14:55:50.250 -0500>,<Administrator>,<TOPSPIN>,<proc1d>,<TOPSPIN 2.1>,
      <abs ABSG = 4 
       data hash MD5: 32K
       A3 8A C8 CD 8E D2 B9 C2 3E 5F FD 0B C0 50 72 91>)
(   8,<2012-08-01 14:55:50.281 -0500>,<Administrator>,<TOPSPIN>,<proc1d>,<TOPSPIN 2.1>,
      <abs ABSG = 5 
       data hash MD5: 32K
       3E 13 66 BC 2E 10 6B 82 D0 98 18 C1 4B F7 09 1D>)
$$ ##END=
$$ 
$$ $$ hash MD5
$$ $$ C9 ED 54 07 83 8E 90 40 81 62 61 59 BB 72 54 31
##$RELAX= 
##$RELAX= 
##$RELAX= 
##$RELAX= 
##$RELAX= 
##$RELAX= 
##$RELAX= 
$$ Bruker specific parameters
$$ --------------------------
$$ [...]
##$TP= (0..7)
150 150 150 150 150 150 150 150
##$TP07= 0
##$TPNAME0= <>
##$TPNAME1= <>
##$TPNAME2= <>
##$TPNAME3= <>
##$TPNAME4= <>
##$TPNAME5= <>
##$TPNAME6= <>
##$TPNAME7= <>
##$TPOAL= (0..7)
0.5 0.5 0.5 0.5 0.5 0.5 0.5 0.5
##$TPOFFS= (0..7)
0 0 0 0 0 0 0 0
##$TUNHIN= 0
##$TUNHOUT= 0
##$TUNXOUT= 0
##$USERA1= <user>
##$USERA2= <user>
##$USERA3= <user>
##$USERA4= <user>
##$USERA5= <user>
##$V9= 5
##$VALIST= <valist>
##$VCLIST= <CCCCCCCCCCCCCCC>
##$VD= 0
##$VDLIST= <DDDDDDDDDDDDDDD>
##$VPLIST= <PPPPPPPPPPPPPPP>
##$VTLIST= <TTTTTTTTTTTTTTT>
##$WBST= 1024
##$WBSW= 4
##$XGAIN= (0..3)
0 0 0 0
##$XL= 0
##$YL= 0
##$YMAX_a= 452783
##$YMIN_a= -577988
##$ZGOPTNS= <>
##$ZL1= 120
##$ZL2= 120
##$ZL3= 120
##$ZL4= 120
##$ABSF1= 14.98509
##$ABSF2= -5.573092
##$ABSG= 5
##$ABSL= 3
##$ALPHA= 0
##$AQORDER= 0
##$ASSFAC= 0
##$ASSFACI= 0
##$ASSFACX= 0
##$ASSWID= 0
##$AUNMP= <proc_prof1d_extract_pilot.lims>
##$AXLEFT= 0
##$AXNAME= <>
##$AXNUC= <1H>
##$AXRIGHT= 0
##$AXTYPE= 0
##$AXUNIT= <>
##$AZFE= 0.1
##$AZFW= 0.1
##$BCFW= 0
##$BC_mod= 0
##$BYTORDP= 0
##$COROFFS= 0
##$CY= 15
##$DATMOD= 1
##$DC= 0
##$DFILT= <>
##$DTYPP= 0
##$F1P= 0
##$F2P= 0
##$FCOR= 0.5
##$FTSIZE= 32768
##$FT_mod= 6
##$GAMMA= 0
##$GB= 0
##$INTBC= 1
##$INTSCL= 1
##$ISEN= 128
##$LB= 0
##$LEV0= 0
##$LPBIN= 0
##$MAXI= 10000
##$MC2= 0
##$MEAN= 0
##$ME_mod= 0
##$MI= 0
##$NCOEF= 0
##$NC_proc= -8
##$NLEV= 6
##$NOISF1= 0
##$NOISF2= 0
##$NSP= 0
##$NTH_PI= 0
##$NZP= 0
##$OFFSET= 14.98509
##$PC= 1
##$PHC0= 178.9233
##$PHC1= 0
##$PH_mod= 1
##$PKNL= yes
##$PPARMOD= 0
##$PPDIAG= 0
##$PPIPTYP= 0
##$PPMPNUM= 2147483647
##$PPRESOL= 1
##$PSCAL= 4
##$PSIGN= 0
##$PYNMP= <proc.py>
##$REVERSE= no
##$SF= 400.02
##$SI= 32768
##$SIGF1= 0
##$SIGF2= 0
##$SINO= 400
##$SIOLD= 32768
##$SPECTYP= <>
##$SREGLST= <1H.CDCl3>
##$SSB= 0
##$STSI= 32768
##$STSR= 0
##$SW_p= 8223.68421052631
##$SYMM= 0
##$S_DEV= 0
##$TDeff= 65536
##$TDoff= 0
##$TI= <>
##$TILT= no
##$TM1= 0
##$TM2= 0
##$TOPLEV= 0
##$USERP1= <user>
##$USERP2= <user>
##$USERP3= <user>
##$USERP4= <user>
##$USERP5= <user>
##$WDW= 1
##$XDIM= 32768
##$YMAX_p= 423005065
##$YMIN_p= -838770
##$CURPLOT= <Network HP LaserJet P1505>
##$CURPRIN= <$Network HP LaserJet P1505>
##$DFORMAT= <normdp>
##$LAYOUT= <+/1D_H.xwp>
##$LFORMAT= <normlp>
##$PFORMAT= <normpl>
##$SURQMSG= 1
$$ End of Bruker specific parameters
$$ ---------------------------------
##NTUPLES= NMR SPECTRUM
##VAR_NAME=  FREQUENCY,     SPECTRUM/REAL,   SPECTRUM/IMAG
##SYMBOL=    X,             R,               I
##VAR_TYPE=  INDEPENDENT,   DEPENDENT,       DEPENDENT
##VAR_FORM=  AFFN,          ASDF,            ASDF
##VAR_DIM=   32768,         32768,           32768
##UNITS=     HZ,            ARBITRARY UNITS, ARBITRARY UNITS
##FACTOR=    0.250966925370066, 1,           1
##FIRST=     8223.43324360094, -137021,      -68486
##LAST=      0,             -33746,          47090
##MIN=       0,             -838770,         0
##MAX=       8223.43324360094, 423005065,    0
$$ Real data points
##PAGE= N=1
##DATA TABLE= (X++(R..R)), XYDATA
$$ [...]
19557B9717J1651R9826b28745d3459G0965a17656j0019G4210d1455a8732j86389
19546b05121d8396f597n4782j45361A4566c34706C7391J74552b84814H7568a37419
19534I5000b34202l44492A5798c3065B46817a78996C07694d42773h3528A04487
19523A3702L1538c43551R9202F4712l0377a98567b0072m4356I2913C0571a97154
19511A71979R0135h6548j09307I8064a10265M588k18092E4784a05675A07227d9790
19499B54942E0321K13902a40337c1448A91990a34538E488L4991P0164a69340L9185
19488a30155p5031O753a9090k3802k24146J21217J9798D8636f747J586n1627k08746
19476b65534B98458f3999E556J92021c66548F8729I674K03908a49413k6510K5620
$$ plain form
19557 29717 41368 141194 -228745 -43459 70965 -117656 -127675 74210 -41455 -18732 -205121
19546 -205121 -48396 -6597 -61379 -206740 14566 -334706 37391 211943 -284814 87568 -137419
19534 95000 -234202 -578694 15798 -33065 246817 -178996 307694 -442773 -83528 104487
19523 13702 45240 -343551 -244349 64712 34335 -198567 -20072 -64428 92913 30571 -197154
19511 171979 262114 -86548 -195855 98064 -110265 -105677 -323769 54784 -105675 107227 -49790
19499 254942 50321 264223 -140337 -31448 191990 -134538 5488 40479 110643 -169340 -130155
19488 -130155 -205186 -198433 -19090 -42892 -267038 -145821 -126023 48636 -6747 -5161 -56788 -265534
19476 -265534 298458 -63999 5556 197577 -366548 68729 9674 213582 -149413 -175923 -150303
19465a50303M4665N0981j27319C21088o1562g7672B5521a0754l05153A6962M1790
19454E8752a63071A94308a52370c8648j65213J3420C63879A9178b63098J00802
19444a62296L4638A93326i9742j6160a8624j27992k00678a58292F705L03338b68420
19432a60664P0881l1662b8136I6171l1246c03731G8617l4147d9339o7155j11599
19421b28093K9634q0005E0189K6360a31974q9478J1047l9651r0516J63365G5158
19409a68210A23222a77928m92568F1459O6592N2589a71026j57042e45H2391h0864
19397b10823f4042M76A49016a48991C5180J09703j9002a41709O1851m5268A93659
19385A8678D199a03785n3455B38933e0691k05294c1798j66094D8931e5800j93845
$$ plain form
19465 -150303 -105638 -54657 -181976 321088 259526 -77672 25521 -10754 -315907 16962 58752
19454 58752 -163071 194308 -152370 -38648 -203861 -190441 363879 19178 -263098 -162296
19444 -162296 -127658 193326 -99742 -115902 -18624 -146616 -347294 -158292 6705 310043 -268420
19432 -160664 -89783 -121445 -28136 96171 64925 -303731 78617 44470 -49339 -116494 -228093
19421 -228093 -198459 -278464 50189 76549 -131974 -221452 -210405 -250056 -340572 -177207 75158
19409 -168210 123222 -177928 -670496 61459 128051 180640 -171026 -328068 -545 82391 -80864
19397 -210823 -64042 -63566 149016 -148991 35180 144883 125881 -141709 -79858 -125126 193659
19385 18678 4199 -103785 -157240 238933 -50691 -255985 -31798 -197892 48931 -55800 -249645
19374b49645C6273a77963f5750K6793A16213A7178d16514a78087A31619a66974
19363b1616j59951l3807B02928F8880J61697b68256a31363L1221C01949a03181
19352d4378b2162p0990d2439n2224B9425c20688A17714N4088C146a45840A07645
19340A50037a25913K1522j36908G4725a08588A30238C6316R7028m5787J11360
19330A98917B2819b66742B18130a568l10226A14092m6481j1645b39314b6739E7460
19318B3818a6816l3731F8613a07909p6858B53137N7345a87541b2605B88852b7956
19306a75236A33339m991J30685A26751b22103N9248A53182n0735M7244c4562G7716
19294b58055A89340E2357a02607M1452j8423k24330a45356A03187g1970A42641
$$ plain form
19374 -249645 36273 -177963 -65750 -38957 116213 17178 -416514 -178087 131619 -166974
19363 -21616 -181567 -215374 202928 68880 230577 -268256 -131363 -100142 301949 -103181
19352 -44378 -22162 -93152 -42439 -94663 29425 -320688 117714 171802 3146 -145840 107645
19340 150037 -125913 -104391 -241299 74725 -108588 130238 36316 133344 87557 198917
19330 198917 22819 -266742 218130 -1568 -311794 114092 67611 55966 -239314 -26739 57460
19318 23818 -16816 -50547 68613 -107909 -184767 253137 310482 -187541 -22605 288852 -27956
19306 -175236 133339 128348 259033 126751 -222103 -162855 153182 102447 149691 -34562 77716
19294 -258055 189340 52357 -102607 -61155 -79578 -303908 -145356 103187 -71970 142641
19283c1821l2528D2225a33396G2629J37615j02813f5008l5321j77484R1204k13885
19272d00494a7102h478n7817j52389h9794K0593j58747j39275P5654r5345B39547
19260b7762l0203F2471f7049A23005b06301f4177j27386A12617b65305a24125
19249c68996C5113a50324j57680a44436k73885d8169k67469g6765B0170c35761
19238a8871j00395A8628b57272m6444J44094o7088a00255I1012m2479b9313D6729
19226a37619d5961r2056B0173J51951H6057J22231l6620b85866d2520R253D2369
19214b85685B4602a53088j17296g4673B65400A26226C406b65213o3444c6172r5283
19203a31455B10095c6235D69802b34060b6180B16904M3090C3371a53918E5310
$$ plain form
19283 -31821 -64349 42225 -133396 72629 210244 107431 -65008 -100329 -277813 -186609 -400494
19272 -400494 -17102 -8478 -66295 -218684 -89794 -69201 -227948 -367223 -291569 -386914 239547
19260 -27762 -57965 62471 -67049 123005 -206301 -64177 -191563 112617 -265305 -124125
19249 -368996 35113 -150324 -308004 -144436 -418321 -48169 -315638 -76765 20170 -335761
19238 -18871 -119266 18628 -257272 -303716 -159622 -226710 -100255 91012 48533 -29313 46729
19226 -137619 -45961 -138017 20173 172124 86057 208288 171668 -285866 -42520 -33267 42369
19214 -285685 24602 -153088 -270384 -74673 265400 126226 3406 -265213 -328657 -36172 -131455
19203 -131455 210095 -36235 469802 -234060 -26180 216904 259994 33371 -153918 55310
19192c7142J5971k01549d6010A02835a08562C14923I6679a85620A71092A5218
19181b79983I7065a21615B4767J57309a19417A65528L8177a22221D3019O7703
19171A10722C5138J68618a28238B58155n8402i7476F2194f985F9089J1223a52047
19159c58225I418a9475k02631F414b91086d7615j10320L9685M9973B25995a02366
19147a61612C83736b50600l5867i0486k26236J09786q3709J29654B2236Q8425
19137A10661a00703A88417a93616H2156c3865k13736A09914N0480f619j98725
19127b05344A46633F9407a70205j27265E8634b06773B61808a26392l62304K08605
19117b80091G4675N7119a61517l20519G6877e04271A10353a37831j75690A80040
$$ plain form
19192 -37142 -21171 -222720 -46010 102835 -108562 314923 96679 -185620 171092 15218
19181 -279983 97065 -121615 24767 182076 -119417 165528 203705 -122221 43019 110722
19171 110722 35138 203756 -128238 258155 199753 -97476 62194 -6985 69089 80312 -152047
19159 -358225 9418 -19475 -222106 6414 -291086 -47615 -157935 -118250 -68277 225995 -102366
19147 -161612 383736 -250600 -286467 -90486 -316722 -206936 -290645 -160991 22236 110661
19137 110661 -100703 188417 -193616 82156 -33865 -247601 109914 160394 -6619 -205344
19127 -205344 146633 69407 -170205 -297470 58634 -206773 261808 -126392 -488696 -280091
19117 -280091 74675 131794 -161517 -482036 76877 -504271 110353 -137831 -313521 180040
19106A72818d46716D5995e0436D9384g7276n9972L4638o4347o8298k03824c8906
19094b46659C8415b45925E5462a36420A79153a99507M95g2097A4087a22596A67015
19082a54125A2948D499b46666i0587E4027b80472J06895M2909J414B1394R9700
19071A21094b90955a15456m443F4294M7131C4475b96589I8597k0087a86268h1971
19059e2078r4540A08615i461k42237a17443N4843E2832i5581k84041A39649a95305
19047a38372M8497E3176b16493A28487a14748A76694h8082l45771g1372j588A61642
19035c04999a28533H7524b91886E22799A23485J87700G0167A8699Q3450A8959
19024c43429A43155J01522p1068C5243j1338K96808G7229d0300a9746l9517a8103
$$ plain form
19106 172818 -446716 45995 -50436 49384 -77276 -137248 -102610 -166957 -235255 -439079 -38906
19094 -246659 38415 -245925 55462 -136420 179153 -199507 -199012 -72097 14087 -122596 167015
19082 -154125 12948 4499 -246666 -90587 54027 -280472 -173577 -130668 -129254 21394 121094
19071 121094 -290955 -115456 -119899 64294 111425 34475 -296589 98597 78510 -186268 -81971
19059 -52078 -146618 108615 -9461 -251698 -117443 -62600 52832 -95581 -379622 139649 -195305
19047 -138372 -89875 53176 -216493 128487 -114748 176694 -88082 -433853 -71372 -72960 161642
19035 -304999 -128533 87524 -291886 522799 123485 311185 70167 18699 102149 18959
19024 -343429 143155 244677 173609 35243 23905 320713 77229 -40300 -19746 -59263 -18103
19012b73188h3201A65559p5927J26211a05671b577A21167K248c77708a12739C66755
19000a2178j39796M6863k09303A55644a32904d2313j96920E7336h470j22146H3359
18988b83029A02233c2353p292I9607g2516a092k34844N9366q6622A5366K03845
18977B19211J1955b48473C6691a56536c9518j10722m3979c0018G3563K32685i7413
18965B17694n2336A4616b41058A84850a38855F7435a29593B81519h0238j53079
18955b33317A06976a23451l28024A26888n5101L2467a56653C2094N5517a39735
18944a79770A08098d14090a09841k0463b8290l5611e031A02419i0974A47969F0303
18932F9130P9236a55819f2875K3923r0631j44221j79714C9708M2872a45363B4782
$$ plain form
19012 -273188 -83201 165559 89632 215843 -105671 -2577 121167 123415 -377708 -112739 366755
19000 -12178 -151974 -105111 -314414 155644 -132904 -42313 -239233 57336 -8470 -130616 83359
18988 -283029 102233 -32353 -39645 99607 -72516 -1092 -235936 -176570 -263192 15366 219211
18977 219211 231166 -248473 36691 -156536 -39518 -150240 -194219 -30018 73563 306248 -97413
18965 217694 165358 14616 -241058 184850 -138855 67435 -129593 281519 -80238 -233317
18955 -233317 106976 -123451 -451475 126888 71787 104254 -156653 32094 87611 -139735
18944 -179770 108098 -414090 -109841 -130304 -28290 -63901 -5031 102419 -90974 147969 60303
18932 69130 148366 -155819 -62875 -38952 -129583 -273804 -453518 39708 82580 -145363 24782
18920e9790I3073k5713f9419m3150q6053f7966m0158D6696J59064b32549N5128
18909a77421j31432O471A27476J05749b57724c3407o5733k35595c3841C45910
18898C09528a71670A32601h2628B48396h4783K2871A57097d7551k1652a4617B15624
18886F4864b37330H3762f7807j00863P075E27321a47120j61470L9559A94047m0336
18875A53711D7823k0394c67937E4i7469D7096P5064B9836i7071k2109j0787B74707
18862a75428f035k80337k10097a23193C17192c3993k32241E0006d7227n3431p3035
18851a73693A38525D4085k0447Q8730N8999a90616e4125E5229k7325O0160j8155
18840F9909b26195j85439i3605F5617b12154O107B2312L30071a48642A11525a96652
$$ plain form
18920 -59790 93073 67360 -69419 -112569 -198622 -67966 -108124 46696 205760 -232549 -177421
18909 -177421 -308853 -302382 127476 233225 -257724 -33407 -99140 -334735 -33841 345910
18898 309528 -171670 132601 -82628 248396 -84783 -61912 157097 -47551 -69203 -14617 215624
18886 64864 -237330 83762 -67807 -168670 -161595 527321 -147120 -308590 -269031 194047 153711
18875 153711 47823 27429 -367937 54 -97469 47096 122160 29836 -97071 -119180 -129967 274707
18862 -175428 -6035 -286372 -496469 -123193 317192 -33993 -266234 50006 -47227 -100658 -173693
18851 -173693 138525 44085 23638 112368 171367 -190616 -54125 55229 27904 88064 69909
18840 69909 -226195 -411634 -93605 65617 -212154 -206047 22312 352383 -148642 111525 -196652
18828b00743H2912B45b90018A1296K08577q2544F6201e3425q5466F7157a34095
18816F3023J83944a96708H1214k1020a54222p0396A97273P3519a41276O3451A48673
18804C11021I3210j0750B9740c02820M3185B29416e00333J47251J10180A4103
18793c78108B22766b37312G7483J87392a09698k48767J50818b0183l36603J33417
18783b23369O6249M6585C0199a76845A8138c3453A08776a21203K6231r7426I2305
18771c35770p762C02170a11097M0789l2908d5192m1943B2014J36387a29558C8571
18759a48238j19804R715f4884F6712a49661B45174b38094p2543A31663A795K37032
18748B38827b53120Q4988f9849j43620B1228J15960B08J72438G8435a05052k676
$$ plain form
18828 -200743 82912 245 -290018 11296 219873 137329 66201 -53425 -138891 67157 -134095
18816 63023 246967 -196708 81214 60194 -154222 -224618 197273 270792 -141276 -77825 148673
18804 311021 93210 82460 29740 -302820 -259635 229416 -500333 -353082 -242902 14103
18793 -378108 222766 -237312 77483 264875 -109698 -358465 -207647 -20183 -356786 -223369
18783 -223369 -157120 -110535 30199 -176845 18138 -33453 108776 -121203 -94972 -192398 92305
18771 -335770 -343532 302170 -111097 -70308 -103216 -45192 -87135 22014 158401 -129558 38571
18759 -148238 -268042 -258327 -64884 66712 -149661 245174 -238094 -310637 131663 1795 238827
18748 238827 -253120 -168132 -69849 -213469 21228 137188 208 172646 78435 -105052 -107728
18737a07728J1438j4891a0721o2540k58823c5028k50137C8113a4449p9459F1785
18725A55405f7441o2978B01428G455a71070A61110K37295c73093h4221G0249A7647
18713A00044i4652E5067H542J49157G040k025b05823E7812b1221n3998B12990
18701a94258j7679m5100O685A0282a33733k14395B69216h6955A20887J28278a9525
18689a34955E5085a02504k06732J07715A66806a74766A14580a74292O4294j80832
18679b90830a6461E2463b34899A91483j8444K0918n3003J40501f0136A58521n3252
18668A05269e3685l257j72134R0368B92587f7759j39474K3956j633k4936B0884
18656A82308i9133a3258F8661b09385r2821A51199c35685i1074E6014b68912j39405
$$ plain form
18737 -107728 -96290 -111181 -10721 -73261 -332084 -35028 -285165 38113 -14449 -93908 61785
18725 155405 -67441 -130419 201428 7455 -171070 161110 398405 -373093 -84221 70249 17647
18713 100044 -94652 55067 8542 157699 7040 5015 -205823 57812 -21221 -75219 212990
18701 -194258 -211937 -257037 -250352 10282 -133733 -348128 269216 -86955 120887 249165 -19525
18689 -134955 55085 -102504 -309236 -201521 166806 -174766 114580 -174292 -109998 -290830
18679 -290830 -16461 52463 -234899 191483 173039 193957 140954 281455 -60136 158521 105269
18668 105269 -53685 -56942 -229076 -138708 292587 -67759 -207233 -183277 -184910 -209846 20884
18656 182308 -99133 -13258 68661 -209385 -302206 151199 -335685 -91074 56014 -268912 -408317
18645d08317I4848a46722O4697j68369B8772a10330I5164A6903b58224A07573
18634a49998B10498h7296J3166F4755J7181J96845e04550G6838A3776J80691a62665
18622a90501l2028A22126a40054I2099j4556J0564B1806Lb1079j41771j55493
18611c18343a12419n07065B86884e3215I3410J4109d00792a22375l2803f1134
18600E6150R7737A2855b62677h6591B3250N2539a37083A58210b20590l188B59484
18588h3836k69290D58312a3649k56343J15467m5182A6125c37125a65510G3775
18577b82554A1220e0831B09790b48015j8228C0016L93813f7655j1439F694L1168
18566C7862R3477l7059C0352i7269M5511A68640C4870M21535a09927b8253G1778
$$ plain form
18645 -408317 94848 -146722 -82025 -250394 28772 -110330 95164 16903 -258224 107573
18634 -149998 210498 -87296 -74130 64755 81936 278781 -504550 76838 13776 194467 -162665
18622 -190501 -222529 122126 -140054 92099 77543 88107 21806 21809 -21079 -162850 -318343
18611 -318343 -112419 -619484 286884 -53215 93410 107519 -400792 -122375 -155178 -61134
18600 56150 153887 12855 -262677 -86591 23250 75789 -137083 158210 -220590 -223778 259484
18588 -83836 -353126 458312 -13649 -269992 -154525 -199707 16125 -337125 -165510 73775
18577 -282554 11220 -50831 209790 -248015 -266243 30016 423829 -67655 -79094 6694 37862
18566 37862 131339 94280 30352 -97269 -51758 168640 34870 456405 -109927 -28253 71778
18554e090r0016A37267O2933d8358j55778F2948b37146O8087j09981e0874k3685
18543g4559j4633A60495a25816k3999j66117D0955b81071l2776J02616M6781j37548
18532c01998A6692J12852J81319a32596B59411p9290a0000F3153f9718A59172
18521a0912I3282d48305H9677K41957d6660j74233B1872b35944A60777c97938
18510a85552C2065h2061k44144B2202a4202G2821R5871k5036O484F3066H927R1468
18498A00395b18461A05825a06571d1988j36275C0080a79128b2281k59653R2096
18488a89838F3649K17922A9694b67577f2219G2409P2378l3498h6952B71966G5956
18476A21198i4801m9315k48350A0063e2931F0298k3041c65950c1768l24685c5679
$$ plain form
18554 -5090 -95106 137267 200200 -48358 -204136 62948 -237146 -169059 -279040 -50874 -74559
18543 -74559 -89192 160495 -125816 -149815 -315932 40955 -281071 -313847 -211231 -164450 -301998
18532 -301998 16692 129544 310863 -132596 259411 180121 -10000 63153 -69718 159172
18521 -10912 93282 -448305 89677 331634 -46660 -220893 21872 -235944 160777 -397938
18510 -185552 32065 -82061 -326205 22202 -14202 72821 168692 143656 150140 63066 8927 100395
18498 100395 -218461 105825 -106571 -41988 -178263 30080 -179128 -22281 -281934 -189838
18488 -189838 63649 281571 19694 -267577 -62219 72409 144787 111289 -86952 271966 75956
18476 121198 -94801 -144116 -392466 10063 -52931 60298 37257 -365950 -31768 -356453 -35679
18464b77284B99033a27489k10387F0197c54084I72c53093B03293a48667C5290
18453a73045M4149M1291O320m5698A84746G5744e3656B89726C6962J84595j04889
18442A16668r712b77383L1535d8600b2701H6708K01061b34404j11018A63699b57719
18430a37708f7586C14847c64674i4017r4667A8481K47027n4697e2540q5503j40666
18419b78709J36641O9810A33408i0434o108J1273A74054G095a55935O9266j23871
18408b10540A06291J6800a67421O736A61805J8391c3783o6368l39790A16442K3344
18397A39786M3686F7771b32191A10110a45170l5533B65823f6427A68816b13290
18386a8775A67610a04897j96059h9517A88079b16738Q1474j27219A87511a33022
$$ plain form
18464 -277284 299033 -127489 -337876 60197 -354084 972 -353093 203293 -148667 35290
18453 -173045 -128896 -87605 -81285 -126983 184746 75744 -53656 289726 36962 221557 116668
18442 116668 106956 -277383 -245848 -48600 -22701 86708 287769 -234404 -345422 163699 -257719
18430 -137708 -67586 314847 -364674 -94017 -188684 18481 265508 210811 -52540 -138043 -278709
18419 -278709 -142068 -72258 133408 -90434 -96542 -85269 174054 7095 -155935 -86669 -210540
18408 -210540 106291 123091 -167421 -160685 161805 180196 -33783 -100151 -439941 116442 139786
18397 139786 183472 67771 -232191 110110 -145170 -180703 265823 -66427 168816 -213290
18386 -18775 167610 -104897 -300956 -89517 188079 -216738 -135264 -262483 187511 -133022
18375A01128J04660c13955f560A20968J05166G358b9181j27083A08570a04741
18364B1671b33825A56085b3042B94668a02232C13555H0762o847r313B8203c4042
18352A30574A628M1228b60506e4674k2451r2231J6908q1482K6335g6058j46796
18341b22854j01546A5329a03450B89838j35172b09161e620k67722I20d11537A88547
18329d2553C059a4463l2330j19556f2578l20355a53072f8221o609B25830d8867
18317B28019A02910a09817L1902A90529a37953o1469P3613G2857a76875b1602
18306H645J65286b14013C28340a22430c855A41418e2621j03701K869j29873G4082
18294g9786B82595d90973J4155H4692b92784L5561A51090D0427j1821R2313a75975
$$ plain form
18375 101128 205788 -313955 -6560 120968 226134 7358 -29181 -156264 108570 -104741
18364 21671 -233825 156085 -23042 294668 -102232 313555 80762 73915 64602 28203 -34042
18352 130574 1628 42856 -260506 -54674 -77125 -169356 -152448 -233930 -207595 -76058 -222854
18341 -222854 -324400 15329 -103450 289838 154666 -209161 -5620 -273342 920 -411537 188547
18329 -42553 3059 -14463 -46793 -166349 -62578 -382933 -153072 -68221 -74830 225830 -48867
18317 228019 102910 -109817 -77915 190529 -137953 -199422 -125809 72857 -176875 -21602
18306 8645 173931 -214013 328340 -122430 -3855 141418 -52621 -156322 -153453 -283326 74082
18294 -79786 282595 -490973 -476818 84692 -292784 -257223 151090 40427 28606 120919 -175975
18282a413H7204D913J71469F2933j3165N9800k8760k40M5342b69561d6843o3519
18270a10362A44287b9922r978j5776a0341C84074d5700j1897k94285q8643h6049
18258a52591g3650C51860A40140c1523j2254C4756Q4753j3580j5784h8261B51851
18246A34546a06255J0991B28849b0648j28444A38892m0005J55495A26914b66912
18235b49335A07897f77I9363D7953f4142H4044c73017a47983A10240j0033a29584
18223C1382a44936A37563a36420B74966I4234b40254C859a5200j25045k851F7592
18211C23846G032B021o89J65728k4424a01081M2836j0525r8510J4142f1401l9913
18199a01314c313n8315A79933a06580A5285K1311K6231a99163c4187A13818o745
$$ plain form
18282 -1413 87204 4913 176382 62933 49768 109568 80808 80568 125910 -269561 -46843 -110362
18270 -110362 144287 -29922 -39900 -55676 -10341 384074 -45700 -57597 -351882 -440525 -86049
18258 -152591 -73650 351860 140140 -31523 -43777 34756 119509 105929 90145 -88261 251851
18246 134546 -106255 -95264 228849 -20648 -149092 138892 98887 254382 126914 -266912
18235 -249335 107897 -677 99363 47953 -64142 84044 -373017 -147983 110240 100207 -129584
18223 31382 -144936 137563 -136420 274966 94234 -240254 3859 -15200 -140245 -143096 67592
18211 323846 7032 2021 1332 167060 142636 -101081 -58245 -68770 -167280 -153138 -61401 -101314
18199 -101314 -3313 -61628 179933 -106580 15285 36596 62827 -199163 -34187 113818 107073
18188A07073J2184n1127A5396a35281A61265a80464L0249q2321F5b36934M7926
18177a89008f8254j62916e0317E7787b2534A07768e4508E37289c3381C7342J4425
18166E1767c65377b1027j49141A06113C8180H536J39813a75717A08453a46085
18155a95192l0650A13030O4062a57127c4193r312o465r0185l1805m69758a15166
18143a18316B97018A41628a46745m7821B19253c503k18570Q2494C7865b29330
18132B28732a92187M0012A06947h4893l03855J43662B67715b85966d3214B63890
18121i1184b6851m0079j43160B4936c5905A84654c42916E7575a1005k21860n4683
18110b87548P6716L0351g219k66506g5112q0546a8363j36602d6971J7159j24567
$$ plain form
18188 107073 119257 68130 15396 -135281 161265 -180464 -150215 -232536 65 -236934 -189008
18177 -189008 -68254 -231170 -50317 57787 -22534 107768 -54508 537289 -33381 37342 51767
18166 51767 -365377 -21027 -170168 106113 38180 8536 148349 -175717 108453 -146085
18155 -195192 -225842 113030 177092 -157127 -34193 -43505 -49970 -140155 -171960 -641718 -115166
18143 -118316 297018 141628 -146745 -194566 219253 -3503 -222073 -139579 37865 -229330
18132 228732 -192187 -152175 106947 -84893 -388748 -245086 267715 -285966 -43214 263890
18121 -91184 -26851 -66930 -210090 24936 -35905 184654 -342916 57575 -11005 -232865 -287548
18110 -287548 -210832 -180481 -7219 -273725 -75112 -155658 -18363 -154965 -46971 -29812 -154379
18099a54379J3945l77019D5035r095a39794O6369A06990P5931H0979a51839B6999
18087B8300a44191j56159f783j89048j72124A60757a49476N2846o716b6938k22105
18076b49043j32428d8332k94298a24726N8765m3092A98038C78d7002C29501j49647
18065A79854M8025b62945G9717a1781C72689a53410C48408a34243D6371a77742
18054a30906k2221f4093A63790d398A36591f2801D520K15700o0641d277F7528
18042A08517E267K14662O4273a71714b1212l90141A69292D882P9736b43441J02737
18031a40704A77955J62355F3736b83043E6637e1264C18467e0481I7141c8264F6545
18019a21367b6974k01297B028M6545J58269J4581F4657a15203j3724j9453G688
$$ plain form
18099 -154379 -140434 -517453 45035 35940 -139794 -73425 106990 182921 80979 -151839 26999
18087 28300 -144191 -300350 -6783 -195831 -367955 160757 -149476 -96630 -103346 -26938 -249043
18076 -249043 -381471 -48332 -342630 -124726 -65961 -109053 198038 378 -47002 329501 179854
18065 179854 227879 -262945 79717 -11781 372689 -153410 348408 -134243 46371 -177742
18054 -130906 -153127 -64093 163790 -4398 136591 -62801 4520 220220 159579 -4277 67528
18042 108517 5267 219929 284202 -171714 -21212 -411353 169292 4882 84618 -243441 -140704
18031 -140704 177955 340310 63736 -283043 56637 -51264 318467 -50481 97141 -38264 66545
18019 -121367 -26974 -228271 2028 48573 206842 221423 64657 -115203 -128927 -148380 7688
18007G6697h3425j20676G2588a80278c8574F0040a66702A86462q6537a62307q7556
17996b49863B35400l5366a975j48838D666g0008C9609K48214H8565c41318A31168
17984B53022A8087a49381m44550K57874F7605J67386f0217k57725G5073l7506
17974C7567a11381n8900j91181d4707B1524K40334j16916A6219M29070h3856j21697
17963b05553B88076B4068B36a23682e212j17450A14007b08835I5280a94554j4474
17952b09028j24221A10172B1532b58603a01383c0263F1140J96973c5419B01280
17941I0584i0727j34339e5415p9049M841l41943a20433A58148g0497J230E5797
17929A72464c09170a20680H7835c6445a7762m406A95575n940b50480a02269e559
$$ plain form
18007 76697 -83425 -204101 72588 -180278 -38574 60040 -166702 186462 99925 -162307 -249863
17996 -249863 235400 200034 -1975 -150813 4666 -70008 39609 287823 88565 -341318 131168
17984 253022 18087 -149381 -593931 -336057 67605 234991 -60217 -317942 75073 37567
17974 37567 -111381 -170281 -361462 -44707 21524 261858 144942 16219 445289 -83856 -205553
17963 -205553 288076 24068 236 -123682 -5212 -122662 114007 -208835 95280 -194554 -209028
17952 -209028 -333249 110172 21532 -258603 -101383 -30263 61140 258113 -35419 201280
17941 90584 -90727 -225066 -55415 -134464 -129623 -471566 -120433 158148 -70497 -69267 55797
17929 172464 -309170 -120680 87835 -36445 -17762 -22168 195575 189635 -250480 -102269 -5559
17917c04460a52203A07033b1080k04521H7738k2986d39974A82496P8268q0574
17907A80190p6240J50987F3251P9646j1728a95832a7883A09140k3077a03632A8058
17895B06212a9124A19336J0259e1012B12317a00757r4581G5129L9645n4772k4264
17884C5738J62313n8874c8889A3810J97055c06227a17474B52575a23900l9269
17874a63169A16913e6705A31021c52332a7385k3624A51158P1090E431K06143E138
17862h3881j85687A08548i3920B82899J35191a91871A48156l1996b56248D6168
17851b38227A7560b26185d2680h747l6882r0311c8767a7245C03253a61926B21799
17839B50253o6582c12122a38215M5628A06638C9341b5493A04027B8360f3962A30187
$$ plain form
17917 -304460 -152203 107033 -21080 -225601 87738 64752 -439974 182496 260764 180190
17907 180190 103950 254937 63251 142897 131169 -195832 -17883 109140 86063 -103632 18058
17895 206212 -19124 119336 129595 -51012 212317 -100757 -195338 75129 114774 60002 35738
17884 35738 198051 139177 -38889 13810 210865 -306227 -117474 252575 -123900 -163169
17874 -163169 116913 -56705 131021 -352332 -17385 -41009 151158 222248 5431 211574 5138
17862 -83881 -269568 108548 -93920 282899 418090 -191871 148156 116160 -256248 46168
17851 -238227 17560 -226185 -42680 -8747 -45629 -135940 -38767 -17245 303253 -161926 221799
17839 250253 183671 -312122 -138215 -92587 106638 39341 -25493 104027 28360 -63962 130187
17827b95998d8390j55409B12708A00381C6628c60433J43863A85303A1455K113
17817A3568N0746k060b35336a07664b9419A06895J04340O2162a57095P7035A05884
17805c76227B8288g6214K4164A00310a58637j37245c0053q9816N978j6819A07737
17793e2016k11645B85517E6191b26980B69224E2437M2674i5825k78758d0458o9036
17782a09494J1484B39744c10352b3364j64928P8080A63243c55418a70230A31727
17771d04184A27620o3480a20910b905j74664M1364N0902A93834L7450i4595k74422
17760c69017D8158a04255M5910K8281C80867b74659A8000d620A04731E667a23894
17748F062J7010a6216a734l1853I8725J52958B8982R3015e7716A26814a37848
$$ plain form
17827 -295998 -48390 -203799 212708 100381 36628 -360433 -216570 185303 11455 13568
17817 13568 64314 62254 -235336 -107664 -29419 106895 211235 273397 -157095 -80060 105884
17805 -376227 28288 -76214 -52050 100310 -158637 -295882 -30053 -119869 -113891 -130710 107737
17793 -52016 -263661 285517 56191 -226980 269224 52437 95111 -95825 -374583 -40458 -109494
17782 -109494 -98010 239744 -310352 -23364 -188292 -110212 163243 -355418 -170230 131727
17771 -404184 127620 64140 -120910 -2905 -177569 -136205 -85303 193834 231284 -94595 -369017
17760 -369017 48158 -104255 -58345 -30064 380867 -274659 18000 -4620 104731 5667 -123894
17748 6062 23072 -16216 -1734 -33587 98725 251683 28982 121997 -57716 126814 -137848
17736g7236l7179K1317A45468b00934n4543L4119j89714B93560I9767a03200j23890
17725b27090B84767a55427E0481M6514a47439C8241b82192C7402b2543k9412r4308
17714a46263k13545A3459L92204h7855D9998a21692o4795a3260B5185a4358l6942
17703e1300j007A5263K38750e18A3548a22322A80416K31756a97730E4201a47307
17691F2145c12391d6548j86371e8669A73667j4359b0814j5643g324k55407B00797
17679H6904N6804a11030F6185b30812d0902A1267c68547A05963N8452k750R3641
17668B55306i0401H6905a63524F194c48k78233H1386k7591K19368E9456b83901
17656e876H3266c465E4642k3481f0512A80046J11161B1490a75885B98391F3624
$$ plain form
17736 -77236 -114415 -93098 145468 -200934 -255477 -221358 -411072 293560 99767 -103200 -227090
17725 -227090 284767 -155427 50481 96995 -147439 38241 -282192 37402 -22543 -51955 -146263
17714 -146263 -359808 13459 405663 -87855 49998 -121692 -186487 -13260 25185 -14358 -51300
17703 -51300 -52307 15263 254013 -518 13548 -122322 180416 412172 -197730 54201 -147307
17691 62145 -312391 -46548 -232919 -58669 173667 159308 -20814 -36457 -7324 -262731 200797
17679 86904 143708 -111030 66185 -230812 -40902 11267 -368547 105963 164415 161665 255306
17668 255306 -90401 86905 -163524 6194 -348 -278581 81386 53795 273163 59456 -283901
17656 -5876 83266 -3465 54642 31161 -60512 180046 291207 21490 -175885 298391 63624
17644A15237a66745A70144a3446B13733a60336A52522a82205j4481K1979B65858
17633B5708K5729J66458a66020C50020a4466D2537O72e0853G7179a32784G516
17621A71299c20438D3750b07799A58749g9230F807N674c4255l37050J54089B28460
17609i8483H3927A5157K03733e1933D3076L80631A6049J39063e8945C45397b0791
17597A949O3210i3627B94005g6455A58868P0374d0823B2674O6903r802a14946
17585a19782j3113D9017K24357m2137b4114k507l20292a4110E01263k45071j15578
17574A40614c02055J20235j46572J22585H2064a74013H7116K1845J27163h3818
17563g8178C3693i2745j06068E2983P0549J31089J43700c55851E20493A81863
$$ plain form
17644 115237 -166745 170144 -13446 213733 -160336 152522 -182205 -196686 -174707 265858
17633 25708 51437 217895 -166020 350020 -14466 42537 43209 -50853 77179 -132784 7516
17621 171299 -320438 43750 -207799 158749 -79230 6807 12481 -34255 -371305 -217216 228460
17609 -98483 83927 15157 218890 -51933 43076 423707 16049 155112 -58945 345397 -20791
17597 1949 65159 -93627 294005 -76455 158868 229242 -40823 22674 89577 79775 -114946
17585 -119782 -132895 49017 273374 231237 -24114 -26621 -346913 -14110 501263 256192 140614
17574 140614 -302055 -181820 -328392 -205807 82064 -174013 87116 108961 236124 -83818
17563 -78178 33693 -92745 -198813 52983 123532 254621 398321 -355851 520493 181863
17552c0854o724D3398a123C30425a44892C58757c224j81192A85245a44159O8267
17541g5892b7527B20779q0167a0087j4261A97273K32569A29524a77236C9394J87133
17530B26527D1523R5456a9219A87812c10627B48677c7738Q48B32113c85627a7526
17518A39474L8527A6857p059g6192q9071C24981d7216j3601j53267P7910B18418
17506G9212Q8809A9894m541J90207m0960b32994A04K54449b13009A89666M9329
17495B38995a75567N2233C24056b270D38111A82592e7846A36234k1585B7333J41764
17484A69097a39494A43818a77019B70627A23567N6114k9998e0767A61061G3729
17473b62871b7717B50684o9881q0960J41113P1711m2575e9784I0824l0467M4507
$$ plain form
17552 -30854 -37578 43398 -1123 330425 -144892 358757 -3224 -184416 185245 -144159 -75892
17541 -75892 -27527 220779 140612 -10087 -24348 197273 429842 129524 -177236 39394 226527
17530 226527 41523 136979 -19219 187812 -310627 248677 -37738 -36890 232113 -385627 -17526
17518 139474 178001 16857 9798 -76192 -165263 324981 -47216 -60817 -214084 -136174 218418
17506 79212 168021 19894 15353 205560 164600 -232994 104 254553 -213009 189666 238995
17495 238995 -175567 -123334 324056 -2270 438111 182592 -57846 136234 114649 27333 169097
17484 169097 -139494 143818 -177019 270627 123567 179681 149683 -50767 161061 73729
17473 -262871 -27717 250684 180803 99843 240956 312667 270092 -59784 90824 60357 104864
17462A04864a57917C03616G434J93119E6085L02566A13884K45245O0497g491D5289
17450E27123A65316C7981J63443E0935J14956o2815L38351G2643M4806b6044H5122
17438D88109A71868c2474B92690o4634G7617J03196o6668J95740j45033p4237
17428I0615K21068m3927A32455J34842j08973J05098L03899r3569A47065O296
17418A53361N5559B7109K75151F1949K86888I9159O4354Q0734Q8673c992k7837
17407c1829j34220N3720C22819i1748A27884O1265l4713l9193D6573K07720F1001
17395H3485J05721h7625A34601L5487J51634a6946j82778A04890i4385I3558K04027
17384B97585j07072a32398C42294A25066E0114e4283C6942N30849j13676A7597
$$ plain form
17462 104864 -157917 303616 7434 200553 56085 358651 113884 359129 419626 -7491 45289
17450 527123 165316 37981 201424 50935 165891 103076 441427 72643 117449 -26044 85122
17438 488109 171868 -32474 292690 228056 77617 180813 114145 309885 164852 90615
17428 90615 311683 267756 132455 267297 158324 263422 567321 473752 147065 153361
17418 153361 208920 27109 302260 61949 348837 99159 163513 244247 332920 -3992 -31829
17407 -31829 -166049 -112329 322819 -91748 127884 189149 154436 115243 46573 254293 61001
17395 83485 189206 -87625 134601 170088 321722 -16946 -199724 104890 -94385 93558 297585
17384 297585 190513 -132398 342294 125066 50114 -54283 36942 567791 454115 17597
17373g7306G1741K34308A24487d136C79316A89646a61323G1257J25752N076j4020
17362A88065K08477G4162J9798K8817M4419a20582c9140F4944d0600E2935Q4131
17351A37066J47852H0127L39723A73298J90109b6129D00288A07049a81944o8210
17341b50154P0855L6331I5867B0625K71362k6780p3270q2460h3052C3139b09509
17329D3380J71903c9729D3542P9248e6527J205b1902A25209O9749A5456a4458
17317A5892K83576I7169a4556C34822j62420g3432E6952J68023I6674A774J57401
17306A59175M21833A64614L44342D9021e2763B40439K59741e2257C10273p4061
17296B36212n0043J01449n4783J8668j23081a7982B42729h6732A07972m1986K42906
$$ plain form
17373 -77306 71741 306049 124487 -4136 379316 189646 -161323 71257 197009 202085 188065
17362 188065 396542 74162 93960 122777 167196 -120582 -39140 64944 -40600 52935 137066
17351 137066 284918 80127 419850 173298 363407 -26129 400288 107049 -181944 -250154
17341 -250154 -179299 -142968 95867 20625 291987 265207 191937 109477 -83052 33139 -209509
17329 43380 215283 -39729 43542 122790 -56527 -55322 -21902 125209 194958 15456 -14458
17317 15892 299468 97169 -14556 334822 172402 -73432 56952 224975 96674 1774 159175
17306 159175 581008 164614 508956 49021 -52763 240439 500180 -52257 310273 236212
17296 236212 186169 287618 232835 251503 128422 -17982 242729 -86732 107972 65986 308892
17285C08892k9154G9003R9006P2686j8980c01695A23237M1932p1411O3831K3228
17274A80817a88760A80594P8524j24703O4105p0166K4286O4996J72076A30211
17263A7406R8373g6805E6310a10018C20959j14838l0275g520A13830P1394f8958
17251I34O1800J18985b3628B15183K13273A36396O9743E4969K33965F0588L61098
17240D21686p2653n7264a02018C76266P0704B09383H4580L7310E508K73694a8349
17228A27147L378n9149K00616A20245m6220R2277J2459p8335K8184A3830J39331
17217A53161K11332a74601C81044N0913B14549K01669f5078I8657K85833r3723
17207B90767J27395H9605L87938j39179A33853J53773I4500K80018j63765K16132
$$ plain form
17285 308892 279738 79003 178009 250695 231715 -301695 123237 165169 93758 157589 180817
17274 180817 -188760 180594 259118 134415 198520 128354 152640 217636 389712 130211
17263 17406 115779 -76805 56310 -110018 320959 206121 175846 -7520 113830 185224 -68958
17251 934 62734 181719 -23628 215183 428456 136396 206139 54969 288934 60588 421686
17240 421686 349033 291769 -102018 376266 446970 209383 84580 121890 5508 279202 -18349
17228 127147 130525 71376 271992 120245 74025 166302 178761 100426 128610 13830 153161
17217 153161 364493 -174601 381044 431957 214549 416218 -65078 98657 384490 290767
17207 290767 418162 89605 477543 338364 133853 287626 94500 374518 210753 426885
17197D26885L6221c2117C41254F7025B6476K21469A00270K37729I4167K35001
17187C29168A21534K27507o8493H2354J22511l3472b8971A93573G0706L81760
17177D52466k08311H7851L18082j39981r4013L3169K17588B06295l2375K54660
17167D28580q9871Q8814j07109L68125A44846j7163J75223l1219o6333O755K1701
17156B33810J36927q5130p655A34080g2071C75831A86247O8762J42408j26759
17146B70658J45055A38469J50984R3548o5733A15765Q7376D2424L79593A73564
17135D22132j37722p05F8117M74449E212M35236j31462j26604M48363k70179r8936
17124B61630j997N7328J05709m4501A01471L3022J1055J60062L2158J90240k27149
$$ plain form
17197 426885 463106 -32117 341254 67025 26476 247945 100270 337999 94167 329168
17187 329168 121534 349041 280548 82354 204865 171393 -28971 193573 70706 452466
17177 452466 244155 87851 405933 265952 171939 205108 422696 206295 173920 428580
17167 428580 338709 427523 320414 688539 144846 127683 302906 271687 205354 212109 233810
17156 233810 370737 285607 277952 134080 -72071 375831 186247 255009 397417 270658
17146 270658 415713 138469 289453 383001 317268 115765 203141 42424 422017 173564
17135 422132 284410 283705 68117 542566 5212 440448 308986 182382 630745 360566 261630
17124 261630 259633 316961 422670 378169 101471 134493 145548 305610 337768 528008 300859
17113C00859j19582n545J49859J37632o8091j89809K04481j79513F4902L42594
17103D07496Q6349B37857J043j5333R6022R4735K0392K6658A76033B5725N36972
17092E62697a62746C57567C371L08155J42703m9761A09783K02590A50895K14236
17082C65131A65404J8493J64156N2169c3G46685l43723j8579J85079D9082P70247
17071H19329l58150I1964K35668o8311A19573O89839D02916P7633B19187L31609
17061E50796J0735k11485K09924j31556o2804L42183k30232j5423K5371K49316
17051G36825l43263J40080J07180k2060J68239m5207K8612C84041P9436I7855
17040E73287j46786J48531m3506j97326L0594J79907k42248J44415K42256j12244
$$ plain form
17113 300859 181277 175732 325591 463223 395132 205323 409804 230291 64902 407496
17103 407496 493845 237857 238900 223567 319589 414324 434716 461374 176033 25725 562697
17092 562697 -162746 357567 3371 311526 454229 404468 109783 312373 150895 365131
17082 365131 165404 183897 348053 400222 -33 746685 402962 384383 569462 49082 819329
17071 819329 461179 91964 327632 259321 119573 809412 402916 480549 219187 550796
17061 550796 561531 350046 559970 428414 365610 707793 477561 462138 487509 736825
17051 736825 393562 533642 640822 618762 787001 741794 770406 384041 463477 97855
17040 573287 426501 575032 531526 334200 364794 544701 302453 446868 689124 576880
17030E76880k0920k58959J41897J16733r8587j57871J83241J12464k05630L98010
17020G87258K80270C28248K96249k019j65259M16025D29524p2768j16551M41238
17010F81443J06083C59373K13190L31199B53291K63523L38984k36011k57636J83901
17000E46052L27261j04841k16197l2947J76321J17055B99076N7313L41121C23988
16989F32288n1889J25641o3713R3718r9837r3995L26440P7672j34962M8883A78042
16977G97010j34779K94368J19763l80686M391K99277j38868j55489L38431n03407
16967E40011L17703j66054n1516N07941l71221C69335O13704r7474Q9840m36587
16957E38818M71147m33899O8095K58571j08250N2542K4006J78741J46014k13559
$$ plain form
17030 576880 555960 297001 438898 555631 457044 299173 482414 594878 389248 787258
17020 787258 1067528 328248 624497 622478 457219 873244 429524 356756 240205 681443
17010 681443 787526 359373 572563 903762 253291 516814 855798 619787 362151 546052
17000 546052 873313 768472 552275 519328 695649 812704 299076 356389 697510 323988
16989 632288 580399 706040 642327 736045 636208 542213 868653 946325 811363 860246 178042
16977 797010 662231 956599 1076362 695676 700067 999344 860476 704987 1043418 540011
16967 540011 857714 691660 640144 1148085 776864 369335 983039 885565 975405 538818
16957 538818 1009965 576066 644161 902732 794482 847024 871030 1049771 1195785 982226
16947I82226o4041L87876n59071K92543k11332K16462M84660F85548L49292j29712
16937I05128K15553K07831r5799k08450N3864m3640k7734p5793K85141J29120
16927A345221j60372q3204o1003n5298K20133J9597M7823L06426l96364J48383
16917A331342q8318L0428J30188k52189L00610P523j32679M41966o47632R8026
16907A219265J52607K55181k91275L07227J2002j54909N341j84045M96619m01007
16897A417006Q8883L3759L0879j31721K08060j04853J41568J67491m62827N10963
16887A899208p7929K90083l43437J47224l65728L14213k53552L41158K14238l02415
16877A863063K45368k06145j72474P3019J05543J31354j10518J83650K24864j10720
$$ plain form
16947 982226 918185 1306061 746990 1039533 828201 1044663 1529323 685548 1034840 905128
16937 905128 1120681 1328512 1232713 1024263 1078127 1034487 1006753 930960 1216101 1345221
16927 1345221 1184849 1101645 1040642 985344 1205477 1225074 1272897 1579323 1182959 1331342
16917 1331342 1243024 1273452 1403640 1151451 1452061 1459584 1326905 1768871 1121239 1219265
16907 1219265 1371872 1627053 1335778 1643005 1655007 1500098 1505439 1321394 1818013 1417006
16897 1417006 1505889 1539648 1570527 1438806 1646866 1542013 1683581 1851072 1388245 1899208
16887 1899208 1821279 2111362 1767925 1915149 1549421 1863634 1610082 1951240 2165478 1863063
16877 1863063 2108431 1902286 1729812 1802831 1908374 2039728 1929210 2112860 2337724 2227004
16867B227004J90084j01985M0966l35856K2352P35087n40529P6503J93488j34392
16857B372722J55317k38720K12900M00020p6519j51538l8184R1811K24356J03728
16847C055893p1133J12137P2714j72835j3516O2075L4564j25525M63791J16282
16837C534447j64719L34599k69101N806J63375O0980j24763K11087K53341j22941
16827C882111L87626j15353K2870J8615J84539k5259L50564l60672K64502K5359
16817D634902l2844K93285K81737L09677k93804m3944L08711J06127L17711M13918
16807F295476j31928M6435K01224Q5254o9653L68057j02628M22082M0191K69981
16797G424491L13313L2341k54033K03648M40514J76573L01471L98296q2275M48544
$$ plain form
16867 2227004 2417088 2315103 2356069 2020213 2042565 2777652 2237123 2313626 2507114 2372722
16857 2372722 2528039 2289319 2502219 2902239 2825720 2674182 2635998 2727809 2952165 3055893
16847 3055893 2984760 3096897 3169611 2996776 2983260 3045335 3079899 2954374 3418165 3534447
16837 3534447 3369728 3704327 3435226 3441032 3604407 3665387 3540624 3751711 4005052 3882111
16827 3882111 4269737 4154384 4177254 4195869 4380408 4355149 4705713 4345041 4609543 4634902
16817 4634902 4602058 4895343 5177080 5486757 5192953 5149009 5457720 5563847 5881558 6295476
16807 6295476 6163548 6209983 6411207 6496461 6426808 6794865 6692237 7114319 7154510 7424491
16797 7424491 7737804 7770145 7516112 7719760 8160274 8336847 8638318 9036614 8954339 9402883
16787I402883J59298L71995K86987J74755M75499j17336P03974M36124k3687M12158
16777A2282650N71982L73550L63279O37397K09495L51971R22930q9689J007640
16768A6631205O00995N98627O55210O93590N18916Q16866Q22820J001536R76026
16759B3315791L37523J193046J347555R04928J356479J340158J236014J371861
16751C2403355J565284J509594J824847J649439K346954J856289K451526K175057
16743D7782345K827452K573815L331473L125284L331233L971040L889071M286766
16735G5118479M868181M858339N529331N285719O171626O224402O852042O533996
16727A21442115P649523P540943P370509P177568O985629O548633O269774N156357
$$ plain form
16787 9402883 9562181 9934176 10221163 10395918 10871417 10754081 11458055 11894179 11870492 12282650
16777 12282650 12854632 13228182 13591461 14228858 14438353 14790324 15713254 15623565 16631205
16768 16631205 17232200 17830827 18486037 19179627 19698543 20515409 21338229 22339765 23315791
16759 23315791 23653314 24846360 26193915 27098843 28455322 29795480 31031494 32403355
16751 32403355 33968639 35478233 37303080 38952519 41299473 43155762 45607288 47782345
16743 47782345 50609797 53183612 56515085 59640369 62971602 66942642 70831713 75118479
16735 75118479 79986660 84844999 90374330 95660049 101831675 108056077 114908119 121442115
16727 121442115 129091638 136632581 144003090 151180658 158166287 164714920 170984694 176141051
16719A76141051M316307L584670J369251N36487r50404k266074l558926m692278
16711A74480084n628889o064861p164495p144901p577781p513880p592601p106281
16703A18686395p124907o678047o650195n775322n729513n524900m927373m574742
16695G1701396m353634m044929l478241l640278k907928l037059k878854k748555
16687D4611918k288294j973773j880709k241577j673111j628650j672690j257835
16679B9995279j691935j249330j062681j173616j188583r19609j090860q57343
16671B0761322p05891j030564n30902p71244l39430q51186o29796k88123n22360
16662A5091826r46490m70925o06469j62120r27887K86717m88937n78888m37515
$$ plain form
16719 176141051 180457358 184042028 185411279 185947766 184997362 182731288 179172362 174480084
16711 174480084 168851195 162786334 155621839 148476938 140899157 133385277 125792676 118686395
16703 118686395 111561488 104883441 98233246 92457924 86728411 81203511 76276138 71701396
16695 71701396 67347762 63302833 59824592 56184314 53276386 50239327 47360473 44611918
16687 44611918 42323624 40349851 38469142 36227565 34554454 32925804 31253114 29995279
16679 29995279 28303344 27054014 25991333 24817717 23629134 22709525 21618665 20761322
16671 20761322 20055431 19024867 18493965 17722721 17383291 16532105 15902309 15614186 15091826
16662 15091826 14145336 13674411 13067942 12905822 11977935 12264652 11775715 11196827 10759312
16653A0759312J18128m15683m87239n27793P823j1741n21228k85367j66696n76347
16643G893169J49207l88784j91663o7572p9041n24660J09990j49388m48087j45452
16633F157719j24487J95985l69860k67805O2460j48360k41229q143j17462k05906
16623D932912q0839J60512m44102J72549j96716O3533l92586m39377N19221l58075
16613C937032K56919k21668j65752R1640k89656j42156r732k11761J61722q5454
16603C321134j86909j1623K87297k03321l00611M37574l16743j09048q5227j04382
16593B728141m827K6293r6564j2823j57996K77363o5524o53034N04386k25328
16583B320087J10984n1490n0287O8881L6614K5157k82519k88710J54015j06380
$$ plain form
16653 10759312 10877440 10461757 9974518 9446725 9454548 9442807 8921579 8636212 8469516 7893169
16643 7893169 8042376 7653592 7461929 7394357 7315316 6790656 6900646 6751258 6303171 6157719
16633 6157719 6033232 6229217 5859357 5591552 5654012 5505652 5264423 5256280 5138818 4932912
16623 4932912 4852073 5012585 4568483 4741032 4544316 4607849 4215263 3775886 4295107 3937032
16613 3937032 4193951 3972283 3806531 3898171 3608515 3466359 3456627 3244866 3406588 3321134
16603 3321134 3134225 3122602 3409899 3206578 2905967 3343541 3026798 2917750 2832523 2728141
16593 2728141 2723314 2749607 2653043 2640220 2482224 2759587 2694063 2041029 2545415 2320087
16583 2320087 2431071 2379581 2329294 2398175 2434789 2459946 2177427 1888717 2042732 1936352
16573A936352m8448j22191k3744K67223j8319R4175m42352J23756q9074L29544
16563B006922l54853J61383k1493k2809r5605k88261N04174n61030l5696K20188
16553A512920L4967o4611m2259K4117j72531P7511J44521k74189P673Q1459J5563
16542A345141M61585H81943P4621j43579O13701k40191p8980L30735k68121j97693
16532I72436M8329K1211M0543K32981n83317M52862k31309L2421J19100J76708
16522A281965j67161k42850k9965m523M22848m28075J31859J76990l46451o5770
16512G28867J40943J11844k58804l0864L36573l53634J87228j32716K71725j28575
16502H72587l1220j53814K7186m2383J28827M72538m54465r9509K05182l71895
$$ plain form
16573 1936352 1887904 1765713 1741969 2009192 1990873 2085048 1642696 1766452 1677378 2006922
16563 2006922 1652069 1813452 1791959 1769150 1673545 1385284 1889458 1328428 1292732 1512920
16553 1512920 1547887 1483276 1441017 1465134 1292603 1370114 1514635 1240446 1248119 1329578 1345141
16542 1345141 1806726 881943 956564 812985 1426686 1186495 1107515 1438250 1170129 972436
16532 972436 1020765 1041976 1082519 1315500 732183 1185045 953736 986157 1105257 1281965
16522 1281965 1114804 871954 841989 837466 1260314 832239 964098 1141088 794637 728867
16512 728867 869810 981654 722850 691986 1028559 674925 862153 729437 1001162 872587
16502 872587 841367 687553 714739 672356 801183 1273721 819256 719747 924929 553034
16492E53034P4875M2243Q3258Q1967k0120l13774L38839k06696O4024k05803P5259
16481E67106K0547L47368C90544L01633J77892D04326J61673k56203K75006K07180
16471G91982J4588C68990J13949p498J90907J17865J28703C93425A33078L57725
16461D90803M66746l25465o5535J45800j41871k12669M76948B03222J48859J62050
16451E14131J70120j43746J80580j77804j84130N638o8764K17680B13720K97447
16441E11167N8487j16518j23823L56910j90920M8522n2648j55116J67812r992
16431D93881j37634m4461J32319J6438j85392K21644j36945j66780K40193J35119
16421E68382E9030K14928K64834p1563o3303j93393b5255A54367K90063A51140
$$ plain form
16492 553034 627909 670152 753410 835377 815257 501483 840322 633626 697650 491847 567106
16481 567106 587653 935021 390544 692177 870069 404326 565999 309796 584802 791982
16471 791982 806570 368990 482939 475441 666348 784213 912916 393425 133078 490803
16461 490803 957549 632084 566549 712349 570478 357809 834757 203222 352081 514131
16451 514131 684251 540505 721085 543281 359151 364789 296025 513705 213720 511167
16441 511167 569654 453136 329313 686223 495303 543825 491177 336061 503873 493881
16431 493881 356247 311786 444105 460543 275151 496795 359850 193070 433263 568382
16421 568382 59030 273958 538792 467229 403926 210533 -25255 154367 444430 151140
16410G22646l19156J2865j44583M4328R471J32247q7741F8927M06778r7063I0905
16398C09881L39984A16565A8977K24339J28197j69526j4257J39628O9377q3880
16388C12855J40396I0069L00950q795A6406J73004R0106J62947k02308K77836
16378E17991B46492j20568J38721G8021K66746J70892j48214A07986J05333a7544
16367F680J89909O5771A17184N8398J37970A02994K41246f4038B34980A05110
16356C70139k9420b6250D58809G9370j9188M15409I2040J58131a41021B01192
16345C38167G9402l8708J06343J61541j12111I7045L24153m5729A41239K39033
16335C80272i9103A72766J62375E5997L18551j14705n6844J53525j03770j7997
$$ plain form
16410 722646 403490 416355 271772 316100 325571 457818 370077 68927 475705 378642 90905
16398 309881 649865 116565 18977 243316 371513 201987 187730 327358 396735 312855
16388 312855 453251 90069 391019 382224 16406 189410 279516 442463 240155 517991
16378 517991 246492 125924 264645 78021 344767 515659 367445 107986 213319 -17544
16367 6680 196589 262360 117184 175582 313552 102994 344240 -64038 234980 105110
16356 370139 340719 -26250 458809 79370 60182 475591 92040 250171 -141021 201192
16345 338167 79402 40694 147037 308578 196467 97045 421198 375469 141239 380272
16335 380272 -99103 172766 335141 55997 374548 259843 202999 356524 252754 234757
16325B34757E0199L5644J7254m2670K03773r3045b81995I0941P9614K700E3268
16313h0979A23324l2703P2276h825F0141J44994r5418J01165a38797B62070A06621
16301E0139K23379r2474q3903J18058n7954n5332L42966A58304R3583E8445a5527
16289a35541A83509J10467b60654C1350J17700C0605J86206n3605a06854m9266
16279a56120E4527c5011f856A21323D6549O209J66004l1562b8848D09923f6088
16267e9160K9100m20A53009c6240A23929d4029P03A66668b57717F4553p944K17416
16255B74025A36498a24389B86226f2366B21298b1345j89671F6639Q2902a01809
16244I6472a04p1758p307A26326a14457A26916P1897r7012J1303D3244P4362N6319
$$ plain form
16325 234757 50199 85843 103097 60427 264200 171155 -281995 90941 170555 173255 53268
16313 -80979 123324 90621 162897 -8825 60141 205135 109717 210882 -138797 262070 106621
16301 50139 273518 181044 97141 215199 157245 101913 444879 158304 251887 58445 -15527
16289 -135541 183509 293976 -260654 31350 149050 30605 216811 163206 -106854 -156120
16279 -156120 54527 -35011 -6856 121323 46549 52758 218762 187200 -28848 409923 -66088
16267 -59160 -30060 -30480 153009 -36240 123929 -44029 -43326 166668 -257717 64553 56609 274025
16255 274025 136498 -124389 286226 -62366 221298 -21345 -211016 66639 149541 -101809
16244 96472 -104 -71862 -79169 126326 -114457 126916 198813 101801 113104 43244 117606 173925
16232A73925k1670M35064A72614g817j87109F2514J93675I8499j0326J29611l4751
16221A83033l6782g273j96938A48359g5828m8776A27137j5336j1407b1334F4211
16209a07191j45094F22287d8188C27636B1030Q0222l0885K9629i9828I0639L45748
16198D36387g2257C724K4071J72760d230B37188F8835f1510b6086E17317e4579
16186f7674M384A55343C0416L15498g9268C46193d730j92182M0830H4630c1370
16174F208G36e0874q0912B01274J96137f2308k61400A78322p2940M0935O4834
16163B11151M1527J1799g6800p8988p1548D8377N6092J740h6216A16699J13910
16152B30609a69378O8464j73792I9260e2417j26466p2529H5048b9425A0512a74915
$$ plain form
16232 173925 152255 587319 172614 -7817 -194926 62514 256189 98499 88173 217784 183033
16221 183033 146251 -7273 -204211 148359 -75828 -124604 127137 111801 100394 -21334 64211
16209 -107191 -252285 622287 -48188 327636 21030 101252 70367 99996 -99828 90639 436387
16198 436387 -72257 3724 27795 200555 -4230 237188 68835 -61510 -26086 517317 -54579
16186 -67674 -63290 155343 30416 345914 -79268 346193 -4730 -196912 -156082 84630 -31370
16174 6208 736 -50874 -131786 201274 397411 -62308 -323708 178322 105382 146317 211151
16163 211151 252678 264477 -76800 -155788 -227336 48377 104469 106209 -86216 116699 230609
16152 230609 -169378 -100914 -274706 99260 -52417 -178883 -251412 85048 -29425 10512 -174915
16140A30171K707j2216b07081b957D3979a91620A01059a3820A54696R6222N3578
16129C04496C6138a13812B0008M1243d2341G1073J2607O9762D3048J84946h7088
16117g7682Q42E9941a17957j98967J24689A46651b58444N9694K5905B68730j5122
16106B53608k6728a15994B39238k5827H6024J61173R9626F3049L5078J4014m6850
16095F5291b11944i8720j6656O471d1948l98972J67434h6433A5348m503a0772
16083a00323A9712M4604A0521K7708J2320k2306o703a05891k01613B8678a60851
16071B9551a67369B12949a71831g8008r1742C50331a30267I0824B3837P1292B9197
16059d19514A51080d9591q6167B81145c01732a00134k31117C120J26735f5733
$$ plain form
16140 130171 132878 120662 -207081 -2957 43979 -191620 101059 -13820 154696 250918 304496
16129 304496 36138 -113812 20008 61251 -42341 71073 83680 153442 43048 227994 -87088
16117 -77682 -76840 59941 -117957 -316924 -192235 146651 -258444 -198750 -172845 268730 253608
16106 253608 226880 -115994 239238 213411 86024 247197 346823 63049 98127 112141 65291
16095 65291 -211944 -98720 -115376 -108905 -41948 -440920 -273486 -86433 15348 10845 -10772
16083 -100323 19712 64316 10521 38229 50549 28243 21540 -105891 -307504 28678 -160851
16071 29551 -167369 212949 -171831 -78008 -169750 350331 -130267 90824 23837 95129 29197
16059 -419514 151080 -49591 -135758 281145 -301732 -100134 -331251 3120 129855 -65733
16048e0905I4542a6667j38136A54861a49296A8403P5194m3123a58275A51366l7173
16037A14193a00194D6207a08192j76465A27090J35936a87078A3440b0796B7213
16026b53320D0614N3856A9530K72211A534a90057G5511a34470A13941c40923a53871
16014A55360l7241l8170l0714K2716K73694a25824n4386a9487p4965l2624A3447
16002h8629G8294E819d2672A13200R3777d2441o6750b005k37039O0613j01266
15991b79697C3447N02750A51716a87623A27640a54299H8339A9839K21010J03363
15981C44212J9503A30589m3709M2778K44496F4384c61375B28537q1885a14860
15970d3436k52844O6570G0322K77790a20189H7780a61623G1688i3659l83390C1040
$$ plain form
16048 -50905 94542 -16667 -154803 154861 -149296 18403 93597 50474 -158275 151366 114193
16037 114193 -100194 46207 -108192 -284657 127090 263026 -187078 13440 -20796 27213
16026 -253320 40614 94470 19530 291741 1534 -190057 75511 -134470 113941 -340923 -153871
16014 155360 118119 79949 49235 71951 345645 -125824 -180210 -19487 -94452 -127076 13447
16002 -88629 78294 5819 -42672 113200 206977 -42441 -109191 -2005 -239044 -178431 -279697
15991 -279697 33447 536197 151716 -187623 127640 -154299 88339 19839 240849 344212
15981 344212 363715 130589 86880 129658 374154 64384 -361375 228537 146652 -114860
15970 -43436 -296280 -229710 70322 348112 -120189 87780 -161623 71688 -93659 -477049 31040
15958a59913A07642a17778j32178f7197j5856j09781I3989d1551k68097a32215
15947c9163n9657a9051A54289B2184d57530b0501A37509o2468J39073e8612l1123
15936h9735r9373l3211A71962d65031P8605J45248A37070b15859M1260j03075
15926b77674g5091I8884a51323r8849A4921a22609j05388e1018j52590a1146m4041
15915e5187q7686b5821j59731r4164l9229A16967b9031F8261J7715A7868O7628
15904H5496J41254G1844a04404b8550j74583g6495m4365n5864A17843B401L60356
15893C62757f0925k24765a15175K992J7482F3596c3065B74270G8177O9717a10272
15881D3388b2247I2916a62375d7414k07380b595A85972g1417F3386L6768c66840
$$ plain form
15958 -159913 107642 -117778 -249956 -67197 -83053 -192834 93989 -41551 -309648 -132215
15947 -39163 -98820 -19051 154289 22184 -457530 -20501 137509 75041 214114 -58612 -89735
15936 -89735 -189108 -222319 171962 -465031 -386426 -241178 137070 -215859 -174599 -277674
15926 -277674 -75091 98884 -151323 -250172 14921 -122609 -227997 -51018 -203608 -11146 -55187
15915 -55187 -142873 -25821 -185552 -279716 -318945 116967 -29031 68261 85976 17868 85496
15904 85496 226750 71844 -104404 -28550 -203133 -76495 -120860 -176724 117843 2401 362757
15893 362757 -60925 -285690 -115175 -112183 -94701 63596 -33065 274270 78177 147894 -110272
15881 43388 -22247 92916 -162375 -47414 -254794 -2595 185972 -71417 63386 100154 -366840
15869a49047A54371h2461k44747E9314c10798A07765J94300j644F7153b496q913
15858a1409p3071k2812O303b3985j7156A52231E9210a54397B85962a09156A11993
15846A50331B1578C201d9266I6138C1118a71691B34761r7748b90632A80081b75094
15834B66059G3082R6021b4477G4739a65984B06972D4445f0927C78040A2228a93452
15822e8962A06395j6631L670a01750j13251b7394G7960J80060A22388H258c96207
15810a55905n6287H2307J46058a95626G4943L38906j80329i3967A26242K32172
15800C58414d161j51168B11040a0215m1829a1279j13423A68103a54134c2392D14747
15788a1182j59139F8811a36083A20044J99707a06595I8868O8231a96752h6836
$$ plain form
15869 -149047 154371 -82461 -327208 59314 -310798 107765 302065 300421 67153 -2496 -11409
15858 -11409 -84480 -107292 -100989 -23985 -41141 152231 59210 -154397 285962 -109156 111993
15846 150331 21578 3201 -49266 96138 31118 -171691 234761 137013 -290632 180081 -275094
15834 266059 73082 169103 -24477 74739 -165984 206972 44445 -60927 378040 12228 -193452
15822 -58962 106395 89764 93434 -101750 -215001 -27394 77960 258020 122388 8258 -396207
15810 -155905 -212192 82307 228365 -195626 74943 413849 233520 -93967 126242 358414
15800 358414 -4161 -155329 211040 -10215 -52044 -11279 -124702 168103 -154134 -32392 414747
15788 -11182 -170321 68811 -136083 120044 319751 -106595 98868 167099 -196752 -86836
15777b98114B1232d9383p2982B0441b90458L6313C751b63864A36939b11271f4977
15765b17382K4003k8579r7174j1436j15474b01103c0167l51089c6348q3951A43349
15753A16588O7139q7535b09578G9361A8144d6958A4829L0806K74873n8871H9467
15741A34662a74495M5673A03609C536J60160b81820A90838d25227h3692j6231
15731i9923k3959D4394d6067H8155A8130e7380j91976a18110g476p6743B64250
15719I37i1767k4441I4305a18074F8554j3664a671A1126b51030g0656j21754a468
15706c37195J09838O1268L4084p08A9036c02807A63936g6063H2774a70825a7940
15694A19481b11719F5564k8647e4425C4467K65792a40901E4310J06570b09047
$$ plain form
15777 -298114 21232 -49383 -122365 20441 -290458 -254145 3751 -263864 136939 -211271 -64977
15765 -217382 -193379 -221958 -319132 -330568 -446042 -201103 -30167 -381256 -36348 -120299 143349
15753 116588 183727 96192 -209578 79361 18144 -46958 14829 45635 320508 261637 89467
15741 134662 -174495 -128822 103609 3536 163696 -281820 190838 -425227 -83692 -99923
15731 -99923 -123882 44394 -46067 88155 18130 -57380 -249356 -118110 -7476 -84219 264250
15719 937 -91767 -116208 94305 -118074 68554 54890 -1671 11126 -251030 -70656 -192410 -1468
15706 -337195 -227357 -166089 -132005 -132713 19036 -302807 163936 -76063 82774 -170825 -17940
15694 119481 -211719 65564 36917 -54425 34467 300259 -140901 54310 160880 -209047
15683b22195j0386C11310C7145f5400J6369D9330E480b02760Q705B00259d9725
15671B98008c0577m0170A35331N6389c01713A63974a47193A9730c17213k4246
15661c41459P7256r5043a53362p5738a00610A53000e9840l30476b3283B8375h8937
15649A07054b28951c9137B01746H7662i1907D4001a23481M5873j14371h920H3754
15637b6577C1465a21581D3194M1727a64851f8811A88667C5478R4975m7558J99022
15626B81917p7077n0906p3341J21692b43226h1761N34H0863a17362C6175J56308
15615A92483C1024J63753D508i209H9778b59321a17045q4379b4298q0258b090
15603B70421j03462L9849r0223b98036K7066a03598D4658c13542A0524b84039
$$ plain form
15683 -222195 -232581 311310 37145 -65400 -49031 49330 5480 -202760 -194055 200259 -49725
15671 298008 -30577 -70747 135331 191720 -301713 163974 -147193 19730 -317213 -341459
15661 -341459 -264203 -359246 -153362 -229100 -100610 153000 -59840 -390316 -23283 28375 -88937
15649 107054 -228951 -39137 201746 87662 -91907 44001 -123481 -77608 -191979 -8920 83754
15637 -26577 31465 -121581 43194 84921 -164851 -68811 188667 35478 130453 82895 281917
15626 281917 204840 153934 80593 202285 -243226 -81761 -81227 80863 -117362 36175 192483
15615 192483 31024 194777 4508 -9209 89778 -259321 -117045 -201424 -24298 -104556 -2090
15603 270421 166959 206808 116585 -298036 -270970 -103598 44658 -313542 10524 -284039
15592b65618G621a4240k9282k54046h0893a0215A77022J21479p4554a30539L0679
15581i9860M8787r6183B29938a53093A6199h6052A42685a32863j0360G750b63160
15569B45480b4612j41946D43228F8480b31219A42482j3521O7795c0186I3288a295
15557A12210a54342d2158D0613b8501h788A54723b55079M2671f7728C77838h3604
15545c45023i2020B8304J86468L5541l9345B9776b39708D793a40523G8986Q7890
15534A66876b10137p8525E6246K20036a53691B88972a15816j67298A6614J55708
15524A72322e4427r8623G6027a47420c727n2809m3506j52942Q1475c0847j47447
15513a78294e3840l7935A00954k241M1270a33382j01592B59642j4499i164E4088
$$ plain form
15592 -265618 7621 -14240 -43522 -297568 -80893 -10215 177022 298501 223947 -130539 -99860
15581 -99860 -51073 -147256 229938 -153093 16199 -86052 142685 -132863 -143223 7750 -263160
15569 245480 -24612 -166558 443228 68480 -231219 142482 128961 196756 -30186 93288 -1295
15557 112210 -154342 -42158 40613 -28501 -8788 154723 -255079 -212408 -67728 377838 -83604
15545 -345023 -92020 28304 214772 250313 210968 29776 -239708 4793 -140523 78986 166876
15534 166876 -210137 -288662 56246 276282 -153691 288972 -115816 -283114 16614 172322
15524 172322 -54427 -153050 76027 -147420 -3727 -56536 -100042 -252984 -171509 -30847 -178294
15513 -178294 -53840 -91775 100954 98713 139983 -133382 -234974 259642 245143 -9164 54088
15501A01181L6100b13339j80434a10177N212k27261Q5226A6592f6174c164r1776
15490i4940k69618J08830A10019f6421B58009b51171e7365B75565H5255b23048
15479b21517k04997J03893J32408P2602A49084Q764B7381J49085B4284h2780c9839
15467b72235e2959j04431A81344b63868C8805a01118F1262K49507A9220K4738
15457D3958K1969b5009A91668E9161J98191R5538A00530l2788b15798A50590R3210
15446B43800c02012i0620p4966a7102p1228k14103J13583B6879a78411j3093B3774
15434b9861k12923f1974j75086J09522j8174A15960q134J27490b01687C63659
15423e0648A17860g0785B33026a40911F0755L6760b7521j07424f0107B5257K4501
$$ plain form
15501 101181 137281 -213339 -393773 -110177 -104965 -332226 -247000 16592 -66174 -3164 -94940
15490 -94940 -364558 -255728 110019 -66421 258009 -251171 -57365 275565 85255 -223048
15479 -221517 -426514 -322621 -190213 -117611 149084 157848 27381 176466 24284 -82780 -39839
15467 -272235 -52959 -157390 181344 -263868 38805 -101118 61262 310769 19220 43958
15457 43958 65927 -25009 191668 59161 257352 352890 100530 67742 -215798 150590 243800
15446 243800 -302012 -90620 -165586 -17102 -88330 -302433 -188850 26879 -178411 -191504 23774
15434 -29861 -242784 -61974 -237060 -127538 -145712 115960 107826 235316 -201687 363659
15423 -50648 117860 -70785 233026 -140911 60755 97515 -27521 -134945 -60107 25257 49758
15412D9758R6860g1637j09692c4676j75805A19945g5880B7596J19325E5101a74468
15400a06216A9415J33921J91019b1333A33395L0154D173P6555J06266a34477I4376
15388A30112b31943l20947a15376k25463A16035K0706N0670h0258l9014I6791
15377a58948P206m4147i7132D02305A17952a4199j42061A69638F7911A2168J53777
15366A65945b8466c357j32530F4594L08666H1292L3725M2852a31303D4178c59065
15354D4808e5981E1972c13437A89652H5062J0738i1467c4511C1392a00934A68112
15342B19354g2905H5189d0641G6113J07068i0909D7769b18095A08251B4100h1435
15330B17650e8307H9697J63659j1527a1294D13332b01476O5686B18268c25090
$$ plain form
15412 49758 146618 -71637 -181329 -34676 -210481 119945 -75880 27596 146921 55101 -174468
15400 -106216 19415 153336 344355 -21333 133395 163549 4173 80728 186994 -134477 94376
15388 130112 -231943 -552890 -115376 -340839 116035 136741 187411 -80258 -119272 96791
15377 -158948 -151742 -195889 -97132 402305 117952 -14199 -156260 169638 67911 12168 165945
15366 165945 -28466 -3357 -135887 64594 373260 81292 115017 157869 -131303 44178 -359065
15354 44808 -55981 51972 -313437 189652 85062 95800 -91467 -34511 31392 -100934 168112
15342 219354 -72905 85189 -40641 76113 183181 -90909 47769 -218095 108251 24100 -81435
15330 217650 -58307 89697 253356 241829 -11294 413332 -201476 -135790 218268 -325090
15319B13655b54328B4084K16475O5138C6925K37755a51462B17783e2897j67783
15309b20680D8436e4834B2225M3971P0547a30865a3316j15486F0355k1412f2053
15297a63076d6037B05316e1751A02994K31750F0709a4738H235Q3000d307j92885
15286a97192J5597B10043a00231K7132C4141a52758g2893A59627C9957k273o408
15275C1276M9992J03667K11825h898A26100b4281k03599B08239e9956K3231j99345
15264b36070E0482J94079c6158j45216f0767j57893B22337E4375c53971D1261
15253a30425B07694n308l6858L51630K34855Q25531l58899N5727j17627D62000
15242B16340a51269F3471e8018D7120f9576M980D0170h7629q2855J6741A3384
$$ plain form
15319 213655 -254328 24084 240559 305697 36925 274680 -151462 217783 -52897 -220680
15309 -220680 48436 -54834 22225 66196 136743 -130865 -13316 -128802 60355 38943 -62053
15297 -163076 -46037 205316 -51751 102994 334744 60709 -14738 8235 91235 -4307 -197192
15286 -197192 -181595 210043 -100231 -73099 34141 -152758 -72893 159627 39957 37684 31276
15275 31276 81268 184935 396760 -8898 126100 -24281 -227880 208239 -59956 -36725 -236070
15264 -236070 50482 244561 -36158 -181374 -60767 -218660 222337 54375 -353971 41261
15253 -130425 207694 202386 165528 517158 752013 1577544 1218645 1274372 1156745 462000
15242 216340 -151269 63471 -58018 47120 -69576 -64596 40170 -87629 -170484 -153743 13384
15230A41428P1851B7631Q0813a41028B23957a22120d7563j16211r9598C7293e8844
15218b39793B63955q411j8300B375h7913r1363D6601O2849K03766a13293e1099
15206d0672D602L20434I6328C2544O0649R0965g1208g091j21905B29106M744A06885
15193A06256b01709J2960m5665F4073K52748F9729J34093G3420J94051b37404
15182A62070G5573e7054E3698O2464K10063D8272J62507N6850d6439A51975n9662
15171I2313N8899f4992B48320A19136M5538o554a53704A8333J0256K24892J00275
15160C53756c8772F8756J95595H9780A5823L6833d4988B18877f2268G1947R9549
15149A71496J89955f9110D06873c006E2993a0637k2946A35470a30668o2419k3305
$$ plain form
15230 141428 213279 27631 108444 -141028 223957 -122120 -47563 -163774 -263372 37293 -58844
15218 -239793 263955 255544 237244 2375 -87913 -179276 46601 109450 313216 -113293 -51099
15206 -40672 4602 325036 96328 32544 93193 184158 -71208 -7091 -128996 229106 233850 106885
15193 106256 -201709 -188749 -234414 64073 316821 69729 203822 73420 267471 -237404
15182 162070 75573 -57054 53698 116162 326225 48272 210779 267629 -46439 151975 92313
15171 92313 151212 -64992 248320 119136 164674 158120 -153704 18333 28589 253481 353756
15160 353756 -38772 68756 264351 89780 15823 52656 -44988 218877 -62268 71947 171496
15149 171496 361451 -69110 406873 -3006 52993 -10637 -33583 135470 -130668 -193087 -216392
15138b16392B87185C9685f0095H4498K1777L3225K22832c29330a9687A23993F0223
15126c04287A51906D6082E430J05371b67010J21819i199C00097P2731a3008A52007
15114A64093O685g7330A98549M6253L6924H6459O4708m1842i5954C10908j48594
15103A62314K16493j49590p8906b95952B10784J35166g3006A04947L9870L0816
15093A75633N2718b9442A94600I6438m8051M67386h2829k61393A15239K19704
15083C34943I1106f9712A34164a5732j7528p6759D32678A27575K90420j36208
15073B81787j35976N8658l8889p2580C6899f5337A90831n3642J1426k2696K09371
15062C35290o8284I0218B7332J34575J5626n6639J83490H0403J97489j9503r4634
$$ plain form
15138 -216392 287185 39685 -60095 84498 106275 139500 362332 -329330 -19687 123993 60223
15126 -304287 151906 46082 5430 110801 -267010 -145191 -9199 300097 372828 -13008 152007
15114 164093 170778 -77330 198549 244802 281726 86459 151167 109325 -95954 310908 162314
15103 162314 378807 229217 150311 -295952 210784 345950 -73006 104947 144817 175633
15093 175633 228351 -29442 194600 96438 48387 515773 -82829 -344222 115239 334943
15083 334943 91106 -69712 134164 -15732 -33260 -110019 432678 127575 417995 281787
15073 281787 145811 204469 165580 93000 36899 -65337 190831 137189 148615 125919 335290
15062 335290 267006 90218 27332 161907 177533 120894 304384 80403 277892 258389 163755
15051A63755F5324J55042o105d5705A67143J52786j34513M3136j9853a22205A72124
15039A84624L9129Q9336I9277k9556P9415J83442H0530K97911A06956O3579m2383
15028A28152J55851A16142K37420e6132A44174J11080E8925J4194N8303Q8006
15018B19428K426J87469j43866l6843J10288P3730B1411O1364i9144C59500j68849
15007A90651h2524C68934l6207J37710j4783c7047o2836A17072N1614j3062F1210
14995B91001P9336i4768B98568A17952N9718O6795n5625N7468b16772K0863A71597
14983f9638G4579L74312a48536C35799o7567L045m7190a28600A67265C3216M54625
14972D87841j92014j21253A803J24171l2399D3212J48635J6060i3012A48720o1838
$$ plain form
15051 163755 65324 220366 214261 -45705 167143 319929 185416 228552 208699 -122205 172124
15039 184624 223753 313089 99277 69721 149136 332578 80530 378441 106956 170535 128152
15028 128152 284003 116142 353562 -56132 144174 255254 58925 73119 131422 219428
15018 219428 221854 409323 265457 228614 338902 412632 21411 82775 -99144 359500 190651
15007 190651 -82524 368934 332727 470437 455654 -37047 -99883 117072 168686 155624 61210
14995 291001 370337 -94768 298568 117952 177670 244465 188840 246308 -216772 -195909 171597
14983 -69638 74579 448891 -148536 335799 268232 271277 224087 -128600 167265 33216 487841
14972 487841 295827 174574 1803 125974 93575 43212 191847 207907 -93012 148720 86882
14961H6882J4008P3507d4030C02431A13655K78984A09255J04992O6786k5397J07767
14950C63403L99930A36726J48393d3675A46586C0494K04270J95798A18166O0502
14940A78668G7334K9623C3566e2370A87727J93756A13035K60071j82115m324b3955
14928C04598k672j3274A17370K55170j24019J92370K06050l2174B82868A04118
14917B35406J52654k7480A72416J10675L3870J51054G9293L58986j47438A37929
14906C00676N4595j58078a1620B70503J49778F0453K85828A66872C7683J04981
14896A42664K05443B0626J82856J49301N6485K95151A60828N3146J36147j33816
14886B16305L2834L57270B79312J69588B10148g8115B64197J20622C3143K56136
$$ plain form
14961 86882 100890 174397 -44030 302431 113655 392639 109255 214247 281033 255636 363403
14950 363403 763333 136726 285119 -43675 146586 30494 234764 430562 118166 178668
14940 178668 77334 106957 33566 -52370 187727 381483 113035 373106 190991 186667 -23955
14928 304598 301926 288652 117370 372540 248521 440891 646941 614767 282868 104118
14917 235406 388060 360580 172416 283091 316961 468015 79293 438279 290841 137929
14906 300676 355271 197193 -11620 270503 420281 60453 346281 166872 37683 142664
14896 142664 348107 20626 203482 352783 409268 704419 160828 213974 350121 216305
14886 216305 249139 606409 279312 448900 210148 -78115 264197 384819 33143 289279
14876B89279J80474P8207I7312L49947o253K01661k50494C5960K02938q8933L73842
14865E23807j53047o8718L59786k66664M7778j04428A68312K36166A26983O1875
14855A88858N6327K60721j19573H3183L4259J12685J35231k4014J55730J58686
14845F55760f62C95298P7107p6532A64846L78062r0661q0191p6059K77936A7053
14833D85966j62971A54788J89458J15713l5120M0255C1984K00901P7323P1545
14823C81753A57021M83868j34203q0000K66465j54214j9583j87341R620K26550
14813E68183R3112B81657J7724L53197B27805p265p4572K11915p6491K59870k23570
14802C17692K24268k24305J00092j05190J90471m8169N9658R9389k21040m5252
$$ plain form
14876 289279 469753 547960 97312 447259 441006 642667 392173 35960 238898 149965 523807
14865 523807 370760 302042 661828 395164 442942 338514 168312 404478 126983 188858
14855 188858 245185 505906 386333 83183 117442 230127 365358 341344 497074 655760
14845 655760 -662 395298 472405 395873 164846 542908 452247 372056 295997 573933 17053
14833 485966 322995 154788 344246 459959 424839 465094 31984 232885 310208 381753
14823 381753 157021 640889 506686 426686 693151 538937 519354 332013 341633 568183
14813 568183 661295 281657 299381 652578 227805 220540 145968 357883 281392 541262 317692
14802 317692 541960 317655 417747 312557 503028 454859 514517 613906 392866 347614
14792C47614P2593j74297M52805N862A66293N53405j45405Q7771J52151j30261
14782F83954C18812L52411l05782J56971B55811K82680J31299K05146C97660L16536
14772G14196j62453J32912L9993r4230j67629K76809C01195L62578K5270J11745
14762H00788l68489J6256j39240M18911Q3237K0633m8853O4014k91432O96m344
14751E52177J79951C59743M37489j12970k0291k8939P6569j37949K55245o4445
14741G64452p6517M9951j64958K1116k55198K32338J80596k02199K08260J43049
14731I00890q1660J15310l71427K04684k99541J37626M13601D90298K7925M34790
14721I53013k43998k1249j82344J86765L8732l4549J32680l24541j8013j68839
$$ plain form
14792 347614 420207 245910 698715 704577 166293 719698 574293 662064 814215 683954
14782 683954 318812 671223 365441 522412 255811 538491 669790 874936 397660 714196
14772 714196 551743 684655 724648 630418 462789 739598 301195 663773 689043 800788
14762 800788 432299 448555 309315 728226 811463 832096 783243 847257 555825 556521 552177
14751 552177 732128 359743 797232 684262 663971 635032 711601 573652 828897 764452
14741 764452 687935 737886 572928 594044 338846 571184 751780 549581 757841 900890
14731 900890 819230 934540 563113 767797 468256 605882 1019483 490298 518223 953013
14721 953013 709015 687766 505422 692187 730919 696370 829050 504509 486496 317657
14711C17657K79190J25129L4084k24953J25948n1300J71118K23495k92875j89597
14701E17896J66602M28427m79403R2045J66551l11416k81462M80788K63928l61449
14691F82507J72498p9878J20968P7712J61288k59502K09122k68068k64165J08236
14681F60718L03144q022K25299D22438L16476m3590K5074j1068O0736K13487k36761
14670G46792K07993J35888k21705K26358l43938K94204l90544M35993E41612K88425
14660H30037J56939m66195J94771K77345Q1488k85611J38387J36269q5612J91440
14650A169258n31762L17058J22403P2419j44077K60628j24180J3450P400j66700
14640I95897K86790j20409K4982M473j93475J82623L89361o94228L89337j04312
$$ plain form
14711 317657 596847 721976 756060 531107 657055 605755 776873 1000368 707493 517896
14701 517896 684498 1112925 633522 725567 892118 580702 299240 780028 1043956 682507
14691 682507 855005 775127 896095 973807 1135095 875593 1084715 816647 552482 660718
14681 660718 963862 955840 1181139 422438 738914 695324 720398 709330 770066 983553 746792
14670 746792 954785 1090673 868968 1095326 751388 1045592 655048 1091041 541612 830037
14660 830037 986976 520781 715552 992897 1074385 788774 927161 1063430 977818 1169258
14650 1169258 637496 954554 1076957 1149376 1005299 1265927 1141747 1155197 1162597 995897
14640 995897 1282687 1162278 1187260 1191733 998258 1180881 1570242 876014 1265351 1161039
14630A161039J40086l48887K66068J35665J2637j89111j4410K18004k25445N1529
14620A207175k03017L47048p9093k00758J58123q1922J90358O2945j27697m4344
14610A228818K07711J91534J36078m69121o888R7743K66017l38719J36781K38535
14600A688489k44960J433M76591m8406k03271J1845m64938M59843j51022K06588
14590A732192Q7324j82749N6287p4945j2444L33330O4317K1682k95391K21687
14580A951290k31836K96664m78949L24696J27812O6137j30759j4992L57935j62739
14570B105259r9236k57333L39940M5637L27216l3550k43157O5527J97090k13721
14560B233672L53826l4821J48171K21440K7271N0046J36214L41961N15924O22343
$$ plain form
14630 1161039 1301125 952238 1218306 1353971 1366608 1177497 1163087 1381091 1155646 1207175
14620 1207175 1004158 1351206 1272113 1071355 1229478 1147556 1337914 1400859 1273162 1228818
14610 1228818 1436529 1628063 1764141 1295020 1288132 1385875 1651892 1313173 1449954 1688489
14600 1688489 1443529 1444962 1921553 1873147 1669876 1681721 1216783 1676626 1525604 1732192
14590 1732192 1819516 1636767 1693054 1618109 1605665 1938995 2003312 2024994 1729603 1951290
14580 1951290 1719454 2016118 1537169 1861865 1989677 2055814 1925055 1910063 2267998 2105259
14570 2105259 2006023 1748690 2088630 2134267 2461483 2427933 2184776 2250303 2447393 2233672
14560 2233672 2587498 2552677 2700848 2922288 2949559 2999605 3135819 3477780 3993704 4616047
14550D616047J048629K208235M626467Q096782J4663251K187143A8422802G780754
14541D963264j400542p32143l61655m42469m1121K9450o4975k52570L50882l44517
14531A703604N59088l49639k0324K85307j66737K84870K43076k94578k25864M68809
14521B487612M0388j41325L42832n88949M80538j95193J02947K30345o779j04088
14511B648328J2371L25365l59546J9362L59706p2972j30595O5667j65286J47461
14501B849861p9878O4842m4888L01213n3204J18493l42125M55969l62460K84642
14491C192465k40278L83342j84209n0393K89560K92134J49082m15818J75468l9039
14481C552314m9115o9728M36651j8555n00844L94970m9113k9192L13527j40650
$$ plain form
14550 4616047 5664676 7872911 12499378 20596160 35259411 37446554 18422802 7780754
14541 4963264 3562722 2830579 2468924 2026455 1985334 2014784 1949809 1697239 2048121 1703604
14531 1703604 2262692 1913053 1892729 2178036 2011299 2296169 2539245 2244667 2018803 2487612
14521 2487612 2528000 2386675 2729507 2140558 2621096 2425903 2528850 2759195 2752416 2648328
14511 2648328 2660699 2986064 2626518 2645880 3005586 2932614 2802019 2867686 2702400 2849861
14501 2849861 2769983 2834825 2789937 3091150 3037946 3156439 2814314 3270283 2907823 3192465
14491 3192465 2952187 3335529 3151320 3100927 3390487 3682621 3831703 3415885 3591353 3552314
14481 3552314 3503199 3433471 3870122 3851567 3350723 3745693 3696580 3667388 3980915 3840265
14471C840265L52323r84k74862K87741L01902p84435K56654J37781K47726J44480
14461D508591k58715L16089M6120j72098k03963L22353r3910M3443N76481n54549
14451D529842K69573M22633K69130k95776n9771l5603K12621K11219k11298j1121
14441E301449M46108m6424l8506J1904L26449k0886k0434K56825J8365L34354
14431F569204j13690j10079M0712K41830j00309L48793J84546o9938J05672L3286
14421G130027O8835J6712M3842P4599M10915L0884L9700J74996K06332K25508
14411H422350M9102m5374L12010J80848k46461L85555q3415K49865J57140L15608
14401I697228N149J88432J02888M4886L67068J11948M11895j3620K66954L61439
$$ plain form
14471 3840265 4192588 4191604 3916742 4204483 4506385 3721950 3978604 4116385 4364111 4508591
14461 4508591 4249876 4565965 4612085 4439987 4236024 4558377 4464467 4507910 5084391 4529842
14451 4529842 4799415 5222048 5491178 5195402 5135631 5100028 5312649 5523868 5312570 5301449
14441 5301449 5747557 5701133 5662627 5674531 6000980 5980094 5959660 6216485 6234850 6569204
14431 6569204 6455514 6345435 6386147 6627977 6527668 6876461 7061007 6991069 7096741 7130027
14421 7130027 7198862 7215574 7259416 7334015 7744930 7775814 7815514 7990510 8196842 8422350
14411 8422350 8471452 8426078 8738088 8918936 8672475 9058030 8974615 9224480 9381620 9697228
14401 9697228 9702377 9890809 9993697 10038583 10405651 10517599 10929494 10915874 11182828 11544267
14391A1544267l13381M53461P7743J91660L72209M9718L54647O41291j91314J27008
14381A3307309K47857L38471K58899J82007N17583K44865K31059L95573J36646
14372A5860269M12330J82127M56669J90908L97464N01100J82378N80436K31448
14363A8995129M33264P39454L0426P90349J81089N68189O50377M06244L78457
14354B3172978O01905O62374Q41051N0823J193197N50868N86707M22900P42868
14345B8825671Q56148J031592O36250P12723R59301R91933J038324P32571J030527
14336C6815040J143297J052053J294496R19753J203606J588289R81263J505884
14328D6503681J904333J072125J489888J756610K004602J883906J831873K027612
$$ plain form
14391 11544267 11230886 11684347 11762090 11953750 12325959 12375677 12730324 13371615 13180301 13307309
14381 13307309 13555166 13893637 14152536 14334543 14852126 15096991 15328050 15723623 15860269
14372 15860269 16272599 16454726 16911395 17102303 17499767 18000867 18183245 18763681 18995129
14363 18995129 19428393 20167847 20198273 20988622 21169711 21737900 22388277 22794521 23172978
14354 23172978 23774883 24437257 25278308 25329131 26522328 27073196 27659903 28082803 28825671
14345 28825671 29681819 30713411 31349661 32062384 33021685 34013618 35051942 35784513 36815040
14336 36815040 37958337 39010390 40304886 41224639 42428245 44016534 44997797 46503681
14328 46503681 48408014 49480139 50970027 52726637 54731239 56615145 58447018 60474630
14320F0474630K432974J796040K590241K431891K540663K430317L224255L094517
14312H1015528L145959L218205L532244L927079L926922M124011M605226M511050
14304A12006224N074608N286815N300250O063344N894065O781653P208174P106248
14296A60721381P984731Q005626Q713353R256055R717722J0038253J0637903J1467062
14288B36542086J1813043J1873424J3117554J2822328J3443089J4040384J3315381
14281C26967289J4017434J3795683J3568267J2747161J2128544J1103477R392554
14274D13720409O038465K504935P41256j032698p20315p22084k534404n070990
14266D12924574q684449j0239949r926368j0162279j1606885j3093622j3526959
$$ plain form
14320 60474630 62907604 64703644 67293885 69725776 72266439 74696756 77921011 81015528
14312 81015528 84161487 87379692 90911936 94839015 98765937 102889948 107495174 112006224
14304 112006224 117080832 122367647 127667897 133731241 139625306 146406959 153615133 160721381
14296 160721381 168706112 176711738 185425091 194681146 204398868 214437121 225075024 236542086
14288 236542086 248355129 260228553 273346107 286168435 299611524 313651908 326967289
14281 326967289 340984723 354780406 368348673 381095834 393224378 404327855 413720409
14274 413720409 419758874 422263809 423005065 421972367 421252052 420529968 417995564 412924574
14266 412924574 404240125 394000176 384073808 373911529 362304644 349211022 335684063
14259C35684063j4018461j4427899j3865995j4026751j2876054j2642710j2567471
14252B41258722j1941092j1586679j0575231j0376276r828968q895573q940853
14245A69114050p973003p705858o949055o940844o458839n825786o004315n065489
14237A16190861n216171m901720m403265m235856m301772l152046l461453l440381
14229H3078197l300399l182210k812702l232399k597092k265011k318684k281803
14221F1087897k110013j851326j848086j642155k016458j829094j692674r00579
14213D7197512j242946j676070j276248j493107j458384p34119p36903r84562
14205C7595173j214644j150944j138005n56961q89256m57176j164155j004212
$$ plain form
14259 335684063 321665602 307237703 293371708 279344957 266468903 253826193 241258722
14252 241258722 229317630 217730951 207155720 196779444 186950476 178054903 169114050
14245 169114050 161141047 153435189 146486134 139545290 133086451 127260665 121256350 116190861
14237 116190861 110974690 106072970 101669705 97433849 93132077 89980031 86518578 83078197
14229 83078197 79777798 76595588 73782886 70550487 67953395 65688384 63369700 61087897
14221 61087897 58977884 57126558 55278472 53636317 51619859 49790765 48098091 47197512
14213 47197512 45954566 44278496 43002248 41509141 40050757 39316638 38579735 37595173
14205 37595173 36380529 35229585 34091580 33534619 32645363 32188187 31024032 30019820
14197C0019820o83010q76947q79519l26951o40193o46766m58003p15699p12059
14188B4080673p13422m90524j07412q49241o12627m58511k98119n20684m47259
14179A9582874j97267n46946m52771j94452o11603l6949o53868k94633j38057
14170A6456328o87933r2515l77945k15039o8479l28587j36965n71980k03724r9274
14160A3673887l90675k17632j897m51600l04847J10579l38744r5208k12218j50352
14150A1621293m17571m35669J1906L17280l44422l50216j86984o4066q2727k87556
14140I781268j57872k74324P3941k87085r9651q8944l25938L68870j89005n22168
14130H279092K23528l11858l2738j32380m94783M41220n33595l4806n7481m7287
$$ plain form
14197 30019820 29336810 28459863 27580344 27253393 26613200 25966434 25508431 24792732 24080673
14188 24080673 23367251 22876727 22769315 21920074 21307447 20848936 20550817 20030133 19582874
14179 19582874 19385607 18838661 18385890 18191438 17579835 17542886 16889018 16594385 16456328
14170 16456328 15768395 15675880 15297935 15082896 15014417 14685830 14548865 13976885 13773161 13673887
14160 13673887 13283212 13065580 13063683 12612083 12307236 12417815 12079071 11983863 11771645 11621293
14150 11621293 11203722 10768053 10779959 11097239 10752817 10402601 10215617 10151551 10068824 9781268
14140 9781268 9623396 9349072 9423013 9135928 9036277 8947333 8621395 8990265 8801260 8279092
14130 8279092 8502620 8190762 8158024 8025644 7530861 7972081 7438486 7403680 7346199 7298912
14120G298912k84688J98691K52823o25812j21465N5233k12643j11484m7674K0211
14110F422104j58612K17265k90978Q8323o2232k99305l3706J54072m20033M17372
14100F034270o65978L41304J30004k15687k93189K75178m90580K9755j58893J17585
14090E103769k63899M30668j34962n10824J67084j46368M76922n94181J66327
14081D694536m4465k9269m42625K22472r4246L97282m78086r5832J33890q4699
14071D178958J15250k97664k97002L63548j74202q2280p2225K72766l7391l48105
14061C621653J95711K44687k14098p7524J09838N8346n14703J41764l54257J58425
14051C369842m3631J57826k73356k37613L24779j56665J96363l14191J82885k49164
$$ plain form
14120 7298912 7014224 7212915 7465738 6839926 6718461 6773694 6561051 6449567 6401893 6422104
14110 6422104 6263492 6480757 6189779 6278102 6215870 5916565 5882859 6036931 5616898 6034270
14100 6034270 5368292 5709596 5839600 5623913 5330724 5605902 5115322 5145077 4986184 5103769
14090 5103769 4839870 5270538 5135576 4624752 4791836 4645468 5122390 4528209 4694536
14081 4694536 4650071 4620802 4178177 4400649 4306403 4703685 4225599 4129767 4263657 4178958
14071 4178958 4294208 3996544 3699542 4063090 3888888 3806608 3734383 4007149 3969758 3621653
14061 3621653 3817364 4062051 3847953 3770429 3880267 3938613 3423910 3565674 3211417 3369842
14051 3369842 3326211 3484037 3210681 2973068 3297847 3141182 3337545 3023354 3206239 2957075
14041B957075J82032k55085K35145n3136m96521K91365J5802K64487l33825J73173
14031B980512l02436L12117o68149M57972j59545K37373j61506J51032K17293
14022C064663n47746L98079m56306J89094k27573J2286r8248J65067J49558l67752
14012B281122j20593p8014J92691n7365j94100Q5159M07548l91799R7638k50527
14002A971760J27334l6722O2563K062k57036K52597k55414o4745M43598j85582
13992B060415k34836J71171P75936J586349K768048P462332J5003961Q462459
13984C8055835j5678701A1178120l795541j685467p90495j007218l88815k27184
13976C283400j22095l04041K18016p07513K91528l32665j60123J81214K29692
$$ plain form
14041 2957075 3139107 2884022 3119167 3066031 2569510 2860875 2876677 3141164 2807339 2980512
14031 2980512 2678076 2990193 2322044 2780016 2620471 2857844 2696338 2847370 3064663
14022 3064663 2516917 2914996 2458690 2647784 2420211 2432497 2334249 2499316 2648874 2281122
14012 2281122 2160529 2082515 2275206 2217841 2023741 2108900 2516448 2124649 2222287 1971760
14002 1971760 2099094 2062372 2124935 2126997 1869961 2122558 1867144 1802399 2245997 2060415
13992 2060415 1825579 1996750 2772686 4359035 7127083 14589415 29593376 38055835
13984 38055835 22377134 11178120 7382579 5697112 4906617 3899399 3510584 3283400
13976 3283400 3161305 2857264 3075280 2367767 2659295 2326630 2166507 2347721 2577413
13967B577413l41049o4199j10049p1481q9815J12812J39875p9568j38341Q2646
13957B018244j78857J81103k48875J14838Q1740J808q4030k9185J02987q2789
13947A876984j07413k90289J38093N5965K43279k76717k0010J49582O5245l07280
13937A527439r694m9085M94127m06001k44897L32455k53602L16958j05947k10907
13927A390846j21682L36675J01287o7149n7998p9417K03745j94073J27600m60147
13917A179687L62884o6498p1881j04488R9743L00507l94193J69531M523k47359
13907A232456k05816R8212K37706J32884k36357J09286J12481j72135J6229N8659
13897A383605k30508j17914P0635Q1663o8286M54827m94112P5672o4154k2804
$$ plain form
13967 2577413 2236364 2172165 2062116 1990635 1900820 2013632 2153507 2073939 1935598 2018244
13957 2018244 1839387 2020490 1771615 1886453 1968193 1970001 1885971 1856786 1959773 1876984
13947 1876984 1769571 1479282 1617375 1673340 1916619 1639902 1619892 1769474 1834719 1527439
13937 1527439 1517745 1468660 1962787 1556786 1311889 1644344 1390742 1707700 1601753 1390846
13927 1390846 1269164 1605839 1707126 1639977 1581979 1502562 1706307 1512234 1639834 1179687
13917 1179687 1542571 1476073 1404192 1299704 1399447 1699954 1305761 1475292 1479815 1232456
13907 1232456 1026640 1124852 1362558 1495442 1259085 1368371 1480852 1308717 1324946 1383605
13897 1383605 1153097 1035183 1105818 1187481 1119195 1574022 1079910 1155582 1091428 1068624
13887A068624L2062p1529O9933P8255N9107J02212J23063l17664k28487K50207
13877A165783k48633l3967l52698P49353k66976R9555k30553K67930j28295J68084
13867A189583o4407n15734M46614o8720K09439k51607j19296K7867M36438m64827
13857H25350j45807J70276L34103E11654M23756M04330j84238k16062m420K72622
13847A207642Q7396l90344k28624K36483j0125L23894k43589l15972M94165n06064
13837F54862B98830P92108M3020l70498R9394p5806K81821k97345m447q9350L9076
13826G16803J59455p843n601k66736J64469K8526J81692j98834j59425K25218
13816H37724J06287k13111J03066l38436L92296J6393o9329o5107m5028P3477
$$ plain form
13887 1068624 1100686 1029157 1099090 1177345 1236452 1338664 1461727 1144063 915576 1165783
13877 1165783 917150 883183 530485 1279838 1012862 1112417 881864 1149794 1021499 1189583
13867 1189583 1125176 609442 1056056 987336 1196775 945168 825872 853739 1290177 825350
13857 825350 679543 849819 1183922 511654 935410 1339740 1155502 939440 935020 1207642
13847 1207642 1295038 904694 676070 912553 902428 1226322 982733 666761 1160926 654862
13837 654862 298830 1090938 1133958 763460 862854 787048 1068869 771524 767077 677727 716803
13826 716803 876258 868415 862814 596078 760547 789073 970765 771931 612506 837724
13816 837724 944011 730900 833966 495530 887826 904219 834890 769783 724755 798232
13806G98232p255j59607J07376P387K5797k36800R0920O0268L8840j67600o242
13795E51316L57687r57J53739k59102j30042K45521k14320M671K76088m42040
13785E42561L15750j08417j79370r7911K86916j19022J52038l61878L62532l40183
13775D53016J46703j23179j7607L07331k15667R4628J62400j98894j60376K11359
13765F59714r317j70288q1661M28629j56153O4775K0026l20254K59436R615j24230
13754E80292j83894J64810j17416K03461J2630j34637K40746k72987J38999P3177
13744G05181Q7511j74576L5858Q531j13912j1502j4001q46M11455D21618P1796
13733D93414k0835P5410J8102n8454K14532j65199o7439L3039K56429j74088j82392
$$ plain form
13806 798232 790977 631370 738746 746133 771930 535130 626050 686318 725158 557558 551316
13795 551316 909003 908046 1061785 802683 672641 918162 703842 708513 984601 542561
13785 542561 858311 749894 570524 472613 759529 640507 792545 430667 793199 453016
13775 453016 599719 476540 458933 766264 550597 645225 807625 608731 448355 659714
13765 659714 650397 480109 398448 827077 670924 735699 755725 435471 694907 704522 580292
13754 580292 396398 561208 443792 647253 659883 525246 765992 493005 632004 705181
13744 705181 792692 618116 653974 662505 548593 537091 523090 522244 933699 421618 493414
13733 493414 472579 547989 566091 507637 722169 556970 489531 522570 778999 604911 422519
13722D22519N97907m52091p8192k22151L90825j51826n7567L1418K74663l10553
13712D44952J18700n8458r1973m07A95801J98555A27479K02701K15084j32960
13702D12304J09048K28056l56571L66126j53064r9741l8679N2315j70309J88114
13692E37599L15659j46188j73990B05532M72227R4754k91290l8777J33372A30961
13681B29023J88358r6965j208J3440L68605k73726J28353q5463N03983m20845
13671E53555j8365B43895K8996K12768j717j13133j18998R804N6367K56652j27708
13660D46926j09093r1542K17389L330k5885R7235P9835o1602B40753K88745k49881
13649B79617J15380L09255C20112K53557q7678J4887j42939A25048L78312j60634
$$ plain form
13722 422519 1020426 568335 490143 267992 658817 506991 449424 480842 755505 444952
13712 444952 563652 505194 413221 412814 195801 394356 127479 330180 545264 412304
13702 412304 521352 749408 392837 758963 605899 506158 467479 519794 349485 537599
13692 537599 853258 707070 533080 205532 677759 772513 481223 442446 575818 130961
13681 229023 417381 320416 319208 332648 701253 427527 555880 470417 974400 553555
13671 553555 535190 243895 272891 485659 483942 370809 251811 261615 317982 574634 446926
13660 446926 337833 246291 463680 467010 441125 538360 618195 556593 240753 529498 279617
13649 279617 394997 704252 320112 573669 485991 500878 357939 125048 503360 342726
13639C42726J41847A72454K83383k12559L02707J11051B97018K03829j42958R1193
13629D49082A3911L77301L6007m0630K33484B70843m1178K45076k16629J51023
13619D09135K0451j09761P414j46175f7292A00130K44960K3899N7384L1778j64468
13608B93683O7108j23197J24368K1944P141M6081K2632o41A92386G4736M49421
13597E24157j3016J8834B21158k2702K9832N5471E458K41124K12187j51412O5152
13586C72509K62345B32763K63030A44448K67485g6822D06130J01799M1097m0977
13576E08049A69678K29285j1001r4956R9728J15671A63365L62007j45315L5318
13566D15375l3881j59634l5325R2158A26551J39663K22390D1681K29688Q2725
$$ plain form
13639 342726 484573 172454 455837 243278 545985 657036 297018 500847 357889 449082
13629 449082 13911 391212 427219 386589 620073 270843 229665 474741 258112 409135
13619 409135 429586 319825 327239 181064 -67292 100130 345090 368989 426373 458151 293683
13608 293683 360791 237594 361962 383906 391047 437128 459760 459119 192386 74736 524157
13597 524157 511141 529975 221158 198456 228288 283759 5458 246582 458769 307357 372509
13586 372509 634854 232763 495793 144448 411933 -76822 406130 507929 549026 508049
13576 508049 169678 398963 387962 293006 392734 508405 163365 525372 380057 415375
13566 415375 381494 221860 186535 278693 126551 266214 488604 41681 271369 354094
13556C54094K5161q3291J12118j66081q3153L8216J75295A31546J41070Q8580
13546C61196J91994p5442j46124A10255K00288J94910A68764E1472l181K35720
13536B84011A28074K88604a2810C99392A26616K43738j05165J82037j47322L6614
13526C36518r6404I3551Q3584l3184H67M15156G0264K15386a6340D38976C2642
13514D4868L28365n6394r916m4277p3674L7719K39673j19564F4951K32278K09551
13503E06780j25546r1973A34142m8651K16904m9256K6352A09818J65788L562j38033
13492A41135K72162k03028J57939F2281a59391F7126J61492I0098K93356E1432
13481B91267A11019M81131J00556k85114I2645O9843J03166a71825b3943j24518
$$ plain form
13556 354094 379255 295964 408082 242001 158848 197064 372359 131546 272616 361196
13546 361196 553190 477748 331624 110255 310543 505453 168764 51472 48291 284011
13536 284011 128074 416678 -12810 399392 126616 370354 265189 447226 299904 336518
13526 336518 240114 93551 177135 143951 867 416023 70264 285650 -16340 438976 32642
13514 44868 373233 316839 306923 262646 188972 226691 466364 346800 64951 297229 506780
13503 506780 381234 289261 134142 85491 302395 253139 279491 109818 275606 279168 141135
13492 141135 413297 210269 368208 62281 -159391 67126 228618 90098 383454 51432
13481 291267 111019 592150 692706 407592 92645 162488 265654 -171825 -23943 -148461
13471a48461E14476B48430A12427M13309B34068l4160N2977J47101F2938K25649
13461B88587J22963j42956o9774L58107p0514j97319N702G9961O900J51874j908
13450B36827K51550F5069J20190J60886a2173A26837J60901N367a28614A80731
13439A823J87438a5714j5343B31175r0539D8589J88300a2726I8364A0949K00694
13428B11643K961J9701K38970G5546K98909i8539A23893P7258g9365A06275L2555
13417A38830M2863J76517j78774N0504B0594d8596A85670F684K50797A07821a03703
13405B07639J15079B0896J55909K98151j96965a2905E33302a31968B67827F3404
13394B35194P4253i5175B82195G8090e0846G6373K41761J16449p2016j5285A56557
$$ plain form
13471 -148461 514476 248430 112427 525736 234068 199908 252885 399986 62938 288587
13461 288587 411550 268594 198820 556927 486413 289094 294796 79961 86861 238735 236827
13450 236827 488377 65069 185259 346145 -12173 126837 287738 293105 -128614 180731
13439 1823 189261 -15714 -31057 231175 140636 48589 236889 -12726 98364 10949 211643
13428 211643 214604 234305 473275 75546 374455 -98539 123893 201151 -79365 106275 138830
13417 138830 181693 358210 179436 229940 20594 -48596 185670 6684 257481 107821 -103703
13405 207639 322718 20896 176805 474956 277991 -12905 533302 -131968 267827 63404
13394 235194 309447 -95175 282195 78090 -50846 76373 318134 434583 362567 347282 156557
13382A40100o9263Q8325M06206b4608a0330r5656A31727J5358J9213P2754A07487
13370D22380j93395o2481K68776A67287R064p8669K06551M6343n1911a28920L6335
13359i2585D55603b61639B94283K17477D7317N148R0101i127D67949k23200J76495
13348D21244A2356J28153m2500A9849N3921L34388k0185j51342J0286J22115f0081
13336g7334B70606a563k73853B48967J65566A33887K01372j15885C8482a23640
13325E59715G7854a33928B20528p0326K85432a8980B80159I3285O4136K15978
13315C73399r3392K11193l6602j04765D5044Q2224E2012O58963A97191h1781L8232
13304d3549k248A38155h2579E7947a8723C65231A36398J2137J70292J18699A73365
$$ plain form
13382 140100 70837 159162 565368 -24608 -10330 -105986 131727 147085 166298 239052 107487
13370 422380 228985 166504 435280 167287 176351 97682 304233 350576 298665 -128920 -92585
13359 -92585 455603 -261639 294283 511760 47317 52465 142566 -9127 467949 244749 421244
13348 421244 12356 140509 98009 19849 73770 408158 387973 236631 246917 369032 -60081
13336 -77334 270606 -1563 -275416 248967 414533 133887 335259 219374 38482 -123640
13325 559715 77854 -133928 220528 150202 435634 -18980 280159 93285 157421 373399
13315 373399 280007 491200 454598 349833 45044 127268 52012 710975 197191 -81781 -43549
13304 -43549 -45797 138155 -82579 57947 -18723 365231 136398 148535 318827 437526 173365
13292i598A39736P5298C765O2257Q0018j2220C3095K10246O6074j5876a09563
13280C70758g9667D89135I418M51647A13063j4065l6848J34085J14593N6423L1993
13269C99244G5046J87899G8976M6058D7525K51767G3571K45953a03863k8399D04619
13257a5858q476C28483E393a6572B9067A732K89542n7475o4622K82442B09716
13245B67936j33662L47193A32916b9386O256B4276L14052c5561A86753e7679B50256
13233B50931A4799P5588R0172J4322i0936M3158l9816C7765J52736b9093E0603
13221F7687b68528A98994E2966K63941q3684f9750B4099K99842m2472A13718O5996
13210A79714l4633a1399B28702B3495b88563A33247b6109C51488a44370A56407
$$ plain form
13292 -9598 139736 215034 3765 66022 146040 133820 33095 243341 309415 293539 -109563
13280 370758 -79667 489135 9418 461065 113063 98998 62150 196235 310828 367251 399244
13269 399244 75046 262945 78976 125034 47525 299292 73571 319524 -103863 -132262 404619
13257 -15858 -24334 328483 5393 -16572 29067 1732 291274 233799 169177 451619 209716
13245 267936 134274 481467 132916 -29386 -23130 24276 338328 -35561 186753 -57679 250256
13233 250931 14799 90387 180559 194881 -90936 -47778 -87594 37765 190501 -29093 50603
13221 67687 -268528 198994 52966 316907 233223 -69750 24099 323941 281469 113718 179714
13210 179714 145081 -11399 228702 23495 -288563 133247 -26109 351488 -144370 156407
13199D60015G5906K13135m4234M0425F6125i484m3431C0622L4277J44673b05412
13187F0954K73340A36906e8667B44658I4979b88741I7891A354f9661m6494L0242
13176h5913B62258j24603O9674H5705a64614A70730a84953C57517a8231B69665
13165a10454B16616L4475M0938g2340B55137B5686Q8799c5272B16605c39850C18097
13153A66165N0989e1189A10690k0931a99452G470J11646J44234F097P2287J38404
13142B16788I1135a04830A72647a30510H4905i2082G6723c05803I9923J53136
13132B53059r9962n3178h53A03296b99782C82142d3111j6388A11648O9238b7157
13120C71841a72909c0394j11997B13846a28803q4992I0490L07275a9157j80267
$$ plain form
13199 460015 75906 289041 244807 285232 66125 -9484 -52915 30622 64899 209572 -205412
13187 60954 334294 136906 -58667 244658 94979 -288741 97891 1354 -69661 -116155 -85913
13176 -85913 262258 137655 207329 85705 -164614 170730 -184953 357517 -18231 269665
13165 -110454 216616 251091 292029 -72340 255137 25686 114485 -35272 216605 -339850 318097
13153 166165 217154 -51189 110690 89759 -199452 7470 119116 263350 6097 78384 216788
13142 216788 91135 -104830 172647 -130510 84905 -92082 76723 -305803 99923 253059
13132 253059 153097 99919 -853 103296 -299782 382142 -43111 -59499 111648 180886 -27157
13120 371841 -172909 -30394 -142391 213846 -128803 -213795 90490 397765 -19157 -199424
13110a99424A92994b90709C22459G0271M8859c2251A67985C6486f2456A93123
13099E8232a74151E11875G9910a28200M5279E7458J19466i5927b1522G1806a2268
13087B21847L5811e734D7561j2922J40306e1596F4358i5399A70891D5942a66236
13075E2104J30925l4568o4301b20897B01515L97293i2742E0817a7460B28597j12830
13064A15767a76803g4249B91626a16699A93334q8303A7582C669a3948B06439a680
13052A24936L42804b55375C5946N6217K52025A6134b23129C17569a74162I5451
13041f4375B40820a01173E5923i3234A13967K05232A20939h140j03288A21962
13030A73862o4942D8781O6996K08540n5959a88396B69264i4105J4634A19408b75824
$$ plain form
13110 -199424 192994 -290709 322459 70271 119130 -32251 167985 36486 -62456 193123
13099 58232 -174151 511875 79910 -128200 -82921 57458 176924 -95927 -21522 71806 -12268
13087 221847 257658 -5734 47561 34639 174945 -51596 64358 -95399 170891 45942 -166236
13075 52104 183029 148461 84160 -220897 201515 598808 -92742 50817 -17460 228597 115767
13064 115767 -176803 -74249 291626 -116699 193334 105031 17582 3669 -13948 206439 -1680
13052 124936 467740 -255375 35946 92163 344188 16134 -223129 317569 -174162 95451
13041 -64375 240820 -101173 55923 -93234 113967 319199 120939 -8140 -111428 121962
13030 173862 108920 48781 115777 324317 268358 -188396 269264 -94105 -79471 119408 -275824
13018h9547a0071A77419K02610B4391a0976B24906I4545a46409B00768E9492h2250
13006F7568L8994D4431M4788A9465d7204B11911A9015K4636c22495j06778P4634
12995c54639B7583a98103h523k77127A14169k7143B6340K81052A7894a35564H1663
12983B17419l9193a2523A16462K05326I0597K22538j19613b27070A24480q389
12973A16091L69326B5753b92916a1645k4598p3050A80629G0786f4156j06485i583
12961b653D4534h4303A59574c01473A34675g1870G9882J92442c579r6772A63386
12949a90655C5947d1657H7549L51662E3189K4153J3800J84807J16471A37441R878
12938A47319J42657a97828h909j29491L861B88429b2674B8030J01666l4042D3819
$$ plain form
13018 -89547 -10071 177419 380029 24391 -10976 224906 94545 -146409 200768 59492 -82250
13006 67568 106562 44431 89219 19465 -47204 211911 19015 43651 -322495 -429273 -354639
12995 -354639 27583 -198103 -8523 -285650 114169 87026 26340 307392 17894 -135564 81663
12983 217419 178226 -12523 116462 321788 90597 313135 193522 -227070 124480 116091
12973 116091 485417 25753 -292916 -11645 -36243 -109293 180629 70786 -64156 -170641 -9583
12961 -2653 44534 -84303 159574 -301473 134675 -71870 79882 272324 -3579 -100351 163386
12949 -190655 35947 -41657 87549 439211 53189 77342 91142 275949 392420 137441 147319
12938 147319 289976 -197828 -8909 -138400 -134539 288429 -22674 28030 129696 95654 43819
12926e7932j15433B52922N833n7610C7947e276B953b52292M7193A52992a50250
12914A7654a95464a3728A40018a46980f7520r660G4063f863A35007f9501H692
12902B8562J46159M5926a83551n5784A15423J9539C439a14161B08871a66611A87869
12890F5128k2493e5055C06929j19378e2905D6893b14224J236R6770j7803N5577
12879g8444C20400E0659J06456a78988A00457g1359A34136D3965a48153A69724
12868e8124a6465D68a37712C3442a51518j02327B5975R1457a98508A74305B0402
12856B3584a86549K2242E20836H9311h420A18031a31748A13839A2306e2042B0245
12844C1128a12787A21284g9621o5837C66979r551c43349e0623k976C1950L3979
$$ plain form
12926 -57932 -173365 252922 258755 201145 37947 -5276 2953 -252292 -205099 152992 -150250
12914 17654 -195464 -13728 140018 -146980 -67520 -77180 74063 -6863 135007 -69501 8692
12902 28562 174721 220647 -183551 -239335 115423 134962 3439 -114161 208871 -166611 187869
12890 65128 42635 -55055 306929 187551 -52905 46893 -214224 -212988 -116218 -134021 -78444
12879 -78444 320400 50659 157115 -178988 100457 -71359 134136 43965 -148153 169724
12868 -58124 -16465 468 -137712 33442 -151518 -253845 25975 117432 -198508 174305 20402
12856 23584 -186549 -164307 520836 89311 -8420 118031 -131748 113839 12306 -52042 20245
12844 31128 -112787 121284 -79621 -145458 366979 357428 -343349 -50623 -53599 31950 65929
12833F5929E03M25355F8220E292J93373L73782I5060f9034A94712b59361A10002
12821B48700r2645b20351R8376m845f638l27746A26658b99308C53618a7030G2774
12809f050j25133B59661a03070A47178b77841h0982m4766B27824F7139A1717J83504
12798A95221c63273f7149o2155k7398J4978j50342A00514b5322A6216M7872R9470
12787A63558a77837a4091C03495b45663C5900K58768A00081J1671B1894J7214
12777C9108Q3691a43171A31170k8351c42019A80527B3041C035P0421h0934r9310
12766a80244A28718a85040d0862J7918r065A87544b01586Q6654A20548k6624K50064
12755C43988d37966A240g7819C7904b59291C71778b00095A53048R7735j23310
$$ plain form
12833 65929 503 425858 68220 5292 198665 572447 95060 -69034 194712 -259361 110002
12821 248700 156055 -220351 -121975 -126820 -6638 -334384 126658 -299308 353618 -17030 72774
12809 -6050 -131183 259661 -103070 147178 -277841 -80982 -125748 227824 67139 11717 195221
12798 195221 -363273 -67149 -129304 -156702 -141724 -292066 100514 -25322 16216 64088 163558
12787 163558 -177837 -14091 303495 -245663 35900 294668 100081 111752 21894 39108
12777 39108 122799 -143171 131170 102819 -342019 180527 23041 3035 73456 -80934 -180244
12766 -180244 128718 -185040 -40862 -22944 -32009 187544 -201586 -114932 120548 93924 343988
12755 343988 -437966 1240 -77819 37904 -259291 371778 -200095 153048 250783 127473
12745A27473j6332j9062N6384K58891G7368d52023E6610L17079A30486K3090e280
12733i9421A4512L1382b54538D27123j06070f6373J4273B0604J27562n7561J97735
12722B88340b80630g8541m214m2038h416G506f4616g685A0697J69053f9182A58866
12709b8600A42612L7022J36845O8429n5044p5731J49406A91321R5157A32483a7663
12697B05003c45141a48480G6307b6975I0695a19119A8810b9294i034I5858e1882
12685F2770b80826A07366f3286j16503e466j99744C1740K45358k3517M9300j12877
12674A90004B4951g425j90602C32186B8574a98084a1296G8136k4193K26425a92979
12662C86257D5133e9676j92245J22838A30184m66f0321C31443C2779K79970L2520
$$ plain form
12745 127473 111141 92079 148463 407354 77368 -452023 56610 373689 130486 153576 -5280
12733 -99421 14512 45894 -254538 427123 321053 -66373 -52100 20604 148166 90605 288340
12722 288340 -280630 -78541 -82755 -124793 -8416 7506 -64616 -7685 10697 179750 -69182 158866
12709 -28600 142612 179634 316479 384908 329864 254133 403539 191321 286478 132483 -17663
12697 205003 -345141 -148480 76307 -26975 90695 -119119 18810 -29294 -9034 95858 -51882
12685 62770 -280826 107366 -63286 -179789 -5466 -205210 31740 277098 253581 302881 190004
12674 190004 24951 -7425 -198027 332186 28574 -198084 -11296 78136 53943 280368 -192979
12662 386257 45133 -59676 -251921 -129083 130184 129718 -60321 331443 32779 312749 345269
12651C45269a55680E485d0255o6448A82183c4769B9928b7391k55350b8656m1100
12640f9756C16194i1969C34523a28018A41184J02322H8590N0787M8493a458B03481
12628E00660k20242q7875K66590A97531f6747F6247i4648D61425h1495B13785
12617E7530e8960A2842a53678I8632f501C08004h2275b6552j1120B04642a08615
12605b93926c6298j54522I787L46989C3789d586k15884C42576j70532h7373A38126
12593b69474J02303d2298j85847f2665b1785C2282c5449j15038b9846B9831L66924
12582C96755a88676C18577q5531a46043G2137j1282K16633J50516j33597A20428
12571a08670p3930B7712a65942d6802A58660J13291j09536o0235g172A75244p4910
$$ plain form
12651 345269 -155680 5485 -40255 -106703 182183 -34769 29928 -27391 -282741 -28656 -69756
12640 -69756 316194 -91969 334523 -128018 141184 243506 88590 139377 187870 -1458 203481
12628 500660 280418 192543 459133 197531 -66747 66247 -94648 461425 -81495 213785
12617 57530 -58960 12842 -153678 98632 -6501 308004 -82275 -26552 -37672 204642 -108615
12605 -293926 -36298 -190820 9787 356776 33789 -4586 -220470 342576 172044 -87373 138126
12593 -269474 -167171 -42298 -228145 -62665 -21785 32282 -35449 -150487 -29846 29831 396755
12582 396755 -188676 318577 233046 -146043 72137 60855 277488 428004 294407 120428
12571 -108670 -182600 27712 -165942 -46802 158660 271951 162415 102180 -7172 175244 100334
12560A00334e1145j39468A10095M7416k5784k9836P799i9775q7635C98666A06753
12548a15877A01392c50631J58017k5294i9056a855j95343C39039H0348d8091j50397
12537a98488B81144b33837f3728A46344O9004b37057g1248B54098b09884f7958
12526A7681J05342i2219m4516M2428A28442k2112J50034f1349p3422p8245f7180
12514B15689c7562A66448a69851e480l4055j1606A50052e3637B9967L4902f989
12502F1705B7324b62810a26383A54689a69002D0076L81534B954J41357C4556a53786
12490B57856f6770G0188b25975A22291J25115o6736K7198K0199k3917q0850e7922
12478d24861A71332c54526h8492o916o4490l2217c6050E1836a13825d6385A19790
$$ plain form
12560 100334 -51145 -190613 110095 157511 131727 101891 109690 -99775 -187410 398666 106753
12548 -115877 101392 -350631 -192614 -217908 -99056 -1855 -197198 339039 80348 -48091 -198488
12537 -198488 281144 -233837 -63728 146344 215348 -237057 -71248 254098 -209884 -67958
12526 17681 123023 -92219 -136735 -94307 128442 106330 256364 -61349 -134771 -213016 -67180
12514 215689 -37562 166448 -169851 -5480 -39535 -51141 150052 -53637 29967 64869 -6989
12502 61705 27324 -262810 -126383 154689 -169002 40076 421610 2954 144311 34556 -153786
12490 257856 -66770 70188 -225975 122291 247406 180670 207868 228067 204150 123300 -57922
12478 -424861 171332 -354526 -88492 -95408 -159898 -192115 -36050 51836 -113825 -46385 119790
12466b2224r3320q1681A74910d4165C32416I1650a0960I5861O6158K76932b9723
12454c06010R4845F9463f0335C9723b40587K8633K4064C11070b13510D6185k0245
12443B5940J23567G0678G369L56370E8414K39220A007K93498n0824g0281A00671
12431h2255K3540E862J27414L409F0949b64849B22623a25441B07344F1607K54036
12420C15643b07653m228c1080m1505A80676r534a11137C10032A20816Q5722f148
12408a41884C8663Q1421l2320B2622L3554J84255b14343C18321M9181C5184b00485
12396A71719q0616A1875J66020d6133C4611a60469g8269I6599D7922K70453A07480
12384d0776j39066H7197J94025J74622A63872q1825a01488a838j30105j25833
$$ plain form
12466 -22224 -115544 -197225 174910 -44165 332416 91650 -10960 95861 162019 438951 -29723
12454 -306010 -211165 69463 -60335 39723 -240587 -211954 -187890 311070 -213510 46185 25940
12443 25940 149507 70678 7369 363739 58414 297634 1007 294505 243681 -70281 100671
12431 -82255 -58715 5862 133276 136685 60949 -264849 222623 -125441 207344 61607 315643
12420 315643 -207653 -211881 -31080 -72585 180676 171142 -111137 310032 120816 206538 -6148
12408 -141884 38663 120084 87764 22622 56176 240431 -214343 318321 367502 35184 -200485
12396 171719 91103 11875 177895 -46133 34611 -160469 -78269 96599 47922 318375 107480
12384 -40776 -179842 87197 281222 455844 163872 82047 -101488 -1838 -131943 -257776
12374b57776d8148J0643p765A01856a62303a6149l2946I2483F817d4253k02093
12363b46346d1261l02579J46543I5762a03606l4901B7978h0007C4928L3524N53341
12352F21793i6169a7685B05157a55961A83441a22501A12926a57874o0092h3389
12341b58387L6013a03601C18495b26564g7536o3812A71665k9785a63001d7982
12330B19657C9328b20363A15470K0539g4627A24166e1322A87362e1635a7833A7216
12318B84782K4318a0009n6728m5335B45893j5746c43068a20003B34803E2569a04108
12306b31533K913A19945h3706K1305A90339l3223F9930l4864J99120h6866A44511
12294H8450c5851C78887D0406d531A13056k1638P6935a40425A31977R4179e1979
$$ plain form
12374 -257776 -48148 -37505 -45270 101856 -162303 -16149 -49095 92483 6817 -44253 -246346
12363 -246346 -41261 -343840 -197297 95762 -103606 -138507 27978 -80007 34928 68452 621793
12352 621793 -96169 -17685 205157 -155961 183441 -122501 112926 -157874 -217966 -83389
12341 -258387 -222374 -103601 318495 -226564 -77536 -141348 171665 141880 -163001 -47982
12330 219657 39328 -220363 115470 136009 -74627 124166 -51322 187362 -51635 -17833 17216
12318 284782 309100 -10009 -66737 -112072 245893 230147 -343068 -120003 234803 52569 -104108
12306 -231533 -228620 119945 -83706 -62401 190339 157116 69930 35066 234186 -86866 144511
12294 88450 -35851 378887 40406 -4531 113056 91418 168353 -140425 131977 226156 -51979
12282C97589b2682j07701b3938k4186k0085A36743J89792A51134b29173G1690
12271C36594m0498G8859J15307G9730P8039C4085J1394K02694A06837m4142K8872
12260I1567K49902J00210A5542a55144G6134h6986J0319B8921a53712G7534J10752
12249A88286D8900J68972l0111C2566J99703b11069B20275c9692J8935m7075B44886
12237a75661D38056A56884p4179J1586b7928B51123a21077C4756K59602C7496
12226a12304H6303A7839J74938E6541P1837J57107R1986A25442J59461I7187K23554
12215C20741K9489j29815J03167h290A49347b14334A70055a50696A9372K73055
12205B92427B9686a11667C04679A11855L8420N4510L4055J81813B03498L9896
$$ plain form
12282 397589 -22682 -130383 -23938 -48124 -68209 136743 326535 151134 -229173 71690
12271 336594 296096 78859 194166 79730 157769 34085 45479 248173 106837 62695 91567
12260 91567 341469 441679 15542 -155144 76134 -86986 -76667 28921 -153712 77534 188286
12249 188286 48900 217872 187761 32566 232269 -211069 220275 -39692 -20757 -67832 244886
12237 -175661 438056 156884 82705 94291 -27928 251123 -121077 34756 294358 37496
12226 -112304 86303 17839 192777 56541 128378 285485 377471 125442 284903 97187 320741
12215 320741 350230 220415 323582 -8290 149347 -214334 170055 -150696 19372 292427
12205 292427 29686 -111667 304679 111855 150275 204785 238840 420653 203498 243394
12195B43394D0935K51767A4484Q0801N0138j4286K26412Q4600G5710M9392e9196
12183B79802D7306L78096A35465E5247j7092a67916f5733c0137E21441j43548
12173C77893a41093c8318B7299M8473N3620a01057A26984f5148B23414G3265J34371
12162B07636i7125j66140C4186J97459A09766m2317L03537b16146F0463J1090
12152G1553J1038i2569C26824q3520l241B0745K13666E7714k4108b61365a30530
12140a5845C4427f0169B39356E7326P939k0212b45175b8242a2346k15193G639
12128d8489A66250f5003k4766A30859J4556J26460l8367m6479P879c3250j00928
12117a34178I3738h7117k528j62259A92569e422A81024G8218a69259O5209r3793
$$ plain form
12195 243394 40935 292702 14484 95285 145423 131137 357549 442149 75710 125102 -59196
12183 279802 47306 425402 135465 55247 38155 -167916 -65733 -30137 521441 377893
12173 377893 -141093 -38318 27299 75772 129392 -101057 126984 -65148 223414 73265 207636
12162 207636 -97125 -263265 34186 231645 109766 67449 370986 -216146 60463 71553
12152 71553 82591 -92569 326824 243304 240063 20745 234411 57714 33606 -261365 -130530
12140 -15845 34427 -60169 239356 57326 65265 45053 -245175 -28242 -12346 -227539 7639
12128 -48489 166250 -65003 -89769 130859 145415 271875 233508 187029 194908 -33250 -134178
12117 -134178 93738 -87117 -89645 -251904 192569 -5422 181024 78218 -169259 -104050 -197843
12106a97843F8388R1753c12757a00184B14636i7611j5307j11320J7523P4330d7956
12094c5894C5775K55945a93238E6696K45642A11384M3548E4572f8304b1491p2216
12083i3707q2570k15006a06603H429K61737j10516d01338A89271a02401G9571
12072E8575j6665K01863M47110Q53337m09513C32317r1835Q5307b57769A9908
12061A91953m3866K1410B500b0629j38211O9500B10105n7830a38231h053j41514
12050a49567A84157G326a37322j1301I7840a4256j68919F3104c108H2683e6172
12038B1139a43899B1904a94440B01976m9875C770K22245a70329A9093c5372G1715
12026F5905f7256E4836M882d3009H3704a03796D93101c7750A08421a42045B7419
$$ plain form
12106 -197843 68388 160141 -312757 -100184 214636 -97611 -112918 -224238 -206715 -132385 -47956
12094 -35894 35775 291720 -193238 56696 302338 111384 154932 54572 -68304 -21491 -93707
12083 -93707 -176277 -391283 -106603 8429 270166 159650 -401338 189271 -102401 79571
12072 58575 41910 243773 690883 1544220 1134707 332317 240482 325789 -257769 19908
12061 191953 148087 169497 2500 -20629 -158840 -89340 210105 152275 -138231 -8053 -149567
12050 -149567 184157 7326 -137322 -148623 97840 -14256 -183175 63104 -3108 82683 -56172
12038 21139 -143899 21904 -194440 201976 152101 3770 226015 -170329 19093 -35372 71715
12026 65905 -67256 54836 59718 -43009 83704 -103796 493101 -37750 108421 -142045 27419
12014A68395A112b5417j03353D30326a65111b3245j84268A36181D2268J9348O8362
12003A29978b53438B14768i5591q7744D0248c8306j38480H3992f1291j94924J18486
11992a37729n2251A8604a88042D3969b67385B14744b61888p1062h0888B22808
11981A01833d3847C39756a59019l836j98797B41596f9397B41076b91054G3697
11970i1785j02926H7035h569j5878k5019j55410A7807M1137Q0214i6528F0797
11958c5585F5335b90298A71041A1110K95374n0340F0308K64325f9371A0860g4442
11946a5341D601J27445L9269g0853g888B67654H9343b27822A91546d6618B71898
11934A81516d88111A0383a25388F9408c23794i0109C84053n1947g4896A71521
$$ plain form
12014 168395 1112 -25417 -128770 430326 -165111 -23245 -207513 136181 42268 61616 129978
12003 129978 -253438 214768 -95591 -183335 40248 -38306 -176786 83992 -61291 -256215 -137729
11992 -137729 -189980 18604 -188042 43969 -267385 214744 -261888 -332950 -80888 222808
11981 101833 -43847 339756 -159019 -162855 -361652 241596 -69397 241076 -291054 73697
11970 -91785 -194711 87035 -8569 -24447 -49466 -204876 17807 58944 139158 -96528 60797
11958 -35585 65335 -290298 171041 11110 306484 256144 60308 324633 -69371 10860 -74442
11946 -15341 4601 132046 171315 -70853 -7888 267654 89343 -227822 191546 -46618 271898
11934 181516 -488111 10383 -125388 69408 -323794 -90109 384053 332106 -74896 171521
11923G2872b668q4143d307A65511E3795J93846E4305j9343a3670A19611f7459
11911A09668J05462l0367b41425a00527j75556H1641a37188C7093b409m24167
11901d26576A80641c13985I5294b35435b0620D8795l134e2891j0622L0443j79009
11890b12079b3442M110E1846B913J09268b35343B1973L04597a03887B32451b50730
11878A07156g1693F8257a66996b7711A57893e4924B2665a28748A08915a7029E9127
11866d29115D8426L14800g8019c3528l67814g7985E2814e2350A70495D0953J11357
11855A52310K25274A23048c1378D8465J31189q9744M2806c1183A71390J38692
11845C10082c9535f689B71434a21379q080D6224c19401G2772O6116g4492j24087
$$ plain form
11923 72872 -2668 -86811 -4307 165511 53795 247641 54305 34962 -13670 119611 -67459
11911 109668 215130 184763 -241425 -100527 -276083 81641 -137188 37093 -2409 -426576
11901 -426576 180641 -313985 95294 -235435 -20620 48795 45661 -52891 -63513 -33070 -212079
11890 -212079 -23442 -19332 51846 2913 112181 -235343 21973 326570 -103887 232451 -250730
11878 107156 -71693 68257 -166996 -27711 157893 -54924 22665 -128748 108915 -17029 59127
11866 -429115 48426 363226 -78019 -33528 -401342 -77985 52814 -52350 170495 40953 152310
11855 152310 377584 123048 -31378 48465 179654 89910 132716 -31183 171390 310082
11845 310082 -39535 -6689 271434 -121379 -129459 46224 -319401 72772 138888 -74492 -198579
11834a98579P0224j52750b3544l04159B81880i8960j41296f7520j8178p9034C0666
11822c04559Q4201h7374K308E628b47505d9491d204j86452i344H8803b36954j15736
11810c52690I432g5543A10077J52959b00221R8998J4917k0408C96060A60759c12457
11798e0711i781k26011r1581H4386a24157a6118j40884C66305A79032e9119A95580
11786A95534c65405C1463a68373P5911n760H9394n377M3005B589b23871i3304
11774H4763k2233h706k94545a7060l43166h0488A91535a87157i020j99010c9920
11762h2960j42429F8286a84174A83226J71599A30515Q3559a620E6799J1739J03136
11751A71674M4725b75857d4678B39813d75984J24799K3299a29084d506r9373J3526
$$ plain form
11834 -198579 -128355 -281105 -23544 -327703 281880 -98960 -240256 -67520 -85698 -164732 30666
11822 -304559 -220358 -87374 -85066 5628 -247505 -49491 -4204 -190656 -9344 88803 -236954 -352690
11810 -352690 9432 -75543 110077 263036 -200221 -101223 -86306 -106714 396060 160759 -312457
11798 -50711 -9781 -235792 -327373 84386 -124157 -16118 -157002 366305 179032 -59119 195580
11786 195534 -365405 31463 -168373 -92462 -98222 89394 84017 127022 2589 -223871 -93304
11774 84763 62530 -8706 -303251 -17060 -360226 -80488 191535 -187157 -9020 -208030 -39920
11762 -82960 -225389 68286 -184174 183226 354825 130515 214074 -1620 56799 68538 171674
11751 171674 216399 -275857 -44678 239813 -475984 -351185 -327886 -129084 -4506 -103879 -90353
11740i0353d136n0494A35793a55481D21053A88695K276m2998d4803j36169D9044
11728G2915c8472A08628n3271Q2431h0055A68968o8184B6672M5783g6700B49204
11716a02116a3564A78760n5206a77499g9862C40346i4357A3908K00902G7017e0444
11704A33905b27032A917J06320b90991e1275C43184B194b37671B30814j05131
11694A25683e8960B77333h6226C9351J52540F7004a45802b6377H6787O8083k9385
11683A25485c6344A14968a34067C28267d6184A99285i9380A10856P1560K601A5402
11671B31434G1224R8797j0896K02031j71618m6401E0268M6842H990f7988A00476
11659E1370j9722a27111A8955J20233B8057a09911F9606r961a17146A2083J29692
$$ plain form
11740 -90353 -4136 -54630 135793 -155481 421053 188695 190971 147973 -44803 -180972 49044
11728 72915 -38472 108628 55357 137788 -80055 168968 100784 26672 72455 -76700 249204
11716 -102116 -13564 178760 123554 -177499 -79862 340346 -94357 13908 214810 77017 -50444
11704 133905 -227032 1917 108237 -290991 -51275 343184 2194 -237671 230814 125683
11694 125683 -58960 277333 -86226 39351 191891 67004 -145802 -26377 86787 154870 125485
11683 125485 -36344 114968 -134067 328267 -46184 199285 -99380 110856 182416 185017 15402
11671 231434 71224 170021 159125 361156 189538 143137 50268 97110 8990 -67988 100476
11659 51370 31648 -127111 18955 139188 28057 -109911 69606 59645 -117146 12083 141775
11648A41775J24170q8784F2455a69031D5467d65693B99065E953a0217M250j97520
11637b03487H5507l1621K33227d81534a1661j36059B09886f2578A25859D6990
11626D6226a79931A5379a70998q4088G5978K6788m4435J2789c01165B35916e74906
11614F1997K7385K34940a6893B1367N8440c873k98178A15564e0701j33789h7620
11602a69735C01037o7347a98331D725i2596i249A01620b22138f9038J9645b0012
11590A37125C7125Q8973a64185k2049A6927M8422J26023J54616J18140e1624i821
11578A01425F473a7187j21964a3208D2290a30713B28821J4609j02679n6168k1859
11567F2724b09741G1436L61327j90341b34626J5867D7694h6930H7980Q2883G9918
$$ plain form
11648 141775 265945 177161 62455 -169031 45467 -465693 299065 5953 -10217 -5967 -203487
11637 -203487 85507 53886 287113 -481534 -11661 -147720 209886 -62578 125859 46990
11626 46226 -179931 15379 -170998 -255086 75978 102766 58331 71120 -301165 235916 -574906
11614 61997 89382 324322 -16893 21367 79807 -3873 -302051 115564 -50701 -184490 -87620
11602 -169735 301037 233690 -198331 4725 -92596 -9249 101620 -222138 -69038 -49393 -20012
11590 137125 37125 126098 -164185 -186234 16927 65349 191372 345988 464128 -51624 -9821
11578 101425 6473 -17187 -139151 -13208 42290 -130713 228821 243430 140751 84583 62724
11567 62724 -209741 71436 432763 242422 -234626 -218759 47694 -86930 87980 170863 79918
11555a0217A77321g9103B325K28839c21721D9015b44833a3205B38756d7050A13827
11543A39571a46311c5622A88560d7710D1625O0302L9051J1656P9425f1434o7802
11532a29236A96695E7606i8360A79467h8253A14623m4727J37021d10510B13498
11521F4602K79233A40558n5869a35820A6463a71269O5764A44483J8674b55197
11510B19334O0034M1146F2352a59222D79838E7689a22612d204A73973Q8539o66
11499B61846j07244h8227A69502J98823j22460J02049j72086o8070L09822A28418
11488D8635R7852P849N1870f7776F5111g9748j22175B78588I06L70282J5185a48970
11475d6531H0678l9696J4269K75130o0185r6619n0535l6312K6011M4571Q3530
$$ plain form
11555 -10217 177321 -79103 2325 231164 -321721 49015 -244833 -13205 238756 -47050 113827
11543 139571 -146311 -35622 188560 -47710 41625 101927 140978 152634 232059 -61434 -129236
11532 -129236 196695 57606 -98360 179467 -88253 114623 69896 206917 -410510 213498
11521 64602 343835 140558 84689 -135820 16463 -171269 -105505 144483 163157 -255197
11510 219334 279368 320514 62352 -159222 479838 57689 -122612 -4204 173973 262512 261846
11499 261846 154602 -88227 169502 368325 245865 347914 175828 107758 417580 128418
11488 48635 146487 154336 206206 -67776 65111 -79748 -201923 278588 906 371188 386373 -148970
11475 -46531 80678 40982 55251 330381 270196 173577 123042 86730 112741 157312 240842
11464B40842C98L09026j46294a0406C28669A58239l8966b9488E547J74160L3055
11453B12762E4594J10027G5787h8305C22436h9381b3816C94210A68569J28626
11443B97195A43592E3234J89412O7652a89324B47630A13950K18488E9500a7634
11432A55638J20022j17286b49120a845l0504m1589A1778a01571b404j72209A3699
11420a23040J2697d8613j22952O7529q1251A91720o0676J06372b46137a4272l28090
11409c42362G5352a20571j36233j31486c627F3781l1668a3276j80685j1239B72066
11397b1252r6977c1500k33262J31245C18631A3379P0376c99166C8195M4950i6422
11385D6269j0751J2430i4392K3277A67105G1816C1175J54962H6321a73618A00136
$$ plain form
11464 240842 398 309424 163130 -10406 328669 158239 119273 -29488 5547 179707 212762
11453 212762 54594 164621 75787 -88305 322436 -89381 -23816 394210 168569 297195
11443 297195 143592 53234 242646 310298 -189324 247630 113950 332438 59500 -17634
11432 155638 275660 158374 -249120 -1845 -32349 -73938 11778 -101571 -2404 -174613 13699
11420 -123040 -110343 -48613 -171565 -104036 -185287 191720 131044 237416 -246137 -14272 -342362
11409 -342362 75352 -120571 -256804 -388290 -3627 63781 32113 -13276 -193961 -205200 272066
11397 -21252 -118229 -31500 -264762 -133517 318631 13379 83755 -399166 38195 83145 -96422
11385 46269 35518 47948 -94392 -71115 167105 71816 31175 186137 86321 -173618 100136
11373A34229B3183i9790j43332b3939B43675b5761A09929J31626c0697l4605M728
11362f0574A4812O1988J34351j6566M14968c0937j41128M4098C75718a76873d9059
11350i220k04466e6037G4442J35728G9799c70605g807j20549A57690d16280A65057
11338B48850b96401a10296j2865A18863c3205A56478a62084B5483J10971b37210
11327a80641j49750a10403D2742d5638k1413L1518j97664e6500j27271B67738
11316c1989H1774Q8457h8064q8382j61765a42367f5564j9345L1001B34720K10075
11305D44795e0169p831C00301a71247A06334f1084k5426c6711e373j81215C53673
11293D0285L6508b57541E2080R1523g7575j06290O821A86404b4887A33260i3522
$$ plain form
11373 134229 23183 -99790 -243122 -23939 243675 -25761 109929 241555 -30697 -65302 -60574
11362 -60574 14812 76800 211151 194585 609553 -30937 -172065 -127967 375718 -176873 -49059
11350 -9220 -213686 -56037 74442 210170 79799 -370605 -7807 -128356 157690 -416280 165057
11338 248850 -296401 -110296 -123161 118863 -33205 156478 -162084 25483 136454 -237210
11327 -180641 -330391 -110403 42742 -45638 -67051 -35533 -233197 -56500 -183771 267738
11316 -31989 81774 170231 -88064 -176446 -338211 -142367 -65564 -84909 -53908 234720 444795
11305 444795 -50169 -58000 300301 -171247 106334 -61084 -86510 -36711 -5373 -186588 353673
11293 40285 76793 -257541 52080 143603 -77575 -183865 -177044 186404 -24887 133260 -93522
11281d1984n873E7737c6802A6898d02685I4895J17662b55502a13712C0991g52160
11269B95342B9354c6382D34918a58710K5113L4057j03407F5632b52555G3537R2423
11258A65960c68191d9668j81452R4654C1554N2239a21044C1746D473c79696A64848
11246a45834J1354d914A47025a32751E9128d544F1323b15160A89421p4152m0680
11235G4589g7625D1313J06621b0317a213j38609f4841m9963p3531j80536j4206
11224c83077A38094b31448j903C02882A10903J3297K90548a14768a6052l0430
11214d6482B06484G4490r865a50738o0476J02074A25943K60060j64248a41798
11203f0189n1890j42682B0727a47172B64757J17919g4916A06519k9707J26474
$$ plain form
11281 -41984 -47857 57737 -36802 16898 -402685 94895 212557 -255502 -113712 30991 -752160
11269 295342 29354 -36382 434918 -158710 -133597 -99540 -202947 65632 -252555 73537 165960
11258 165960 -368191 -49668 -231120 -136466 31554 83793 -121044 31746 4473 -379696 164848
11246 -145834 -134480 -4914 147025 -132751 59128 -4544 61323 -215160 189421 115269 74589
11235 74589 -77625 41313 147934 -20317 -1213 -139822 -64841 -114804 -188335 -368871 -383077
11224 -383077 138094 -231448 -233351 302882 110903 124200 414748 -114768 -16052 -46482
11214 -46482 206484 74490 64625 -150738 -211214 -109140 125943 386003 221755 -141798
11203 -60189 -112079 -254761 20727 -147172 264757 382676 -74916 106519 76812 203286
11193B03286B6596a18247c0277J0284p921m014j53589A9243d4973H7779F55d9726
11180d63575A07634f5925j53279P0413l02117d5587m72471D6215K34355A39323
11169G2946j4626f7861C62776d8472C8864a04297o5260M8300H0046c32389i4397
11157d4109A95393l734b24359q2062A12428B6967a67080A52682a259I9309K1861
11146A21170K6016l8287a31241a9341j48700J338H5494J23820K6918b05405A91984
11134B72753c22673A9016a22485B35442i7210G3623J33833j02742f8475b5805
11123B63545J35059B0879c0554i198k2673D9214K4843L01355H6897R3785b13007
11111B34035J09416A33794j3380D1206P091L90104A52358m3848L5680O7930C9501
$$ plain form
11193 203286 26596 -118247 -30277 -19993 -27914 -31928 -185517 19243 -44973 87779 655 -49726
11180 -463575 107634 -65925 -219204 -148791 -450908 -45587 -518058 46215 280570 139323
11169 72946 58320 -67861 362776 -48472 38864 -104297 -169557 -121257 80046 -332389 -94397
11157 -44109 195393 191659 -224359 -306421 112428 26967 -167080 152682 -1259 99309 121170
11146 121170 147186 108899 -131241 -19341 -168041 -166703 85494 209314 236232 -205405 191984
11134 272753 -322673 19016 -122485 235442 -97210 73623 207456 104714 -68475 -25805
11123 263545 398604 20879 -30554 -9198 -31871 49214 74057 375412 86897 180682 -213007
11111 234035 343451 133794 120414 41206 48297 438401 152358 108510 144190 212120 39501
11099F3318N38248b0359B13319C2497H273L98875D136J84677A1435K58193J3710
11088B83338n7768P3487c7468C3952M28140b07058A73162c0379B48317J94201
11078D42518R3784j07198p9060J07516A60875M5979M6963J45130k4576j40356
11068B34015A09702J41295m1729M84232k57830J64524j48840K22818k11802k15585
11058B46785K69614n566L4990R7979j70229M59856j43618N3096j18448j92417
11048E32042l427J86439j84684J19569O0690j5828j863Q8890k85514L84436j79836
11037G00914l16195K12646j43622K17615o7516J84921J7304J34565k16072R4584
11027H19144k69271j53681M45872l15105K13868l03695j16964K90754k45294K86987
$$ plain form
11099 63318 601566 -20359 213319 32497 8273 407148 4136 188813 11435 269628 283338
11088 283338 225570 299057 -37468 33952 462092 -207058 173162 -30379 248317 442518
11078 442518 536302 429104 350044 457560 160875 206854 253817 398947 374371 234015
11068 234015 109702 250997 209268 693500 435670 600194 451354 674172 462370 246785
11058 246785 516399 510833 545823 643802 473573 933429 789811 842907 724459 532042
11048 532042 528615 715054 530370 649939 710629 694801 692938 781828 496314 880750 700914
11037 700914 384719 597365 453743 671358 603842 788763 806067 940632 724560 819144
11027 819144 549873 396192 842064 526959 740827 437132 320168 610922 365628 652615
11017F52615l03828J76780j27807K14767j2402j73165K72714J12075l4971l5258
11007G41520C62106L98037j323k82201j17165N20824k21230k26963L23670J10443
10997H66198k46095p3914r1783L74800l47367L77266j24745j41819K02329J59373
10987I54243L33784l71327j10529J57995J96538j17348P5149L51857j07629j32404
10977A230329P12638m6215K13285M48010K13329k3275l58479J79144j59703k9481
10967B379582k46790k02171k45967J3295n1149j62711K7054K5939q318L02924
10957A831688k7934k88901j62108j71217J23311m14418q2371l56629K2796A09679
10946A27481L44397A29116M4610O4917K45039B36372m6074J37010C1359J38641
$$ plain form
11017 652615 348787 525567 397760 612527 600125 426960 699674 811749 776778 741520
11007 741520 362106 760143 758820 476619 359454 880278 659048 432085 755755 866198
10997 866198 620103 546189 454406 829206 481839 859105 734360 592541 794870 954243
10987 954243 1288027 916700 806171 964166 1160704 1043356 1118505 1470362 1362733 1230329
10977 1230329 1942967 1896752 2110037 2558047 2771376 2748101 2389622 2568766 2409063 2379582
10967 2379582 2132792 1930621 1684654 1697949 1646800 1484089 1511143 1537082 1528764 1831688
10957 1831688 1803754 1514853 1352745 1181528 1304839 890421 808050 451421 474217 109679
10946 127481 471878 129116 173726 238643 483682 236372 190298 327308 31359 170000
10936A70000K5521K00076J27611G6241i4234C80071j0809a31584p6730O6395C16036
10924C28000A45122a03136C99758c61465C18195A09942e9705C27675G3515f5108
10913A31794o28R6374h0685j68310A89528b16079A41625a42882A43105e5649F5590
10901C7944b48449B22355b6483A78351O5018F8068g213j77804P1290L1725A06444
10889a78584N8570N2012K7189j13600B12589q4456J46164E5120i5206A54115c5568
10877i5182H966R6573B3834b4849j49417I6025h7284r1630J1135A837Q2455C2462
10864B82596F0263a84288O3966E6279k3006b56305E5029a32174j716A63606E5076
10852D063P5822a7359A17978h0732m9676F3602j8568c1868A02329j5715C071K22966
$$ plain form
10936 170000 195521 395597 523208 76241 -94234 380071 369262 -131584 -208314 -141919 316036
10924 328000 145122 -103136 399758 -361465 318195 109942 -59705 327675 73515 -65108
10913 131794 131166 227540 -80685 -248995 189528 -216079 141625 -142882 143105 -55649 65590
10901 37944 -248449 222355 -26483 178351 243369 68068 -7213 -185017 -113727 -82002 106444
10889 -178584 -120014 -68002 -40813 -154413 212589 128133 274297 55120 -95206 154115 -35568
10877 -95182 8966 105539 23834 -24849 -174266 96025 -87284 -178914 -167779 1837 84292 32462
10864 282596 60263 -184288 -120322 56279 33273 -256305 55029 -132174 -133890 163606 55076
10852 4063 79885 -17359 117978 -80732 -130408 63602 45034 -31868 102329 86614 3071 226037
10840B26037k3473J49019h7158j04954H8979b13959B09111a24908L1887A1460
10829A03117A9591J46209a5348j11069j58878g5463D351R4254e6638B46320d2415
10817a17249o3323m0430m385d9798B16924I6615h1845j04051G864K48487g6998
10805b84858A8528R6576P9956C3176f4654N636B11282b84659m4492a29974C05747
10793A47238a59028O5998n0171B99480d37885B5440K88016b93398a31859K1402
10783a10457D29611E4175e1139A32635J16898I3648fA22171m0346J63154B1459
10771i713F6177b4753m34224D5339J70686E2652J43711b06579E5599b97860c1081
10759B9458a60101f5916N008b6538l09487J6062Q5105k4027J07130b0880m3527
$$ plain form
10840 226037 202564 351583 -87158 -192112 88979 -213959 209111 -124908 -93021 11460
10829 103117 19591 165800 -15348 -126417 -285295 -75463 4351 98605 -56638 246320 -42415
10817 -117249 -180572 -221002 -225387 -49798 216924 96615 -81845 -185896 7864 256351 -76998
10805 -284858 18528 115104 195060 33176 -64654 -59018 211282 -284659 -329151 -129974 305747
10793 147238 -159028 -93030 -143201 299480 -437885 25440 313456 -293398 -131859 -110457
10783 -110457 429611 54175 -51139 132635 249533 93648 -6 122171 81825 244979 21459
10771 -9713 66177 -24753 -458977 45339 216025 52652 196363 -206579 55599 -297860 -31081
10759 29458 -160101 -65916 -60908 -26538 -336025 -319963 -234858 -258885 -151755 -20880 -64407
10748f4407r5602B30282O2848a79988A0603J43242b43359r5822A33773J59047
10738B92820c76963a70701A02955b79893i9352b6750j11435j21647b1263l9078
10728f0341G5601b19847h9076b2411j07764m6525C225J17146J829h3816j45050
10717b28866i4791r8754D6440b94612a14478j76340a05214j12356l2970K6083
10707b24457b0290o867R771A04976c12182I1643a17729o5442F6879j9285K91356
10696C38950i2495A8290h0501m7540n9659B98526d6523n9476j77142B97319A25538
10684c06436a35663A88198b0593C7681i9356b2791D2322J22728i4020E2789b41151
10672F8686b87658J05628B15125b2057B29211a01978k05025M0377E303a1294j75057
$$ plain form
10748 -64407 -160009 230282 293130 -179988 10603 153845 -243359 -339181 133773 292820
10738 292820 -376963 -170701 102955 -279893 -99352 -26750 -138185 -259832 -21263 -60341
10728 -60341 75601 -219847 -89076 -22411 -130175 -176700 3225 120371 122200 -83816 -228866
10717 -228866 -94791 -193545 46440 -294612 -114478 -290818 -105214 -217570 -250540 -224457
10707 -224457 -20290 -27157 -17386 104976 -312182 91643 -117729 -183171 66879 47594 338950
10696 338950 -92495 18290 -80501 -128041 -187700 298526 -46523 -105999 -283141 297319 125538
10684 -306436 -135663 188198 -20593 37681 -99356 -22791 42322 165050 -94020 52789 -241151
10672 68686 -287658 -182030 215125 -22057 229211 -101978 -307003 -266626 5303 -11294 -186351
10661a86351k20357e3056k07977O9713A1698J2745J79936a56862B03920c04362
10650i17j78742f8597k61249H7417b42038e7236n5451B83797b21599D9543e9618
10638b45086k13279a42380A32668i1779B06016g5678C83882a46152C7884L02903
10628C40787a1209k13658h7542j03720r6204K6467B13698b42063d8364C8168b18096
10616C8853N1076a07503K1803J5611E3535A3083Q0484R2542L062D827f5598H3573
10603B13790c87692e6383o70A04123a81612k5679P1735A28665b26284L9419P4172
10592a12693N5158j22717D5334j3122b536j4439j88221c4388N1A09572a2052A46100
10579b3586A29382D3523a37638k13578A69982e960k26325B48189G2157R9931a20904
$$ plain form
10661 -186351 -406708 -53056 -261033 -191320 11698 24443 204379 -156862 203920 -304362
10650 -917 -179659 -68597 -329846 87417 -242038 -57236 -112687 283797 -221599 49543 -59618
10638 -245086 -458365 -142380 132668 -91779 206016 -75678 383882 -146152 37884 340787
10628 340787 -11209 -224867 -87542 -191262 -287466 -260999 213698 -242063 -48364 38168 -218096
10616 38853 89929 -107503 -85700 -70089 53535 13083 93567 186109 189171 4827 -65598 83573
10603 213790 -387692 -56383 -57053 104123 -181612 -207291 -135556 128665 -226284 -186865 -112693
10592 -112693 -57535 -180252 45334 32212 -2536 -16975 -205196 -34388 -34337 109572 -12052 146100
10579 -23586 129382 43523 -137638 -351216 169982 -5960 -232285 248189 72157 172088 -120904
10567A6289J83814c35596A47441A8628b90149a25497A52895e7464k34295O6127
10557b25632H7174Q1305b5038j93972i1153I0412b73283B16605b07894B76753
10546E4353C464i1676q7185C31456b2251p0994n6960D38238H6284e8851g362j78663
10534a86025C01648a80411A89260m6304O5335b502A99166b27766A66946b7614
10523g1443A6114a32322M4865k1023J5937k43491A82565B753J33863c79755A55382
10511c0958k65038Q2286d6543H3252e294E1452J97085g5736B06101b03849a7739
10499g540j79972D0244a90316I6500a51877n7232H751f4840b1811I8040K39810
10488C37850J589b06210D7872J25769o8896J61601K72196M9875J11350k48306
$$ plain form
10567 16289 200103 -335596 147441 18628 -290149 -125497 152895 -57464 -291759 -225632
10557 -225632 87174 168479 -25038 -219010 -91153 90412 -273283 216605 -207894 276753
10546 54353 3464 -91676 -178861 331456 -22251 -93245 -150205 438238 86284 -58851 -7362 -186025
10534 -186025 301648 -180411 189260 142956 208291 -2502 199166 -227766 166946 -27614
10523 -71443 16114 -132322 -87457 -108480 -92543 -336034 182565 2753 136616 -379755 155382
10511 -30958 -295996 -213710 -46543 83252 -5294 51452 248537 -75736 206101 -203849 -17739
10499 -7540 -187512 40244 -190316 96500 -151877 -209109 8751 -64840 -21811 98040 337850
10488 337850 339439 -206210 47872 173641 104745 266346 538542 588417 699767 451461
10478D51461B8716D720L86163j85736o804A5495K150a85417F6173O2423C8590
10466a31979B06994e310j46969E3597a57767L8375I6052b06416l6337D1827R0600
10455A32427e5650C04995O6717j62328p9550b511C38256i6899j56172L9975C36406
10443b44971B96885b07360H7810a82771D5414b61143h8013A24681e0959C6965
10432i7715J3821G4464b88501A49926a10782k7302I9803O9179J4417a7588j18045
10421a35633e8200H3092M7266n5295J52186J1549a28439I5971c5955m15A28271
10409E4298a1012F4232J34335Q1626F0835A3800e1329D1380J93229a38886B27337
10397A72978d296F24K18825g1784C15126j36135i9472H500J88961o9222i1456
$$ plain form
10478 451461 28716 4720 390883 205147 198343 15495 17645 -185417 66173 128596 38590
10466 -131979 206994 -5310 -152279 53597 -157767 -119392 96052 -206416 -242753 41827 132427
10455 132427 -55650 304995 371712 209384 129834 -2511 338256 -96899 -253071 -213096 336406
10443 -244971 296885 -207360 87810 -182771 45414 -261143 -88013 124681 -50959 36965
10432 -97715 -83894 74464 -288501 149926 -110782 -138084 99803 168982 183399 -17588 -135633
10421 -135633 -58200 83092 130358 75063 227249 238798 -128439 95971 -35955 -36370 128271
10409 54298 -11012 64232 198567 280193 60835 13800 -51329 41380 234609 -138886 227337
10397 172978 -4296 624 219449 -71784 315126 178991 -99472 8500 197461 128239 -91456
10385B11772a45621A8347L02001G786J20986M01418b45313c5264C66806A13877
10374E34951I4614D1013J8269M5786M17366A16842N56650k07618j58964J72261
10364D79171A13469m8760O04L22835A81818a07907B03052b3054B39202n0885a59698
10352B66813J84813l4735J40546j84342j75956J80449j12131j06165M5879J12082
10342C17253f5006E87139d6649l1685A17325J63817k202E8578K73539j54506g3027
10330a36040L1227F6967K81047a92234D57797D0476a64730F9759J36657J85560
10320C91976I6753J79450B6533O0613J45693j03249K8509C134J25436a48641A1517
10308A45184F7523J24586p6039b17027A7605c6629F8905R6707d795I5452a58511
$$ plain form
10385 211772 -145621 18347 320348 7786 128772 530190 -245313 -35264 366806 113877
10374 534951 94614 41013 59282 105068 522434 116842 673492 465874 306910 479171
10364 479171 113469 64709 65313 388148 181818 -107907 203052 -23054 239202 188317 -159698
10352 266813 451626 416891 557437 373095 197139 377588 265457 159292 205171 317253
10342 317253 -65006 587139 -46649 -78334 117325 281142 278940 58578 332117 177611 -73027
10330 -136040 -104813 66967 348014 -192234 457797 40476 -164730 69759 206416 391976
10320 391976 96753 276203 26533 87146 232839 129590 158099 3134 128570 -148641 11517
10308 145184 67523 192109 116070 -217027 17605 -36629 68905 165612 -4795 95452 -158511
10296C2410a68053L0982j9399K1784K1480G9396C597a01573j12712B63939b9684
10284A70655J24127b88351J42814C8211g0945r9459F1164e7144r7050B8593f3574
10272A46449p2050J81767b37200D1926a62140F5271J01488b54556A72327H5153
10261b63683B69539J0577O132R0084E1948J76780r7182E0215i5917j18540f67
10249B42792b22297L2120O6564d7262k42094e2923a9541p4780K0459K8196k28125
10238b73791a6832n8961j61782B00323h999A78266H432h7280A26617J471a56282
10226h1484G4955J67883e7440o7215N595K3079A59961b27491A82786r0093c55263
10214f2053J5533k8544C327J79086I0323K4321J07070D2189A4558c25250g7142
$$ plain form
10296 32410 -168053 -137071 -156470 -134686 -113206 79396 3597 -101573 -214285 263939 -29684
10284 170655 294782 -288351 -145537 38211 -70945 -170404 61164 -57144 -154194 28593 -63574
10272 146449 74399 256166 -237200 41926 -162140 65271 166759 -254556 172327 85153
10261 -263683 269539 280116 286248 376332 51948 228728 131546 50215 -95917 -214457 -667
10249 242792 -222297 -190177 -123613 -47262 -289356 -52923 -19541 -94321 -73862 -45666 -273791
10238 -273791 -16832 -75793 -237575 200323 -8999 178266 8432 -87280 126617 128088 -156282
10226 -81484 74955 242838 -57440 -124655 -119060 -95981 159961 -227491 182786 92693 -355263
10214 -62053 -46520 -75064 3327 182413 90323 114644 221714 42189 14558 -325250 -77142
10202G9269a58052O5137B642J11569b30717E8826b29355j1063C6655a72773A00096
10190A60218J51270b36021A03375c08273E8343c2333j92568A77041Q0408b8627
10179f1776I7633d3462G258N5234c68277D4279c03812J36625A38095b42015B50858
10167A03175a23940F8961R786a48250K0728A49121a00124c5904k8256J9872l9210
10156h3498B7287O6188b11090d7774r4017A80564F4779b93621j1774a6357j80724
10145a97081R4864I1629D1746a51868D6393h6210A25611a83516A44860F4692b70148
10133A70036D8696b54020A7962O227J04992l5371c80230a11883a8140G216c95305
10121A07211a09480K1994D5116c64314b1671A1435d5554A44709B078h9592A62993
$$ plain form
10202 79269 -158052 -92915 2642 114211 -230717 58826 -229355 -240418 36655 -172773 100096
10190 160218 311488 -236021 103375 -308273 58343 -32333 -224901 177041 257449 -28627
10179 -61776 97633 -43462 7258 62492 -368277 44279 -303812 -167187 138095 -242015 250858
10167 103175 -123940 68961 78747 -148250 -127522 149121 -100124 -35904 -64160 -44288 -83498
10156 -83498 27287 93475 -211090 -47774 -141791 180564 64779 -293621 -305395 -16357 -197081
10145 -197081 -102217 91629 41746 -151868 46393 -86210 125611 -183516 144860 64692 -270148
10133 170036 48696 -254020 17962 24189 129181 93810 -380230 -111883 -18140 7216 -395305
10121 107211 -109480 -87486 45116 -364314 -21671 11435 -45554 144709 2078 -89592 162993
10109a24076A1871b67409A77511b781o5316A06900a42828j16832A2127K04297
10099B16424a39357K2411l89801a2861D3119O2282e4614j0631k17316B3066J12650
10088A35716A0706K47374b1333j26978A8961c6015k73843a08996K3094E7877h38770
10076B73578C986M312b35188J06430C8180a63777A4066b75728B08396d6167H093
10064a78730I9244J8348j5861e1010r4157a0216k23241n0063A89564a72754L9134
10053a33620B92148A17586A8622g8919o5294A27382J23347e1913j2852m8183j7332
10042a30280D4356b76981b9194l9544D0759d9884j52506h1178m0000F7877b32289
10030h8359D6494K06092o8477j861B0651i6851r4359d1830k51284J6914J06672
$$ plain form
10109 -124076 11871 -267409 177511 -2781 -68097 106900 -142828 -259660 12127 216424
10099 216424 -139357 -116946 -506747 -12861 43119 105401 -54614 -65245 -282561 23066 135716
10088 135716 10706 258080 -21333 -148311 18961 -36015 -309858 -108996 -85902 57877 -838770
10076 273578 3986 8298 -235188 -128758 38180 -163777 14066 -275728 208396 -46167 8093
10064 -178730 99244 117592 101731 -51010 -145167 -10216 -233457 -283520 189564 -172754 -133620
10053 -133620 292148 117586 18622 -78919 -144213 127382 250729 -51913 -64765 -112948 -130280
10042 -130280 44356 -276981 -29194 -68738 40759 -49884 -202390 -81178 -121178 67877 -232289
10030 -88359 46494 252586 184109 182248 20651 -96851 -191210 -41830 -293114 -276200 -169528
10019a69528g4731l08115a20201j24939H5291c75372A05231A9391K37971i1691
10008I6794h1945j93962i6336A40042a2160j52782Q1256I5699a35318D9040i6075
9996B3028f9591j00846j72350P8197b8242I8410l77a42506q610k91931i1570B8338
9983c6250A05672b67332A8935i7734k0072B50639h8829A51570j2210i894l1724
9972d1618a3998H1197a94188P6963D8512c79257E4609j9593a74406c0855a011
9960F4530a34788l10362C5278j5086O9156A3687K844a49184J9529d8337r6303
9949a44640M098l57334e0022I9677d1707A86350c4065j43505e9879j08686l1620
9938b00185a2554j40858A54032b71723A14094e4075B36981B274h8792A2227J7130
$$ plain form
10019 -169528 -74731 -382846 -120201 -245140 85291 -375372 105231 19391 257362 -91691
10008 96794 -81945 -275907 -96336 140042 -12160 -164942 -83686 95699 -135318 49040 -96075
9996 23028 -69591 -170437 -342787 -264590 -28242 98410 98033 -142506 -151116 -443047 -91570 28338
9983 -36250 105672 -267332 18935 -97734 -117806 250639 -88829 151570 139360 -9894 -41618
9972 -41618 -13998 81197 -194188 -117225 48512 -379257 54609 35016 -174406 -30855 -1011
9960 64530 -134788 -445150 35278 20192 89348 13687 16531 -149184 -129655 -48337 -144640
9949 -144640 -140542 -497876 -50022 99677 -41707 186350 -34065 -177570 -59879 -168565 -200185
9938 -200185 -12554 -153412 154032 -271723 114094 -54075 236981 2274 -88792 12227 29357
9927B9357a09554N4330r3419r7367A21445b36158D2463R9214b52602k2867i2559
9915A63938b7750p5936j2006c6027B9474c12162B54143h730D6663e8751B92302
9903b98800k6179e0673n6203j18204A71071a4432k952l90324a14417j10123R7300
9892a27240F9742J68524q4997c66914I318J29917b30871R7757F7372g1366j72578
9881b43944B56754b3706j85591e6425o0038I1612N2001b00069C53825H6211C728
9869a26271j58925f3803p1599E9141Q0898l3931b05866i0462B661K33688a93643
9857b43439L6579m6025j4504j37471a27737c6995j14865A64789e5273l0114j00357
9846a85744K1339M613C5792a56935g4688j33545K867j42551a68503L7102E499
$$ plain form
9927 29357 -109554 -55224 -148643 -246010 121445 -236158 42463 141677 -252602 -275469 -92559
9915 163938 -27750 -103686 -115692 -36027 29474 -312162 254143 -8730 46663 -58751 292302
9903 -298800 -324979 -50673 -106876 -225080 171071 -14432 -17384 -407708 -114417 -224540 -127240
9892 -127240 69742 238266 153269 -366914 9318 139235 -230871 -133114 67372 -71366 -243944
9881 -243944 256754 -23706 -209297 -56425 -116463 91612 143613 -200069 353825 86211 3728
9869 -126271 -285196 -63803 -135402 59141 140039 106108 -205866 -90462 2661 236349 -193643
9857 -243439 -206860 -252885 -267389 -404860 -127737 -36995 -151860 164789 -55273 -85387 -185744
9846 -185744 -164405 -159792 35792 -156935 -74688 -208233 -205366 -347917 -168503 -131401 5499
9834a01932q5147d6538B44059O4852b74458B51198b2479j23585P0942k12418C4820
9822e3880K0650A31486a78743A38739n6766c31658a41966G6213P470m1236K606
9811D5053L1894a59176g6923C31458e134A12107m998a11991D0949h5504L4875
9800e0629I907a79996o4858e8991A45670a05495d2340j42659d4619k19687m6742
9789c11048H3943M3763d07159A66605A1937K3766a64488c4095A15023L0981b4645
9777b36593g329l91231H5407c22568a11416I1395J62356b4886o1892j03082n1524
9766b41384h2598A23156d48518P7858A36287b16659e4324A22267f7287F678a9519
9754a79301A65420J18659D3819a67875K303B57231F410a98127i6882A41662D7701
$$ plain form
9834 -101932 -187079 -46538 244059 308911 -274458 251198 -22479 -146064 -75122 -287540 34820
9822 -53880 -33230 131486 -178743 138739 81973 -331658 -141966 76213 83683 42447 45053
9811 45053 76947 -159176 -76923 331458 -5134 112107 107109 -111991 40949 -85504 -50629
9800 -50629 9907 -179996 -244854 -58991 145670 -105495 -42340 -184999 -44619 -264306 -311048
9789 -311048 83943 127706 -407159 166605 11937 35703 -164488 -34095 115023 146004 -24645
9777 -236593 -7329 -398560 85407 -322568 -111416 91395 253751 -24886 -86778 -189860 -241384
9766 -241384 -82598 123156 -448518 -370660 136287 -216659 -54324 122267 -67287 6678 -19519
9754 -179301 165420 284079 43819 -167875 -165572 257231 6410 -198127 -96882 141662 47701
9742G4703b75646A87629K0434b6264A4946b60833K5458C20789a92023J392a552
9730a25939l3223P8828A46073a75322N1445k97773e7131r9775H9089a99004a5878
9718D9788g1283q1652O5197E6361J03437g9867H266a2585A77290a42791A11539
9706a17625a2590j03740d0255A16860a05876E9458a1475A37384a00202I1350b3074
9694G9909K11899j22769d38136a04321A33506l9457k3481b14176F2183L3906K2456
9683A18545c79872C06007B2267A252L3728c2878l34405a03693M403L9393j42189
9672b02086M6430k2178I7112J05195a15295A16602i84k65040D6527J54062b35327
9660A07728a43841R726I1471G785R6312a68163k9644j52737A19709d3151j8513
$$ plain form
9742 74703 -275646 187629 208063 -26264 14946 -260833 -235375 320789 -192023 -190631 -1552
9730 -125939 -159162 -80334 146073 -175322 -123877 -421650 -57131 -156906 89089 -199004 -15878
9718 49788 -71283 -152935 -87738 56361 159798 -79867 8266 -12585 177290 -142791 111539
9706 -117625 -12590 -116330 -40255 116860 -105876 59458 -11475 137384 -100202 91350 -23074
9694 79909 291808 169039 -438136 -104321 133506 94049 70568 -214176 62183 96089 118545
9683 118545 -379872 306007 22267 1252 34980 -32878 -367283 -103693 -99290 -59897 -202086
9672 -202086 -155656 -177834 97112 202307 -115295 116602 -984 -266024 46527 200589 -235327
9660 107728 -143841 -134115 91471 7785 104097 -168163 -197807 -350544 119709 -43151 -61664
9649f1664H1276h2902L7282k85910h9641j13492B19280i2794E0718A4023J40467
9638A54490c85303A5791c94015c3760j67272A09824c96668C5741c62684J57503
9628b05181K418N5665A45628b30033K437C9337j8470N2142J1084A8239b24047
9616a57305q681A09619E492a00648j98712r2723M5713C01229c8448j34664n6987
9605b30099C4759e2664k7725a0409I4984a37436r8303R5684n8452b4350j50687
9594a75037d8622k20139A07807n2974J20654B6176a65804B73649g7894n3067B91965
9582h0456j15860e2844J2130j29945A10486h9449B10124p2631a47241f8023j00061
9571a68084j3825O7882B36444f160B73237D1199D517a14010j03590b7599n8165
$$ plain form
9649 -61664 81276 -82902 -45620 -331530 -89641 -203133 219280 -92794 50718 14023 154490
9638 154490 -385303 15791 -394015 -33760 -201032 109824 -396668 35741 -362684 -205181
9628 -205181 -202763 -147098 145628 -230033 -227596 39337 20867 73009 84093 18239 -224047
9616 -157305 -165986 109619 5492 -100648 -299360 -392083 -346370 301229 -38448 -173112 -230099
9605 -230099 34759 -52664 -80389 -10409 94984 -137436 -235739 -140055 -198507 -24350 -175037
9594 -175037 -48622 -268761 107807 54833 175487 26176 -165804 273649 -77894 -130961 291965
9582 -80456 -196316 -52844 -40714 -170659 110486 -89449 210124 137493 -147241 -68023 -168084
9571 -168084 -181909 -114027 236444 -6160 273237 41199 4517 -114010 -217600 -27599 -85764
9560h5764o0784C54392d67319d892q7911H3787b00969i1287C505b1951B86742
9548A53578D0045a73062H0364l3003a49924J6316D1677d13593D5143a20825B39485
9536F9098h0669b9688H5646j372K2301a46196d8074b711j61429M2725n4199Q0271
9524i5343Q791D3757c5551j05794M4744l8986b1104m4111j67514P9808l680n6146
9512b12747O579Q622A90668a30460J5386m3429j065j9616j33847F8725b54435
9500b02381l72j7212h7074B9955a32241k13462e4835r7860N1494B03763a00973
9488a9439j87658J00398F5212a22322h762A07402J5983J83873A36797a62152a1635
9476a69201c6766k5212A90384b50028D26002E0375c8478o5756k17456J4503G6111
$$ plain form
9560 -85764 -146548 354392 -467319 -4892 -92803 83787 -200969 -91287 3505 -21951 286742
9548 153578 40045 -173062 80364 47361 -149924 -133608 41677 -413593 45143 -120825 239485
9536 69098 -80669 -29688 85646 84274 106575 -146196 -48074 -2711 -164140 -121415 -175614 -95343
9524 -95343 -86552 43757 -35551 -141345 -96601 -135587 -21104 -65215 -232729 -152921 -156601 -212747
9512 -212747 -206168 -197546 190668 -130460 -115074 -158503 -159568 -179184 -313031 68725 -254435
9500 -202381 -202753 -219965 -87074 29955 -132241 -345703 -54835 -152695 -101201 203763 -100973
9488 -19439 -207097 -106699 65212 -122322 -8762 107402 123385 307258 136797 -162152 -11635
9476 -169201 -36766 -61978 190384 -250028 426002 50375 -38478 -104234 -321690 -307187 76111
9464a76131J4830A52605b1660m2529k01906O4438b1806j90789K8584K1622q9575
9453b51964R7830j29814N5726I7906g7566l5060K826j90321A83118b08448C5190
9441h6978j35469A1246h3651o927a9270k3182m5274p2335G149M7377c53262c1836
9428a2468j16718d8091k03978B1426i5585L5042A5906O627a51674j77124a20876
9416a64737G8437J60946j16539a05597C5663a40136O2906A11253f5537l00148
9406c65685B52861a83676A78403b7038f336C42598A41535e7518C05908a92905
9395c24917a33294k16177a23024a6011o4076b1823k49913j70553B3767h6964B7561
9383A0657a40844j11343C50465h987l06349a40286p6197j18563a2473r9082j68218
$$ plain form
9464 -176131 -161301 152605 -21660 -64189 -266095 -201657 -21806 -212595 -184011 -162389 -251964
9453 -251964 -154134 -283948 -228222 97906 -77566 -112626 -109800 -300121 183118 -208448 35190
9441 -86978 -222447 11246 -83651 -90578 -19270 -42452 -87726 -160061 7149 54526 -353262 -31836
9428 -12468 -129186 -48091 -252069 21426 -95585 -60543 15906 22533 -151674 -328798 -120876
9416 -164737 78437 239383 122844 -105597 35663 -140136 -77230 111253 -65537 -365685
9406 -365685 252861 -183676 178403 -27038 -6336 342598 141535 -57518 305908 -192905
9395 -324917 -133294 -349471 -123024 -16011 -80087 -21823 -271736 -442289 23767 -86964 27561
9383 10657 -140844 -252187 350465 -8987 -315336 -140286 -216483 -335046 -12473 -111555 -279773
9372b79773B22817i8257B4173c84416a47878A93531A8004b13323k15669c7278
9361a19374r7333B4923b33936B88421a56728A76033b44847l67887i9895L594b6793
9349A0831b5940l32894f5852B6367a0605L930n3070n26935A58326d00986J79156
9338b21830A24809b03561L7687a955k3252p9862K868j01158f9622B23813a28819
9326g9515l3403j30221a4939B28597P5161p1113c23168A04114g5763B13365m0271
9315A73094a22561b3930A54751l9966a15425k12134N9132d0929k92694A32513
9304C3420d51272J00427E6791g0416o9363I3151a87811K7879I2859K02982j35017
9293A60824b62631g5747j5379D8834R6830c4774q2774E4794F687b33812A39709
$$ plain form
9372 -279773 222817 -98257 24173 -384416 -147878 193531 18004 -213323 -428992 -37278
9361 -119374 -216707 24923 -233936 288421 -156728 176033 -244847 -612734 -99895 -96301 -26793
9349 10831 -25940 -358834 -65852 26367 -10605 -6675 -59745 -586680 158326 -400986 -221830
9338 -221830 124809 -203561 -165874 -1955 -25207 -105069 -102201 -203359 -69622 223813 -128819
9326 -79515 -112918 -243139 -14939 228597 303758 232645 -323168 104114 -75763 213365 173094
9315 173094 -122561 -23930 154751 114785 -115425 -327559 -268427 -40929 -333623 132513
9304 33420 -451272 -350845 56791 -70416 -139779 93151 -187811 -159932 92859 295841 160824
9293 160824 -262631 -75747 -91126 48834 145664 -34774 -117548 54794 6687 -233812 139709
9281a99465B5060e7695j59390H0660C6915e89495B6137c36652A62365J44613b29248
9269a49286p8930l0783A05254c4054H3981b84008a34378j4271b0375B99141b71125
9257C4199b25909H6041p315b3686I7187c2410H015J0868M0873h6173B5357J03674
9245A29031k3910a12281j65134I165b02358a673j20213k8028C7778c16163e9075
9233d6007A4228a15150L085e0820C6863c42160A96998a56063A94595b13234j50939
9222c64173g6889c1441A31637b54905a0175m3398k01251A74104q5951D0026A2762
9210I5959f6724H0382c01295p5628a05905m4637a7334p6689C0687b34119O9982
9199a64137A49428R3676A13001a08144B59045f9831j11284r3494J35116j95919
$$ plain form
9281 -199465 25060 -57695 -217085 80660 36915 -589495 26137 -336652 162365 306978 -229248
9269 -149286 -228216 -258999 105254 -34054 83981 -284008 -134378 -148649 -20375 299141 -271125
9257 34199 -225909 86041 78726 -23686 97187 -32410 8015 18883 59756 -86173 25357 129031
9245 129031 105121 -112281 -277415 9165 -202358 -1673 -121886 -149914 37778 -316163 -59075
9233 -46007 14228 -115150 -112065 -50820 36863 -342160 196998 -156063 194595 -213234 -364173
9222 -364173 -76889 -31441 131637 -254905 -10175 -53573 -254824 174104 88153 40026 12762
9210 95959 -66724 80382 -301295 -376923 -105905 -150542 -17334 -94023 30687 -234119 -164137
9199 -164137 149428 243104 113001 -108144 259045 -69831 -181115 -274609 -139493 -335412
9189c35412B15407j04331n165h7829G2244e7777j87808b3946B34314G1057c1887
9177a50206m9135g8843A65967K4384a32345A06332f6174j73881m7823B9181Q6085
9166A15266n7416a81552B06930b42436C4360a2410k77826g061l5812m34438h9935
9154g8764B16889A1168a49537B67191a2620k08936H1996i3098A27275n2351A2657
9142a32837d5839B8984j2375J03870a11855L4313r956F7292J36796p2388a13470
9130B66856B9033c31815h9649k63501B58405b57838D4847b5986k490I9794c35589
9118B00102F4931a41924I5943c0492q3050c4360H7785o207J2058b70961A96820
9106G0129A978b72518L9567A67984E8845g9735B5773b544p8533j24364O5085d0260
$$ plain form
9189 -335412 215407 111076 105911 -87829 72244 -57777 -245585 -23946 234314 71057 -31887
9177 -150206 -199341 -78843 165967 190351 -132345 106332 -66174 -240055 -287878 29181 115266
9166 115266 57850 -181552 206930 -242436 34360 -12410 -290236 -7061 -42873 -477311 -89935
9154 -78764 216889 11168 -149537 267191 -12620 -221556 81996 -93098 127275 74924 12657
9142 -132837 -45839 28984 16609 120479 -111855 -77542 -87498 67292 204088 131700 -113470
9130 266856 29033 -331815 -89649 -353150 258405 -257838 44847 -25986 -28476 99794 -335589
9118 200102 64931 -141924 95943 -30492 -113542 -34360 87785 81578 93636 -270961 196820
9106 70129 1978 -272518 -232951 167984 58845 -79735 25773 -2544 -81077 -205441 -140356 -40260
9093b86549A44352f3380n17019J70925L7131a63372q9306a01074j46684f1137
9082a78158a0991G8483a12251I4921P7704g2642H2472M8515a05755j00278n4750
9071b60783C14678h1298b8572k22530A36729b8730I5931A3253L19464h2288A58909
9059A8699d2826H2406B2667a4886c380k77720R3306r9062b0952j18769E0360A3629
9046a69883N6822j74523B40531D9779d14573C1391h8988j4391B5724I283c39510
9034c18053F9409a01126D5740b83815C285J72967a69827a0461l6245k83821i7050
9022b75402a19533k8131O9668c4965o2077m4270M3047a364A66140b50963n2735
9011c03698l5699a16359A26330b94554B09189e4288o4646A60347a3334I0125b39174
$$ plain form
9093 -286549 144352 -63380 -580399 -409474 -372343 -163372 -252678 -101074 -247758 -61137
9082 -178158 -10991 78483 -112251 94921 172625 -72642 82472 130987 -105755 -206033 -260783
9071 -260783 314678 -81298 -28572 -251102 136729 -28730 95931 13253 332717 -82288 158909
9059 18699 -42826 82406 22667 -14886 -3380 -281100 -187794 -286856 -20952 -139721 50360 13629
9046 -169883 -113061 -287584 240531 49779 -414573 31391 -88988 -103379 25724 9283 -339510
9034 -318053 69409 -101126 45740 -283815 3285 176252 -169827 -10461 -46706 -330527 -97050
9022 -275402 -119533 -147664 -77996 -34965 -97042 -141312 -98265 -1364 166140 -250963 -303698
9011 -303698 -339397 -116359 126330 -294554 209189 -54288 -118934 160347 -13334 90125 -239174
8999b20014C9220O2793b34303M6765E4880c9778l43354d9295k8696A0792c78102
8987C34426h8061q9672g5753B07057a69996P6800l51836J90744B06277L4536a56854
8975c262m9310k9139j05472p3849A91046m3584c2529o2061n0259b2091m94460
8964e16551b04556d8176D4513a20739k49035a76776B20457D0709a50498j73110
8954c23608e3377j08878D679L44687m2044B0804J13884a18646J4070A0765a76896
8942A34062E9385J93026C2094b00515B35121b00908A24645L06578n072a01875
8931B8033d37960B10955r1398a03493B60560P5970Q04150Q59978L542472Q400280
8921A3943410E382909A701198E74749R2296A96400k0794j8790b49204D46799A90340
$$ plain form
8999 -220014 39220 102013 -234303 -187538 54880 -39778 -383132 -49295 -77991 10792 -378102
8987 334426 -88061 -177733 -75753 207057 -169996 -93196 -445032 -254288 206277 240813 -156854
8975 -3262 -52572 -81711 -187183 -261032 191046 147462 -32529 -94590 -144849 -22091 -516551
8964 -516551 -204556 -48176 44513 -120739 -369774 -176776 220457 40709 -150498 -323608
8954 -323608 -53377 -162255 4679 349366 307322 20804 134688 -118646 -104576 10765 -176896
8942 134062 59385 252411 32094 -200515 235121 -200908 124645 431223 426151 -101875
8931 28033 -437960 210955 119557 -103493 260560 336530 1140680 2000658 5543130 13943410
8921 13943410 5382909 1701198 574749 667045 196400 175606 156816 -249204 446799 190340
8910g7152D54891A91076M9936a08469E3578b3977B64401a92963h714A86944b71591
8898A57505c61549F9466J25166b48862c356o3254l2872A75239a28128j5048G5545
8886c79749A22340a07671N0909j39996j54256d8402j49901e8633m0290m1082E53458
8874c58216A47017b95754j1479J20704A04209e07660D8556J8169R5117l0635b14581
8862g2280m5527c3822a6754m8497A34566b50107F0837b48679L9049c8055l3249
$$ plain form
8910 -77152 454891 191076 241012 -108469 53578 -23977 264401 -192963 -8714 186944 -271591
8898 157505 -361549 69466 194632 -248862 -3356 -66610 -99482 175239 -128128 -143176 75545
8886 -379749 122340 -107671 -56762 -196758 -351014 -48402 -198303 -58633 -98923 -140005 553458
8874 -358216 147017 -295754 -307233 -186529 104209 -507660 48556 66725 161842 131207 -214581
8862 -72280 -117807 -33822 -16754 -65251 134566 -250107 60837 -248679 -209630 -38055 -71304
$$ [...]
##END NTUPLES=NMR SPECTRUM
##END=
