
##TITLE=AC1302_PERAH12114_6608382_PZ89wDSsjw
##JCAMPDX= 6.0         $$ Bruker NMR JCAMP-DX V2.0
##DATA TYPE= NMR SPECTRUM
##DATA CLASS= NTUPLES
##ORIGIN= BRUKER
##OWNER= Administrator
$$ 1.72 TOPSPIN		Version 2.1
$$ 2012-08-01 15:04:12.281 -0500  Administrator@TOPSPIN
$$ Compression mode = diff/dup
##.OBSERVE FREQUENCY= 400.02188249412
##.OBSERVE NUCLEUS= ^1H
##.ACQUISITION MODE= SIMULTANEOUS (DQD)
##.ACQUISITION SCHEME= undefined
##.AVERAGES= 32
##.DIGITISER RES= 22
##SPECTROMETER/DATA SYSTEM= spect
##.PULSE SEQUENCE= noesygpps1d.comp
##.SOLVENT NAME= COFFEE_meoh
##.SHIFT REFERENCE= INTERNAL, COFFEE_meoh, 1, 14.96061
##AUDIT TRAIL= $$ (NUMBER, WHEN, WHO, WHERE, PROCESS, VERSION, WHAT)
$$ ##TITLE= Audit trail, TOPSPIN		Version 2.1
$$ ##JCAMPDX= 5.01
$$ ##ORIGIN= Bruker BioSpin GmbH
$$ ##OWNER= Administrator
$$ $$ C:\Bruker\TOPSPIN/data/COFFEE/nmr/AC1302_PERAH12114_6608382_PZ89wDSsjw/22/pdata/1/auditp.txt
$$ ##AUDIT TRAIL=  $$ (NUMBER, WHEN, WHO, WHERE, PROCESS, VERSION, WHAT)
(   1,<2012-08-01 14:57:48.000 -0500>,<Administrator>,<TOPSPIN>,<go>,<TOPSPIN 2.1>,
      <acquisition in progress>)
(   2,<2012-08-01 15:04:07.406 -0500>,<Administrator>,<TOPSPIN>,<proc1d>,<TOPSPIN 2.1>,
      <Start of raw data processing
       efp LB = 0.3 FT_mod = 6 PKNL = 1 PHC0 = 0 PHC1 = 0 SI = 128K 
       data hash MD5: 128K
       64 1F B2 7F F4 98 E2 A6 39 61 7E 75 77 FD 08 FE>)
(   3,<2012-08-01 15:04:08.875 -0500>,<Administrator>,<TOPSPIN>,<proc1d>,<TOPSPIN 2.1>,
      <pk PHC0 = 0.1428223 PHC1 = 0 
       data hash MD5: 128K
       08 A5 21 06 CD 8C 98 5D FC 53 0F 9F 6B 47 A7 96>)
(   4,<2012-08-01 15:04:10.125 -0500>,<Administrator>,<TOPSPIN>,<proc1d>,<TOPSPIN 2.1>,
      <abs ABSG = 1 
       data hash MD5: 128K
       C0 1F 7F C8 14 F9 9B 2C ED 24 DB 3D D0 E7 AC 17>)
(   5,<2012-08-01 15:04:10.531 -0500>,<Administrator>,<TOPSPIN>,<proc1d>,<TOPSPIN 2.1>,
      <abs ABSG = 2 
       data hash MD5: 128K
       05 05 30 92 92 D8 4E 6B 12 BD AB 3D AD 20 80 35>)
(   6,<2012-08-01 15:04:10.953 -0500>,<Administrator>,<TOPSPIN>,<proc1d>,<TOPSPIN 2.1>,
      <abs ABSG = 3 
       data hash MD5: 128K
       A5 A7 4F D4 8E 2B 9B 98 2A FC 27 AE 29 43 4A 62>)
(   7,<2012-08-01 15:04:11.375 -0500>,<Administrator>,<TOPSPIN>,<proc1d>,<TOPSPIN 2.1>,
      <abs ABSG = 4 
       data hash MD5: 128K
       AC CA 1C 00 6A 08 1D 81 A9 B1 D6 63 75 19 66 7D>)
(   8,<2012-08-01 15:04:11.796 -0500>,<Administrator>,<TOPSPIN>,<proc1d>,<TOPSPIN 2.1>,
      <abs ABSG = 5 
       data hash MD5: 128K
       FD DD B6 AA 03 A4 44 85 F9 24 03 E9 00 20 97 56>)
$$ ##END=
$$ 
$$ $$ hash MD5
$$ $$ 95 47 FB AF 39 A7 B1 53 A2 B4 9C 40 BE 50 7F 99
##$RELAX= 
##$RELAX= 
##$RELAX= 
##$RELAX= 
##$RELAX= 
##$RELAX= 
##$RELAX= 
##$RELAX= 
$$ Bruker specific parameters
$$ --------------------------
##$DU= <C:\Bruker\TOPSPIN>
##$EXPNO= 22
##$NAME= <AC1302_PERAH12114_6608382_PZ89wDSsjw>
##$PROCNO= 1
##$TYPE= <nmr>
##$USER= <COFFEE>
##$ACQT0= -6.4851347046831
##$AMP= (0..31)
$$ [...]
150 150 150 150 150 150 150 150
##$TP07= 0
##$TPNAME0= <>
##$TPNAME1= <>
##$TPNAME2= <>
##$TPNAME3= <>
##$TPNAME4= <>
##$TPNAME5= <>
##$TPNAME6= <>
##$TPNAME7= <>
##$TPOAL= (0..7)
0.5 0.5 0.5 0.5 0.5 0.5 0.5 0.5
##$TPOFFS= (0..7)
0 0 0 0 0 0 0 0
##$TUNHIN= 0
##$TUNHOUT= 0
##$TUNXOUT= 0
##$USERA1= <user>
##$USERA2= <user>
##$USERA3= <user>
##$USERA4= <user>
##$USERA5= <user>
##$V9= 5
##$VALIST= <valist>
##$VCLIST= <CCCCCCCCCCCCCCC>
##$VD= 0
##$VDLIST= <DDDDDDDDDDDDDDD>
##$VPLIST= <PPPPPPPPPPPPPPP>
##$VTLIST= <TTTTTTTTTTTTTTT>
##$WBST= 1024
##$WBSW= 4
##$XGAIN= (0..3)
0 0 0 0
##$XL= 0
##$YL= 0
##$YMAX_a= 0
##$YMIN_a= 0
##$ZGOPTNS= <>
##$ZL1= 120
##$ZL2= 120
##$ZL3= 120
##$ZL4= 120
##$ABSF1= 14.96061
##$ABSF2= -5.597571
##$ABSG= 5
##$ABSL= 3
##$ALPHA= 0
##$AQORDER= 0
##$ASSFAC= 0
##$ASSFACI= 0
##$ASSFACX= 0
##$ASSWID= 0
##$AUNMP= <proc_prof1d_extract.lims>
##$AXLEFT= 0
##$AXNAME= <>
##$AXNUC= <1H>
##$AXRIGHT= 0
##$AXTYPE= 0
##$AXUNIT= <>
##$AZFE= 0.1
##$AZFW= 0.1
##$BCFW= 0
##$BC_mod= 0
##$BYTORDP= 0
##$COROFFS= 0
##$CY= 15
##$DATMOD= 1
##$DC= 0
##$DFILT= <>
##$DTYPP= 0
##$F1P= 0
##$F2P= 0
##$FCOR= 0.5
##$FTSIZE= 131072
##$FT_mod= 6
##$GAMMA= 0
##$GB= 0
##$INTBC= 1
##$INTSCL= 1
##$ISEN= 128
##$LB= 0.3
##$LEV0= 0
##$LPBIN= 0
##$MAXI= 10000
##$MC2= 0
##$MEAN= 0
##$ME_mod= 0
##$MI= 0
##$NCOEF= 0
##$NC_proc= -3
##$NLEV= 6
##$NOISF1= 0
##$NOISF2= 0
##$NSP= 0
##$NTH_PI= 0
##$NZP= 0
##$OFFSET= 14.96061
##$PC= 1
##$PHC0= 0.1428223
##$PHC1= 0
##$PH_mod= 1
##$PKNL= yes
##$PPARMOD= 0
##$PPDIAG= 0
##$PPIPTYP= 0
##$PPMPNUM= 2147483647
##$PPRESOL= 1
##$PSCAL= 4
##$PSIGN= 0
##$PYNMP= <proc.py>
##$REVERSE= no
##$SF= 400.020009792118
##$SI= 131072
##$SIGF1= 0
##$SIGF2= 0
##$SINO= 400
##$SIOLD= 131072
##$SPECTYP= <>
##$SREGLST= <1H.CDCl3>
##$SSB= 0
##$STSI= 131072
##$STSR= 0
##$SW_p= 8223.68421052631
##$SYMM= 0
##$S_DEV= 0
##$TDeff= 65536
##$TDoff= 0
##$TI= <>
##$TILT= no
##$TM1= 0
##$TM2= 0
##$TOPLEV= 0
##$USERP1= <user>
##$USERP2= <user>
##$USERP3= <user>
##$USERP4= <user>
##$USERP5= <user>
##$WDW= 1
##$XDIM= 131072
##$YMAX_p= 401061491
##$YMIN_p= -18155
##$CURPLOT= <Network HP LaserJet P1505>
##$CURPRIN= <$Network HP LaserJet P1505>
##$DFORMAT= <normdp>
##$LAYOUT= <+/1D_H.xwp>
##$LFORMAT= <normlp>
##$PFORMAT= <normpl>
##$SURQMSG= 1
$$ End of Bruker specific parameters
$$ ---------------------------------
##NTUPLES= NMR SPECTRUM
##VAR_NAME=  FREQUENCY,     SPECTRUM/REAL,   SPECTRUM/IMAG
##SYMBOL=    X,             R,               I
##VAR_TYPE=  INDEPENDENT,   DEPENDENT,       DEPENDENT
##VAR_FORM=  AFFN,          ASDF,            ASDF
##VAR_DIM=   131072,        131072,          131072
##UNITS=     HZ,            ARBITRARY UNITS, ARBITRARY UNITS
##FACTOR=    0.0627417313425164, 1,          1
##FIRST=     8223.62146879497, 4102,         -65503
##LAST=      0,             5644,            -65095
##MIN=       0,             -18155,          0
##MAX=       8223.62146879497, 401061491,    0
$$ Real data points
##PAGE= N=1
##DATA TABLE= (X++(R..R)), XYDATA
$$ [...]
63947A090743Q9349J02024J16566J31920J47094J61035J72984J83167J92412K00842
$$ 1090743 1180092 1282116 1398682 1530602 1677696 1838731 2011715 2194882 2387294 2588136
63937B588136K07557K11637K12681K10093K02699J89676J71396J48900J23030
$$ 2588136 2795693 3007330 3220011 3430104 3632803 3822479 3993875 4142775 4265805
63928D265805R4550O4532L3919K943k8383n9385q9003j16737j42554j65762j84727
$$ 4265805 4360355 4424887 4458806 4461749 4433366 4373981 4284978 4168241 4025687 3859925 3675198
63917C675198j98070k05713k08541k07486k03220j96320j87275j76448j64245
$$ 3675198 3477128 3271415 3062874 2855388 2652168 2455848 2268573 2092125 1927880
63908A927880j51196j37658j23768j09923r7042q5948p6532o7939n9523n1351
$$ 1927880 1776684 1639026 1515258 1405335 1308293 1222345 1145813 1077874 1018351 967000
63898I67000m3836l7265l1815k7605k4435k1666j8728j5787j3657j2903j3164
$$ 967000 923164 885899 854084 826479 802044 780378 761650 745863 732206 719303 706139
63887G06139j3516j3381j2799j1914j0612q951p521o864o571n558l280k82K718
$$ 706139 692623 679242 666443 654529 643917 634966 627445 620581 614010 608452 605172 604890 607608
63874F07608N717R081J2632J5677J7819J9316K0659K2169K3971K5939K7552K8131
$$ 607608 613325 622406 635038 650715 668534 687850 708509 730678 754649 780588 808140 836271
63862H36271K7463K6011K4478K3238K2228K1068J9265J6493J2919R156N733K612
$$ 836271 863734 889745 914223 937461 959689 980757 1000022 1016515 1029434 1038590 1044323 1046935
63850A046935p20m710r244j3646j7162j9603k1444k3279k5246k7123k8798l0337
$$ 1046935 1046215 1041505 1032261 1018615 1001453 981850 960406 937127 911881 884758 855960 825623
63838H25623l1665l2526l2852l2858l2563l1606k9804k7746k6347k5701k4797
$$ 825623 793958 761432 728580 695722 663159 631553 601749 574003 547656 521955 497158
63827D97158k2680j9731j7391j6478j6231j5324j3541j1841j0861j0082q781p206
$$ 497158 474478 454747 437356 420878 404647 389323 375782 363941 353080 342998 334217 327011
63815C27011o166n871n778n458n031m735m614m694m939n040m629l826l128k693
$$ 327011 320845 314974 309196 303738 298707 293972 289358 284664 279725 274685 270056 266230 263102 260409
63801B60409k215j588j202j360j868k374k765k983k886k515k142j843j403r05
$$ 260409 258194 256606 255404 254044 252176 249802 247037 244054 241168 238653 236511 234668 233265 232360
63787B32360q91j669k764l421l305k435r58O51J542J242K04p60j329j551j348
$$ 232360 231469 229800 227036 223615 220310 217875 216917 217568 219110 220352 220556 219796 218467 216916 215568
63772B15568o44J93O82P69O05P7q52j594j475p00j60k30m35l49j72k33m54n36
$$ 215568 214924 215117 215799 216568 217173 217250 216398 214804 213329 212629 212469 212239 211804 211455 211283 211050 210596 210060
63754B10060k78L79J296K012K068J524Q62M47K85K51J80q2k93J74J409K437K380
$$ 210060 209782 210161 211457 213469 215537 217061 217923 218370 218655 218906 219086 219004 218711 218885 220294 222731 225111
63737B25111J798J833K252J718J61o14O85L023M481M528L908L142K369K051K657
$$ 225111 226909 228742 230994 232712 232873 232259 232944 235967 240448 244976 248884 252026 254395 256446 259103
63722B59103L720M310M303M335M605M614M134L609L384L221K770K004R79l27j739
$$ 259103 262823 267133 271436 275771 280376 284990 289124 292733 296117 299338 302108 304112 305091 304764 303025
63707C03025k819l302l369l432l761m148l910k472l58R19M89o99j026j50R42J611
$$ 303025 300206 296904 293535 290103 286342 282194 278284 275812 275454 276373 276862 276163 275137 274987 275929 277540
63691B77540K184K914L370L286L116L304L644L816L890L825L127J603J8o56l37
$$ 277540 279724 282638 286008 289294 292410 295714 299358 303174 307064 310889 314016 315619 315637 314981 314644
63676C14644K89P22R08Q53N56K49K29M35N42M78N74J092J849K324K044R80m18
$$ 314644 314933 315655 316563 317416 317972 318221 318450 318885 319427 319905 320479 321571 323420 325744 327788 328768 328350
63659C28350j597k398l058l795m559n128n209m524l233k175k118k771l140k941
$$ 328350 326753 324355 321297 317502 312943 307815 302606 298082 294849 292674 290556 287785 284645 281704
63645B81704k841l023k506o16J594K448J774R86J137J851K325K555L108M140N078
$$ 281704 278863 275840 273334 272718 274312 276760 278534 279520 280657 282508 284833 287388 290496 294636 299714
63630B99714N299M937M876N700O773O864N903N428O751R247J1246J2147J2732
$$ 299714 305013 309950 314826 320526 327299 334163 340066 345494 352245 361492 372738 384885 397617
63617C97617J3569J4258J4350J4179J4478J5795J8381K1919K5291K7343K8250
$$ 397617 411186 425444 439794 453973 468451 484246 502627 524546 549837 577180 605430
63606F05430K9310L1159L2866L3165L1828K9303K5745K1066J5532R679L924j287
$$ 605430 634740 665899 698765 731930 763758 793061 818806 839872 855404 865083 869007 867720
63594H67720n253p492q211q031p576p524q504j0429j2452j4150j6280j9682k3743
$$ 867720 862467 854975 846764 838733 831157 823633 815129 804700 792248 778098 761818 742136 718393
63581G18393k6778k7668k6615k4395k1689j8979j6482j4113j1891j0181q988p437
$$ 718393 691615 663947 637332 612937 591248 572269 555787 541674 529783 519602 510614 503177
63569E03177m800j762K61J057J822L301M761N315N361O034P746R928J1783J2854
$$ 503177 498377 496615 496876 497933 499755 503056 507817 513132 518493 524527 532273 542201 553984 566838
63555E66838J3135J3190J3891J5616J7833J9863K1764K4182K7484L1457L5638
$$ 566838 579973 593163 607054 622670 640503 660366 682130 706312 733796 765253 800891
63544H00891L9573M2744M4511M4130M0797L3980K4029J2363R67q309j4161j6326
$$ 800891 840464 883208 927719 971849 1012646 1046626 1070655 1083018 1083985 1075676 1061515 1045189
63532A045189j5917j4819j4158j3584j2307j0543r461j0087j2771j7398k3340
$$ 1045189 1029272 1014453 1000295 986711 974404 963861 954400 944313 931542 914144 890804
63521H90804k9192l3331l5149l5449l5438l5513l5127l3594l0793k7200k3500
$$ 890804 861612 828281 793132 757683 722245 686732 651605 618011 587218 560018 536518
63510E36518k0202j7651j6072j5357j4790j3455j1064q212n713m077l580m158
$$ 536518 516316 498665 482593 467236 452446 438991 427927 419715 414002 409925 406345 402187
63498D02187m927m606l086j910k416l886m498l669k300r84N75K292L223K948K250
$$ 402187 397260 392654 389568 387658 385242 381356 376858 373189 370889 369905 370480 372772 375995 378943 381193
63483C81193J868J564J141J264K297L230L003K211K311L391M107L640K517J325
$$ 381193 383061 384625 385766 387030 389327 392557 395560 397771 400082 403473 407580 411220 413737 415062
63469D15062r5j789l081l465l397l601m062m338m448m799n415n790n495m599l418
$$ 415062 414967 413178 410097 406632 403235 399634 395572 391234 386786 381987 376572 370782 365287 360688 357270
63454C57270k127p73M95J356J634J678K163L384M926O260P380Q487R385R734R787
$$ 357270 355143 354370 354865 356221 357855 359533 361696 365080 370006 376266 383646 392133 401518 411252 421039
63439D21039J0253J1536J3646J6703K0653K4493K6947K8226L0017L2937L5004
$$ 421039 431292 442828 456474 473177 493830 518323 545270 573496 603513 636450 671454
63428F71454L3654K8688K2136J5746R919M998K077J982M243P691J1495J5321J9040
$$ 671454 705108 733796 755932 771678 781597 786595 788672 790654 794897 802588 814083 829404 848444
63415H48444K2783K6780L0730L3623L4575L3525L0734K6082J9392J1382L669k316
$$ 848444 871227 898007 928737 962360 996935 1030460 1061194 1087276 1106668 1118050 1121719 1119403
63403A119403o265q814j0662j2029j2889j3537j4642j6575j9022k1492k4007k6883
$$ 1119403 1113138 1104324 1093662 1081633 1068744 1055207 1040565 1023990 1004968 983476 959469 932586
63391I32586k9959l2590l4361l5212l4882l2984k9879k6823k4740k3352k1811
$$ 932586 902627 870037 835676 800464 765582 732598 702719 675896 651156 627804 605993
63380F05993j9689j6892j3337r365n940l678k016j75J506K197K322L444O135R103
$$ 605993 586304 569412 556075 546710 540770 537092 535076 534901 536407 538604 540926 544370 550505 559608
63366E59608J0922J1858J3239J5657J8597K1482K4277K6940K9020L0139L0708
$$ 559608 570530 582388 595627 611284 629881 651363 675640 702580 731600 761739 792447
63355G92447L1823L4226L7466M0105M0820L9164L5398K9991K3533J6763J0146
$$ 792447 824270 858496 895962 936067 976887 1016051 1051449 1081440 1104973 1121736 1131882
63344A131882L688k470p574j0950j2861j4034j4579j4308j3985j5077j7991k1544
$$ 1131882 1135570 1133100 1125526 1114576 1101715 1087681 1073102 1058794 1044809 1029732 1011741 990197
63332I90197k4579k7135k9481l1071l1323l0656k9797k8624k6621k3989k1278
$$ 990197 965618 938483 909002 877931 846608 815952 786155 757531 730910 706921 685643
63321F85643j8266j4286r511n000j590L59K66k515p619j3553j8807k2454k3831
$$ 685643 667377 653091 643580 638580 636990 637349 637615 635100 627481 613928 595121 572667 548836
63308E48836k2687j9886j6942j4523j2163r739q227q321r138r123p781n879m303
$$ 548836 526149 506263 489321 474798 462635 452896 444669 436348 427210 418087 410306 404427 400124
63295D00124l341k843k515k133j839k005k567k969k985l086l520l620k733j418
$$ 400124 396783 393940 391425 389292 387453 385448 382881 379912 376927 373841 370321 366701 363968 362550
63281C62550q46j262j788j740j372j185j209j189j019p01k36K41M49K75j15n27
$$ 362550 361704 360442 358654 356914 355542 354357 353148 351959 350940 350239 350003 350244 350693 350968 350853 350326
63265C50326q30p69k9J287K489K834K238J342R26J270J983K451K466K409K805
$$ 350326 349496 348727 348698 349985 352474 355308 357546 358888 359814 361084 363067 365518 367984 370393 373198
63250C73198L763M920N817O282O496O777P190P506P682Q241R734J1844J3569J4510
$$ 373198 376961 381881 387698 393980 400476 407253 414443 421949 429631 437872 447606 459450 473019 487529
63236D87529J5387J6913J8657J9615J9587J9362J9703K0681K1892K2866K3284
$$ 487529 502916 519829 538486 558101 577688 597050 616753 637434 659326 682192 705476
63225G05476K3215K3012K2769K2090K0857J9772J9560J9930K0081J9954K0055
$$ 705476 728691 751703 774472 796562 817419 837191 856751 876681 896762 916716 936771
63214I36771K0166J9275J6909J3534R403M160j913p385j1296j4532j8521k3085
$$ 936771 956937 976212 993121 1006655 1016058 1020218 1018305 1010920 999624 985092 966571 943486
63202I43486k6644k8348k8873k9068k8726k7152k4363k1244j8651j6618j4304
$$ 943486 916842 888494 859621 830553 801827 774675 750312 729068 710417 693799 679495
63191F79495j0782n948p35L721O955R182J0740J1851J2746J3633J4558J5621J7134
$$ 679495 668713 662765 662030 665751 672706 681888 692628 704479 717225 730858 745416 761037 778171
63178G78171J9161K0973K1525K0607J9150J8165J7702J7092J5967J4654J3513
$$ 778171 797332 818305 839830 860437 879587 897752 915454 932546 948513 963167 976680
63167I76680J2218R999O559K492j511n617j0528j6163k1346k5077k7633k9895
$$ 976680 988898 998897 1005456 1007948 1006437 1000820 990292 974129 952783 927706 900073 870178
63155H70178l2026l3495l4089l4101l3527l1958k9439k6695k4204k1691j8904
$$ 870178 838152 804657 770568 736467 702940 670982 641543 614848 590644 568953 550049
63144E50049j6267j4262j2685j1090r675q933q659p958o309m111k141q67l30k35
$$ 550049 533782 519520 506835 495745 486070 477137 468478 460520 454211 450100 447959 447092 446762 446527
63130D46527j47J20K61N3K0R06K452L396L051K198J938K273K535K684L229M026
$$ 446527 446380 446500 446761 446814 446834 447740 450192 453588 456639 458837 460775 463048 465583 468267 471496 475522
63114D75522M248L724L367L813M458M411L798L380L299L030K420J915J740J599
$$ 475522 479770 483494 486861 490674 495132 499543 503341 506721 510020 513050 515470 517385 519125 520724
63100E20724J380J367J454R14m60j481p54J423L146L089J934J292J691K204J911
$$ 520724 522104 523471 524925 525839 525379 523898 523144 524567 527713 530802 532736 534028 535719 537923 539834
63085E39834J032M16M17O56Q90J533L046M958N986N405M101L854N414P665R012
$$ 539834 540866 541282 541699 542355 543245 544778 547824 552782 558768 564173 568274 572128 577542 585207 594219
63070E94219R272R622J0762J2019J2659J3208J4600J6577J8087J9049K0445K2444
$$ 594219 603491 613113 623875 635894 648553 661761 676361 692938 711025 730074 750519 772963
63058G72963K3953K4638K6061K9542L4026L7553M0189M3623M8067N1518N2677
$$ 772963 796916 821554 847615 877157 911183 948736 988925 1032548 1080615 1132133 1184810
63047A184810N2811N3764N5425N6371N6161N5658N5517N5534N5370N5031N4621
$$ 1184810 1237621 1291385 1346810 1403181 1459342 1515000 1570517 1626051 1681421 1736452 1791073
63036A791073N4197N3814N3295N2189N0330M7960M4650L8874K9655J8270P102
$$ 1791073 1845270 1899084 1952379 2004568 2054898 2102858 2147508 2186382 2216037 2234307 2241409
63025B241409l104j3573k5062l6424m6170n4217o1161o6682o9762p0142o8609
$$ 2241409 2238305 2224732 2199670 2163246 2117076 2062859 2001698 1935016 1865254 1795112 1726503
63014A726503o5914o2144n7182n1081m3816l5330k6139j7559j0762n644r34M464
$$ 1726503 1660589 1598445 1541263 1490182 1446366 1411036 1384897 1367338 1356576 1350932 1349998 1354462
63002A354462J0510J6424K1673K6107K9449L1368L2206L2922L3877L4312L3599
$$ 1354462 1364972 1381396 1403069 1429176 1458625 1489993 1522199 1555121 1588998 1623310 1656909
62991A656909L2397L1748L1584L1024K9833K8332K5986K1576J5095Q151J792m871
$$ 1656909 1689306 1721054 1752638 1783662 1813495 1841827 1867813 1889389 1904484 1912635 1914427 1909556
62979A909556j2942k1756k9777l6848m4116n1961n9223o4524o7388o8013o6873
$$ 1909556 1896614 1874858 1845081 1808233 1764117 1712156 1652933 1588409 1521021 1453008 1386135
62968A386135o4709o2137n9035n4952n0214m5833m2110l8194l3494k8771k5289
$$ 1386135 1321426 1259289 1200254 1145302 1095088 1049255 1007145 968951 935457 906686 881397
62957H81397k3389k2453k1837k1191k0216j8806j7379j6541j6304j6037j5249
$$ 881397 858008 835555 813718 792527 772311 753505 736126 719585 703281 687244 671995
62946F71995j4156j3366j3188j3326j3267j2872j2502j2390j2091j0936r036p342
$$ 671995 657839 644473 631285 617959 604692 591820 579318 566928 554837 543901 534865 527523
62934E27523o555o437o407o211n712m605l002j796j674k045j800r17m18p77j393
$$ 527523 520968 514531 508124 501913 496201 491596 488594 486798 485124 483079 481279 480362 479944 479167 477774
62919D77774j737j996k246j944r29j15l54j266j918k138k281k281j902j614k086
$$ 477774 476037 474041 471795 469851 468922 468807 468453 467187 465269 463131 460850 458569 456667 455053 452967
62904D52967l003l423l234l131l127k436j093l46q54j587j387n31J08N68J322
$$ 452967 449964 446541 443307 440176 437049 434613 433520 433174 432320 430733 429346 428815 428923 429491 430813
62889D30813K060K174J952J996J864O35j245k142j441k81K88N99J235J710J253
$$ 430813 432873 435047 436999 438995 440859 441494 440249 438107 436666 436385 436673 437272 438507 440217 441470
62874D41470K26j73O28J967K619J769l28k310k769j686l73K27N12J147J819J820
$$ 441470 441696 441523 442151 444118 446737 448506 448178 445868 443099 441413 441040 441267 441779 442926 444745 446565
62858D46565J246P40M24k9m65l12M85J263J478J178P57P42J658L408M871M848
$$ 446565 447811 448551 448975 448946 448481 448169 448654 449917 451395 452573 453330 454072 455730 459138 464009 468857
62842D68857L386J538o5j509k576k554j497o29q15j330r69K10J103J123O87K84
$$ 468857 472243 473781 473716 472207 469631 467077 465580 464951 464136 462806 461837 462047 463150 464273 464960 465244
62826D65244q5l77j37R69K611M023M639M447L898L535L521L530L179K509J850
$$ 465244 465159 464782 464645 465614 468225 472248 476887 481334 485232 488767 492288 495818 498997 501506 503356
62811E03356J387J123J228J933K993L733L853L969M933O772Q564R384R144Q550
$$ 503356 504743 505866 507094 509027 512020 515753 519606 523575 528508 535280 543844 553228 562372 570922
62797E70922Q537R741J2110J4793J6615J7107J7053J7758J9784K2681K5884K9436
$$ 570922 579459 589200 601310 616103 632718 649825 666878 684636 704420 727101 752985 782421
62785G82421L3640L8473M3679M9159N4779O0110O4855O9427P4513P9915Q4514
$$ 782421 816061 854534 898213 947372 1002151 1062261 1127116 1196543 1271056 1350971 1435485
62774A435485Q7515Q9104Q9519Q8015Q3463P5731O5827N4697M2370K8445J2961
$$ 1435485 1523000 1612104 1701623 1789638 1873101 1948832 2014659 2069356 2111726 2140171 2153132
62763B153132l308j9201l3720m6432n7398o6617p3689p8358q1182q3120q4363
$$ 2153132 2149824 2130623 2096903 2050471 1993073 1926456 1852767 1774409 1693227 1610107 1525744
62752A525744q4135q1875p8071p3665o9070o4318n9723n5664n1857m7552m2611
$$ 1525744 1441609 1359734 1281663 1207998 1138928 1074610 1014887 959223 907366 859814 817203
62741H17203l7788l3772l0517k7729k5491k3806k1892j8691j4231j0004p673p433
$$ 817203 779415 745643 715126 687397 661906 638100 616208 597517 583286 573282 565609 558176
62729E58176p806p059m846k397j143j233j632j444o80L76J856L862N825P103P986
$$ 558176 550370 543311 538465 536068 534925 533692 532060 530616 529936 530312 532168 536030 541855 548958 556944
62714E56944R358J1275J2681J2938J2963J4332J7557K1769K5884K9603L3197L6793
$$ 556944 566302 577577 590258 603196 616159 630491 648048 669817 695701 725304 758501 795294
62702G95294M0213M3479M7200N2054N7724O2811O6256O8600P1060P3547P4565
$$ 795294 835507 878986 926186 978240 1035964 1098775 1165031 1233631 1304691 1378238 1452803
62691A452803P3313P0689O7573O3095N5738M5476L3658K1094P610o580k0446l3365
$$ 1452803 1526116 1596805 1664378 1727473 1783211 1828687 1862345 1883439 1891049 1884469 1864023 1830658
62679A830658m5504n6584o5324p0959p4343p6638p7618p6307p2873o8771o5047
$$ 1830658 1785154 1728570 1663246 1592287 1517944 1441306 1363688 1287381 1214508 1145737 1080690
62668A080690o1357n6879n1532m6107m1639l8677l6834l4936l2021k8275k4687
$$ 1080690 1019333 962454 910922 864815 823176 784499 747665 712729 680708 652433 627746
62657F27746k1863j9537j7211j4801j2576j0839r799r380r092q421p539p222p790
$$ 627746 605883 586346 569135 554334 541758 530919 521120 511740 502648 494227 486688 479466 471676
62644D71676q442p981o113l827k490k636l523l793k710q05P75J488J699J850J773
$$ 471676 463234 455253 449140 445313 442823 440187 436664 432871 430161 429356 430131 431619 433318 435168 436941
62629D36941J075j30j204j577j128j56Q52J489J683J626J432J095Q43J196K312
$$ 436941 438016 437886 436682 435105 433977 433821 434673 436162 437845 439471 440903 441998 442841 444037 446349
62614D46349L587M328M634N142O022O845P463Q360R821J1272J2007J2251J2970
$$ 446349 449936 454264 458898 464040 470062 476907 484370 492730 502551 513823 525830 538081 551051
62601E51051J4732J7260K0036K2837K5483K7637K9246L0865L3101L5796L8242
$$ 551051 565783 583043 603079 625916 651399 679036 708282 739147 772248 808044 846286
62590H46286M0142M1792M3162M3293M1064L6388L0173K3266J5933Q313P62o525
$$ 846286 886428 928220 971382 1014675 1055739 1092127 1122300 1145566 1161499 1169812 1170574 1164049
62578A164049j3777k1100k7924l3430l7376m0136m1945m2520m1546l9297l6651
$$ 1164049 1150272 1129172 1101248 1067818 1030442 990306 948361 905841 864295 824998 788347
62567G88347l4459l2872l1169k8570k5286k2482k0877j9750j7903j5290j3015
$$ 788347 753888 721016 689847 661277 635991 613509 592632 572882 554979 539689 526674
62556E26674j1746j0918r747q243o868n722m663l805l420l465l609l536l082k284
$$ 526674 514928 504010 494263 486020 479152 473430 468767 464962 461542 458077 454468 450932 447850 445566
62542D45566j524j231j241r16r4O46R71J380K194K821K767K663L212L701K992
$$ 445566 444042 442811 441570 440654 440560 441206 442177 443557 445751 448572 451339 454002 457214 460915 463907
62527D63907J744K073M776Q227J0585J1858J3102J4756J6652J8900K1679K4636
$$ 463907 465651 467724 472500 480727 491312 503170 516272 531028 547680 566580 588259 612895
62515F12895K7352L0111L3370L6702L9107M0296M1040M2096M3152M2983M0568
$$ 612895 640247 670358 703728 740430 779537 819833 860873 902969 946121 989104 1029672
62504A029672L6125L0971K6037K0682J3673N283k589q733j3931j9227k3895k6322
$$ 1029672 1065797 1096768 1122805 1143487 1157160 1162443 1159854 1151121 1137190 1117963 1094068 1067746
62492A067746k6216k4767k2913k0632j7722j4197r945n013j31L970P667J1917
$$ 1067746 1041530 1016763 993850 973218 955496 941299 931354 926341 926210 930180 937847 949764
62480I49764J6664K0908K4350K7690L1100L3641L4613L4158L2051K7230J9621
$$ 949764 966428 987336 1011686 1039376 1070476 1104117 1138730 1172888 1204939 1232169 1251790
62469A251790J1323M630n91o392j3987k2570l0723l7761m3467m7462m9402m9519
$$ 1251790 1263113 1267743 1267152 1260760 1246773 1224203 1193480 1155719 1112252 1064790 1015388 965869
62457I65869m8587m7358m6045m4206m1273l7332l3177k9328k5438k1065j6717
$$ 965869 917282 869924 823879 779673 738400 701068 667891 638563 613125 592060 575343
62446E75343j3410j1303r495p325n150l507k204p62O05J242J218J342J853J822
$$ 575343 561933 550630 541135 533810 528660 525153 522949 522187 522792 524034 525252 526594 528447 530269
62432E30269N68r94j393q17j105l196n687o650o040n421n796o828p818q363q076
$$ 530269 530837 529843 528450 527633 526528 523332 517645 510995 504955 499534 493738 486910 479092 470729 462653
62417D62653o793n263m636n005n245m642l783l442l420l044k290j724j708k025
$$ 462653 455860 450597 445961 440956 435711 431069 427286 423844 420424 417380 415090 413366 411658 409633
62403D09633k138j595n99j31q95k094k111o18R22J242Q26R43K038L655N170N901
$$ 409633 407495 405900 405301 405170 404275 402181 400070 399452 400374 401616 402442 403385 405423 409078 414248 420149
62387D20149N325L898K912K851K795K190K082L376N012N365M807N083O631Q240
$$ 420149 425474 429372 432284 435135 437930 440120 442202 445578 450590 455955 460762 465845 472476 480716
62373D80716R212J0103J1243J2143J2743J3700J5087J6152J6844J8149K0406K2649
$$ 480716 489928 500031 511274 523417 536160 549860 564947 581099 597943 616092 636498 659147
62361F59147K4353K6459K9861L4011L8016M2016M6385N0485N3444N5410N6892
$$ 659147 683500 709959 739820 773831 811847 853863 900248 950733 1004177 1059587 1116479
62350A116479N7387N5840N2060M6549L9365L0262J9823R381j17q296j4823j9828
$$ 1116479 1173866 1229706 1281766 1328315 1367680 1397942 1417765 1427146 1427029 1418733 1403910 1384082
62338A384082k4624l0548l6953m1652m3787m4849m6253m7142m5747m2051l7839
$$ 1384082 1359458 1328910 1291957 1250305 1206518 1161669 1115416 1068274 1022527 980476 942637
62327I42637l4455l1686k8800k5595k2284j9240j7108j6495j7104j7784j7854
$$ 942637 908182 876496 847696 822101 799817 780577 763469 746974 729870 712086 694232
62316F94232j7886j8635j9656j9697j8301j6342j4895j4151j3623j2857j1729
$$ 694232 676346 657711 638055 618358 600057 583715 568820 554669 541046 528189 516460
62305E16460j0373r187q609q561q334p297n577l822k486j605j015m97J51P84Q72
$$ 516460 506087 496900 488291 479730 471396 464099 458522 454700 452214 450609 449594 449097 449248 450032 450904
62290D50904J88n96m98O17J952K899L696M720N619N685M923M311M795O239P599
$$ 450904 451092 450496 449998 450615 452567 455466 459162 463882 469501 475186 480109 484420 489215 495454 503053
62275E03053Q047P733P389P444P875Q712J0092J1757J3082J3904J4784J6114J7533
$$ 503053 511100 518833 526222 533666 541541 550253 560345 572102 585184 599088 613872 629986 647519
62262F47519J8819K0767K4329K9154L3891L7904M1743M5886M9903N3257N6029
$$ 647519 666338 687105 711434 740588 774479 812383 854126 900012 949915 1003172 1059201
62251A059201N8380N9756N9189N6101N0514M2926L4289K5629J7240Q498j092j0871
$$ 1059201 1117581 1177337 1236526 1292627 1343141 1386067 1420356 1445985 1463225 1471723 1470631 1459760
62239A459760j9520k6422l2232l8054m4341n0556n5725n9150o0623o0118n7672
$$ 1459760 1440240 1413818 1381586 1343532 1299191 1248635 1192910 1133760 1073137 1013019 955347
62228I55347n3805m9559m5671m1862l7517l2850k8751k5533k2660j9755j7068
$$ 955347 901542 851983 806312 764450 726933 694083 665332 639799 617139 597384 580316
62217E80316j4713j2373j0171q933q932r053q059o118m335l150k081q39K78J083
$$ 580316 565603 553230 543059 534126 525194 516141 508082 501964 497629 494479 492398 491559 491837 492920
62203D92920J845K819L982N370P087Q839J0015J0422J0533J0715J0699J0174R579
$$ 492920 494765 497584 501566 506936 514023 522862 532877 543299 553832 564547 575246 585420 594999
62190E94999R708J0543J0989J0127Q437P317P388P772P386O458O131O700P088
$$ 594999 604707 615250 626239 636366 644803 652120 659508 667280 674666 681124 687255 693955 701043
62177G01043O303M746L624L464L780M055M489N721Q094J1428J5378J9780K4529
$$ 701043 707346 712092 715716 719180 722960 727015 731504 737225 745319 756747 772125 791905 816434
62164H16434K9204L3172L6235L8822M1183M2701M2411M0013L5843L0216K3441
$$ 816434 845638 878810 915045 953867 995050 1037751 1080162 1120175 1156018 1186234 1209675
62153A209675J6296R512K881m269j1566j7653k1945k5374k8956l2533l5398l7234
$$ 1209675 1225971 1235483 1238364 1234095 1222529 1204876 1182931 1157557 1128601 1096068 1060670 1023436
62141A023436l7901l7204l5488l3541l1334k7840k2961j8476j5883j4290j1818
$$ 1023436 985535 948331 912843 879302 847968 820128 797167 778691 762808 748518 736700
62130G36700q404n589m015k820j445m08J61J194L360N934P773Q632R061R426R493
$$ 736700 728296 722707 718692 715872 714427 714019 714180 715374 718734 724668 732441 741073 750134 759560 769053
62115G69053Q708O711L746N79k174m329n533n182l558k362k967m713o078p000
$$ 769053 777761 784472 788218 788797 786623 782294 776761 771579 768021 765659 762692 757979 751901 744901
62101G44901q483j0124j0054p687m753k855j487N15K894M632N671O646P500P676
$$ 744901 736418 726294 716240 708553 703800 700945 699458 699973 702867 707499 713170 719816 727316 734992
62087G34992P390P582Q569R676J0264J0467J0789J1471J2352J3203J4142J5737
$$ 734992 742382 749964 758533 768209 778473 788940 799729 811200 823552 836755 850897 866634
62075H66634J8331K1194K2882K2827K2077K2045K2955K4015K4708K5280K6030
$$ 866634 884965 906159 929041 951868 973945 995990 1018945 1042960 1067668 1092948 1118978
62064A118978K6815K7290K7400K7438K7759K8326K8554K7765K5742K2593J8309
$$ 1118978 1145793 1173083 1200483 1227921 1255680 1284006 1312560 1340325 1366067 1388660 1406969
62053A406969J3000P432K491j998p026j2737j7977k2121k6274l1658l7496m1813
$$ 1406969 1419969 1427401 1429892 1427894 1420868 1408131 1390154 1368033 1341759 1310101 1272605 1230792
62041A230792m4002m5345m6900m8032m7541m5312m2184l8730l5009l1355k8595
$$ 1230792 1186790 1141445 1094545 1046513 998972 953660 911476 872746 837737 806382 777787
62030G77787k7074k5908k3819k0671j7657j5803j4825j3770j2319j0847r701r121
$$ 777787 750713 724805 700986 680315 662658 646855 632030 618260 605941 595094 585393 576272
62018E76272r468j0566j1133j0066q240p717q915r899r020o905n019l585k041
$$ 576272 566804 556238 545105 535039 526799 519082 510167 500268 491248 484343 479324 475739 473698
62005D73698m76P33J910L303L924K738P22J75J861M092M893M009K493J318Q37
$$ 473698 473222 473955 475865 479168 483092 485830 486552 486727 488588 492680 497573 501582 504075 505393 506230
61990E06230P82L90q97k642l816m084m158m731n708o604p149p314p158o846o478
$$ 506230 507012 507402 506505 503863 500047 495963 491805 487074 481366 474762 467613 460299 453141 446295 439817
61975D39817n984n449n235n288m738l014r58J45L69Q10J561J470K32p89m91M03
$$ 439817 433833 428384 423149 417861 413123 410109 409151 409296 409665 410475 412036 413506 413738 412949 412458 412861
61959D12861N93R9p8M26J071J367J367J414J960L221M664N321N080M999N742O499
$$ 412861 413454 413553 413475 413901 414972 416339 417706 419120 421080 424301 428965 434286 439366 444365 450107 456606
61943D56606O357O052P188R999J3077J5239J6538J7368J7643J7257J6600J6142
$$ 456606 462963 469015 476203 486202 499279 514518 531056 548424 566067 583324 599924 616066
61931F16066J6020J6184J6439J6160J4597J1775Q665O193M505L390K768K341J278
$$ 616066 632086 648270 664709 680869 695466 707241 715906 722099 726604 729994 732762 735103 736381
61918G36381j109m476p593r257q915o815l953j600k45Q74K837N610Q098R572J0502
$$ 736381 735272 730796 723203 713946 705031 698216 694263 692663 692418 693292 696129 701739 709837 719409 729911
61903G29911J1650J2789J2825J1148Q397N639L098M4l931q034j1017j2705j4138
$$ 729911 741561 754350 767175 778323 786720 792359 795457 795501 791570 783536 772519 759814 745676
61890G45676j6048j7760j8089j7004j5605j4554j3341j1466r590q880r487j0412
$$ 745676 729628 711868 693779 676775 661170 646616 633275 621809 612219 603339 593852 583440
61878E83440j0790j0724j0748j0992j1200j1177j0887j0218q963p080m886k967
$$ 583440 572650 561926 551178 540186 528986 517809 506922 496704 487741 480661 475775 472808
61866D72808j789j238o25N72K090L255L996N013O806R022J1058J2882J4814J6816
$$ 472808 471019 469781 469156 469728 471818 475073 479069 484082 490888 499910 510968 523850 538664 555480
61852E55480J8540K0012K1673K3686K5605K6864K7349K7345K7214K7131K6885
$$ 555480 574020 594032 615705 639391 664996 691860 719209 746554 773768 800899 827784
61841H27784K5761K2985J8552J3442Q777M816J038k890o483q903r798r482q351
$$ 827784 853545 876530 895082 908524 917301 922117 923155 920265 913782 904879 895081 885599 877248
61828H77248o483l889r10K026M849P694J0328J2117J2663J2107J0728Q583N687
$$ 877248 870765 866876 865966 867992 872841 880535 890863 902980 915643 927750 938478 947061 952748
61815I52748K054k537q278j4515j9853k3576k6409k9163l1217l1344k9728k7861
$$ 952748 954802 952265 943987 929472 909619 886043 859634 830471 799254 767910 738182 710321
61803G10321k6504k4967k2760k0642j9247j7806j5342j2450j0597j0005r504q491
$$ 710321 683817 658850 636090 615448 596201 578395 563053 550603 540006 530001 520497 512006
61791E12006p805q163q882q828q042p485p528p486o647n104l428k062j276j244
$$ 512006 504201 496038 487156 478328 470286 462801 455273 447787 441140 436036 432608 430546 429270 428026
61777D28026j826k479k691k357j610n52N38J089P82R5j93%R0j15o5O26J476J834
$$ 428026 426200 423721 421030 418673 417063 416511 417049 418138 418920 419015 418822 418822 418912 418797 418732 419358 420834 422668
61759D22668J809J995K540L043L188L018K702K419K393K678K981L042K874K360
$$ 422668 424477 426472 429012 432055 435243 438261 440963 443382 445775 448453 451434 454476 457350 459710
61745D59710J016j190l141l559k635j766j705j893j786j742k094k271j653o80
$$ 459710 460726 459536 456395 452836 450201 448435 446730 444837 443051 441309 439215 436944 435291 434611
61731D34611j90j06L85J551K761L382L326K816K152J790K039K553K628K128J645
$$ 434611 434421 434315 434700 436251 439012 442394 445720 448536 450688 452478 454517 457070 459698 461826 463471
61716D63471J640J890K093K465L281M077L905K477O41n17q39j127k065l408m296
$$ 463471 465111 467001 469094 471559 474840 478917 482822 485299 485940 485423 484584 483457 481392 477984 473688
61701D73688m227l501k817k698l183l791l776k808j540j162k104l402l658k561
$$ 473688 469461 465960 463143 460445 457262 453471 449695 446887 445347 444185 442081 438679 435021 432460
61687D32460j129m74p15j161j324j376j583j720j397q52q69j655k316j971j011
$$ 432460 431331 430857 430142 428981 427657 426281 424698 422978 421581 420729 419860 418205 415889 413918 412907
61672D12907n14n89k36R42J914J643N48k50n97j188k102k478j857r09m60m32k77
$$ 412907 412393 411804 411568 412510 414424 416067 416615 416365 415768 414580 412478 410000 408143 407234 406774 406342 406065
61655D06065L4K6m25p78m99K36P28N84K18L81J206J983K036J637J705K701M150
$$ 406065 406099 406125 405700 404922 404423 404659 405387 405971 406189 406570 407776 409759 411795 413432 415137 417838 421988
61638D21988N270N664N227L857J728l75j555j769j898k611l488l686l170k782
$$ 421988 427258 432922 438149 442006 443734 443359 441804 440035 438137 435526 432038 428352 425182 422400
61624D22400l002l354l263k976l048l320l110k254j320p47m90n39j031j614j555
$$ 422400 419398 416044 412781 409805 406757 403437 400327 398073 396753 396006 395516 394977 393946 392332 390777
61609C90777q77p20j894l658m663m677m565m822n005m684m127l821l813l776l473
$$ 390777 389900 389180 387286 383628 378965 374288 369723 364901 359896 355212 351085 347264 343451 339675 336202
61594C36202k998k735l043l692l858l048j916j602k312l041k795j676o57n80j456
$$ 336202 333204 330469 327426 323734 319876 316828 314912 313310 310998 307957 305162 303486 302829 302249 300793
61579C00793k440k559j677o75l57m99m00q9k01q54j465j738j931k080j833j335
$$ 300793 298353 295794 294117 293442 293085 292586 292186 292097 291896 291042 289577 287839 285908 283828 281995 280660
61563B80660j326j914k102j132M20J559K119K384K124J029k74o87k6Q41J202J121
$$ 280660 279334 277420 275318 274186 274606 276165 278284 280668 282792 283821 283547 282860 282834 283675 284877 285998
61547B85998Q81N43J41j91m25m91m6J086K302K677K119J446J217J112O86J16r8
$$ 285998 286879 287422 287563 287372 286947 286456 286410 287496 289798 292475 294594 296040 297257 298369 299055 299171 299073
61530B99073K04P99J413J833J924J642Q74n49k284l098j951M31J865J091q22j878
$$ 299073 299277 300076 301489 303322 305246 306888 307762 307213 304929 301831 299880 300311 302176 303267 302445 300567
61514C00567j428l96J47j33j080k270k985k622j364l0P50R44P05O0r23j951k626
$$ 300567 299139 298743 298890 298757 297677 295407 292422 289800 288436 288406 289156 290100 290805 290865 289942 287991 285365
61497B85365k623j966j218j049j283q01R43K723K767J078m69n08L07N96J28l24
$$ 285365 282742 280776 279558 278509 277226 276425 277368 280091 282858 283936 283467 282959 283266 283862 283990 283666
61481B83666k96L7M87J030J512J814K146K663K942K469J516R64J234J926K461
$$ 283666 283370 283407 283894 284924 286436 288250 290396 293059 296001 298470 299986 300950 302184 304110 306571
61466C06571K478J700J08j546k083j073O44J864J998J104m64k042k804k484j700
$$ 306571 309049 310749 310857 309311 307228 306155 306799 308663 310661 311765 311301 309259 306455 303971 302271
61451C02271j148p75j32P63J451J736J772J522P18m26j040m52J015K337K764K338
$$ 302271 301123 300348 300216 300979 302430 304166 305938 307460 308178 307752 306712 306260 307275 309612 312376 314714
61435C14714J666J447J991L006L821M013L791L614L493K962J780L53o93j130j051
$$ 314714 316380 317827 319818 322824 326645 330658 334449 338063 341556 344518 346298 346651 345958 344828 343777
61420C43777m59O32J709J994J390P69R70J817K470K427J706M27j200k566k980
$$ 343777 343318 343950 345659 347653 349043 349812 350782 352599 355069 357496 359202 359629 358429 355863 352883
61405C52883k454j647j066p72p96j202j657j597j055o30m95j31N75Q28J04q45
$$ 352883 350429 348782 347716 346944 346148 344946 343289 341692 340637 340007 339512 339381 339956 340784 340888 340043
61389C40043r52k93J94J15p5N4M93J107J655J645Q70l8k67J16M59O96J311K182
$$ 340043 339091 338798 338992 339107 339032 339086 339579 340686 342341 343986 344856 344818 344551 344667 345126 345822 347133 349315
61371C49315K518K122J740J846J902J296K53o24j041q10K79J828K783K640K139
$$ 349315 351833 353955 355695 357541 359443 360739 360992 360368 359327 358517 358796 360624 363407 366047 368186
61356C68186K141K437K415K316K823L842M671N235O096P278Q022P955P595P339
$$ 368186 370327 372764 375179 377495 380318 384160 388831 394066 400162 407440 415462 423417 431012 438351
61342D38351O684N080L079K076K864M731O003N554L875K575K570L034K580J212
$$ 438351 445035 450115 453194 455270 458134 462865 468868 474422 478297 480872 483442 486476 489056 490268
61328D90268K79M89Q49M5j799l429m100m124l919l292j938j86J192J786J913K114
$$ 490268 490547 491036 491885 491930 490131 486702 482602 478478 474559 471267 469329 469143 470335 472121 474034 476148
61312D76148K519K928L412M467O305Q244R316R383R189R304R539R654R888J0369
$$ 476148 478667 481595 485007 489474 495779 504023 513339 522722 531911 541215 550754 560408 570296 580665
61298E80665J0413R110O455L322N15j685l183m046m828o195p936q986q770p990
$$ 580665 591078 600188 606643 609965 610480 608795 605612 601566 596738 590543 582607 573621 564851 556861
61284E56861p602p537p117o346n934o053n862m595k598q72L5K63O8m38r65j000
$$ 556861 549259 541722 534605 528259 522325 516272 510410 505815 503217 502345 502380 502643 502711 502273 501308 500308
61268E00308l00P32J474J839K378L528M934N789N821N590N616N674N404N351O464
$$ 500308 500008 500740 502214 504053 506431 509959 514893 520682 526503 532093 537709 543383 548787 554138 560602
61253E60602Q493R717Q850O657M837L814K617Q47m59l39N75Q44n3j466k677l485
$$ 560602 569095 578812 587662 594319 599156 602970 605587 606434 605975 605636 606211 607055 607002 605536 602859 599374
61237E99374l823l614l074k648k455k240j898j568j158l36R01K119L181M443N875
$$ 599374 595551 591937 588863 586215 583760 581520 579622 578054 576896 576560 577461 579580 582761 587204 593079
61222E93079O581N876M476L807M277M919M860M371M209M507M788M767M579M343
$$ 593079 599660 605536 610012 613819 618096 623015 627875 632246 636455 640962 645750 650517 655096 659439
61208F59439L910L207K459J947J663J437J347J688K451L067L073K887L402M695
$$ 659439 663349 666556 669015 670962 672625 674062 675409 677097 679548 682615 685688 688575 691977 696672
61194F96672N894O609P779J0289J3195J4518J3651J1926J0573R367P667N702L906
$$ 696672 702566 709175 716954 727243 740438 754956 768607 780533 791106 800473 808140 813842 817748
61181H17748J988l10k119k394j545r92j274j755k139k986m520o066p088p743q008
$$ 817748 819736 819426 817307 814913 813368 812376 811102 809347 807208 804222 799702 793636 786548 778805 770797
61166G70797p377o073n543o768q826j0138j0519j0967j1852j2581j2839j2904
$$ 770797 763420 757347 751804 745036 736210 726072 715553 704586 692734 680153 667314 654410
61154F54410j2589j1155q743o830o462o743n943l713j365j06R4k43j063k452l888
$$ 654410 641821 630666 621923 615093 608631 601888 595945 592232 590867 590761 590855 590612 589549 587097 583209
61139E83209m596m635m894n793o518n984m249k444j362o96L42K017L931N478O277
$$ 583209 578613 573978 569084 563291 556773 550789 546540 544096 542734 542038 542380 544397 548328 553806 560083
61124E60083O446O644P627R561J1905J4033J5760J7211J8469J9470K0066K0150
$$ 560083 566529 573173 580800 590361 602266 616299 632059 649270 667739 687209 707275 727425
61112G27425J9960K0091K0857K1713K1859K1360K0987K0938K0601J9740J8930
$$ 727425 747385 767476 788333 810046 831905 853265 874252 895190 915791 935531 954461
61101I54461J8385J7287J4953J1817Q529M963J012k549n184p860j1716j5946j8622
$$ 954461 972846 990133 1005086 1016903 1025432 1030395 1031407 1028858 1023674 1015814 1004098 988152 969530
61088I69530j9444j9923k0725k0644j8969j7227j7336j9017k0333k0233j9351
$$ 969530 950086 930163 909438 888794 869825 852598 835262 816245 795912 775679 756328
61077G56328j8571j7856j6670j4854j2770j0881r352q029o798n799n123m439l368
$$ 756328 737757 719901 703231 688377 675607 664726 655374 647345 640547 634748 629625 625186 621818
61064F21818k184j550j495j198P4K239M710O792P741P196N906N307O011P282Q369
$$ 621818 619634 618084 616589 615391 615465 617704 622414 629206 636947 644143 650049 655356 661367 668649 677018
61049F77018R624J1639J3963J5545J6169J6692J8021K0360K3326K6174K8079K8809
$$ 677018 686642 698281 712244 727789 743958 760650 778671 799031 822357 848531 876610 905419
61037I05419K9152L0270L2493L5055L7029L8303L9569M1518M4125M6743M8860
$$ 905419 934571 964841 997334 1032389 1069418 1107721 1147290 1188808 1232933 1279676 1328536
61026A328536N0516N1842N2655N3116N4541N8621O5626P4177Q3134R3001J05136
$$ 1328536 1379052 1430894 1483549 1536665 1591206 1649827 1715453 1789630 1872764 1965765 2070901
61015B070901J20254J38230J58838J82234K09170K41248K80725L29862L90648
$$ 2070901 2191155 2329385 2488223 2670457 2879627 3120875 3401600 3731462 4122110
61006D122110M64960N54327O59659P81871R22165J080268J252894J435175J619387
$$ 4122110 4587070 5141397 5801056 6582927 7505092 8585360 9838254 11273429 12892816
60997A2892816J782529J871018J809415J545950J103998N88264J32239j68850
$$ 12892816 14675345 16546363 18355778 19901728 21005726 21593990 21726229 21557379
60989B1557379k86455k43919r6272P2046J52182M7563k70177p34905j219459j604025
$$ 21557379 21270924 21027005 20930733 21002779 21154961 21202524 20932347 20197442 18977983 17373958
60979A7373958j825935j883461j810121j650072j445963j232789j033059q56534
$$ 17373958 15548023 13664562 11854441 10204369 8758406 7525617 6492558 5636024
60971E636024p05369n79192m76257l93101l25835k71892k29899j98271j74663
$$ 5636024 4930655 4351463 3875206 3482105 3156270 2884378 2654479 2456208 2281545
60962B281545j56509j41722j29046j17848j07504r7140q6326p5654o5920n7059
$$ 2281545 2125036 1983314 1854268 1736420 1628916 1531776 1445450 1369796 1303876 1246817
60952A246817m8691m1393l6309l3472l1650k9962k8575k7520k6082k3908k1716
$$ 1246817 1198126 1156733 1120424 1086952 1055302 1025340 996765 969245 943163 919255 897539
60941H97539k0121j8607j6401j3816j1977j1531j2160j3019j3357j3038j2663
$$ 897539 877418 858811 842410 828594 816617 805086 792926 779907 766550 753512 740849
60930G40849j2763j2885j2056j0235q430p287o491n838n733o170o247n479m571
$$ 740849 728086 715201 703145 692910 684480 677193 670702 664864 659131 652961 646714 641235 636664
60917F36664m195l906l150k410k288k187j119O84K079K648K952L533M605O400
$$ 636664 632469 628563 625413 623003 620715 618528 617409 618093 620172 622820 625772 629305 633910 640310
60903F40310Q812J0866J1655J1623J1998J3070J4054J4557J5066J5820J6263J6051
$$ 640310 649122 659988 671643 683266 695264 708334 722388 736945 752011 767831 784094 800145
60891H00145J5766J6185J7308J8400J8617J7547J5547J3589J2300J1317R983Q370
$$ 800145 815911 832096 849404 867804 886421 903968 919515 933104 945404 956721 966704 975074
60879I75074O905N347L101M45j658l074m712o975r065j0239j0818j1351j1732
$$ 975074 981979 987326 990427 990872 989214 986140 981428 974453 965388 955149 944331 932980 921248
60866I21248j1852j2360j3850j5714j6667j6176j4826j3492j2768j2908j3734
$$ 921248 909396 897036 883186 867472 850805 834629 819803 806311 793543 780635 766901
60855G66901j4642j5152j5277j5140j4554j3483j2532j2316j2513j2276j1505
$$ 766901 752259 737107 721830 706690 692136 678653 666121 653805 641292 629016 617511
60844F17511j1020j1333j1917j2021j1687j1469j1473j1246j0647j0242j0519
$$ 617511 606491 595158 583241 571220 559533 548064 536591 525345 514698 504456 493937
60833D93937j0907j0179q025n818n244o259p065o280m539l416l332l291k505j395
$$ 493937 483030 472851 464826 459008 453764 447505 440440 434160 429621 426205 422873 419582 417077 415682
60819D15682p32n14k02L10N88L68p3l38l63k79n8N14J460K321K355J234m13j342
$$ 415682 414950 414436 414234 414544 415132 415500 415427 415089 414726 414447 414389 414903 416363 418684 421039 422273 421860 420518
60801D20518q63L98J141Q03R3jN72R89O92M1l32n61j419l093m485m296k683j234
$$ 420518 419655 420053 421194 421997 422090 422089 422661 423650 424342 424383 424051 423490 422071 418978 414493 410197 407514 406280
60783D06280j044j488j479j246j837l100l585k780k070k669l727l669k594j860
$$ 406280 405236 403748 402269 401023 399186 396086 392501 389721 387651 384982 381255 377586 374992 373132
60769C73132j816j594j041j124k069k677k149j286r83p84M4J000J123N35N1j42
$$ 373132 371316 369722 368681 367557 365488 362811 360662 359376 358393 357609 357653 358653 359776 360311 360362 360220
60753C60220k34K16J574K827K444P04l62M26K037K913K822K469K216J993J811
$$ 360220 359986 360202 361776 364603 367047 367751 367389 367815 369852 372765 375587 378056 380272 382265 384076
60738C84076J647J215L85n72j491k595l830m453l889k708k161k829m104m904m641
$$ 384076 385723 386938 387323 386751 385260 382665 378835 374382 370493 367785 365624 362795 358691 353787 349146
60723C49146l608k629k242k215k072j860j974k311k285j840j630j944k220j977
$$ 349146 345538 342909 340667 338452 336380 334520 332546 330235 327950 326110 324480 322536 320316 318339
60709C18339j524j270j127j138j781k861k990j376N58P47p30j868j602q01k42
$$ 318339 316815 315545 314418 313280 311499 308638 305648 304272 304830 305577 304847 302979 301377 300576 300334
60694C00334O36K144L038K111K04o96O1J358K063K140K060K100K387K883L115
$$ 300334 300970 303114 306152 308263 308467 307771 307832 309190 311253 313393 315453 317553 319940 322823 325938
60679C25938K575J538R71J433K530L576M230M354L881L183K994L532M064L835
$$ 325938 328513 330051 331022 332455 334985 338561 342791 347145 351026 354209 357203 360735 364799 368634
60665C68634K993K219J759J404J124J112J309J460J495J368O46r08k407k347m81
$$ 368634 371627 373846 375605 377009 378133 379245 380554 382014 383509 384877 385523 384615 382208 379861 379380
60650C79380J605K252J515N97J29j18k14J76Q47Q07n27k472l931m677n271n929
$$ 379380 380985 383237 384752 385349 385478 385360 385146 385322 386169 386976 386449 383977 380046 375369 370098 364169
60634C64169o220n951n568n358m666k741j62J300O57j032j836j035N18J731K105
$$ 364169 357949 351998 346430 341072 336406 333665 333503 334803 335460 334428 332592 331557 332075 333806 335911
60619C35911J492M9j259j179J68J031K44j040q98O16J602J053N4q5M79R55J319
$$ 335911 337403 337452 336193 335014 335182 336213 336457 335417 334519 335135 336737 337790 337844 337759 338238 339193 340512
60602C40512J852K030J101m73j262o08O89J585J974K292K605K556K010J275O48
$$ 340512 342364 344394 345495 345022 343760 343152 343841 345426 347400 349692 352297 354853 356863 358138 358786
60587C58786J9q88j936k436j836n25M25M82K22L76P68Q21Q30J758L721N558O360
$$ 358786 358805 357917 355981 353545 351709 351184 351609 352091 352313 352689 353457 354278 355108 356866 360587 366145 372505
60570C72505O639P347Q335Q731Q457Q379Q858R168Q646P570O358M666K103o86
$$ 372505 379144 386491 394826 403557 412014 420393 429251 438419 447065 454635 460993 465659 467762 467076
60556D67076k499l127l486m214m876m863m287l522k452p72J259L056M591O372
$$ 467076 464577 461450 457964 453750 448874 444011 439724 436202 433750 432978 434237 437293 441884 448256
60542D48256Q521J0391J1290J1216J0705J0223R936R789R533Q780P210M820J885
$$ 448256 456777 467168 478458 489674 500379 510602 520538 530327 539860 548640 555850 560670 562555
60529E62555j148l661n075n306m965m748m708m369l655l208l485l908l484k113
$$ 562555 561407 557746 552671 547365 542400 537652 532944 528575 524920 521712 518227 514319 510835 508722
60515E08722o83K12R51J980K894L082K804K880L539M376N327O805Q824J0912J3198
$$ 508722 508039 508251 509202 511182 514076 517158 519962 522842 526381 530757 536084 542889 551713 562625 575823
60500E75823J6589K1323K6130K9559L1638L3509L5842L8243L9871L9867L7504
$$ 575823 592412 613735 639865 669424 701062 734571 770413 808656 848527 888394 925898
60489I25898L2674K6146J8771J0611J367q587j8301k7152l4904m1061m4924m6307
$$ 925898 958572 984718 1003489 1014100 1015467 1006880 988579 961427 926523 885462 840538 794231
60477G94231m5529m2853l8708l4264l0699k7802k4398k0303j6768j4564j2869
$$ 794231 748702 705849 667141 632877 602178 574376 549978 529675 512907 498343 485474
60466D85474j0751q764p973q126p937o916n857n477n423m920l839k831k580l060
$$ 485474 474723 465959 457986 449860 441923 435007 429150 423673 418250 413330 409491 406660 404080 401020
60452D01020l467l008j883j188j665k822l553l311k444j608j239j370j636j585
$$ 401020 397553 394545 392662 391474 389809 386987 383434 380123 377679 376071 374832 373462 371826 370241
60438C70241j208r25q89o36K19J271J714J267L65l87o84n83m10m82p55q63o09
$$ 370241 369033 368108 367219 366583 366802 368073 369787 371054 371419 371032 370348 369765 369355 368873 368118 367255 366646
60421C66646j61L61R97J580J715J394J080R47O60K59M31J273J664P83m16l78Q81
$$ 366646 366485 366846 367843 369423 371138 372532 373612 374559 375219 375478 375909 377182 378846 379629 379213 378835 379716
60404C79716K045K535K904L246K755J371M02P77J659J719J032P17J178J707J623
$$ 379716 381761 384296 387200 390446 393201 394572 394974 395751 397410 399129 400161 400878 402056 403763 405386
60389D05386J090P31J019K097L676N014N315M406K953J991K120L042L839L848
$$ 405386 406476 407207 408226 410323 413999 419013 424328 428734 431687 433678 435798 438840 442679 446527
60375D46527L327L031L289L768M110M298M329M036L467K959K572J881P25k72m43
$$ 446527 449854 452885 456174 459942 464052 468350 472679 476715 480182 483141 485713 487594 488319 488047 487604
60360D87604j2K62K56O53J907L538M558M430L457K530K487L489M955O267P376
$$ 487604 487592 487854 488110 488763 490670 494208 498766 503196 506653 509183 511670 515159 520114 526381 533757
60345E33757Q473R221Q848P145M857K775Q57j364l752n457n865n194m165l462
$$ 533757 542230 551451 560299 567444 572301 575076 575933 574569 570817 565360 559495 554301 550136 546674
60331E46674l542m420n371n359m273l357l870n501o798o934o352n632m715l556
$$ 546674 543132 538712 533341 527982 523709 520352 516482 510981 504183 497249 490897 485265 480550 476994
60317D76994k655k322k032j165M1R87J729K808M404O365Q756J1590J4248J6074
$$ 476994 474339 472017 469985 468820 468861 469848 471577 474385 478789 485154 493910 505500 519748 535822
60303E35822J7404J9015K0586K0779J9011J6027J2440P831J971m146r413j3941
$$ 535822 553226 572241 592827 613606 632617 648644 661084 668915 670886 666740 657327 643386
60291F43386j8296k1933k3525k2653k0081j6559j2337q057n050m104m428m441
$$ 643386 625090 603157 579632 556979 536898 520339 508002 499945 494895 490791 486363 481922
60279D81922l429k106j586k079k749k766k245j897j938j861j467j419k230l214
$$ 481922 478493 476387 474801 472722 469973 467207 464962 463065 461127 459266 457799 456380 454150 450936
60265D50936l173k024j020j203k269l142l167k481j524o37j5J86j67j026k003
$$ 450936 447763 445739 444719 443516 441247 438105 434938 432457 430933 430296 430281 430467 430300 429274 427271
60250D27271k556k422j800r76q6O85J002R07R27J183Q14q50k783k989r72J540
$$ 427271 424715 422293 420493 419517 419431 420116 421118 422025 422952 424135 424949 424099 421316 418327 417355 418895
60234D18895K685K473K086K052K028J882J905K071J980J657J613J970K214K069
$$ 418895 421580 424053 426139 428191 430219 432101 434006 436077 438057 439714 441327 443297 445511 447580
60220D47580J971K200K257J686J139J772L659N527O228N892N413N336N594N938
$$ 447580 449551 451751 454008 455694 456833 458605 462264 467791 474019 479911 485324 490660 496254 502192
60206E02192O099N790N098M717N206O025N914M461K784K333L312M629N107M474
$$ 502192 508291 514081 519179 523896 529102 535127 541041 545502 548286 550619 553931 558560 563667 568141
60192E68141L356K579K360K034Q61q67k024k105j870k113k519k452k260k768l782
$$ 568141 571497 574076 576436 578470 579331 578464 576440 574335 572465 570352 567833 565381 563121 560353 556571
60177E56571m227l777l266l343l689l860l958m127m176m083m087l937l106k016
$$ 556571 552344 548567 545301 541958 538269 534409 530451 526324 522148 518065 513978 510041 506935 504919
60163E04919j980l117l658k306l12J98q35j627j205j89Q15J891K714K367Q85l13
$$ 504919 502939 499822 496164 493858 493546 493744 492909 491282 490077 489888 490703 492594 495308 497675 498560 498247
60147D98247j59Q17J546J806J970K208K512K936L293L281L219L953N497O622O323
$$ 498247 498088 498905 500451 502257 504227 506435 508947 511883 515176 518457 521676 525629 531126 537748 544071
60132E44071M981L549K391J595J563K259K584J525l65j542j246O5J629K897L397
$$ 544071 549052 552601 554992 556587 558150 560409 562993 564518 564153 562611 561365 561430 563059 565956 569353
60117E69353L066K576K541K662K341J893K082K687K600J480K89r2O3J1l42n03
$$ 569353 572419 574995 577536 580198 582539 584432 586514 589201 591801 593281 593570 593478 593541 593552 593210 592707
60101E92707j52M34O03j05j432k612l209l369l038j754K24J486J279R03J909L448
$$ 592707 592555 592989 593592 593487 592055 589443 586234 582865 579827 578073 578297 579783 581062 581965 583874 587322
60085E87322L300J365J54J287L299L782K216l05k828m838n732n334m479m082m069
$$ 587322 590622 591987 592141 593428 596727 600509 602725 602420 599592 594754 589022 583688 579209 575127 571058
60070E71058l926l795m283n554p280r026j0206j0211r142p872o929o035n136m872
$$ 571058 567132 563337 559054 553500 546220 537194 526988 516777 507635 499763 492834 486799 481663 476791
60056D76791n308n280m036k554k135k423k188j258l23N96J954L337L862L754L978
$$ 476791 471483 466203 462167 459613 457478 455055 452867 451609 451286 451882 453836 457173 461035 464789 468767
60041D68767M437M097L010K551L261L983L795L409L815M598M596L542K137R31
$$ 468767 473204 477301 480311 482862 486123 490106 493901 497310 501125 505723 510319 513861 515998 516929
60027E16929j82j498l043m419n076m947m784n387o539p323p376p129o755n816
$$ 516929 516747 515249 512206 507787 502711 497764 492980 487593 481054 473731 466355 459226 452471 446655
60013D46655m169k483j493j334j782k553l246l564l718l947l850k952j845j550
$$ 446655 442486 440003 438510 437176 435394 432841 429595 426031 422313 418366 414516 411564 409719 408169
59999D08169j757j122M11J151K43q00k87J217J998J806J831K563L226L205K775
$$ 408169 406412 405290 405701 406852 407095 406295 406008 407225 409223 411029 412860 415423 418649 421854 424629
59984D24629K336K003J995K564L385L836L858L770L270J581j081l162l434k431
$$ 424629 426965 428968 430963 433527 436912 440748 444606 448376 451646 453227 452146 448984 445550 443119
59970D43119j684j914k575k959l060l146k989k020k81J266J652R51P6k71l5N68
$$ 443119 441435 439521 436946 433987 430927 427781 424792 422772 422491 423757 425409 426360 426436 426165 426130 426698
59954D26698J285J654J317O24L29N07M55j16n66l73J17M75R79J846K399J925Q86
$$ 426698 427983 429637 430954 431578 431907 432414 432869 432753 432187 431814 431931 432406 433385 435231 437630 439555 440441
59937D40441L36M17M42K03K45P59J216J258J199J367J579J525J198P44L24K47
$$ 440441 440777 441194 441636 441839 442084 442843 444059 445317 446516 447883 449462 450987 452185 452929 453253 453500
59921D53500P32J421J577J045O06J120K561M066M765M452L729L524M222N116M975
$$ 453500 454232 455653 457230 458275 458881 460001 462562 466628 471393 475845 479574 483098 487320 492436 497411
59906D97411L266O49j686k920k868j859n95J17j07q93j484j424q80k80K73J102
$$ 497411 500677 501326 499640 496720 493852 491993 491398 491515 491408 490515 489031 487607 486727 486447 486720 487822
59890D87822K388L713M422M441M384M799N591O333O724O566N692M285L051K666
$$ 487822 490210 493923 498345 502786 507170 511969 517560 523893 530617 537183 542875 547160 550211 552877
59876E52877L133L790L868K944J236l96j125j159j629l199n075n930n503m793
$$ 552877 556010 559800 563668 566612 567848 567452 566327 565168 563539 560340 555265 549335 543832 539039
59862E39039m792n482n997n459l679j334O28J880K800L634M080M006M047M945
$$ 539039 534247 528765 522768 517309 513630 512296 512924 514804 517604 521238 525318 529324 533371 538316
59848E38316O594Q189R009Q631O848L971J021r89j834j842j282m78o8m84j400
$$ 538316 544910 553099 562108 570739 577587 581558 582579 581590 579756 577914 576632 576154 576086 575602 574202
59833E74202k269l073l950m567m658m750n363n838n093l460k539l058l998m202
$$ 574202 571933 568860 564910 560343 555685 550935 545572 539734 534641 531181 528642 525584 521586 517384
59819E17384l853l750l989m069l838l618l526l128j850K56K149K456R28j007j670
$$ 517384 513531 509781 505792 501723 497885 494267 490741 487613 485763 486019 488168 490624 491552 490545 488875
59804D88875r75k81n99j659k720l355l381k778j994j655j795j936j986k314k808
$$ 488875 487900 487619 487020 485361 482641 479286 475905 473127 471133 469478 467683 465747 463761 461447 458639
59789D58639k733j836q20l07p5K01K31k88r10r07j99O70J147R51J66n85n38K81
$$ 458639 455906 454070 453250 452943 452868 453069 453300 453012 452102 451195 450996 451666 452813 453764 453930 453345 452807 453088
59771D53088R10P07K10K59P24P81J91m17m62o1L63O70R81J313J491J447J485K028
$$ 453088 453998 454705 454915 455174 455898 456679 456870 456453 455991 455930 456293 456963 457944 459257 460748 462195 463680 465708
59753D65708L053M007M440M492M516M584M687N034N649N976N527M648L956L329
$$ 465708 468761 472768 477208 481700 486216 490800 495487 500521 506170 512146 517673 522321 526277 529606
59739E29606K295J140O42Q20R85R63J220J566J057n13k015k338j434J81J880K588
$$ 529606 531901 533041 533683 534503 535488 536451 537671 539237 540294 539781 537766 535428 533994 534175 536055 538643
59723E38643J351j086k533j896m76R5l3J68P09Q33L97k34j015j812j779l92J363
$$ 538643 539994 538908 536375 534479 534003 534098 534065 534233 534942 535775 536172 535938 534923 533111 531332 530940 532303
59706E32303K066J782J754K421K972K722J936J275J211J981L283M214M136L463
$$ 532303 534369 536151 537905 540326 543298 546020 547956 549231 550442 552423 555706 559920 564056 567519
59692E67519K966K652K067J237N47K5m85q30r73j302j730j256L84J506L83k175
$$ 567519 570485 573137 575204 576441 576988 577013 576528 575698 574725 573423 571693 570437 570821 572327 572710 570535
59676E70535l822l877l684l979l951l224k817l380m124m334m459m858m779l675
$$ 570535 566713 562836 559152 555173 551222 547998 545181 541801 537677 533343 528884 524026 519247 515572
59662E15572k403k051k341k277j583o10M96J553J879J127K03L79J690K986L400
$$ 515572 513169 511118 508777 506500 504917 504307 504803 506356 508235 509362 509565 509944 511634 514620 518020
59647E18020L108K739K620K582K100P79j104k743l593l720l336k668k391l288
$$ 518020 521128 523867 526487 529069 531169 531948 530844 528101 524508 520788 517452 514784 512393 509105
59633E09105m991n853m812k713j122m68j38J38R1k34m37n43j038k028l058l777
$$ 509105 504114 498261 493449 490736 489614 489146 489008 489146 489237 489003 488566 488023 486985 484957 481899 478122
59617D78122m247m545m546m195l602k933k404k224k197j681m30Q12J179Q99R65
$$ 478122 473875 469330 464784 460589 456987 454054 451650 449426 447229 445548 445118 445930 447109 448008 448973
59602D48973J714K431K398J690P87J5m75o79q78j368j872j692o40N92J207J074
$$ 448973 450687 453118 455516 457206 457993 458008 457533 456854 455976 454608 452736 451044 450404 450996 452203 453277
59586D53277N58J0l63n32q54j777k987l309k079l11K31r48k620l462l378k997
$$ 453277 453835 453845 453482 452950 452096 450319 447332 444023 441944 441633 441864 440916 438296 434834 431456 428459
59570D28459k599k232k213k621k529q36J932L614K777M17j320j535r63l53L83
$$ 428459 425860 423628 421415 418794 416265 415429 417361 420975 423752 424169 422849 421314 420351 419998 420381
59555D20381J444K361K409J413p9j175j217l42O54J370K425M423O569P380O838
$$ 420381 421825 424186 426595 428008 427929 426754 425537 425195 425849 427219 429644 434067 440636 448016 454854
59540D54854O684Q107J0288J2040J3795J6599J9582J9969J6035R130K288k606
$$ 454854 461538 469645 479933 491973 505768 522367 541949 561918 577953 587083 589371 586765
59528E86765n783q166r747r607p302l832q99O82J498K360L095K872J440m04j587
$$ 586765 580982 572816 563069 553462 546160 542328 541429 542111 543609 545969 549064 551936 553376 552972 551385
59513E51385j768j601k132l809n993p516p814p274o568o079o065o713p648p904
$$ 551385 549617 548016 545884 542075 536082 528566 520752 513478 506910 500831 494766 488053 480405 472501
59499D72501o919n261l850k885k060j436j365j667j677j118l47K96P52R11O89
$$ 472501 465582 460321 456471 453586 451526 450090 448725 447058 445381 444263 443916 444212 444964 445875 446564
59484D46564M97R88J995K446J750P73Q56K145L490L925L746L913M720N455N313
$$ 446564 447061 448049 450044 452490 454240 455013 455869 458014 461504 465429 469175 473088 477808 483263 488576
59469D88576M388L435K812K069P61p26j497j169k46M91Q04J217K479M617O499
$$ 488576 492964 496399 499211 501280 502041 501315 499818 498649 498403 498894 499698 500915 503394 508011 514510
59454E14510O759N393L974L947N102O275P003P679Q354Q355P226N284L130J098
$$ 514510 521269 526662 530636 534583 539685 545960 552963 560642 568996 577351 584577 589861 592991 594089
59440E94089o90k368m377o847q960r764r553r429r352p999n082k491k014k858
$$ 594089 593399 591031 586654 579807 570847 561083 551530 542101 532749 524750 519668 517177 515163 512305
59426E12305k796j159P31J880K896M654O949R078J0950J2940J5127J7064J8255
$$ 512305 509509 508350 509081 510961 513857 518511 525460 534538 545488 558428 573555 590619 608874
59413F08874J8619J8851K0100K2631K4755K3810J8618J0470J586o527j2820j6031
$$ 608874 627493 646344 666444 689075 713830 737640 756258 766728 768314 761787 748967 732936
59401G32936j5579j2672r293o072k271K008M702L587j503q729j5882k1326k4024
$$ 732936 717357 704685 695392 689320 687049 689057 693759 697346 695843 687114 671232 649906 625882
59388F25882k3785k1611j8994j6664j4382j1949r718p913o123l960j832m90pK87
$$ 625882 602097 580486 561492 544828 530446 518497 508779 500866 494743 490783 488951 488461 488454 488741
59374D88741Q75J484J601J239R96J399K366L326L910M350N006N629N553M734M140
$$ 488741 489616 491100 492701 493940 494936 496335 498701 502027 505937 510287 515293 520922 526475 531209 535349
59359E35349M696O110P245P483P273P355P974Q910R835J0468J0787J1206J2282
$$ 535349 540045 546155 553400 560883 568156 575511 583485 592395 602230 612698 623485 634691 646973
59346F46973J4010J5683J6651J6889J6734J6366J5791J5028J4018J2599J0780
$$ 646973 660983 676666 693317 710206 726940 743306 759097 774125 788143 800742 811522
59335H11522Q843O907M669J865j192l939o221q264j0217j2137j4220j6459j8058
$$ 811522 820365 827272 831941 833806 832614 828675 822454 814190 803973 791836 777616 761157 743099
59322G43099j7927j6062j3893j2818j2663j2139j0541q521p066o269n411m040
$$ 743099 725172 709110 695217 682399 669736 657597 647056 638535 631469 625200 619789 615749
59310F15749k504j367n81M73K166M052N321N722N938O993R236J1882J3401J2503
$$ 615749 613245 611878 611297 611770 613936 617988 623309 629031 634969 641962 651198 663080 676481 688984
59296F88984Q982L771j743o495j0007j2149j2948j2593j1472j0001q442o881n397
$$ 688984 697966 701737 699994 693499 683492 671343 658395 645802 634330 624329 615887 609006 603609
59283F03609m147l292k760k222j403m05M50J099J809K745L686M357M801N219N714
$$ 603609 599462 596170 593410 591188 589785 589380 589830 590929 592738 595483 599169 603526 608327 613546 619260
59268F19260O396P475Q853R848R759Q663P179N605L725J391j287m273p424r939
$$ 619260 625656 633131 641984 651832 661591 670254 677433 683038 686763 688154 686867 682594 675170 665231
59254F65231j0799j0128r323r394r797r483q443p376o440n264l904k757j710l36
$$ 665231 654432 644304 634981 625587 615790 606307 597864 590488 584048 578784 574880 572123 570413 570077
59240E70077J076J662J295P47M17p7o82m71R30K415K883K824L346M135L678J419
$$ 570077 571153 572815 574110 574857 575274 575197 574515 574044 574974 577389 580272 583096 586442 590577 594255 595674
59224E95674j399l288m011m226m439m743n019n061m771m481m709n318n355m088
$$ 595674 594275 590987 586976 582750 578311 573568 568549 563488 558717 554236 549527 544209 538854 534766
59210E34766j913m2N87n8j226j961j826j316j280j726j620j64K003L388L232K139
$$ 534766 532853 532811 533398 533340 532114 530153 528327 527011 525731 524005 522385 522221 524224 527612 530844 532983
59194E32983J180R18J283J934K472K674K736L142L996M649M358L212K189K098
$$ 532983 534163 535081 536364 538298 540770 543444 546180 549322 553318 557967 562325 565537 567726 569824
59180E69824K741L248L115K581K115J861J768J887K223K537K670K939L730M687
$$ 569824 572565 575813 578928 581509 583624 585485 587253 589140 591363 593900 596570 599509 603239 607926
59166F07926M921M154L224L092L768M681N577O462O972O560N381M123K900J112
$$ 607926 612847 617001 620225 623317 627085 631766 637343 643805 650777 657337 662718 666841 669741 670853
59152F70853j233k999l437l484m527o343p442p292o858o727o153m711l590l990
$$ 670853 669620 666621 663184 659700 655173 648830 641388 634096 627238 620511 614358 609647 606057 602067
59138F02067n068m940l394k049j876k118k024k107k826l283k447r48l04p98j280
$$ 602067 596999 592059 588665 586616 584740 582622 580598 578491 575665 572382 569935 568987 568683 567885 566605
59123E66605r69k91J69N85J412K694M167N525O408O582O338O305O698P113P091
$$ 566605 565636 565345 565514 566099 567511 570205 574372 579897 586305 592887 599225 605530 612228 619341 626432
59108F26432O549N673M871M751N526O405O254M979L603K864K479K007J576J328
$$ 626432 632981 638654 643525 648276 653802 660207 666461 671440 675043 677907 680386 682393 683969 685297
59094F85297R40L02j10j12l80j309k016j519m47l92j685l050l470l416l891n173
$$ 685297 686237 686539 686429 686317 685937 684628 682612 681093 680646 680254 678569 675519 672049 668633 664742 659569
59078F59569o909q663r887r935q754p243o463o659p242p508p109o186n293m943
$$ 659569 652660 643997 634110 624175 615421 608178 601715 595056 587814 580306 573197 567011 561718 556775
59064E56775m979m713l838k871k371k122j506n06J66j54j439l026m028l906k957
$$ 556775 551796 547083 543245 540374 538003 535881 534375 533869 534035 533881 532442 529416 525388 521482 518525
59049E18525k139k080k425k415j899j335r33n28k22m88j280j704j068Q5O24K85
$$ 518525 516386 514306 511881 509466 507567 506232 505299 504771 504549 504061 502781 501077 500009 500094 500718 501003
59033E01003m9M58J657K814L535M003M471M942N331N826O810Q314R685J0108R535
$$ 501003 500954 501412 503069 505883 509418 513421 517892 522834 528165 533991 540801 549115 558800 568908 578443
59018E78443Q861Q865R355R643R532R203Q385O561M099K220J378M91j397l406
$$ 578443 587304 596169 605524 615167 624699 633902 642287 648848 652947 655167 656545 657036 655639 652233
59004F52233l836k544j030j39J023L302N762O761O210N568N679N682M392K035
$$ 652233 648397 645853 644823 644684 645707 649009 654771 661532 667742 673310 678989 684671 689063 691098
58990F91098j4q59q31p80j169k023l188m302m764m294l402k875k721k140o74J176
$$ 691098 691084 690225 689394 688614 687445 685422 682234 677932 673168 668874 665472 662597 659876 657736 657062 658238
58974F58238K726M033N527P132Q355R034R379R423R176R185J0137J1669J2386
$$ 658238 660964 664997 670524 677656 686011 695045 704424 713847 723023 732208 742345 754014 766400
58961G66400J1540J0022R164R008Q395O525L741Q21j958m798p819j0783j3265
$$ 766400 777940 787962 797126 806134 814529 821054 824795 825616 823658 818860 811041 800258 786993
58948G86993j4921j5511j4970j3693j2658j2644j3135j2526j0062p052n444n341
$$ 786993 772072 756561 741591 727898 715240 702596 689461 676935 666873 659821 654377 649036
58936F49036n121m002l178l795m914m684k915j284j127k100l123l662l649k976
$$ 649036 643915 639913 636735 632940 628026 623342 620427 619143 618016 615916 612793 609131 605482 602506
58922F02506j741o94o91j623k343j935q11j86n09q94l28R47J814J809J652K186
$$ 602506 600765 600071 599380 597757 595414 593479 592668 592482 591973 591079 590751 591698 593512 595321 596973 599159
58906E99159L401M744N869O742P434Q151R194J0567J1812J2432J2304J1589J0575
$$ 599159 602560 607304 613173 619915 627349 635500 644694 655261 667073 679505 691809 703398 713973
58893G13973R729R510R918J0602J1476J2797J4465J5858J6624J7053J7359J7112
$$ 713973 723702 733212 743130 753732 765208 778005 792470 808328 824952 842005 859364 876476
58881H76476J5843J3746J1335Q889O611M787L219J050k263o069r189j1165j2424
$$ 876476 892319 906065 917400 926289 932900 937687 940906 941956 939693 933624 924435 913270 900846
58868I00846j3503j4504j5084j4695j3195j1406j0398j0103r486q343p844q670
$$ 900846 887343 872839 857755 843060 829865 818459 808061 797958 788472 780129 772285 763615
58856G63615r767r926r516r527r898j0031j0170j0728j0977r979q301p264o882
$$ 763615 753848 743922 734406 724879 714981 704950 694780 684052 673075 663096 654795 647531 640649
58843F40649o236n458n490o105o146n776o326p609p616n613l586l418m349m525
$$ 640649 634413 628955 623465 617360 611214 605438 599112 591503 583887 578274 574688 571270 566921 562396
58829E62396l650k694k118j748j698k064k313j917j114k18J099K972M541M932
$$ 562396 558746 556052 553934 552186 550488 548424 546111 544194 543080 542862 543961 546933 551474 556406
58815E56406M476L959L346K238J123R63J842K965L837M494M768M258L035J608
$$ 556406 560882 564841 568187 570425 571548 572511 574353 577318 581155 585649 590417 594675 597710 599318
58801E99318J67j527l410m777m912l851k521k046k764l953m804n387o035o122
$$ 599318 599485 597958 594548 589771 584859 581008 578487 576441 573677 569724 564920 559533 553498 547376
58787E47376m690k299q50j052j429n56J024K142K951M236N750O685P085P360O972
$$ 547376 542686 540387 539537 538485 537056 536500 537524 539666 542617 546853 552603 559288 566373 573733 580705
58772E80705N122K337j03k059m373o963q646q953q719q480p642n787l733k609
$$ 580705 585827 588164 588061 586002 581629 574666 566020 557067 548348 539868 532226 526439 522706 520097
58758E20097k559k880k933k546j868j094k09R32K041K386J788J177J391J972K087
$$ 520097 517538 514658 511725 509179 507311 506217 506008 506940 508981 511367 513155 514332 515723 517695 519782
58743E19782K048K680L552L412K370K051L219M704N344N599O401P399P551O711
$$ 519782 521830 524510 528062 531474 533844 535895 539114 543818 549162 554761 561162 568561 576112 582823
58729E82823N636M795M019L228K735K813L283L653L554L103K821L028L546M203
$$ 582823 588459 593254 597273 600501 603236 606049 609332 612985 616539 619642 622463 625491 629037 633240
58715F33240N180O391P040O755O609P723R086Q468N693L160K391J850n16m014
$$ 633240 638420 644811 651851 658606 665215 672938 682024 690492 696185 699345 701736 703586 703070 699056
58701F99056o322o975p811j0074j2841j4650j5342j5765j6487j7336j7656j6757
$$ 699056 692734 685759 677948 667874 655033 640383 625041 609276 592789 575453 557797 541040
58689E41040j4561j1923r854q384o783m883l400k775k478j980j649k076k939l294
$$ 541040 526479 514556 504702 496318 489535 484652 481252 478477 475999 474019 472370 470294 467355 464061
58675D64061k804j983j250m25P38K050L168L957M378M503M887O387R040J1511
$$ 464061 461257 459274 458024 457599 458337 460387 463555 467512 471890 476393 481280 487667 496707 508218
58661E08218J2310J1417R929Q296N886K448j057l675n654p611r092q990p281n350
$$ 508218 520528 531945 541874 550170 556056 558504 557447 553772 548118 540507 531415 522425 515144 509794
58647E09794m500m686m895m312l019j858j651k389l287l729l794l614k899j602
$$ 509794 505294 500608 495713 491401 488382 486524 484873 482484 479197 475468 471674 468060 465161 463559
58633D63559n01j99j38M58J076O04p06j372q90l77o45r75n37K33N59P32J484K679
$$ 463559 463058 462859 462721 463179 464255 464859 464153 462781 461891 461514 460869 459894 459357 459590 460149 460881 462365 465044
58615D65044L610M224N022O023O608O327N270L880K859K868L647L843K478L55
$$ 465044 468654 472878 477900 483923 490531 496858 502128 506008 508867 511735 515382 519225 521703 522058
58601E22058p97m05M86P85M62l3n48j077j361j152o34k48k06l20j50P36K406M399
$$ 522058 521261 520856 521342 522127 522589 522556 522008 520931 519570 518418 517784 517536 517330 517010 516860 517596 520002 524401
58583E24401O118P317Q034Q197P734P065O939P517Q037P802P167P097P882Q837
$$ 524401 530519 537836 545870 554067 561801 568866 575805 583322 591359 599161 606328 613425 621307 630144
58569F30144R330R583J0187J1176J2124J2925J3950J5439J7245J9331K1893K4635
$$ 630144 639474 649057 659244 670420 682544 695469 709419 724858 742103 761434 783327 807962
58557H07962K6388K6049K3757K0699J7854J5275J2396Q649L962q75m541o380p140
$$ 807962 834350 860399 884156 904855 922709 937984 950380 959029 962991 962116 957575 951195 944055
58544I44055p978q942r208q656q317r032j0582j2432j4478j6629j8367j9422k0232
$$ 944055 936077 927135 917927 909271 900954 891922 881340 868908 854430 837801 819434 800012 779780
58531G79780k1098k1344k0043j7249j3868j0607p729n640m841n110n346m510k596
$$ 779780 758682 737338 717295 700046 686178 675571 667842 662202 657361 652251 646905 642395 639799
58518F39799n19O83N65n06j660k225k170j908j737j585j269q98q61j395k185k640
$$ 639799 639280 639963 640528 640022 638362 636137 633967 632059 630322 628737 627468 626570 625709 624314 622129 619489
58502F19489k640k620k721k319r99M41P85L1o86p94q46j192j228n56J96M37P15
$$ 619489 616849 614229 611508 609189 608190 608631 609416 609447 608761 607967 607121 605929 604701 604145 604341 604778 605493
58485F05493J741L007L519L514M256O227Q526J0276J1717J3500J5536J6942J6972
$$ 605493 607234 610241 613760 617274 621530 627757 636283 646559 658276 671776 687312 704254 721226
58472G21226J5718J3985J2449J0913Q543M995R46k616n246o887p478p240o888
$$ 721226 736944 750929 763378 774291 782834 787829 788775 786159 780913 774026 766548 759308 752420
58459G52420o772o147m141j216J197K539L752N818Q427J0351J0698R452P224M774
$$ 752420 745648 739501 735360 734144 735341 737880 741632 747450 755877 766228 776926 786378 793602 798376
58445G98376K509K78k214m777o831q105q828r162q892p861o395n035m083l499
$$ 798376 800885 801163 798949 794172 787341 779236 770408 761246 752354 744493 738098 733063 728980 725481
58431G25481k981k046k80K257M913O837P562P322O962P355Q719J0442J1681J1945
$$ 725481 722500 720454 720174 722431 727344 734181 741743 749065 756027 763382 772101 782543 794224 806169
58417H06169J1014Q681N054R61k404m415n323n707n903n960n842n520n001m347
$$ 806169 817183 825864 830918 831879 829475 825060 819737 814030 808127 802167 796325 790805 785804 781457
58403G81457l668l144l009l278l400k589p43J309K758L599M215M519M134L143
$$ 781457 777789 774645 771636 768358 764958 762369 761626 762935 765693 769292 773507 778026 782160 785303
58389G85303K110J464J265J312J092j2j818l038k688j606j555k867m011l698k348
$$ 785303 787413 788877 790142 791454 792546 792534 790716 787678 784990 783384 781829 778962 774951 771253 768905
58374G68905r18O53K919N489P256P954Q477R550J0805J1480J1510J1418J1448
$$ 768905 767987 768640 771559 777048 784304 792258 800735 810285 821090 832570 844080 855498 866946
58361H66946J1378J1205J1475J2622J4238J5352J5392J4515J3152J1631J0317
$$ 866946 878324 889529 901004 913626 927864 943216 958608 973123 986275 997906 1008223
58350A008223R538R088Q258O710M995L835L323L311M066N860Q111R787J0641J1324
$$ 1008223 1017761 1026849 1035107 1041817 1046812 1050647 1053970 1057281 1061347 1067207 1075318 1085105 1095746 1107070
58336A107070J2245J3101J3706J4431J5474J6335J6604J6757J7420J8214J8072
$$ 1107070 1119315 1132416 1146122 1160553 1176027 1192362 1208966 1225723 1243143 1261357 1279429
58325A279429J6697J4970J3762J2921J1830J0478R378Q601P639O379N619O146
$$ 1279429 1296126 1311096 1324858 1337779 1349609 1360087 1369465 1378066 1385705 1392084 1397703 1403849
58313A403849P654R093R885J0247J0496J0756J1379J2824J4820J6324J6789J6969
$$ 1403849 1411503 1420596 1430481 1440728 1451224 1461980 1473359 1486183 1501003 1517327 1534116 1551085
58301A551085J7938J9737K1496K2636K3333K3982K4652K5028K4679K3572K2436
$$ 1551085 1569023 1588760 1610256 1632892 1656225 1680207 1704859 1729887 1754566 1778138 1800574
58290A800574K2311K3428K4894K5851K6457K7349K8667L0169L1870L3843L5645
$$ 1800574 1822885 1846313 1871207 1897058 1923515 1950864 1979531 2009700 2041570 2075413 2111058
58279B111058L6641L6822L6813L7271L8652M1200M4446M7057M7951M7591M7511
$$ 2111058 2147699 2184521 2221334 2258605 2297257 2338457 2382903 2429960 2477911 2525502 2573013
58268B573013M8658N0692N2881N5039N7601O1084O5450O9734P2740P4475P6405
$$ 2573013 2621671 2672363 2725244 2780283 2837884 2898968 2964418 3034152 3106892 3181367 3257772
58257C257772P9655Q3505Q6471Q8400R0457R3296R6364R8849J00393J00992J01229
$$ 3257772 3337427 3420932 3507403 3595803 3686260 3779556 3875920 3974769 4075162 4176154 4277383
58246D277383J02625J06570J12776J19663J26459J33787J42105J50819J59487
$$ 4277383 4380008 4486578 4599354 4719017 4845476 4979263 5121368 5272187 5431674
58237E431674J68754J79340J90965K03083K15922K29897K44463K58532K71938
$$ 5431674 5600428 5779768 5970733 6173816 6389738 6619635 6864098 7122630 7394568
58228G394568K85879L01930L21074L43558L69188L97637M28779M62864N00313
$$ 7394568 7680447 7982377 8303451 8647009 9016197 9413834 9842613 10305477 10805790
58219A0805790N41440N86627O36808O93527P58297Q32014R15429J010304J119798
$$ 10805790 11347230 11933857 12570665 13264192 14022489 14854503 15769932 16780236 17900034
58210A7900034J247596J397332J573862J785392K043926K363116K754767L226278
$$ 17900034 19147630 20544962 22118824 23904216 25948142 28311258 31066025 34292303
58202C4292303L780789M420718N152827N992295O965385Q110234R470696J1081698
$$ 34292303 38073092 42493810 47646637 53638932 60604317 68714551 78185247 89266945
58194H9266945J2959827J5114557J7564740K0321879K3339193K6480359K9529363
$$ 89266945 102226772 117341329 134906069 155227948 178567141 205047500 234576863
58187B34576863L2161428L3807006L3540271L0268191K3294369J2909129N04234
$$ 234576863 266738291 300545297 334085568 364353759 387648128 400557257 401061491
58180D01061491j1930393k2563320l0242239l4598145l5881824l4730631l1943998
$$ 401061491 389131098 366567778 336325539 301727394 265845570 231114939 199170941
58173A99170941k8287609k4365683k0585883j7184620j4264879j1833459r843204
$$ 199170941 170883332 146517649 125931766 108747146 94482267 82648808 72805604
58166G2805604q230861o936123n905344n091384m451256l941441l518820l150262
$$ 72805604 64574743 57638620 51733276 46641892 42190636 38249195 34730375 31580113
58158C1580113k819080k519486k247712k000969j780043j586692j419021j272555
$$ 31580113 28761033 26241547 23993835 21992866 20212823 18626131 17207110 15934555
58150A5934555j144243j032152r32882q42844p61338o89343o26109n69519n18917
$$ 15934555 14790312 13758160 12825278 11982434 11221096 10531753 9905644 9336125 8817208
58141H817208m74864m36724m03063l73862l49841l29865l11214k92365k73660
$$ 8817208 8342344 7905620 7502557 7128695 6778854 6448989 6137775 5845410 5571750
58132E571750k55563k38137k21865k07191j93438j79869j67414j57561j49806
$$ 5571750 5316187 5078050 4856185 4648994 4455556 4275687 4108273 3950712 3800906
58123C800906j42080j33567j25283j17910j10889j03842r7161r0862q4459p8337
$$ 3800906 3658826 3525259 3399976 3282066 3171177 3067335 2970174 2879312 2794853 2716516
58113B716516p3728p0747o7875o4167o0690n8956n8756n8530n7275n5278n3244
$$ 2716516 2642788 2572041 2504166 2439999 2379309 2320353 2261597 2203067 2145792 2090514 2037270
58102B037270n1429m9656m7803m6021m4461m2880m0901l8688l6851l5425l3552
$$ 2037270 1985841 1936185 1888382 1842361 1797900 1755020 1714119 1675431 1638580 1603155 1569603
58091A569603l0792k8081k6602k6084k5187k3375k1504k0487k0323k0550k0940
$$ 1569603 1538811 1510730 1484128 1458044 1432857 1409482 1387978 1367491 1347168 1326618 1305678
58080A305678k1464k2044k2578k2914k2775k2065k1134k0333j9407j7874j5943
$$ 1305678 1284214 1262170 1239592 1216678 1193903 1171838 1150704 1130371 1110964 1093090 1077147
58069A077147j4475j3941j3875j3557j2915j2596j3141j4201j4618j3590j1732
$$ 1077147 1062672 1048731 1034856 1021299 1008384 995788 982647 968446 953828 940238 928506
58058I28506j0598j0977j2102j2756j2558j1916j1302j1126j1619j2262j1834
$$ 928506 917908 906931 894829 882073 869515 857599 846297 835171 823552 811290 799456
58047G99456r846p425o108o048o190n867n374n136n216n566o074o404o397o454
$$ 799456 789610 782185 776077 770029 763839 757972 752598 747462 742246 736680 730606 724202 717805 711351
58033G11351o994p756q243q494q687q460p550o777p182q338q720p779o447n491
$$ 711351 704357 696601 688358 679864 671177 662717 655167 648390 641208 632870 624150 616371 609924 604433
58019F04433m630l621l038l269l726l687l232k786k473k376k746l367l445k695
$$ 604433 599803 596182 593144 589875 586149 582462 579230 576444 573971 571595 568849 565482 562037 559342
58005E59342j874j649j643j310j050j498k286k475j916j248p30j08M58K33j088
$$ 559342 557468 555819 554176 552866 551816 550318 548032 545557 543641 542393 541663 541555 542013 542246 541158
57990E41158k920m533n671o314o381n955n399n032m942n131n448n460m867m083
$$ 541158 538238 533705 528034 521720 515339 509384 503985 498953 494011 488880 483432 477972 473105 469022
57976D69022l836m014l580k060m46m8p28j022J9J680K388J415l56j239l68J368
$$ 469022 465186 461172 457592 455532 455086 455038 454310 453288 453307 454987 457375 458790 458434 457195 456827 458195
57960D58195K190J394J30j11O10R51K27p64j070q79r68j479j887j823j303l81
$$ 458195 460385 461779 461909 461798 462408 463359 463586 462822 461752 460873 459905 458426 456539 454716 453413 453032
57944D53032Q07J799K222K399K992M070N106N878O708P650Q152P876P371P479
$$ 453032 453839 455638 457860 460259 463251 467321 472427 478305 485013 492663 500815 508691 516062 523541
57930E23541Q296R003Q602O672L761J048o66j784l225n039o334o749p052p749
$$ 523541 531837 540840 549442 556114 559875 560923 560257 558473 555248 550209 543875 537126 530074 522325
57916E22325q041p100n776n729p060q037p449o095n410n430n032l808k725k808
$$ 522325 514284 507184 501408 495679 488619 480582 473133 467038 461628 456198 451166 447358 444633 441825
57902D41825l722m170l468k313j863k376l082l222k735j916q91K36J180J887K784
$$ 441825 438103 433933 430465 428152 426289 423913 420831 417609 414874 412958 412067 412303 413483 415370 418154
57887D18154M076M996M494K744J234J101J895K341J967J373J115R44L31p21j734
$$ 418154 422230 427226 431720 434464 435698 436799 438694 441035 443002 444375 445490 446434 446765 446044 444310
57872D44310k331k360j648k89P89L48j573l209k974j469o13r62j081J91K103L273
$$ 444310 441979 439619 437971 437682 438471 438819 437246 434037 431063 429594 428981 428019 426938 427129 429232 432505
57856D32505L675M308N441O260O101N174M143L514L398L290K331L54j602k476
$$ 432505 436180 440488 445929 452189 458290 463464 467607 471121 474519 477809 480140 480494 478892 476416
57842D76416k581l042m091m914n114n235n630n847n504m969m620m187l391k591
$$ 476416 473835 470793 466702 461788 456674 451439 445809 439962 434458 429489 424869 420682 417291 414700
57828D14700k149j700p68L03Q06Q65J356K536L507L342K315J528J577K043K307
$$ 414700 412551 410851 410083 410386 411192 412057 413413 415949 419456 422798 425113 426641 428218 430261 432568
57813D32568K328K245J610k24k910n052n825o027o772p693p381n533l564k777
$$ 432568 434896 437141 438751 438527 435617 430565 424740 418713 411941 404248 396867 391334 387770 384993
57799C84993k876k689j705k98J058K136K789K962K819K494J949J283R31J202J761
$$ 384993 382117 379428 377723 377425 378483 380619 383408 386370 389189 391683 393632 394915 395846 397048 398809
57784C98809J968J570Q36J99N8P27K116L556M265M106L637L461L695M087M389
$$ 398809 400777 402347 403183 403382 403440 404167 406283 409839 414104 418210 421847 425308 429003 433090 437479
57769D37479M556M580M302L426J898J71j056j461j265r15p85j144k019k954l241
$$ 437479 442035 446615 450917 454343 456241 456412 455356 453895 452630 451715 450930 449786 447767 444813 441572
57754D41572k635j623q07k36M72J460K349K571J948Q72o7o80j245j921k407k451
$$ 441572 438937 437314 436507 436271 436743 438203 440552 443123 445071 445943 445876 445196 443951 442030 439623 437172
57738D37172k395k711l274l628l792m077m231l624k345j275p88l45L13N64J06
$$ 437172 434777 432066 428792 425164 421372 417295 413064 409440 407095 405820 405032 404687 405000 405564 405670
57723D05670j77N05J456J468P66P91K162L845M511L951K876J902J017j89j815
$$ 405670 405493 405998 407454 408922 409688 410479 412641 416486 420997 424948 427824 429726 430743 430554 428739
57708D28739l162l311k409j771k152k558j636K87J715K113K288K706K939L031
$$ 428739 425577 422266 419857 418086 415934 413376 411740 412027 413742 415855 418143 420849 423788 426819
57694D26819L872N438N915L775m0l064l981l438k631k104j817j411l87J353L042
$$ 426819 430691 436129 442044 445819 445779 442715 438734 435296 432665 430561 428744 427333 426946 428299 431341
57679D31341L830M018M778O664R069J1417J4125J7891K2562K7252L1441L5398
$$ 431341 435171 439189 443967 450631 459700 471117 485242 503133 525695 552947 584388 619786
57667F19786L9555M3641M6334M5443L8743K5441P353j1460k6812l6615m1353m2602
$$ 619786 659341 702982 749316 794759 833502 858943 866296 854836 828024 791409 750056 707454
57655G07454m1279l7415l1300k4334j8431j4657j2602j1052r130o893n047m160
$$ 707454 666175 628760 597460 573126 554695 540038 527436 516384 507254 500361 495314 491154
57643D91154m038l880l130k085j425j259r52p4R07J176O34N5J60R26J812K325
$$ 491154 487116 483236 480106 478021 476596 475337 474385 474311 475218 476394 477028 477083 477243 478169 479981 482306
57627D82306K233J485L74m44m22K40P31N44j6l21k83l98r63j496j195J09J597
$$ 482306 484539 486024 486398 485954 485532 485772 486503 487047 487031 486710 486427 486029 485066 483570 482375 482484 484081
57610D84081K195J582L84n34q16n98q7O00J297J778J979K020J955J707J296R39
$$ 484081 486276 487858 488242 487708 486892 486294 486207 486807 488104 489882 491861 493881 495836 497543 498839 499778
57594D99778Q36R67J195J401J482J371J124Q40M77Qk34K57J429K526K954K924
$$ 499778 500614 501581 502776 504177 505659 507030 508154 508994 509471 509479 509245 509502 510931 513457 516411 519335
57578E19335K887K674J877Q61O27J518K638K904K256J517J345J640J900J859J766
$$ 519335 522222 524896 526773 527634 528261 529779 532417 535321 537577 539094 540439 542079 543979 545838 547604
57563E47604K087K924L811M248M343M579N022N179M673L687K575J564J023J417
$$ 547604 549691 552615 556426 560674 565017 569596 574618 579797 584470 588157 590732 592296 593319 594736
57549E94736K566L378K921J521K89j98k13q1J48L11J62K8P54K570M497N432N497
$$ 594736 597302 600680 603601 605122 605411 605213 605000 604919 605067 605378 605540 605568 606322 608892 613389 618821 624318
57532F24318N721O538P231P078O494O585P644Q665Q625P827P436P806Q001P258
$$ 624318 630039 636577 643808 650886 657380 663965 671609 680274 688899 696726 704162 711968 719969 727227
57518G27227O212N960O451O610O001N382N419N679N351M376L417L096L553M377
$$ 727227 733439 739399 745850 752460 758461 763843 769262 774941 780292 784668 788085 791181 794734 799111
57504G99111M712M026L074L405N287O877O329M251K907L237L926L548K469J947
$$ 799111 803823 807849 810923 814328 819615 826492 832821 837072 839979 843216 847142 850690 853159 855106
57490H55106K299K740K638K188K010K576L889N332N976N426M409M117M953O091
$$ 855106 857405 860145 862783 864971 866981 869557 873446 878778 884754 890180 894589 898706 903659 909750
57476I09750O422N801N154N329N997N954M648K952K208K750L826M663N086N272
$$ 909750 916172 921973 927127 932456 938453 944407 949055 952007 954215 956965 960791 965454 970540 975812
57462I75812N601O640Q492J0046R796P703N505M792N497O643P754Q819R624R986
$$ 975812 981413 988053 996545 1006591 1016387 1024090 1029595 1034387 1039884 1046527 1054281 1063100 1072724 1082710
57448A082710J0179J0361J0038Q947P968Q129R045R386Q838Q426Q858R671J0218
$$ 1082710 1092889 1103250 1113288 1122235 1130203 1138332 1147377 1156763 1165601 1174027 1182885 1192556 1202774
57435A202774J0530J0762J0739J0522J0650J1181J1313J0640J0103J0803J2241
$$ 1202774 1213304 1224066 1234805 1245327 1255977 1267158 1278471 1289111 1299214 1310017 1322258
57424A322258J2722J1528R870R492J0814J2749J3977J4048J3374J2444J1289R791
$$ 1322258 1334980 1346508 1356378 1365870 1376684 1389433 1403410 1417458 1430832 1443276 1454565 1464356
57412A464356Q279P473P707Q512R185R633J0344J1616J3073J3996J4046J3573
$$ 1464356 1472635 1480108 1487815 1496327 1505512 1515145 1525489 1537105 1550178 1564174 1578220 1591793
57400A591793J3265J3523J4142J4530J4193J3140J2011J1816J3144J5396J7083
$$ 1591793 1605058 1618581 1632723 1647253 1661446 1674586 1686597 1698413 1711557 1726953 1744036
57389A744036J7201J6161J5157J4907J5319J6148J7334J8729J9933K0498K0024
$$ 1744036 1761237 1777398 1792555 1807462 1822781 1838929 1856263 1874992 1894925 1915423 1935447
57378A935447J8300J5718J3445J2530J2942J3852J4740J5654J6556J7166J7445
$$ 1935447 1953747 1969465 1982910 1995440 2008382 2022234 2036974 2052628 2069184 2086350 2103795
57367B103795J7503J7044J5722J4153J3611J4492J5887J7017J8106J9405K0330
$$ 2103795 2121298 2138342 2154064 2168217 2181828 2196320 2212207 2229224 2247330 2266735 2287065
57356B287065K0357K0083K0416K1246K1720K1519K1113K0941K1018K1208K1355
$$ 2287065 2307422 2327505 2347921 2369167 2390887 2412406 2433519 2454460 2475478 2496686 2518041
57345B518041K1266K0936K0622K0469K0404K0608K1466K2688K3268K2853K2479
$$ 2518041 2539307 2560243 2580865 2601334 2621738 2642346 2663812 2686500 2709768 2732621 2755100
57334B755100K3102K4143K4442K4129K4375K5511K6569K6705K6116K5440K4987
$$ 2755100 2778202 2802345 2826787 2850916 2875291 2900802 2927371 2954076 2980192 3005632 3030619
57323C030619K4672K4185K3284K2356K2303K3269K4071K3842K3615K4954K7391
$$ 3030619 3055291 3079476 3102760 3125116 3147419 3170688 3194759 3218601 3242216 3267170 3294561
57312C294561K8796K8280K7125K6557K6233K5595K5178K5593K6376K6860K7297
$$ 3294561 3323357 3351637 3378762 3405319 3431552 3457147 3482325 3507918 3534294 3561154 3588451
57301C588451K8102K8792K8690K8072K7627K7301K6655K5995K6125K7124K8162
$$ 3588451 3616553 3645345 3674035 3702107 3729734 3757035 3783690 3809685 3835810 3862934 3891096
57290C891096K8397K7485K5673K3973K3746K5207K6696K6465K4902K3964K4567
$$ 3891096 3919493 3946978 3972651 3996624 4020370 4045577 4072273 4098738 4123640 4147604 4172171
57279D172171K5701K6129K5751K4941K3790K2681K2643K4151K6065K6715K5862
$$ 4172171 4197872 4224001 4249752 4274693 4298483 4321164 4343807 4367958 4394023 4420738 4446600
57268D446600K4831K4745K5317K5529K5003K4314K4231K4954K6064K6984K7427
$$ 4446600 4471431 4496176 4521493 4547022 4572025 4596339 4620570 4645524 4671588 4698572 4725999
57257D725999K7442K7226K7008K7003K7302K7672K7661K7091K6447K6482K7334
$$ 4725999 4753441 4780667 4807675 4834678 4861980 4889652 4917313 4944404 4970851 4997333 5024667
57246E024667K8161K7922K6475K4811K4040K4349K4921K4784K3555K1519J9314
$$ 5024667 5052828 5080750 5107225 5132036 5156076 5180425 5205346 5230130 5253685 5275204 5294518
57235E294518J7515J6395J5901J5781J5689J5206J4086J2560J1180J0190R350
$$ 5294518 5312033 5328428 5344329 5360110 5375799 5391005 5405091 5417651 5428831 5439021 5448371
57224E448371Q578Q330Q908R740J0030R913J0217J1084J1665J1416J0913J0911
$$ 5448371 5456949 5465279 5474187 5483927 5493957 5503870 5514087 5525171 5536836 5548252 5559165 5570076
57212E570076J1183J0916R970R126R165J0084J1145J1554J1112J0353R852R494
$$ 5570076 5581259 5592175 5602145 5611271 5620436 5630520 5641665 5653219 5664331 5674684 5684536 5694030
57200E694030Q714P447O312N658N042L961K667J779J467J343Q21o74l347o464
$$ 5694030 5702744 5710191 5716503 5722161 5727203 5731164 5733831 5735610 5737077 5738420 5739241 5738567 5735220 5728756
57186E728756q551q826q128q000r231j1699j5062j8785k1928k3894k5288k7180
$$ 5728756 5720205 5711379 5703251 5695251 5686020 5674321 5659259 5640474 5618546 5594652 5569364 5542184
57174E542184k9546l1322l2106l2837l4572l7265m0128m2566m4380m5557m6244
$$ 5542184 5512638 5481316 5449210 5416373 5381801 5344536 5304408 5261842 5217462 5171905 5125661
57163E125661m6611m6507m5636m4177m2694m1228l9121l6153l3265l1445l0305
$$ 5125661 5079050 5032543 4986907 4942730 4900036 4858808 4819687 4783534 4750269 4718824 4688519
57152D688519k8543k5776k3184k2126k2577k3295k3344k3090k3708k5930k9530
$$ 4688519 4659976 4634200 4611016 4588890 4566313 4543018 4519674 4496584 4472876 4446946 4417416
57141D417416l3844l8453m3121m7394n0778n3314n5489n7368n8115n6842n3792
$$ 4417416 4383572 4345119 4301998 4254604 4203826 4150512 4095023 4037655 3979540 3922698 3868906
57130C868906n0278m7328m4716m1660l8366l6249l6351l7989l9540m0366m1111
$$ 3868906 3818628 3771300 3726584 3684924 3646558 3610309 3573958 3535969 3496429 3456063 3414952
57119C414952m2206m3067m3068m2341m0958l8363l4555l0987k9005k7802k5382
$$ 3414952 3372746 3329679 3286611 3244270 3203312 3164949 3130394 3099407 3070402 3042600 3017218
57108C017218k1262j6662j1894n052O042K1862M1851O6042R5068J29046J67026
$$ 3017218 2995956 2979294 2967400 2962348 2968390 2990252 3032103 3098145 3193213 3322259 3489285
57097C489285K07167K47230K85782L23562L63324M08203M60341N20007N84167
$$ 3489285 3696452 3943682 4229464 4553026 4916350 5324553 5784894 6304901 6889068
57088F889068O45810O96574P30541P44176P34395P02779O64548O47103O70237
$$ 6889068 7534878 8231452 8961993 9706169 10440564 11143343 11807891 12454994 13125231
57079A3125231P25037P75939P85395P35437O28212M74297K85813P6682j37976
$$ 13125231 13850268 14626207 15411602 16147039 16775251 17249548 17535361 17612043 17474067
57070A7474067l45004n33922o94901q18755q99698r36759r32708q93251q27029
$$ 17474067 17129063 16595141 15900240 15081485 14181787 13245028 12312320 11419069 10592040
57061A0592040p44414o55529n70166m98454m48366m20885m08723m01078l89731
$$ 10592040 9847626 9192097 8621931 8123477 7675111 7254226 6845503 6444425 6054694
57052F054694l71412l46824l18948k91177k65456k41957k20645k02258j87154
$$ 6054694 5683282 5336458 5017510 4726333 4460877 4218920 3998275 3796017 3608863
57043C608863j74235j61942j49865j38649j28840j20501j13389j06719r9128q9707
$$ 3608863 3434628 3272686 3122821 2984172 2855332 2734831 2621442 2514723 2415595 2325888
57033B325888p8829o7392n5656m3460l0916j8281n924M327Q385K282j4109l6393
$$ 2325888 2247059 2179667 2124011 2080551 2049635 2031354 2025430 2029757 2038142 2040424 2026315 1989922
57021A989922n8767p7070q9172r4332r3274q8101q1078p3503o5849n8351n1134
$$ 1989922 1931155 1854085 1764913 1670581 1577307 1489206 1408128 1334625 1268776 1210425 1159291
57010A159291m4367l8726l5013l2860l0633k7374k4173k2724k3011k3489k3288
$$ 1159291 1114924 1076198 1041185 1008325 977692 950318 926145 903421 880410 856921 833633
56999H33633k2939k2870k2428k1006j9161j7862j7151j6332j5177j4081j3080
$$ 833633 810694 787824 765396 744390 725229 707367 690216 673884 658707 644626 631546
56988F31546j1561r260o996n808n631n411m689m434n885q758j1277j2181j2157
$$ 631546 619985 610725 603729 597921 592290 586879 582190 577756 571871 563113 551836 539655 527498
56975E27498j2859j4703j6295j6145j4332j2073j0089q101n868l864k489j161
$$ 527498 514639 499936 483641 467496 453164 441091 431002 422901 417033 413169 410680 409519
56963D09519J060M051O617Q088R215J1040J3264J4384J3275J0120N756P55m685
$$ 409519 410579 414630 421247 429335 438550 449590 462854 477238 490513 500633 506389 507144 502459
56950E02459j0211j4992j7983j8628j7492j5946j4887j3898j1997q986n513k087
$$ 502459 492248 477256 459273 440645 423153 407207 392320 378422 366425 357439 351926 349839
56938C49839J216M097O067P433R314J2178J5112J7100J8201J8612J7372J3208
$$ 349839 351055 355152 361219 368652 377966 390144 405256 422356 440557 459169 476541 489749
56926D89749O406j292q513j4920k0090k3024k3278k1596j9038j6085j3116j0843
$$ 489749 496155 494863 486350 471430 451340 428316 405038 383442 364404 348319 335203 324360
56914C24360r635q957q158p308o670n833m231k291j094r26r26l68M27P79P88J325
$$ 324360 314725 305768 297610 290302 283632 277799 273568 271277 270183 269257 268331 267963 268390 269169 269957 271282
56898B71282K997N360P204P666P200P219Q575J0566J1906J2480J3371J5078J6557
$$ 271282 274279 279639 286843 294509 301709 308928 317503 328069 339975 352455 365826 380904 397461
56885C97461J6560J5170J3202J0558O243J35o258j1169j4045j5250j5025j3459
$$ 397461 414021 429191 442393 452951 459194 459329 453071 441902 427857 412607 397582 384123
56873C84123j1107q702o234k992J277N772R527J2492J5454J9104K3463K8077L2472
$$ 384123 373016 364314 358080 355088 356365 362137 371664 384156 399610 418714 442177 470254 502726
56860E02726L6453L9876M2000M1126L5422K4492J0018n166j8460k8142l3402l4416
$$ 502726 539179 579055 621055 662181 697603 722095 732113 726947 708487 680345 646943 612527
56848F12527l2160k7738k1912j5370q933l024K854R505J7102K5189L3380M1509
$$ 612527 580367 552629 530717 515347 506414 503390 506244 515749 532851 558040 591420 632929
56836F32929M9248N6212O2340O7459P0219O7976N8174M0000J5238j1932l6356
$$ 632929 682177 738389 800729 868188 938407 1006383 1064557 1104557 1119795 1107863 1071507
56825A071507n4228o4649o8800o7927o2734n4389m4743l5138k5745j6524p920
$$ 1071507 1017279 952630 883830 815903 753169 698780 654037 618899 593154 576630 568710
56814E68710j72P200J4567K1545K7840L4019M0467M6085M8831M7152M0227K7588
$$ 568710 568538 575738 590305 611850 639690 673709 714176 760261 809092 856244 896471 924059
56802I24059R860j0321k9335m4667n5285o0471n9818n4577m7550m0818l4332k7277
$$ 924059 933919 923598 894263 849596 794311 733840 674022 619445 571895 531077 496745 469468
56790D69468j9902j3271p806k959J890O808J1448J5421J8639K1389K3706K4558
$$ 469468 449566 436295 428489 425530 427420 434228 445676 461097 479736 501125 524831 549389
56778E49389K2159J5553N559n932j7074k6331l2513l5303l5432l3843l1049k7559
$$ 549389 571548 587101 592660 586728 569654 543323 510810 475507 440075 406232 375183 347624
56766C47624k4260k1566j8760j5043j0920p679n796m748m238m487n247n568m964
$$ 347624 323364 301798 283038 267995 257075 249396 243600 238852 234614 230127 224880 219312 214348
56753B14348m020l481l347l243l104l037k981k909k955l032k769k092j425j050
$$ 214348 210328 206847 203500 200257 197153 194116 191135 188226 185271 182239 179470 177378 175953 174903
56739A74903p85n73p64j369j674j242o49n13l31P13K123K514J594N69L53M91K92
$$ 174903 174118 173545 172781 171412 169738 168496 167847 167334 167003 167716 169839 172353 173947 174516 174869 175360 175652
56722A75652L8K94P88Q70O35P11J095J101L91n90j281j526j405j117j145j909
$$ 175652 175690 175984 176772 177642 178277 178988 180083 181184 181575 180985 179704 178178 176773 175656 174511 172602
56706A72602l024l377k340n73O35N80m62j652k081j276L00J459J404M71n22j351
$$ 172602 169578 166201 163861 163288 163923 164503 164041 162389 160308 159032 159332 160791 162195 162666 162144 160793
56690A60793k235k829k282m77J503K515K543K319K246K170J963J807J927K390
$$ 160793 158558 155729 153447 152970 154473 156988 159531 161850 164096 166266 168229 170036 171963 174353
56676A74353L029L365K914J898J360K007L174L533K711J572R48R36J464K567L697
$$ 174353 177382 180747 183661 185559 186919 188926 192100 195633 198344 199916 200864 201800 203264 205831 209528
56661B09528L699K239N91J61O95R44O80Q35J672K130J498O29P07J465J606N90
$$ 209528 213227 215466 216057 216218 216913 217857 218537 219372 221044 223174 224672 225301 226008 227473 229079 229669
56645B29669q28j804k240k349k035j186j28N73O23J54m68p85m54M02J147J098
$$ 229669 228841 227037 224797 222448 220413 219227 219099 219672 220295 220449 219981 219196 218742 219144 220291 221389
56629B21389J65j101j988k160j864j759k314l214l477k521r79r8l44j032j410
$$ 221389 221554 220453 218465 216305 214441 212682 210368 207154 203677 201156 200177 200079 199735 198703 197293
56614A97293j492j548j386p35O9M89O99J254J930J850R58L80Q20J398Q68o75k120
$$ 197293 195801 194253 192867 192132 192201 192690 193389 194643 196573 198423 199381 199761 200581 201979 202847 202172 200052
56597B00052k845k976k515j397k67o3o68r70n85m11r95j396n22J107J923J321
$$ 200052 197207 194231 191716 190319 190052 189989 189321 188351 187766 187355 186360 184964 184442 185549 187472 188793
56581A88793K16k69J16Q77J367J214O39L76R60K104L121L684L840L586L036K833
$$ 188793 189009 188740 188856 189733 191100 192314 192953 193329 194289 196393 199514 203198 207038 210624 213660 216493
56565B16493L607N015O022O287O648P965J0038J1970J3108J3247J2264J0102P114
$$ 216493 220100 225115 231137 237424 244072 252037 262075 274045 287153 300400 312664 322766 329880
56552C29880M125K067J385J655J852J305L47k70m25o20r61r34m07j05o52j665
$$ 329880 334005 336072 337457 339112 340964 342269 342616 342346 341921 341301 340340 339406 338999 338894 338242 336577
56536C36577k369k669l040l674m344m894n303n433n239n146n591o234o235n329
$$ 336577 334208 331539 328499 324825 320481 315587 310284 304851 299612 294466 288875 282641 276406 271077
56522B71077m108l151k411j605p28R4P65R85L68q69j749j571q77q55j901l266
$$ 271077 266969 263818 261407 259802 259074 259168 259933 260918 261286 260417 258668 257097 256220 255365 253464 250198
56506B50198m055m146l964l712l152k078p76J28K74l8j88Q4N06O78L80n71k160
$$ 250198 246143 241997 238033 234321 231169 229091 228315 228443 228717 228679 228491 228575 229081 229759 230139 229568 227408
56489B27408l628l694j938L25J342R46N07Q59J274Q53J7k18J39J23o33j299r23
$$ 227408 223780 220086 218148 218473 219815 220761 221268 222127 223401 224254 224271 224053 224192 224315 223682 222383 221460
56472B21460M30J894K676K608K088J619J245N33o41j480j036N32J983K445K210
$$ 221460 221890 223784 226460 229068 231156 232775 234020 234553 233912 232432 231396 231928 233911 236356 238566
56457B38566J944J703J214N95K61K83K87o9p27j235j112m03J31j81q75q07K14
$$ 238566 240510 242213 243427 244022 244283 244566 244853 244784 244057 242822 241710 241307 241438 241257 240382 239575 239789
56440B39789J005P48L18J006K475L069K033L55o69q72q94j124j390j289o04L82
$$ 239789 240794 241542 241860 242866 245341 248410 250443 250798 250129 249257 248363 247239 245849 244560 243956 244338
56424B44338R85Q39M38M92R32J122R11P05N53Kr36j559j495j153q01o3J131J957
$$ 244338 245323 246162 246600 247092 248024 249146 250057 250762 251315 251317 250381 248822 247327 246174 245373 245310 246441 248398
56406B48398J785J238J329K006K343J844P66m83j481j628q10j7l73j547j994r78
$$ 248398 250183 251421 252750 254756 257099 258943 259709 259226 257745 256117 255307 255290 254917 253370 251376 250398
56390B50398N29J143N24p33j902k384j866p64j7m7k99j87J05L13R16K347L768
$$ 250398 250927 252070 252594 251861 249959 247575 245709 244945 244928 244881 244582 244395 244500 244813 245729 248076 251844
56373B51844L754K322J143J304J806J097n62j359l74J302K121J891J499J520J778
$$ 251844 255598 257920 259063 260367 262173 263270 262708 261349 260975 262277 264398 266289 267788 269308 271086
56358B71086J903J671R50K7k49P03K208K984K780K579K917L024K137Q41K36L68
$$ 271086 272989 274660 275610 275637 275388 276091 278299 281283 284063 286642 289559 292583 294720 295561 295797 296165
56342B96165M59L59P47J891L109L663L525L130K919L202L891M263L702K740K638
$$ 296165 296624 296983 297730 299621 302730 306393 309918 313048 315967 319169 323060 327323 331025 333765 336403
56327C36403L658M555M182K885J738J093O57M32N98O73j66j794k978k798j650
$$ 336403 340061 344616 348798 351683 353421 354514 355171 355603 356201 356874 356708 354914 351936 349138 347488
56312C47488n80r0P5L66J015J925K723L105L193L328L428L047K261K000K955M495
$$ 347488 346908 346818 346893 347259 348274 350199 352922 356027 359220 362548 365976 369023 371284 373284 376239 380734
56296C80734N353N186M839N043N455N216L977K207R18J161L213N890P293O769
$$ 380734 386087 391273 396112 401155 406610 411826 415803 418010 418928 420089 423302 429192 436485 443254
56282D43254N769O117P694Q694Q087O924O828P997R329J0020J0255J0413J0440
$$ 443254 449023 455140 462834 471528 479615 486539 493367 501364 510693 520713 530968 541381 551821
56269E51821J0426J1113J3162J5992J8077J8748J9146K0849K3823K6588K8343
$$ 551821 562247 573360 586522 602514 620591 639339 658485 679334 703157 729745 758088
56258G58088L0011L2689L6078L9327M2827M7861N4614O1730O8184P4491Q1565
$$ 758088 788099 820788 856866 896193 939020 986881 1041495 1103225 1171409 1245900 1327465
56247A327465Q9201R6505J03192J09585J15536J20089J22299J21890J19084J14092
$$ 1327465 1416666 1513171 1616363 1725948 1841484 1961573 2083872 2205762 2324846 2438938
56237B438938J06849R7097Q4721O9991N3270L4561J3866p899k8924m7774o4139
$$ 2438938 2545787 2642884 2727605 2797596 2850866 2885427 2899293 2891394 2862470 2814696 2750557
56226B750557p8074q9176r7148j02558j06264j08376j08483j06672j03556r9456
$$ 2750557 2672483 2583307 2486159 2383601 2277337 2168961 2060478 1953806 1850250 1750794
56216A750794r4382q8667q2951p7450p1926o6383o1159n6308n1555m6874m2494
$$ 1750794 1656412 1567745 1484794 1407344 1335418 1269035 1207876 1151568 1100013 1053139 1010645
56205A010645l8356l4230l0458k7824k6443k5470k4066k2106j9776j7269j5058
$$ 1010645 972289 938059 907601 879777 853334 827864 803798 781692 761916 744647 729589
56194G29589j3670j2815j1525r540p754o767n958m721l740l879m437l825j882
$$ 729589 715919 703104 691579 682039 674285 667518 661560 656839 653099 649220 644783 640958 639076
56181F39076k55k30j193j639r66J82Q37N08n34j324q69R01K970M229M480M303
$$ 639076 638821 638591 637398 635759 634793 634975 635812 636320 635786 634462 633593 634494 637464 641693 646173 650476
56165F50476M253M485M961N661O629P944R570J1130J2050J2159J2021J2295J2998
$$ 650476 654729 659214 664175 669836 676465 684409 693979 705109 717159 729318 741339 753634 766632
56152G66632J3744J4612J6141J8373K0582K2376K4471K7767L2076L6532M1041
$$ 766632 780376 794988 811129 829502 850084 872460 896931 924698 956774 993306 1034347
56141A034347M6392N2822N9391O5167P0232P5023P9248Q2085Q2917Q1289P6719
$$ 1034347 1080739 1133561 1192952 1258119 1328351 1403374 1482622 1564707 1647624 1728913 1805632
56130A805632O9408O0936N3452M8178M5113M3579M2249L9031L2261K2231J0763
$$ 1805632 1875040 1935976 1989428 2037606 2082719 2126298 2168547 2207578 2239839 2262070 2272833
56119B272833p46j1903k2047k9977l5673m1165m8592n7891o7127p4497p9250q1209
$$ 2272833 2272087 2260184 2238137 2208160 2172487 2131322 2082730 2024839 1957712 1883215 1803965 1722756
56107A722756q0452p7441p2654o6123n7891m8791m0113l2533k5923k0211j5710
$$ 1722756 1642304 1564863 1492209 1426086 1368195 1319404 1279291 1246758 1220835 1200624 1184914
56096A184914j2461r843p210m625k660j523o80O26K482M090M655M407M416N335
$$ 1184914 1172453 1162610 1155400 1150775 1148115 1146592 1145912 1146538 1149020 1153110 1157765 1162172 1166588 1171923
56082A171923O764Q053R186J0403J1381J1502J0850J0365J0891J2343J3887J4687
$$ 1171923 1178687 1186740 1195926 1206329 1217710 1229212 1240062 1250427 1261318 1273661 1287548 1302235
56070A302235J4516J3916J3758J4447J5526J6181J6080J5694J5976J7661K0466
$$ 1302235 1316751 1330667 1344425 1358872 1374398 1390579 1406659 1422353 1438329 1455990 1476456
56059A476456K2978K3887K3559K3770K5382K7070K7054K5524K4321K4512K5386
$$ 1476456 1499434 1523321 1546880 1570650 1596032 1623102 1650156 1675680 1700001 1724513 1749899
56048A749899K5803K5511K4899K4388K4447K5478K7219K8863L0045L1177L2519
$$ 1749899 1775702 1801213 1826112 1850500 1874947 1900425 1927644 1956507 1986552 2017729 2050248
56037B050248L3724L4676L6000L8048L9978M0799M0869M1479M3128M5151M7024
$$ 2050248 2083972 2118648 2154648 2192696 2232674 2273473 2314342 2355821 2398949 2444100 2491124
56026B491124M8996N1191N3002N4056N5073N6991N9563O1691O3165O5262O9314
$$ 2491124 2540120 2591311 2644313 2698369 2753442 2810433 2869996 2931687 2994852 3060114 3129428
56015C129428P5089Q0955Q5474Q8523R1077R4173R8033J02007J05314J08015J11059
$$ 3129428 3204517 3285472 3370946 3459469 3550546 3644719 3742752 3844759 3950073 4058088 4169147
56004D169147J15241J20349J25740J31491J38337J46424J54847J62820J70730
$$ 4169147 4284388 4404737 4530477 4661968 4800305 4946729 5101576 5264396 5435126
55995E435126J79462J89084J98926K08872K19769K32338K46333K61167K77025
$$ 5435126 5614588 5803672 6002598 6211470 6431239 6663577 6909910 7171077 7448102
55986G448102K94711L14655L36749L61283L89269M21271M56356M93126N31874
$$ 7448102 7742813 8057468 8394217 8755500 9144769 9566040 10022396 10515522 11047396
55977A1047396N74954O24779O82198P47369Q21336R05922J002775J113987J243545
$$ 11047396 11622350 12247129 12929327 13676696 14498032 15403954 16406729 17520716 18764261
55968A8764261J397214J581719J806026K083286K428235K850507L351720L930829
$$ 18764261 20161475 21743194 23549220 25632506 28060741 30911248 34262968 38193797
55960C8193797M591511N344961O211023P221306Q416796R833096J1487211J3385809
$$ 38193797 42785308 48130269 54341292 61562598 69979394 79812490 91299701 104685510
55952A04685510J5543279J7970874K0630087K3398064K6072885K8357514K9753546
$$ 104685510 120228789 138199663 158829750 182227814 208300699 236658213 266411759
55945B66411759K9454285K6475838K0139152J0647184p18476j2020353k1444696
$$ 266411759 295866044 322341882 342481034 353128218 352409742 340389389 318944693
55938C18944693k7914068l1221952l1787048l0317264k7567371k4202074k0723710
$$ 318944693 291030625 259808673 228021625 197704361 170136990 145934916 125211206
55931A25211206j7452979j4556740j2094535j0057305q396588p051016n965761
$$ 125211206 107758227 93201487 81106952 71049647 62653059 55602043 49636282
55924D9636282n097940m411825l872844l444654l090409k779070k492587k226169
$$ 49636282 44538342 40126517 36253673 32809019 29718610 26939540 24446953 22220784
55916B2220784j980929j757566j556222j378018j223248j089357r72643q70897
$$ 22220784 20239855 18482289 16926067 15548049 14324801 13235444 12262801 11391904
55908A1391904p82945p06800o39944n80752n28457m82504m42753m09216l80546
$$ 11391904 10608959 9902159 9262215 8681463 8153006 7670502 7227749 6818533 6437987
55899F437987l53968l27782l02815k80312k59746k40024k21496k05008j89967
$$ 6437987 6084019 5756237 5453422 5173110 4913364 4673340 4451844 4246836 4056869
55890D056869j75216j61099j48884j38600j29096j19928j11550j04064r7478r2969
$$ 4056869 3881653 3720554 3571670 3433070 3303974 3184046 3072496 2968432 2870954 2777985
55880B777985r1957r3615r4939r3670q9988q5096p9736p4513p0300o7317o4670
$$ 2777985 2686028 2592413 2497474 2403804 2313816 2228720 2148984 2074471 2004171 1936854 1872184
55869A872184o1584n8440n5983n4167n2391n0375m8197m5806m3107m0269l7588
$$ 1872184 1810600 1752160 1696177 1642010 1589619 1539244 1491047 1445241 1402134 1361865 1324277
55858A324277l5192l3106l1435l0116k8667k6540k3821k1431k0417k0935k1994
$$ 1324277 1289085 1255979 1224544 1194428 1165761 1139221 1115400 1093969 1073552 1052617 1030623
55847A030623k2391k1942k1496k1751k2404k2652k2146k1193k0379k0142k0354
$$ 1030623 1008232 986290 964794 943043 920639 897987 875841 854648 834269 814127 793773
55836G93773k0150j8666j6192j3936j2456j1068r250p694p203p368p263o884o860
$$ 793773 773623 754957 738765 724829 712373 701305 692055 684361 677158 669790 662527 655643 648783
55823F48783p238p667q404r973j1955j3183j3104j2114j0664r037p834p541p655
$$ 648783 641545 633878 625474 615501 603546 590363 577259 565145 554481 545444 537610 530069 522414
55810E22414p236o363n887n797n081l442j883j054k57J271L053M140M365M126
$$ 522414 515178 508815 502928 497131 492050 488608 486725 485671 485414 486685 489738 493878 498243 502369
55796E02369L540K539J399N13n3l50l11p4j11o36j255j522j502j555k030l349
$$ 502369 505909 508448 509847 510360 510307 509957 509646 509572 509461 508825 507570 506048 504546 502991 500961 497612
55780D97612n773q737j1001j1900j1980j2036j2059j1510j0214q401o286m026
$$ 497612 491839 483102 472101 460201 448221 436185 424126 412616 402402 394001 387715 383689
55768C83689j876j30R14Q31n53k592m228n146n832o284n667l746j767j077j586
$$ 383689 381813 381683 382597 383428 382875 380283 376055 370909 365077 358793 353126 349380 347613 346536 344950
55753C44950k474l752o013q922j1113j1720j1113j0084r024q074p378o817n934
$$ 344950 342476 338724 332711 323789 312676 300956 289843 279759 270735 262661 255283 248466 242532
55740B42532m512l006k137k094k298j985j030n2L90M98P57J037O85m26j595k213
$$ 242532 238020 235014 232877 230783 228485 226500 225470 225418 225808 226306 227063 228100 228785 228359 226764 224551
55724B24551k380k409k343k263k378k520k222j618j428j567p84J475L742M223
$$ 224551 222171 219762 217419 215156 212778 210258 208036 206418 204990 203423 202639 204114 207856 212079
55710B12079L187K442K874L702M002L596K478O00j485k809l193l462m175m982
$$ 212079 215266 217708 220582 224284 228286 231882 234360 234960 233475 230666 227473 224011 219836 214854
55696B14854n462n700n703n087l866k783k318k010j412r60j187j524r05O52J922
$$ 214854 209392 203692 197989 192902 189036 186253 183935 181925 180513 179553 178366 176842 175937 176589 178511
55681A78511K053J489J112J126J227J438K062K924L205K372R01k40o70p28p21
$$ 178511 180564 182053 183165 184291 185518 186956 189018 191942 195147 197519 198420 198180 197510 196782 196061
55666A96061n67k43%J10M33J109J684J730J428J144Q32M10L45J162K493L263K846
$$ 196061 195494 195251 195251 195361 195794 196903 198587 200317 201745 202889 203721 204131 204476 205638 208131 211394 214240
55649B14240J576J01j148j897j934j391p90o81j209j984k331j995j672k321l711
$$ 214240 215816 215917 214769 212872 210938 209547 208757 208076 206867 204883 202552 200557 198885 196564 192853
55634A92853m466m013l593m362n382m905l153k077k395k646j658l57j90r39j278
$$ 192853 188387 184374 180781 176419 171037 166132 162979 160902 158507 155861 154203 153846 153656 152717 151439
55619A51439o64K93R19R65L84o36j548j914j774j372q75o43j135k117k647k309
$$ 151439 150775 151068 151987 152952 153336 152700 151152 149238 147464 146092 145217 144574 143439 141322 138675 136366
55603A36366j791j645j259K2J424J585M88n47p80p88j158j514j341r53r68j209
$$ 136366 134575 132930 131671 131693 133117 134702 135190 134643 133863 133075 131917 130403 129062 128109 127141 125932
55587A25932q23N39K152L004K901K516K384K278J854J499J930L111M281N086N931
$$ 125932 125109 125648 127800 130804 133705 136221 138605 140883 142737 144236 146166 149277 153558 158644 164575
55572A64575P010P912Q490R281J0399J0818R556O975M128J362j473l970n443o114
$$ 164575 171585 179497 187987 197268 207667 218485 228041 235016 239144 240506 239033 235063 229620 223506
55558B23506o979q392r651r996r349q015o386m937l936l126k218j520j497j914
$$ 223506 216527 208135 198484 188488 179139 171124 164738 159801 155865 152739 150521 149001 147504 145590
55544A45590k230k529l217l912l685k430j018o5N28P04J02r80j528j136m75o2
$$ 145590 143360 140831 137614 133702 130017 127587 126569 126504 127032 127736 127838 126858 125330 124194 123719 123657
55528A23657M55J329K028K175K223K466K202P53j313k819l274k918k041j134j085
$$ 123657 124112 125441 127469 129644 131867 134333 136535 137288 135975 133156 129882 126964 124923 123789 122704
55513A22704k275l734m087l104j649m55K29J52q13k138l058l463l715l731l112
$$ 122704 120429 116695 112608 109504 107855 107400 107629 107781 106968 104830 101772 98309 94594 90863 87751
55498H7751k059j350j273j409j471j628j863j833j508j225r09l2J330K190J950
$$ 87751 85692 84342 83069 81660 80189 78561 76698 74865 73357 72132 71223 71191 72521 74711 76661
55483G6661J312J352K136K880L050K689J865N37j016k163k526k292j911j661j548
$$ 76661 77973 79325 81461 84341 87391 90080 91945 92482 91466 89303 86777 84485 82574 80913 79365
55468G9365j420j106o72m68p37j133r09K04J608K447K487K030J149m27k442l664
$$ 79365 77945 76839 76167 75699 74962 73829 72920 73124 74732 77179 79666 81696 82845 82418 79976 76312
55452G6312k924n50J765K625K127J330R95J037R64N41O2K3M43O92L11j65J27R22
$$ 76312 73388 72838 74603 77228 79355 80685 81680 82717 83681 84222 84284 84307 84750 85442 85753 85588 85715 86637
55434H6637R49k43j454j427n08J82N07J159K055K232J474Q65J219J814J429R5
$$ 86637 87586 87343 85889 84462 83954 84136 84643 85802 87857 90089 91563 92428 93647 95461 96890 96985
55418I6985q90n67O87J790K228K345K455K085O15j434k497j768l47Q9o93j555
$$ 96985 96095 95528 96215 98005 100233 102578 105033 107118 107733 106299 103802 102034 101687 101776 101083 99528
55402I9528j743j634j699j700j279n77J07P29J231J268O11m24j216j309o76K33
$$ 99528 97785 96151 94452 92752 91473 90896 91003 91732 92963 94231 94842 94418 93202 91893 91217 91450
55386I1450O91L10m86r18p46l92l32p49j505j994j388J40R99j8j795k164j013
$$ 91450 92141 92451 91965 91047 90301 89909 89577 88828 87323 85329 83941 84081 85080 85062 83267 81103 80090
55369H0090m01j300k063j089O61J215M44j92lM62Q10J114J071J93j026j439q08
$$ 80090 79689 78389 76326 75237 75898 77113 77557 77365 77362 77824 78634 79748 80819 81012 79986 78547 77739
55352G7739p0J63K44N30O26R9p83j370j151L1J764K953K659J213o7l57N4O29J246
$$ 77739 77669 77832 78076 78606 79232 79331 78548 77178 76027 76058 77822 80775 83434 84647 84580 84223 84277 84906 86152
55333H6152J748J649P77k81q61j006j209j580j651r40M44J740K120J499O44K59
$$ 86152 87900 89549 90326 90045 89184 88178 86969 85389 83738 82798 83242 84982 87102 88601 89245 89504
55317H9504K13ml61m12j18R4O1L8Q9m9m00o06m55m1N12R56O90n97k046k228q35
$$ 89504 89717 89713 89352 88940 88822 88916 88977 89015 89104 89055 88655 88049 87594 87553 88065 89021 89711 89114 87068 84840 84005
55296H4005R75K070K348K137J591J117J408K409L046K551J430N12j81q04q60j4
$$ 84005 84980 87050 89398 91535 93126 94243 95651 98060 101106 103657 105087 105599 105418 104614 103754 103740
55280A03740P97L07j161j968j397n40o39j449j786j153j62L86L81K58K94K39k82
$$ 103740 104537 104844 103683 101715 100318 99778 99139 97690 95904 94751 94589 94975 95356 95614 95908 96147 95865
55263I5865j085j427q42K18Q41O20j8l75j63K91M14L7k98R4J094J802J587P65
$$ 95865 94780 93353 92511 92729 93570 94190 94172 93797 93634 93925 94339 94376 94078 94172 95266 97068 98655 99420
55245I9420j8o45j287j788j833j565j394j259o73L48R78M43j021k354k610j654
$$ 99420 99402 98757 97470 95682 93849 92284 90890 89631 88958 89306 90284 90727 89706 87352 84742 83088
55229H3088j37J043J345R22M22M54J121J955K295J804P38l34r46r49n18r1j17
$$ 83088 82951 83994 85339 86261 86683 87137 88258 90213 92508 94312 95050 94716 93770 92821 92303 92212 92095
55212I2095o11j044r77o05l80l29j97m8p1PO21J449J681J250R37J044R71M83L31
$$ 92095 91484 90440 89463 88858 88478 88149 87952 87904 87833 87840 88461 89910 91591 92841 93778 94822 95793 96276 96607
55193I6607J033J892K050J712J448J009q6j298j554p26L15R33J139R31J80q26
$$ 96607 97640 99532 101582 103294 104742 105751 105665 104367 102813 102087 102402 103335 104474 105405 105585 104759
55177A04759j574j997k308k359j943j519j761k418k528j767p55m3L68N53N92R24
$$ 104759 103185 101188 98880 96521 94578 93059 91298 88880 86352 84585 83830 83787 84155 84708 85300 86224
55161H6224J849K653K287R34j65n22p95j231j078p6P99Q84Q57J302J414L62r67
$$ 86224 88073 90726 93013 93947 93782 93260 92465 91234 90156 90080 90879 91763 92620 93922 95336 95698 94731
55144I4731r70M15J723J977J467P13j69r37j083n76J4L37O13R96J185R50N51L06
$$ 94731 93761 94176 95899 97876 99343 100056 99887 98950 97867 97291 97305 97642 98255 99251 100436 101386 101937 102243
55126A02243P0m21r59q93M6J210J490N05q94j642j746k027k596k438q81J232K517
$$ 102243 102313 101892 100933 100040 100086 101296 102786 103291 102397 100755 99009 96982 94386 91948 91067 92299 94816
55109I4816K595J964Q60p41k220k478j301K10Q91O84L09K35L80M70M13L44M29
$$ 94816 97411 99375 100235 99494 97274 94796 93495 93705 94596 95280 95589 95824 96204 96674 97087 97431 97860
55092I7860N91N51K67J77O48J400J824J712J278O33j32m78J97J540K315J855P87
$$ 97860 98451 99002 99269 99446 100094 101494 103318 105030 106308 106941 106809 106331 106528 108068 110383 112238 113025
55075A13025l4p11j760k873l077k017l91R64J753J881J146k35j279j080N5Q78
$$ 113025 112991 112280 110520 107647 104570 102553 102162 103126 104879 106760 107906 107671 106392 105312 105367 106245
55059A06245O45j33n16k55J94L74J41m54j113j222m30P15J224R25O84J117J579
$$ 106245 106890 106757 106241 105986 106180 106554 106695 106241 105128 103906 103476 104191 105415 106340 107024 108141 109720
55042A09720J011n80k006k165j029O23J912K266J613M83l04l75j68l06o39l35
$$ 109720 110731 110151 108145 105980 104951 105574 107486 109752 111365 111848 111544 111169 111001 110695 110056 109721
55026A09721Q94J966J434o40k548k998k643k776l138k289o8J696J554L26k85j38
$$ 109721 110615 112581 114015 113375 110827 107829 105186 102410 99272 96983 96915 98611 100165 100491 100206 100068
55010A00068m91j810k910k473n31J722L002K757J439J66k43NJ69k6k87m37n43
$$ 100068 99577 97767 94857 92384 91853 93575 96577 99334 100773 100939 100696 100701 100870 100844 100557 100120 99577
54993I9577m78k9N16N49J06J3P65J716J801P83n20j040l57J042K217K583K244
$$ 99577 99099 99070 99586 100135 100241 100254 101019 102735 104536 105319 104799 103759 103402 104444 106661 109244 111488
54976A11488J563O84k65q51p20j78J86K99N23Q97J089J064J143J300J080L59m69
$$ 111488 113051 113735 113470 112619 111899 111721 111907 112206 112729 113626 114715 115779 116922 118222 119302 119661 119192
54959A19192j179j891k371j926m37J123J688J233N49K83N05P91M97o52j985k410
$$ 119192 118013 116122 113751 111825 111388 112511 114199 115432 115981 116264 116769 117560 118057 117405 115420 113010
54943A13010j749r90r24j163q80K0J064J908K371K226J533Q43N49M43K89L75Q94
$$ 113010 111261 110271 109347 108184 107304 107324 108388 110296 112667 114893 116426 117269 117818 118261 118550 118925 119819
54926A19819J321J069M00M1K28P28J437K294K979L397M132N596P046P249N983
$$ 119819 121140 122209 122609 122650 122878 123606 125043 127337 130316 133713 137845 143441 150487 157736 163719
54911A63719M156K578J403N47j09r05k048l179l910m558n535o328o056m892l848
$$ 163719 167875 170453 171856 172403 172294 171389 169341 166162 162252 157694 152159 145831 139775 134883 131035
54896A31035l133j970k35Q88M64q75j697j298k8J216J597R38K7j92K46O43Q95
$$ 131035 127902 125932 125697 126585 127049 126174 124477 123179 123151 124367 125964 126902 126929 126737 126983 127626 128521
54879A28521J514K324K407J682J368K286L719M558M606M176L390K621K549K957
$$ 128521 130035 132359 134766 136448 137816 140102 143821 148379 152985 157161 160551 163172 165721 168678
54865A68678K463M03j924k950k937l200m005m513m259l410k056n35R1p99k103
$$ 168678 171141 171544 169620 166670 163733 160533 156528 152015 147756 144346 142290 141755 141846 141047 138944
54850A38944k352j936k378l634l959k752j605j875k710k426p37J286K534K405
$$ 138944 136592 134656 132278 128644 124685 121933 120328 118453 115743 113317 112580 113866 116400 118805
54836A18805Q88j038j778p55P84J203L02q66j517j772k014k210j917p78Q86K073
$$ 118805 119693 118655 116877 116122 116906 118109 118411 117545 116028 114256 112242 110032 108115 107337 108223 110296
54820A10296K010J013k1o88j054q74N0R28P10q1K55J899K766J401p51j287j3J245
$$ 110296 112306 113319 113298 112610 111556 110682 110732 111660 112370 112289 112544 114443 117209 118610 117859 116572 116559 117804
54802A17804J293N91j4k14j3L62L35l60j045r09k08K08J99K92N76O38M69M79O95
$$ 117804 119097 119688 119674 119460 119447 119809 120144 119784 118739 117830 117622 117830 118029 118321 118897 119535 120004 120483 121178
54783A21178P75O97O32L10n05j106m94J057K154K064J440J171J400J828K128K021
$$ 121178 121953 122650 123282 123592 123087 121981 121487 122544 124698 126762 128202 129373 130773 132601 134729 136750
54767A36750J674J893L089M264M259L652L977N128N308L896K465K217K183J059
$$ 136750 138424 140317 143406 147670 151929 155581 159558 164686 169994 173890 176355 178572 180755 181814
54753A81814o85j950k947m420n856o073n093l990l228k465j661j126o63Q5O11
$$ 181814 181129 179179 176232 171812 165956 159883 154790 150800 147572 145107 143446 142320 141657 141742 142353
54738A42353P3j219j950j579q55n16m88n24o77q56p54m95n57q59o35M67J856K862
$$ 142353 142426 141207 139257 137678 136823 136307 135819 135295 134618 133762 133008 132513 131956 131097 130462 130929 132785 135647
54720A35647L448L779L804L648L836M603N320N085L688J754J30p30j027j384k191
$$ 135647 139095 142874 146678 150326 154162 158765 164085 169170 172858 174612 174742 174012 172985 171601 169410
54705A69410l118l556l396l032k725k493k491k874l238k874j738o71l93q06j355
$$ 169410 166292 162736 159340 156308 153583 151090 148599 145725 142487 139613 137875 137204 136811 136005 134650
54690A34650j607j426j084j266k283l260k961j581p09j096j572r08J98J54j113
$$ 134650 133043 131617 130533 129267 126984 123724 120763 119182 118473 117377 115805 114897 115095 115249 114136
54675A14136k010j401K24J667K198J670M06p10p43K72J235J218M07m01p77p24
$$ 114136 112126 110725 110949 112616 114814 116484 116890 116180 115437 115709 116944 118162 118569 118168 117391 116667
54659A16667k45O40J529J826J428R29R64J440J634J058J01l90j45J37l47j396
$$ 116667 116422 117062 118591 120417 121845 122774 123738 125178 126812 127870 127971 127581 127436 127573 127226 125830
54643A25830j936j323j65L49j61r41j081m72L02P78R68J103J327J688K044J982
$$ 125830 123894 122571 122406 122755 122594 121653 120572 120100 120402 121180 122148 123251 124578 126266 128310 130292
54627A30292J154j23r87r86n70l95n16o51q13j116j275j013p03q19r25j44J300
$$ 130292 131446 131323 130336 129350 128780 128385 127869 127218 126405 125289 124014 123001 122298 121479 120554 120410 121710
54610A21710K132J826J324J403J474P92j25l81l05p94j554j505p72p12j550j557
$$ 121710 123842 125668 126992 128395 129869 130661 130536 130155 129850 129056 127502 125997 125225 124513 122963 121406
54594A21406M74L107L800K027k76j193o69J48M23J21l52m45K82J609K529K073
$$ 121406 121880 124987 128787 130814 130538 129345 128676 128824 129247 129368 129016 128571 128853 130462 132991 135064
54578A35064M51r83j073q1O41J35j182k076j804o80M72J102J039K90q96j830j787
$$ 135064 135515 134532 133459 133378 134019 134154 132972 130896 129092 128412 128884 129986 131025 131315 130419 128589 126802
54561A26802p87K45N12K93M79J225J642J049J1m10pN86J015J505J967J747P20
$$ 126802 126015 126260 126772 127065 127544 128769 130411 131460 131471 131061 131054 131640 132655 134160 136127 137874 138594
54544A38594n7N34K258L876M638M760M498L537J591q76k901l816l676k984k165
$$ 138594 138537 139071 141329 145205 149843 154603 159101 162638 164229 163353 160452 156636 152960 149976 147811
54529A47811j277k84M77L57p42j913k048j096k2M36M67N30N96M21R4q9j06j03
$$ 147811 146534 146250 146727 147084 146342 144429 142381 141285 141263 141699 142166 142696 143292 143713 143807 143718 143612 143509
54511A43509NL53O35K97o33j361j251o53l89n86n53J54R66J043L94j94k97l05
$$ 143509 143514 143867 144502 144799 144166 142805 141554 140901 140512 139926 139373 139527 140493 141536 141930 141736 141439 141134
54493A41134o60j096j018l08O02J254J433J052J83p62j266j102l87O81J853K656
$$ 141134 140474 139378 138360 138052 138654 139908 141341 142393 142576 141814 140548 139446 139059 139740 141593 144249
54477A44249K552J515J80o93q50o10m30m41l25L06J330K026J753O30n79j147q32
$$ 144249 146801 148316 148496 147803 146953 146343 145913 145472 145147 145453 146783 148809 150562 151192 150613 149466 148634
54460A48634J15J094J469J061L46j25l50o93j181j428j190o21K0N06N56Q6m66
$$ 148634 148749 149843 151312 152373 152719 152594 152244 151551 150370 148942 147752 147131 147151 147657 148213 148299 147833
54443A47833n59l56m82r11q29L9O98J48j071j505p42R7K3m32m6J279K284K074
$$ 147833 147274 146918 146436 145525 144696 144735 145433 145581 144510 143005 142263 142360 142383 141951 141905 143184 145468 147542
54425A47542J291J141J572J353N2j022n40R25J590Q24l02o76l32J94N92M82n70
$$ 147542 148833 149974 151546 152899 152951 151929 151389 152314 153904 154728 154426 153750 153418 153612 154204 154686 154116
54408A54116k065k528j234O60J550J312R97J139J460J801K227K330J600N57M64
$$ 154116 152051 149523 148289 148949 150499 151811 152808 153947 155407 157208 159435 161765 163365 163922 164386
54393A64386J582K581K152N14j101j869j887j671j566j434q02M35J432J057o62
$$ 164386 165968 168549 170701 171215 170114 168245 166358 164687 163121 161687 160885 161320 162752 163809 163147
54378A63147k292k510j474l14K84M50L34l50j696k889k644n87K041L476L183K152
$$ 163147 160855 158345 156871 156557 156841 157291 157625 157275 155579 152690 150046 149459 151500 154976 158159 160311
54362A60311J445J131R55J179J976K667K528K026K057K320J763N35N2P68J440
$$ 160311 161756 162887 163842 165021 166997 169664 172192 174218 176275 178595 180358 180893 180945 181713 183153
54347A83153J167Q06J417K517K993K745K221J198o43k519l341l346l564m012l802
$$ 183153 184320 185126 186543 189060 192053 194798 197019 198217 197574 195055 191714 188368 184804 180792 176990
54332A76990k944k523k861k954k178j285j114j319j112m17L91J156J690J519O42
$$ 176990 174046 171523 168662 165708 163530 162245 161131 159812 158700 158283 158674 159830 161520 163039 163681
54317A63681n8N4K64o06k381l513k881j058L90M25p10j897k111j171K37J260J493
$$ 163681 163623 163677 163941 163335 160954 157441 154560 153502 153892 154317 153607 151710 149599 148428 148665 149925 151418
54300A51418J097N99N90J251J991J845N11j234k313k343j710r60m01q6J27M26
$$ 151418 152515 153114 153704 154955 156946 158791 159302 158068 155755 153412 151702 150742 150341 150255 150382 150808
54284A50808Q69J350J724J749J119o1q98n03P57J494J074M02M82R48Q21J08l08
$$ 150808 151677 153027 154751 156500 157619 157558 156660 156157 156914 158408 159482 159884 160366 161314 162135 162243 161935
54267A61935j01K00K17J76J42l38j486k699l078k309q27O01J341J274Q34O08Q57
$$ 161935 161834 162034 162251 162427 162569 162231 160745 158046 154968 152659 151832 152433 153774 155048 155882 156490 157347
54250A57347J539K432K946K205N7k221k951j829j24R87J418J507J224N59p0l16
$$ 157347 158886 161318 164264 166469 166526 164305 161354 159525 159401 160388 161806 163313 164537 165096 165026 164710
54234A64710l77m65l73m9q1r14j960k297j960j723j662r09R04K714L078J830J99
$$ 164710 164333 163868 163495 163446 163365 162451 160491 158194 156234 154511 152849 151940 152844 155558 158636 160466 160665
54217A60665n24j34N77P83L61k11n34p00r47j104p95n0N63N68O8n01q81j072j122
$$ 160665 160141 160007 160584 161367 161728 161517 160983 160283 159336 158232 157437 157387 157950 158518 158586 158085 157204 156132 155010
54198A55010j019p60l24K76Q36R96O66K52K13L91K54k86o48m61j45k60o26n90
$$ 155010 153991 153231 152907 153183 154019 155015 155681 155933 156146 156537 156791 156505 155857 155396 155251 154991 154365 153775
54180A53775j7O37J079J320J028l56k450l714l037j083O69J632K039J713K60j592
$$ 153775 153758 154395 155474 156794 157822 157466 155016 151302 148265 147182 147851 149483 151522 153235 153495 151903
54164A51903k163q93Q05J378R59O17N61J15r02j786j984j661j112k70R53K261
$$ 151903 149740 148847 149652 151030 151989 152606 153167 153282 152380 150594 148610 146949 145837 145567 146520 148781
54148A48781L159L254K349O57r70j497p28L42N83l4m60J14J299J949J462L66l50
$$ 148781 151940 155194 157543 158200 157230 155733 155005 155347 155930 155896 155436 155550 156849 158798 160260 160626 160276
54131A60276k86J77M96M62J49k56n19n79p27j205j635j368n01J42K33M40J202
$$ 160276 159990 160167 160663 161125 161274 161018 160499 159920 159193 157988 156353 154985 154484 154626 154859 155299 156501
54114A56501J869J811J682K391L265K638M04j461j382j15N62J33o01j029j217
$$ 156501 158370 160181 161863 164254 167519 170157 170561 169100 167718 167603 168165 168298 167697 166668 165451
54099A65451j166o76K6K81j05n59n01L4O99J293J719J830J587J185Q27N68M74
$$ 165451 164285 163609 163635 163916 163811 163252 162751 162785 163484 164777 166496 168326 169913 171098 171925 172493 172967
54082A72967O88J095J185N75l87q52l74N95J251J319J220J425J810J789J057O7
$$ 172967 173655 174750 175935 176510 176123 175271 174897 175492 176743 178062 179282 180707 182517 184306 185363 185430
54066A85430l16L12J415J977J510O24M71J581L391M974N981O607O854O437N481
$$ 185430 185114 185426 186841 188818 190328 190952 191423 193004 196395 201369 207350 213957 220811 227248 232729
54051B32729M705M450L972K344j31k140l037l462l995m017k683n57P92P85N19
$$ 232729 237434 241884 245856 248200 248069 245929 242892 239430 235435 231418 228735 228178 228970 229755 230274
54036B30274J144K399L302L612L871M228M165L460K745K773L476M032L742K650
$$ 230274 231418 233817 237119 240731 244602 248830 252995 256455 259200 261973 265449 269481 273223 275873
54022B75873J412O55M53L76O0m91j187k013k738k882k485k446l351m278l813k196
$$ 275873 277285 277940 278393 278769 278829 278338 277151 275138 272400 269518 267033 264587 261236 256958 253145 250949
54006B50949j283k132l681m420m236l825l196k008p74m93j237k213k991l644l778
$$ 250949 249666 247534 243853 239433 235197 231372 228176 226168 225394 224901 223664 221451 218460 214816 211038
53991B11038k687p03P17O84k03r98j561k064k185j567m79N41J333J773J478M65
$$ 211038 208351 207648 208365 209049 208846 207848 206287 204223 202038 200471 199992 200533 201866 203639 205117 205582
53975B05582k67J66J104R32p70k461k403o24J304K120J923J477J029L16m69m62
$$ 205582 205315 205481 206585 207517 206747 204286 201883 201259 202563 204683 206606 208083 209112 209428 208959 208497
53959B08497P99K495L383L370L524M459N473N574M722L616K808K461K553K697
$$ 208497 209296 211791 215174 218544 222068 226527 232000 237574 242296 245912 248720 251181 253734 256431
53945B56431K228J063J27K63J029J357J153J268J946K330J852J198J335K220L074
$$ 256431 258659 259722 259849 260112 261141 262498 263651 264919 266865 269195 271047 272245 273580 275800 278874
53930B78874L461L526L445L236K961K663K273J938K187L265M529N156N320N920
$$ 278874 282335 285861 289306 292542 295503 298166 300439 302377 304564 307829 312358 317514 322834 328754
53916C28754P158Q204Q524Q671R291J0112J0596J0941J1550J1982J1552J0733
$$ 328754 335912 344116 352640 361311 370602 380714 391310 402251 413801 425783 437335 448068
53904D48068J0687J1260J0620P454K500k657p321j1464j4637j6295j6665j6361
$$ 448068 458755 470015 480635 488089 490589 487932 480611 469147 454510 438215 421550 405189
53892D05189j5458j3911j2396j1610j1013r557p540o412o663p254p421p627q136
$$ 405189 389731 375820 363424 351814 340801 331244 323704 317292 310629 303375 295954 288327 280191
53879B80191q075o796n057l884l119k133j135o49m18oNj245l180m149l536k373
$$ 280191 272116 265320 260263 256379 253260 251127 249992 249343 248925 248919 248924 247679 244499 240350 236814 234441
53863B34441j829j984k339k548k459k066j703j664j627j067k49L8k72m27j59j21
$$ 234441 232612 230628 228289 225741 223282 221216 219513 217849 216222 215155 214906 214944 214672 214245 214086 213965
53847B13965o36r91n38J87K36m01r11q40n55o13j128j668j609p32M16J036J000
$$ 213965 213329 212338 211800 211987 212223 211822 210911 210071 209516 208903 207775 206107 204498 203766 204182 205218 206218
53830B06218Q27O62k3j304k135j479K40J653K177K421K877L049K302J001J85K24
$$ 206218 207045 207707 207684 206380 204245 202766 203006 204659 206836 209257 212134 215183 217485 218486 218671 218895
53814B18895L73j21q63p33N86K143L037L605M649N879O112M997L534K609K032
$$ 218895 219268 219147 218284 217551 218137 220280 223317 226922 231571 237450 243562 248559 252093 254702 256734
53799B56734J585J986L724N599N722L866J767R79J399K057K387K198J311o3j033
$$ 256734 258319 260305 264029 269628 275350 279216 280983 281962 283361 285418 287805 290003 291314 291251 290218
53784B90218r07j01M02L22J66J76m8q46j969l029l884m351m111l355l040l761
$$ 290218 289311 289210 289612 289934 290100 290276 290228 289382 287413 284384 280500 276149 272038 268683 265643 261882
53768B61882m729m683l689l094l586m255m004l001j971r75J09M33j021l472m603
$$ 261882 257153 252470 248781 245687 242101 237846 233842 230841 228870 227895 228004 228437 227416 223944 219341
53753B19341l349j359q51j798k224r44J044J933J117n08j679j802j059l7O56N99
$$ 219341 215992 214633 213782 211984 209760 208816 209860 211793 212910 212402 210723 208921 207862 207825 208481 209080
53737B09080j74j017j062j18J039J507J288J015Q95O30L55P79K018K984K560R15
$$ 209080 208906 207889 206827 206709 207748 209255 210543 211558 212453 213083 213438 214217 216235 219219 221779 222694
53721B22694q47j851j761m35J787L783M406L708K764K345K293K194J983J761J578
$$ 222694 221847 219996 218235 217800 219587 223370 227776 231484 234248 236593 238886 241080 243063 244824 246402
53706B46402J608K038K676L095L241L422L567L201K370J902K298K899K794K109
$$ 246402 248010 250048 252724 255819 259060 262482 266049 269250 271620 273522 275820 278719 281513 283622
53692B83622J713J890K126K131K208K405K112J004j34l65r5p31k633m289m066
$$ 283622 285335 287225 289351 291482 293690 296095 298207 299211 299077 298712 298617 297886 295253 290964 286898
53677B86898k275o61j10Q1N27N22p73k578l132j930l76J17j89p8P96J485J116
$$ 286898 284623 283962 283852 283933 284460 284982 284209 281631 278499 276569 276193 276310 276121 276043 276839 278324 279440
53660B79440J04k95M42J310Q34j047k633k377p84K48j45r14q01NN54Q15J605K998
$$ 279440 279544 279249 279691 281001 281835 280788 278155 275778 274994 275242 275097 274183 273382 273387 273941 274756 276361 279359
53642B79359L759K768N37j133r15Q04K474K997K623K218J981J414M87K5N82J516
$$ 279359 283118 285886 286423 285290 284375 285179 287653 290650 293273 295491 297472 298886 299373 299398 299980 301496
53626C01496J880J764J960K526K635J966J356J738L016M373N112M914L830K537
$$ 301496 303376 305140 307100 309626 312261 314227 315583 317321 320337 324710 329822 334736 338566 341103
53612C41103K200L395N313O494O246N041L746K902K644K837L163L273K966K239
$$ 341103 343303 346698 352011 358505 364751 369792 373538 376440 379084 381921 385084 388357 391323 393562
53598C93562J381J016J613K699L160K621K002K058K055Q48j125k239k034j902
$$ 393562 394943 395959 397572 400271 403431 406052 408054 410112 412167 413015 411890 409651 407617 405715
53584D05715k932m242m269k938j642j446k108k787l065l198l648m373m564l477
$$ 405715 402783 398541 394272 391334 389692 388246 386138 383351 380286 377088 373440 369067 364503 361026
53570C61026j546r1K84L09P51J255J149O11K03j59p30r42p2J346J967J537J091
$$ 361026 359480 359389 359673 359982 360733 361988 363137 363748 363951 363792 363062 362120 362048 363394 365361 366898 367989
53553C67989J176J088L92l4Q06K542L985M585M710M814N010N214N246M927M373
$$ 367989 369165 370253 370645 370611 371417 373959 377944 382529 387239 392053 397063 402277 407523 412450 416823
53538D16823L974L926M159M777O022P551Q458Q417Q224Q681R612J0522J1571J3069
$$ 416823 420797 424723 428882 433659 439681 447232 455690 464107 472331 481012 490624 501146 512717 525786
53524E25786J4565J5375J5761J6540J7608J7881J6956J5909J6041J7376J8946
$$ 525786 540351 555726 571487 588027 605635 623516 640472 656381 672422 689798 708744
53513G08744K0126K1110K2204K3241K3902K4353K5076K5983K6190K5122K3616
$$ 708744 728870 749980 772184 795425 819327 843680 868756 894739 920929 946051 969667
53502I69667K3189K4149K5183K5018K3777K2228K0565J8695J7183J6867J7763
$$ 969667 992856 1017005 1042188 1067206 1090983 1113211 1133776 1152471 1169654 1186521 1204284
53491A204284J9093K0224K0826K0479J9070J7594J7446J8593J9295J8085J5464
$$ 1204284 1223377 1243601 1264427 1284906 1303976 1321570 1339016 1357609 1376904 1394989 1410453
53480A410453J3223J2468J2676J2460J1002Q827P080O003M566J941j226l851o241
$$ 1410453 1423676 1436144 1448820 1461280 1472282 1481109 1488189 1494192 1498758 1500699 1499473 1495622 1489381
53467A489381r544j3494j6205j6659j6068j6019j6411j6282j5797j6067j7484
$$ 1489381 1479837 1466343 1450138 1433479 1417411 1401392 1384981 1368699 1352902 1336835 1319351
53456A319351j9371k1118k2573k3431k3248k2316k1553k1305k0895j9692j8075
$$ 1319351 1299980 1278862 1256289 1232858 1209610 1187294 1165741 1144436 1123541 1103849 1085774
53445A085774j6918j6501j6204j5050j2511r081o051m328l454k331q35O6L9K12
$$ 1085774 1068856 1052355 1036151 1021101 1008590 999509 993458 989130 985676 983345 982510 982576 982615 982827
53431I82827J587L389M133L945M483O445Q541R613J0630J3285J7270K0348K1126
$$ 982827 984414 987803 991936 995881 1000364 1006809 1015350 1024963 1035593 1048878 1066148 1086496 1107622
53418A107622K0528K0152K0442K1138K2510K4992K8054L0661L2687L4872L7321
$$ 1107622 1128150 1148302 1168744 1189882 1212392 1237384 1265438 1296099 1328786 1363658 1400979
53407A400979L9138L9879M0417M1801M3870M5744M7230M8976N1264N3345N4234
$$ 1400979 1440117 1479996 1520413 1562214 1606084 1651828 1699058 1748034 1799298 1852643 1906877
53396A906877N3898N3464N4162N6108N8048N8518N7248N5299N3757N2634N1149
$$ 1906877 1960775 2014239 2068401 2124509 2182557 2241075 2298323 2353622 2407379 2460013 2511162
53385B511162M8835M6026M3355M0997L8484L5152L0801K5932K1278J7159J3359
$$ 2511162 2559997 2606023 2649378 2690375 2728859 2764011 2794812 2820744 2842022 2859181 2872540
53374B872540R425M857p35p283j4091k0433k6301l2172l8057m3402m7883n1607
$$ 2872540 2881965 2886822 2886087 2878804 2864713 2844280 2817979 2785807 2747750 2704348 2656465 2604858
53362B604858n4344n5479n5203n4934n5812n7223n7649n6527n4478n2009m9093
$$ 2604858 2550514 2495035 2439832 2384898 2329086 2271863 2214214 2157687 2103209 2051200 2002107
53351B002107m6102m4013m3214m2852m1920m0568l9734l9748l9852l9085l7320
$$ 2002107 1956005 1911992 1868778 1825926 1784006 1743438 1703704 1663956 1624104 1585019 1547699
53340A547699l5242l3452l1762k9424k6128k2560j9752j7980j6611j5083j3615
$$ 1547699 1512457 1479005 1447243 1417819 1391691 1369131 1349379 1331399 1314788 1299705 1286090
53329A286090j2767j2667j3011j3602j4463j5411j5871j5243j3338j0540p770
$$ 1286090 1273323 1260656 1247645 1234043 1219580 1204169 1188298 1173055 1159717 1149177 1141407
53318A141407o183o279p123o899m825k116m81O8R62K735M244M722N263P197R888
$$ 1141407 1135224 1128945 1121822 1114923 1110098 1107982 1107501 1107569 1108531 1111266 1115510 1120232 1125495 1132692 1142580
53303A142580J1708J2672J4395J7370K0063K1284K1881K3199K5072K6472K7156
$$ 1142580 1154288 1166960 1181355 1198725 1218788 1240072 1261953 1285152 1310224 1336696 1363852
53292A363852K7521K7554K7167K6918K7165K6912K4914K1719J9160J7866J6618
$$ 1363852 1391373 1418927 1446094 1473012 1500177 1527089 1552003 1573722 1592882 1610748 1627366
53281A627366J4334J1306Q113M589O30l103o025q503j1066j3478j5289j6789j8587
$$ 1627366 1641700 1653006 1661119 1665708 1666338 1663235 1657210 1648707 1637641 1624163 1608874 1592085 1573498
53268A573498k0674k2604k4324k6072k7721k8839k9276k9154k8500k7490k6877
$$ 1573498 1552824 1530220 1505896 1479824 1452103 1423264 1393988 1364834 1336334 1308844 1281967
53257A281967k7453k8978l0227l0234k9159k7896k7177k7151k7463k7613k7401
$$ 1281967 1254514 1225536 1195309 1165075 1135916 1108020 1080843 1053692 1026229 998616 971215
53246I71215k7003k6499k5545k3931k2264k1498k1682k1721k0650j8707j6901
$$ 971215 944212 917713 892168 868237 845973 824475 802793 781072 760422 741715 724814
53235G24814j5816j5211j4567j3626j2392j1032r792q893q387q211q340q751r285
$$ 724814 708998 693787 679220 665594 653202 642170 632378 623485 615098 606887 598547 589796 580511
53222E80511r732j0120j0660j1359j1911j2156j2434j3131j3974j4100j2945j0788
$$ 580511 570779 560659 549999 538640 526729 514573 502139 489008 475034 460934 447989 437201
53210D37201q369o356n240n331o356p321p279o352n569n690o498p308p774p972
$$ 437201 428832 422476 417236 411905 405549 398228 390949 384597 379028 373338 366840 359532 351758 343786
53196C43786p962p679p129o432n607m483l005j587r88j627k987l957l877l069
$$ 343786 335824 328145 321016 314584 308977 304494 301489 299902 298914 297287 294300 290343 286466 283397
53182B83397k215j589j230j489k623l929m075k633p29K41J44j29r5k00r43j984
$$ 283397 281182 279593 278363 276874 274251 270322 266247 263614 262885 263126 263270 263141 263046 262846 261903 259919
53166B59919k418j764n09M06N95N63Q80J197N96j043k578k893k205j598j541j446
$$ 259919 257501 255737 255228 255634 256229 256792 257672 258869 259465 258422 255844 252951 250746 249148 247607 246161
53150B46161o74N76J517J563P47m49j488k119k329k019j035K98J137J038O12P01
$$ 246161 245487 246063 247580 249143 249890 249441 247953 245834 243505 241486 240451 240749 241886 242924 243536 244237
53134B44237J130J068M61K22P55J274J054N34M26N15K80J08O94J447Q75j160k860
$$ 244237 245367 246435 246896 247118 247873 249147 250201 250735 251161 251676 251956 252064 252758 254205 255080 253920 251060
53117B51060k672j090M23J281J640J252j76j781k128j115j19J1o8M01R55Q11J60
$$ 251060 248388 247298 247721 249002 250642 251894 251718 249937 247809 246694 246575 246586 246518 246919 247874 248685 248845
53100B48845l78r02j804k657k599j659p46l50j58M5N0o9J12M50J80q30j518r70
$$ 248845 248467 247565 245761 243104 240505 238846 238100 237750 237592 237637 237687 237618 237730 238180 238360 237530 236012 235042
53082B35042M19J632K283K505K172J121j61q80r09q04r35j183j489j899k113j599
$$ 235042 235461 237093 239376 241881 244053 245174 245013 244133 243224 242420 241485 240302 238813 236914 234801 233202
53066B33202m29N46O39Q5l94m20j55J14K89M41O75J007J338J572J700J746J739
$$ 233202 232773 233319 233958 234043 233649 233229 233074 233188 233477 233918 234593 235600 236938 238510 240210 241956 243695
53049B43695J824K138K421K073R55j87n55m60r28k228l448l711l160k419j715
$$ 243695 245519 247657 250078 252151 253106 252919 252364 251904 250976 248748 245300 241589 238429 236010 234295
53034B34295j055p08q34r48m47L97P05L11J27R01K104K542J773M60n28q62n98
$$ 234295 233240 232532 231698 230750 230303 230700 231405 231716 231843 232744 234848 237390 239163 239623 239095 238233 237635
53017B37635J45J089J614J221J65o17l54Q14J957K105R81q07k221k581k009j081
$$ 237635 237780 238869 240483 241704 241869 241252 240898 241712 243669 245774 246755 245948 243727 241146 239137 238056
53001B38056j45Q09J674K029J602O37l95j234j738j635p46O24J801K278J922R56
$$ 238056 237911 238720 240394 242423 244025 244662 244267 243033 241295 239660 238914 239538 241339 243617 245539 246495
52985B46495l3l21L30J370K084K316K207J616M48o20o75J21O07K65m9N88J924
$$ 246495 246462 246141 246471 247841 249925 252241 254448 256064 256512 255892 255217 255338 255945 256210 256161 256749 258673
52968B58673L082L694L782L200K048J079Q18O51k60j394j401j47R05O23m98j371
$$ 258673 261755 265449 269231 272431 274479 275558 276376 277027 276767 275373 273972 273825 274730 275353 274855 273484
52952B73484j651j556j235r96j459k596l226k358p07O9n57j549j825j308m02O61
$$ 273484 271833 270277 269042 268046 266587 263991 260765 258407 257700 257769 257212 255663 253838 252530 252128 252789
52936B52789J533J590N86q79j988k467k469k044j243n14m58j120j799j689o30
$$ 252789 254322 255912 256498 255619 253631 251164 248695 246651 245408 244894 244436 243316 241517 239828 239198
52921B39198P83J748J928J589J108N90J7m76p78j037j290j165m81O4l18j098q79
$$ 239198 239981 241729 243657 245246 246354 246944 246961 246485 245707 244670 243380 242215 241734 241798 241480 240382 239503
52904B39503M97J427Q05l40m96l6m34j620j843l13J521J926R27j97n48l6J018
$$ 239503 240000 241427 242232 241892 241396 241360 240926 239306 237463 237150 238671 240597 241524 241327 240779 240743 241761
52887B41761J976K107J471J031J283J333J75j620k478j862p71k43k48k51o3J95
$$ 241761 243737 245844 247315 248346 249629 250962 251137 249517 247039 245177 244406 244163 243915 243664 243601 243796
52871B43796M20N00L48J63L40R17J438J459R79L37J5M35J513K400K237J262O31
$$ 243796 244216 244716 245064 245227 245567 246484 247922 249381 250360 250697 250712 251147 252660 255060 257297 258559 259190
52854B59190R21J478J481J041O72K32p78k220l339l776l835l742l350k712k306
$$ 259190 260111 261589 263070 264111 264783 265015 264237 262017 258678 254902 251067 247325 243975 241263 238957
52839B38957k371k543k514k564k906l047k334r98J06O49J060J576J833J649J507
$$ 238957 236586 234043 231529 228965 226059 223012 220678 219680 219786 220435 221495 223071 224904 226553 228060
52824B28060J730J764R05n23j456j379p37j16L47O78P50N36K06j33m52n55j94
$$ 228060 229790 231554 232459 231936 230480 229101 228364 228248 228595 229273 230023 230559 230765 230632 230180 229625 229431
52807B29431M47Q74R86J120J261Q77j89j228j552j357j255j362j368j162r00p34
$$ 229431 229878 230752 231738 232858 234119 234996 234807 233579 232027 230670 229415 228053 226685 225523 224623 223889
52791B23889q49j386j931j559kJ635K044J240L13n5JK40N31M97j90j095j395r53
$$ 223889 223040 221654 219723 218164 218162 219797 221841 223081 223394 223339 223340 223580 224111 224608 224418 223323 221928 220975
52773B20975k91L70J178J784J513N42j04m7o0o83j287j186p68p66j087j089o50
$$ 220975 220684 221054 222232 224016 225529 226071 225967 225920 225860 225177 223890 222704 221936 221170 220083 218994 218344
52756B18344j91j6j74o56j175j082K6J699L064L524K967J664L64q8L73R77J163
$$ 218344 218153 218137 217963 217307 216132 215050 215076 216775 219839 223363 226330 227994 228358 228270 228643 229620 230783
52739B30783J201J429J623J589J641J932K019J760J815K380K309O70j409j844
$$ 230783 231984 233413 235036 236625 238266 240198 242217 243977 245792 248172 250481 251151 249742 247898
52725B47898k87J563K243J836J018M7q35j122p30k85l31p25j091j321j468j575
$$ 247898 247611 249174 251417 253253 254271 254318 253483 252361 251631 251346 251015 250290 249199 247878 246410 244835
52709B44835j690j625r07M04J147L23j292j867r54Q2K57K10O57R89M16m57m48
$$ 244835 243145 241520 240613 241017 242164 242487 241195 239328 238374 238456 238713 238923 239580 240569 240985 240528 240080
52692B40080M02R87Q31N67P74J162J078K93p41j167m12J038J905J468L53m52q72
$$ 240080 240482 241469 242300 242867 243641 244803 245881 246174 245433 244266 243854 244892 246797 248265 248618 248166 247294
52675B47294j389j774j212L47J733J870R93K23K05N30L89m06j183j158l65L33
$$ 247294 245905 244131 242919 243266 244999 246869 247862 248085 248290 248820 249209 248803 247620 246462 246097 246430
52659B46430K52l05m22M17J777K757K906K627K570K638J996L04j476k076j489
$$ 246430 246682 246377 245955 246372 248149 250906 253812 256439 259009 261647 263643 263947 262471 260395 258906
52644B58906p90n92n27l29l74q12j098r02o92q42q88l38M45R29J324K035K705
$$ 258906 258116 257524 256997 256668 256294 255482 254384 253482 252790 251948 251060 250722 251167 252096 253420 255455 258160
52627B58160K707K195J815J694J515J223Q58O3j397k837l334k954k432j989j380
$$ 258160 260867 263062 264877 266571 268086 269309 270167 270230 268833 265996 262662 259708 257276 255287 253907
52612B53907r02j093j551j281k94L29K37L86J410K460K389J203k83j479k073j733
$$ 253907 253005 251912 250361 249080 248786 249115 249352 249738 251148 253608 255997 257200 256917 255438 253365 251632
52596B51632n25P47J186O58k94r27o01Q24K573L545L481L032K464J255o45k101
$$ 251632 251107 251854 253040 253698 253404 252477 251876 252700 255273 258818 262299 265331 267795 269050 268405 266304
52580B66304k131j236n47l00P9P62J347J593J593J354Q90N29M68K73n63j720k336
$$ 266304 264173 262937 262390 262090 262169 262931 264278 265871 267464 268818 269708 270237 270705 270978 270415 268695 266359
52563B66359k084j360o15r0%l32n80l62j30n70j401j601q44N7K72j42o39q59o57
$$ 266359 264275 262915 262300 262210 262210 261878 261298 260936 260806 260236 258835 257234 256390 256447 256719 256577 255938 255079 254422
52544B54422q7L95K38l74n30K64J370J768J182J18q30j331j261p53k64k39o64
$$ 254422 254335 254730 254968 254594 254064 254328 255698 257466 258648 258766 257936 256605 255344 254591 254327 254088 253424
52527B53424j079j080o99l13j63n2L49R00J006M92O1M56J434K111K168K036J974
$$ 253424 252345 251265 250566 250253 250090 250038 250387 251287 252293 252785 252846 253302 254736 256847 259015 261051 263025
52510B63025J791J587J902K809L587L764L743L775L091R57j823l533l546k768
$$ 263025 264816 266403 268305 271114 274701 278465 282208 285983 289074 290031 288208 284675 281129 278361
52496B78361k163j795j519j568j903j837j059m00p13j421j168J69J172Q50p6k88
$$ 278361 276198 274403 272884 271316 269413 267576 266517 266117 265404 263983 262815 262984 264156 265006 264930 264642
52480B64642L96J148J436J407J176O45N9L1P53J673K168K116J665R85M25L68O29
$$ 264642 265038 266186 267622 269029 270205 270850 270909 270940 271693 273366 275534 277650 279315 280300 280725 281093 281722
52463B81722N16q3k34Q34K465L180K322N37j189k259k464k014j654k032k796l002
$$ 281722 282238 282155 281921 282755 285220 288400 290722 291259 290070 287811 285347 283333 281679 279647 276851 273849
52447B73849k497k176k507k655j676J5J112J025K67n04j044j067j50J468K628
$$ 273849 271352 269176 266669 264014 262338 262353 263465 264490 264757 264253 263209 262142 261992 263460 266088
52432B66088K352R50m49j234j609j688j118R9J108J131N65L58N94N00p4j05J135
$$ 266088 268440 269390 268941 267707 266098 264410 263292 263391 264499 265630 266195 266553 267147 267647 267573 267468 268603
52415B68603K834L564L034K267K229L035M383O017P637Q852R519R821R848R312
$$ 268603 271437 275001 278035 280302 282531 285566 289949 295966 303603 312455 321974 331795 341643 350955
52401C50955P780N058J459k173m934o589p634q367q330p155n483m263l428k208
$$ 350955 358735 363793 365252 363079 358145 351556 343922 335555 327225 320070 314587 310324 306896 304688
52387C04688o40L11K78P9L98Q19P49M55M60O47P67J258K580M107M639M000L307
$$ 304688 304048 304359 304637 304716 305114 305933 306682 307137 307597 308244 309011 310269 312849 316956 321595 325595 328902
52370C28902L554M543N393N531M987M050K973J888R06K02j17k58n81j036j124
$$ 328902 332456 336999 342392 347923 352910 356960 359933 361821 362727 362929 362812 362554 361973 360937 359813
52355C59813o39j5L10M94Q01R82P71O24J115J853J891J284J315K815N015O533
$$ 359813 359174 359159 359469 359963 360764 361746 362517 363141 364256 366109 368000 369284 370599 373414 378429 384962
52339C84962O852O367N546M801M832O184Q445J0533J1921J3039J4312J5484J6273
$$ 384962 391814 398181 403727 408528 413360 419544 427989 438522 450443 463482 477794 493278 509551
52326E09551J7027J8106J9066J9271J9140J9738K1080K1833K1234K0288K0280
$$ 509551 526578 544684 563750 583021 602161 621899 642979 664812 686046 706334 726614
52315G26614K0816K0474J8953J7353J6434J5842J5180J4702J4465J3822J2399
$$ 726614 747430 767904 786857 804210 820644 836486 851666 866368 880833 894655 907054
52304I07054J0783R669Q898P996P053O377N791M914L783K576J136o54k386l657
$$ 907054 917837 927506 936404 944400 951453 957830 963621 968535 972318 974894 976030 975376 972990 969333
52290I69333m692n806o673o848o718p051p824q240p819o749n198l094n93J831
$$ 969333 964641 958835 952162 945314 938596 931545 923721 915481 907662 900913 895715 892621 892028 893859
52276H93859L875N544O956Q377J0139J1940J2712J2052J1356J2375J4753J6262
$$ 893859 897734 903278 910234 918611 928750 940690 953402 965454 976810 989185 1003938 1020200
52264A020200J5598J3812J2596J2318J2320J2113J1495J0285Q724P687P679Q031
$$ 1020200 1035798 1049610 1062206 1074524 1086844 1098957 1110452 1120737 1129461 1137148 1144827 1152858
52252A152858P664O345M541K500J90k062l632m430n102o265p878r500j0872j2021
$$ 1152858 1160522 1166867 1171408 1173908 1174098 1172036 1168404 1163974 1158872 1152607 1144729 1135229 1124357 1112336
52238A112336j2941j3373j3132j2522j2121j1955j1300r658p651o385o070n939
$$ 1112336 1099395 1086022 1072890 1060368 1048247 1036292 1024992 1015334 1007683 1001298 995228 989289
52226I89289n477n012m911m882m453l553k270n17J633L585M639M654M142L897
$$ 989289 983812 978800 973889 969007 964554 961001 958731 958214 959847 963432 968071 972725 976867 980764
52212I80764M484N737O720O613N713N046N034N106M666L797K814J947J612K264
$$ 980764 985248 990985 997705 1004318 1010031 1015077 1020111 1025217 1029883 1033680 1036494 1038441 1040053 1042317
52198A042317L585M540M635M415M351M137L563L128L053K624J450N29R05J863
$$ 1042317 1045902 1050442 1055077 1059492 1063843 1067980 1071543 1074671 1077724 1080348 1081798 1082327 1083232 1085095
52184A085095J795N08o76j057j449k658m273n465o198p001p978q580q237p004
$$ 1085095 1086890 1087398 1086722 1085665 1084216 1081558 1077285 1071820 1065622 1058621 1050643 1042063 1033826 1026822
$$ [...]
##END NTUPLES=NMR SPECTRUM
##END=
