
##TITLE=AC1302_PERAH12114_6608382_PZ89wDSsjw
##JCAMPDX= 6.0         $$ Bruker NMR JCAMP-DX V2.0
##DATA TYPE= NMR SPECTRUM
##DATA CLASS= NTUPLES
##ORIGIN= BRUKER
##OWNER= Administrator
$$ 1.72 TOPSPIN		Version 2.1
$$ 2012-08-01 15:09:34.156 -0500  Administrator@TOPSPIN
$$ Compression mode = diff/dup
##.OBSERVE FREQUENCY= 400.02188249412
##.OBSERVE NUCLEUS= ^1H
##.ACQUISITION MODE= SIMULTANEOUS (DQD)
##.ACQUISITION SCHEME= undefined
##.AVERAGES= 64
##.DIGITISER RES= 22
##SPECTROMETER/DATA SYSTEM= spect
##.PULSE SEQUENCE= noesygpps1d.comp
##.SOLVENT NAME= COFFEE_meoh
##.SHIFT REFERENCE= INTERNAL, COFFEE_meoh, 1, 14.96062
##AUDIT TRAIL= $$ (NUMBER, WHEN, WHO, WHERE, PROCESS, VERSION, WHAT)
$$ ##TITLE= Audit trail, TOPSPIN		Version 2.1
$$ ##JCAMPDX= 5.01
$$ ##ORIGIN= Bruker BioSpin GmbH
$$ ##OWNER= Administrator
$$ $$ C:\Bruker\TOPSPIN/data/COFFEE/nmr/AC1302_PERAH12114_6608382_PZ89wDSsjw/22/pdata/1/auditp.txt
$$ ##AUDIT TRAIL=  $$ (NUMBER, WHEN, WHO, WHERE, PROCESS, VERSION, WHAT)
(   1,<2012-08-01 15:09:19.453 -0500>,<Administrator>,<TOPSPIN>,<go>,<TOPSPIN 2.1>,
      <created by zg
	started at 2012-08-01 14:57:48.000 -0500,
	POWCHK enabled, PULCHK disabled,
       configuration hash MD5:
       6B 1B 68 BB D9 2E 58 E2 7F 35 AD 54 07 DF 0E 41
       data hash MD5: 64K
       37 E5 6E 3F F4 EE 4F 8E 02 A2 BD 59 B5 99 2C C8>)
(   2,<2012-08-01 15:09:27.515 -0500>,<Administrator>,<TOPSPIN>,<proc1d>,<TOPSPIN 2.1>,
      <Start of raw data processing
       efp LB = 0.3 FT_mod = 6 PKNL = 1 PHC0 = 0 PHC1 = 0 SI = 128K 
       data hash MD5: 128K
       5E BA B4 C7 B7 06 50 F8 4B 04 D2 16 78 30 A0 65>)
(   3,<2012-08-01 15:09:29.125 -0500>,<Administrator>,<TOPSPIN>,<proc1d>,<TOPSPIN 2.1>,
      <pk PHC0 = 0.2526855 PHC1 = 0 
       data hash MD5: 128K
       B7 28 57 BE 01 C7 9C 0F AA 53 70 21 46 77 15 F3>)
(   4,<2012-08-01 15:09:31.656 -0500>,<Administrator>,<TOPSPIN>,<proc1d>,<TOPSPIN 2.1>,
      <abs ABSG = 1 
       data hash MD5: 128K
       27 03 D2 5A 49 4C 27 ED A2 51 86 C8 0A FF 89 D6>)
(   5,<2012-08-01 15:09:32.093 -0500>,<Administrator>,<TOPSPIN>,<proc1d>,<TOPSPIN 2.1>,
      <abs ABSG = 2 
       data hash MD5: 128K
       00 C6 68 FD 34 80 ED C0 AD 59 12 2F 2E 95 69 59>)
(   6,<2012-08-01 15:09:32.484 -0500>,<Administrator>,<TOPSPIN>,<proc1d>,<TOPSPIN 2.1>,
      <abs ABSG = 3 
       data hash MD5: 128K
       F6 56 C6 F1 7D 13 A4 37 40 C0 3A 44 88 0C 0F 84>)
(   7,<2012-08-01 15:09:32.890 -0500>,<Administrator>,<TOPSPIN>,<proc1d>,<TOPSPIN 2.1>,
      <abs ABSG = 4 
       data hash MD5: 128K
       D3 78 C3 0D EA 61 F2 E4 40 F6 A3 4A D8 00 8C 35>)
(   8,<2012-08-01 15:09:33.312 -0500>,<Administrator>,<TOPSPIN>,<proc1d>,<TOPSPIN 2.1>,
      <abs ABSG = 5 
       data hash MD5: 128K
       96 C2 35 CF 73 86 45 96 B2 F6 47 3D A9 B5 8A 69>)
$$ ##END=
$$ 
$$ $$ hash MD5
$$ $$ BB 06 3D F6 44 DC EA 82 A4 B4 79 ED 5F 09 DA CD
##$RELAX= 
##$RELAX= 
##$RELAX= 
##$RELAX= 
##$RELAX= 
##$RELAX= 
##$RELAX= 
##$RELAX= 
$$ Bruker specific parameters
$$ [...]
##$TP07= 0
##$TPNAME0= <>
##$TPNAME1= <>
##$TPNAME2= <>
##$TPNAME3= <>
##$TPNAME4= <>
##$TPNAME5= <>
##$TPNAME6= <>
##$TPNAME7= <>
##$TPOAL= (0..7)
0.5 0.5 0.5 0.5 0.5 0.5 0.5 0.5
##$TPOFFS= (0..7)
0 0 0 0 0 0 0 0
##$TUNHIN= 0
##$TUNHOUT= 0
##$TUNXOUT= 0
##$USERA1= <user>
##$USERA2= <user>
##$USERA3= <user>
##$USERA4= <user>
##$USERA5= <user>
##$V9= 5
##$VALIST= <valist>
##$VCLIST= <CCCCCCCCCCCCCCC>
##$VD= 0
##$VDLIST= <DDDDDDDDDDDDDDD>
##$VPLIST= <PPPPPPPPPPPPPPP>
##$VTLIST= <TTTTTTTTTTTTTTT>
##$WBST= 1024
##$WBSW= 4
##$XGAIN= (0..3)
0 0 0 0
##$XL= 0
##$YL= 0
##$YMAX_a= 11742955
##$YMIN_a= -9286773
##$ZGOPTNS= <>
##$ZL1= 120
##$ZL2= 120
##$ZL3= 120
##$ZL4= 120
##$ABSF1= 14.96062
##$ABSF2= -5.597562
##$ABSG= 5
##$ABSL= 3
##$ALPHA= 0
##$AQORDER= 0
##$ASSFAC= 0
##$ASSFACI= 0
##$ASSFACX= 0
##$ASSWID= 0
##$AUNMP= <proc_prof1d_extract.lims>
##$AXLEFT= 0
##$AXNAME= <>
##$AXNUC= <1H>
##$AXRIGHT= 0
##$AXTYPE= 0
##$AXUNIT= <>
##$AZFE= 0.1
##$AZFW= 0.1
##$BCFW= 0
##$BC_mod= 0
##$BYTORDP= 0
##$COROFFS= 0
##$CY= 15
##$DATMOD= 1
##$DC= 0
##$DFILT= <>
##$DTYPP= 0
##$F1P= 0
##$F2P= 0
##$FCOR= 0.5
##$FTSIZE= 131072
##$FT_mod= 6
##$GAMMA= 0
##$GB= 0
##$INTBC= 1
##$INTSCL= 1
##$ISEN= 128
##$LB= 0.3
##$LEV0= 0
##$LPBIN= 0
##$MAXI= 10000
##$MC2= 0
##$MEAN= 0
##$ME_mod= 0
##$MI= 0
##$NCOEF= 0
##$NC_proc= -2
##$NLEV= 6
##$NOISF1= 0
##$NOISF2= 0
##$NSP= 0
##$NTH_PI= 0
##$NZP= 0
##$OFFSET= 14.96062
##$PC= 1
##$PHC0= 0.2526855
##$PHC1= 0
##$PH_mod= 1
##$PKNL= yes
##$PPARMOD= 0
##$PPDIAG= 0
##$PPIPTYP= 0
##$PPMPNUM= 2147483647
##$PPRESOL= 1
##$PSCAL= 4
##$PSIGN= 0
##$PYNMP= <proc.py>
##$REVERSE= no
##$SF= 400.020009789667
##$SI= 131072
##$SIGF1= 0
##$SIGF2= 0
##$SINO= 400
##$SIOLD= 131072
##$SPECTYP= <>
##$SREGLST= <1H.CDCl3>
##$SSB= 0
##$STSI= 131072
##$STSR= 0
##$SW_p= 8223.68421052631
##$SYMM= 0
##$S_DEV= 0
##$TDeff= 65536
##$TDoff= 0
##$TI= <>
##$TILT= no
##$TM1= 0
##$TM2= 0
##$TOPLEV= 0
##$USERP1= <user>
##$USERP2= <user>
##$USERP3= <user>
##$USERP4= <user>
##$USERP5= <user>
##$WDW= 1
##$XDIM= 131072
##$YMAX_p= 400646837
##$YMIN_p= -18751
##$CURPLOT= <Network HP LaserJet P1505>
##$CURPRIN= <$Network HP LaserJet P1505>
##$DFORMAT= <normdp>
##$LAYOUT= <+/1D_H.xwp>
##$LFORMAT= <normlp>
##$PFORMAT= <normpl>
##$SURQMSG= 1
$$ End of Bruker specific parameters
$$ ---------------------------------
##NTUPLES= NMR SPECTRUM
##VAR_NAME=  FREQUENCY,     SPECTRUM/REAL,   SPECTRUM/IMAG
##SYMBOL=    X,             R,               I
##VAR_TYPE=  INDEPENDENT,   DEPENDENT,       DEPENDENT
##VAR_FORM=  AFFN,          ASDF,            ASDF
##VAR_DIM=   131072,        131072,          131072
##UNITS=     HZ,            ARBITRARY UNITS, ARBITRARY UNITS
##FACTOR=    0.0627417313425164, 1,          1
##FIRST=     8223.62146879497, 2528,         -64885
##LAST=      0,             4461,            -64553
##MIN=       0,             -18751,          0
##MAX=       8223.62146879497, 400646837,    0
$$ Real data points
##PAGE= N=1
##DATA TABLE= (X++(R..R)), XYDATA
$$ [...]
63923D451108n7720q7414j15677j41975j65154j83902j97408k05597k08920k08020
63913B879321k03582j96342j87143j76698j65271j52720j39060j24845j10937
63904A422723r8053q6587p6574o7679n9437n1692m4666l8482l2988k8191k4359
63893H14015k1399j8639j5765j3515j2644j2682j2517j2001j1827j1885j1063
63882F60078r087p329o954p144o158l618o27K019M698P977J1718J5328J8315K0374
63868F99590K1532K2413K3791K5636K7003K7112K6162K4887K3718K2671K1627
63857I66142K0339J8424J5726J2551R275N950K478j082m661q454j2529j6438j9579
63844I88142k1948k4078k6234k8113k9433l0354l1148l1791l2170l2339l2300
$$ y = [4451108, 4393388, 4305974, 4190297, 4048322, 3883168, 3699266, 3501858, 3296261, 3087341, 2879321, 2675739, 2479397, 2292254, 2115556, 1950285, 1797565, 1658505, 1533660, 1422723, 1324670, 1238083, 1161509, 1093830, 1034393, 982701, 938035, 899553, 866565, 838374, 814015, 792616, 773977, 758212, 744697, 732053, 719371, 706854, 694853, 683026, 671141, 660078, 650991, 643662, 636708, 629564, 623406, 619788, 619161, 621180, 625878, 633855, 645573, 660901, 679216, 699590, 721122, 743535, 767326, 792962, 819965, 847077, 873239, 898126, 921844, 944515, 966142, 986481, 1004905, 1020631, 1033182, 1042457, 1048407, 1050885, 1049803, 1045142, 1036688, 1024159, 1007721, 988142, 966194, 942116, 915882, 887769, 858336, 827982, 796834, 765043, 732873, 700534, 668234]
63833F68234l1733l0383k8585k7004k5781k4310k2061j9399j7313j6329j5981
63822D09355j5408j4282j2922j1658j0395q961p582o693o314n967n303m569m283
63809B95018m547m898m823m271l616l148k781k255j595j152j158j462j812k205
63795B55295k725l216l397l248k971k624k121j594j355j465j672j765j662j180
63781B24300k56N94O17j20p00o53o22j227j979j987j287o12k07K10N42L42k48
63764B16707m77j11K31Q7k17k42j11j45l22m18l18R3Q18J430J349P04L43O77J090
63745B21168Q40P5m44k50N57J505J996J785J459J810K575K542J367L71Q31K282
63729B40469L405L836M039L983L266K379K427L504M459M568M392M622M965M710
$$ y = [668234, 636501, 606118, 577533, 550529, 524748, 500438, 478377, 458978, 441665, 425336, 409355, 393947, 379665, 366743, 355085, 344690, 335729, 328147, 321454, 315140, 309173, 303870, 299301, 295018, 290471, 285573, 280750, 276479, 272863, 269715, 266934, 264679, 263084, 261932, 260774, 259312, 257500, 255295, 252570, 249354, 245957, 242709, 239738, 237114, 234993, 233399, 232044, 230579, 228907, 227142, 225480, 224300, 224044, 224638, 225255, 225135, 224435, 223782, 223160, 221933, 219954, 217967, 216680, 216068, 215861, 216071, 216613, 216955, 216707, 216230, 216119, 216350, 216437, 216220, 215978, 215867, 215722, 215400, 214982, 214664, 214757, 215575, 217005, 218354, 219058, 219401, 220078, 221168, 222008, 222083, 221639, 221389, 221946, 223451, 225447, 227232, 228691, 230501, 233076, 235618, 236985, 237356, 238187, 240469, 243874, 247710, 251749, 255732, 258998, 261377, 263804, 267308, 271767, 276335, 280727, 285349, 290314, 295024]
63715B95024L766K642J877J753K118K240J326n47k420l558m079m379m476m202
63701B87085l565k571j193K03Q96O68J87K44Q96J689K327K758K968L033L176L482
63685C02283L770L899L870L496K432Q89k39l33K03N65N40L75J17l30o46l46M58
63668C21003J104J271J366J834K430K468J612J97j166k151k857l452l947m333
63654C15379m706m979m725l773k763k525k935l058k524k008k042k056j249J68
63640B76204J241J541J502J720K379L246L906M073L977M164M785N439N869O277
63626C26323O611O340N546N444O944R186J0591J0969J1500J2784J4119J4835J5252
63613D56444J6014J7357J9333K1985K4861K7163K8696L0054L1536L2514L2278
$$ y = [295024, 298790, 301432, 303309, 305062, 307180, 309420, 310746, 310199, 307779, 304221, 300142, 295763, 291287, 287085, 283520, 280949, 279756, 279959, 280855, 281523, 281710, 281954, 282850, 284539, 286866, 289624, 292592, 295625, 298801, 302283, 306053, 309952, 313822, 317318, 319750, 320639, 320400, 320067, 320270, 320835, 321375, 321750, 321867, 321537, 320891, 320545, 321003, 322107, 323378, 324744, 326578, 329008, 331476, 333088, 333285, 332119, 329968, 327111, 323659, 319712, 315379, 310673, 305694, 300969, 297196, 294433, 291908, 288973, 285915, 283391, 281383, 279341, 277285, 276036, 276204, 277445, 278986, 280488, 282208, 284587, 287833, 291739, 295812, 299789, 303953, 308738, 314177, 320046, 326323, 332934, 339274, 344820, 350264, 357208, 366394, 376985, 387954, 399454, 412238, 426357, 441192, 456444, 472458, 489815, 509148, 531133, 555994, 583157, 611853, 641907, 673443, 705957, 738235]
63602G38235L0841K8452K4963K0274J4939R709M799J10m064p063q513q655q218
63589H35809q128r002j0677j2515j4371j6790k0000k3137k5053k5469k4931k3887
63577F21849k2349k0258j7715j4950j2345j0304q703o824m258j587K96J359K335
63564E06546L588M757N496N983O582P456Q629J0051J1447J2509J3355J4478J6122
63551F26999J7988J9736K1542K3909K7148L1099L5275L9167M2400M4510M4510
63540I74283M1068L3557K2953J1392Q50p525j3149j5881j6352j5744j4845j3590
63528I87017j1822j0138r589j0818j3829j8323k3680k8758l2313l3959l4408l4558
63516G24822l4536l3818l2077k9576k6760k3853k1031j8708j7209j6187j4814
$$ y = [738235, 769076, 797528, 822491, 842765, 857704, 867413, 872212, 872322, 868258, 861195, 852682, 844027, 835809, 827681, 818679, 808002, 795487, 781116, 764326, 744326, 721189, 696136, 670667, 645736, 621849, 599500, 579242, 561527, 546577, 534232, 523928, 515225, 508401, 504143, 502556, 502852, 504211, 506546, 510134, 514891, 520387, 526370, 532952, 540408, 549037, 559088, 570535, 583044, 596399, 610877, 626999, 644987, 664723, 686265, 710174, 737322, 768421, 803696, 842863, 885263, 929773, 974283, 1015351, 1048908, 1071861, 1083253, 1084103, 1076578, 1063429, 1047548, 1031196, 1015452, 1000607, 987017, 975195, 965057, 955468, 944650, 930821, 912498, 888818, 860060, 827747, 793788, 759380, 724822, 690286, 656468, 624391, 594815, 568055, 544202, 523171, 504463, 487254, 471067, 456253]
63505D56253j2697j0298q227o596n348m770m961n108m184k471j508k131l328l617
63491C81009k842j873j074p8J092J791J740J440J307J200J117J576K698L653L679
63476C96435L259L404M100M314L515K300J357N87m30j692k936m120n257o065o257
63461C92514n963n502m887l968k936k206j787j240l73L67N03K85N03J623L314
63446C70247M879N961O681P293P917Q653R664J1016J2647J4649J7295K0484K3438
63433E20824K5577K7528L0433L3975L5879L4023K8581K1553J4746Q955M678K470
63421G89222K383L896O638J0596J5397K0122K4200K7882L1394L4109L5069L3899
63409A034807L0722K5569J8618J0804L587k061o041q683j0356j1537j2730j4060
$$ y = [456253, 443556, 433258, 425031, 418435, 413087, 408317, 403356, 398248, 394064, 391593, 390085, 387954, 384626, 381009, 378167, 376294, 375220, 375142, 376234, 378025, 379765, 381205, 382512, 383712, 384829, 386405, 389103, 392756, 396435, 399694, 403098, 407198, 411512, 415027, 417327, 418684, 419271, 418841, 417149, 414213, 410093, 404836, 398771, 392514, 386551, 381049, 376162, 372194, 369258, 367052, 365265, 364025, 363652, 364019, 364522, 364807, 365310, 366933, 370247, 375126, 381087, 387768, 395061, 402978, 411631, 421295, 432311, 444958, 459607, 476902, 497386, 520824, 546401, 573929, 604362, 638337, 674216, 708239, 736820, 758373, 773119, 782074, 786752, 789222, 791605, 795501, 802139, 812735, 828132, 848254, 872454, 900336, 931730, 965839, 1000908, 1034807, 1065529, 1091098, 1109716, 1120520, 1124107, 1122046, 1116005, 1107322, 1096966, 1085429, 1072699, 1058639]
63397A058639j5302j6446j7993k0428k3616k6939k9948l2583l4729l5840l5284
63386G69531l3092l0121k7291k4841k2529k0310j8384j6563j4176j0934p440m518
63374E39332k323m75J158K402L398M709O622Q731J0489J1982J3805J6295J9088
63361F35213K1593K3699K5778K7996K9941L1259L2475L4580L7652M0319M0910
63350I81415L8901L4935K9821K3920J7366J0392L442k820p724j1083j3276j4611
63338A090678j4919j4231j3561j4303j6844k0325k3786k6920k9611l1424l2046
63327H52708l1732l0918k9603k7508k4581k1088j7311j3380r323n198j458P89
63315F41397L02l143q332j3563j7772k0561k1681k1110j9473j7664j5962j3970
$$ y = [1058639, 1043337, 1026891, 1008898, 988470, 964854, 937915, 907967, 875384, 840655, 804815, 769531, 736439, 706318, 679027, 654186, 631657, 611347, 592963, 576400, 562224, 551290, 543850, 539332, 537009, 536534, 537692, 540094, 543492, 548201, 554823, 563554, 574043, 586025, 599830, 616125, 635213, 656806, 680505, 706283, 734279, 764220, 795479, 827954, 862534, 900186, 940505, 981415, 1020316, 1055251, 1085072, 1108992, 1126358, 1136750, 1140192, 1137372, 1129648, 1118565, 1105289, 1090678, 1075759, 1061528, 1047967, 1033664, 1016820, 996495, 972709, 945789, 916178, 884754, 852708, 820976, 790058, 760455, 732947, 708366, 687278, 669967, 656587, 647264, 642066, 640608, 641397, 641699, 638556, 630224, 616661, 598889, 578328, 556647, 535537, 516064, 498400, 482438, 468468]
63303D68468j1561r417q329q194q107p407o264n247m506l701k684j879j779k225
63289C87168k522k337k073k260k799l095k829k249j750j423j128q72r36j535k392
63274C56968k811k332j242l18o6l74q25j090j020o36j81Q1K52O99J486K194K475
63257C53260K526K731L130L490L717L883M026M232M754N651O491O780O604O467
63243D17742O672P263Q418J0308J2490J4117J4977J5821J7300J9024K0079K0240
63231E84451K0172K0566K1476K2443K2993K2921K2385K1762K1305K0964K0622
63220H22060K0356K0337K0527K0734K0844K0763K0152J8554J5855J2380Q428L957
63208A024947j130o550j1749j6423k0652k4467k7471k9124k9400k8908k8186k7046
$$ y = [468468, 456907, 447490, 439161, 430967, 422860, 415453, 409189, 403942, 399436, 395735, 393051, 391172, 389393, 387168, 384646, 382309, 380236, 377976, 375177, 372082, 369253, 367004, 365254, 363831, 362703, 361831, 360895, 359360, 356968, 354157, 351825, 350583, 350265, 350199, 349825, 349000, 347910, 346890, 346254, 346073, 346154, 346406, 347105, 348591, 350785, 353260, 355786, 358517, 361647, 365137, 368854, 372737, 376763, 380995, 385749, 391400, 397891, 404671, 411275, 417742, 424414, 431677, 440095, 450403, 462893, 477010, 491987, 507808, 525108, 544132, 564211, 584451, 604623, 625189, 646665, 669108, 692101, 715022, 737407, 759169, 780474, 801438, 822060, 842416, 862753, 883280, 904014, 924858, 945621, 965773, 984327, 1000182, 1012562, 1020990, 1024947, 1023817, 1017267, 1005518, 989095, 968443, 943976, 916505, 887381, 857981, 829073, 800887, 773841]
63196G73841k4904k1720j8232j5078j2075q659m766q60K750O047Q819J0634J1582
63183G07379J2463J3859J5461J6676J7545J8470J9341J9654J9444J9351J9632
63172H99275J9685J8877J7318J5515J3658J1584R131O142K441j877o348j0730
63160I94671j5310k0263k4971k8527l0745l2123l2964l3120l2570l1600l0305
63149F82173k8492k6238k4019k2058k0017j7657j5333j3533j2214j1007r775q610
63137D73220p501o302m939l435j899o81j93l77o47n33r4N36J504K699L404L143
63121D57905K514K480L059L531L714M140M851N070M419L620L399L398K853J912
63107E06865J399J586J914J984K011K206K288J968J478J200J038O48J51J56R51
$$ y = [773841, 748937, 727217, 708985, 693907, 681832, 673173, 668407, 667547, 670297, 676344, 685163, 695797, 707379, 719842, 733701, 749162, 765838, 783383, 801853, 821194, 840848, 860292, 879643, 899275, 918960, 937837, 955155, 970670, 984328, 995912, 1005043, 1011185, 1013626, 1011749, 1005401, 994671, 979361, 959098, 934127, 905600, 874855, 842732, 809768, 776648, 744078, 712478, 682173, 653681, 627443, 603424, 581366, 561349, 543692, 528359, 514826, 502612, 491605, 481830, 473220, 465719, 459417, 454478, 451043, 449144, 448463, 448270, 447893, 447246, 446713, 446619, 447155, 448659, 451358, 454762, 457905, 460419, 462899, 465958, 469489, 473203, 477343, 482194, 487264, 491683, 495303, 498702, 502100, 504953, 506865, 508264, 509850, 511764, 513748, 515759, 517965, 520253, 522221, 523699, 524899, 525937, 526585, 526736, 526892, 527843]
63092E27843J934K256J812J261J090J058Q00N53Q32J533J961J862J862K611L803
63077E53071M540M516M403N006O354P804Q855R600J0389J1295J2122J2831J3697
63064F64483J4883J6153J7278J8486K0148K2102K3836K5400K7580L0857L4685
63053I15891L8181M1225M4352M7693N0609N2499N3501N4260N5186N6177N6900
63042A466474N7164N6999N6491N5663N4653N3876N3654N3635N2944N1169M8804
63031B061526M6252M2762L7035K8802J9124Q977j783j3563k5725l6857m6215n4257
63019B066078o1482o7316p0564p0843o9067o6361o2836n7843n1169m3477l5496
63008A409624k7382j9257j1746n357L73O349J2594J8190K2548K5968K8770L0712
$$ y = [527843, 529777, 532033, 533845, 535106, 536196, 537254, 538054, 538607, 539439, 540972, 542933, 544795, 546657, 549268, 553071, 557611, 562127, 566530, 571536, 577890, 585694, 594549, 604149, 614538, 625833, 637955, 650786, 664483, 679366, 695519, 712797, 731283, 751431, 773533, 797369, 822769, 850349, 881206, 915891, 954072, 995297, 1039649, 1087342, 1137951, 1190450, 1243951, 1298211, 1353397, 1409574, 1466474, 1523638, 1580637, 1637128, 1692791, 1747444, 1801320, 1854974, 1908609, 1961553, 2012722, 2061526, 2107778, 2150540, 2187575, 2216377, 2235501, 2244478, 2242695, 2229132, 2203407, 2166550, 2120335, 2066078, 2004596, 1937280, 1866716, 1795873, 1726806, 1660445, 1597609, 1539766, 1488597, 1445120, 1409624, 1382242, 1362985, 1351239, 1345882, 1346255, 1352604, 1365198, 1383388, 1405936, 1431904, 1460674, 1491386]
62996A491386L1690L2287L3034L3659L3690L3329L3008L2485L1193K9261K7271
62985A842293K5055K1623J6439J0026L000m699j3237k2105l0513l8195m5388n2236
62973A712063n8503o3657o6949o7866o6755o4709o2361n9219n4672m9296m4414
62962A053662m0544l6992l3066k9086k5872k3788k2554k1726k0991k0162j9162
62951G59719j8042j6935j6014j5455j5237j5069j4655j4050j3467j2910j2230
62940E95655j1581j1292j1243j0850r833q639p783p166o387n398m477l781l303
62927D93922l125l224l175k477j265k62J5l00q03j265j575j600j321r45p15p44
62911D71141j069j644k178k285j954j676j882k430k872l036l052k979k735k374
$$ y = [1491386, 1523076, 1555363, 1588397, 1622056, 1655746, 1689075, 1722083, 1754568, 1785761, 1815022, 1842293, 1867348, 1888971, 1905410, 1915436, 1918436, 1913737, 1900500, 1878395, 1847882, 1809687, 1764299, 1712063, 1653560, 1589903, 1522954, 1455088, 1388333, 1323624, 1261263, 1202044, 1147372, 1098076, 1053662, 1013118, 976126, 943060, 913974, 888102, 864314, 841760, 820034, 799043, 778881, 759719, 741677, 724742, 708728, 693273, 678036, 662967, 648312, 634262, 620795, 607885, 595655, 584074, 572782, 561539, 550689, 540856, 532217, 524434, 517268, 510881, 505483, 501006, 497225, 493922, 490797, 487573, 484398, 481921, 480656, 480394, 480409, 480109, 479306, 478041, 476466, 474866, 473545, 472600, 471885, 471141, 470072, 468428, 466250, 463965, 462011, 460335, 458453, 456023, 453151, 450115, 447063, 444084, 441349, 438975]
62897D38975k092j907j545q18R3Q19J153J107Q02M42K65L68N50N14K20p0q1J97
62879D38992N90R48J177J178R15N85N59R80J463J391N45n85j247j106m89O2K94
62862D46252L63N03P66J006J039P87L76J05K40P67J354J641J526J183Q74Q53J336
62845D60971K302L304L656L006J640J97q36j361j512j517j542j545j261m96N31
62830D65537J308J496J183P07L32J69K88P71J641K687L474L651L341L081L206
62815D92872L453L320K739K120J786J769K096K882L897M530M535M499N164O431
62801E42093P488P887P994Q352R111J0252J1922J4087J6131J7293J7637J8182
62789F88429J9969K3142K7073L1161L5258L9503M4022M8897N4141N9575O4824
$$ y = [438975, 436883, 434976, 433431, 432613, 432706, 433525, 434678, 435785, 436587, 437029, 437294, 437662, 438212, 438726, 438946, 438876, 438795, 438992, 439582, 440530, 441707, 442885, 443800, 444385, 444944, 445924, 447387, 448778, 449323, 448738, 447491, 446385, 445896, 445958, 446252, 446615, 447118, 447884, 448890, 449929, 450716, 451092, 451197, 451437, 452204, 453558, 455199, 456725, 457908, 458782, 459635, 460971, 463273, 466577, 470233, 473239, 474879, 475076, 474240, 472879, 471367, 469850, 468308, 466763, 465502, 465006, 465537, 466845, 468341, 469524, 470231, 470563, 470732, 471020, 471791, 473432, 476119, 479593, 483244, 486585, 489666, 492872, 496325, 499645, 502384, 504504, 506290, 508059, 510155, 513037, 516934, 521464, 525999, 530498, 535662, 542093, 549581, 557468, 565462, 573814, 582925, 593177, 605099, 619186, 635317, 652610, 670247, 688429, 708398, 731540, 758613, 789774, 825032, 864535, 908557, 957454, 1011595, 1071170, 1135994]
62778A135994O9685P4371P9132Q3657Q7142Q8990Q9142Q7478Q3358P6174O6281
62767B021404N4813M2436K8725J3148l656j9983l4452m6886n7745o7086p4393
62756A856325p9331q2275q3909q4519q3857q1678p8156p3768o8986o4226n9819
62745A015801n5799n1761m7235m2268l7471l3358k9911k6859k4206k2119k0361
62734F24453j8169j5060j1620r139q233q072p269n463l617k667k431k140j572
62721E29001r75j86J331L441N203O198P266R263J1653J3144J3538J4056J5833
62708F28766J8776K2197K5828K9728L3696L7325M0573M3938M7993N2836N7888
62697A039544O2260O5537O8188P0846P3242P4342P3627P1579O8494O3552N5778
$$ y = [1135994, 1205679, 1280050, 1359182, 1442839, 1529981, 1618971, 1708113, 1795591, 1878949, 1955123, 2021404, 2076217, 2118653, 2147378, 2160526, 2156870, 2136887, 2102435, 2055549, 1997804, 1930718, 1856325, 1776994, 1694719, 1610810, 1526291, 1442434, 1360756, 1282600, 1208832, 1139846, 1075620, 1015801, 960002, 908241, 861006, 818738, 781267, 747909, 717998, 691139, 666933, 644814, 624453, 606284, 591224, 579604, 570465, 562232, 554160, 546891, 541428, 537811, 535144, 532713, 530573, 529001, 528026, 527840, 529171, 532612, 537815, 544013, 551279, 560542, 572195, 585339, 598877, 612933, 628766, 647542, 669739, 695567, 725295, 758991, 796316, 836889, 880827, 928820, 981656, 1039544, 1101804, 1167341, 1235529, 1306375, 1379617, 1453959, 1527586, 1599165, 1667659, 1731211, 1786989]
62686A786989M5444L3760K1388Q190n697j9514l2691m5079n6097o4589p0187p3966
62674A527951p6935p8477p7270p3473o8929o5113o1775n7854n3026m7900m3202
62663H23997l9294l6151l3401l0528k7344k4201k1519j9249j7038j4782j2796
62652E47694j1443j0779j0471r987q991p734o897o862p199p081o124m661l373
62639D46092k745k772k896k362r30P96J957K269K006J399M64o00j332j523j367
62624D38456r96k93O56J337J375J032Q54J085J716K719L910M860N443O084P068
62609D75306P913Q124Q180Q936J0213J1054J1447J2627J5222J8152K0144K1529
62597F28847K3564K6587K9820L2677L5143L7105L8370L9419M1004M2677M2760
$$ y = [1786989, 1832433, 1866193, 1887581, 1895771, 1890074, 1870560, 1837869, 1792790, 1736693, 1672104, 1601917, 1527951, 1451016, 1372539, 1295269, 1221796, 1152867, 1087754, 1025979, 968125, 915099, 867199, 823997, 784703, 748552, 715151, 684623, 657279, 633078, 611559, 592310, 575272, 560490, 547694, 536251, 525472, 515001, 505014, 496023, 488289, 481392, 474530, 467331, 460250, 454126, 449465, 446092, 443347, 440575, 437679, 435317, 434387, 435183, 437140, 439409, 441415, 442814, 443278, 442678, 441346, 439823, 438456, 437460, 437167, 437823, 439160, 440535, 441567, 442421, 443506, 445222, 447941, 451851, 456711, 462154, 468238, 475306, 483219, 491343, 499523, 508459, 518672, 529726, 541173, 553800, 569022, 587174, 607318, 628847, 652411, 678998, 708818, 741495, 776638, 813743, 852113, 891532, 932536, 975213, 1017973]
62586A017973M0148L5474K9942K3872J6991R458J719o204j4415k2291k8773l3504
62574A070390l7042l9882m1850m2528m1841m0050l7604l5070l2794l0532k7831
62563F63366k4855k2411k0893j9674j7854j5366j2999j1475j0722j0071q959p438
62551D80649o039n120m524l974l603l632l735l283k285j442j021l66R69K247K447
62536D47288J740J228J349J508J317J291J877K582K752K740L567N562Q008J0120
62522D92929J1828J3471J5240J7238J9696K2710K5859K8537L0663L2804L5392
62511G46367L8079M0125M1317M2100M2670M2336M0167L6142L1214K6122K0540
62500A147179J3748N841k119r103j4874j9629k3266k5325k5558k4303k2265j9950
$$ y = [1017973, 1058121, 1093595, 1123537, 1147409, 1164400, 1173858, 1175577, 1169373, 1154958, 1132667, 1103894, 1070390, 1033348, 993466, 951616, 909088, 867247, 827197, 789593, 754523, 721729, 691197, 663366, 638511, 616100, 595207, 575533, 557679, 542313, 529314, 517839, 507117, 497046, 488087, 480649, 474610, 469490, 464966, 460992, 457389, 453757, 450022, 446739, 444454, 443012, 441991, 441625, 442594, 444841, 447288, 449028, 450256, 451605, 453113, 454430, 455721, 457598, 460180, 462932, 465672, 469239, 474801, 482809, 492929, 504757, 518228, 533468, 550706, 570402, 593112, 618971, 647508, 678171, 710975, 746367, 784446, 824571, 865888, 907988, 950658, 992994, 1033161, 1069303, 1100517, 1126639, 1147179, 1160927, 1166768, 1164649, 1155546, 1140672, 1121043, 1097777, 1072452, 1046894, 1022591, 1000326, 980376]
62488I80376j7367j4195j0254n764j124L479Q094J2686J7036K1076K4982K8695
62476A047720L1581L3007L3122L2493L0863K6985K0227J1927M364j560p015j3490
62464A250224k1030k8588l5467m1611m6656m9631n0040m8746m7215m5962m4261
62453G91017m1382l7680l4110l0920k7397k3002j8345j4568j1974r794p388n064
62441E29393l370k088n76J062J974J857J498J647J907J458M22k78l87p90k240
62426E31489m252n776o494o969p680q517r082r095q425p171n838n056m934m940
62412D37260m562l888l281k809k312j906j984k607l164k940j934r04n45p65r24
62397D02735n99N4P09J270J767K129K383K847L716M523M555L826L153L095L337
$$ y = [980376, 963009, 948814, 938560, 932796, 931672, 935151, 943245, 955931, 972967, 994043, 1019025, 1047720, 1079301, 1112308, 1145430, 1177923, 1208786, 1235771, 1255998, 1267925, 1272289, 1270729, 1263714, 1250224, 1229194, 1200606, 1165139, 1123528, 1076872, 1027241, 977201, 928455, 881240, 835278, 791017, 749635, 711955, 677845, 646925, 619528, 596526, 578181, 563613, 551639, 541845, 534457, 529393, 526023, 523935, 523359, 524421, 526395, 528252, 529750, 531397, 533304, 534762, 535184, 534906, 534519, 533729, 531489, 527237, 521461, 514967, 507998, 500318, 491801, 482719, 473624, 465199, 458028, 452190, 447134, 442200, 437260, 432698, 428810, 425529, 422720, 420408, 418502, 416518, 413911, 410747, 407807, 405873, 404969, 404424, 403659, 402735, 402136, 402190, 402899, 404169, 405936, 408065, 410448, 413295, 417011, 421534, 426089, 429915, 433068, 436163, 439500]
62382D39500L413L504M003M664M913M831N209O479Q129R407J0130J0679J1457
62369E26318J2567J3798J4793J5506J6456J8228K0673K3034K4996K7161L0236
62358G43766L4203L8539M2859M6929N0491N3386N5668N7157N7194N5215N1274
62347A286681M5609L8146K8998J9117R654R07p363j4850k0951k6019l1111l6259
62335A292559m0203m2382m4002m6100m7570m6436m2653l8217l4677l1777k8735
62324H49807k5575k2710k0198j8106j6901j6816j7274j7612j7943j8669j9484
62313F38519j9529j8496j6984j5725j4908j4261j3375j1942j0062q351p422p181
62301D80283o900o041m700l252j990j137q32q80q24m79j48o2M7N63J377K048K483
$$ y = [439500, 442913, 446417, 450420, 455084, 459997, 464828, 470037, 476516, 484645, 494052, 504182, 514861, 526318, 538885, 552683, 567476, 582982, 599438, 617666, 638339, 661373, 686369, 713530, 743766, 777969, 816508, 859367, 906296, 956787, 1010173, 1065841, 1122998, 1180192, 1235407, 1286681, 1332290, 1370436, 1399434, 1418551, 1428205, 1429112, 1421749, 1406899, 1385948, 1359929, 1328818, 1292559, 1252356, 1209974, 1165972, 1119872, 1072302, 1025866, 983213, 944996, 910319, 878542, 849807, 824232, 801522, 781324, 763218, 746317, 729501, 712227, 694615, 676672, 658003, 638519, 618990, 600494, 583510, 567785, 552877, 538616, 525241, 513299, 503237, 494886, 487464, 480283, 473383, 467342, 462642, 459390, 457400, 456263, 455431, 454551, 453727, 453248, 453100, 453038, 453085, 453648, 455025, 457073, 459556]
62284D59556L017L808M492M710M688N060O060P178P699P525P267P551Q388R349
62270E46348J0133J0786J1427J2131J3066J4427J6138J7869J9576K1781K5046
62259G18728K9280L3795L8002M1865M5665M9502N3066N5895N7727N8575N8287
62248A240387N6170N1433M4161L5522K6729J7992Q758j140j1039k0015k7630l4066
62236A387262l9873m5574n1212n6125n9414o0661o0030n7858n4469n0385m6183
62225H05478m1964l7404l2526k8059k4642k2023j9408j6517j3804j1742j0333
62214E47056r345q666q214p753o956n683m081k505j276l52O96K199L888N162N862
62199E10032O504P548Q769R637J0114J0583J1114J1288J0946J0606J0731J0934
$$ y = [459556, 462573, 466381, 470873, 475583, 480271, 485331, 491391, 498569, 506268, 513793, 521060, 528611, 536999, 546348, 556481, 567267, 578694, 590825, 603891, 618318, 634456, 652325, 671901, 693682, 718728, 748008, 781803, 819805, 861670, 907335, 956837, 1009903, 1065798, 1123525, 1182100, 1240387, 1296557, 1347990, 1392151, 1427673, 1454402, 1472394, 1481152, 1480012, 1468973, 1448958, 1421328, 1387262, 1347389, 1301815, 1250603, 1194478, 1135064, 1074403, 1014373, 956515, 902046, 851661, 805478, 763514, 726110, 693584, 665525, 640883, 618860, 599452, 582935, 569131, 557389, 547056, 537711, 529045, 520831, 513078, 506122, 500439, 496358, 493853, 492577, 492225, 492921, 495120, 499008, 504170, 510032, 516536, 524084, 532853, 542490, 552604, 563187, 574301, 585589, 596535, 607141, 617872, 628806]
62187F28806J0442R264Q274Q058Q160P812P001O355O198O166N757M922L995L329
62173G24539L135L539M661O592R270J2382J5606J8981K2844K7266L1738L5640
62161I16193L8750M1066M2372M2309M0662L7209L1615K4037J5670P985J365m900
62149A234333j1249j7163k2035k6003k9517l2628l5121l6914l7885l7697l6254
62138I11867l3938l1095k7626k3578j9608j6316j3458j0480p571n449m245l329
62126G15174k223j057L0J290K943M809O583Q113R234R669R266Q130O388M075J303
62111G83727j561l895m977m430k870j798k338m154o062p509q737r617r350p613
62097G08816n207l049j144R01K942M508N607O594P445P847P949Q354R297J0295
$$ y = [628806, 639248, 648512, 656786, 664844, 673004, 680816, 687817, 694172, 700370, 706536, 712293, 717215, 721210, 724539, 727674, 731213, 735874, 742466, 751736, 764118, 779724, 798705, 821549, 848815, 880553, 916193, 954943, 996009, 1038381, 1080690, 1121352, 1158561, 1190176, 1214213, 1229883, 1237868, 1239233, 1234333, 1223084, 1205921, 1183886, 1157883, 1128366, 1095738, 1060617, 1023703, 985818, 948121, 911867, 877929, 846834, 819208, 795630, 776022, 759706, 746248, 735768, 728197, 722748, 718503, 715174, 712951, 711894, 711924, 713214, 716157, 720966, 727549, 735662, 744896, 754565, 763831, 771961, 778349, 782424, 783727, 782166, 778271, 773294, 768864, 765994, 764196, 761858, 757704, 751642, 744133, 735396, 725779, 716429, 708816, 703609, 700560, 699416, 700317, 703259, 707767, 713374, 719968, 727413, 735260, 743209, 751563, 760860, 771155]
62083G71155J0837J0994J1190J1634J2288J3197J4592J6625J9020K1096K2226
62072I34854K2419K2367K2766K3636K4438K4827K5042K5485K6181K6801K7192
62061A206008K7599K8293K9107K9429K8605K6288K2525J7736J2554P451K369l011
62049A434953q616j3838j8332k2599k7414l2715l7534m1008m3182m4708m6006
62038A099001m6838m6602m4961m2240l9156l6196l3390l0734k8384k6218k3686
62027G00596k0572j7592j5622j4563j3593j2332j1061j0003r164q868r478j0434
62015E47314j0559r661q881r000r287q617p031n335l868k436j010L44J801L284
62001D77058M032L571K772K998M257N160M742L440K178J248M90j47o33j087j689
$$ y = [771155, 781992, 792986, 804176, 815810, 828098, 841295, 855887, 872512, 891532, 912628, 934854, 957273, 979640, 1002406, 1026042, 1050480, 1075307, 1100349, 1125834, 1152015, 1178816, 1206008, 1233607, 1261900, 1291007, 1320436, 1349041, 1375329, 1397854, 1415590, 1428144, 1435595, 1437964, 1434953, 1426337, 1412499, 1394167, 1371568, 1344154, 1311439, 1273905, 1232897, 1189715, 1145007, 1099001, 1052163, 1005561, 960600, 918360, 879204, 843008, 809618, 778884, 750500, 724282, 700596, 680024, 662432, 646810, 632247, 618654, 606322, 595261, 585258, 576094, 567226, 557748, 547314, 536755, 527094, 518213, 509213, 499926, 491309, 484278, 478943, 475075, 472639, 471629, 471973, 473774, 477058, 481090, 484661, 487433, 490431, 494688, 499848, 504590, 508030, 510208, 511456, 511946, 511799, 511166, 510079, 508390]
61986E08390k508l528m597n443o012o629p464p996p597o507n649n484n590n413
61972D27973m765l619k046n24L38N55O82Q44N42l48j071r56l05J05L8j25O8Q07
61954D18193J936K891L116K764K610L064L755M369N175O292P103P110O986P886
61940D83250J0008J2449J4386J5679J6441J6723J6734J6750J6702J6300J5666
61929F51088J5293J5215J4720J3130J0583P806N406L561K191J078j21j805m164
61916G33981o811q659q570o461l615j495l01R37K949N398P489Q940J0005J0907
61902G44694J1511J1436J0382Q409N944L316L42l295p230j0459j2463j3828j5362
61889G33397j6875j7418j6650j5338j4375j3745j2824j1429j0144r581r710j0050
$$ y = [508390, 505882, 502354, 497757, 492314, 486302, 479673, 472209, 464213, 456616, 450109, 444460, 438976, 433386, 427973, 423208, 419589, 417543, 417019, 417357, 417912, 418594, 419438, 419980, 419632, 418561, 417605, 417300, 417405, 417443, 417318, 417386, 418193, 420129, 423020, 426136, 428900, 431510, 434574, 438329, 442698, 447873, 454165, 461268, 468378, 475364, 483250, 493258, 505707, 520093, 535772, 552213, 568936, 585670, 602420, 619122, 635422, 651088, 666381, 681596, 696316, 709446, 720029, 727835, 733241, 736802, 738993, 740071, 739950, 738145, 733981, 727170, 718511, 709941, 703480, 699865, 698370, 698069, 699006, 701955, 707353, 714842, 723782, 733787, 744694, 756205, 767641, 778023, 786432, 792376, 795692, 796034, 792739, 785509, 775050, 762587, 748759, 733397, 716522, 699104, 682454, 667116, 652741, 638996, 626172, 614743, 604599, 595018, 585308, 575258]
61877E75258j0336j0676j1087j1218j0723r741q669p602o253m585l117k347k044
61864D76860j434j36J442K704L631M740O425Q598J0948J3254J5355J7102J8508
61851E77997J9885K1548K3431K5167K6511K7469K8030K8049K7502K6578K5227
61840H57394K2910J9126J4215R240N043J589j586m644p281r090r826r396p903
61827H79791n672k994J18L705P359J0243J1786J2088J1514J0129P869M910J469
61814I52315k667p829j3595j8860k2960k6225k9011l0788l0829k9442k7733k6190
61802F86186k4347k1955j9649j7997j6584j4707j2577j1093j0563j0343r817r115
61790E07439q688q532q215p492o574n856n475n168m592l752l058k857l007l107
$$ y = [575258, 564922, 554246, 543159, 531941, 521218, 511477, 502808, 495206, 488953, 484368, 481251, 478904, 476860, 475426, 475290, 476732, 479436, 483067, 487807, 494232, 502830, 513778, 527032, 542387, 559489, 577997, 597882, 619430, 642861, 668028, 694539, 722008, 750038, 778087, 805589, 832167, 857394, 880304, 899430, 913645, 922885, 927928, 929517, 927931, 923287, 916006, 906916, 897090, 887694, 879791, 874119, 871125, 871243, 874948, 882307, 892550, 904336, 916424, 927938, 938067, 945936, 950846, 952315, 949648, 941819, 928224, 909364, 886404, 860179, 831168, 800380, 769551, 740109, 712376, 686186, 661839, 639884, 620235, 602238, 585654, 570947, 558370, 547277, 536714, 526371, 516554, 507439, 498751, 490219, 482004, 474512, 467938, 462082, 456607, 451439, 446847, 443095, 440037, 437180, 434173, 431066]
61776D31066l047l032l029k580j375J82J289J570J279Q32M17J47K39P55J346J548
61760D27607J397J465K201L368M211M161L266K110J363J354J910K613L124L201
61746D63351K535J000r19k278k603k375k279k334k198j989k135k482k337j538
61732D41419p36l64O0J027K112K547K324K094K150K191K020J820J732J677J706
61717D63779K038K615L021L044K942K967K897K338J276J41o16r47j223j840k718
61702D79714l307l243k877k839l251l666l762l578l157k469j825j772k318k715
61688D38935k397j734j450j622j767j696j652j670j413q18m10o79j384j850j739
61673D16654j318r74p56m24J25O73Q96P03K56l02r41j502j560q69J56P47O51L56
$$ y = [431066, 428019, 424987, 421958, 419378, 418003, 418185, 419474, 421044, 422323, 423155, 423572, 423719, 423958, 424713, 426059, 427607, 429004, 430469, 432670, 436038, 440249, 444410, 447676, 449786, 451149, 452503, 454413, 457026, 460150, 463351, 465886, 466886, 465967, 463689, 461086, 458711, 456432, 454098, 451900, 449911, 447776, 445294, 442957, 441419, 440683, 440319, 440379, 441406, 443518, 446065, 448389, 450483, 452633, 454824, 456844, 458664, 460396, 462073, 463779, 465817, 468432, 471453, 474497, 477439, 480406, 483303, 485641, 486917, 487058, 486442, 485495, 484272, 482432, 479714, 476407, 473164, 470287, 467448, 464197, 460531, 456769, 453191, 450034, 447565, 445740, 443968, 441650, 438935, 436538, 434804, 433354, 431732, 429965, 428269, 426617, 424947, 423534, 422716, 422306, 421627, 420243, 418393, 416654, 415336, 414362, 413606, 413182, 413307, 413980, 414876, 415579, 415835, 415533, 414592, 413090, 411530, 410661, 410817, 411564, 412215, 412571]
61655D12571K92J99l43j004r50j6R46J165R31J017J490J712J427J216J641K543
61639D24837L402M010M304L969K728R73m60j234j799k590l339l485l024k533k421
61624D23338k506k458k361k527k861k821k141j290r13r98j052r27r44j173j228
61609C97138j075j403k642m091m632m186l725l916m392m483m089l570l208l069
61595C48657l088l069k872k690k860l254l277k712k216k506l323l640k945j884
61581C08321j485j986k652k723k193j563j046m63J44K99k16r24j277j382j565
61566B89289j660j368j040j291j842j690n72O27J162J305J470J350N81l54o33
61551B85334j36O26J286J697J648J137O60O29P57O11M52P86J380J549J274J178
$$ y = [412571, 412863, 413062, 412719, 411715, 410765, 410749, 411695, 412860, 413791, 414808, 416298, 418010, 419437, 420653, 422294, 424837, 428239, 432249, 436553, 440522, 443250, 444223, 443763, 442529, 440730, 438140, 434801, 431316, 428292, 425759, 423338, 420832, 418374, 416013, 413486, 410625, 407804, 405663, 404373, 403460, 402462, 401410, 400483, 399539, 398366, 397138, 396063, 394660, 392018, 387927, 383295, 379109, 375384, 371468, 367076, 362593, 358504, 354934, 351726, 348657, 345569, 342500, 339628, 336938, 334078, 330824, 327547, 324835, 322619, 320113, 316790, 313150, 310205, 308321, 306836, 304850, 302198, 299475, 297282, 295719, 294673, 294210, 294354, 294653, 294437, 293513, 292236, 290854, 289289, 287629, 286261, 285221, 283930, 282088, 280398, 279826, 280453, 281615, 282920, 284390, 285740, 286321, 285967, 285334, 285198, 285824, 287110, 288807, 290455, 291592, 292252, 292881, 293638, 294249, 294701, 295487, 296867, 298416, 299690, 300868]
61535C00868J358J137J43r99j433r96j11P63J342J525J358Q10k79j643k255j319
61519C00269M21J223M09q65j254q69p21j188j785k096k205k179j785q95J66Q07
61503B87453P41K43j62l96r20j893k576k190j208q54j225r88O31K436K782J729
61487B83603P30N82P77P34O03O11N49K32l9J29O97J307J671J726J610J558J608
61470B98688J490J093Q02R72J203P46l89j319j389p68J16J085J804J648N06o70
61454C05618q30o4O11O20L71M30P11P55M95L36N20O84K75o03j030k17J515K976
61436C13173L325K838K368K385K708K896K734K401K278K476K555J992R56J91O4
61421C45340J65R5J30O51J375J734J785K054K574K770K345J659J049L65n38j336
$$ y = [300868, 302226, 303363, 303506, 302507, 301074, 300078, 299967, 300730, 302072, 303597, 304955, 305765, 305486, 303843, 301588, 300269, 300690, 301913, 302322, 301457, 300203, 299334, 298613, 297425, 295640, 293544, 291339, 289160, 287375, 286480, 286646, 287453, 288194, 288437, 288275, 287879, 286959, 285066, 282490, 280300, 279092, 278238, 277013, 276025, 276656, 279092, 281874, 283603, 284333, 284915, 285692, 286426, 287029, 287640, 288189, 288421, 288382, 288511, 289208, 290515, 292186, 293912, 295522, 297080, 298688, 300178, 301271, 302073, 303045, 304248, 304994, 304605, 303286, 301897, 301129, 301245, 302330, 304134, 305782, 306288, 305618, 304788, 304724, 305335, 305955, 306326, 306756, 307467, 308222, 308717, 309053, 309573, 310257, 310532, 309929, 308899, 308682, 310197, 313173, 316498, 319336, 321704, 324089, 326797, 329693, 332427, 334828, 337106, 339582, 342137, 344129, 345085, 345276, 345340, 345505, 345600, 345730, 346381, 347756, 349490, 351275, 353329, 355903, 358673, 361018, 362677, 363726, 364091, 363553, 362217]
61405C62217j646j607j641j888k141k199j993j524r17m63l16l22l03l23m47l99
61389C44088J01P85J007N55q4l15o4L15M92L74R2o7J17O03J114J464J647J678
61371C53902J538J383J484J842K068J814J098J46p96j313r21L31J634K295K518
61356C69023K870L266L180K745K784L612M602N252N934O996P893P881P185O553
61342D39776O028N063L827L358M118N127N072L843K531K148K702L369L297K325
61328D92584J064J69m51j385k684l568l440k724k210j930j234N2J254J740J715
61313D78952J821K280K841L402M279N692P268Q342Q752Q970R392R826R917R849
61299E71583J0053J0356R892Q047N084J756j323l754n342o350p332q378q911q594
$$ y = [362217, 360571, 358964, 357323, 355435, 353294, 351095, 349102, 347578, 346661, 346198, 345882, 345560, 345257, 344934, 344487, 344088, 344189, 344974, 345981, 346536, 346452, 346137, 346073, 346388, 346880, 347254, 347346, 347279, 347396, 347999, 349113, 350577, 352224, 353902, 355440, 356823, 358307, 360149, 362217, 364031, 365129, 365275, 364479, 363166, 362245, 362576, 364210, 366505, 369023, 371893, 375159, 378339, 381084, 383868, 387480, 392082, 397334, 403268, 410264, 418157, 426038, 433223, 439776, 445804, 450867, 454694, 458052, 462170, 467297, 472369, 476212, 478743, 480891, 483593, 486962, 490259, 492584, 493648, 493817, 493366, 491981, 489297, 485729, 482289, 479565, 477355, 475425, 474191, 474243, 475497, 477237, 478952, 480773, 483053, 485894, 489296, 493575, 499267, 506535, 514877, 523629, 532599, 541991, 551817, 561734, 571583, 581636, 591992, 601884, 609931, 615015, 616771, 615448, 611694, 606352, 600002, 592670, 584292, 575381, 566787]
61285E66787q008p854p890p404o465n880n873n676m646l103j709o55J42M97J98
61270E02461l98n30J78J355K333K782K929L182L601L902M032M452N441O415O678
61255E48813O603P232Q509Q915P482N275L979L686L107J707L88k8P8o1n30j021
61239F04134j561k341l117l393l064k493k069j930k025k040j515l21J054K042
61225E81361K723L579M591N117M845M399M585N320N799N573N027M727M721M730
61211F47097M667M600M389L774K881K195J937J765J367J012J201J898K567L001
61197F84351L620M733N954O786P553R122J1580J3724J4287J3294J1799J0471R059
61184H06333P225N197L289J386n80k039k307j629j037j154j694k224k827l785
$$ y = [566787, 558779, 550925, 543035, 535631, 529166, 523286, 517413, 511737, 507091, 503988, 502279, 501624, 501766, 502263, 502461, 502063, 501533, 501711, 503066, 505399, 508181, 511110, 514292, 517893, 521795, 525827, 530279, 535720, 542135, 548813, 555416, 562648, 571157, 580072, 587554, 592829, 596808, 600494, 603601, 605308, 605696, 605668, 605746, 605685, 605155, 604134, 602573, 600232, 597115, 593722, 590658, 588165, 586096, 584166, 582141, 580101, 578586, 578265, 579319, 581361, 584084, 587663, 592254, 597371, 602216, 606615, 611200, 616520, 622319, 627892, 632919, 637646, 642367, 647097, 651764, 656364, 660753, 664527, 667408, 669603, 671540, 673305, 674672, 675684, 676885, 678783, 681350, 684351, 687971, 692704, 698658, 705444, 712997, 722119, 733699, 747423, 761710, 775004, 786803, 797274, 806333, 813558, 818755, 822044, 823430, 822850, 820811, 818504, 816875, 815838, 814684, 812990, 810766, 807939, 804154]
61170H04154n061o439p738q615q609p820p212p648q806r633r720r720j0350j1518
61156F85265j2592j3008j2465j0957q968p345o601o345n755m416k620r40J26K00
61142E93579q66k701m432n339n459n391n485n454m869l815k781k022j301k34J281
61127E44711L004M573N674O284O795P724R259J1188J3253J5298J7072J8272J8919
61114F82026J9426K0102K0873K1602K2264K2676K2484K1742K1088K0900K0728
61103I15911J9950J8644J7271J5831J3970J1648R035N939K059k297o446j0180
61091A011335j3631j6403j7845j8259j8784j9752k0159j9372j8395j8558j9654
61080H10523k0357k0075j9395j8826j8081j6739j4932j3079j1411r926q577p305
$$ y = [804154, 799093, 792654, 784916, 776301, 767692, 759872, 752660, 745012, 736206, 726573, 716853, 707133, 696783, 685265, 672673, 659665, 647200, 636243, 627275, 619930, 613329, 606984, 601229, 596813, 594193, 593253, 593379, 593579, 592713, 590012, 585580, 580241, 574782, 569391, 563906, 558452, 553583, 549768, 546987, 544965, 543664, 543430, 544711, 547715, 552288, 557962, 564246, 571041, 578765, 588024, 599212, 612465, 627763, 644835, 663107, 682026, 701452, 721554, 742427, 764029, 786293, 808969, 831453, 853195, 874283, 895183, 915911, 935861, 954505, 971776, 987607, 1001577, 1013225, 1022260, 1028199, 1030258, 1027961, 1021515, 1011335, 997704, 981301, 963456, 945197, 926413, 906661, 886502, 867130, 848735, 830177, 810523, 790166, 770091, 750696, 731870, 713789, 697050, 682118, 669039, 657628, 647702, 639125, 631820]
61068F31820o134n193m475l702k690j680r75l93N84K151M046N925P459Q201P929
61053F42873P193O998P783R140J0608J2228J4046J5598J6440J6904J7868J9778
61041G97457K2274K4720K6755K8356K9688L1022L2578L4328L6094L7873L9852
61030A140997M2090M4388M6644M8940N1108N2519N2804N2784N4154N8115O4575
61019A709118P2742Q2089R2659J04888J19457J36921J57295J80396K07027K39290
61009C101882K79468L29138L89870M63898N53171O58447P80379R20369J078491
61000H555113J251323J433343J616379J777890J865809J806499J548857J114917
60992B0970130O06618J54728j47152k70675k37739j00388O0437J38405L7671k71199
$$ y = [631820, 625686, 620493, 616018, 612316, 609626, 607946, 606971, 606578, 607162, 609313, 613359, 619284, 626743, 634944, 642873, 650066, 657064, 664847, 673987, 684595, 696823, 710869, 726467, 742907, 759811, 777679, 797457, 819731, 844451, 871206, 899562, 929250, 960272, 992850, 1027178, 1063272, 1101145, 1140997, 1183087, 1227475, 1274119, 1323059, 1374167, 1426686, 1479490, 1532274, 1586428, 1644543, 1709118, 1781860, 1863949, 1956608, 2061496, 2180953, 2317874, 2475169, 2655565, 2862592, 3101882, 3381350, 3710488, 4100358, 4564256, 5117427, 5775874, 6556253, 7476622, 8555113, 9806436, 11239779, 12856158, 14634048, 16499857, 18306356, 19855213, 20970130, 21576748, 21731476, 21584324, 21313649, 21075910, 20975522, 21035959, 21174364, 21212035, 20940836]
60982B0940836p24839j200037j580407j804246j868120j802824j650267j451640
60974H858456j241267j042131q65270p13657n86699m82311l97527l29281k75081
60965B925232k32946k00962j76970j58552j43436j30232j18484j07814r7376q6546
60955A471914p5666o5474n6214m7995m1502l7408l5205l3577l1830l0073k8204
60944I88766k5819k3218k1333k0301j9124j7172j5143j4012j3795j3857j3715
60933G91277j3122j2019j0909j0597j1041j1142j0182q815q027p824p637p339
60921F72623p047o467n325m065l284k878k464k245k525k702j846j32J329K102
60907F35074K894M295N919P121P885Q639R711J1120J2571J3579J4042J4535J5562
$$ y = [20940836, 20215997, 19015960, 17435553, 15631307, 13763187, 11960363, 10310096, 8858456, 7617189, 6575058, 5709788, 4996131, 4409432, 3927121, 3529594, 3200313, 2925232, 2692286, 2491324, 2314354, 2155802, 2012366, 1882134, 1763650, 1655836, 1558460, 1471914, 1396248, 1330774, 1274560, 1226565, 1185063, 1147655, 1112450, 1078873, 1047043, 1016970, 988766, 962947, 939729, 918396, 898095, 878971, 861799, 846656, 832644, 818849, 804992, 791277, 778155, 766136, 755227, 744630, 733589, 722447, 712265, 703450, 695423, 687599, 679962, 672623, 665576, 659109, 653784, 649719, 646435, 643557, 641093, 638848, 636323, 633621, 631775, 631643, 632972, 635074, 637968, 642263, 648182, 655303, 663188, 671827, 681538, 692658, 705229, 718808, 732850, 747385, 762947]
60894G62947J6659J6964J6532J6319J6802J7516J7953J8030J7455J5732J3217
60883I46126J1230J0467J0099Q995P164N246L390J411m79k088l935o533r293j1093
60869I70707j1792j2232j2866j3330j3501j3868j4632j5220j5149j4676j4226
60858H19215j3783j3304j3202j3839j4885j5636j5670j4914j3507j1955j1044
60847F67476j1044j1313j1201j0994j1344j2059j2266j1723j1149j1089j1168
60836E42126j0911j0617j0812j1169j0713r143p419o730p114p405o548m782l285
60823D35478k805k929k814k214j449o93J20P03M71n97j625j788j184m70O4N73
60807D18841J099J423J401J096N99R4q1J79L69r8r95j383p83K07P35O64M02Q0
$$ y = [762947, 779606, 796570, 813102, 829421, 846223, 863739, 881692, 899722, 917177, 932909, 946126, 957356, 967823, 977922, 986917, 994081, 999327, 1002717, 1004128, 1003649, 1001561, 997626, 991093, 981800, 970707, 958915, 946683, 933817, 920487, 906986, 893118, 878486, 863266, 848117, 833441, 819215, 805432, 792128, 778926, 765087, 750202, 734566, 718896, 703982, 690475, 678520, 667476, 656432, 645119, 633918, 622924, 611580, 599521, 587255, 575532, 564383, 553294, 542126, 531215, 520598, 509786, 498617, 487904, 478761, 471342, 464612, 457498, 450093, 443545, 438763, 435478, 432673, 429744, 426930, 424716, 423267, 422574, 422694, 423397, 423868, 423271, 421646, 419858, 418674, 418204, 418268, 418841, 419940, 421363, 422764, 423860, 424459, 424553, 424472, 424651, 425020, 424922, 423927, 422544, 421761, 421968, 422703, 423367, 423769, 423849]
60789D23849n60j529k254k162j368n41j86k72o34j355k431l317l361k778k574
60774C98527l219l967l898l149k502k183j842j478j468j714j621j060n70m47l59
60759C69050j33j08k89m4Q13J425J060K74P0M15N40L75O03J396K113K397K661
60742C82618L215L615L329K505J653R52K17p19j850l050m018m377m077l558l350
60727C73105l605m034m231l991l442k932k668k582k582k730k951k873k347j880
60713C30257k000k373k195j421q54r33j191j224j365j856k050j335l27k60j287
60698C09586k275k289j521n70L85J304J795J522Q54N65R62J696K355K866L286
60683C20521L562L585L328K838K258J887K001K516L070L469L830M177M226L832
$$ y = [423849, 423289, 421760, 419506, 417344, 415976, 415435, 415249, 414977, 414343, 412988, 410557, 407240, 403879, 401101, 398527, 395308, 391341, 387443, 384294, 381792, 379609, 377767, 376289, 374821, 373107, 371486, 370426, 369856, 369409, 369050, 368917, 368809, 368520, 368476, 369289, 370714, 371774, 372048, 372118, 372533, 373073, 373448, 374051, 375447, 377560, 379957, 382618, 385833, 389448, 392777, 395282, 396935, 397887, 398104, 397385, 395535, 392485, 388467, 384090, 380013, 376455, 373105, 369500, 365466, 361235, 357244, 353802, 350870, 348202, 345620, 343038, 340308, 337357, 334484, 332137, 330257, 328257, 325884, 323689, 322268, 321414, 320481, 319290, 318066, 316701, 314845, 312795, 311460, 311133, 310873, 309586, 307311, 305022, 303501, 302931, 303316, 304620, 306415, 307937, 308791, 309356, 310318, 312014, 314369, 317235, 320521, 324083, 327668, 330996, 333834, 336092, 337979, 339980, 342496, 345566, 349035, 352865, 357042, 361268, 365100]
60669C65100L393L424L788L836L216K219J281N67J58K09O71J132J217Q99L15m48
60653C90977j121j155k95R07J506J142K93l02k93J72O08N08k64j391k483l440
60637C85369m300m910n063m851m589m467m348l926k962j639o92q42j785k227j337
60622C37431K49J273J295P67J14m53n35J05Q47Q33K42R2O32R79N89J17K99Q77
60604C45753J248J406J539J318L89q55j647j675j011L28K081L422L662L065K370
60589C61393J785J074L33r5k62m98p44o87m57m64o16m32R6N38R46J911L529N067
60571C72417N976O547P186P735P993Q333R125R967J0104R389Q242O826M855K322
60557D77017j50j951l118m087m929n245m782l863k919j837k16J741L183L707M071
$$ y = [365100, 368493, 371917, 375705, 379541, 382757, 384976, 386257, 386824, 386982, 387191, 387862, 388994, 390211, 391110, 391425, 390977, 389856, 388701, 388406, 389313, 390819, 391961, 392254, 391952, 391659, 391831, 392439, 392947, 392683, 391292, 388809, 385369, 381069, 376159, 371096, 366245, 361656, 357189, 352841, 348915, 345953, 344314, 343622, 342780, 340995, 338768, 337431, 337680, 338953, 340248, 341015, 341129, 340676, 340141, 340246, 341093, 341926, 342168, 342260, 342892, 343871, 344460, 344577, 344876, 345753, 347001, 348407, 349946, 351264, 351653, 350798, 349151, 347476, 346465, 346793, 348874, 352296, 355958, 359023, 361393, 363178, 364252, 364585, 364490, 364228, 363730, 362986, 362299, 361842, 361378, 360762, 360330, 360426, 360964, 361910, 363821, 367350, 372417, 378393, 384940, 392126, 399861, 407854, 416187, 425312, 435279, 445383, 454772, 463014, 469840, 474695, 477017, 476867, 474916, 471798, 467711, 462782, 457537, 452755, 448892, 445973, 444136, 443920, 445661, 448844, 452551, 456622]
60542D56622N332P537R780J1318J2077J2201J1790J1116J0448R550P812N105J998
60529E72686r64l601n662o662o550n920n233m396l430k860k872k738j817o21n9
60514E19301j1L87J283J924J973K033K625L466M169M974O352Q450J1255J4845
60500E83026J8941K2722K5582K7850L0276L3080L5858L8114L9379L9010L6520
60489I30358L2105K6355J9473J1215J668q450j8272k7212l4763m0387m3835m5269
60477H02986m4829m2478l8611l4322l0591k7315k3783j9952j6639j4331j2493
60466D97642j0511q776q134q438q410p200n508m664m942n307m803l652k774k672
60452D11851l050l353l289k908k487k369k599k697k114r88j74k93j030j580j589
$$ y = [456622, 461954, 469491, 479271, 490589, 502666, 514867, 526657, 537773, 548221, 557771, 565583, 570688, 572686, 571722, 568121, 562459, 555797, 549247, 543327, 538094, 533698, 530268, 527408, 524536, 521798, 519981, 519360, 519301, 519290, 519677, 520960, 522884, 524857, 526890, 529515, 532981, 537150, 542124, 548476, 556926, 568181, 583026, 601967, 624689, 650271, 678121, 708397, 741477, 777335, 815449, 854828, 893838, 930358, 962463, 988818, 1008291, 1019506, 1021174, 1012724, 994452, 967240, 932477, 892090, 848255, 802986, 758157, 715679, 677068, 642746, 612155, 584840, 561057, 541105, 524466, 510135, 497642, 487131, 478355, 470221, 461783, 453373, 446173, 440665, 436001, 431059, 425752, 420949, 417297, 414523, 411851, 408801, 405448, 402159, 399251, 396764, 394395, 391796, 389099, 386985, 385997, 385823, 385530, 384500, 382920, 381331]
60437C81331j302r79n87j22J83J40j44m26o16p16o86n19l52k98k51qM30P78P23
60418C76579K40l42n99l99K0M62J070K022K929L028K099Q53J63K32P63J553K443
60401C93116K927K510J480P61P94J115J197J254J723K383K578K141J672J749K330
60386D19730L025L580L882L764L110K180J578J723K449L181L520L505L406L403
60372D62036L568L980M576M949M655L781K915K416K012J364O62K86J03k73n96
60357D96434k7J689L557M312L789K942K741L391M552N796O824P551Q050Q220P605
60342E67426N887L526J429p7j497l213m771n485n336m841m327l865l687m048m688
60327E32433n014m884m781n051n470n701n747n664n276m495l585k737j665o2J729
$$ y = [381331, 380029, 379050, 378463, 378341, 378524, 378664, 378520, 378094, 377478, 376762, 376076, 375557, 375205, 374907, 374656, 374648, 375078, 375856, 376579, 376819, 376477, 375878, 375479, 375499, 375961, 377031, 379053, 381982, 385010, 387109, 387962, 388125, 388357, 389120, 390673, 393116, 396043, 398553, 400033, 400794, 401588, 402703, 403900, 405154, 406877, 409260, 411838, 413979, 415651, 417400, 419730, 422755, 426335, 430217, 433981, 437091, 439271, 440849, 442572, 445021, 448202, 451722, 455227, 458633, 462036, 465604, 469584, 474160, 479109, 483764, 487545, 490460, 492876, 494888, 496252, 496914, 497200, 497303, 497030, 496434, 496407, 498096, 501653, 505965, 509754, 512696, 515437, 518828, 523380, 529176, 536000, 543551, 551601, 559821, 567426, 573313, 576839, 578268, 578191, 576694, 573481, 568710, 563225, 557889, 553048, 548721, 544856, 541169, 537121, 532433, 527419, 522535, 517754, 512703, 507233, 501532, 495785, 490121, 484845, 480350, 476765, 474028, 472363, 472301, 474030]
60312D74030K942L259L199L653N262P999J1133J3713J5506J7202J9346K1240K1458
60299F19942J9403J5751J1343O337P11n079j0431j5155j9147k1788k2337k0848
60287E58702j8207j5220j2110r018o475m971m283l629k568j525j254j882k708
60274D74852k974k635k174j818j380q89q93j735k840l194k534j645j420j930k565
60259D44226k790k550k079j619j303j192j312j588j753j473p04Q4L40R0o0L58
60243D26675J127J635J484O69n00j458j602q34K20Q61J092J441K101K678K773
60228D38362K431J864J227P96R58J662K288K410K363K585K803K478J886J980L067
60213D69160M324M867M733M514M560M951N699O497O676N993N258N418O194O330
$$ y = [474030, 476972, 480231, 483430, 487083, 492345, 500344, 511477, 525190, 540696, 557898, 577244, 598484, 619942, 639345, 655096, 666439, 672776, 673487, 668408, 657977, 642822, 623675, 601887, 579550, 558702, 540495, 525275, 513165, 504147, 497672, 492701, 488418, 484789, 482221, 480696, 479442, 477560, 474852, 471878, 469243, 467069, 465251, 463871, 462982, 462089, 460354, 457514, 454320, 451786, 450141, 448721, 446791, 444226, 441436, 438886, 436807, 435188, 433885, 432693, 431381, 429793, 428040, 426567, 425863, 425947, 426287, 426377, 426317, 426675, 427802, 429437, 430921, 431590, 431090, 429632, 428030, 427196, 427416, 428277, 429369, 430810, 432911, 435589, 438362, 440793, 442657, 443884, 444680, 445638, 447300, 449588, 451998, 454361, 456946, 459749, 462227, 464113, 466093, 469160, 473484, 478351, 483084, 487598, 492158, 497109, 502808, 509305, 515981, 521974, 527232, 532650, 538844, 545174]
60199E45174N284L989L691M471N250N012L766K459J996K223K020O29j260k293
60185E82411k168j859k117k587k775k980l558m008l667k903k667l139l675l895
60171E40413l963l852l347k796k823l193k980k189j994k821l391k573j217r27
60157E02347j690k068j369k72O33J520K355K471J670P83O09R43J224J423J753
60142E12332K055K128K226K679L353L971M589N298N761N614N058M513L974L252
60128E66803K560K231J986J191j51j212j291m89O01J472J902J976K037K321K595
60113E84532K446J913J486J484J740J956K000J764J079l5j186j804j580p80j93
60098E94822m96j543k517k906k908k707j942m79R18J511J775K603L661L690K534
$$ y = [545174, 550458, 554447, 558138, 562609, 567859, 572871, 576637, 579096, 581092, 583315, 585335, 585964, 584704, 582411, 580243, 578384, 576267, 573680, 570905, 567925, 564367, 560359, 556692, 553789, 551122, 547983, 544308, 540413, 536450, 532598, 529251, 526455, 523632, 520439, 517459, 515270, 513276, 510455, 507064, 504491, 503274, 502347, 500657, 498589, 497220, 496948, 497581, 499101, 501456, 503927, 505597, 506380, 506989, 507932, 509156, 510579, 512332, 514387, 516515, 518741, 521420, 524773, 528744, 533333, 538631, 544392, 550006, 555064, 559577, 563551, 566803, 569363, 571594, 573580, 574771, 574620, 573408, 572117, 571628, 572229, 573701, 575603, 577579, 579616, 581937, 584532, 586978, 588891, 590377, 591861, 593601, 595557, 597557, 599321, 600400, 600365, 599179, 597375, 595795, 595015, 594822, 594326, 592783, 590266, 587360, 584452, 581745, 579803, 579324, 580242, 581753, 583528, 586131, 589792, 593482, 596016]
60083E96016J612J975K897K999J916K46j419k758l530l816m083m561m918m974
60069E77602n206o088p333q289q728q767q480q012p694p533p058o111n258m904
60055D78141m576l757k865k576k637k216j119J30J180K008K470K545K750L463
60041D72941M088L844L152L140L878M285L957L796M415M984M404K846J380N30
60027E21640j26j179k645l986m670m787n014n753o540o755o565o511o354n386
60013D55369l782k634k435k558k486k528k900l113k881k727k993l112k546j702
59999D16972j128n73K80Q64N90J12N79J831K539K109J431J528K297K884K756K110
59983D37181J629J899K813L553L492K911K362J729N15j084k211k532k624k986
$$ y = [596016, 597628, 599603, 602500, 605499, 607415, 607661, 606242, 603484, 599954, 596138, 592055, 587494, 582576, 577602, 572396, 566308, 558975, 550686, 541958, 533191, 524711, 516699, 509005, 501472, 494414, 488303, 483045, 478141, 473565, 469808, 466943, 464367, 461730, 459514, 458395, 458525, 459705, 461713, 464183, 466728, 469478, 472941, 477029, 480873, 484025, 487165, 491043, 495328, 499285, 503081, 507496, 512480, 516884, 519730, 521110, 521640, 521514, 520335, 517690, 513704, 509034, 504247, 499233, 493480, 486940, 480185, 473620, 467109, 460755, 455369, 451587, 448953, 446518, 443960, 441474, 438946, 436046, 432933, 430052, 427325, 424332, 421220, 418674, 416972, 415844, 415271, 415551, 416415, 417005, 417117, 417696, 419527, 422066, 424175, 425606, 427134, 429431, 432315, 435071, 437181, 438810, 440709, 443522, 447075, 450567, 453478, 455840, 457569, 458084, 457000, 454789, 452257, 449633, 446647]
59969D46647l325l174k696k409k405k198j355k9J091J331O37l42q27n64J39Q59
59953D31380J347J544J568J599J669J640J500J412J344J030N44N11J248K060J989
59938D52385J046J21k43k78l13k68l2K39M08N56P65R74J112J106P96K78J35Q03
59920D59590J725J864J154P33J438K751L651L906L955M001L907L778L908M097
59906E00458L641K163J90j311j806j535j112r84j138j256j033l86M73J145J321
59891D98830J151J243K024L195M064M428M692N114N325M914M128L625L697M106
59877E50536M557M965N184M828L617J832J83q27j406k200l503m829n436n197m773
59862E47531m787n033m727l505j930q88o07m71K09J422K609L458M292N627P469
$$ y = [446647, 443322, 440148, 437452, 435043, 432638, 430440, 429085, 429056, 430147, 431478, 432115, 431773, 430946, 430382, 430521, 431380, 432727, 434271, 435839, 437438, 439107, 440747, 442247, 443659, 445003, 446033, 446577, 447088, 448336, 450396, 452385, 453431, 453552, 453309, 453031, 452718, 452450, 452418, 452657, 453065, 453621, 454386, 455360, 456472, 457578, 458374, 458652, 458787, 459590, 461315, 463179, 464333, 465066, 466504, 469255, 472906, 476812, 480767, 484768, 488675, 492453, 496361, 500458, 504099, 506262, 506452, 505141, 503335, 501800, 500688, 499704, 498566, 497310, 496277, 495891, 496364, 497509, 498830, 499981, 501224, 503248, 506443, 510507, 514935, 519627, 524741, 530066, 534980, 539108, 542733, 546430, 550536, 555093, 560058, 565242, 570070, 573687, 575519, 575702, 574875, 573469, 571269, 567766, 562937, 557501, 552304, 547531, 542744, 537711, 532984, 529479, 527549, 526661, 526054, 525583, 525792, 527214, 529823, 533281, 537573, 543200, 550669]
59847E50669R129R647Q462N876K937P18l92o81n66k91p3r9l42o73j252k382l838
59830E76849m874n161n236n585n794n159l841k759k486k849l489m204m720m737
59816E15955m372m087m065l981l469k480j203k2N13J10p46j176q96m77n84j286
59800D87734k171k733k653k071j596j693k107k295k318k578k803k159n89P99J102
59785D61869O65K74Ln15j125j275q27j69L31M93J99l69n83m1P77J046O96L78L95
59766D62222L53Pk51j2M80P01N93N30P42J145J636K223K824L274L595L986M444
59749D88492M636M401M114M249M683M889M718M536M509M296L686L025K631K254
59735E45119J573Q68N62M14j46j059j616j364l96J018K386K760J532m28j391p70
$$ y = [550669, 559798, 569445, 577907, 583783, 586720, 587438, 587046, 586365, 585799, 585508, 585435, 585336, 584994, 584321, 583069, 580687, 576849, 571975, 566814, 561578, 555993, 550199, 545040, 541199, 538440, 535954, 533105, 529616, 525412, 520692, 515955, 511583, 507496, 503431, 499450, 495981, 493501, 492298, 492276, 492789, 492899, 492153, 490977, 490081, 489604, 489020, 487734, 485563, 482830, 480177, 478106, 476510, 474817, 472710, 470415, 468097, 465519, 462716, 460557, 459968, 460767, 461869, 462534, 462808, 462811, 462296, 461171, 459896, 459069, 458900, 459231, 459724, 459923, 459554, 458971, 458930, 459707, 460753, 461449, 461827, 462222, 462575, 462582, 462331, 462319, 462799, 463500, 464093, 464623, 465365, 466510, 468146, 470369, 473193, 476467, 480062, 484048, 488492, 493128, 497529, 501643, 505892, 510575, 515464, 520182, 524718, 529227, 533523, 537209, 540234, 542865, 545119, 546692, 547560, 548122, 548536, 548390, 547331, 545715, 544351, 543955, 544973, 547359, 550119, 551651, 551223, 549832, 549062]
59719E49062K60M79J09J2K83L11j76q92j421j415o90M12J074R20N25O77J420K274
59701E53224K925L247L032K315J669J685K306L031L482L429K709J538N29n3n96
59686E84472j307j704j497j272j522j612p59M36O21l80j468k034k565l368l914
59671E62127l892l866m315m819m813m493m335m247l780k957k296k155k342k304
59657E11513j566j60J280K040K056J875J974K366K779K926K655K174J966K058
59643E35936J681K43j586k576k520k270k308k352k464l233m456m818l658k045
59629E03574j297j294j199j013j279j759j661j017p37j273k133k811l346l828
59615D78927m047l872l453k964k573k544k861k857j896m31M34M83O85J673K759
$$ y = [549062, 549322, 549801, 549910, 549922, 550205, 550516, 550340, 549448, 548027, 546612, 545922, 546334, 547408, 548328, 548853, 549530, 550950, 553224, 556149, 559396, 562428, 564743, 566412, 568097, 570403, 573434, 576916, 580345, 583054, 584592, 585121, 585068, 584472, 583165, 581461, 579964, 578692, 577170, 575558, 574799, 575235, 575856, 575476, 574008, 571974, 569409, 566041, 562127, 558235, 554369, 550054, 545235, 540422, 535929, 531594, 527347, 523567, 520610, 518314, 516159, 513817, 511513, 509947, 509787, 511067, 513107, 515163, 517038, 519012, 521378, 524157, 527083, 529738, 531912, 533878, 535936, 537617, 537860, 536274, 533698, 531178, 528908, 526600, 524248, 521784, 518551, 514095, 509277, 505619, 503574, 502277, 500983, 499784, 498771, 497492, 495733, 494072, 493055, 492318, 491045, 488912, 486101, 482755, 478927, 474880, 471008, 467555, 464591, 462018, 459474, 456613, 453756, 451860, 451429, 451863, 452346, 453031, 454704, 457463]
59600D57463K950K250J383O99P1m72o85n88m60l60p9M00P61P43M16K8k25l31m93
59581D63471r72j674k053j761j260j358k141k815k714k102j681j745k093k502
59567D36600k819k709j894o86J16Q1l53m44p5K18N0k04K08J349K219J718Q8j077
59549D32386n36J172K513K978L512M861O392P105P200P770R175J0649J1636J2730
59535E19543J4742J7098J7823J5224R585K983k456o025q122q892p891n219k203
59522E56190k53N73J217K046K360J549Mj331j894j817j719k315l874n810p127
59507E37799p430p162o829o508o176o045o196o325o136n637m824l495j830o76
59493D62530p66j767k574k448j547m51L78P75Q33Q32R77J163J146Q89P24J138
$$ y = [457463, 460413, 462663, 464046, 464745, 464816, 464344, 463659, 463071, 462611, 462251, 462172, 462572, 463333, 464076, 464492, 464520, 464295, 463964, 463471, 462499, 460825, 458772, 457011, 455751, 454393, 452252, 449437, 446723, 444621, 442940, 441195, 439102, 436600, 433781, 431072, 429178, 428492, 428608, 428689, 428336, 427892, 427817, 428035, 428085, 427881, 428089, 429438, 431657, 433375, 433463, 432386, 431850, 433022, 435535, 438513, 442025, 446886, 453278, 460383, 467583, 475353, 484528, 495177, 506813, 519543, 534285, 551383, 569206, 584430, 594015, 596998, 594542, 588517, 580395, 571503, 563612, 558393, 556190, 555937, 556510, 557727, 559773, 562133, 563682, 563686, 562355, 560461, 558644, 556925, 554610, 550736, 544926, 537799, 530369, 523207, 516378, 509870, 503694, 497649, 491453, 485128, 478992, 473355, 468531, 465036, 463206, 462530, 461764, 459997, 457423, 454975, 453428, 452977, 453355, 454130, 454963, 455795, 456772, 457935, 459081, 459970, 460694, 461832]
59477D61832K345L918M895M652L660L025L223L727L953L972L938L456K186O39
59463E09421k66k69J62O14J049J488J995K858M197N486O013N824N661N922O312
59448E56467O573O912P394P515O737N116L106R43j422l984o415q149q753q428
59434E63612p954p823p557o389m526l060k513k224j468m39L68J163K503M376O348
59419E34417Q391J0765J3255J5199J6424J7461J8759K0287K1983K3805K4967K3785
59407G49498J9005J1142K097o249j2682j6377j6938j4918j1547p623l137J571
59395F93842M770M251o47q207j5653k0970k3552k3728k2180j9649j6726j3753
59383E37798j0972q666o990n702m373k911j678r78n73P9J130K158K693K822L022
$$ y = [461832, 464177, 468095, 472990, 477642, 481302, 484327, 487550, 491277, 495230, 499202, 503140, 506596, 508782, 509421, 509155, 508886, 509048, 509662, 510711, 512199, 514194, 517052, 521249, 526735, 532748, 538572, 544233, 550155, 556467, 563040, 569952, 577346, 584861, 591598, 596714, 599820, 600763, 599341, 595357, 588942, 580793, 572040, 563612, 555658, 547835, 540278, 533889, 529363, 526303, 523790, 521566, 520098, 519659, 520027, 521190, 523693, 528069, 534417, 542808, 553573, 566828, 582027, 598451, 615912, 634671, 654958, 676941, 700746, 725713, 749498, 768503, 779645, 781742, 775493, 762811, 746434, 729496, 714578, 703031, 695408, 692271, 693842, 698612, 702863, 702216, 694009, 678356, 657386, 633834, 610106, 587926, 568277, 551551, 537798, 526826, 518160, 511170, 505468, 501095, 498184, 496506, 495528, 494955, 495034, 496164, 498322, 501015, 503837, 506859]
59368E06859L466L830L834L754M027M518M658M313M129M701N779O602O845O879
59354E74194P183P872Q791R738J0559J1230J1973J3050J4384J5595J6418J6853
59342G17840J6916J6486J5577J4512J3595J2668J1252R098O485L887J471j037
59330H38750l870o771r191j0998j2684j4595j6225j6679j5865j4710j4033j3603
59318F89526j2612j0823q874p548o967o551n622m077k509j551j062k01J583L826
59304F26538N560O366O736P511R188J1480J3214J2806R425L844k078o917j0429
59291F93244j2879j4153j3948j2487j0551q719o940m966l021j697j269j271r50
59278F00393o6Q97J400J562J995L053M426N551O175O501O872P459Q122Q545Q507
$$ y = [506859, 510325, 514155, 517989, 521743, 525770, 530288, 534946, 539259, 543388, 548089, 553868, 560470, 567315, 574194, 581377, 589249, 598040, 607778, 618337, 629567, 641540, 654590, 668974, 684569, 700987, 717840, 734756, 751242, 766819, 781331, 794926, 807594, 818846, 827944, 834429, 838316, 839787, 838750, 834880, 828109, 818918, 807920, 795236, 780641, 764416, 747737, 731872, 717162, 703129, 689526, 676914, 666091, 657217, 649669, 642702, 636151, 630529, 626452, 623943, 622392, 621330, 621129, 622712, 626538, 632098, 638464, 645200, 652711, 661899, 673379, 686593, 699399, 708824, 712668, 710590, 703673, 693244, 680365, 666212, 652264, 639777, 629226, 620507, 613567, 608601, 605580, 603883, 602614, 601343, 600393, 600327, 601224, 602624, 604186, 606181, 609234, 613660, 619211, 625386, 631887, 638759, 646218, 654340, 662885, 671392]
59263F71392P996P007N402L194Q00j353l418n814q284r876j0157r828r763r842
59249F27456r410q444p495o697n661m331l086j981o54P60J489J283Q71Q07O60
59234E85567M8k57P13K487L572L348K610K131J634N03j210k872l928m210l953
59219E86183l770m145m875n319n244m989m706m062k929j765j015o30m72o70j175
59204E40417j482j321j104j201j198n19O18J518K010K403K658K439J906J704J996
59189E50844K289K406K894M044N098N024L839K597K178K428K616K364J989J932
59175E92542K113K059J640J340J628K366L118L784M445M826M554L905L687M226
59161F36233N021N546N842O046N939N320M381L251J648n44k716m166m979n717
$$ y = [671392, 679388, 686395, 691797, 694991, 695791, 694438, 691020, 685206, 676922, 667046, 656889, 647061, 637298, 627456, 618046, 609602, 602107, 595410, 589749, 585418, 582332, 580351, 579697, 580457, 581946, 583229, 584100, 584907, 585567, 585615, 585358, 586071, 588558, 592130, 595478, 598088, 600219, 601853, 602356, 601146, 598274, 594346, 590136, 586183, 582413, 578268, 573393, 568074, 562830, 557841, 553135, 549073, 546144, 544379, 543364, 542734, 542262, 541592, 540417, 538935, 537614, 536510, 535309, 534111, 533592, 534210, 535728, 537738, 540141, 542799, 545238, 547144, 548848, 550844, 553133, 555539, 558433, 562477, 567575, 572599, 576438, 579035, 581213, 583641, 586257, 588621, 590610, 592542, 594655, 596714, 598354, 599694, 601322, 603688, 606806, 610590, 615035, 619861, 624415, 628320, 632007, 636233, 641254, 646800, 652642, 658688, 664627, 669947, 674328, 677579, 679227, 678683, 675967, 671801, 666822, 661105]
59147F61105o443o786o794o872o861o058m490l347l495m179l968k681j556j538
59133E96037k243k795k944k930k750k229j554j191j203j138o78m0M40Q46J541
59118E77169K646L894M934N627O014O186O255O423O856P387P455O680N559N159
59104F58244N834O575O185M823L775L680L798L200K000Q99J76l64q36j296j949
59089F94744k714k928k182j229j207k087k700k395j868k144l436n283p170q567
59075F48834q981q477p786p526p586p528p218o724o007n135m451m150m004l795
59061E59466l697l747l477k531j416r64j331k065k788l274l073k005q42o63j439
59046E26154k110k139k059k240k093j127LL85J95K79P29Q10K46k70o6P29J634
$$ y = [661105, 654662, 647876, 641082, 634210, 627349, 621291, 616801, 613454, 609959, 605780, 601812, 599131, 597575, 596037, 593794, 590999, 588055, 585125, 582375, 580146, 578592, 577401, 576198, 575060, 574382, 574342, 574782, 575628, 577169, 579815, 583709, 588643, 594270, 600284, 606470, 612725, 619148, 626004, 633391, 640846, 647526, 653085, 658244, 664078, 670653, 676838, 681661, 685436, 689116, 692914, 696114, 698114, 699013, 699189, 698825, 697989, 696693, 694744, 692030, 689102, 686920, 685691, 684484, 682397, 679697, 677302, 675434, 673290, 669854, 664571, 657401, 648834, 639853, 631376, 623590, 616064, 608478, 600950, 593732, 587008, 581001, 575866, 571415, 567265, 563261, 559466, 555769, 552022, 548545, 546014, 544598, 543634, 542303, 540238, 537450, 534176, 531103, 529098, 528256, 527593, 526154, 524044, 521905, 519846, 517606, 515513, 514386, 514389, 514774, 514969, 515248, 515977, 516787, 517033, 516763, 516697, 517426, 519060]
59029E19060K476L290L949M364M844N833P345Q856R795J0026R887R826R918R822
59015F19291R256Q412P685O997N893M316K835J758N69j214k980l513k538j007
59001F55760K84J527L064M429M959M878M942N196M852L531J813M27n60j318j688
58986F92096j563j472k110l334m253m307l841l442l144k501j229M93K225L614
58972F67232M622N542O645P793Q544Q761Q928R601J0641J1270J0938R908Q850
58959G79275Q021P070N613L756J890J47j696l734n643p076q192r471j0935j1969
58945G47056j2089j1625j1271j1086j0390q765o735n153m250l699l425l748m604
58932F50216n140m572l208k155k082k685l312l635l508k753j548p21r77j875k140
$$ y = [519060, 521536, 524826, 528775, 533139, 537983, 543816, 551161, 560017, 569812, 579838, 589725, 599551, 609469, 619291, 628547, 636959, 644644, 651641, 657534, 661850, 664685, 666443, 667012, 665798, 662818, 659305, 656767, 655760, 656044, 657571, 660635, 665064, 670023, 674901, 679843, 685039, 689891, 693422, 695235, 695662, 695102, 693784, 692096, 690533, 689061, 686951, 683617, 679364, 675057, 671216, 667774, 664630, 662129, 660900, 661393, 663618, 667232, 671854, 677396, 684041, 691834, 700378, 709139, 718067, 727668, 738309, 749579, 760517, 770425, 779275, 787296, 794366, 799979, 803735, 805625, 805772, 804076, 800342, 794699, 787623, 779431, 769960, 759025, 747056, 734967, 723342, 712071, 700985, 690595, 681830, 675095, 669942, 665692, 661993, 658568, 654820, 650216, 645076, 640504, 637296, 635141, 633059, 630374, 627062, 623427, 619919, 617166, 615618, 614897, 613920, 612045, 609905]
58917F09905j213N4M80j3n14l57K73Q82J318J755K409L347M399N213N681O289
58901F39908P637R545J1132J1892J2184J2384J2195J1314J0298J0009J0454J0944
58889G69896J1321J2207J3926J5896J7413J8362J8826J8497J7074J4866J2501
58878I40785J0238P906N436K932L50k554n813r046j1757j3711j4984j5655j5557
58865H78570j4460j2599j0777r657r079q497p919p881q475r081r268r343r675
58852G51859j0098j0387j0707j1110j1135j0496r637r007q271p036n819n412n604
58839F37140n586n377n698o470o667n906n102n021n163m708l781l051k640k213
58825E69757j764j620j778j784j249j73J108K102K499K569K915L610L999L632
$$ y = [609905, 608692, 608746, 609226, 609213, 608699, 608342, 608615, 609497, 610815, 612570, 614979, 618326, 622725, 627938, 633619, 639908, 647545, 657090, 668222, 680114, 692298, 704682, 716877, 728191, 738489, 748498, 758952, 769896, 781217, 793424, 807350, 823246, 840659, 859021, 877847, 896344, 913418, 928284, 940785, 951023, 958929, 964365, 967297, 967647, 965093, 959280, 950234, 938477, 924766, 909782, 894127, 878570, 864110, 851511, 840734, 831077, 821998, 813501, 805582, 797701, 789226, 780145, 770877, 761534, 751859, 741761, 731374, 720667, 709557, 698422, 687926, 678289, 669282, 661011, 653975, 648156, 642744, 637140, 631554, 626177, 620479, 614009, 607342, 601436, 596334, 591313, 586150, 581442, 577661, 574610, 571970, 569757, 567993, 566373, 564595, 562811, 561562, 561389, 562497, 564599, 567098, 569667, 572582, 576192, 580191, 583823]
58811E83823L001K888L318L679L703L731L982M080L482K120M40j067k253l233
58797F11694m003m398m467m617n066n439n319m952m779m493l418j818q40q49p64
58782E56472L28J850K753L150L906N138O119O501O570O362N388L470J058j377
58768F07688l728n846p364q125q306p953o875n230l771l209l496l960m022l595
58754E32208k955k323j599n62O46J532J877K046K444K920L130L121L107K931K401
58739E50924K032K690M387O034O643O280N646N193M921M717M561M539M723M987
58725F18277M972M472L747L217K912K571K209K154K630L578M783N872O444O642
58711F74480P291Q706R673Q645N880L307J977Q36j410m315o545p866r188j0978
$$ y = [583823, 586824, 589712, 593030, 596709, 600412, 604143, 608125, 612205, 615687, 617807, 618247, 617180, 614927, 611694, 607691, 603293, 598826, 594209, 589143, 583704, 578385, 573433, 568654, 564161, 560743, 558925, 558085, 557236, 556472, 556800, 558650, 561403, 564553, 568459, 573597, 579716, 586217, 592787, 599149, 604537, 608007, 609065, 607688, 603960, 598114, 590750, 582625, 574319, 566366, 559491, 554261, 550490, 547281, 543785, 539825, 535803, 532208, 529253, 526930, 525331, 524769, 525415, 526947, 528824, 530870, 533314, 536234, 539364, 542485, 545592, 548523, 550924, 552956, 555646, 560033, 566067, 572710, 578990, 584636, 589829, 594750, 599467, 604028, 608567, 613290, 618277, 623249, 627721, 631468, 634685, 637597, 640168, 642377, 644531, 647161, 650739, 655522, 661394, 667838, 674480, 681771, 690477, 700150, 708795, 714675, 717982, 719959, 720795, 719385, 715070, 708525, 700659, 691471, 680493]
58697F80493j2729j3951j4775j5449j5907j5987j5616j4677j3153j1378r722q082
58685E19067o190m372l378l320l403l012k551k763l577m176m012l299k476j572
58671D70966l34J242K728L659M027M357N261O865Q666R987J0529J0455R910Q635
58657E56953O286L074j73k682m363n557o379o579o043n085m191l629l383l293
58643E14956l139k750k190j767j809k355l024l166k371r81J43N59P41J250J748
58628D95845J467N68Q3M04O40L4p68o84K04R58J331J962L022L791L862L829M260
58611E20808M742M663M301M333M613M292L095J677O77O1l95o10n58n63q61j244
58595E49031j446j622j958k184j905j226n71j5P04J646K634L749N249O902Q007
$$ y = [680493, 667764, 653813, 639038, 623589, 607682, 591695, 576079, 561402, 548249, 536871, 527149, 519067, 512877, 508505, 505127, 501807, 498404, 495392, 492841, 490078, 486501, 482325, 478313, 475014, 472538, 470966, 470632, 471874, 474602, 478261, 482288, 486645, 491906, 498771, 507437, 517424, 527953, 538408, 548318, 556953, 563239, 566313, 566140, 563458, 559095, 553538, 547159, 540580, 534537, 529452, 525261, 521632, 518249, 514956, 511817, 509067, 506877, 505110, 503301, 500946, 497922, 494756, 492385, 491404, 491547, 492106, 492847, 494097, 495845, 497312, 497880, 497963, 498367, 499007, 499041, 498273, 497589, 497793, 498751, 500082, 502044, 505066, 508857, 512719, 516548, 520808, 525550, 530213, 534514, 538847, 543460, 547752, 550847, 552524, 553201, 553262, 552867, 552257, 551699, 551136, 550275, 549031, 547585, 545963, 544005, 541821, 539916, 538690, 538119, 538104, 538808, 540454, 543088, 546837, 552086, 558988, 566995]
58580E66995Q297Q292Q479Q630Q334P779P490P560P647P647P879Q564R520J0413
58566F83526J1156J1972J3185J4885J6790J8558K0242K2131K4033K5131K4768
58555H86377K3070K0533J7426J3885J0222O696L257r3k958n021o475p529p906
58542I51484p460o958p406q844j0547j2261j4351j6806j8998k0542k1571k1969
58530G83771k1192j9168j6575j3935j1157q323o144n117m785m394l740k955k026
58517F64260j060m88m97o11l84p2j10l62m73o31j266k222k860k895k610k297j947
58500F43475j449p80o1L83K33l39o97n75m38o82r23n98J63Q79J568K537L636M436
58482F50768N091O143P561Q761R682J1010J3020J4884J5598J5118J4122J2998
$$ y = [566995, 575292, 583584, 592063, 600693, 609027, 616806, 624296, 631856, 639503, 647150, 655029, 663593, 673113, 683526, 694682, 706654, 719839, 734724, 751514, 770072, 790314, 812445, 836478, 861609, 886377, 909447, 929980, 947406, 961291, 971513, 978209, 981466, 981373, 978415, 973394, 966919, 959390, 951484, 944024, 937066, 929660, 920816, 910269, 898008, 883657, 866851, 847853, 827311, 805740, 783771, 762579, 743411, 726836, 712901, 701744, 693421, 687277, 682160, 677375, 672981, 669241, 666286, 664260, 663200, 662712, 662215, 661604, 661220, 661148, 661038, 660676, 660203, 659572, 658306, 656084, 653224, 650329, 647719, 645422, 643475, 642026, 641246, 641185, 641568, 641801, 641462, 640765, 640190, 639752, 639070, 638147, 637549, 637712, 638591, 640159, 642696, 646332, 650768, 655859, 662002, 669563, 678324, 688006, 699016, 712036, 726920, 742518, 757636, 771758, 784756]
58470G84756J1531R436O740L681M93k551n034o564p198p519p996q184p021m168
58456G60402o66K109L868N385P257R265J0749J1145J0136P863N050K449J24k347
58442H32789m950p068q290q861r088q824p870o534n363m513l720k753j535Q4K296
58427G55800M918P182Q272Q225Q054Q739J0136J1175J1160J0365R242P565M912
58414H65745J635j305l333m618n541o327p122p912q295p828o659n384m320l401
58400G95335k673k276j843p25R79K272K593K626L242M138M261L332K267K017K525
58385H18070K956K658J791J121J259K045K776L048L154L475L905M129M286M821
58371H59494N784O717P331P858Q560R229R507R487R639J0167J0803J1363J2168
$$ y = [784756, 796287, 805723, 812463, 816144, 816637, 814086, 809052, 802488, 795290, 787771, 779775, 771591, 764570, 760402, 759736, 761845, 765713, 771098, 778355, 787620, 798369, 809514, 819650, 827513, 832563, 835012, 835136, 832789, 827839, 820771, 812481, 803620, 794532, 785708, 777838, 771304, 765941, 761428, 757708, 754955, 753420, 753504, 755800, 760718, 767900, 776172, 784397, 792451, 801190, 811326, 822501, 833661, 844026, 853268, 860833, 865745, 867380, 866075, 862742, 858124, 852583, 846256, 839134, 831222, 822927, 815099, 808440, 803056, 798736, 795335, 792662, 790386, 788543, 787818, 788797, 791069, 793662, 796288, 799530, 803668, 807929, 811261, 813528, 815545, 818070, 821026, 823684, 825475, 826596, 827855, 829900, 832676, 835724, 838878, 842353, 846258, 850387, 854673, 859494, 865278, 871995, 879326, 887184, 895744, 904973, 914480, 923967, 933606, 943773, 954576, 965939, 978107]
58358I78107J3594J5312J6368J6151J4963J3551J2304J1119R841Q461P008N577
58346A122356M445L890L815L852L907M344N485P178Q955J0445J1503J2216J2934
58333A215325J4081J5621J6880J7202J6804J6580J7016J7607J7535J6654J5437
58322A396742J4196J2775J1072R376Q008P011O448O624P608Q790R485R747J0172
58309A518054J0944J1769J2646J4000J5820J7365J8086J8338J8770J9504K0292
58298A695588K1109K2078K3127K4087K4856K5190K4779K3959K3850K5126K7044
58287A960793K8358K8900K9569L0857L2250L3129L3586L4087L4776L5375L5627
58276B317307L5762L6552L8655M1680M4290M5594M6160M7239M9336N2044N4915
$$ y = [978107, 991701, 1007013, 1023381, 1039532, 1054495, 1068046, 1080350, 1091469, 1101310, 1109771, 1116779, 1122356, 1126801, 1130691, 1134506, 1138358, 1142265, 1146609, 1152094, 1159272, 1168227, 1178672, 1190175, 1202391, 1215325, 1229406, 1245027, 1261907, 1279109, 1295913, 1312493, 1329509, 1347116, 1364651, 1381305, 1396742, 1410938, 1423713, 1434785, 1444161, 1452169, 1459180, 1465628, 1472252, 1479860, 1488650, 1498135, 1507882, 1518054, 1528998, 1540767, 1553413, 1567413, 1583233, 1600598, 1618684, 1637022, 1655792, 1675296, 1695588, 1716697, 1738775, 1761902, 1785989, 1810845, 1836035, 1860814, 1884773, 1908623, 1933749, 1960793, 1989151, 2018051, 2047620, 2078477, 2110727, 2143856, 2177442, 2211529, 2246305, 2281680, 2317307, 2353069, 2389621, 2428276, 2469956, 2514246, 2559840, 2606000, 2653239, 2702575, 2754619, 2809534]
58265B809534N7848O0851O4025O7562P1225P4155P5934P7523Q0210Q3893Q7289
58254C610049Q9763R1913R4360R6975R9494J01948J04269J06434J09190J13702
58244D618097J20049J27027J33770J40711J48437J56663J65000J73879J83850
58235E967483J94647K05775K17533K30538K44664K59240K74156K90075L07750
58226H191861L27732L50494L76201M04513M35229M68938N06477N47999N93413
58217A2202857O43645P00620P65922Q40344R25033J022293J134881J265403J417347
58208B0918345J596596J811755K073627K394487K786071L256302L808405M445036
58200D3090624N173966O010912O981181Q122027R478666J1088585J2968899J5126458
$$ y = [2809534, 2867382, 2928233, 2992258, 3059820, 3131045, 3205200, 3281134, 3358657, 3438867, 3522760, 3610049, 3699812, 3791725, 3886085, 3983060, 4082554, 4184502, 4288771, 4395205, 4504395, 4618097, 4738146, 4865173, 4998943, 5139654, 5288091, 5444754, 5609754, 5783633, 5967483, 6162130, 6367905, 6585438, 6815976, 7060640, 7319880, 7594036, 7884111, 8191861, 8519593, 8870087, 9246288, 9650801, 10086030, 10554968, 11061445, 11609444, 12202857, 12846502, 13547122, 14313044, 15153388, 16078421, 17100714, 18235595, 19500998, 20918345, 22514941, 24326696, 26400323, 28794810, 31580881, 34837183, 38645588, 43090624, 48264590, 54275502, 61256683, 69378710, 78857376, 89945961, 102914860, 118041318]
58192A18041318J7576482K0328431K3335670K6462712K9492004L2093014L3690591
58185C01020222L3364254L0043783K3063553J2730676M24349j1901981k2456154
58178C66288702l0107946l4486251l5822084l4728772l1988958k8362147k4453012
58171A46339532k0671700j7258170j4320377j1869976r862844q237506o935297
58164E7183662n902932n090738m451706l940053l513137l139304k803028k499618
58156B5843146k226277j980167j761018j569648j403833j258949j131934j021403
58148A3489917r24542q37320p57815o86488o23153n66193n14784m69453m30136
58139G680033l95859l66464l42473l22866l04927k86815k68728k51241k34139
$$ y = [118041318, 135617800, 155946231, 179281901, 205744613, 235236617, 267329631, 301020222, 334384476, 364428259, 387491812, 400222488, 400646837, 388744856, 366288702, 336180756, 301694505, 265872421, 231143649, 199154691, 170792544, 146339532, 125667832, 108409662, 94089285, 82219309, 72356465, 64118959, 57183662, 51280730, 46189992, 41738286, 37798233, 34285096, 31145792, 28342764, 25843146, 23616869, 21636702, 19875684, 18306036, 16902203, 15643254, 14511320, 13489917, 12565375, 11728055, 10970240, 10283752, 9660599, 9094406, 8579622, 8110169, 7680033, 7284174, 6917710, 6575237, 6252371, 5947444, 5660629, 5391901, 5140660, 4906521]
58130D906521k17374k01677j87541j74718j63081j52935j44104j35756j27461
58121C401874j19603j12458j05806r9548r3821q8388q2774p7161p2310o8402o4875
58110B416728o1518n8864n7249n6232n5216n3964n2445n0737m9228m8188m7138
58099A825949m5422m3330m1830m1086m0179l8534l6668l5177l3845l2294l0724
58088A406860k9464k8210k6415k4113k1927k0441j9834j9898k0197k0340k0267
58077A155754k0099j9795j9219j8525j8031j7716j7245j6554j5987j5710j5407
58066I61466j4732j3824j3164j3037j3210j3055j2136j0828j0098j0398j1050
58055H25934j1077j0402r771r749j0244j0803j0894j0033q289o512n517n147m703
$$ y = [4906521, 4689147, 4487470, 4299929, 4125211, 3962130, 3809195, 3665091, 3529335, 3401874, 3282271, 3169813, 3064007, 2964459, 2870638, 2782250, 2699476, 2622315, 2550005, 2481603, 2416728, 2355210, 2296346, 2239097, 2182865, 2127649, 2073685, 2021240, 1970503, 1921275, 1873087, 1825949, 1780527, 1737197, 1695367, 1654281, 1614102, 1575568, 1538900, 1503723, 1469878, 1437584, 1406860, 1377396, 1349186, 1322771, 1298658, 1276731, 1256290, 1236456, 1216558, 1196361, 1176021, 1155754, 1135655, 1115860, 1096641, 1078116, 1060085, 1042369, 1025124, 1008570, 992583, 976873, 961466, 946734, 932910, 919746, 906709, 893499, 880444, 868308, 857480, 847382, 836984, 825934, 814857, 804455, 794684, 784935, 774691, 763888, 752994, 742961, 734672, 728160, 722643, 717496, 712793]
58042G12793m138m125m959o056o692o724o515o553p127q018q628q763q954r520
58028F16021r800r162q280q307r046r201q382p556p332p114o392n598n127m562
58014E10162l601k797k656k831k897l020l232k926j910j115j355k092k411k485
58000D74834k974l636l756l537l771m344m282l250j891p01M04J279J425R52O86
57985D47438R76J200P91j2p40j374k002k437k638k901l239l064k006o78o2l55
57969D28897p96n67M01J372J455N18m83m80L76Q62L17m25k46P10J335J100M76
57952D34822q1p88j901l015l374k689j322J33J278J998K417K749L120L532M074
57937D40953M981O340P733Q499Q436Q089Q130Q544Q604P716O046M265K787J438
$$ y = [712793, 708655, 704530, 699571, 693515, 686823, 680099, 673584, 667031, 659904, 651886, 643258, 634495, 625541, 616021, 606221, 597059, 588779, 580472, 571426, 562225, 553843, 546287, 538955, 531841, 525449, 519851, 514724, 510162, 506561, 503764, 501108, 498277, 495380, 492360, 489128, 486202, 484292, 483177, 481822, 479730, 477319, 474834, 471860, 468224, 464468, 460931, 457160, 452816, 448534, 445284, 443393, 442692, 443096, 444375, 445800, 446752, 447438, 448414, 449614, 450405, 450393, 449653, 448279, 446277, 443840, 441202, 438301, 435062, 431998, 429992, 429314, 429252, 428897, 428101, 427534, 427935, 429307, 430762, 431280, 430797, 430317, 430693, 431555, 431872, 431447, 431201, 431911, 433246, 434346, 434822, 434741, 433953, 432052, 429037, 425663, 422974, 421652, 421785, 423063, 425061, 427478, 430227, 433347, 436879, 440953, 445934, 452274, 460007, 468506, 476942, 485031, 493161, 501705, 510309, 518025, 524071, 528336, 531123, 532561]
57923E32561j70k075l832m963n515o037o842p519p473o889o612p032p539p466
57909D52597o997o664o348n509m276l454l370l392k868k033j612j902k593l198
57895C98381l349k895j999j058l04L10Q53J299J825K713L772M211L608K578K067
57880D12012K235K531K607K487K034R70m64j554j974k065k086j874j499j573k369
57865D09418l137l028k356k139k501k379j021R68K465L183L647M163M445M250
57851D15978L815L533L463L383L037K235R23n55j551j747j676k183l364m408m584
57836D16299m078l605l514l576l488l199k778k297j843j458r96l63K73P81J462
57821C87620K661L968M417L751K901K825L317L528L185K556J540k95k702m654
$$ y = [532561, 532391, 530316, 526484, 521521, 516006, 509969, 503127, 495608, 488135, 481246, 474634, 467602, 460063, 452597, 445600, 438936, 432588, 427079, 422803, 419349, 415979, 412587, 409719, 407686, 406074, 404172, 401579, 398381, 395032, 392137, 390138, 389080, 388776, 389086, 389939, 391238, 393063, 395776, 399548, 403759, 407367, 409945, 412012, 414247, 416778, 419385, 421872, 423906, 424876, 424412, 422858, 420884, 418819, 416733, 414859, 413360, 411787, 409418, 406281, 403253, 400897, 398758, 396257, 393878, 392857, 393825, 396290, 399473, 403120, 407283, 411728, 415978, 419793, 423326, 426789, 430172, 433209, 435444, 436367, 435812, 434261, 432514, 430838, 428655, 425291, 420883, 416299, 412221, 408616, 405102, 401526, 398038, 394839, 392061, 389764, 387921, 386463, 385467, 385104, 385377, 386158, 387620, 390281, 394249, 398666, 402417, 405318, 408143, 411460, 414988, 418173, 420729, 422269, 421974, 419272, 414618]
57807D14618n568n962o467o823o406n311m231l501k872k169j517r27j29R21J826
57792C65482K229K211K017J695J247R19R76J323J561J478J256J246J665K517L537
57777C91359M257M316L875L561L802M357M615M340L843L434K981K199J109or74
57762D37068j752k182k086j693j585k017k556k584j990j139l55L31R64J559K051
57747D22034K226J797P64l87j137j466j659j717j408q78p03j138j773k126k171
57732D10258k005j469n11L80O32L38R0J45K29J12j25m28q56j153p27N91K116K989
57714D10606L076K838K527J931R10k13r63j223j268j411j623j564r55J4Q43J277
57698D14802J586K082K656L016L199L408L390K509N95j632l252l969m043l736
$$ y = [414618, 409050, 403088, 396621, 389798, 383392, 378081, 373850, 370349, 367477, 365308, 363791, 362864, 362735, 363656, 365482, 367711, 369922, 371939, 373634, 374881, 375800, 376776, 378099, 379660, 381138, 382394, 383640, 385305, 387822, 391359, 395616, 399932, 403807, 407368, 411170, 415527, 420142, 424482, 428325, 431759, 434740, 436939, 438048, 438042, 437068, 435316, 433134, 431048, 429355, 427770, 425753, 423197, 420613, 418623, 417484, 417129, 417460, 418424, 419983, 422034, 424260, 426057, 426821, 426434, 425297, 423831, 422172, 420455, 419047, 418169, 417466, 416328, 414555, 412429, 410258, 408253, 406784, 406273, 406653, 407285, 407623, 407713, 407858, 408087, 408199, 408074, 407646, 406790, 405637, 404910, 405501, 407617, 410606, 413682, 416520, 419047, 420978, 421888, 421675, 420712, 419489, 418221, 416810, 415187, 413623, 412668, 412682, 413525, 414802, 416388, 418470, 421126, 424142, 427341, 430749, 434139, 436648, 437243, 435611, 432359, 428390, 424347, 420611]
57684D20611l108k194j024M04J978L438M690O056P852R970J2225J4916J8548K3015
57670E17377K7618L1953L6228M0513M4053M5561M3639L6855K4314P083j1256k6470
57658H17468l6395m1509m3100m1680l7439l1363k5114j9911j6006j3072j0715
57647E01164q597o566m861l913l718l590k819j470l17R5J0K5K75M38M07N62J198
57630D68323K040K550K574K295J758Q47k09p81n23J26M21J38l39o78r48j253j350
57613D74991r16j28L70J62m50q00n56Q4P95J450J979K245K227K171K320K554K523
57596D91021K108J556J152R56Q84R03J054J342J599J518R28J35k34J44R09J520
57580E07495J932K453K971K878J911P19K45P40J615K149K119J800J581J594J692
$$ y = [420611, 417503, 415309, 414285, 414689, 416667, 420105, 424795, 430851, 438703, 448673, 460898, 475814, 494362, 517377, 544995, 576948, 613176, 653689, 697742, 743303, 786942, 823797, 848111, 855194, 843938, 817468, 781073, 739564, 696464, 654784, 617345, 585982, 560868, 540957, 524951, 511879, 501164, 492567, 486001, 481140, 477227, 473509, 469919, 467100, 465630, 465313, 465408, 465418, 465443, 465718, 466156, 466563, 467125, 468323, 470363, 472913, 475487, 477782, 479540, 480387, 480178, 479397, 478874, 479000, 479421, 479559, 479220, 478542, 477594, 476341, 474991, 474075, 473947, 474317, 474479, 474029, 473229, 472673, 472757, 473552, 475002, 476981, 479226, 481453, 483624, 485944, 488498, 491021, 493129, 494685, 495837, 496793, 497677, 498580, 499634, 500976, 502575, 504093, 505021, 505156, 504922, 505066, 505975, 507495, 509427, 511880, 514851, 517729, 519640, 520359, 520604, 521344, 522959, 525108, 527227, 529027, 530608, 532202, 533894]
57565E33894J771J977K436K876K916K714K917L745M563M716M374M120M045L863
57551E80927L714M138N105N749N311L958K437J308Q00R82J633K164K159J911K105
57536F24401K958M008M712N006N197N465N634N394M754M145M014M331M796N401
57522F90216O407P560P977P216O090N746O195O458O052N549N524N692N512N042
57508G77236M749M797M987N056M813M274L967M562N756O133M795K776J907K527
57494H38335L222K826J764J125J277J858K457K860L029L334M322N831O788O457
57480H85485N538N407O431P667Q153P871P384O968O431N516M304L253K830L070
57466I66308L548L864M036M332M914N811O950P961Q297P834P184P022P351P710
$$ y = [533894, 535665, 537642, 540078, 542954, 545870, 548584, 551501, 555246, 559809, 564525, 568899, 573019, 577064, 580927, 584641, 588779, 593884, 599633, 604944, 608902, 611339, 612647, 613447, 614429, 616062, 618226, 620385, 622296, 624401, 627359, 631367, 636079, 641085, 646282, 651747, 657381, 662775, 667529, 671674, 675688, 680019, 684815, 690216, 696623, 704183, 712160, 719376, 725466, 731212, 737407, 743865, 749917, 755466, 760990, 766682, 772194, 777236, 781985, 786782, 791769, 796825, 801638, 805912, 809879, 814441, 820197, 826330, 831125, 833901, 835808, 838335, 841557, 844383, 846147, 847272, 848549, 850407, 852864, 855724, 858753, 862087, 866409, 872240, 879028, 885485, 891023, 896430, 902861, 910528, 918681, 926552, 933936, 940904, 947335, 952851, 957155, 960408, 963238, 966308, 969856, 973720, 977756, 982088, 987002, 992813, 999763, 1007724, 1016021, 1023855, 1031039, 1038061, 1045412, 1053122]
57452A053122P907Q078Q271Q445Q704R053R093Q569Q041Q325R282R963R991J0010
57438A176854J0518J1076J1136J0910J0853J0888J0789J0809J1239J1675J1513
57427A298260J0954J0769J1152J1522J1533J1572J2126J3105J4062J4650J4705
57416A434410J4212J3393J2518J1564J0386R302R027R716J0565J0764J0538J0722
57404A567117J1542J2343J2603J2595J2854J3366J3680J3596J3365J3273J3400
57393A709734J3788J4540J5541J6308J6401J5910J5364J5180J5388J5832J6469
57382A880455J7315J8223J8817J8713J7826J6493J5246J4434J4097J4175J4636
57371B060430J5297J5766J5762J5389J4942J4558J4272J4250J4637J5289J5942
$$ y = [1053122, 1061029, 1069107, 1077378, 1085823, 1094527, 1103580, 1112673, 1121242, 1129283, 1137608, 1146890, 1156853, 1166844, 1176854, 1187372, 1198448, 1209584, 1220494, 1231347, 1242235, 1253024, 1263833, 1275072, 1286747, 1298260, 1309214, 1319983, 1331135, 1342657, 1354190, 1365762, 1377888, 1390993, 1405055, 1419705, 1434410, 1448622, 1462015, 1474533, 1486097, 1496483, 1505785, 1514812, 1524528, 1535093, 1545857, 1556395, 1567117, 1578659, 1591002, 1603605, 1616200, 1629054, 1642420, 1656100, 1669696, 1683061, 1696334, 1709734, 1723522, 1738062, 1753603, 1769911, 1786312, 1802222, 1817586, 1832766, 1848154, 1863986, 1880455, 1897770, 1915993, 1934810, 1953523, 1971349, 1987842, 2003088, 2017522, 2031619, 2045794, 2060430, 2075727, 2091493, 2107255, 2122644, 2137586, 2152144, 2166416, 2180666, 2195303, 2210592, 2226534]
57360B226534J6603J7417J8231J8738J8987J9321J9782K0075K0151K0365K0824
57349B437028K1155K1144K1121K1362K1618K1566K1368K1346K1534K1871K2445
57338B673558K3055K3083K2400K1957K2714K4224K5176K5140K4935K5212K5575
57327B937029K5397K4738K4093K3721K3622K3740K3931K3959K3798K3647K3607
57316C201282K3727K4322K5610K7006K7438K6684K5752K5512K5706K5761K5871
57305C484671K6506K7378K7857K8078K8722K9746L0267K9836K9004K8369K7834
57294C798268K7217K6918K7394K8300K8724K8209K7183K6504K6713K7595K8323
57283D101348K8169K7296K6627K6774K7300K7270K6289K4758K3418K2965K3770
$$ y = [2226534, 2243137, 2260554, 2278785, 2297523, 2316510, 2335831, 2355613, 2375688, 2395839, 2416204, 2437028, 2458183, 2479327, 2500448, 2521810, 2543428, 2564994, 2586362, 2607708, 2629242, 2651113, 2673558, 2696613, 2719696, 2742096, 2764053, 2786767, 2810991, 2836167, 2861307, 2886242, 2911454, 2937029, 2962426, 2987164, 3011257, 3034978, 3058600, 3082340, 3106271, 3130230, 3154028, 3177675, 3201282, 3225009, 3249331, 3274941, 3301947, 3329385, 3356069, 3381821, 3407333, 3433039, 3458800, 3484671, 3511177, 3538555, 3566412, 3594490, 3623212, 3652958, 3683225, 3713061, 3742065, 3770434, 3798268, 3825485, 3852403, 3879797, 3908097, 3936821, 3965030, 3992213, 4018717, 4045430, 4073025, 4101348, 4129517, 4156813, 4183440, 4210214, 4237514, 4264784, 4291073, 4315831, 4339249, 4362214, 4385984]
57272D385984K5438K6761K6736K5696K4921K5061K5441K5167K4334K3757K3892
57261D663188K4521K5189K5541K5389K4898K4617K4854K5181K4968K4351K4082
57250D936779K4459K4987K5226K5341K5503K5397K4790K4186K4241K4783K4970
57239E210662K4355K3273K2112K0774J9063J7227J5839J5215J5120J5015J4502
57228E413157J3628J2733J2013J1356J0642J0051R864J0101J0593J1257J2061
57217E537456J2775J3089J2950J2612J2280J1926J1526J1200J1137J1374J1732
57206E670057J1877J1609J1147J0942J1000J0712R659Q283P346O912O370N385
57194E781299M205L099K045J061J69j028l099n763p780q346q193q763j0660j3336
$$ y = [4385984, 4411422, 4438183, 4464919, 4490615, 4515536, 4540597, 4566038, 4591205, 4615539, 4639296, 4663188, 4687709, 4712898, 4738439, 4763828, 4788726, 4813343, 4838197, 4863378, 4888346, 4912697, 4936779, 4961238, 4986225, 5011451, 5036792, 5062295, 5087692, 5112482, 5136668, 5160909, 5185692, 5210662, 5235017, 5258290, 5280402, 5301176, 5320239, 5337466, 5353305, 5368520, 5383640, 5398655, 5413157, 5426785, 5439518, 5451531, 5462887, 5473529, 5483580, 5493444, 5503545, 5514138, 5525395, 5537456, 5550231, 5563320, 5576270, 5588882, 5601162, 5613088, 5624614, 5635814, 5646951, 5658325, 5670057, 5681934, 5693543, 5704690, 5715632, 5726632, 5737344, 5747003, 5755286, 5762632, 5769544, 5775914, 5781299, 5785504, 5788603, 5790648, 5791709, 5791878, 5790850, 5787751, 5781988, 5774208, 5765862, 5757669, 5748906, 5738246, 5724910]
57180E724910j5986j8250k0190k2102k4290k6700k8889l0609l2227l4246l6584
57169E434837l8781m0699m2573m4400m5831m6623m6852m6551m5629m4222m2716
57158D949960m1186l9174l6406l3407l1018k9350k7621k5245k2749k1255k1110
57147D621439k1493k1565k1622k2738k5504k9587l4388l9446m4168m7874n0492
57136D262562n2701n4942n6684n7085n6036n4038n1345m7843m3731l9768l6843
57125C711546l5494l5789l7266l9091m0564m1496m1973m1964m1323l9819l7063
57114C279704l2845k7927k3824k1154j8723j4870r166j995P013J9021L4717N4209
57102C244160P8199J08048J44363J86225K31901K79506L27300L74669M23170M75696
$$ y = [5724910, 5708924, 5690674, 5670484, 5648382, 5624092, 5597392, 5568503, 5537894, 5505667, 5471421, 5434837, 5396056, 5355357, 5312784, 5268384, 5222553, 5175930, 5129078, 5082527, 5036898, 4992676, 4949960, 4908774, 4869600, 4833194, 4799787, 4768769, 4739419, 4711798, 4686553, 4663804, 4642549, 4621439, 4599946, 4578381, 4556759, 4534021, 4508517, 4478930, 4444542, 4405096, 4360928, 4313054, 4262562, 4209861, 4154919, 4098235, 4041150, 3985114, 3931076, 3879731, 3831888, 3788157, 3748389, 3711546, 3676052, 3640263, 3602997, 3563906, 3523342, 3481846, 3439873, 3397909, 3356586, 3316767, 3279704, 3246859, 3218932, 3195108, 3173954, 3155231, 3140361, 3131195, 3129200, 3136213, 3155234, 3189951, 3244160, 3322359, 3430407, 3574770, 3760995, 3992896, 4272402, 4599702, 4974371, 5397541, 5873237]
57092E873237N34374N99701O70669P43772Q12035Q67288R03779R17962R06424
57083A2829241Q69906Q21475P84031P71253P70278P48266O77706N53306L86287
57074A9211749J89994k5026k47170m62556o58447q24934r53441j037051j073519
57065A4119599j066424j022748r50522q58566p56397o53305n58126m79551m24202
57056G349758l92679l78163l70223l60529l45573l25637l02583k78434k54786
57047D341151k32803k13315j96648j82381j69623j57789j46764j36500j26936
57038B778392j18266j10672j03618r5963q7019p6971o6218n4898m3256l1637j9872
57027A970002p808K702P153J303j4999l7324n9805p8239r0743r6958r7449r3431
$$ y = [5873237, 6407611, 7007312, 7677981, 8421753, 9233788, 10101076, 11004855, 11922817, 12829241, 13699147, 14520622, 15304653, 16075906, 16846184, 17594450, 18272156, 18825462, 19211749, 19401743, 19376717, 19129547, 18666991, 18008544, 17183610, 16230169, 15193118, 14119599, 13053175, 12030427, 11079905, 10221339, 9464942, 8811637, 8253511, 7773960, 7349758, 6957079, 6578916, 6208693, 5848164, 5502591, 5176954, 4874371, 4595937, 4341151, 4108348, 3895033, 3698385, 3516004, 3346381, 3188592, 3041828, 2905328, 2778392, 2660126, 2549454, 2445836, 2349873, 2262854, 2185883, 2119665, 2064767, 2021511, 1989874, 1970002, 1962194, 1964896, 1972049, 1973352, 1958353, 1921029, 1861224, 1782985, 1692242, 1595284, 1497835, 1404404]
57015A404404q6413p7974o9516o1785n4659m7896m2039l7893l5144l2371k8848
57004H29866k5538k3736k3335k3162k2592k1892k1212k0205j8868j7835j7430
56993E94061j7013j5858j4245j2995j2164j0934q863o597n014m135l342k458k083
56980D78360k868m791p256r654j1682j3280j4450j5091j4974j3974j2301j0388
56968C47651q515o658m740k740n57J941M509O527P742Q795J0554J2897J4576J4323
56954D06305J1836P591K216l678r294j3735j6403j7289j6872j5771j4327j2467
56942C08112r980o894l507j30K973N491P292Q800J0694J3111J5449J7151J8225
56929C86787J8531J7058J2619N332l118j0776j6582k0339k2165k2305k1133j9030
$$ y = [1404404, 1317991, 1240017, 1170501, 1108716, 1054057, 1006161, 964122, 926229, 891085, 858714, 829866, 804328, 780592, 757257, 734095, 711503, 689611, 668399, 648194, 629326, 611491, 594061, 577048, 561190, 546945, 533950, 521786, 510852, 501989, 495392, 490378, 486243, 482901, 480443, 478360, 475492, 470701, 463445, 453791, 442109, 428829, 414379, 399288, 384314, 370340, 358039, 347651, 339136, 332478, 327738, 324998, 324441, 326382, 330891, 337418, 345160, 353955, 364509, 377406, 391982, 406305, 418141, 425732, 427948, 424270, 414976, 401241, 384838, 367549, 350677, 334906, 320579, 308112, 298132, 291238, 287731, 287601, 290574, 296065, 303357, 312157, 322851, 335962, 351411, 368562, 386787, 405318, 422376, 434995, 440327, 437209, 426433, 409851, 389512, 367347, 345042, 323909, 304879]
56917C04879j6371j3725j1728j0504r540q355p076o063n240m295l362k952l122
56904B02546l218k686j790j193j026o88L82K000L377L930L904M130N168O785Q367
56889B29988R741J1245J3002J4541J5309J5221J4323J2198Q291K893k714p224
56877C36814j0094j1312j0944r316p251n444l657r78K919P225J0868J3701J6554
56864C29085K0258K4823K9577L3969L8005M1741M4263M3503L7526K6148J1297
56853F80195m115j7479k7073l2202l3217l1129k6860k0996j4227p492j299M784
56841D68890J1476J8841K6386L3904M1612M9477N6931O3364O8268P0564O8080
56830I77793N8341M0320J5792j0920l4785n2405o3019o7517o6876o1871n3758
$$ y = [304879, 288508, 274783, 263055, 252551, 243011, 234656, 227580, 221517, 216277, 211982, 208620, 205668, 202546, 199328, 196642, 194852, 193659, 192633, 191945, 192327, 194327, 197704, 201634, 205538, 209668, 214836, 221621, 229988, 239729, 250974, 263976, 278517, 293826, 309047, 323370, 335568, 343859, 346752, 344038, 336814, 326720, 315408, 304464, 295148, 287897, 282453, 278796, 277818, 280737, 287962, 298830, 312531, 329085, 349343, 374166, 403743, 437712, 475717, 517458, 561721, 605224, 642750, 668898, 680195, 676080, 658601, 631528, 599326, 566109, 534980, 508120, 487124, 472897, 465405, 464106, 468890, 480366, 499207, 525593, 559497, 601109, 650586, 707517, 770881, 839149, 909713, 977793, 1036134, 1076454, 1092246, 1081326, 1046541, 994136, 931117, 863600, 796724, 734853, 681095]
56819F81095m4310l4831k5639j6685q186l86O862J3849K0665K7304L3745L9653
56807F93136M4216M6519M5596M0059K8574J1467q496k7637m3377n4418n9807n9252
56795F56580n4237m7489m0816l4215k7262k0407j4343q895l407K193P304J1482
56783D26488J4873J7892K0757K3031K3443K0519J3876M616n673j5862k4972l1656
56771D87332l4881l4948l3146l0477k7278k3869k0753j8060j5438j2694j0110
56760B25678q033o540n649n318n190m759l969l293l027k946k802k752k973l253
56746A65174l248k915k445k005j753j814k036k019j664j333j290j295j079q37
56732A39441q12p28j96M93O53K08j66l6K79L81M39P75J209J275Q53J53p35j777
$$ y = [681095, 636785, 601954, 576315, 559630, 551444, 551058, 557920, 571769, 592434, 619738, 653483, 693136, 737352, 783871, 829467, 869526, 898100, 909567, 901071, 873434, 830057, 775639, 715832, 656580, 602343, 554854, 514038, 479823, 452561, 432154, 417811, 408916, 405509, 407702, 415006, 426488, 441361, 459253, 480010, 503041, 526484, 547003, 560879, 565495, 559822, 543960, 518988, 487332, 452451, 417503, 384357, 353880, 326602, 302733, 281980, 263920, 248482, 235788, 225678, 217645, 211105, 205456, 200138, 194948, 190189, 186220, 182927, 179900, 176954, 174152, 171400, 168427, 165174, 161926, 159011, 156566, 154561, 152808, 150994, 148958, 146939, 145275, 143942, 142652, 141357, 140278, 139441, 138629, 137901, 137705, 138198, 138851, 139059, 138893, 138857, 139136, 139517, 139956, 140731, 141940, 143215, 144068, 144221, 143486, 141709]
56714A41709k549k422j331K1J006J666K262K555K140J303R64J518K213K018Q49
56699A53922l85p95l07M91R71R15N20M8m58j039j422j126j56Q08J183J201J438
56682A55809J845J866J352P78N11M37M27N65P20M98n6k77J77P37P33M02M92J195
56664A68211K069K730L065K897K128J254J036J553K093K138J950J956K048J873
56650A97001J479J247J295J328J006K56p42j684k195j985j081R0R27J048N35j67
56634A98358n76m53P5N63M85l26j427k098k057j669j486j660j943k014j762j321
56618A80689r86r15q92o15j76K4n6K0N09J094J412J492J394R14J34j99M63J513
56600A85819J770Q70m70j450j853j821j596j475j457j077j36O09K77o74q09L37
$$ y = [141709, 139160, 136738, 135407, 135428, 136434, 138100, 140362, 142917, 145057, 146360, 147324, 148842, 151055, 153073, 153922, 153537, 152742, 152435, 152926, 153897, 154812, 155332, 155380, 154922, 153883, 152461, 151335, 151179, 151987, 153170, 154371, 155809, 157654, 159520, 160872, 161650, 162161, 162598, 163025, 163590, 164310, 164808, 164752, 164475, 164652, 165389, 166122, 166524, 167016, 168211, 170280, 173010, 176075, 178972, 181100, 182354, 183390, 184943, 187036, 189174, 191124, 193080, 195128, 197001, 198480, 199727, 201022, 202350, 203356, 203612, 202870, 201186, 198991, 197006, 195925, 196015, 196942, 197990, 198525, 198358, 197782, 197329, 197404, 197967, 198452, 198126, 196699, 194601, 192544, 190875, 189389, 187729, 185786, 183772, 182010, 180689, 179703, 178788, 177896, 177281, 177105, 177129, 177073, 177093, 177602, 178696, 180108, 181600, 182994, 183908, 184042, 183843, 184306, 185819, 187589, 188459, 187989, 186539, 184686, 182865, 181269, 179794, 178337, 177260, 177124, 177733, 178010, 177336, 176527, 176864]
56584A76864J615J835J138L74q1k46qO17J172J305J286J457J672J765K120L046
56568A95931L997M266M131M510N571O522O879P123P881R075J0260J1269J2033
56555B89448J2077J0708P859M477J931R03Q91Q73M06j04k17j03j76m82p86j083
56539C26622j514k005k374k703l182l666l856l852m060m508m743m563m398m695
56525B76503n246n468n101m396l681l015k282j488q68p09j084j749k332k547k286
56510B34251j731j372j630k283k556k016j161p24p07n82k64k54p18j101r12m10
56494B15830j22j01j44m09j176k075k203j284j91N9m09o00p6M68K62m09o30j56
56476B06634L02J29l62m26J87J082J751J976J833J565J369J218R46O20N54Q40
$$ y = [176864, 178479, 180314, 181452, 181826, 181745, 181499, 181491, 182108, 183280, 184585, 185871, 187328, 189000, 190765, 192885, 195931, 199928, 204194, 208325, 212835, 218406, 224928, 231807, 238930, 246811, 255886, 266146, 277415, 289448, 301525, 312233, 320092, 324569, 326500, 327403, 328294, 329167, 329573, 329469, 329252, 329149, 328973, 328491, 327705, 326622, 325108, 323103, 320729, 318026, 314844, 311178, 307322, 303470, 299410, 294902, 290159, 285596, 281198, 276503, 271257, 265789, 260688, 256292, 252611, 249596, 247314, 245826, 244958, 244249, 243165, 241416, 239084, 236537, 234251, 232520, 231148, 229518, 227235, 224679, 222663, 221502, 220778, 220071, 219489, 219225, 218971, 218253, 217152, 216240, 215830, 215708, 215607, 215463, 215054, 213878, 211803, 209600, 208316, 208125, 208184, 207775, 207175, 207099, 207567, 207829, 207420, 206790, 206634, 206936, 207065, 206703, 206277, 206464, 207546, 209297, 211273, 213106, 214671, 216040, 217258, 218204, 218824, 219378, 220218]
56460B20218J110R95N92K49Q0roJ53L30L10R3j36k46j77J59O90J114J227J170
56441B27916J089P95J82l33k39K50M16k3o35r82j111j216j267j141q06k62M25
56424B23058J005J236J184J032O98P5m58m04J0K0m59n57K38J214J441J057R05
56407B31295J226J538J626J843K322K534J963Q18j80n50l62J3K37K42K44N27J092
56390B46428J522J312L57q39j474j140k67K39m2n48m20M27J210J365J252J511
56374B50893J996J989J389J006J325J620R37m12j116n95L92R80J262J677K090
56359B65433K078J665J148N66k3j06O66J647J813J184P99J194J726J639J076O63
56343B83168O08P49J049J603K333L036L536L645L301K867K946L611M230M264L961
$$ y = [220218, 221328, 222323, 222915, 223164, 223244, 223235, 223229, 223382, 223712, 224022, 224115, 223979, 223733, 223556, 223715, 224405, 225519, 226746, 227916, 229005, 229800, 229982, 229649, 229410, 229660, 230076, 230053, 229418, 228436, 227325, 226109, 224842, 223701, 222895, 222633, 223058, 224063, 225299, 226483, 227515, 228213, 228288, 227830, 227426, 227436, 227456, 226997, 226440, 226678, 227892, 229333, 230390, 231295, 232521, 234059, 235685, 237528, 239850, 242384, 244347, 245165, 244985, 244435, 244073, 244086, 244323, 244565, 244809, 245336, 246428, 247950, 249262, 249619, 248780, 247306, 246166, 245899, 246138, 246096, 245548, 245128, 245555, 246765, 248130, 249382, 250893, 252889, 254878, 256267, 257273, 258598, 260218, 261155, 260743, 259627, 259032, 259424, 260404, 261666, 263343, 265433, 267511, 269176, 270324, 270890, 270867, 270761, 271427, 273074, 274887, 276071, 276870, 278064, 279790, 281429, 282505, 283168, 283776, 284525, 285574, 287177, 289510, 292546, 296082, 299727, 303028, 305895, 308841, 312452, 316682, 320946, 324907]
56328C24907L849L918L755L240K646K152J679J241J058J196J334J021J38r26j562
56313C49646j512j157j115j424j408m84J054K328K883K988K982K724K048J476
56299C61029J893L376M781M979M203L637L792L994L585K894K569K675L059L999
56285D10465N585O900O877N880N409O115P058P257P039P319Q237R201R802J0133
56271E13277J0382J0690J1289J2425J4059J5805J7186J8052J8891K0515K3114
56260F85685K5874K7994K9819L2301L5591L9089M2875M7951N4688O2098O9186
56249A153151P6110Q3363R0633R7334J03607J09850J15630J19907J22092J22135
56239B193812J19827J14790J07034R6909Q4505O9628N2300L2907J2066r253k9706
$$ y = [324907, 328756, 332674, 336429, 339669, 342315, 344467, 346146, 347387, 348445, 349641, 350975, 351996, 352134, 351208, 349646, 348134, 346977, 345862, 344438, 343030, 342546, 343600, 345928, 348811, 351799, 354781, 357505, 359553, 361029, 362922, 366298, 371079, 376058, 380261, 383898, 387690, 391684, 395269, 398163, 400732, 403407, 406466, 410465, 416050, 422950, 429827, 435707, 441116, 447231, 454289, 461546, 468585, 475904, 484141, 493342, 503144, 513277, 523659, 534349, 545638, 558063, 572122, 587927, 605113, 623165, 642056, 662571, 685685, 711559, 739553, 769372, 801673, 837264, 876353, 919228, 967179, 1021867, 1083965, 1153151, 1229261, 1312624, 1403257, 1500591, 1604198, 1714048, 1829678, 1949585, 2071677, 2193812, 2313639, 2428429, 2535463, 2632372, 2716877, 2786505, 2838805, 2871712, 2883778, 2874525, 2844819]
56228B844819m8132o4037p7275q7682r5398j01085j05238j07620j07862j06269
56218A944221j03453r9523r4398q8569q2825p7407p2105o6940o2106n7377n2369
56207A087149m7305m2778l8864l5148l1594k8709k6767k5459k4277k2735k0414
56196G43099j7388j4537j2708j1665j0540r162q095p456o641n447m471m084l812
56183F27093l154k323j759j433j052n23J20Q21J281J095M15J6M36J402K320K911
56167F27666L194L290L504M171N178O026O581P320Q518R682J0187J0152J0247
56154G15716J0931J2161J3690J5286J6791J8234J9855K1934K4629K8032L2211
56143I29470L7193M3020M9724N7024O4195P0636P6433Q1868Q6426Q8818Q8039
$$ y = [2844819, 2796687, 2732650, 2655375, 2567693, 2472295, 2371210, 2265972, 2158352, 2050490, 1944221, 1840768, 1741245, 1646847, 1558278, 1475453, 1398046, 1325941, 1259001, 1196895, 1139518, 1087149, 1039844, 997066, 958202, 923054, 891460, 862751, 835984, 810525, 786248, 763513, 743099, 725711, 711174, 698466, 686801, 676261, 667099, 659004, 651548, 644907, 639460, 634989, 630905, 627093, 623939, 621616, 619857, 618424, 617372, 616849, 616969, 617790, 619071, 620166, 620581, 620597, 621033, 622435, 624755, 627666, 630860, 634150, 637654, 641825, 647003, 653029, 659610, 666930, 675448, 685130, 695317, 705469, 715716, 726647, 738808, 752498, 767784, 784575, 802809, 822664, 844598, 869227, 897259, 929470, 966663, 1009683, 1059407, 1116431, 1180626, 1251262, 1327695, 1409563, 1495989, 1584807, 1672846]
56132A672846Q3991P7148O8348N9030N1032M5587M2646M1160L9600L6271K9911
56121B247570K0522R384j937j2339k1195k8367l4540m0979m8523n7055o5901p4109
56109A892531q0264q2938q1874p8224p3088o6447n8036m8729m0214l3468k8210
56098A221039k3674j9428j5405j1681q367n534l203j361J14J464K722L445L308
56085A143439K961L602N474P430Q408Q696R187J0030J0696J1018J1353J1902J2535
56072A256731J3190J3901J4459J4584J4483J4687J5331J5924J6016J5821J6082
56061A421209J7368J9478K1465K2489K2742K3217K4365K5436K5536K4914K4629
56050A672848K5159K5981K6481K6667K6867K7214K7637K8045K8297K8300K8260
$$ y = [1672846, 1756837, 1833985, 1902333, 1961363, 2012395, 2057982, 2100628, 2141788, 2181388, 2217659, 2247570, 2268092, 2277476, 2275539, 2263200, 2242005, 2213638, 2179098, 2138119, 2089596, 2032541, 1966640, 1892531, 1812267, 1729329, 1647455, 1569231, 1496143, 1429696, 1371660, 1322931, 1282717, 1249249, 1221039, 1197365, 1177937, 1162532, 1150851, 1142484, 1136950, 1133747, 1132386, 1132500, 1133964, 1136686, 1140131, 1143439, 1146400, 1150002, 1155476, 1162906, 1171314, 1180010, 1189197, 1199227, 1209923, 1220941, 1232294, 1244196, 1256731, 1269921, 1283822, 1298281, 1312865, 1327348, 1342035, 1357366, 1373290, 1389306, 1405127, 1421209, 1438577, 1458055, 1479520, 1502009, 1524751, 1547968, 1572333, 1597769, 1623305, 1648219, 1672848, 1698007, 1723988, 1750469, 1777136, 1804003, 1831217, 1858854, 1886899, 1915196, 1943496, 1971756]
56039A971756K8602K9440L0433L1346L2488L4270L6413L8076L8906L9565M0949
56028B352244M3153M5599M7993N0517N3078N5114N6497N7901N9819O1792O3384
56017B947091O5364O8921P3909P8873Q2925Q6630R0777R5203R9295J02986J06700
56006C898674J10662J14763J18905J23160J27807J33240J39667J46821J54289
55997E067988J62083J70515J79606J89114J99031K09624K21072K33534K47432
55988F879999K63001K79905K97914L17685L40064L64981L92055M21878M55393
55979A0012875M92355N32080N75586O25294O82559P47342Q20593R04975J002822
55970A6396481J115778J247331J403752J592081J820111K099391K444331K864993
$$ y = [1971756, 2000358, 2029798, 2060231, 2091577, 2124065, 2158335, 2194748, 2232824, 2271730, 2311295, 2352244, 2395397, 2440996, 2488989, 2539506, 2592584, 2647698, 2704195, 2762096, 2821915, 2883707, 2947091, 3012455, 3081376, 3155285, 3234158, 3317083, 3403713, 3494490, 3589693, 3688988, 3791974, 3898674, 4009336, 4124099, 4243004, 4366164, 4493971, 4627211, 4766878, 4913699, 5067988, 5230071, 5400586, 5580192, 5769306, 5968337, 6177961, 6399033, 6632567, 6879999, 7143000, 7422905, 7720819, 8038504, 8378568, 8743549, 9135604, 9557482, 10012875, 10505230, 11037310, 11612896, 12238190, 12920749, 13668091, 14488684, 15393659, 16396481, 17512259, 18759590, 20163342, 21755423, 23575534, 25674925, 28119256, 30984249]
55962C0984249L363049L937739M594190N344878O209094P217274Q411199R829035
55954G9890707J1489157J3396702J5562741J7995771K0657044K3425806K6100538
55947B08518466K8378312K9752341K9419031K6418213K0102886J0688935n64444
55940C52713740j1766017k1144297k7638893l1031271l1708843l0345056k7671928
55933A71407435k4348854k0884618j7608803j4695582j2210981j0151288q470499
55926F3036810p107794o009813n135700m448819l910042l478734l117465k797331
55918B7031112k502415k229188j979616j754513j553150j375602j221867j089423
55910A3325338r74310q74038p87537p12793o46796n87622n34922m88534m47975
$$ y = [30984249, 34347298, 38285037, 42879227, 48224105, 54433199, 61650473, 70061672, 79890707, 91379864, 104776566, 120339307, 138335078, 158992122, 182417928, 208518466, 236896778, 266649119, 296068150, 322486363, 342589249, 353278184, 352713740, 340947723, 319803426, 292164533, 261133262, 229424419, 199079363, 171407435, 147058581, 126173963, 108565160, 93869578, 81658597, 71507309, 63036810, 55929016, 49919203, 44783503, 40334684, 36424642, 32945908, 29828443, 27031112, 24528697, 22299509, 20319893, 18565380, 17012230, 15636628, 14414761, 13325338, 12351028, 11476990, 10689453, 9976660, 9329864, 8742242, 8207320, 7718786, 7270811]
55901G270811m12868l82463l55005l28871l04003k81135k60161k40457k22146
55892D483702k05648j90459j75684j61494j48751j37526j27173j17546j08975
55883C110446j01438r4983r0561q9093q9777r0452q9570q6872q2675p7638p2976
55872B144411o9537o6784o3762o0736n8668n7372n5643n3126n0651m8577m6238
55861A513317m3287m0306l7735l5338l3123l1690l1173l0758k9738k8321k7039
55850A144809k6053k5413k5247k5345k5175k4639k4258k4260k4109k3243k1830
55839H75237k0457j9472j8823j8223j7350j6129j4837j3684j2461j0955r497q575
55827F94774q115p704p362p457q032q794r632j0537j1261j1617j1863j2114j1761
$$ y = [7270811, 6857943, 6475480, 6120475, 5791604, 5487601, 5206466, 4946305, 4705848, 4483702, 4278054, 4087595, 3911911, 3750417, 3601666, 3464140, 3336967, 3219421, 3110446, 3009008, 2914025, 2823464, 2734371, 2644594, 2554142, 2464572, 2377700, 2295025, 2217387, 2144411, 2074874, 2008090, 1944328, 1883592, 1824924, 1767552, 1711909, 1658783, 1608132, 1559555, 1513317, 1470030, 1429724, 1391989, 1356651, 1323528, 1291838, 1260665, 1229907, 1200169, 1171848, 1144809, 1118756, 1093343, 1068096, 1042751, 1017576, 992937, 968679, 944419, 920310, 897067, 875237, 854780, 835308, 816485, 798262, 780912, 764783, 749946, 736262, 723801, 712846, 703349, 694774, 686659, 678955, 671593, 664136, 656104, 647310, 637678, 627141, 615880, 604263, 592400, 580286, 568525]
55814E68525j0354q666p889p966p829p097o340n681m468k603j006l14o0M40J276
55799D99968K290L389M118L834K697J664J247R91N34J97J27k19j217k370l017
55784E14233l108l004l174m332o927j0118j2237j2719j2662j2964j2991j1786
55772D08211r648p494n457l142p30J053J688R44j241m207o515p249o959o560n964
55757C46730m710l284k697l006l377l499l885m780n733o344o634o524n742m451
55743B82064l368k956k948k811k390j942j780j937k063j765j119n89l32m7K53
55728B56270n0j241k614l345l541l744l855l392k542k054k235k654k754k186q06
55713B19257R43K027J945J607K181L349L787L156K444K195J726M75r94j932k473
$$ y = [568525, 558171, 549505, 541616, 533650, 525821, 518724, 512384, 506703, 502235, 499632, 498626, 498312, 498252, 498692, 499968, 502258, 505647, 509765, 513599, 516296, 517960, 519207, 520198, 520732, 520929, 521056, 520837, 519620, 517250, 514233, 511125, 508121, 504947, 500615, 493688, 483570, 471333, 458614, 445952, 432988, 419997, 408211, 398563, 391069, 385612, 382470, 381740, 382793, 384481, 385425, 384184, 379977, 373462, 366213, 359254, 352694, 346730, 342020, 338736, 336039, 333033, 329656, 326157, 322272, 317492, 311759, 305415, 298781, 292257, 286515, 282064, 278696, 275740, 272792, 269981, 267591, 265649, 263869, 261932, 259869, 258104, 256985, 256396, 256064, 256017, 256270, 256220, 254979, 252365, 249020, 245479, 241735, 237880, 234488, 231946, 229892, 227657, 225003, 222249, 220063, 219257, 220200, 222227, 224172, 225779, 227960, 231309, 235096, 238252, 240696, 242891, 244617, 245092, 244098, 242166, 239693]
55698B39693l168m073m904n544n871n598m750l855l266k808k370k205k191j535
55684A87555P3J629K017J573J533K195K641K300J810J931K388K332J519M70l04
55669B11662p88j196j590j882j999j949j736j317o06M43J688K718L049K540J641
55654B10678J023R81J236J394J312R07l2j506k818k995j836l45K02m57j394j675
55638B04675j460j731k918m202m579m251m324n058n352m333k760k000k121k013
55624A57573j208n16o15r95p79K8P02P88M48M6k13l06l84o31j051j524k058k672
55606A46633l055k825k232k023k312k204j002O50J464J061J36o74j343j814j665
55591A28795p91P1J16m36n69K09J278J829J901K074K475K659K546K722L544M512
$$ y = [239693, 236525, 232452, 227548, 222004, 216133, 210535, 205785, 201930, 198664, 195856, 193486, 191281, 189090, 187555, 187628, 189257, 191274, 192847, 194380, 196575, 199216, 201516, 203326, 205257, 207645, 209977, 211496, 211966, 211662, 210874, 209678, 208088, 206206, 204207, 202258, 200522, 199205, 198599, 199042, 200730, 203448, 206497, 209037, 210678, 211701, 212682, 213918, 215312, 216624, 217531, 217499, 215993, 213175, 210180, 208344, 207999, 208201, 207744, 206350, 204675, 203215, 201484, 198566, 194364, 189785, 185534, 181210, 176152, 170800, 166467, 163707, 161707, 159586, 157573, 156365, 155849, 155234, 154239, 153460, 153488, 154190, 154978, 155426, 155472, 155259, 154953, 154569, 153938, 152887, 151363, 149305, 146633, 143578, 140753, 138521, 136498, 134186, 131982, 130980, 131630, 133094, 134155, 134291, 133617, 132274, 130460, 128795, 128004, 128075, 128191, 127755, 127186, 127395, 128673, 130502, 132403, 134477, 136952, 139611, 142157, 144879, 148423, 152935]
55575A52935N035N347N992O853P443P991R164J0667J1086R485O460L204K65k297
55561B39630m267n500o365p314q243q775q817q406p396n894m624m206m286m008
55547A51529l195k405k022j938k082k497k875k600j510j90O95R55P63L66j6k95
55531A32683n63q52r40o38j41K41N18P93P98J92q09j636k041k181k116j847j739
55514A19722k220l078l610l489k944k157j207n50p39j522j996j888j840k219k504
55499H7759k249j862j806j795j384q20n80n68l84k6L23P96J520K094K007J393
55483H4418Q19O13P97J420K283K668J950M57q66j467j489j244r64r60j380j859
55467H5196j868j371p82l31N2L79N74P14R22J056Q84L88l82j435k370k276p71
$$ y = [152935, 157970, 163317, 169309, 176162, 183605, 191596, 200760, 211427, 222513, 231998, 238458, 241662, 241927, 239630, 235363, 229863, 223498, 216184, 207941, 199166, 190349, 181943, 174547, 168653, 164029, 159823, 155537, 151529, 148334, 145929, 143907, 141969, 139887, 137390, 134515, 131915, 130405, 130215, 130910, 131865, 132628, 132994, 132978, 132683, 132120, 131268, 130328, 129690, 129549, 129790, 130308, 131101, 131899, 132091, 131282, 129646, 127605, 125424, 123308, 121461, 119722, 117502, 114424, 110814, 107325, 104381, 102224, 101017, 100467, 99728, 98206, 96210, 94322, 92482, 90263, 87759, 85510, 83648, 81842, 80047, 78663, 77843, 77263, 76695, 76311, 76285, 76608, 77404, 78924, 81018, 83025, 84418, 85237, 85850, 86647, 88067, 90350, 93018, 94968, 95425, 94559, 93092, 91603, 90359, 89395, 88435, 87055, 85196, 83328, 81957, 81175, 80844, 80896, 81275, 81849, 82563, 83485, 84541, 85425, 85813, 85431, 83996, 81626, 79350, 78579]
55450G8579J096J828J232M24J75J48r9k87K5O65J104J069O85K74J24J74q8q96
55432H6232j571j207J2R57J126J188J691K090J655P41L16O53J083R71L95j33k10
55415I5989J81P98J390J847J949J295j23j465j736j026m04n53j092j459j674j877
55399I2040j794j206m77m6K02N67Q94Q23M46K18L34N86O88N04O2l73m46j36J70
55380I3056J00l95j148j766j702q57j05m26j436j741r90m60j052j820j466l38
55364G7454K07j84o81p35n00l2Q05J575J470M45o21r62n88J06O77O78L2o52p21
55345G7773l15N9M70J261K070K142J546J092J032Q36L60J41K66L8q06j485j359
55328H5121r20r54j349j351o37M02J119J153O92M03O86J023O21l49q53m34K38
$$ y = [78579, 79675, 81503, 82735, 83159, 83334, 83482, 83383, 83096, 83121, 83786, 84890, 85959, 86644, 86918, 87042, 87216, 87128, 86232, 84661, 83454, 83466, 84423, 85549, 86737, 88428, 90518, 92173, 92914, 93230, 93883, 94966, 95937, 96332, 96199, 95989, 96170, 96968, 98358, 100205, 102154, 103449, 103326, 101861, 100125, 99099, 98695, 98142, 97050, 95591, 93917, 92040, 90246, 89040, 88563, 88517, 88719, 89286, 90180, 91003, 91449, 91667, 92001, 92587, 93275, 93779, 93841, 93468, 93022, 92886, 93056, 93156, 92761, 91613, 89847, 88145, 87288, 87183, 86757, 85321, 83580, 82590, 82130, 81078, 79258, 77792, 77454, 77661, 77477, 76796, 76061, 75561, 75529, 76334, 77909, 79379, 79824, 79203, 78241, 77653, 77759, 78436, 79114, 79146, 78494, 77773, 77458, 77517, 77987, 79248, 81318, 83460, 85006, 86098, 87130, 87966, 88326, 88467, 88733, 88771, 87965, 86480, 85121, 84201, 83247, 81898, 80547, 79910, 80312, 81431, 82584, 83276, 83679, 84365, 85388, 86009, 85660, 84807, 84373, 84611]
55311H4611M83L88K11j61o90r15o30k29M7M31Q34N77m72j327j084r9P38J119J088
55292H4920N08l67n27N50J867K123J418P21J91o16j291q72L38Q03q8j109j041
55275H7528l04j2k95m32j14L18N92P77Q48O00M4m21l93J10O93R85R71Q72P73N48
55255I3688K28Q8J55J2n57r64n51L38O72J45m67m86k05k14m56m75j92Q7K11K17
55235I1274m3p55j642j988j403k93N82Q01M59r0m25j89O16J410J486Q01N9j75
55217I0485j11k39n43o84o93q53j044q31k89m5l38p15q53r56r98l83J009K160
55199H4079K091J230P73J099J622J941K171K231J775R26K39j90p90j536j680q18
55183I5163M25J169J273J171J154J186J170J046Q11N52L14r2p96j464j579j213
$$ y = [84611, 85094, 85482, 85693, 85532, 84842, 83927, 83297, 83068, 83115, 83546, 84380, 84957, 84485, 83158, 82074, 81975, 82713, 83832, 84920, 85428, 85061, 84534, 85084, 86951, 89074, 90492, 91213, 91404, 90788, 89497, 88625, 88963, 89766, 89678, 88569, 87528, 87224, 87212, 86917, 86485, 86371, 86689, 87281, 88058, 88906, 89506, 89550, 89129, 88736, 88846, 89539, 90524, 91495, 92367, 93140, 93688, 93916, 94004, 94159, 94171, 93614, 92650, 92099, 92437, 93109, 93254, 92787, 92301, 92096, 91882, 91426, 90951, 90759, 90846, 91057, 91274, 91231, 90476, 88834, 86846, 85443, 85150, 85732, 86533, 86992, 86902, 86477, 86288, 86904, 88314, 89800, 90601, 90660, 90485, 90374, 90135, 89592, 88908, 88215, 87362, 86318, 85487, 85198, 85153, 84815, 84100, 83247, 82291, 81293, 80910, 81919, 84079, 86170, 87400, 88173, 89272, 90894, 92835, 95006, 97237, 99012, 99938, 100177, 99987, 99197, 97661, 95981, 95163, 95588, 96757, 98030, 99201, 100355, 101541, 102711, 103757, 104568, 105120, 105434, 105342, 104546, 103082, 101503, 100290]
55167A00290r85j186j419j290q89l88K98J076J447J127N44K51J99L6j93j87o7
55150I8664k93r39j507j563j163n48K57J275K183K417J750O50j60m30n13o80o67
55133I8733j71M92P19N00M34P99J078O84j94p92n77K87J064J023R0r89j417j301
55115A00462j374j825j903j029L12J204J372J139O82n3q22j129q29l25m6j9QK30
55097I6055O42J021J073P59L97L14M43N16M77N01O66Q31Q57P15M18P6m4K50P75
55078A06742J096R86N89J40k63n68o72n22j95K11O19Q35N54l02j282j685j252
55061A05031m61J1j6j42LL68O38N56K1q36j489j294k21R30J352J074O82M19R9
55042A06725l16n94o92p58o59p4Q18J311J072N60L01K13kk61k37J28O23R81R04
$$ y = [100290, 99305, 98119, 96700, 95410, 94521, 94133, 94431, 95507, 96954, 98081, 98625, 98876, 99075, 99111, 98918, 98731, 98664, 98371, 97432, 95925, 94362, 93199, 92651, 92908, 94183, 96366, 98783, 100533, 101183, 101023, 100593, 100080, 99400, 98733, 98562, 99054, 99773, 100273, 100707, 101506, 102584, 103268, 103074, 102282, 101705, 101992, 103056, 104079, 104169, 103180, 101763, 100462, 99088, 97263, 95360, 94331, 94643, 95847, 97219, 98358, 99040, 98987, 98165, 97036, 96207, 95882, 95836, 95817, 95825, 96055, 96697, 97718, 98791, 99550, 99947, 100261, 100704, 101220, 101697, 102198, 102864, 103695, 104552, 105267, 105685, 105761, 105717, 105967, 106742, 107838, 108824, 109413, 109553, 109290, 108722, 108050, 107528, 107333, 107544, 108163, 108998, 109552, 109250, 107968, 106283, 105031, 104570, 104581, 104565, 104423, 104426, 104794, 105432, 105988, 106009, 105173, 103684, 102390, 102169, 103099, 104451, 105525, 106207, 106626, 106725, 106409, 105815, 105123, 104365, 103706, 103632, 104450, 105761, 106833, 107393, 107694, 107907, 107905, 107644, 107407, 107535, 108158, 109139, 110043]
55023A10043K29p21j286j299j296j603j712j050j6M24l6q39j439j779j848j391
55007I4381k76J138K245K676K505K077J639J114L53l89n70j25K64Rn91q37o31
54990A04982m58n19m21J67J009J560J491R10K92J19M65R36J116R37M99j43p36
54973A12206p68r2O48P24K43o8J30N45Q88J151J313J245J002P16K34o15j440j489
54955A16573o22M19Q33N00j62o17m81J77P01M69k71o49l51j5k64q87j208q52Q1
54936A13374J153J718J385N25p4j97l06n52l96M16J205J271Q74O84P56P81R96
54919A23613J921L308M193M176L935M247M937N168M493L310K265J469M15j215
54905A66235k889l728l664l600m190m938m969m280l557k976j976l63R80R30n03
$$ y = [110043, 110272, 109551, 108265, 106966, 105670, 104067, 102355, 101305, 101289, 101713, 101677, 100838, 99399, 97620, 95772, 94381, 94105, 95243, 97488, 100164, 102669, 104746, 106385, 107499, 107852, 107463, 106893, 106768, 107032, 107041, 106450, 105613, 104982, 104524, 104005, 103584, 103751, 104760, 106320, 107811, 108721, 109013, 109132, 109597, 110533, 111649, 112586, 113085, 112942, 112206, 111438, 111346, 111994, 112718, 112961, 112893, 113023, 113568, 114456, 115607, 116920, 118165, 119167, 119883, 120117, 119502, 118062, 116573, 115951, 116370, 117203, 117703, 117541, 116924, 116443, 116620, 117321, 117790, 117519, 116870, 116519, 116504, 116240, 115353, 114145, 113293, 113374, 114527, 116245, 117630, 118155, 118081, 117884, 117578, 117026, 116630, 117046, 118251, 119522, 120396, 121080, 121836, 122617, 123613, 125534, 128842, 133035, 137211, 141146, 145393, 150330, 155498, 159991, 163301, 165566, 167035, 167450, 166235, 163346, 159618, 155954, 152354, 148164, 143226, 138257, 133977, 130420, 127444, 125468, 125105, 126085, 127015, 126512]
54890A26512j974k083p60P08J118O10K12L61N36M49P02J718K733K716J900J504
54874A36962K121L205M059M478M364L642K713K253K262J933P79p43j984k806l284
54859A59954l366l197l141l130k618j670j265j926k752k638j919j772k376k722
54845A25462k198j401j121j296j291o77M39J441J510L87j066j585r37j44j98r63
54829A16362j572j417o13K45N47K54m6J71O56P83M81J71j04o45j207j104m19j13
54811A12430m28k83R74K190J854L46n42l8Q73J095O83K24o7k18j86j13l23p98
54793A17673j020o84j50Q1k1j50j22L7K69N02O90Q60R58P83L47J87Q37J977K588
54774A25642K133J139M91N33R65J293J293J278J846L019L893L751L315L897N357
$$ y = [126512, 124538, 122455, 121695, 122403, 123521, 124131, 124343, 124704, 125240, 125689, 126391, 128109, 130842, 133558, 135458, 136962, 139083, 142288, 146347, 150825, 155189, 158831, 161544, 163797, 166059, 167992, 168771, 168028, 166044, 163238, 159954, 156588, 153391, 150250, 147120, 144502, 142832, 141567, 139641, 136889, 134251, 132332, 130560, 128184, 125462, 123264, 121863, 120742, 119446, 118155, 117478, 117917, 119358, 120868, 121255, 120189, 118604, 117667, 117523, 117325, 116362, 114790, 113373, 112760, 113005, 113552, 113806, 113760, 113931, 114587, 115370, 115851, 116022, 115918, 115273, 114066, 112962, 112543, 112430, 112002, 111719, 112693, 114883, 116737, 117083, 116541, 116503, 117376, 118471, 119154, 119378, 119311, 119093, 118907, 118794, 118471, 117673, 116653, 115969, 115819, 115900, 115879, 115729, 115607, 115644, 115913, 116415, 117105, 117965, 118923, 119706, 120053, 120240, 121077, 123054, 125642, 127775, 128914, 129405, 129938, 130903, 132196, 133489, 134767, 136613, 139632, 143525, 147276, 150591, 154488, 159845]
54759A59845O051N117L643K946K697J737j19k117l850n373o355o279n414m611
54745A47918m151l492k293r18J25N87L67m06j084j029m39j10l28o62q14r07q70
54728A31494l93L05N02J43J45J091K285K761K622K686L258L962M529N015N303
54713A65708M968L796K090M06p77j235j231j466k463l926m928m830l852k773k271
54698A47216k439k801k733k057j204p85r71j370j436j033n82o60j323j959j939
54683A23924j357q22o11m66k36k18n59q40o53k35k9Q4N36J126J052P2r60j092
54665A18716m41J00O4j66j42L4Q7J45N27J090J334J092P50O07M83J39j99j44K57
54646A24333N36L40k61q58r73m62J65J26o35j222r18j56J64rQM58Q95J048J101
$$ y = [159845, 165896, 171013, 174656, 177602, 180299, 182036, 181917, 179800, 175950, 170577, 164222, 157943, 152529, 147918, 143767, 140275, 137982, 137064, 137189, 137776, 138143, 137737, 136653, 135624, 135185, 135075, 134747, 134085, 133271, 132364, 131494, 131101, 131406, 131908, 132051, 132196, 133287, 135572, 138333, 140955, 143641, 146899, 150861, 155390, 160405, 165708, 170676, 174472, 176562, 176968, 176191, 174956, 173725, 172259, 169796, 165870, 160942, 156112, 152260, 149487, 147216, 144777, 141976, 139243, 137186, 135982, 135197, 134226, 132856, 131420, 130387, 129805, 129145, 127822, 125863, 123924, 122567, 121745, 121134, 120668, 120432, 120214, 119655, 118815, 118162, 117927, 117898, 117982, 118518, 119644, 120696, 120768, 119808, 118716, 118275, 118375, 118439, 118273, 118131, 118165, 118252, 118397, 118924, 120014, 121348, 122440, 123190, 123797, 124280, 124419, 124220, 124076, 124333, 124869, 125209, 124948, 124090, 123117, 122655, 122820, 122946, 122311, 121089, 120171, 120015, 120179, 120170, 120178, 120636, 121531, 122579, 123680]
54627A23680J053N93j73o36n50l29k70j75lj03m98o96n96o77q69k66J313K510
54609A23308K167J041N78P25L71n17q20k47J56k23p49r13j185j724j526J31K163
54592A22736K755J617J18n41m19j71j59m41q97j102m71R91K407K732J800M68k98
54575A31125l35k31m83r32j082p63k17K84O01N68N2o57r08l76M86Q89N36j45m41
54556A27971l8P30J190J031O23N52R08J283J343J082N67m9k48N27K019L096K985
54539A45572K157J566J336Q57q1r19j169j046r51q38l90L51Q61O07m47j687k221
54522A43558j574k07Q39R32L63j60l22l21l75m28l60j92m7m3k65o86j099j237
54504A38376j096q94p56n66k62k8J7R9M42P70N81r8o26n01P7O00Q58R23Q01M19
$$ y = [123680, 124733, 125326, 125153, 124517, 123967, 123638, 123368, 123193, 123190, 123087, 122589, 121893, 121297, 120620, 119751, 119485, 120798, 123308, 125475, 126516, 127094, 127819, 128190, 127673, 126853, 126606, 126762, 126539, 125790, 124877, 123692, 121968, 120442, 120573, 122736, 125491, 127108, 127226, 126685, 126266, 126095, 125936, 125495, 124598, 123496, 123025, 124016, 126423, 129155, 130955, 131423, 131125, 130790, 130559, 130076, 129144, 128062, 127299, 127082, 127366, 127967, 128535, 128587, 127930, 127022, 126646, 127132, 128021, 128557, 128412, 127971, 127933, 128663, 129853, 130884, 131507, 132059, 132967, 134250, 135593, 136675, 137242, 137193, 136945, 137472, 139491, 142587, 145572, 147729, 149295, 150631, 151488, 151407, 150488, 149319, 148273, 147322, 146484, 146094, 146445, 147306, 147913, 147466, 145779, 143558, 141984, 141777, 142616, 143548, 143911, 143751, 143429, 143108, 142733, 142305, 141945, 141753, 141706, 141663, 141398, 140712, 139613, 138376, 137280, 136386, 135630, 135064, 134802, 134774, 134791, 134890, 135332, 136102, 136683, 136585, 135959, 135458, 135535, 136135, 136993, 137916, 138717, 139136]
54484A39136j03m27l28J19O32R28Q66N11Q2k19k72j9M57Q76J018J079J432J966
54466A47734K053J341K63n14p77o16j0R15J504J113K2q18r45q00r01j142j088
54449A47334n67K46J029J394J080K50o02j133j372j391j138o73l25l38n85p28
54433A42481n75j75K20L40K26L27J008J962K478K240J536O73j77o19j95Q17J394
54416A53961R77J28l50m41n07m83j82km72j265j445o97L54J067J377J387J081
54399A54488O91O95J151J492J363J208J521J926J588M51n53o62k05j23p12j266
54383A63053r57J04Q94N54o86j740j755q81M7M58M68M46L20k91j263j677q00Q97
54365A57191K138K245J651R97M26J0J35Q87J543J407Q43P27J142J375J199J220
$$ y = [139136, 139033, 138606, 138278, 138397, 139029, 139957, 140823, 141334, 141416, 141197, 140925, 140906, 141363, 142239, 143257, 144336, 145768, 147734, 149787, 151128, 151391, 150877, 150100, 149484, 149474, 150389, 151893, 153006, 153028, 152210, 151265, 150465, 149564, 148422, 147334, 146767, 147013, 148042, 149436, 150516, 150766, 150164, 149031, 147659, 146268, 145130, 144457, 144132, 143794, 143209, 142481, 141906, 141731, 141951, 142291, 142517, 142844, 143852, 145814, 148292, 150532, 152068, 152741, 152564, 151945, 151750, 152567, 153961, 154938, 155066, 154716, 154275, 153768, 153285, 153103, 153101, 152629, 151364, 149919, 149222, 149576, 150643, 152020, 153407, 154488, 155179, 155874, 157025, 158517, 159880, 161088, 162609, 164535, 166123, 166574, 166021, 165359, 165154, 165031, 164319, 163053, 162096, 162200, 163094, 163648, 162962, 161222, 159467, 158586, 158633, 159091, 159559, 160005, 160325, 160034, 158771, 157094, 156294, 157191, 159329, 161574, 163225, 164222, 164648, 164658, 164793, 165680, 167223, 168630, 169473, 170200, 171342, 172717, 173916, 175136]
54349A75136J781K304K167J601J266J362J600J704J470O64p18k187l138l394l202
54334A78416k852k590k605k792k699k054j186n87l21j44k6q2j29J11L61k6j055
54317A59740j822j578p39l79q72j416j048J66J120Q55m32j634j900j384p83m50
54301A47444k06J46N35Q28J019J118J026O41k4q03j312j073k0J139J469P88j47
54284A52568n14j72M61Q90P67O6o85p11O9Q41R34O85P96J161R95Q3q26r87m49
54265A55972K45O74O38J21n63r24q23n99m63j33O16J398J620J296J012J171J546
54248A62804J545P54o62j933k217j425l73J53K56N18R81J079N39k10o60q02q92
54231A59455r90j004r46q81q23p94q37q03m15L39J018J185Q46L56N6J68P17J320
$$ y = [175136, 176917, 179221, 181388, 182989, 184255, 185617, 187217, 188921, 190391, 191055, 190337, 188150, 185012, 181618, 178416, 175564, 172974, 170369, 167577, 164878, 162824, 161638, 161051, 160730, 160586, 160560, 160478, 160349, 160460, 160821, 160795, 159740, 157918, 156340, 155601, 155222, 154350, 152934, 151886, 152052, 153172, 154027, 153595, 151961, 150061, 148677, 147894, 147444, 147238, 147384, 147919, 148747, 149766, 150884, 151910, 152551, 152527, 151724, 150412, 149339, 149319, 150458, 151927, 152715, 152568, 152054, 151882, 152343, 153233, 154000, 154066, 153381, 152670, 152739, 153580, 154514, 155199, 155995, 157156, 158151, 158234, 157408, 156421, 155972, 156217, 156891, 157529, 157650, 157087, 156163, 155340, 154741, 154278, 154145, 154761, 156159, 157779, 159075, 160087, 161258, 162804, 164349, 165103, 164441, 162508, 160291, 158866, 158493, 158646, 158902, 159420, 160401, 161480, 162019, 161809, 161149, 160347, 159455, 158465, 157461, 156515, 155634, 154811, 154017, 153180, 152377, 151962, 152301, 153319, 154504, 155350, 155706, 155762, 155930, 156647, 157967]
54213A57967J365P16rk04q5k34n56l82L34O69r7j396k013j534o46j28oJ39M12
54194A54312M65P3m23m14K13Q25P34Q3l33j32J45j51q87j384j290p30J44J145
54176A52395J677J129j69j061r80n46m26l17J98M94k97j653k022r55K80N40K37
54159A48524K59M31J1q34j145o07N7K20N1OK28O83J271J595J176K12l71j4O95
54140A52448P94K03k56L7P92J272J102N26P2P4M37P40O11N4n23o71l31N4Rl47
54120A57097m40o5K65N1l47j64O65J451J797J972K115J752O62l76l88M82J083
54103A67612O53l99j216j460j400j315j163p65j50L88O18O95R49J410J735J687
54087A67879J419J163R11O03L58K67J55j30m00l49jL74O45Q27Q55P04O38R59J528
$$ y = [157967, 159332, 160048, 160039, 159835, 159750, 159516, 158960, 158578, 158912, 159581, 159484, 158088, 156075, 154541, 153895, 153767, 153761, 153900, 154312, 154777, 154850, 154427, 154013, 154226, 155051, 155785, 155868, 155535, 155403, 155548, 155397, 154510, 153126, 151836, 151106, 151250, 152395, 154072, 155201, 155032, 153971, 152991, 152445, 152019, 151702, 151900, 152394, 152097, 150444, 148422, 147467, 147747, 148287, 148524, 148783, 149214, 149225, 148391, 147246, 146639, 146696, 146916, 146967, 146973, 147201, 147884, 149155, 150750, 151926, 152138, 151767, 151753, 152448, 153242, 153445, 153189, 153226, 154018, 155290, 156392, 156918, 156990, 157064, 157501, 158241, 158852, 158906, 158383, 157712, 157381, 157435, 157444, 157097, 156657, 156592, 156857, 156908, 156561, 156397, 157062, 158513, 160310, 162282, 164397, 166149, 166811, 166435, 166047, 166529, 167612, 168265, 167866, 166650, 165190, 163790, 162475, 161312, 160547, 160397, 160785, 161403, 162098, 163047, 164457, 166192, 167879, 169298, 170461, 171372, 171975, 172333, 172600, 172755, 172625, 172225, 171876, 171875, 172249, 172894, 173721, 174576, 175280, 175918, 176877, 178405]
54068A78405J814J553J053Q19J027J419J570J363J264J930L379M834N619N916
54054B11965O224O505O357N788N025L795J663q60k532k972l121l661l864k826
54040B27486j094j1J48M10J454K778L681M246M869N351N131M165L138K752L033
54025B67537L402L258K476J438O20K39J99K22p7r89k286l211l232k784k798l522
54009B60492m191m089l458l013k978l045l093l297l542l312k391j330q42j044
53995B20867j554k102k599k761k213j078j12N4m31q91r09o83o89j107j505j172
53979B01115P3J349J472L76o51n29K10K01q55j800j563l68Q59J618J947J885J442
53962B06781R14O92Q45J184J638K260K924L432L871M501N192N383M783L797L040
$$ y = [178405, 180219, 181772, 182825, 183644, 184671, 186090, 187660, 189023, 190287, 192217, 195596, 200430, 206049, 211965, 218189, 224694, 231051, 236839, 241864, 245659, 247322, 246462, 243930, 240958, 237837, 234176, 230312, 227486, 226392, 226381, 226529, 226939, 228393, 231171, 234852, 239098, 243967, 249318, 254449, 258614, 261752, 264504, 267537, 270939, 274197, 276673, 278111, 278731, 278970, 279169, 279391, 279314, 278325, 276039, 272828, 269596, 266812, 264014, 260492, 256301, 252212, 248754, 245741, 242763, 239718, 236625, 233328, 229786, 226474, 224083, 222753, 221911, 220867, 219313, 217211, 214612, 211851, 209638, 208560, 208448, 208502, 208071, 207180, 206271, 205588, 204899, 203792, 202287, 201115, 201188, 202537, 204009, 204385, 203734, 203205, 203415, 203616, 202761, 200961, 199398, 199030, 199889, 201507, 203454, 205339, 206781, 207695, 208387, 209232, 210416, 212054, 214314, 217238, 220670, 224541, 229042, 234234, 239617, 244400, 248197, 251237]
53947B51237K606K099J321N75K40K60L53N36J089J937K450K196J633J633K390
53932B72555L262L681L723L662L475L145K927K939K807K269J803K098L063L953
53918C15362M421M849N628O685P799Q910R909J0638J1224J1972J2722J2905J2404
53905D35428J1863J1714J1424J0128P536L791j020o504j1495j4781j6279j6773
53893D25032j6660j5731j4191j2858j2081j1217r750q224p433p308p229p089p166
53880B88095p213o549n124l749l045k834k692k567k488k247j813j689k328l405
53866B40352m089l970l296k489j786j356j260j305j240j121j206j453j554j466
53852B12761j467j556j302n60J14K17O9K97P71P85J93l00k40j43o49j445j610
$$ y = [251237, 253843, 255942, 257263, 257838, 258078, 258338, 258691, 259227, 260316, 262253, 264703, 266899, 268532, 270165, 272555, 275817, 279498, 283221, 286883, 290358, 293503, 296430, 299369, 302176, 304445, 306248, 308346, 311409, 315362, 319783, 324632, 330260, 336945, 344744, 353654, 363563, 374201, 385425, 397397, 410119, 423024, 435428, 447291, 459005, 470429, 480557, 488093, 491884, 490864, 484360, 472865, 458084, 441805, 425032, 408372, 392641, 378450, 365592, 353511, 342294, 332544, 324320, 316887, 309579, 302350, 295261, 288095, 280882, 274333, 269209, 265460, 262415, 259581, 256889, 254322, 251834, 249587, 247774, 246085, 243757, 240352, 236263, 232293, 228997, 226508, 224722, 223366, 222106, 220801, 219561, 218440, 217234, 215781, 214227, 212761, 211294, 209738, 208436, 207876, 207990, 208207, 208276, 208573, 209344, 210129, 210322, 210022, 209782, 209639, 208990, 207545, 205935]
53835B05935q52J47O54O47N43N20L64j52r32j523j402m74P37J560J867J990K011
53818B11640J599P99L64Q02J431J193K34j49P06J971K655K973L714M743N140M604
53802B44419L824L407L235L110L263L774M123L847L204K692K315J840J468J536
53788B86057J772J522P41R6rJ06N4j01k40n61j179j811k259k821l669m275m050
53771B69373l369l217l791m228l869l175k948l177l211k824k460k443k495k281
53757B25885k026k235k903l362l058k240j625j423j100k14P96J121O94K60K99
53742B08869M52K84M9J79M10J60l76l48M58J194J147P18O60R31R97R14J243J958
53724B19899K275J792J056O63M59J54J57J017K319K940K477J698J382J369J163
$$ y = [205935, 205083, 205230, 205884, 206531, 207074, 207594, 207958, 207806, 206874, 205351, 203949, 203475, 204212, 205772, 207639, 209629, 211640, 213239, 214038, 214402, 215204, 216635, 217828, 218062, 217913, 218619, 220590, 223245, 226218, 229932, 234675, 239815, 244419, 248243, 251650, 254885, 257995, 261258, 265032, 269155, 273002, 276206, 278898, 281213, 283053, 284521, 286057, 287829, 289351, 290092, 290188, 290179, 290285, 290339, 290238, 289998, 289437, 288258, 286447, 284188, 281367, 277698, 273423, 269373, 266004, 262787, 258996, 254768, 250899, 247724, 244776, 241599, 238388, 235564, 233104, 230661, 228166, 225885, 223859, 221624, 218721, 215359, 212301, 210061, 208436, 207013, 205913, 205699, 206495, 207616, 208310, 208570, 208869, 209321, 209605, 209654, 209833, 210243, 210403, 210027, 209679, 210137, 211331, 212478, 213196, 213856, 214787, 215784, 216698, 217941, 219899, 222174, 223966, 225022, 225685, 226144, 226298, 226455, 227472, 229791, 232731, 235208, 236906, 238288, 239657, 240820]
53709B40820R05J136J826K302K196J946K176K874L447L411K893K442K478K873
53695B73725L117K901K444K087J817J503J380J826K518K534J562M55N9p2j000
53680B96856k666l723l249j852o86q1K73L36k81j413k193k008j169m44k41l41
53664B77118k94J36P18R49O09J38R6L16Nj036j818j320M0P64J79o93n31N54J341
53645B77271J235R19J108J411J032J24k47M37J423J677J166P27Q93J296J326R67
53629B92765P42J018J623K186K598K988L365L533L382L120L097L455M043M506
53615C32421M434L656K627K289L164M636N515N296M495L755L131K520K244K678
53601C82861L541M051L815L202K786K691K608K284J831J555J418R31k64j724k542
$$ y = [240820, 241725, 242861, 244687, 246989, 249185, 251131, 253307, 256181, 259628, 263039, 265932, 268374, 270852, 273725, 276842, 279743, 282187, 284274, 286091, 287594, 288974, 290800, 293318, 295852, 297414, 297869, 297928, 297856, 296856, 294190, 290467, 287218, 285366, 284680, 284599, 284872, 285208, 284927, 283514, 281321, 279313, 278144, 277700, 277459, 277118, 276824, 276960, 277678, 278627, 279236, 279374, 279470, 279786, 279791, 278755, 276937, 275617, 275657, 276421, 276600, 275907, 275376, 275930, 277271, 278506, 279425, 280533, 281944, 282976, 283100, 282853, 283290, 284713, 286390, 287556, 288283, 289176, 290472, 291798, 292765, 293507, 294525, 296148, 298334, 300932, 303920, 307285, 310818, 314200, 317320, 320417, 323872, 327915, 332421, 336855, 340511, 343138, 345427, 348591, 353227, 358742, 364038, 368533, 372288, 375419, 377939, 380183, 382861, 386402, 390453, 394268, 397470, 400256, 402947, 405555, 407839, 409670, 411225, 412643, 413574, 413310, 411586, 409044]
53586D09044k530k551l346m421m637l748k717k449k771k922k633k357k556l056
53572C66350l224k692j783j100p53k91N17J248J407J086O92L06j35l10J94J077
53556C62589J562J475J445J817K048J660J186J540K719L685L607K771K229K682
53542C93015L887N015N491N415N213N143N352O051P204Q217Q528Q428Q746R659
53528D85364J0481J0811J1127J1917J2915J3712J4521J5626J6603J6794J6401
53517F36272J6323J6995J8061J9175K0434K1871K3091K3705K3848K3980K4367
53506H68122K4886K5197K5060K4559K4063K3838K3786K3606K3075K2135K0883
53495A129210J9720J9162J9300J9635J9699J9534J9281J8700J7650J6749J6839
$$ y = [409044, 406514, 403963, 400617, 396196, 391559, 387811, 385094, 382645, 379874, 376952, 374319, 371962, 369406, 366350, 363126, 360434, 358651, 357551, 356798, 356507, 357024, 358272, 359679, 360765, 361457, 361763, 361628, 361318, 361512, 362589, 364151, 365626, 367071, 368888, 370936, 372596, 373782, 375322, 378041, 381726, 385333, 388104, 390333, 393015, 396902, 401917, 407408, 412823, 418036, 423179, 428531, 434582, 441786, 450003, 458531, 466959, 475705, 485364, 495845, 506656, 517783, 529700, 542615, 556327, 570848, 586474, 603077, 619871, 636272, 652595, 669590, 687651, 706826, 727260, 749131, 772222, 795927, 819775, 843755, 868122, 893008, 918205, 943265, 967824, 991887, 1015725, 1039511, 1063117, 1086192, 1108327, 1129210, 1148930, 1168092, 1187392, 1207027, 1226726, 1246260, 1265541, 1284241, 1301891, 1318640, 1335479]
53484A335479J7772J8350J7641J5952J4358J3574J3397J2948J1462R035O543M596
53472A491107K857P37j613l673n665q323j1514j4042j5198j5658j6340j7082j7164
53459A368429j6653j6443j7167j8716k0677k2587k3808k3809k2749k1438k0514
53448A143868j9925j9291j8488j7741j7173j6444j4854j2041q614n835m431l882
53436I85149l182k118j269q31j08J520L583N046N678O278P522R128J0521J1867
53422A038784J3785J6215J8225J9181J9560K0263K1530K3002K4504K6178K8041
53411A269268K9920L1859L4003L6082L7558L8490L9634M1466M3544M5261M6769
53400A693854M8661N0963N2943N4000N4351N4746N5671N6874N7624N7432N6504
$$ y = [1335479, 1353251, 1371601, 1389242, 1405194, 1419552, 1433126, 1446523, 1459471, 1470933, 1479968, 1486511, 1491107, 1493964, 1494701, 1493088, 1489415, 1483750, 1475427, 1463913, 1449871, 1434673, 1419015, 1402675, 1385593, 1368429, 1351776, 1335333, 1318166, 1299450, 1278773, 1256186, 1232378, 1208569, 1185820, 1164382, 1143868, 1123943, 1104652, 1086164, 1068423, 1051250, 1034806, 1019952, 1007911, 999297, 993462, 989031, 985149, 981967, 979849, 978580, 977749, 977641, 979161, 982744, 987790, 993468, 999746, 1007268, 1016396, 1026917, 1038784, 1052569, 1068784, 1087009, 1106190, 1125750, 1146013, 1167543, 1190545, 1215049, 1241227, 1269268, 1299188, 1331047, 1365050, 1401132, 1438690, 1477180, 1516814, 1558280, 1601824, 1647085, 1693854, 1742515, 1793478, 1846421, 1900421, 1954772, 2009518, 2065189, 2122063, 2179687, 2237119, 2293623]
53389B293623N5389N4290N2890N0907M8500M6049M3727M1399L8718L5285L1004
53378B791781K6342K1944J7885J3620Q735L398k087p657j3254j8681k4067k9945
53366B788014l6418m2643m7668n1360n4022n5586n5916n5652n5773n6331n6432
53355B220213n5519n3909n1925m9394m6394m3786m2329m1739m1209m0592m0411
53344A713006m0819m1087m0294l8265l5689l3352l1362k9161k6321k3249k0726
53333A352681j8937j7307j5465j3838j3026j2980j3231j3610j4241j4896j4947
53322A190203j4036j2418j0599q935p643o795o114n105l660k258j282l92R92K748
53308A114706M155M992N970P715R839J1548J2897J4688J7121J9307K0511K1183
$$ y = [2293623, 2349012, 2403302, 2456192, 2507099, 2555599, 2601648, 2645375, 2686774, 2725492, 2760777, 2791781, 2818123, 2840067, 2857952, 2871572, 2880307, 2883705, 2881618, 2873961, 2860707, 2842026, 2817959, 2788014, 2751596, 2708953, 2661285, 2609925, 2555903, 2500317, 2444401, 2388749, 2332976, 2276645, 2220213, 2164694, 2110785, 2058860, 2009466, 1963072, 1919286, 1876957, 1835218, 1794009, 1753417, 1713006, 1672187, 1631100, 1590806, 1552541, 1516852, 1483500, 1452138, 1422977, 1396656, 1373407, 1352681, 1333744, 1316437, 1300972, 1287134, 1274108, 1261128, 1247897, 1234287, 1220046, 1205150, 1190203, 1176167, 1163749, 1153150, 1144215, 1136572, 1129777, 1123663, 1118558, 1114898, 1112640, 1111358, 1110966, 1111958, 1114706, 1118861, 1123853, 1129823, 1137538, 1147377, 1158925, 1171822, 1186510, 1203631, 1222938, 1243449, 1264632]
53296A264632K2300K4014K5596K6510K6878K7029K7131K7295K7419K6891K5054
53285A550749K2178J9441J7614J6251J4429J1777Q448M577M05l431o376q602j0680
53272A636780j2735j4521j6194j8303k0904k3326k5013k6125k7055k7846k8347
53261A396411k8546k8457k8038k7603k7854k8997l0146l0143k8927k7560k6900
53250A083240k6783k6621k6303k6189k6395k6478k5801k4241k2475k1481k1577
53239H08896k1978k1566k0000j7883j5922j4352j3169j2390j1829j1088j0051
53228F38668r130q717q679q791r207j0087j1009j1376j1293j1408j1909j2372
53216E14690j2627j3086j3813j3984j2817j0700q775p688p204o917o710o490o066
$$ y = [1264632, 1286932, 1310946, 1336542, 1363052, 1389930, 1416959, 1444090, 1471385, 1498804, 1525695, 1550749, 1572927, 1592368, 1609982, 1626233, 1640662, 1652439, 1660887, 1665464, 1665869, 1662438, 1656062, 1647460, 1636780, 1624045, 1609524, 1593330, 1575027, 1554123, 1530797, 1505784, 1479659, 1452604, 1424758, 1396411, 1367865, 1339408, 1311370, 1283767, 1255913, 1226916, 1196770, 1166627, 1137700, 1110140, 1083240, 1056457, 1029836, 1003533, 977344, 950949, 924471, 898670, 874429, 851954, 830473, 808896, 786918, 765352, 745352, 727469, 711547, 697195, 684026, 671636, 659807, 648719, 638668, 629538, 620821, 612142, 603351, 594144, 584057, 573048, 561672, 550379, 538971, 527062, 514690, 502063, 488977, 475164, 461180, 448363, 437663, 428888, 421200, 413996, 407079, 400369, 393879, 387813]
53203C87813n485n156n415o145o946p552p913p999p717p048o163n365m777m164
53189B99968l256k297j956k525l380l637l118k359j777j403j354j883k725k998
53175B65300k207r86l30l95n85o26r01j595k171j984j084o5O34R48R28O40K40
53158B55761j11m45q61j209j194q54o32p88r90p54k06K8l27q18q79n58l20l34
53140B44509l40j63J1Ll7J13L54M34L67M49Q29J293J492J259O88J11l8M07R82
53121B52723Q98q3j245j629j037o6P12J179J320R39K3r14j241q92l42j1P8J10
53103B50522J44Q0k53r49j804k340k230j695j238r67n41J89P86P41J69l17l35
53086B39962r0J3j24k40p8L23O95Q45Q10O35K25m21r18q24k79j3m40j089j183
$$ y = [387813, 382328, 377172, 371757, 365612, 358666, 351114, 343201, 335202, 327485, 320437, 314274, 308909, 304132, 299968, 296712, 294415, 292459, 289934, 286554, 282917, 279799, 277440, 275663, 274260, 272906, 271023, 268298, 265300, 263093, 262107, 261777, 261382, 260797, 260171, 259270, 257675, 255504, 253520, 252436, 252371, 253005, 253953, 254881, 255521, 255761, 255650, 255205, 254344, 253135, 251941, 251087, 250455, 249667, 248677, 247923, 247717, 247745, 247418, 246600, 245721, 245163, 244843, 244509, 244169, 244006, 244017, 244020, 243983, 244096, 244450, 244884, 245251, 245700, 246529, 247822, 249314, 250573, 251261, 251372, 251334, 251741, 252723, 253621, 253538, 252293, 250664, 249627, 249561, 250273, 251452, 252772, 253711, 253734, 252820, 251579, 250687, 250345, 250334, 250412, 250522, 250666, 250746, 250493, 249544, 247740, 245400, 243170, 241475, 240237, 239270, 238729, 238918, 239704, 240445, 240614, 240297, 239962, 239872, 239885, 239761, 239521, 239443, 239766, 240461, 241306, 242116, 242751, 242976, 242555, 241637, 240813, 240534, 240521, 240081, 238992, 237809]
53067B37809o09K4J64j90o80r67q14j89O51J294J479J217O80J50j8L24Q79J140
53049B42344R66O51M36K28q3l35l75m14p75j427j993k231k195j954j426o55nJ46
53031B30903r5k10J06N88P89P45R16J469J887J519L87p76j240q18K06J325J957
53014B39658J662N49o56j159p26K02R53J063N02l51r58r71m50K73Q46J035P96
52997B42268L29p7l12n20p19n52K98J516K292K105J231L31j66k11J40P88J454
52980B50195J714J299L22p42j249q27K68J242J529J378J512K216L041L384L059
52965B68341K265J346O87N33O32M05k91q22n41K96P86M18n42j516k110k186j909
52948B65792j698j789j879j586j132j085j433j615j405j172j035n89K11O47K64
$$ y = [237809, 237200, 237224, 237388, 237198, 236518, 235551, 234737, 234548, 235199, 236493, 237972, 239189, 239869, 240019, 240001, 240325, 241204, 242344, 243310, 243961, 244397, 244625, 244542, 244207, 243832, 243418, 242643, 241216, 239223, 236992, 234797, 232843, 231417, 230762, 230757, 230903, 230808, 230598, 230704, 231292, 232081, 232826, 233742, 235211, 237098, 238617, 239004, 238228, 236988, 236170, 236376, 237701, 239658, 241320, 241869, 241213, 240054, 239328, 239530, 240483, 241546, 242048, 241697, 240739, 239768, 239318, 239591, 240437, 241472, 242268, 242597, 242520, 242208, 241688, 240969, 240417, 240715, 242231, 244523, 246628, 247859, 248190, 248024, 247813, 247953, 248741, 250195, 251909, 253208, 253530, 252788, 251539, 250712, 250980, 252222, 253751, 255129, 256641, 258857, 261898, 265282, 268341, 270606, 271952, 272639, 273172, 273804, 274209, 273918, 273096, 272555, 272851, 273637, 274055, 273513, 271997, 269887, 267701, 265792, 264094, 262305, 260426, 258840, 257708, 256623, 255190, 253575, 252170, 250998, 249963, 249374, 249585, 250232, 250496]
52933B50496l54m85l66o29j079r84l86j79p88j597j855j509q74j02O72J094R09
52916B41984L20k27m52l84k58l37o41q46o68k45J07L53O03P00M47J33J98L89l9
52897B41137j091j743j234q1O41N81K47K09O04J186J540J393R88Q91J199J292
52881B47759O26n20j454j846j756j275n61PK23L85Q13J272J290R49Q02J078J469
52864B49261J601J403J002O77P90J349J699J215K39k31J24N05J59o03r78q70r57
52847B56385j724k863l706l888l543l052k711k521k298k010j929k243k569k168
52833B19160q57N39R92M77k4K13Q65J244J325J519J729J336K26q56j176q29l43
52816B25540P4N10R16J087R42N70J04k14o3N63J185J293Q84L34n3k09j98k10m94
$$ y = [250496, 250142, 249657, 249291, 248662, 247583, 246599, 246213, 246034, 245246, 243649, 241794, 240285, 239411, 239309, 239981, 241075, 241984, 242304, 242077, 241625, 241241, 240983, 240646, 240005, 239159, 238491, 238246, 238353, 238706, 239309, 240009, 240456, 240589, 240787, 241176, 241137, 240046, 238303, 237069, 236988, 237629, 238210, 238457, 238666, 239270, 240456, 241996, 243389, 244377, 245268, 246467, 247759, 248385, 247865, 246411, 244565, 242809, 241534, 240973, 240980, 241203, 241588, 242401, 243673, 244963, 245912, 246714, 247792, 249261, 250862, 252265, 253267, 253944, 254734, 256083, 257782, 258997, 259236, 259005, 259129, 259634, 259793, 259190, 258212, 257342, 256385, 254661, 251798, 248092, 244204, 240661, 237609, 234898, 232377, 230079, 228069, 226140, 223897, 221328, 219160, 218303, 218842, 219834, 220311, 220287, 220500, 221365, 222609, 223934, 225453, 227182, 228518, 228744, 227888, 226712, 225883, 225540, 225614, 226124, 227040, 228127, 229069, 229639, 229743, 229529, 229466, 230029, 231214, 232507, 233391, 233725, 233672, 233463, 233265, 233055, 232561]
52797B32561j086j726k157k295k103j643j275j347j532j099m7P19P19O41J130
52782B19460J650J366N47N9m0k80m99o9P71J049O50N10R59J102L29o91j092r47
52764B24834p13l78N6N2o98j546j672j143n30j9M27N09N6l35M5R89J690J879J919
52745B25422J942J752J404J239J235J078Q22R01J381J822J940J916J979K122K259
52730B49214K199J544K29q89p10O23J653J296M5r04j117j034j015r65q23q02j036
52713B47508j321j362j203j182j455j674j332n17K2k06o86n33K46P62N11J7p8
52696B37517P5Oj73J3M93O65L70J80N34J058J109P01M04N33P98Q28O41M30J64
52677B46346l21r55j348j148l59N75J021O77Kj51M14Q39K82p94j073j12J058J309
$$ y = [232561, 231475, 229749, 227592, 225297, 223194, 221551, 220276, 218929, 217397, 216298, 216251, 216970, 217689, 218330, 219460, 221110, 222476, 223023, 223082, 223042, 222762, 222263, 222194, 222965, 224014, 224664, 225174, 226133, 227235, 227564, 226873, 225781, 224834, 224121, 223743, 223799, 223851, 223153, 221607, 219935, 218792, 218262, 218243, 218670, 219179, 219235, 218900, 218945, 219934, 221624, 223503, 225422, 227364, 229116, 230520, 231759, 232994, 234072, 234894, 235795, 237176, 238998, 240938, 242854, 244833, 246955, 249214, 251413, 252957, 253186, 252297, 251587, 252210, 253863, 255159, 255204, 254300, 253183, 252149, 251134, 250169, 249346, 248544, 247508, 246187, 244825, 243622, 242440, 240985, 239311, 237979, 237462, 237484, 237278, 236592, 236059, 236305, 237067, 237578, 237595, 237517, 237592, 237598, 237425, 237438, 237931, 238596, 238966, 239146, 239680, 240738, 241847, 242548, 242952, 243485, 244283, 245111, 245752, 246182, 246346, 246025, 245070, 243722, 242574, 242215, 242790, 243811, 244488, 244490, 244339, 244753, 245592, 245874, 245080, 244007, 243895, 244953, 246262]
52659B46262P34J93J40M37R30J525J964K081K122K263K065J065k89r95q45o28
52643B59024r49j515j810j793j612j182m61J96M08K18l5r0K06Q30J477J786J873
52626B56571K167K656K765K234J511R89L85o50j819k594k907k865k280j162k56
52611B54745k62p08n58K14N86J55k02L12J195J406P51j42q10j230j341r23r2N88
52593B53684O60K22k45k99K28J162K017K292J864J072L10k89p34q43m02L60P69
52576B61828M15k42l75K05Q96J164J121J027P28k2r74j594j724j561j139m00K88
52559B59641L00l74r77r69p16q08j078q47N5R93J291R07K38l66p18o81k70J97
52541B55818L10N8j22P7L24M9p45j379j299o48J05O49P79K67o72j175o49L20O71
$$ y = [246262, 246996, 247189, 247329, 247766, 248696, 250221, 252185, 254266, 256388, 258651, 260716, 261781, 261492, 260497, 259652, 259024, 258075, 256560, 254750, 252957, 251345, 250163, 249702, 249898, 250306, 250524, 250489, 250399, 250605, 251435, 252912, 254698, 256571, 258738, 261394, 264159, 266393, 267904, 268893, 269278, 268628, 266809, 264215, 261308, 258443, 256163, 255001, 254745, 254483, 253775, 253217, 253431, 254017, 254172, 253970, 254282, 255477, 256883, 257634, 257492, 256682, 255452, 254111, 253188, 253096, 253684, 254344, 254566, 254321, 254022, 254250, 255412, 257429, 259721, 261585, 262657, 262967, 262678, 261944, 261101, 260699, 261059, 261828, 262243, 262001, 261626, 261831, 262727, 263891, 265012, 266039, 266767, 266745, 265771, 264177, 262453, 260892, 259753, 259353, 259641, 259941, 259567, 258590, 257621, 256905, 256097, 255019, 254172, 254227, 255220, 256511, 257418, 257656, 257290, 256572, 255891, 255621, 255818, 256128, 256186, 256064, 256141, 256465, 256514, 255769, 254390, 253091, 252443, 252548, 253197, 253976, 254243, 253571, 252396, 251747, 252067, 252738]
52522B52738L69L31Q58J102N15j48O6R29J568J808K083K334K070J457J338J988
52506B71406K721L009L105L175K588Q66j261k541k663k355k182k035j784j624
52492B70425j576j298q00p14j313j751j029N09J446J145N05N74J130J270Q04L40
52476B69667J88N4j74j03M93J264J843K199K232J612M43m77n68j68K43R80K477
52459B82205M074M449L201J203o03j953k699k630k100k046k756l389l240k742
52445B70974k566k413j614m60J06j44n78q79j275j539q71P93K215K206R89l80
52429B64564j351j906j809p87N82J123M63m58o05k7N32Q22J275K168L147L657
52413B71390L571L213L045L376M277N543O838P907Q645R010Q987Q598P765O151
$$ y = [252738, 253107, 253438, 254296, 255398, 255913, 255765, 255831, 256760, 258328, 260136, 262219, 264553, 266623, 268080, 269418, 271406, 274127, 277136, 280241, 283416, 286004, 286870, 285609, 283068, 280405, 278050, 275868, 273833, 272049, 270425, 268849, 267551, 266751, 266037, 264724, 262973, 261944, 262453, 263899, 265044, 265549, 266123, 267253, 268523, 269327, 269667, 269855, 269909, 269735, 269632, 270125, 271389, 273232, 275431, 277663, 279275, 279718, 279241, 278673, 278505, 278748, 279728, 282205, 286279, 290728, 293929, 295132, 294529, 292576, 289877, 287247, 285147, 283101, 280345, 276956, 273716, 270974, 268408, 265995, 264381, 263921, 264027, 263883, 263305, 262426, 261151, 259612, 258741, 259534, 261749, 263955, 264944, 264564, 263213, 261307, 259498, 258711, 259293, 260416, 260879, 260421, 259816, 259789, 260321, 261143, 262418, 264586, 267733, 271390, 274961, 278174, 281219, 284595, 288872, 294415, 301253, 309160, 317805, 326815, 335802, 344400, 352165, 358316]
52399C58316L452m8l456n987p495q165p971o902n434m297l704l229k525j708r98
52384B99849m14rQ6R1N21J324J643J003L43R88K769M088M021L453L726M835N654
52367C33971N531M877M275L737L040K320J878J646J140M8j302k154k015j074Q4
52352C56002J021J580J652J178N39M66J244K249K695K684L050M139N296N763N598
52337C95156N397N497N882O649Q024R887J1715J3134J4239J5280J6287J7157J7871
52324E42175J8498J9111J9799K0590K1244K1393K0993K0461K0145J9900J9386
52313G63695J8578J7697J6799J5807J4879J4302J4023J3574J2636J1367J0109
52302I23466R007Q105P493P125O667N761M397K876J409l4j515k988m365n631o809
$$ y = [358316, 361768, 361720, 358264, 352277, 344782, 336617, 328646, 321744, 316310, 312013, 308309, 305080, 302555, 300847, 299849, 299435, 299426, 299512, 299603, 300124, 301448, 303091, 304094, 304437, 305425, 308194, 312282, 316303, 319756, 323482, 328317, 333971, 339502, 344379, 348654, 352391, 355431, 357751, 359629, 361275, 362415, 362463, 361161, 359007, 356992, 355918, 356002, 357023, 358603, 360255, 361433, 361972, 362438, 363682, 365931, 368626, 371310, 374360, 378499, 383795, 389558, 395156, 400553, 406050, 411932, 418581, 426605, 436492, 448207, 461341, 475580, 490860, 507147, 524304, 542175, 560673, 579784, 599583, 620173, 641417, 662810, 683803, 704264, 724409, 744309, 763695, 782273, 799970, 816769, 832576, 847455, 861757, 875780, 889354, 901990, 913357, 923466, 932473, 940578, 948071, 955196, 961863, 967624, 972021, 974897, 976306, 976272, 974757, 971769, 967404, 961773, 954964]
52287I54964p809q426q564q432q306q061p162n319k956p39J185L133N230P237
52273I05975R012J0631J1953J2630J2803J3236J4361J5572J5882J5076J3758J2563
52261A063452J1745J1340J1200J0934J0220R187Q258P609P129O684O115N009L022
52248A171904M06k042l740m743n486o368p624r275j1052j2561j3501j3745j3323
52235A068850j2532j1779j1072r936q226o736o382o952p312o867o044n330m489
52222I65193l177j660m48L91J138J893K571L185L797M385M913N440N896O047N847
52207A005411N626N659N774N582M950M042L116K467K317K612L034L374L656L856
52193A061476L838L673L604L555L124K316J772J864K016J458L00p19j363k117
$$ y = [954964, 947155, 938729, 930165, 921733, 913427, 905366, 898204, 892885, 889929, 889190, 890375, 893508, 898738, 905975, 914987, 925618, 937571, 950201, 963004, 976240, 990601, 1006173, 1022055, 1037131, 1050889, 1063452, 1075197, 1086537, 1097737, 1108671, 1118891, 1128078, 1136336, 1143945, 1151074, 1157758, 1163873, 1168882, 1171904, 1172310, 1170268, 1166528, 1161785, 1156299, 1149931, 1142307, 1133032, 1121980, 1109419, 1095918, 1082173, 1068850, 1056318, 1044539, 1033467, 1023531, 1015305, 1008569, 1002187, 995235, 987923, 981056, 975012, 969682, 965193, 962016, 960356, 959908, 960299, 961437, 963330, 965901, 969086, 972883, 977268, 982181, 987621, 993517, 999564, 1005411, 1011037, 1016696, 1022470, 1028052, 1033002, 1037044, 1040160, 1042627, 1044944, 1047556, 1050590, 1053964, 1057620, 1061476, 1065314, 1068987, 1072591, 1076146, 1079270, 1081586, 1083358, 1085222, 1087238, 1088696, 1088996, 1088277, 1086914, 1084797]
52179A084797l362m822n982o703p254p891q438q308p206n724m858m736m370k984
52165A002159j082K96Q91J167J435J744K308L219L936L836L201K795K583J785
52151A030273L02q96j092o89l75k07j4M0j76k62K45J256K398L495M392M753M491
52134A047934M133M301N122O466Q350J0639J2785J4392J5826J7764K0321K3104
52122A191137K5823K8290L0113L0986L1149L0998L0378K8896K6761K4635K2665
$$ y = [1084797, 1081435, 1076613, 1070631, 1063928, 1056674, 1048783, 1040345, 1032037, 1024831, 1019107, 1014249, 1009513, 1005143, 1002159, 1001077, 1001373, 1002264, 1003431, 1004866, 1006610, 1008918, 1012137, 1016073, 1019909, 1023110, 1025905, 1028488, 1030273, 1030575, 1029679, 1028587, 1027898, 1027523, 1027316, 1027302, 1027342, 1027166, 1026904, 1027149, 1028405, 1030803, 1034298, 1038690, 1043443, 1047934, 1052067, 1056368, 1061490, 1067956, 1076306, 1086945, 1099730, 1114122, 1129948, 1147712, 1168033, 1191137, 1216960, 1245250, 1275363, 1306349, 1337498, 1368496, 1398874, 1427770, 1454531, 1479166, 1501831]
$$ [...]
##END NTUPLES=NMR SPECTRUM
##END=
